##TITLE=1H_DE-105_m
 200.13MHz, CDCl3,
 8 sc
 
 8.8.2025
##JCAMPDX= 6.0         $$ Bruker NMR JCAMP-DX V2.0
##DATA TYPE= NMR FID
##DATA CLASS= NTUPLES
##ORIGIN= UXNMR, Bruker Analytische Messtechnik GmbH
##OWNER= pz
$$ XWIN-NMR		Version 3.5
$$ Fri Aug  8 15:41:08 2025 Russian Standard Time (UT+4h)  she@DPX200
##.OBSERVE FREQUENCY= 200.1313
##.OBSERVE NUCLEUS= ^1H
##.DELAY= (6, 6)
##.ACQUISITION MODE= SIMULTANEOUS
##.ACQUISITION SCHEME= undefined
##.AVERAGES= 8
##.DIGITISER RES= 18
##SPECTROMETER/DATA SYSTEM= spect
##.PULSE SEQUENCE= zg30
##.SOLVENT NAME= CDCl3
##.SHIFT REFERENCE= (INTERNAL, CDCl3, 0, 14.3821)
##AUDIT TRAIL= $$ (NUMBER, WHEN, WHO, WHERE, WHAT)
$$ ##TITLE= Audit trail, XWIN-NMR		Version 3.5
$$ ##JCAMPDX= 5.01
$$ ##ORIGIN= Bruker BioSpin GmbH
$$ ##OWNER= she
$$ F:/spectra/data/she/nmr/H-C/1/audita.txt
$$ ##AUDIT TRAIL=  $$ (NUMBER, WHEN, WHO, WHERE, WHAT)
(   1,<2025-08-08 15:39:50.57 +0400>,<she>,<DPX200>,
      <created by zg, POWCHK disabled, PULCHK disabled
       configuration hash MD5:
       00 E9 B6 7A A2 85 ED C7 34 08 36 98 17 FE 4E 26
       data hash MD5: 16K
       60 8C 89 6C 48 36 28 9E 3D 14 96 74 97 90 44 6A>)
$$ ##END=
$$ 
$$ hash MD5
$$ 6D E8 3A 83 62 C5 05 BE 3E A5 C0 31 0B 76 C1 2D
##$RELAX= 
##$RELAX= 
##$RELAX= 
##$RELAX= 
##$RELAX= 
##$RELAX= 
$$ Bruker specific parameters
$$ --------------------------
##$DU= <F:/spectra>
##$EXPNO= 1
##$NAME= <H-C>
##$PROCNO= 1
##$TYPE= <nmr>
##$USER= <she>
##$AMP= (0..31)
100 100 100 100 100 100 100 100 100 100 100 100 100 100 100 100 100 100 
100 100 100 100 100 100 100 100 100 100 100 100 100 100 
##$AQSEQ= 0
##$AQ_mod= 1
##$AUNM= <au_zg>
##$AUTOPOS= <>
##$BF1= 200.13
##$BF2= 200.13
##$BF3= 200.13
##$BF4= 200.13
##$BF5= 200.13
##$BF6= 200.13
##$BF7= 200.13
##$BF8= 200.13
##$BYTORDA= 1
##$CFDGTYP= 0
##$CFRGTYP= 5
##$CHEMSTR= <none>
##$CNST= (0..31)
1 1 145 1 1 1 1 1 1 1 1 1 1 1 1 1 1 1 1 1 1 1 1 1 1 1 1 1 1 1 1 1 
##$CPDPRG= <>
##$CPDPRG1= <>
##$CPDPRG2= <>
##$CPDPRG3= <>
##$CPDPRG4= <mlev>
##$CPDPRG5= <mlev>
##$CPDPRG6= <mlev>
##$CPDPRG7= <mlev>
##$CPDPRG8= <mlev>
##$CPDPRGB= <>
##$CPDPRGT= <>
##$D= (0..31)
0 0.7 0 0 0 0 0 0 0 0 0 0.03 0 0 0 0 0 0 0 0 0 0 0 0 0 0 0 0 0 0 0 0 
##$DATE= 1754653189
##$DBL= (0..7)
120 120 120 120 120 120 120 120 
##$DBP= (0..7)
150 150 150 150 150 150 150 150 
##$DBP07= 0
##$DBPNAM0= <>
##$DBPNAM1= <>
##$DBPNAM2= <>
##$DBPNAM3= <>
##$DBPNAM4= <>
##$DBPNAM5= <>
##$DBPNAM6= <>
##$DBPNAM7= <>
##$DBPOAL= (0..7)
0.5 0.5 0.5 0.5 0.5 0.5 0.5 0.5 
##$DBPOFFS= (0..7)
0 0 0 0 0 0 0 0 
##$DE= 6
##$DECBNUC= <off>
##$DECIM= 32
##$DECNUC= <off>
##$DECSTAT= 4
##$DIGMOD= 1
##$DIGTYP= 9
##$DL= (0..7)
0 120 120 120 120 120 120 120 
##$DP= (0..7)
150 150 150 150 150 150 150 150 
##$DP07= 0
##$DPNAME0= <>
##$DPNAME1= <>
##$DPNAME2= <>
##$DPNAME3= <>
##$DPNAME4= <>
##$DPNAME5= <>
##$DPNAME6= <>
##$DPNAME7= <>
##$DPOAL= (0..7)
0.5 0.5 0.5 0.5 0.5 0.5 0.5 0.5 
##$DPOFFS= (0..7)
0 0 0 0 0 0 0 0 
##$DQDMODE= 0
##$DR= 18
##$DS= 0
##$DSLIST= <SSSSSSSSSSSSSSS>
$$ [...]
##$SUBNAM0= <"">
##$SUBNAM1= <"">
##$SUBNAM2= <"">
##$SUBNAM3= <"">
##$SUBNAM4= <"">
##$SUBNAM5= <"">
##$SUBNAM6= <"">
##$SUBNAM7= <"">
##$SUBNAM8= <"">
##$SUBNAM9= <"">
##$SW= 18.0517328524113
##$SWIBOX= (0..15)
0 0 2 0 0 0 0 0 0 0 0 0 0 0 0 0 
##$SW_h= 3612.71676300578
##$TD= 16384
##$TD0= 1
##$TE= 0
##$TE2= 300
##$TE3= 300
##$TEG= 300
##$TL= (0..7)
0 120 120 120 120 120 120 120 
##$TP= (0..7)
150 150 150 150 150 150 150 150 
##$TP07= 0
##$TPNAME0= <>
##$TPNAME1= <>
##$TPNAME2= <>
##$TPNAME3= <>
##$TPNAME4= <>
##$TPNAME5= <>
##$TPNAME6= <>
##$TPNAME7= <>
##$TPOAL= (0..7)
0.5 0.5 0.5 0.5 0.5 0.5 0.5 0.5 
##$TPOFFS= (0..7)
0 0 0 0 0 0 0 0 
##$TUNHIN= 0
##$TUNHOUT= 0
##$TUNXOUT= 0
##$USERA1= <user>
##$USERA2= <user>
##$USERA3= <user>
##$USERA4= <user>
##$USERA5= <user>
##$V9= 5
##$VALIST= <valist>
##$VCLIST= <CCCCCCCCCCCCCCC>
##$VD= 0
##$VDLIST= <DDDDDDDDDDDDDDD>
##$VPLIST= <PPPPPPPPPPPPPPP>
##$VTLIST= <TTTTTTTTTTTTTTT>
##$WBST= 1024
##$WBSW= 4
##$XGAIN= (0..3)
0 0 0 0 
##$XL= 0
##$YL= 0
##$YMAX_a= 148676
##$YMIN_a= -194369
##$ZGOPTNS= <>
##$ZL1= 120
##$ZL2= 120
##$ZL3= 120
##$ZL4= 120
##$ABSF1= 10
##$ABSF2= 0
##$ABSG= 5
##$ABSL= 3
##$ALPHA= 0
##$AQORDER= 0
##$ASSFAC= 0
##$ASSFACI= 0
##$ASSFACX= 0
##$ASSWID= 0
##$AUNMP= <proc_1d>
##$AZFE= 0.1
##$AZFW= 0.1
##$BCFW= 1
##$BC_mod= 2
##$BYTORDP= 1
##$COROFFS= 0
##$CY= -3
##$DATMOD= 1
##$DC= 2
##$DFILT= <>
##$DTYPP= 0
##$F1P= 0
##$F2P= 0
##$FCOR= 0.5
##$FTSIZE= 0
##$FT_mod= 4
##$GAMMA= 1
##$GB= 0.15
##$INTBC= 1
##$INTSCL= 1
##$ISEN= 128
##$LB= 0.25
##$LEV0= 0
##$LPBIN= 0
##$MAXI= 10000
##$MC2= 0
##$MEAN= 0
##$ME_mod= 0
##$MI= 1.114404
##$NCOEF= 0
##$NC_proc= 0
##$NLEV= 6
##$NOISF1= 3.799351
##$NOISF2= 2.8
##$NSP= 1
##$NTH_PI= 0
##$NZP= 0
##$OFFSET= 14.38212
##$PC= 1
##$PHC0= -1574.112
##$PHC1= 35.9923
##$PH_mod= 1
##$PKNL= yes
##$PPARMOD= 0
##$PSCAL= 0
##$PSIGN= 0
##$REVERSE= no
##$SF= 200.129724274929
##$SI= 16384
##$SIGF1= 3
##$SIGF2= 2
##$SINO= 400
##$SIOLD= 16384
##$SREGLST= <1H.CDCl3>
##$SSB= 0
##$STSI= 0
##$STSR= 0
##$SW_p= 3205.1282051282
##$SYMM= 0
##$S_DEV= 0
##$TDeff= 0
##$TDoff= 0
##$TI= <>
##$TILT= no
##$TM1= 0
##$TM2= 0
##$TOPLEV= 0
##$USERP1= <user>
##$USERP2= <user>
##$USERP3= <user>
##$USERP4= <user>
##$USERP5= <user>
##$WDW= 1
##$XDIM= 8192
##$YMAX_p= 0
##$YMIN_p= 0
$$ End of Bruker specific parameters
$$ ---------------------------------
##NTUPLES= NMR FID
##VAR_NAME=  TIME,          FID/REAL,        FID/IMAG
##SYMBOL=    X,             R,               I
##VAR_TYPE=  INDEPENDENT,   DEPENDENT,       DEPENDENT
##VAR_FORM=  AFFN,          ASDF,            ASDF
##VAR_DIM=   8192,          8192,            8192
##UNITS=     SECONDS,       ARBITRARY UNITS, ARBITRARY UNITS
##FACTOR=    0.0002768,     1,               1
##FIRST=     0,             0,               0
##LAST=      2.2672688,     0,               0
##MIN=       0,             -194369,         0
##MAX=       2.2672688,     148676,          0
$$ Real data points
##PAGE= N=1
##DATA TABLE= (X++(R..R)), XYDATA
0@%%%%%%%%%%%%%%%qJ6j6J6j6K4l2L2l8M6n3O1p2Q3r2J05j20J37j56J76j98K22
$$ 0 0 0 0 0 0 0 0 0 0 0 0 0 0 0 0 -8 8 -8 8 -8 16 -16 16 -22 24 -29 32 -40 43 -49 56 -64 73 -83 93 -105 117
37A17k48K76l06L44l83M22m67N17n72O30o95P65q42R27j021J127j243J375j524
$$ 117 -131 145 -161 183 -200 222 -245 272 -300 330 -365 400 -442 485 -536 591 -652 723 -801
56h01J691j888K116k384K710l110L620m293N220o583Q783j2897K3056r3107j16502
$$ -801 890 -998 1118 -1266 1444 -1666 1954 -2339 2881 -3702 5081 -7816 15240 -77867 -194369
71a94369K61157N3993j31170O3947R5118r1456q678P6472o1781q9545M6740p693
$$ -194369 66788 120781 -10389 53558 148676 57220 48542 125014 63233 -26312 20428 12735
83A2735r2665J2873N3356n6651k9364N6298K4150j2250J7212K1786K115L564K8532
$$ 12735 -79930 -67057 -13701 -70352 -99716 -43418 -19268 -31518 -14306 7480 9595 13159 41691
96D1691J2133l5293j0176L5829j3990m5376J2155K0297l4172j6584L0879o484
$$ 41691 53824 18531 8355 44184 30194 -15182 -3027 17270 -16902 -33486 -2607 -9091
108i091k6655L1140J0703m5713K4690N8157m2973l7527O0436K0345m9833L016
$$ -9091 -35746 -4606 6097 -39616 -14926 43231 258 -37269 23167 43512 -6321 -3305
120c305L2613k0617j6982J8734j1630k2880K2548Q003l2466P619L3590r093j7106
$$ -3305 29308 8691 -8291 10443 -1187 -24067 -1519 6484 -25982 -18363 15227 6134 -10972
133a0972J5845J3001q774o313L728l071q829N805J064j7685r40K0510k242j7955
$$ -10972 4873 17874 9100 2787 6515 3444 -5385 420 1484 -16201 -17141 3369 1127 -16828
147a6828R505K1138q257j2503J5992M732j5402P651O180k1391K437K1570j5885
$$ -16828 -7323 13815 5558 -6945 9047 13779 -1623 6028 12208 -9183 -6746 14824 -1061
160a061k0518K0171J3774k0185n969J7760K24j0263Q093J513q039J0695O296j5106
$$ -1061 -21579 -1408 12366 -7819 -13788 3972 4196 -6067 2026 3539 -4500 6195 12491 -2615
174b615o05J5822l561j4916J360Q442m653r347K777J903l515N899M128o680L359
$$ -2615 -3220 12602 9041 -5875 -4515 3927 -726 -10073 -7296 -5393 -8908 -3009 1119 -5561 -2202
189b202J3605q62j0270M115J0972o712j2499N675J786j0673L70L136r251K197
$$ -2202 11403 10541 271 4386 15358 8646 -3853 1822 3608 -7065 -6695 -3559 -12810 -10613
203a0613J2005m722q129J1234J1422q792m773J1236K233q142Q95J057m960K397
$$ -10613 1392 -3330 -11459 -225 11197 2405 -2368 8868 11101 2959 3854 4911 -49 2348
217B348J499q617k096P474l66r256M89P402q60n295M309M127j202L711K858l463
$$ 2348 3847 -4770 -6866 608 242 -9014 -8525 -1123 -1983 -7278 -2969 1158 -44 3667 6525 3062
233C062Q49N995k203q688o23O665n660q626L729K981m720J888M043k082K117O449
$$ 3062 3911 9906 7703 -985 -1608 5057 -603 -9229 -5500 -2519 -7239 -5351 -1308 -3390 -1273 5176
249E176r39m711M602N247o116n913N367R97n780n33J304j670J497J129k798n39
$$ 5176 4237 -474 4128 9375 3259 -2654 2713 3710 -2070 -2603 -1299 -2969 -1472 -343 -3141 -3680
265c680M357J472n190k23O344j47m370K329K581j562M29O94k863j398L018p24
$$ -3680 677 2149 -3041 -3264 3080 2933 -1437 892 3473 1911 2340 3034 171 -1227 1791 1067
281A067n816m10N710j754m544L756L722j003M11J349j74p8J324j435l917J152
$$ 1067 -4749 -5159 551 -1203 -5747 -1991 1731 728 1139 2488 2314 2236 3560 2125 -1792 -640
297f40K669l727l459L681K146k866O26K105K15N51L52j120j059K164J150m096
$$ -640 2029 -1698 -5157 -1476 670 -2196 -1570 535 750 1301 1653 533 -526 1638 2788 -1308
313a308j020L814j71l329Q05K054j235m06N65o13q74J749J159l133L46M118p0
$$ -1308 -2328 1486 1315 -2014 -1209 845 -390 -796 -231 -844 -1718 31 1190 -1943 -1597 2521 2451
330B451l424J605K572j438j770j09o2r28l4k84j760J031K604j092j319L114J596
$$ 2451 -973 632 3204 1766 -4 -113 -175 -1103 -1137 -1421 -3181 -2150 454 -638 -1957 1157 2753
347B753j282o14R58N8o79l89q68j587Q93Q76k185o33K513N36j930L73J905pn21
$$ 2753 1471 857 1815 1873 1194 805 -63 -1650 -757 119 -2066 -2699 -186 350 -1580 -1207 698 691 170
366A70M20M27p34P37P69j968l28K514q38k572O57Q30q92j133K29O61m06M25O24
$$ 170 590 1017 283 1020 1789 -179 -507 2007 1169 -1403 -746 84 -808 -1941 -1712 -1051 -1457 -1032 -408
385d08k46R98J892j066q92J210Q67j190j378J93J51r41m55M6m72P62J263j154
$$ -408 -654 344 2236 1170 278 1488 2355 1165 -213 -20 131 -810 -1265 -1219 -1691 -929 334 -820
403h20k50J806O88j507p1J256k2j088K25Q5n16N92pq24n92J325l91j172L03J026
$$ -820 -1070 736 1424 -83 -154 1102 1080 -8 217 302 -214 378 371 -453 -1045 280 -111 -1283 -980 46
423D6m1q26J70P88J39K65J15o32M19N78n14p26K44N65q65r03M45M29J8l46R13
$$ 46 5 -821 -651 137 276 541 656 24 443 1021 507 -219 25 590 -275 -1178 -733 -304 -286 -632 281
444B81o02N77P67p31n34Q42K09r95o18Q82J45j153L23M43p7K77J42j40k07N95
$$ 281 -321 256 1023 292 -242 600 809 -186 -804 78 223 -930 -607 -164 -241 36 178 38 -169 426
464D26j09m47l46J012K5p22J06L49m61K30J7l49J56K01j69m79L36N93l73m00O71
$$ 426 317 -130 -476 536 561 -161 -55 294 -167 63 80 -269 -113 88 -81 -560 -224 369 -4 -404 267
485B67L57k97O1J82k66k00J12m35n39M29K20m34o21O18O87q8k78M94j82O27l02
$$ 267 624 327 388 570 304 104 216 -219 -758 -329 -109 -543 -1164 -546 141 53 -225 269 87 714 412
506D12q5j41N8K52j198P3M11L26r30M90J97J0j96K25J00k1J93Kk45K71L86j85
$$ 412 327 186 244 496 -702 -629 -218 108 -822 -332 -135 -125 -321 -96 4 -17 176 178 -67 204 590 405
528D05n58L20L12l60k51j9Kp2r6j35j8M65J68q4k12L62Q42p23j59L86p3m65j43
$$ 405 -153 167 479 119 -132 -151 -149 -221 -317 -452 -470 -5 163 79 -133 229 1071 348 189 575 502 37 -106
551a06L0k26o4J40j21m88Q05J41l34N42o6m1j53pnJ20K55m17j25o5N51k42o21
$$ -106 -76 -302 -366 -226 -347 -835 -30 111 -223 319 253 212 59 52 47 167 422 5 -120 -185 366 124 -497
574d97K87N02m57k07K44j32K14L01m06m2K29M18q3m58M80p1l50q2L2K34r2l96
$$ -497 -210 292 -165 -372 -128 -260 -46 255 -151 -193 36 454 371 -87 393 322 -28 -110 -78 156 64 -332
596c32J98k46J36K01J10k60N45J92p12M76m6j18k45j7k14L22J6k04K47o2L76K6
$$ -332 -134 -380 -244 -43 67 -193 352 544 -168 308 262 144 -101 -118 -332 -10 6 -198 49 -13 363 389
618C89m40N4J92J06m80R2J76J75l24k36L31r2J08k68j83M15J54m02r0L60K01j84
$$ 389 -51 3 195 301 -179 -87 89 264 -60 -296 35 -57 51 -217 -400 15 169 -233 -323 37 238 54
640E4j79L4J67j5l5M6n6k7J12j88l13M20P1k09n4K39j86OM08m72L15K14k38J09
$$ 54 -125 -91 76 61 26 72 16 -11 101 -87 -400 20 91 -118 -172 67 -119 -113 295 -177 138 352 114 223
664B23p8o2k94J44j8J95k6l33l2K00J56qp9n6L6L46q9n42M48K44k43l05J60N5
$$ 223 145 83 -211 -67 -85 110 84 -249 -281 -81 75 67 -12 -68 -32 314 225 -317 131 375 132 -173 -13 42
688D2K8n4j35o5K22K14n38oJ52K7L6L08m7m1K21l2j40K68k24l74K8L0K19J69n24
$$ 42 70 16 -119 -184 38 252 -286 -292 -140 -113 -77 231 184 143 364 332 192 460 236 -138 -110 -80 139 308 -216
713b16J64K3K6K56l69L46k29P2J92l90K36J50l05r9M33m23M06n29K38n8N0k6j48
$$ -216 -52 -29 -3 253 -116 230 1 73 265 -125 111 261 -44 -143 290 -133 273 -256 -18 -76 -26 -52 -200
736b00J54K8o9j0K22m1K14j15m30N43k44j83M7k12L88j25k03MQ6j36M15k42M95
$$ -200 -46 -18 -87 -97 125 84 298 183 -247 296 52 -131 -84 -296 92 -33 -236 -232 -146 -282 133 -109 386
759C86n1m43P6j19j14J88L9K12j66k27K97j7k67J46J05J92n49L20p3R7j19j03
$$ 386 335 -108 -32 -151 -265 -77 -38 174 8 -219 78 61 -206 -60 45 237 -312 8 -65 32 -87 -190
781a90L9L74n7j01l06M24j49kk9L30m45J16Kl9K4K04k18J0R1J66j96j4r8J9J36
$$ -190 -151 223 166 65 -241 183 34 32 3 333 -112 4 6 -33 -9 195 -23 -13 78 244 48 34 -64 -45 91
806I1l29J85j18Q3j25Q1n6L56O0O2m22J1K94j15o0l6L9L6m7n7L4J36p2lj13K38
$$ 91 -238 -53 -171 -88 -213 -132 -188 168 228 290 -132 -121 173 58 -2 -38 1 37 -10 -67 -33 103 31 28 -85 153
832A53k52K58m9k12J32k33L07J08j74k69Q3K33l98K80o4l7n2K2P6L0J81P1n31
$$ 153 -99 159 110 -102 30 -203 104 212 38 -231 -148 85 -313 -33 -97 -134 -186 -164 -88 -58 123 194 -337
855c37M89k42R5J61k48J39K11m16N79m70j32L20j50p2o7J85o9P7r0J21k22J15
$$ -337 152 -90 5 166 -82 57 268 -148 431 -39 -171 149 -1 -73 -140 45 -24 53 -37 84 -138 -23
877b3K6l54N39q0m1R4j50K3J55m17J79j12K3K89k56K41j85j93L92j75j39L72R1
$$ -23 3 -351 188 108 67 161 11 34 189 -228 -49 -161 -138 151 -105 136 -49 -242 150 -25 -164 208 299
900B99l24r8O5J37j8J64k24ml7O3pM7J23k20J16m08O09l55K22j47j76J58O1K7
$$ 299 -25 -123 -58 79 61 225 1 -3 -40 23 16 63 186 -34 82 -326 283 -72 150 3 -173 -15 46 73
924G3j9p5K82l90j22R1oK53oj48N6o5K46l18M9m2J25P5j05r4L47P2p35N16m16
$$ 73 54 -21 261 -129 -251 -160 -166 87 81 -67 -11 -76 170 -148 -99 -141 -16 59 -46 -140 207 279 -456 60 -356
949c56M11j80J75n5J22j05M4mP5Q2j72j11J57j68q3J28j91K80l13K88j43q9J43
$$ -356 55 -125 50 -5 117 12 56 52 127 209 37 -74 83 -85 -168 -40 -231 49 -264 24 -119 -208 -65
972f5M8J44m19K39k9k38K39J06j63J09m4P6j6k7J97o7j41r6K16k40MK03K19J99
$$ -65 -17 127 -292 -53 -82 -320 -81 25 -138 -29 -73 3 -13 -40 157 90 -51 -147 69 -171 -167 36 255 454
996D54m36j3K08j79o3o3K10k62M5J05j76P7RJ9j21K5K36j1K30j30j94J54p8j06
$$ 454 18 5 213 34 -29 -92 118 -144 -99 6 -170 -93 -84 -65 -186 -161 75 64 294 164 -30 124 46 -60
1020f0j21M31m94K66Oj84L06m14J8L27J1m8M9J19l63J71Q1j05o0L13k15J34m63
$$ -60 -181 250 -244 22 28 -156 150 -264 -246 81 92 44 93 212 -151 20 101 -4 -64 249 34 168 -295
1043b95L12J64R4j7J2j72J38k13k05K03m23M46k13J20p4P7j11M44n02J89J06l84
$$ -295 17 181 275 258 270 98 236 23 -182 21 -402 44 -169 -49 -123 -46 -157 287 -215 -26 80 -304
1065c04K44m1L64j42o9ljj83m4L04l7j59J38K95m25J62m5o1Q1j40k33O9O9K26
$$ -304 -60 -101 263 121 52 49 48 -135 -179 125 88 -71 67 362 -63 99 54 -7 74 -66 -299 -230 -161 65
1089F5LN9j85L47l52K10k81L25k40J22J84r4k23K34p3j50L85n35L04k14R0K49
$$ 65 68 127 -58 289 -63 147 -134 191 -49 73 257 163 -60 174 101 -49 336 -199 105 -109 -19 230
1111B30l6k2j55j50K21k24l1L28L5j09j13J73k29J07j68K83rJ41J1l89J44R5R6
$$ 230 194 172 17 -133 88 -136 -167 161 196 87 -26 147 -82 25 -143 140 131 272 283 -106 38 133 229
1134B29k26N5j54J65J90n6j40j54K0M7O2oO9l26L50q2j02J83k20Q5J70k64J48
$$ 229 3 58 -96 69 259 203 63 -91 -71 -24 38 32 101 -225 125 43 -59 124 -96 -11 159 -105 43
1157D3k48R7K85j45J48k13L55l04M0J94n04K33l53K96M30k64p8N6j05K7K71j31
$$ 43 -205 -108 177 32 180 -33 322 18 58 252 -252 -19 -372 -76 354 90 12 68 -37 -10 261 130
1179A30l21K01j66J2J69j78J80o6J95l77Q6R4j34J8R2K07j61P9m4K54l39J37L64
$$ 130 -191 10 -156 -144 25 -153 27 -39 156 -221 -135 -41 -175 -157 -65 142 -19 60 16 270 -69 68 432
1202D32n39J35j38Q0K7Q7j95K99l46K46J45l56K29q3m7j28O3O7J30q6j54LK01
$$ 432 -107 28 -110 -30 -3 84 -111 188 -158 88 233 -123 106 23 -24 -152 -89 -22 108 22 -132 -129 72
1225G2K42k03J2j16K15k69K90k41j0K50Qj65k97q7L87k24K53q6l2j36O8J67l39
$$ 72 314 111 123 7 222 -47 243 2 -8 242 250 85 -212 -299 88 -136 117 31 -1 -137 -69 98 -241
1248b41J13k2J7K54l0k55oJ02K23Ml06J95j67J62l8j03j0J38J08j52j9j20k0j47
$$ -241 -128 -150 -133 121 91 -164 -170 -68 155 159 -147 48 -119 43 5 -98 -108 30 138 -14 -33 -153 -173 -320
1272c20J38K99k70N6N9M5K01j59J07K1k07R0o6J7j51K87j90Nl1k2j49L51M7l50
$$ -320 -182 117 -153 -97 -38 7 208 49 156 177 -30 60 -6 11 -140 147 -43 -38 -69 -91 -240 111 158 -192
1296a92L27r7r0J65Q1j70Q5j74k9PJ92l14K56p7L5J9j46K76j68K20k34M7J77k03
$$ -192 135 38 -52 113 194 24 109 -65 -94 -87 105 -209 47 -30 5 24 -122 154 -14 206 -28 19 196 -7
1320gJ23Rk31J15K40n05J71r2P4Q2l9k3K88ll95jK91n36K12K39J85P6p4k41J89
$$ -7 116 125 -106 9 249 -256 -85 -177 -103 -21 -60 -83 205 202 -193 -194 97 -439 -227 12 197 273 199 -42 147
1345A47L0k9M9j64m5j6j40K9J26J80j38J15k31J36m9q1K83j18J5o8R7j23m3q2
$$ 147 177 148 197 33 -12 -28 -168 -139 -13 167 29 144 -87 49 0 -81 202 84 99 31 128 5 -38 -120
1369a20J20K13k43l06L55P4m05K88M5j6k32K49J19k97P0K06o8M8j70J12j13K36
$$ -120 0 213 -30 -336 19 93 -312 -24 21 5 -227 22 141 -156 -86 120 52 100 -70 42 -71 165
1391A65k35k7K31j19O5n0J51k20J26O4k29J12j62J67J19o27N81L0j38J38j58L31
$$ 165 -70 -97 134 15 80 30 181 -39 87 151 -78 34 -128 39 158 -469 112 142 4 142 -16 315
1413C15k98K50l94n2J58J30j08R0o6m2M6K56l68J68N0k8k03J40j36L26J7l54J7
$$ 315 17 267 -127 -179 -21 109 1 91 25 -17 29 285 -83 85 135 107 -96 44 -92 234 251 -103 -86
1436h6J28ok42K61J05k70jJ85R2k22L8RL2j86K06o0n4j59L76m6n1Nn4L9p8J39
$$ -86 42 36 -206 55 160 -110 -111 74 166 -56 -18 -9 23 -163 43 -17 -71 -230 146 100 49 54 0 39 -39 100
1462A00r3n9J8lJ19N5k14mnJ19j48P5K19j77N9k43m0J64K85k57R4J37r6m33K48
$$ 100 7 -52 -34 -37 82 137 -77 -81 -86 33 -115 -40 179 2 61 -182 -222 -58 227 -30 64 201 105 -328 -80
1487h0o5J65J5n8K6J11M3j44j42k22O79m58K04m3O7r5Q7l3p6O2j73J49j57K04
$$ -80 -145 20 35 -23 3 114 157 13 -129 -351 328 -130 74 31 98 3 90 57 -19 43 -130 19 -138 66
1511F6j04J05J6m7o8k76J26K4p4K35O1j85o5J53L83l09j8o3L63k47N5j56j02N28
$$ 66 -38 67 83 36 -32 -308 -182 -158 -232 3 64 -121 -186 -33 350 41 23 -40 323 76 131 -25 -127 401
1535D01k24j21j82J41r2J12j22K82J06k01l15K80j89J53k83K65rR6O3k68J90k40
$$ 401 177 56 -126 15 -77 35 -87 195 301 100 -215 65 -124 29 -254 11 2 98 161 -107 83 -157
1557a57K3J30r8K25l12J55Q9k79J07j1J86n4k43K69j76J82J73k06o9J13q7O8l5
$$ -157 -134 -4 -102 123 -189 -34 55 -224 -117 -128 58 4 -239 30 -146 36 209 3 -66 47 -40 28 -7
1580gJ9r9j02O9J10M0k72K36J2K08l23k74J69L88j99P2R9K9n8j60L3M1M9k24J27
$$ -7 12 -87 -189 -120 -10 30 -242 -6 6 214 -109 -383 -214 174 -25 47 146 175 117 -43 -10 31 80 -144 -17
1605a7K0J7q6L2J86j34r5m7J61L5k88J90J15j33J41k13K3K75j97K3L46k32J03
$$ -17 3 20 -66 -34 152 18 -77 -124 37 72 -216 -26 89 -44 97 -116 -93 182 -15 8 354 122 225
1628B25k86P0l1J16j30J24OK4n1k44J61n3J25k2j89k3j75L90R9o3j13J34j40l
$$ 225 -61 9 -22 94 -36 88 94 118 67 -177 -16 -69 56 34 -155 -178 -353 37 136 73 -40 94 -46 -49
1652d9o0q2J68j3j70K66k06K02k16K36l02J81n3K30J59l84J79m15J50J6o8J81
$$ -49 -109 -191 -23 -36 -206 60 -146 56 -160 76 -226 -45 -98 132 291 -93 86 -329 -179 -163 -231 -50
1674e0J62k75J40j7m6m0Q1j3O2Q0l9j9r1k09K53J9k6m9n4J11P0L6j91K42j95m8
$$ -50 112 -163 -23 -40 -86 -126 -45 -58 4 84 45 26 -65 -274 -21 -2 -28 -77 -131 -20 50 86 -105 137 -58 -106
1700a06j7j2J02j44M07l44J15k83P3J65K68l23P4P6K07j73K9J83m02N3j68j37
$$ -106 -123 -135 -33 -177 230 -114 1 -282 -209 -44 224 -99 -25 51 258 85 114 297 -105 -52 -220 -357
1722c57K73L13k1k98J84l38N70k23k70J41J52R1l41J77k5l50M27m0j86K12j01
$$ -357 -84 229 208 -90 94 -244 326 103 -167 -26 126 217 -124 53 28 -322 105 65 -121 91 -10
1743a0q3M8J06O4j76j03K73l20Q8j55J87J90NO8j03q2j55K41J46j07k23L03k11
$$ -10 -93 -45 61 125 -51 -154 119 -201 -113 -268 -81 109 114 182 79 -3 -158 83 229 122 -101 202 -9
1766iK11j82k26K28j28K91r0J54l09J86j85j97L44j38J47k92K14J85j83j08J79
$$ -9 202 20 -206 22 -106 185 95 249 -60 126 -59 -256 88 -50 97 -195 19 204 21 -87 92
1787I2k2k6N1j63j36M13j67J99j56j72O3j44J96j97K25m6J53k74K07O7l27L18
$$ 92 70 44 95 -68 -204 209 42 241 85 -87 -24 -168 28 -169 56 10 163 -111 96 163 -164 154
1809A54k69R0J37n5j61k06O15m28K48j15o8Pl8J86j96J30J5j55J68J44r1j56M8
$$ 154 -115 -25 112 57 -104 -310 305 -123 125 10 -58 -51 -89 97 -99 31 46 -109 59 203 112 -44 4
1832Dj11J94J04k17j6Q2K20l88J04Q1p4J87k59L0K74l65K92k3k07j21M10l82J89
$$ 4 -107 87 191 -26 -42 40 260 -128 -24 57 -17 170 -89 -59 215 -150 142 119 -88 -209 201 -181 8
1855HRj13J60J52l84K35J77m11L32k71K9K06Ql30OJ17R1J5K08l04J09K2j50K95
$$ 8 17 -96 64 216 -168 67 244 -167 165 -106 -77 129 137 -193 -187 -70 21 36 244 -60 49 71 -79 216
1879B16k90J90j85J94n6j00ok11K17q1M59k12r2N1P2m1l16L9j93O53l97J91L8
$$ 216 -74 116 -69 125 69 -31 -37 -248 -31 -112 347 135 43 94 166 125 -191 -152 -345 308 -89 102 140
1902A40k99J21q8Q5P9j84k57N00k44K00J5R8j28j36Q4J1r0J70j80M7J55l31J25
$$ 140 -159 -38 -126 -41 38 -146 -403 97 -147 53 68 166 38 -98 -14 -3 -93 77 -103 -56 99 -232 -107
1925a07K52k52K53r9j02k59K42Q1L12k38k30K04K50o85L43Pj6O4KK48m04M39l50
$$ -107 145 -107 146 47 -55 -314 -72 9 321 83 -147 57 307 -378 -35 -28 -44 20 22 270 -134 305 -45
1948d5m5Pj2J72k34K7j2l6L79Ll40K16k11J41o4P5P8J72j85l87L68k09j0P9R9
$$ -45 -90 -83 -95 77 -157 -130 -142 -178 201 204 -136 80 -131 10 -54 21 99 271 86 -301 67 -142 -152 -73 26
1973B6k40K31j87l4M12l90K15M0N7N2k40j1N2r7J35P0l4P3Qm41N3L60k53L88l05
$$ 26 -214 17 -170 -204 208 -182 33 73 130 182 -58 -69 -17 -114 21 91 57 130 138 -303 -250 110 -143 245 -60
1998f0L5J65o2l91L75k31k7J99j90K07p0J46k13K59l22J42K12k7R2k56q7j6K20
$$ -60 -25 140 78 -313 62 -169 -196 3 -187 20 -50 96 -117 142 -180 -38 174 147 239 -17 -104 -120 100
2021A00R5l30L2J35J68l68k3J58n3K35k81M6k2j56p5N47k1k00J68J12k53jR6p5
$$ 100 195 -135 -103 32 200 -168 -191 -33 -86 149 -132 -86 -108 -264 -339 208 187 -13 155 267 14 13 109 34
2045C4p7L7j09J40Oo8k9J60nj5j9j00p1J59R1k11m0j12K77L0j55K17k67J11j6
$$ 34 -43 -6 -115 25 31 -37 -66 94 89 74 55 -45 -116 43 134 -77 -117 -229 48 78 -77 140 -127 -16 -32
2070c2J49j89J5r9J08L24j38k16J87k78K53k83K4Q5K0J49k59J81J58m0J74j51
$$ -32 117 -72 -57 -156 -48 276 138 -78 109 -169 84 -199 -175 -90 -70 79 -180 1 159 119 293 142
2092A42j7j20Nj5pj7P6J56k70K18j80J1r6j14K08oO2m6K24R5m39J5l73J66L44
$$ 142 125 5 10 -5 -12 -29 47 203 -67 151 -29 -18 -114 -228 -20 -26 36 -10 214 309 -130 -115 -488 -322 22
2117B2l1m3J11o8M0M0l90N03L17m74J39l65J33p6L19q0k74K66Q1l19J98j2J3j93
$$ 22 -9 -52 59 -9 31 71 -319 184 501 27 166 -199 -66 -142 177 97 -177 89 170 -149 49 37 50 -143
2141a43J67j64J63M1j55J12k5j79J59L3K78l80J20j28J62r9m1L60l30N5M5J44
$$ -143 24 -140 23 64 -91 21 -4 -183 -24 9 287 -93 27 -101 61 -38 -79 281 -49 6 51 195
2163A95l22L18l02J48l5L0j43K46o3O6j24j0J42m67M36l82K49J28j27M1J38l02
$$ 195 -127 191 -111 37 2 32 -111 135 72 138 14 4 146 -321 115 -267 -18 110 -17 24 162 -140
2185a40J90J82m29L55k89L61k78M16n4m13L52j94p3k49j34M04J20K0p5k09K91
$$ -140 50 232 -197 158 -131 230 -48 368 314 -99 253 59 -14 -263 -397 7 127 147 72 -137 154
2206A54j25N7Jj29L05k06j75J91MK06l98J86J40jj40N8j24M2J6J78k27j58qj09
$$ 154 29 86 87 -42 263 57 -118 73 77 283 -115 71 211 210 70 128 4 46 62 240 13 -145 -153 -262
2230b62K56P3r8l1L02j32j40%k0p9L7k0j16J45J42j98M7q4J42m3J41K74l73M0
$$ -262 -6 67 -31 -62 240 108 -32 -32 -52 -131 -94 -114 -230 -85 57 -141 -94 -178 -36 -79 62 336 -37 3
2254Ck35J66J9J83l10J40m4l9M8K78m35L5M78l82K9K73j45r4K50m8j53lp0J7j23
$$ 3 -232 -66 -47 136 -174 -34 -78 -117 -69 209 -226 -191 287 -95 -66 207 62 -32 218 170 17 14 -56 -39 -162
2279a62L1J71K90m02l9J92mJ89k61Q5j69k02K77O9j4J57j92o5P7j22J06o0Ok60
$$ -162 -131 40 330 -72 -111 81 77 266 5 90 -79 -281 -4 65 51 208 16 -49 28 -94 12 -48 -42 -302
2303c02K82J7j14J70k37L87k79J53k33K81k58j71L90q4l2Q9K44J8j79k54L29j48
$$ -302 -20 -3 -117 53 -184 203 -76 77 -156 125 -133 -304 86 2 -30 59 303 321 142 -112 217 69
2325F9r9j61K86l99K19L8R2k05m3j46N04m8j37l8P5k93M32p5k67J74R3m16K87
$$ 69 -30 -191 95 -304 -85 -47 45 -160 -203 -349 155 107 -30 -68 7 -286 146 71 -196 -22 71 -345 -58
2348e8J96j09N3r3J48j09rK19j97J39j03R4k21J40l8j87K48k9o5q1J05K1l17R4
$$ -58 138 29 82 -11 137 28 19 238 41 180 77 171 -50 90 52 -135 113 84 19 -62 43 64 -253 -159
2372a59J93j18J30p1N1j01R0J14k76K52J42m87O2K77j86J9J31J00l11J66M9o9
$$ -159 34 -84 46 -25 26 -75 15 129 -147 105 247 -240 -178 99 -87 -68 63 163 -148 18 67 -2
2394bJ41k09j23j8J02l4j19M87p3j41k44QL17j76L38k89R0j51J15L16n93K73p3
$$ -2 139 -70 -193 -211 -109 -143 -262 225 152 11 -233 -225 92 -84 254 -35 55 -96 19 335 -258 15 -58
2417e8J5K17j53j40o3n3K68j60K53l8k15j04J84k1j01K91Q8l67k5M26o12J77L68
$$ -58 -43 174 21 -119 -182 -235 33 -127 126 88 -127 -231 -47 -68 -169 122 210 -157 -182 244 -368 -191 177
2440A77O0j70Q6j46J44j18p8j1K52l24k6J08o4j27K02J93q7k51L43m05N07n25
$$ 177 237 67 153 7 151 33 -45 -56 196 -128 -154 -46 -110 -237 -35 158 71 -180 163 -242 265 -260
2462b60M39j16j02j28k7K57k54M44k94k6M5J82k54p9L62k25k4Q3o6K5M2m4O4O8
$$ -260 179 63 -39 -167 -194 63 -191 253 -41 -67 -22 160 -94 -173 189 -36 -60 23 -43 -18 24 -20 44 112
2486A12Nq5K50j90o0J12l31L00J36l10J82j70J13P2j70O3K10l80J79q1J68m7M6
$$ 112 117 32 282 92 32 144 -187 113 249 -61 121 -49 64 136 -34 29 239 -141 38 -43 125 78 124
2509A24j43j51K50j52L7j47J13J68l16J93J24j10R9r8k90N04p1k43J49R4M2j11
$$ 124 -19 -170 80 -72 -35 -182 -69 99 -217 -24 100 -10 89 -9 -299 205 134 -109 40 134 176 65
2531F5K81q9k16Jl7O8j53J36P2J12k0k19O6l59K16Q4P0j21m7j15J0M18l09K21
$$ 65 346 257 41 42 5 73 -80 56 128 240 220 1 67 -292 -76 8 78 -43 -90 -205 -195 223 -86 135
2555A35j2K3P2l22N7L1M7L04k91k03O8l5P9J22q4J04k39J26j25O7l0j9O5P2J53
$$ 135 123 146 218 -104 -47 -16 31 335 44 -159 -91 -126 -47 75 -9 95 -144 -18 -143 -76 -106 -125 -60 12 165
2580A65j98j07l8K85l4q2j04J21j53L2K04j80J22j63K21j38J12m3J73k26L24l22
$$ 165 -33 -140 -178 107 73 -9 -113 8 -145 -113 91 -89 33 -130 91 -47 65 22 195 -31 293 -29
2602b9j59j09M58j86QQ2q4J85m00m2K30K6j92R5K25l23J82M8K3n8Rq6k16L8N2
$$ -29 -188 -297 161 -25 -17 65 -19 166 -234 -276 -46 -20 -212 -117 108 -215 -33 15 38 -20 -11 -97 -313 -275 -223
2627b23R4J3J13J99l50K10n1J42j07n3q6K8N2J73k55o6M06j22q2j74J86l19J44
$$ -223 -129 -116 -3 196 -154 56 5 147 40 -13 -99 -71 -19 154 -101 -167 239 117 35 -139 47 -272 -128
2650a28K23k16L9k55M54j1J37r9k13K18l90L16m9q3j09J75j3K69j65l6m1r9J56
$$ -128 95 -121 -82 -337 117 106 243 144 -69 149 -241 75 26 -57 -166 9 -4 265 100 64 23 -76 80
2673H0J8o6l24K21j33J18L07k7kk93J85j90m5OK89q1J66j55R4J2j22Lj20J20k80
$$ 80 98 32 -292 -71 -204 -86 221 194 192 -101 84 -106 -151 -145 144 63 229 74 168 180 58 61 -59 61 -219
2698b19K43J77m40ML68o0j96R8r9L36l70K19J01k84P3p4J79m69O82l13o3K95k09
$$ -219 24 201 -239 -235 133 73 -123 -25 -124 212 -158 61 162 -122 -49 -123 56 -413 269 -44 -107 188 -21
2721b1j62K87j64k7L72m99J67O1K08k46q3j15K45J26k46j19K58L10l62J09n3J88
$$ -21 -183 104 -60 -87 285 -214 -47 14 222 -24 -107 -222 23 149 -97 -216 42 352 -10 99 46 234
2743B34k05Q9k58L36k61m9K17k51L31P0m17K65j80K9J82k09J48l11L26l89K92
$$ 234 29 118 -140 196 -65 -114 103 -148 183 253 -164 101 -79 -50 132 -77 71 -240 86 -303 -11
2764a1k0k8J06m3j72J33k27J01M14k25p0j13M05k83j57K17k2j52Q1K05k27K78
$$ -11 -31 -59 47 4 -168 -35 -262 -161 253 28 -42 -155 250 -33 -190 27 5 -147 -66 139 -88 190
2786A90ll18JQ6J44l6p4J46m14J2L01M3l9J13k87J40k95J53K75k05J3l44N16j52
$$ 190 187 -131 -130 -44 100 64 -10 136 -278 -266 35 78 39 152 -135 5 -290 -137 138 -67 -54 -398 118 -34
2810c4K5o8j00L93n6k00o0J60j2L3J55j49j38J04j4m1k28K53N3R4q1q0p9m0j0
$$ -34 -9 -77 -177 216 160 -40 -100 60 48 81 236 87 -51 53 39 -2 -230 23 76 170 89 9 -70 -110 -120
2835a20J84Q7k88J01n8K26l95K68j13K0O5J08l43J74J33Q1j55j32M52m52Q0O2
$$ -120 64 151 -137 -36 -94 132 -263 5 -108 -88 -23 85 -258 -84 49 130 -25 -157 295 -157 -77 -15
2857a5k1J77j64mp1K44j04N5J23j56J2j49M7L29l28k49L11j34P7K1r9L1q3M8J8
$$ -15 -36 141 -23 -27 -98 146 42 97 220 64 76 -73 -26 303 -25 -274 37 -97 -20 1 -98 -67 -150 -102 -84
2882h4m6J28j17Q2l01N67j33j76RL1J38o4k7M9L3k01K5r7J63j38J55q5N1J0L9
$$ -84 -130 -2 -119 -37 -338 229 96 -80 -71 -40 98 34 7 56 89 -112 -87 -184 -21 -159 -4 -89 -38 -28 11
2907A1j95K84j77l3L49O1m52J22N4j26L2K58J34l26k5j25K73l18P3L10k82p5J55
$$ 11 -184 100 -77 -110 239 300 -152 -30 24 -102 -70 188 322 -4 -29 -154 119 -199 -126 184 -98 -173 -18
2930a8K45j64K23l14j5K11m7l95K05J58R3l21K83j9%nj00k17M30n18Q8P0j39K70
$$ -18 227 63 286 -28 -43 168 121 -274 -69 89 182 -139 144 125 125 120 20 -197 233 -285 -197 -127 -266 4
2954Dl3J84l05K18M0l8l13K33J5r6J64J5J22k3r2k26K87k01K40l11N8o5K3J8L36
$$ 4 -29 155 -150 68 108 70 -243 -10 5 -91 73 88 210 187 95 -131 156 -45 195 -116 -58 -123 -100 -82 254
2979B54k71K36j37p0J76l79K99k28n4N10k55k57L19o5mo0j73M90l28j65K46j85
$$ 254 -17 219 82 12 188 -191 108 -120 -174 336 81 -176 143 78 74 14 -159 331 3 -162 84 -101
3001a01L9Oj52K99j66J05j4J57k08K4J35l17K66k95L07l18oK52K2k72J99m6o0
$$ -101 -62 -56 -208 91 -75 30 16 173 -35 -11 124 -193 73 -222 85 -233 -239 13 35 -237 -38 -84 -144
3024a44P2Q7Q3r9j52K38O6j37j17P4Q9K6j83m5r9K99O2j65J92l62J97k49M12Q
$$ -144 -72 15 98 -1 -153 85 151 14 -103 -29 60 86 -97 -142 -241 58 120 -45 147 -215 -18 -267 145 153
3048A53k45Q6J31j16K05l38K79j79J00K4k71L72j82K3p1o5K0P5j05K86n01O0j15
$$ 153 -92 -6 125 9 214 -124 155 -24 76 100 -171 201 19 42 -29 -94 -74 1 -104 182 -319 -259 -374
3071c74M43j47l00L41n5J72N3R5j41lK7j68K33k57jJ26L0j54n2K05J39j24k28
$$ -374 69 -78 -378 -37 -92 80 133 228 87 84 111 -57 176 -81 -82 44 74 -80 -132 73 212 88 -140
3094a40J33j25J79j84M08k80j7J25p2m4J49l83J02q5K66j45L12l01m8K10J2j85
$$ -140 -7 -132 47 -137 271 -9 -26 99 27 -17 132 -251 -149 -234 32 -113 199 -102 -150 60 72 -113
3116a13L3L5m2K80l23J75J83k55K27p4k1j41K28j16l01L28q4o0j26PK78l58J65
$$ -113 -80 -45 -87 193 -130 45 228 -27 200 126 105 -36 192 76 -225 103 19 -41 -167 -160 118 -240 -75
3139g5J0K21k26J31l2j42j00K19q1l8J16Q8n9r0j65M99l22n9R8k17K46J8r9J86
$$ -75 -65 156 -70 61 29 -113 -213 6 -75 -113 3 91 32 -58 -223 276 -46 -105 -7 -224 22 40 -59 127
3163A27j23j42J56N9l3p7J68k07L67k91J04M5r7M0q5k25L63k32k1qK76j07m7K41
$$ 127 4 -138 18 77 44 -33 135 -72 295 4 108 153 56 96 11 -214 149 -83 -104 -112 164 57 10 251
3187B51m29M06j45j42l5J3l1R6R0j39K74l08L20k34O1J67n30%L67j21J57M0k9
$$ 251 -178 228 83 -59 -94 -81 -112 -16 74 -65 209 -99 221 -13 48 215 -315 -315 52 -69 88 128 99
3210I9l6j98m9Q5J75j64L8jK97m67j09K05L7J8K09j04K05l76K44k94K61J1k2j2
$$ 99 63 -135 -184 -99 76 -88 -50 -51 246 -221 -330 -125 -88 -70 139 35 240 -136 108 -186 75 86 64 52
3234E2L0j12j03L38l70K53QK4K2m2m68L01j4J5L8k09L78J60l10k45L41k87k8L18
$$ 52 82 -30 -133 205 -165 88 96 120 142 100 -368 -67 -81 -66 -28 -237 141 301 -9 -254 87 -200 -228 90
3258I0J84l15L73o85L55Q2j86P0k1j00L34k75J1L14l00j23K05j6k00K40N9j41
$$ 90 274 -41 332 -353 2 84 -102 -32 -53 -153 181 -94 -83 231 -69 -192 13 -3 -203 37 96 -45
3280d5J3K9Q0j33n1K9O0n6J2Q5K5J18n31L42N7l02L20J75j72k04K07j27K26k16
$$ -45 -32 -3 77 -56 -107 -78 -18 -74 -62 23 48 166 -365 -23 34 -268 52 227 55 -149 58 -69 157 -59
3304e9j82J76J74r1J10l02K29L6p1%p4k23L68r0j55J51q8M1P6J36m69M33r0m9
$$ -59 -241 -65 109 18 128 -174 55 91 20 20 -54 -277 91 1 -154 -3 -91 -50 26 162 -307 126 36 -13
3328a3R7k76K90l06K28q1NQ1j07n4j1L59l58L6J42k3j37J44L01l90L65q4k72L47
$$ -13 84 -192 98 -208 20 -61 -56 25 -82 -136 -147 212 -146 -110 32 9 -128 16 317 -73 292 208 -64 283
3352B83k24n5j46J10j75L92j05j04O2j9j47j97K41Q2P6k25J49j45J03J55K5j88
$$ 283 59 4 -142 -32 -207 185 80 -24 38 19 -128 -325 -84 -2 74 -151 -2 -147 -44 111 136 -52
3374e2K40L5K9k7k60J87k08n6K12n2J21L5k63qmJ17j51k33J61K15Kk33P9J14P0
$$ -52 188 223 252 225 -35 152 -56 -112 100 48 169 204 -59 -67 -71 46 -105 -338 -177 38 40 -193 -114 0 70
3399G0n6O5q3p2J03r6K11J25j57m1j48J50K1k01O3L53m38r4L93l86J64L76l25
$$ 70 14 79 -4 -76 27 -69 142 267 110 69 -79 71 92 -109 -46 307 -131 -225 168 -218 -54 322 -3
3422cJ2L3l37M64m6N2Oj94MJ28k50L37m71K72j31J06P9P8j33j90L80L0m04O5J87
$$ -3 9 42 -295 169 123 175 181 -13 -9 119 -131 206 -265 7 -124 -18 61 139 6 -184 196 226 -178 -113 74
3447G4q8k9j37l0M56m1l33L30m56M27k35J04m11K39J10J03l72L49O1j31n0K87
$$ 74 -14 -43 -180 -210 246 205 -128 202 -254 173 -62 42 -369 -130 -20 83 -289 60 121 -10 -60 227
3469B27j84Q6o0j59M13m57L7QJ2m7K27j76jN9j49J98Q9om21K80o3K02l13K88r
$$ 227 43 129 69 -90 323 -134 -97 -89 -77 -124 103 -73 -74 -15 -164 34 123 117 -304 -24 -87 115 -198 90 81
3494H1j97J34N2l28M67l16J22j09K27q6K41j66k24O8m4n9L32l43l4J79rM9K2j06
$$ 81 -116 18 70 -258 209 -107 15 -94 133 47 288 122 -102 -34 -78 -137 195 -148 -182 -3 -12 37 59 -47
3518d7PJ26k02L40j91r6J73J92k90K5L3k0j40O2o8K60K6k98L51k08m7M7j49m3
$$ -47 -40 86 -116 224 33 -63 110 302 12 37 70 50 -90 -28 -96 164 190 -108 243 35 -12 35 -114 -157
3542a57M55k99l38K01J93oJ54q5Q4j60K2j1k9j03N6K6q6K96k44Q6L0n7L0q9k8
$$ -157 298 -1 -339 -138 55 49 203 118 202 42 64 53 24 -79 -23 3 -83 213 -31 55 85 28 58 -31 -59
3567e9K5L3L7J25k88J76K4O7mPO8j67K72k03l3j24r2L69k61J28k05K55o2O4r0
$$ -59 -34 -1 36 161 -127 49 73 140 136 143 211 44 316 113 80 -44 -136 233 -28 100 -105 150 88 152 62
3592F2o4J6j04J73j43J89r3mj08L60l10J66j15J31K18n50L33J20k69j11M2k3K76
$$ 62 -2 14 -90 83 -60 129 36 32 -76 284 -26 140 25 156 374 -176 157 277 8 -103 -61 -84 192
3615A92o0r6j3j70K62j35J26k98J05J70k05p7K18j70J40n0J86j34k01J9Q8j5J47
$$ 192 132 36 23 -147 115 -20 106 -192 -87 83 -122 -199 19 -151 -11 -61 125 -9 -210 -191 -103 -118 29
3638B9m7o2J05j11K99l19K59k42j95N17j83k48N3K0K78p1l3L72m43j21J9L56j36
$$ 29 -18 -80 25 -86 213 -106 153 -89 -284 233 50 -198 -145 -125 153 82 49 421 -22 -143 -124 232 96
3661I6M8j76j22l1J13J18K32m45J73p2L6j75P3L80j78O5o9j40J90j45j23K58Q1
$$ 96 144 -32 -154 -185 -72 46 278 -167 6 -66 -30 -205 -132 248 70 135 66 -74 116 -29 -152 106 187
3684A87m76K29j68P5K64q7J12l44N30j93j46J97k87K03P1k6m03J19N2J06j16L5
$$ 187 -289 -60 -228 -153 111 24 136 -208 322 129 -17 180 -107 96 167 141 -262 -143 -91 15 -101 -66
3706f6MJ96m05L21j87L0J8k05L15j06j2m1J39j8J39O8pl04K3j82L72k67J5K39
$$ -66 -62 134 -271 50 -137 -107 -89 -294 21 -85 -97 -138 1 -17 122 190 183 -121 -98 -280 92 -175 -160 79
3730G9k00J44j25J60L6n06L79L48l74K7j27m4L03o7k49J66K40l31J00q8l0K31
$$ 79 -121 23 -102 58 94 -412 -33 315 -59 -32 -159 -203 100 33 -216 -50 190 -141 -41 -129 -159 72
3752G2%j21j80J52J85J00m87L06Rp6o1J17m1q7P7K46k94Q8J05O2k10J50k85K3
$$ 72 72 -49 -229 -77 108 208 -279 27 36 -40 -101 16 -25 -112 -35 211 -83 5 110 172 -38 112 -173 -150
3776a50N77j06o05J52M1J25K05n08J03J46j30K3P9J43k47J35j20J1r9J18n5K0
$$ -150 427 321 -284 -132 -91 34 239 -269 -166 -20 -150 -127 -48 95 -152 -17 -137 -126 -225 -107 -162 -142
3798a42K62j96k2N9j72R7j50K49l7k1J84l04K14o1J55J3l5P1k15j00J55p8J2K87
$$ -142 120 -76 -98 -39 -211 -114 -264 -15 -52 -73 111 -193 21 -40 115 128 93 164 -51 -151 4 -74 -62 225
3822B25j23r0j04J22r2L56l99J85o3M8l06K06O4m7j43K16J57j37j68K90j48K5
$$ 225 102 12 -92 30 -62 294 -105 80 17 65 -241 -35 29 -18 -161 55 212 75 -93 197 49 74
3844G4O2om6n3k0L9Rr3J6J49J07n99L24J15m3n8j30j53N04j18j89L09l0j83J9
$$ 74 136 130 84 31 11 50 59 -34 -18 131 238 -361 -37 78 35 -23 -153 -306 198 80 -109 200 170 -13 6
3869Fj02R7o1m5O4n4K61n4j17o0j7J07J38j14J75l6j76k77J85j8J29r8J50l44
$$ 6 -96 1 -60 -105 -41 -95 166 112 -5 -65 -82 25 163 49 224 188 12 -265 -80 -98 31 -67 83 -261
3893b61O9K36j29R8J19j62K05j23mJ9k85M78j22J22j15l37R7Q0k2N1Rj13J31j66
$$ -261 -192 44 -85 13 132 -30 175 52 48 67 -218 260 138 260 145 -192 -95 -15 -37 14 23 -90 41 -125
3917a25L43k66R4j49k08R7K90k61J41K98l44p2O2O0j99J79m0L7J57L1m36M37j11
$$ -125 218 -48 46 -103 -311 -214 76 -185 -44 254 -90 -162 -100 -40 -239 -60 -100 -63 94 125 -311 126 15
3940A5OJ90j5m40K84J48j95L58m26j72K16N6j0M7n3J35o7l69J10N7J26J83k06
$$ 15 21 211 196 -244 40 188 -7 351 -75 -247 -31 25 15 62 9 144 77 -292 -182 -125 1 184 -22
3963b2L1j5qJ8p8J1K04j97j11J26J03k06L52r9k1j6Q1j95J35k34J04P9p6j63L77
$$ -22 9 -6 -14 4 -74 -63 141 -56 -167 -41 62 -144 208 109 88 72 153 -42 93 -141 -37 42 -34 -197 180
3988A80J05l54%J24N5j71K06k3n6j35j28J02K55l64M08j66j89L10k9j18j43L02
$$ 180 285 -69 -69 55 110 -61 145 122 66 -69 -197 -95 160 -204 204 38 -151 159 130 12 -131 171
4010A71k25j45Q0J03L06m45K38K3N1k96o2L2J6L66k93J72l9J4n7J00R1l21n2J2
$$ 171 -54 -199 -119 -16 290 -155 83 106 157 -139 -201 -169 -153 213 -80 92 53 67 10 110 201 -120 -172 -160
4034a60K70j29J58k52j13K87n3N9o0j93J48K58q5q2rk03K66j23j16K40l00K67
$$ -160 110 -19 139 -113 -226 61 8 67 7 -186 -38 220 135 53 44 -159 107 -16 -132 108 -192 75
4056G5K09j73j99l9J56j57J66O4kj10r0K13m7n4j3J04n4J88j76J5K2M9O1k90J16
$$ 75 284 111 -88 -127 29 -128 38 102 100 -10 -100 113 66 12 -1 103 49 237 61 76 98 147 208 -82 34
4081C4j7j78J78j09K73j31mj89K93l74L48m2k96rJ22j00M50M2k62j08j61K40j04
$$ 34 17 -161 17 -92 181 50 46 -143 150 -224 124 82 -214 -223 -101 -201 249 291 29 -79 -240 0 -104
4104a04L21j97k82K62J54J05l57L9q4J41j77N0k51O17j37Mmj34J48o5J60l80J21
$$ -104 217 20 -262 0 154 259 -98 -59 -143 -2 -179 -129 -380 237 100 104 100 -34 114 49 209 -171 -50
4127e0k14M25k83K52j38j31J3l2K60j62J42j7j18J10J03k37K27k21j15K15J3P1
$$ -50 -264 161 -122 130 -8 -139 -126 -158 102 -60 82 65 -53 57 160 -77 150 -71 -186 29 42 113
4149A13p8o9P9j22J20j50K03p5l4l9J18o5o7o2K39j35K45k88r4N4r0j7m3J36J31
$$ 113 35 -34 45 -77 43 -107 96 21 -13 -52 66 1 -66 -128 111 -24 221 -67 -161 -107 -197 -214 -257 -121 10
4174A0J25j31mL24l29J0P1Ll6j91M3J14L7n7j63J82j57K52k50j19J70K79k62j51
$$ 10 135 4 0 324 -5 5 76 79 43 -148 -105 9 46 -11 -174 8 -149 103 -147 -266 -96 183 -79 -230
4198b30K44p1Q0Qj91K54k21J01J07M1J1Qm18J78K4K48k41m7J23K58k68k5nP8k27
$$ -230 14 -57 23 31 -160 94 -127 -26 81 122 133 141 -277 -99 -75 173 -68 -115 8 266 -2 -27 -32 46 -181
4223a81R0K69n7j72l6J46n4Mmj6J42J89m88K78k25J92k4k90M19r5j84K98j47J34
$$ -181 -91 178 121 -51 -87 59 5 9 5 -11 131 320 -168 110 -115 77 53 -237 182 87 -97 201 54 188
4247A88k36Q3j99J79n0K51k59P4M9j13p6l0N9K5R0K2K7j87M08m24l5K92j27l2
$$ 188 -48 35 -164 15 -35 216 -43 31 80 -33 -109 -139 -80 -55 35 57 84 -103 305 -119 -154 138 11 -21
4271b1k5J06k24J7K73j52J44J55l22J48r5o8K24k57L45l44O9n8J83o2L2o7n7k55
$$ -21 -46 60 -164 -147 126 -26 118 273 -49 99 4 -64 160 -97 248 -96 -27 -85 98 36 68 1 -56 -311
4295c11K60L87o6l15K75j15l20J65K63k19o6P5mp6o9L53k40j36K1L32j90J27k23
$$ -311 -51 336 270 -45 230 115 -205 -40 223 4 -62 13 9 -67 -136 217 -23 -159 -138 194 4 131 -92
4318i2L51n00K22J75k10k06L97j75k9P4j0l9J2j64K14J82l74J13j38R9J69k62
$$ -92 259 -241 -19 156 -54 -260 137 -38 -67 7 -3 -42 -30 -194 20 202 -172 -59 -197 -98 71 -191
4340a91K45l2j46R4K6J17j13q8K82k55K99l76l0K18K7K9j3q0n9L68m07j0j36L37
$$ -191 54 22 -124 -30 -4 113 0 -88 194 -61 238 -138 -168 50 77 106 93 13 -46 322 -85 -95 -231 106
4364A06p2J2j73k09M72Q4k17r9J20j11M35l31J43l14J92L5o4K3l6J3j7j35L44
$$ 106 34 46 -127 -336 136 220 3 -96 24 -87 348 17 160 -154 38 73 9 32 -4 9 -8 -143 201
4387B01j19qJ78l95L51l91J34j20K21n4L14k02j55m8O7K46o26M00j94J20K19j70
$$ 201 82 74 252 -143 208 -183 -49 -169 52 -2 312 110 -45 -93 -26 220 -406 -6 -200 -80 139 -31
4409c1K01nk09N8j7J75M1m29J3L26j52j2j50q1L70o6K0j57J49J22K21n62K91k15
$$ -31 170 165 -44 14 -3 172 213 -216 -203 123 -29 -41 -191 -272 98 32 52 -105 44 166 387 -175 116 -99
4433i9j37L26Q9l34J19O0j85J27l5J67k39P5j32L44j05j66J83j10j47Q8k1o4L70
$$ -99 -236 90 179 -155 -36 24 -161 -34 -69 98 -141 -66 -198 146 41 -125 58 -52 -199 -111 -132 -196 174
4456A74N8j29Oj76J73j20K0m1J81k98L65l55l7K43l09K97l1L7O8n1J6k02J3O7
$$ 174 232 103 109 -67 106 -14 6 -35 146 -152 213 -142 -179 64 -245 52 21 58 126 75 91 -111 -98 -31
4480c1j63L21l70L87j23j63K11j80j94R8L21j71L4N4K12l46K7P4J89n5L7o8R8
$$ -31 -194 127 -243 144 21 -142 69 -111 -305 -207 114 -57 -23 31 243 -103 -76 -2 187 132 169 101 199
4503A99k16lj35J1J75N9j43J1J41L08j37l4j76j34J92k82J54j41J01o9L92l72
$$ 199 -17 -20 -155 -144 31 90 -53 -42 99 407 270 236 60 -74 118 -164 -10 -151 -50 -119 273 -99
4525i9J70j15j34J30m0K76j76K19k29O2J01l83L00o08M67J15m07K90qj99N35m11
$$ -99 71 -44 -178 -48 -88 188 12 231 2 64 165 -218 82 -526 -59 56 -351 -61 -69 -268 267 -144
4547a44J78q4j23M16R3n61K85J04j40J64J62l86N3Q7r6j78K64k42Q7N3K21k00
$$ -144 34 -50 -173 243 336 -225 60 164 24 188 350 -36 17 104 8 -170 94 -148 -61 -8 213 13
4569A3j34K26m5Jk11J0J08J45j7o3k23J37r5J23O6j95K67j50K84j51j11j23p4
$$ 13 -121 105 60 61 -150 -140 -32 113 96 33 -190 -53 -148 -25 41 -154 113 -37 247 96 -15 -138 -212
4592b12K80j87J51k54K04l8j68J49K61j00j61L9J68n04K88n6J79p9om2R9K93k92
$$ -212 68 -119 32 -222 -18 -56 -224 -75 186 86 -75 -36 132 -372 -84 -140 39 -40 -46 -88 11 304 12
4615A2p5J22j48L5K5J02O7o6J46k00j21J82L2J37l79M25l27rK32l18Q8O8ok29
$$ 12 -63 59 -89 -54 -29 73 140 74 220 20 -101 81 113 250 -129 296 -31 -40 192 -126 -38 30 24 -205
4639b05L21j24k69J7K47K25k14J10n3O7P3m23L20j40K00j91J05j97M1J58j96p
$$ -205 116 -8 -277 -260 -13 212 -2 108 55 122 195 -228 92 -48 152 -39 66 -131 -90 68 -128 -135
4661a35K94j97q2J09m7L93l61J35l43K43j42l31O23l36J09k30L01J46r7J62M8
$$ -135 159 -38 -120 -11 -58 335 -26 109 -234 9 -133 -464 159 -177 -68 -298 3 149 52 214 262
4682B62k68Q1q3K23l73j9J73J2j1K50l7m01R8J63q7O1j72J24K7L6m4l54K17K71
$$ 262 -6 75 -8 215 -158 -177 -4 8 -3 247 210 -191 -93 70 -17 44 -128 -4 23 59 15 -339 -122 149
4706A49k64j61K73J37N7j55l39J88K19j21J63k60N9L21n70O1J97J0L7K85l29J30
$$ 149 -115 -276 -3 134 191 36 -303 -115 104 -17 146 -114 -55 266 -304 -243 -46 -36 1 286 -43 87
4728H7k63K67m9M8k23J67J6j80R0p2m5J41N2r1O6n0J29k66K99j67j84K48P0P1
$$ 87 -176 91 42 90 -133 34 50 -130 -40 -112 -157 -16 36 -55 11 -39 90 -176 123 -44 -228 20 90 161
4752A61m8k30L7qk6Kn9L98l07Q5j80J78J16k7K05k93k63L32k08J63nk79M11j2
$$ 161 113 -117 -80 -88 -114 -112 -171 227 -80 5 -175 3 119 92 297 4 -259 73 -135 28 23 -256 155 143
4776A43k19J79q5m2J49J12l40m5M0J03j55K21Loo4j0%J51k03n0J64j0k4j99K79
$$ 143 -76 103 18 -24 125 237 -103 -148 -108 -5 -160 61 64 58 -6 -16 -16 135 -68 -118 46 36 12 -187 92
4801I2p2O5k22M6J46j63K17j88K09l26J17n1M38k9l61o2L45k82j06L17O8j49j9
$$ 92 20 85 -137 -91 55 -108 109 -79 130 -196 -79 -130 308 279 -82 -144 201 -81 -187 130 198 49 30
4824C0J83k71J8r6Q2Nj11K77j50jJ08j7j5l6K55l66J78q7j11O6l5L1j5R0j24J00
$$ 30 213 -58 -40 -136 -54 -49 -160 117 -33 -34 74 57 42 6 261 -105 73 -14 -125 -59 -94 -63 -78 12 -112 -12
4850a2k5K09l0J27n37Q4K74j47O2O3k8p6k19K44j3m4j12R3P7o8J55k66J65K13
$$ -12 -37 172 142 269 -268 -184 90 -57 5 68 40 -36 -255 -11 -24 -68 -180 -87 -10 -78 77 -189 -24 189
4874A89P1o12L00%J83j78K24l46K91l35M44l38J03P6k8Nj40P2jk77L17J77k48
$$ 189 260 -352 -52 -52 131 -47 177 -169 122 -213 231 -107 -4 72 44 49 -91 -19 -20 -297 20 197 -51
4897e1K25n7P2mj88nK7k11K28L05r8k70J41j39k51J78K79m68M48J6j30k96Q9R3
$$ -51 174 117 189 185 -3 -8 19 -192 36 341 243 -27 114 -25 -276 -98 181 -287 161 177 47 -249 -160 -67
4921f7J87P4k00m8J9J58K3k15K89j10j41J12j42M8l8K03j33k6m6J81j39N3l4j53
$$ -67 120 194 -6 -54 -35 123 146 -69 220 110 -31 81 -61 -13 -51 152 19 -7 -53 128 -11 42 8 -145
4945a45q6K08j33J83k07r9L94j92m9K09J17j36Lj60p6q0J27Q6oJ98k38K24l62
$$ -145 -231 -23 -156 27 -180 -279 115 -77 -126 83 200 64 67 -93 -169 -249 -122 -36 -42 156 -82 142 -220
4968b20J39K25J5m72N28l03n0K80n59K65K20j99K36J20j49P1j47j50j20K22M8
$$ -220 -81 144 159 -313 215 -88 -138 142 -417 -152 68 -131 105 225 76 147 0 -150 -270 -48 0
4989@j99L18o7%r8J0OM1m7j15K47m26M99k91j11L76m3q3K94l58n4J22j43J37J62
$$ 0 -199 119 52 52 -46 -36 -30 11 -36 -151 96 -330 169 -122 -233 143 100 17 311 -47 -101 21 -122 15 177
5014A77j06j7l11K11J70j74j2J89r8o0j89L71j71j01L37k68L57l19R3m75M13O3
$$ 177 71 54 -257 -46 124 -50 -62 127 29 -31 -220 151 -20 -121 216 -52 305 -14 79 -396 17 80
5036H0k3l07N09j83j3r7q4N4r2J70L7r2J83p2J54O2j65o5k05J91K62o78J54K08
$$ 80 57 -250 259 76 63 -34 -118 -64 -156 14 51 -41 142 70 224 286 121 56 -149 42 304 -374 -220 -12
5060a2K33P1k79j53J20P8o4J3q2L63l12J72nk48J86k21L6N7L3K53l18R4J4K22
$$ -12 221 292 13 -140 -20 58 -6 7 -75 288 -24 148 143 -105 81 -140 -104 -47 -14 239 -79 15 29 251
5084B51o8j9p9J31k4l17m1K21R5j04k10J60K2o9M6l1l8m9L07k79O1J15J15J01
$$ 251 183 164 85 216 192 -125 -166 55 150 46 -164 -4 18 -51 -5 -36 -74 -123 184 -95 -34 81 196 297
5108B97m08M14j18n64O90l36J60k7j79K09m3l41K56L1K8j05J72j46Q7Q1j28l7
$$ 297 -111 303 185 -379 311 -25 135 108 -71 138 95 -246 10 41 69 -36 136 -10 77 158 30 -7
5130gK47k8k74k00K96L6j51NJ22Q9j30P2j49L2Q0J57r3k38J77N5m64K18J22O2
$$ -7 240 212 -62 -262 34 70 -81 -76 46 135 5 77 -72 -40 40 197 104 -134 43 98 -366 -148 -26 36
5154C6j73K2J82J37n7j87pqq0r8M74Jr5j33j81K11k3r8R5%q0JP3j33K75n09M56
$$ 36 -137 -115 67 204 147 -40 -47 -55 -135 -233 241 242 147 14 -167 44 21 -77 18 18 -62 -61 12 -121 154 -355 101
5181A01L4j93L90k80o3k3J49p8r7n7J78L5j03k53J05J89j48k60O16k07o3L38m02
$$ 101 135 -58 332 52 -11 -34 115 37 -60 -117 61 96 -7 -260 -155 34 -114 -374 242 35 -28 310 -92
5204i2Q2l1j61J12P0r7J38J02o2K56m72L82Lj86O6j10L6l7r8L24k88j96N48k92
$$ -92 -10 -41 -202 -90 -20 -117 21 123 61 317 -155 227 230 44 110 0 36 -1 -99 225 -63 -259 289 -3
5228cN3k5J7n8J8K3p7J47q5j09K24m9J22k97M1j6K59k26K36j35J57r2j66L08l56
$$ -3 50 25 42 -16 2 25 -52 95 10 -99 125 76 198 -99 -58 -74 185 -41 195 60 217 125 -41 267 -89
5253h9K37l14N35j46m77R9M23k99j63K88k05P6j38J76J3O8O2k53J12qq3k4J17
$$ -89 148 -166 369 223 -254 -155 268 -31 -194 94 -111 -35 -173 3 16 84 146 -107 5 -3 -86 -110 7
5276Gj04J06Q3j1J6K5j45K27j53n1O5L8n4k48L74j29j22M5k23J73K88o3l96M59
$$ 7 -97 9 92 81 97 122 -23 204 51 0 65 103 49 -199 175 46 -76 -31 -254 -81 207 144 -252 207
5300B07l37K00j23K19m9k27L06m57J06J66rj14J62J79j15l15L42J09j97l06L23
$$ 207 -130 70 -53 166 117 -110 196 -261 -155 11 2 -112 50 229 114 -201 141 250 53 -253 70
5321G0R8k96K28k4o0j12K96m02K51k8J05l10R9L6K63j96R8QP3m45L30r9j66J06
$$ 70 168 -128 100 76 16 -96 200 -202 49 21 126 -184 -85 -49 214 18 116 124 197 -248 82 -17 -183 -77
5345g7K9K68k17J79M2k08J73j14J1j43K19N0j20k03j92K74J73J4m77K46J49l5
$$ -77 -48 220 3 182 224 16 189 75 86 -57 162 212 92 -111 -303 -29 144 158 -319 -73 76 41
5367D1j64M9R9r1j03J8J25K85m24J98J2j82L03j69j1N3L0k05J01J97n7Pk13K66
$$ 41 -123 -74 25 -66 -169 -151 -26 259 -165 33 45 -137 166 -3 -14 39 69 -136 -35 162 105 112 -101 165
5391A65k95k7L31m3o5O1j6k07j81N58k29l92M65j32M7Q7l43K30j47L8M9j74O6
$$ 165 -130 -157 174 131 66 127 111 -96 -277 281 52 -340 125 -7 40 127 -216 14 -133 -95 -46 -220 -154
5414a54o7L81l79j5L46M2m97M72k28L5Q9NO3k23J12k4K18k20j74K59k07K37o1
$$ -154 -221 160 -219 -234 112 154 -343 129 -99 -64 25 30 93 -130 -18 -42 176 -44 -218 41 -166 71 10
5437A0K3m0j11L20k75K24j54j42K11K11j16j08J18j13j6rk62N00J8l17K81k83
$$ 10 33 -7 -118 202 -73 151 -3 -145 66 277 161 53 171 58 42 33 -229 271 289 -28 253 -30
5459c0M4j2J65k58K05k29K42Kj64K73j75J96o0l72Q4J8J39J30No7j27K4k54M38
$$ -30 14 2 167 -91 114 -115 127 129 -35 238 63 259 199 -173 -89 -71 68 198 203 136 9 33 -221 217
5483B17k99J09n4j47J28J9j30L0K94P4l95Q5j3n7rK82j60n7K52j1k14j48K2K24
$$ 217 -82 27 -27 -174 -46 -27 -157 -127 167 241 -154 -69 -82 -139 -148 134 -26 -83 169 158 -56 -204 -182 42
5507D2j92J65m8Q0q8j0o6P7K56q0j50J00j55J57J15p3P7j22k95J28o5R2J37k2
$$ 42 -150 15 -33 47 -41 -51 -117 -40 216 136 -14 86 -69 88 203 130 207 85 -210 -82 -147 -55 82 60
5531F0j26J6R2q5j21j28K20K87j95O1m0Jk75L44l36L3K88q8J21k50L8J12l6l6
$$ 60 -66 -50 42 -43 -164 -292 -72 215 20 81 41 42 -233 111 -225 -192 96 8 129 -121 -83 29 -7 -43
5555d3o1r7r2J95J34Q3k27Q7J47j24M0n9J57k09N2k04L07Q5l94R9K19l0l41J79
$$ -43 -104 -201 -293 -98 36 119 -108 -21 126 2 42 -17 140 -69 -17 -221 86 171 -223 -124 95 65 -276 -97
5579i7j67K58n2k28M11N7n42L58j24L30k45O9QO0O8l32L55k38J45k82L7pP3P9
$$ -97 -264 -6 -58 -286 125 182 -360 -2 -126 204 -41 28 36 96 164 -168 187 -51 94 -188 -151 -158 -85 -6
5603fp9J43r6N2j17J55q2K21j94J46r6j80K59k59N0R8o8N1J53k23L6K04l3l9j42
$$ -6 -85 58 -38 14 -103 52 -30 191 -3 143 47 -133 126 -133 -83 15 -53 -2 151 -72 -36 168 135 96 -46
5628d6l2O6k15K96j91RK66j47k60L27J28j87j65L76k43l1R0ml9L54l20O9O6j94
$$ -46 -78 -12 -227 69 -122 -113 153 6 -254 73 201 14 -151 225 -18 -49 41 37 -2 352 32 101 167 -27
5652b7j39J7K96k69J74j35K37m14N0L33j61Q6N9N0j13j26O4j06q9J34m8L7K99
$$ -27 -166 -149 147 -122 52 -83 154 -260 -210 123 -38 48 107 157 44 -82 -18 -124 -213 -79 -127 -90 209
5675B09j39N9l16K46k9Pj5j46J31R6k30M06m93K32M5j62K22j17P4l4Q9L5j3k41
$$ 209 70 129 -187 59 30 37 22 -124 7 103 -127 279 -214 18 63 -99 123 6 80 46 135 170 157 -84
5699h4J15j00j1N99m24k47N3J30K36m59K74k20J59J07j44k38J79K39o7j00k18
$$ -84 31 -69 -80 519 95 -152 -99 31 267 -192 82 -138 21 128 -16 -254 -75 164 97 -3 -221
5720b21J60k9l6J68lP7Mk23M71n58O7K5J37k88L02J14l22L24k36r3M7J79n2jk13
$$ -221 -61 -90 -126 42 39 116 120 -103 368 -190 -123 -98 39 -249 53 167 -155 169 -67 -160 -113 66 14 13 -200
5745b00L16j04j76L66k86k62M43l5j9r7P2K93l93J26Q8k82M84m32P5K0K20k07
$$ -200 116 12 -164 202 -84 -346 97 62 43 -54 18 311 -82 44 132 -150 334 -98 -23 -3 217 10
5767A0l29J45K67j44J99j07J4K8n2q6j59K16J15r6k8l0j11P6L86k30m3k41J62
$$ 10 -319 -174 93 -51 148 41 55 83 31 -55 -214 2 117 21 -7 -37 -148 -72 314 84 41 -200 -38
5790c8j06J20M8J53k71J83j21O5j67L21l21m24N81J7Q2k23J64l98K93j77L4p0
$$ -38 -144 -24 24 177 -94 89 -32 33 -134 187 -134 -558 23 40 122 -101 63 -335 -42 -219 -185 -255
5812b55K74n5p2N5o7m4k1L03j61K47l23L95k96J92r3J11k73J43j4J44pl41K34
$$ -255 19 -36 -108 -53 -120 -164 -185 118 -43 204 -119 276 -20 172 79 190 -83 60 46 190 183 -158 76
5835G6l9J39j78p6j89M44k61k3K51k12J13j00L7j3R6l7j39O1j43J55Q4J57k65
$$ 76 37 176 -2 -78 -267 177 -84 -107 144 -68 45 -55 -18 -31 65 28 -111 -50 -193 -38 46 203 -62
5858f2J59l7n6K40j59j4J58k28K5p1k2J47p8m9J20k1K5mk1Q1k16Q8J05Q2m42L15
$$ -62 97 60 4 244 85 71 229 1 26 -45 -67 80 2 -47 73 52 77 73 52 133 -83 5 110 192 -250 65
5884F5J34j79l60K83k0k2jJ96k39L38k27lJ65k9k90K88K56l83K74m08L05j61p3
$$ 65 199 20 -340 -57 -77 -99 -100 96 -143 195 -32 -35 130 101 -189 99 355 -28 246 -162 143 -18 -91
5907i1K97l20J3j11L93rk95J67q3J28j9j76R9ml6K52Mk86OJ66j02J0j52jR1l0
$$ -91 206 -114 -101 -212 181 172 -123 44 -39 89 70 -106 -7 -11 -47 205 209 -77 -71 95 -7 3 -149 -150 -59 -89
5933h9J30K1n6j04M5M2N8k72K62j18K08l4k59J71J54J07j67j86L2O7j07J67k73
$$ -89 41 62 6 -98 -53 -11 47 -225 37 -81 127 93 -166 5 159 266 99 -87 -55 12 -95 72 -201
5956b01K37N6j43Q3Ro7j82M20m70J20L8J57k6l4J4Qn0K8P4Rj58K82K1l73J57J07
$$ -201 36 92 -51 32 41 -26 -208 212 -258 -138 -100 57 31 -3 11 19 -31 -3 71 80 -78 204 225 -148 9 116
5982A16J14k29K12l39J12M7J42o7k72j8K53j05r9rK31J11q4M2l20K40k29J96K10
$$ 116 230 1 213 -126 -14 33 175 108 -164 -182 71 -34 -133 -142 89 200 116 158 -162 78 -151 45 255
6005B55k37K10m6j23o5l7K00l02K24k40QR3J78n7j71M5Q9k78M63l3k59R7N5o4
$$ 255 18 228 182 59 -6 -43 157 -145 79 -161 -153 -60 118 61 -110 -65 24 -254 209 176 -83 14 69 5
6029El72L22K32j80J64j19j08m0K10j21%jj27Q0l6q6J79Q1r5R0j33J41j83K99
$$ 5 -367 -45 187 7 171 52 -56 -96 114 -7 -7 -8 -135 -55 -91 -177 2 83 -12 78 -55 86 -97 202
6053B02k09L0K22Lm52J83N0r6k06j4K66o0J28q2k1Q9J2R1k20j07K10j3O3j03J59
$$ 202 -7 23 245 248 -204 -21 29 -67 -273 -287 -21 -81 47 -35 -56 33 45 136 -84 -191 19 6 69 -34 125
6078A25k58J9l7J04K77l07J04k40M30k56K73l24J51M8k91R3J16j49K12n8m2J79
$$ 125 -133 -114 -151 -47 230 -77 27 -213 217 -39 234 -90 61 109 -182 -89 27 -122 90 32 -10 169
6100A69R6l5o5j81K53n1n9l84J24J30l8J61K23m79K51J20k44r3M4L03j4j37j2
$$ 169 265 230 165 -16 237 186 127 -257 -133 -3 -41 120 343 -136 115 235 -9 -102 -58 245 231 94 82
6123H2k73Q7J78k21M0j05J45J23K03l54k79N12nj1J56k84J86m17L15rJ56j01l80
$$ 82 -191 -104 74 -147 -107 -212 -67 56 259 -95 -374 138 133 122 278 -6 180 -237 78 69 225 124 -256
6146b56Q9J72M7j36K40p3j36K57j14l24r0L02K7P0j69l1K27j83K37k25rq5K99
$$ -256 -167 5 52 -84 156 83 -53 204 90 -234 -324 -22 5 75 -94 -125 102 -81 156 -69 -78 -163 136
6169A36K9k42q7J05J24j86Jk06M04l00J96j67J42J3L4J8p8k9K86j15j23N08l27
$$ 136 165 -77 -164 -59 65 -121 -120 -326 78 -222 -26 -193 -51 -38 -4 14 -64 -93 193 78 -45 463 136
6192A36j89J51n8N3r1L50j96j30j2O8j70J71j2O0l0r8M0j58J54k39R4L14o4k19
$$ 136 -53 98 40 93 2 352 156 26 14 82 -88 83 71 131 101 3 43 -115 39 -200 -106 208 144 -75
6216g5J48m9pj97l2K90j55rJ42j95Q2m8K64P4k75m0J79K35l26K3j4J28m22K58
$$ -75 73 24 17 -180 -212 78 -77 -86 56 -139 -57 -105 159 233 -42 -82 97 332 6 29 15 143 -279 -21
6240b1k00K97K1J22l43K7K5J68J09l44j19K33J60k20p2j85N50j85K9n1O0R1J69
$$ -21 -221 76 97 219 -124 -97 -72 96 205 -139 -258 -25 135 -85 -157 -342 208 23 52 1 61 152 321
6263C21k30r8R6j13R1J02J28k31J95k32j92J68K44m58J72k8R6k61m6M79k37J80
$$ 321 91 -7 89 -24 67 169 297 66 261 29 -163 5 249 -209 -37 -65 31 -230 -276 203 -34 146
6285A46k77O7J51o1j19k2Q1n7J06M0k21K91j99J10j00o7L23k45J0J80j57Q4p9
$$ 146 -131 -64 87 26 -93 -115 -34 -91 15 55 -166 125 -74 36 -64 -131 192 -53 -43 137 -20 64 -15
6308a5J00q7j14N53l55L4N9m19m3M28p7k55k08K78m0j11K20L0k9K69j81r0Lr0
$$ -15 85 -2 -116 437 82 116 175 -244 -287 141 64 -191 -399 -121 -161 -272 -52 -22 -51 218 37 -53 -50 -140
6332a40j11K22j51M06k21n0R1l5m4j0J27k37O9J39l91K27K07l28K92j41K97l0
$$ -140 -251 -29 -180 226 5 -45 46 11 -33 -43 84 -153 -84 55 -336 -109 98 -230 62 -79 218 188
6354A88j6J7j19j18R0J18M3k38j21L88k48L08j80j37J33k60L02%j24m2Q7j93K3
$$ 188 172 189 70 -48 42 160 203 -35 -156 232 -16 292 112 -25 108 -152 150 150 26 -16 71 -122 -99
6377i9R6O4j1J6j78J65L2j07J09k58J88J31j81l9j18R1J12p2J53L3o2k21j11L39
$$ -99 -3 61 50 66 -112 53 85 -22 87 -171 17 148 -33 -72 -190 -99 13 -59 94 127 65 -156 -267 72
6401G2k91J21K4Q1P9l38K10OJ02P3k07k9L02l94L27j05N0J62n54N46m56M6R5J20
$$ 72 -219 -98 -74 7 86 -252 -42 -36 66 139 -68 -97 205 -189 138 33 83 245 -309 237 -219 -173 -78 42
6425D2J33r6j92L11p5l45K10k43J15L5J22Q2j18J5J00l56J93J78k78J07K42k23
$$ 42 175 79 -113 198 123 -222 -12 -255 -140 -105 17 99 -19 -4 96 -260 -67 111 -167 -60 182 -41
6447d1j48P0L83m85R7L02k5j45l62L50O2k45LJ27j37k4J45K25l78M32k20p7l2
$$ -41 -189 -119 264 -221 -124 178 153 8 -354 -4 58 -187 -184 -57 -194 -218 -73 152 -226 206 -14 -91 -123
6470a23l6J88k05K65J30n8l49J29J8J93j87o6J68p0j94J55m2L0J15q5J94j00l0
$$ -123 -159 29 -176 89 219 161 -188 -59 -41 152 -35 -101 67 -3 -197 -42 -84 -54 61 -24 170 70 40
6493D0O7p4J68j00J05j96n8j93K39K0k2j49J01M9J13k06k15J81K41k91L71l38
$$ 40 107 33 201 101 206 10 -48 -241 -2 18 -4 -153 -52 -3 110 -96 -311 -130 111 -180 191 -147
6515a47J75J13k27M7j28J07J82j76J29R8j89k8R4k9n4p3ql14M50j85L00m2lj97
$$ -147 28 141 -86 -39 -167 -60 122 -54 75 173 -16 -44 50 21 -33 -106 -114 -428 22 -163 137 95 92 -105
6539a05K18j82K25k04lO3j24K87Lm4l30L69l77K84j51J3R2j33R0L2K2J9K45m99
$$ -105 113 -69 156 -48 -51 12 -112 175 178 134 -196 173 -204 80 -71 -58 34 -99 -9 23 45 64 309 -190
6563a90K53k1O7j55L38m44J42j67L85n16L93N8k70M38l40jp3K17j94J98J91k22
$$ -190 63 42 109 -46 292 -152 -10 -177 208 -308 85 143 -127 311 -29 -30 -103 114 -80 118 309 87
6585H7MR8J3k92R6j72J24L26l84K29j32J67k7l60J7K22j59Q1K41r2N4n9rj46K4
$$ 87 91 189 202 -90 6 -166 -42 284 -100 129 -3 164 137 -223 -206 16 -143 -62 179 87 141 82 73 -73 -49
6610d9P7j49M3J5l1M26m97L50M0k43m33N84j39jP4l36M40J56l84J97j36nk4q2
$$ -49 28 -121 -78 -63 -94 332 -165 185 225 -18 -451 133 -6 -7 67 -269 171 327 -57 140 4 -1 -25 -107
6634a07n6J77l7J18j58L39j14j98o5L0J04J04j97J97J8j57j73L34m06l4K23J60
$$ -107 -163 14 -23 95 -63 276 162 -36 -101 -71 33 137 -60 137 155 -2 -175 159 -247 -281 -58 102
6656A02NL4Q2Qk14o2j64l5L35j91K16l20M33k75j77J22J34K1J7j47OK23l4j54
$$ 102 107 141 223 231 17 -45 -209 -244 91 -100 116 -204 229 -46 -223 -101 33 54 71 -76 -70 153 119 -35
6680c5J1m7N6k06K85j04k40L22m9n5K10l57J6K44j71J24j54PJ33J77m04L86q6
$$ -35 -24 -71 -15 -221 64 -40 -280 42 -7 -62 148 -209 -193 51 -120 4 -150 -143 -10 167 -237 149 63
6703F3l84J89J78j37K56O0o4P3k61k14K04j20O4Q0k7jJ08J44j66j41J10k39L57
$$ 63 -321 -132 46 -91 165 225 161 234 -27 -241 -37 -157 -93 -13 -40 -41 67 211 45 -96 14 -225 132
6726A32j16J41j75L2m9PK71J39m90O2M4M6J7r1n1J35Q3l14J11j48K6J68p9J43
$$ 132 16 157 -18 14 -35 -28 243 382 -108 -46 -2 44 61 -30 -81 54 137 -177 -66 -214 -188 -20 -99 44
6750D4k76K50j67K27j56J90k97P5p1J05J26p4l4L8p2n8K50o2l5j0P5mJ23p9j41
$$ 44 -232 18 -149 78 -78 112 -185 -110 -181 -76 50 -24 -58 -20 -92 -150 100 38 3 -7 68 64 187 108 -33
6775c3j27N2K58j38J67l78J52M72k14K76m69j22J80k97K14N2k5p1p1p6J18j69
$$ -33 -160 -108 150 12 179 -199 -47 425 211 487 18 -104 76 -221 -7 45 20 -51 -122 -198 -80 -249
6797b49J61K6k12M6J58j74L36k61N16l59Q1m0N0j41p8j51K7N8K92K7j69mK01m52
$$ -249 -88 -62 -274 -228 -70 -244 92 -169 347 -12 69 29 79 -62 -140 -291 -264 -206 86 113 -56 -60 141 -311
6821c11J68R0Mo4o6k3K52rq2o0n5o1o6M80k49N9l7J40m1p9J61qr4q8k7l60M97
$$ -311 -143 -53 -49 -113 -179 -202 50 41 -41 -101 -156 -217 -283 197 -52 7 -30 110 69 -10 151 143 49 -39 -66 -426 71
6848G1K4J13j54j62J65n6O6q0j15M3Oj5K5m2J82O2m01rL49j43K28l52K46p3J72
$$ 71 95 208 54 -108 57 1 67 -13 -128 -85 -79 -94 -69 -111 71 133 -268 -277 72 -71 157 -195 51 -22 150
6873A50k62r2L61rk57j92J92K23k03n0K38j60K67j82j75J88M5QL8l11J30L53n28
$$ 150 -112 -204 157 148 -109 -301 -109 114 -89 -139 99 -61 206 24 -151 37 82 90 128 -183 -53 300 -228
6896b28P1K34J41j84P7k41J90l06L10l58M55k54J00j00l5J41P3j56k23L12l1K1
$$ -228 -157 77 218 34 111 -130 60 -246 64 -294 161 -93 7 -93 -128 13 86 -70 -293 19 -12 9
6918IM4K4L6j05J59j69N5J41l65K25n3O8k28L00j3k10J88j44P4p7l70O23r0j7
$$ 9 53 77 113 8 167 -2 53 194 -171 54 1 69 -159 141 128 -82 106 -38 36 -41 -411 212 122 105
6942A05M7k47L25l23j91K25K82j21m22L09J04j82q9K55k15mk3M6J90k3j31j41
$$ 105 152 -95 230 -93 -284 -59 223 102 -320 -11 93 -89 -178 77 -138 -142 -165 -119 71 48 -83 -224
6964b24J89k05L53m2P3k44n4M02m64K10j02J3r5J58%lj26K48k1L6k25j05j05L16
$$ -224 -35 -240 113 71 144 -100 -154 248 -216 -6 -108 -95 -190 -32 -32 -35 -161 87 66 102 -123 -228 -333 -17
6988a7N9o9J18k38M38l39J64L11m67K3n5J54k77J82Q8k17L3L43j76K06m91Q4K3
$$ -17 42 -27 91 -147 291 -48 116 427 -40 -17 -72 82 -195 -13 75 -142 -109 234 58 264 -227 -143 -120
7011a20j2O0q0J17j77l9L20k39K57K2r9Q5n0L5k99K28m7J09m5n5j03LJ64j6J45
$$ -120 -132 -72 -152 -35 -212 -251 69 -170 87 109 10 95 45 80 -219 9 -38 71 26 -29 -132 -129 35 19 164
7036A64k59n9L61l4l67J0OK56K3R4k11J07j19O9J60k4j31N8l98P5J11qK14k07
$$ 164 -95 -154 207 173 -194 -184 -178 78 101 195 -16 91 -28 41 201 177 46 104 -294 -219 -108 -116 98 -109
7060a09j62J90RK02p3O5J74k94R4j90N9J38J22n04J41O0j99K29N7pk14Q9K36J36
$$ -109 -271 -81 -72 130 57 122 296 2 96 -94 -35 103 225 -279 -138 -78 -277 -48 9 2 -212 -123 113 249
7084B49l71O2M8j12J15J85k60O9P6j42L60l56J79k84M2K26j70L14j59K9n2k54
$$ 249 -122 -60 -12 -124 -9 176 -84 -15 61 -81 279 -77 102 -182 -140 86 -84 230 71 100 48 -206
7106b06J04R3o8M3J94q7j6J9j95J04l6J43j33K15k90J82J3ok36j1k94K58K38j51
$$ -206 -102 -9 -77 -34 160 73 57 76 -119 -15 -51 92 -41 174 -116 66 79 73 -163 -174 -468 -210 28 -123
7130a23L47k44M68k60k62k8J98J72m57J79J86k38o7R6N4K22l43p8K04j15L43j20
$$ -123 224 -20 448 188 -74 -102 96 268 -189 -10 176 -62 -129 -33 21 243 -100 -178 26 -89 254 134
7152A34l06l3O7L6r7L3J44oL9r7j28J06P8J55n0n07K20j82M69j52oj70M91k20
$$ 134 -172 -205 -138 -102 -199 -166 -22 -28 11 -86 -214 -108 -30 125 75 -432 -212 -394 75 -77 -83 -253 238 18
7176A8J25j71J91j10P9p5J00p2j11k66L29Q2L8k37K26k20J99Q2l41K3M1Q7k24
$$ 18 143 -28 163 53 132 57 157 85 -26 -292 37 119 157 -80 146 -74 125 207 -134 -111 -70 17 -207
7199b07K35M1k15J16J69N7m26M63k22o6J38kq4J70j44r3n7M8j20J37K8n1K82k33
$$ -207 28 69 -146 -30 139 196 -230 233 11 -55 83 81 -3 167 23 -70 -127 -79 -199 -62 -34 -85 197 -36
7223c6J00m5O7m12L06j1j74j0R0J09j5o9qK34j82K44k96J28q6R6K56k78Ro6J13
$$ -36 64 19 86 -326 -20 -31 -205 -215 -125 -16 -31 -100 -108 126 -56 188 -108 20 -66 30 286 8 17 -49 64
7248F4j38K96m74K14j1K52l46P2K34l16O7J27k55L90k22Q3m26M34j85J8J4J01
$$ 64 -74 222 -252 -38 -49 203 -143 -71 163 -153 -86 41 -214 176 -46 37 -389 45 -140 -122 -108 -7
7270gK38q6k18r0K12n9r1K9J21J87j06J2k16j2K74m06L24p2K46p00M17ll36L40
$$ -7 231 145 -73 -163 49 -10 -101 -72 49 236 130 142 -74 -86 188 -218 106 34 280 -420 -3 -6 -342 -2
7294bk52l3J35K32p1m0J80Ok12J65K6l2k15n7l3L06m8k98Np8M59j69Q1O6k25J88
$$ -2 -254 -287 -152 80 9 -31 149 155 -57 108 134 102 -113 -170 -203 103 55 -243 -238 -316 143 -26 55 121 -104 84
7320H4j48K51l78J60J26l05J53q8o5PK17j25K89j8j58K08j72O9k54J42j82P3K15
$$ 84 -64 187 -191 -31 95 -210 -57 -145 -210 -203 14 -111 178 160 2 210 38 107 -147 -5 -187 -114 101
7343A01l63J55J85j74p6Q9j31n6L67j23J98k73LP0K05k87J92m3Pm5k87MK96m8
$$ 101 -262 -107 78 -96 -172 -83 -214 -270 97 -26 172 -101 -98 -28 177 -110 82 39 46 1 -286 -282 14 -34
7367c4p8J57j23K25k83J55L4j02J15K9k45N1J26l1O5n08L46jj5K21m7j31k5l5
$$ -34 -112 45 -78 147 -136 19 53 -49 66 95 -150 -99 27 -4 61 -447 -101 -102 -117 104 57 -74 -99 -134
7391a34P4J53j09j43J45k22Q5L6K69k28p7l7L62l11J12J5k87M07j32r0J88q5R4
$$ -134 -60 93 -16 -159 -14 -236 -151 -115 154 -74 -151 -188 174 -137 -25 -10 -297 110 -22 -112 76 -9 85
7414H5l95K50K33k32J88k17K20k22K88k00j09K97k15o3r2JL41k82J76k0l1j11
$$ 85 -310 -60 173 -59 129 -88 132 -90 198 -2 -111 186 -29 -92 -184 -183 158 -124 52 32 1 -110
7436a10Q5j28J3L10l35M2j2L17j87K24j11j26M7K52k46M4P0K9k24K2j1K1j24P
$$ -110 -25 -153 -140 170 -165 -123 -135 182 -5 219 108 -18 29 281 35 79 149 178 -46 -24 -35 -14 -138 -131
7460a31p1K77k4k82K83q8p3M5J52JLm7r8j16k0j03L08n2O2jm1j17k0P3M8K25l35
$$ -131 -202 75 51 -231 52 -36 -109 -64 88 89 92 45 -53 -169 -189 -292 16 -36 26 25 -16 -133 -153 -80 -32 193 -142
7487a42J83j64M7J97j59K86m29J66k33L49ok63K51N8P8m25K2L5M82l43j40K31
$$ -142 41 -123 -76 121 -38 248 -181 -15 -248 101 95 -168 83 141 219 -206 -184 -149 333 -10 -150 81
7509H1K67n68K73M9P9k45q1K33K9l1n0J83k34O%j58J06J05P0l33K06J71j71r0
$$ 81 348 -220 53 102 181 -64 -145 88 117 86 36 219 -15 -9 -9 -167 -61 44 114 -219 -13 158 -13 -103
7533a03k12J92j03J40L85o86N72j29o3P8j02j1P6j14p7j6J80j21l04M71j61Q9
$$ -103 -315 -123 -226 -86 299 -387 185 56 -7 71 -31 -42 34 -80 -157 -173 7 -114 -418 53 -108 -19
7555a9J94r5K2J05k02m0K9q2J37l7L5k38K03MJ9m1K9p3j35K45l37K37K00j56O1
$$ -19 175 80 102 207 5 -35 -6 -88 49 12 47 -191 12 16 35 -6 23 -50 -185 60 -277 -40 160 4 65
7580F5j22j06N5J24o0j02K86j97K71m40K42k31K75j2NJ66p4l89K78r1n3j44L81
$$ 65 -57 -163 -108 16 -44 -146 140 -57 214 -226 16 -215 60 48 53 219 145 -244 34 -57 -110 -254 127
7603A27j16j61L07l45O1M4J02Q8j35p1J49l03J67K37l1r3L02l17j64n2K45l48
$$ 127 11 -150 157 -188 -127 -83 19 107 -28 -99 50 -253 -86 151 120 27 329 12 -152 -204 41 -307
7625c07J49P8J03J73k10P6k40J62P9q9n0L06l59K39K1j29k54O49l28j75K27j74
$$ -307 -158 -80 23 196 -14 62 -178 -16 63 -26 -76 230 -129 110 131 2 -252 397 69 -106 121 -53
7647e3j13O5l2N7K50l29J6q1L84l85L41k28m9Q0K39l36J90nN9j73K42j77J42k92
$$ -53 -166 -101 -133 -76 174 -155 -139 -220 164 -221 120 -108 -157 -77 162 -174 16 11 70 -103 139 -38 104 -188
7671a88O0mK21l7ll07n1L18o4J23P6j71l2Q6p9QJ98j93m7N9j78M41k32J94k04
$$ -188 -128 -132 89 52 49 -258 -309 9 -55 68 144 -27 -59 27 -52 -44 154 -39 -86 -27 -205 236 4 198 -6
7696fl30J43J05%j04M10l71K87J45k93k60L44Q6j75J94k4j69p4l3P0K2r1M5P3
$$ -6 -336 -193 -88 -88 -192 218 -153 134 279 -14 -274 70 156 -19 175 151 -18 -92 -125 -55 -33 -124 -79 -6
7720fN1QJ47m22K54K03k55J22j14K7k9p5O1J63k9J26k44j6J17P1k63j02M88l96
$$ -6 45 53 200 -222 32 235 -20 102 -12 15 -14 -89 -28 135 106 232 -12 -28 89 160 -103 -205 283 -113
7744a13L03k39K86k99K21K04l67N4r0K35j69k03j27L09J38l26K23p2L8k10M72
$$ -113 190 -49 237 -62 159 363 -4 50 -40 195 26 -177 -304 5 143 -183 40 -32 6 -204 268
7765B68p6m8L4l34N7M1K9m4OK1J17m6m9J57J84k92j33K1r4J83m9l6J16j4j56J09
$$ 268 192 144 178 -156 -99 -58 -29 -73 -67 -46 71 25 -24 133 317 25 -108 -87 -181 2 -47 -83 33 19 -137 -28
7791b8J2J67n84K44J35Q3j47kL6N9l5K03P1j09j74K49q1n5nJ16Nl19K5K47l00
$$ -28 -16 151 -433 -189 -54 29 -118 -120 -84 -25 -60 143 214 105 -69 180 99 44 39 155 160 -159 -134 113 -187
7816a87lK66k44J76K08l44L90k69l8J10M9M5j62J01r5Q8j56QL49j60L6J5k75o2
$$ -187 -190 76 -168 8 216 -128 262 -7 -45 65 114 159 -3 98 3 91 -65 -57 292 132 168 183 -92 -154
7840a54K31j6J7n1k2j31lK63k15K70k06K4k5j52M8k5p2L01j02j5J68j68J13l50
$$ -154 77 61 78 27 5 -126 -129 134 -81 189 -17 7 -18 -170 -122 -147 -219 82 -20 -35 133 -35 78 -272
7864b72K05m4J39j95L9l0J49L2O9m87K32N8J27k78J45J0q7K66q8l14K65n4j7L03
$$ -272 -67 -111 28 -167 -128 -158 -9 23 92 -395 -163 -105 22 -256 -111 -101 -188 78 -10 -324 -59 -113 -130 173
7888A73l12K90j64K8J11j3q7k49K88k06M5o3K80l24L47n04L47Q8l61L96r4p0k6
$$ 173 -139 151 -13 15 126 113 26 -223 65 -141 -96 -159 121 -203 144 -360 -13 75 -286 110 16 -54 -80
7911h0O0J47k86J78l9o4K3M3k7J15j10K87l19K00j44k26J66p2k6O1J82o7j34k2
$$ -80 -20 127 -159 19 -20 -84 -61 -18 -45 70 -40 247 -72 128 -16 -242 -76 -148 -174 -113 69 2 -132 -154
7935a54K48J05k60J48k7o3J37r2Npp7r4J22J87k5j05j57K63k84R1n6pNJ09L46
$$ -154 94 199 -61 87 60 -3 134 42 47 40 -37 -131 -9 178 153 48 -109 154 -130 -39 -95 -102 -97 12 358
7960C58m18r1J92j79R9K62k75N9mm2Q6l00K53l5k03J05J94M37m03l39K47J02k0
$$ 358 -60 -151 41 -138 -39 223 -52 7 3 -39 47 -253 0 -35 -238 -133 61 498 95 -244 3 105 85
7983H5l49R0K09N7k37L49Jm6m50K30J40K4n8j40J88j77J91m11M21k65M83k51k65
$$ 85 -264 -174 35 92 -145 204 205 159 -291 -61 79 103 45 -95 93 -84 107 -304 117 -148 335 84 -181
8006a81K28n7j38o2M7J24J97j64J4J74m49K53l8L2j12j14Q3K82j80j54N4j06L66
$$ -181 47 -10 -148 -210 -163 -39 158 -6 8 182 -267 -14 -52 -20 -132 -246 -163 119 -61 -215 -161 -267 99
8029I9l20L34O9j95k08J25J35M8r0R4j41o8L17p0k16K04L3PJ66m00J72k06J24
$$ 99 -221 113 182 -13 -221 -96 39 87 -3 91 -50 -118 199 129 -87 117 150 157 323 -77 95 -111 13
8052A3O4j19M02l04p9J44j56k6J52j74JM30l04k4M6p3J56p2l45K48l2j87J99J5
$$ 13 77 -42 360 56 -23 121 -35 -61 91 -83 -82 348 44 20 66 -7 149 77 -268 -20 -52 -239 -40 -25
8076b5K25j57l25L05j38m0J0Q9K00l47J02m4p8J73k25J84K35k93J81J7K9k70L67
$$ -25 200 43 -282 23 -115 -155 -145 -56 144 -203 -101 -145 -223 -50 -275 -91 144 -149 32 49 78 -192 175
8099A75l46J04K05K9J11k61K31j06j66k77J69l1L96k49O8k01lL88j13q6R4O1J04
$$ 175 -171 -67 138 167 278 17 248 142 -24 -301 -132 -163 233 -16 52 -149 -152 236 123 37 131 192 296
8122B96l45J54j52N4j02J27J15k00K26o1K4j27o1k26M85j38k72K09oK28j30l1
$$ 296 -49 105 -47 7 -95 32 147 -53 173 112 136 9 -52 -278 207 69 -203 6 0 228 98 67
8144F7o4P6j5j16j18o3J46K94j93j7L32j4m72r2K02o5N3J6j53J55j0k04n7L4L
$$ 67 3 79 64 -52 -170 -233 -87 207 14 -3 329 315 -157 -249 -47 -112 -59 -43 -196 -41 -51 -255 -312 -278 -275
8169b75L05K5l24N45j19o8k93l1K15J1N2N0k55K18L30l22J00k55L17k80Q5J07
$$ -275 30 55 -269 276 157 89 -204 -235 -20 -9 43 93 -162 56 386 64 164 -91 226 -54 31 138
8191A38
$$ Imaginary data points
##PAGE= N=2
##DATA TABLE= (X++(I..I)), XYDATA
0@%%%%%%%%%%%qJ6j6J6k4L2l3M1n5O3p2Q8j04J21j45J69j94K26k59K98l43L91
$$ 0 0 0 0 0 0 0 0 0 0 0 0 -8 8 -8 8 -16 16 -17 24 -31 32 -40 48 -56 65 -80 89 -105 121 -138 160 -183 208
33B08m41M97n61O33p12P94q85R89j102J222j356J501j656J831k020K224k452K702
$$ 208 -233 264 -297 336 -376 418 -467 522 -580 642 -714 787 -869 962 -1058 1166 -1286 1416
51A416k975L278l617L995m418M897n445O077o819P701q767J0093j1794J4068j7278
$$ 1416 -1559 1719 -1898 2097 -2321 2576 -2869 3208 -3611 4090 -4677 5416 -6378 7690 -9588
66i588K2187l0730M9854j74613J8708J47953k04433O4347J34115l0761k6075J27822
$$ -9588 12599 -18131 31723 -142890 -124182 23771 -180662 -116315 17800 -12961 -39036 88786
78H8786j7557o6612N4205M5528q4881M864N6187n1391o3009M6576P273m5930j5948
$$ 88786 71229 4617 58822 104350 19469 24333 80520 29129 -33880 12696 19969 -25961 -41909
91d1909R483j2649m132J7325J6296k0463L365N0680J4378l1273K2057L6227k4758
$$ -41909 -32426 -45075 -49207 -31882 -15586 -36049 -32684 17996 32374 1101 23158 59385 34627
104C4627k5012K5527o437m1983O338J0750m6231L506N3998l1738m3723O1968L7187
$$ 34627 9615 35142 28705 -13278 -6940 3810 -42421 -38915 15083 -16655 -60378 1590 38777
117C8777m9370k428M4985j2154k6142J7725q31k5718J3859J3808l0241N75L4734
$$ 38777 -10593 -13021 31964 19810 -6332 11393 10562 -15156 -1297 12511 -17730 -17155 17579
130A7579q855k5119J5093J6194j1837r503N871K715n224M939N621j1235j221J9006
$$ 17579 8724 -16395 -1302 14892 3055 -6448 -577 2138 -3086 1853 7474 -3761 -4982 14024
144A4024j879k1633L403J7137j1039j8933J1785R704j5051L710J5244j1661Q02
$$ 14024 12145 -9488 -6085 11052 13 -18920 -7135 2569 -12482 -8772 6472 -5189 -4387
157d387K5085q269k1863J7903J5060k3371j3713J5710l9j6621L543O397p413P133
$$ -4387 20698 12429 -9434 8469 23529 158 -13555 2155 2116 -14505 -10962 -4565 -11978 -4845
171d845J1652j0369j12J9152o87j4907J665J0313m803j1796Q82L339m984O33L883
$$ -4845 6807 -3562 -3674 15478 14791 -116 1549 11862 7059 -4737 -3855 -516 -5500 -4867 -984
186i84o897NJ1243j274j0775M223J2560l621j0563Q150R166p866n49O469o867
$$ -984 -7881 -7876 3367 2093 -8682 -4459 8101 4480 -6083 2067 11233 3367 2818 9287 2420
201B420k673Q559o784j3186N616P960j0903p855J1688O075p327K972Q342j044
$$ 2420 -253 8306 1522 -11664 -6048 1912 -8991 -16846 -5158 917 -6410 -3438 4904 3860
215C860K813M933n505k683O555j420j0728k694N725k343q227J667N045k310Q95
$$ 3860 6673 11606 6101 3418 9973 8553 -2175 -4869 856 -1487 -9714 -8047 -3002 -5312 -4417
230d417L742j794P65O775l0o373J826P964k680q032L601M835n359k649K665k961
$$ -4417 -675 -2469 -1704 5071 5041 -1332 494 8458 5778 -2254 1347 6182 823 -1826 839 -2122
246b122k011L327k100m975L449O292l753m205P675N139m704r5L836j563p72L02
$$ -2122 -4133 -806 -2906 -7881 -4432 1860 -1893 -6098 1577 6716 2012 1917 5753 4190 3418 3720
262C720l842k701K683p7n595j375O345O72m513K638M638j113L4K068j656r96K246
$$ 3720 -122 -2823 -140 -217 -5812 -7187 -842 -170 -4683 -2045 2593 1480 1514 3582 1926 930 3176
279C176k24m816q82N212j369n858K411M257k734j494J727L08p34J641j83j994
$$ 3176 2952 -1864 -2746 2466 1097 -4761 -2350 1907 -827 -2321 -594 -286 -1020 621 438 -1556
295a556J405L636k151l487L753K347l736j543J828k13j156o09n91n98K132J438
$$ -1556 -151 3485 1334 -2153 1600 3947 211 -1332 496 283 -873 -1482 -2073 -2671 -539 899
311H99k264q74M776J109l591Q19K024j899j390L02p16j311M49J069k254j52M198
$$ 899 -1365 -2239 2537 3646 55 874 2898 999 -391 -89 -805 -2116 -1667 -598 -2852 -3004 1194
328A194L74l453J887L258j353j790J011L5q17K05m75j524L39K146j880k205K433
$$ 1194 1568 -1885 2 3260 1907 117 1128 1163 346 551 76 -1448 -1109 1037 -843 -3048 -615
345f15J870k501o67J748M81m60L97N18m64J030J254j562j249J958M6k944m23J279
$$ -615 1255 -1246 -1913 -165 316 -144 253 771 307 1337 2591 1029 -220 1738 1784 -1160 -1583 -304
363c04n65j466L71Q87k58R20J269p94K45K121L65k576N56J303j009j713j48P84
$$ -304 -869 -2335 -1964 -1077 -1335 -415 854 60 305 2426 2791 215 771 2074 1065 -648 -796 -12
381a2o92n47N20q43N31J378m33j362J645R80j019n75R44R92j087K65k3m31K71
$$ -12 -704 -1251 -731 -1574 -1043 335 -98 -1460 185 1165 146 -429 515 1507 420 685 662 231 502
400E02M54j093j286J400O4j674l02J446M53q40N05Q92N9O4P67o91m44J126l97
$$ 502 956 -137 -1423 -23 41 -1633 -1935 -489 -36 -876 -371 521 580 644 1411 720 276 1402 1005
419A005j725j60R47j67r94rQ89L7q2M98m95L73R23o42n45M46P98o90j001P05L26
$$ 1005 -720 -880 67 -100 -1094 -1103 -214 -177 -259 239 -256 117 1040 398 -147 299 1097 407 -594 111 437
440D37p12j91Q05m43n2M16q26o4N95M56o56l61J064K61q81J0O64k79j45J79n64
$$ 437 -275 -466 339 -104 -156 260 -566 -630 -35 421 -235 -596 468 729 -152 -142 522 243 98 277 -287
461b87k69M43j0p16K20Q35K25m27J38N74K17q51L48j63k05J38j13j208R64N06
$$ -287 -556 -113 -123 -839 -619 216 441 14 152 726 943 92 440 277 72 210 97 -1111 -147 359
481C59p47k82K98R33m29m49M95J74p0M27m33o30O61K1m36n69K57O62o17k72M49
$$ 359 -388 -670 -372 561 132 -317 178 352 282 709 276 -354 307 328 -108 -677 -420 242 -375 -647 -198
502a98r1K32j84N8J5K37M64n57K19N10j10o86J21L92p0n13j09k97o0L15l1l53
$$ -198 -289 -57 -241 -183 -168 69 533 -24 195 705 595 -91 30 422 352 -161 -270 -567 -627 -312 -343 -696
524f96L24O60J27n42O37L25n38j19RL70n35O8m27m8K1L10j75l75K15N21q9m32
$$ -696 -372 288 415 -127 510 835 297 178 187 557 22 90 -337 -385 -364 -54 -229 -604 -389 132 43 -389
546c89N32M13n63J5kJ52O42l46l88k16N57J01p06r5O8K74l96J04J57k19L76k3
$$ -389 143 556 -7 8 6 158 800 454 66 -150 407 508 -198 -293 -225 49 -347 -243 -86 -305 71 48
568D8n3J68K93qm83J02K84l12l89J88J60k51j92P6LM85p0o2l68M50K75l90k75
$$ 48 -5 163 456 448 -35 67 351 39 -350 -162 -2 -253 -445 -369 -366 119 49 -13 -381 69 344 -46 -321
591c21L78J08k81J0Q7J18j33L34l58l87N86K30m84m0K06N7j08P6j86K59J89j56
$$ -321 57 165 -116 -106 -19 99 -34 300 -58 -445 141 371 -113 -153 53 110 2 78 -108 151 340 184
613A84r7q4K09P1l45k67O66n85kR9J75J59Q2rK33q8j23P8m78q5K49m16p2K40L57
$$ 184 87 3 212 283 -62 -329 337 -248 -250 -151 24 183 265 256 489 401 278 356 -122 -207 42 -374 -446 -206 151
638A51j71p0K18k35k1J60q5j82J68M61o03J25J87K13l69k58K43k20L12m2M2k62
$$ 151 -20 -90 128 -107 -128 32 -53 -235 -67 394 -209 -84 103 316 -53 -311 -68 -288 24 -18 24 -238
660b38K46K45n15K82L79n36L08k45K92l2j49r6RK27p8l79M1L2R8Q6l63K26K21
$$ -238 8 253 -262 20 399 -137 171 -74 218 186 37 -59 -50 177 99 -280 -239 -207 -109 -23 -386 -160 61
683F1j65J87J68R7j59L26k82l74J82L4j75k28L14L92n39j2L46l72K24M3k98j08
$$ 61 -104 83 251 348 189 515 233 -141 41 75 -100 -328 -14 378 -161 -173 173 -199 25 68 -230 -338
705c38M91j25j13R8R8j32k40J55M24q7l36j80m7L49n7l20K60K28j9l3j29J10K60
$$ -338 153 28 -85 13 111 -21 -261 -106 318 231 -105 -285 -332 17 -40 -360 -100 128 109 76 -53 57 317
728C17l8l63J87k30K53K08l63k51R9l4O0kJ88R3N6k56K20Q1l37K04j66O1J08j89
$$ 317 279 -84 103 -127 126 334 -29 -280 -181 -215 -155 -157 31 124 180 -76 144 225 -112 92 -74 -13 95 -94
752i4J52L5k11L34l21K85p4j71Rl2J39R0N7q2j88p0L47J97n04J32K44k98n0M6
$$ -94 58 93 -118 216 -105 180 106 -65 -56 -88 51 141 198 116 -72 -142 205 402 -102 30 274 -24 -74 -28
776b8k07J87j23o8J91j4N11m70p0K93K78n23J8j1k7J51m35N00j72m5nj0OL33k45
$$ -28 -235 -48 -171 -239 -48 -62 449 -21 -91 202 480 -43 -25 -36 -63 88 -347 153 -19 -64 -69 -79 -73 260 15
801A5k7j19J66l1k84M32l9K63k86P8q8k51L04p4j75K18j03o9p4KNJ0J90Q0p6r5
$$ 15 -12 -131 35 4 -280 152 113 376 90 168 80 -171 133 59 -116 102 -1 -70 -144 -142 -137 -127 63 143 67 -28
827b8Q7J34m12K34K39m31M0L9qp9qP9K05n9k26K62Rj78K26k14l6O2O6J87j44r0
$$ -28 59 193 -219 15 254 -177 -137 -98 -106 -185 -193 -114 91 32 -194 68 77 -101 125 -89 -125 -63 3 190 46 -44
853d4j44J73K91m87J07J23J38p9Nj0j75J67Q4j83J23j0N4M5m68L79j05j94K71
$$ -44 -188 -15 276 -211 -104 19 157 78 83 73 -102 65 149 -34 89 79 133 178 -290 89 -16 -210 61
876F1j29j08Q0k2K55j62J13k26L83j53k2j60J81l42O42k05pk58l1J23L7j10j52
$$ 61 -68 -176 -96 -118 137 -25 88 -138 245 92 70 -90 91 -251 391 186 179 -79 -110 13 50 -60 -212
899b12J24O8J15K9j47N5j26J8M18l68j7J05j56J60o7j22k36K99J72K3j65O2Q2
$$ -212 -88 -20 95 124 -23 32 -94 -76 342 -26 -43 62 -94 66 -1 -123 -359 -60 112 135 -30 32 114
922A14j19L12k29j47K94m16K1K15l34K61o2J8J54k32K51k03N9K16P7j09O3J22
$$ 114 -5 307 78 -69 225 -191 -170 45 -289 -28 -90 -72 82 -150 101 -102 -43 173 250 141 204 326
944C26k11k4q8K23j27k48K04j79p3M90l51P1K09k4k00j99M66o3k01j76K13j84
$$ 326 115 91 3 226 99 -149 55 -124 -197 293 -58 13 222 198 -2 -201 265 202 1 -175 38 -146
966a46M32k19l9j06J87p8k43P4J32k53K25L87n4k10j46J42L7k76j13j1N03n9J
$$ -146 286 67 28 -78 109 31 -212 -138 -6 -259 -34 353 299 89 -57 85 122 -154 -267 -278 225 166 167
989A67k55j6J03J21k71M0k67L00Q3J2o7Mn4m5J85k81L86j73J83j73k90L29L7j86
$$ 167 -88 -104 -1 120 -151 -111 -378 -78 5 17 -50 -46 -100 -145 40 -241 145 -28 155 -18 -308 21 58 -128
1013a28q0L18m4k6r2K97l75j23K96QM2j4o0j2l1J49j87j16L02q2J07l57J71J59
$$ -128 -208 110 66 40 -52 245 -130 -253 43 51 93 79 19 7 -24 125 -62 -178 124 42 149 -208 -37 122
1037A22j43Mp3K21J26m55J41J32k42K87J65k27k33M14l50J55j49P0j22J44K32
$$ 122 -21 -17 -90 131 257 -198 -57 75 -167 120 285 58 -175 239 -111 44 -105 -35 -157 -13 219
1058B19l62L7j2J61o9L67j66rk67K6J32j99J08m5MN1r1J44Q2n8k39L72j96Q7J27
$$ 219 -143 -106 -118 43 -26 341 175 166 -101 -75 57 -142 -34 -79 -75 -24 -115 29 111 53 -186 186 -10 77 204
1083B04k0k55k01J49o6J63J18k20M7J11J4o8R5k01P1j18K08P2j7N0j11K51k5m
$$ 204 184 -71 -272 -123 -189 -26 92 -128 -81 30 44 -24 71 -130 -59 -177 31 103 86 136 25 276 251 247
1107B47j79l40J37K41J25k95L1M2P5K9j2j86J05K3J80k43K68k97k9J61k22K08
$$ 247 68 -272 -135 106 231 -64 -33 9 84 113 101 -85 20 43 223 -20 248 -49 -78 83 -139 69
1129F9j7K36j73j54J20qk17K27N3k03j91L18j43J79Mm05L88p6J46k91K31J21j88
$$ 69 52 288 115 -39 81 73 -144 83 136 -67 -258 60 -83 96 100 -305 83 7 153 -138 93 214 26
1152B6p6M70m00P5j17Q0k96K35K09j19j12j28J93J93j86j20n4J46p0m7l7R7J05
$$ 26 -50 420 20 95 -22 58 -238 -3 206 87 -25 -153 40 233 47 -73 -127 19 -51 -98 -135 -38 67
1175F7n0P2j98K48k16J06%k00J55n8J52j79N5O2J16O5k40k30O17m55P7j70M1n4
$$ 67 17 89 -109 139 -77 29 29 -171 -16 -74 78 -101 -46 16 132 197 -43 -273 344 -111 -34 -204 -163 -217
1199b17K52Q2m2j79k3J95m7jq7J84k71L41k96O6l28M33j82J13jJ96M2j43j30J08
$$ -217 35 117 75 -104 -127 68 21 20 -67 117 -154 187 -109 -43 -371 62 -120 -7 -8 188 230 87 -43 65
1223F5J07k66J55j53J44j60k78L32k4j66L14L6p8J3j8J0j76j79M04l11RM3oM7
$$ 65 172 -94 61 -92 52 -108 -386 -54 -78 -244 70 106 28 41 23 33 -143 -322 82 -229 -220 -177 -183 -136
1247a36M1K7K85k61k1n7J4M5M0j32J05J18R7j37k8N5k0k57M25l62L85O2n32J14
$$ -136 -95 -68 217 -44 -65 -122 -108 -63 -23 -155 -50 68 165 28 0 55 35 -222 203 -159 226 288 -244 -130
1271a30k09L98J36j22K5J7k68J29K1j83L85o2m4n6K7P1j28K68j61j13l5j61N03
$$ -130 -339 59 195 73 98 115 -153 -24 -3 -186 199 137 93 37 64 135 7 275 114 1 -34 -195 308
1294C08l5o4l0k07l6k99K97L3N8J06j58m7j67M20j58j11L0J45j60J01j86J73j27
$$ 308 273 209 179 -28 -64 -363 -66 -33 25 131 -27 -74 -241 179 21 -90 -60 85 -75 26 -160 13 -114
1317a14M16k71j21l81L32J25n0O8J46j70Q6K29m49L6K30Jj51K31o2n9k29L82l58
$$ -114 302 31 -90 -471 -139 -14 -64 4 150 -20 66 295 -154 -118 112 113 -38 193 131 72 -157 225 -133
1340a33M0Q2p8q0L02m25J99J27p5nn5J65l22K25J58j71oJ42p4J16k95P4J59k04
$$ -133 -93 -11 -89 -169 133 -292 -93 34 -41 -46 -101 64 -258 -33 125 -46 -52 90 16 132 -163 -89 70 -134
1364a34L22j43O0J6J94r0p9o1k26K59l88K58J53k58J05J02L40k98p5jk40K26k4
$$ -134 188 45 105 121 315 225 146 85 -141 118 -270 -12 141 -117 -12 90 430 132 57 56 -184 42 18
1387A8K5n5K65k36qR8j88K16Pj2j38L7J29j40L27k80j20K12j04J0j41j2K9n1L03
$$ 18 43 -12 253 17 9 107 -81 135 142 130 -8 29 158 18 345 65 -55 157 53 63 -78 -90 -61 -112 191
1412A91k43j7J12l4J32o8Jl09L78j72J67k06R6J0j25P3Q4L57k75j40N5k17J2j54
$$ 191 -52 -69 43 9 141 73 74 -235 143 -29 138 -68 28 38 -87 -14 70 427 152 12 67 -150 -138 -292
1436b92J33J01K1J16nMj92k2%Q5J55j06Jj35J56K9J17J49m2k33j72J28M6j41J33
$$ -292 -159 -58 -37 79 74 78 -114 -136 -136 -51 104 -2 -1 -136 20 49 166 315 273 40 -132 -4 42 -99 34
1461C4K09l25j93J06K68k28M9L6J5j75J60K47j68L1l36N94l39Q5j06J01j27J37
$$ 34 243 -82 -275 -169 99 -129 -80 -44 -29 -204 -44 203 35 66 -270 324 -15 70 -36 65 -62 75
1483G5j71o4J11J35k53K22j55K02P9J00m19k5M9j77J89J07K02k48m8Pom3K12p9
$$ 75 -96 -160 -49 86 -167 55 -100 102 181 281 -138 -163 -114 -291 -102 5 207 -41 -89 -82 -88 -131 81 2
1507BlM8O2j84n6Q9O1j77K94k35j2J31N2J88l01J02P0j17N7j20J9R1N9j56K34
$$ 2 -1 47 109 -75 -131 -42 19 -158 136 -99 -111 20 72 260 -41 61 131 14 71 -49 -30 61 120 -36 198
1532A98l00M28k90n9L03J25n54J18j36R9k0q9J67J05M4J7m6m45N49j75j30j40
$$ 198 -102 326 36 -23 280 405 -149 -31 -167 -68 -88 -177 -10 95 139 156 110 -335 214 39 -91 -231
1554b31p1K89J72m08L30q1R4j72o6M1m5K15j67K66k66O5J26n1J0j78M5J17j79
$$ -231 -302 -13 159 -249 81 0 94 -78 -144 -103 -148 67 -100 166 -100 -35 91 40 50 -128 -83 34 -145
1577a45j41K07j31J47l4J01j6J34l66K86M8k9r6J3J57l01K2j5K29O1j42Q6l39
$$ -145 -286 -79 -210 -63 -97 4 -12 122 -244 42 90 61 -35 -22 135 -166 -144 -159 70 131 -11 75 -264
1600b64M55j75r5P6MP7j21R7k79R1K47j0j32j20K16N0j33J12M2n8k99N6M28k38
$$ -264 191 16 -79 -3 1 78 -43 54 -225 -134 113 103 -29 -149 67 117 -16 96 138 80 -219 -163 265 27
1624B7J8N5k19J44lN0j63K24l57M25o8J27m44K67K20m10K12j57J0K10j51j59J49
$$ 27 45 100 -119 25 22 72 -91 133 -224 201 133 260 -184 83 303 -107 105 -52 -42 168 17 -142 7
1647Gj11J22N9q0k29R5n2L42m30K25r9J59J59m82K94j47K72j34j62J2J38j76J12
$$ 7 -104 18 77 -3 -232 -137 -189 153 -277 -52 -151 8 167 -315 -21 -168 104 -30 -192 -180 -42 -218 -106
1670a06P6L32k98Q5j2q8J30p5j55N3J66j95K3k3k1J19J41q0p6L0L9r6Qj74K18
$$ -106 -30 302 4 89 77 -11 119 44 -111 -58 108 -87 -64 -87 -108 11 152 72 -4 26 65 -31 -23 -197 21
1695B1o0K14m4k46J2J70R6k07J37l9l17M25P1m26J76l0L2K16j17l0q8N6pj5j03
$$ 21 -39 175 131 -115 -103 67 163 -44 93 54 -263 162 233 -193 -17 -47 -15 201 84 54 -34 22 15 0 -103
1720a03J31K95l34j58J56l02K79k13l2L65K58j80j67K05j51n5j28L69l12M9K85
$$ -103 28 323 -11 -169 -13 -315 -36 -249 -281 84 342 162 -5 200 49 -6 -134 235 -77 -28 257
1741B57j44M9k34P4PK15n5j35J30j33k66m3J25J09k08L39j41o4N2N7l15L82j98
$$ 257 113 162 -72 2 9 224 169 34 164 31 -235 -278 -153 -44 -252 87 -54 -118 -66 -9 -324 58 -140
1764a40K37q4O4m8J8m7l44P1N4K90k86J95L5k0J35j69R5k7k62J51j3L19k92J52
$$ -140 97 13 77 29 47 0 -344 -273 -219 71 -215 -20 15 -5 130 -39 56 29 -233 -82 -95 224 -68 84
1788H4K8l54L04j35n1L5J5J00m06M87p9l2r3J23R4j74L83m02j61j4J99m3R7nM8
$$ 84 112 -242 62 -73 -124 -89 -74 26 -380 107 28 -4 -97 26 120 -54 329 -73 -234 -248 -49 -92 5 0 48
1813D8m9j8j26q3J36l8r9K74n9P4p1m7L15j57q5M4Q2j66p7l8m1J16KN3j12J34
$$ 48 -1 -19 -145 -228 -92 -130 -229 45 -14 60 -11 -58 257 100 15 59 141 -25 -102 -140 -181 -65 -63 -10 -122 12
1839A2N2n2l3p6L4j27K42m1J33l5j42J4pn9K28m2J18k35P3J27J30m04j99K69j26
$$ 12 64 12 -21 -97 -63 -190 52 11 144 109 -33 -19 -26 -85 143 101 219 -16 57 184 314 -90 -289 -20 -146
1864a46J75J7j26J81k9Q4k49m0P6J32l8o4P6k61J76K10j63j47Q6o3R1K05j29q
$$ -146 29 46 -80 101 72 156 -93 -133 -57 75 37 -27 49 -212 -36 174 11 -136 -50 -113 -22 183 54 46
1888D6j76l4k2J91p6J39R2j88K03k95J80j04O7K10j31n4k66K77m26O47k92K01
$$ 46 -130 -164 -186 5 -71 68 160 -28 175 -120 60 -44 23 233 102 48 -218 59 -367 280 -12 189
1910A89j69K31k80j63L77j58j55l16L77nJ36N3j01j16L78l77NL00j09k32L7J50
$$ 189 20 251 -29 -192 185 27 -128 -444 -67 -72 64 117 16 -100 278 -99 -94 206 97 -135 -98 52
1932E2j78p2M36k03J92k19M6j5Q5j87R4n7j24K49Mk30P4q9O8K43k07N3J7k09L08
$$ 52 -126 -198 238 35 227 8 54 39 124 -63 31 -26 -150 99 103 -127 -53 -142 -74 169 -38 15 32 -177 131
1957A31l92M36j99K72k38l9K12j50J61m16J19J24L5l8m7j1N3J38k93J06P8j02
$$ 131 -261 175 -24 248 10 -29 183 33 194 -222 -103 21 56 18 -29 -40 13 151 -142 -36 42 -60
1979f0l9J5J45j40O3j00O6J7J46J13k08J90p2J54m35J21k26K51k40K54j77n5J24
$$ -60 -99 -84 61 -79 -16 -116 -50 -33 113 226 18 208 136 290 -145 -24 -250 1 -239 15 -162 -217 -93
2002i3J16k76R9P5K12l46N67k91m5J70l8M0k31J98j07Pk22K05p3P7l1k30K87j34
$$ -93 23 -253 -154 -79 133 -213 354 63 18 188 150 190 -41 157 50 57 -165 40 -33 44 13 -217 70 -64
2026f4O2J31j44j29K02k0k27j42J25K17K2p6N7l5j80L77k59L80k74O1O8l23J63
$$ -64 -2 129 -15 -144 58 38 -189 -331 -206 11 33 -43 14 -21 -201 176 -83 297 23 84 152 -171 -8
2049hj12L45k62J41k53m6J26J22J42j67r4J31J5k51J65o4R5o6R3k17J28j30J18
$$ -8 -120 225 -37 104 -149 -195 -69 53 195 28 -66 65 80 -171 -6 -70 25 -41 52 -165 -37 -167 -49
2072d9n7m2K22n1k38M6j61M13O2R0J16m88J62j49K81k54J00K35j1l58J98J64m81
$$ -49 -106 -148 74 23 -215 -169 -330 83 145 235 351 -137 25 -124 157 -97 3 238 227 -131 67 231 -250
2095b50J38J08j3P7j22J06J75l51O1J18K9j97K5O7M6n5l8K2J41k53O2J3J27Q6
$$ -250 -112 -4 -17 60 -62 44 219 -132 -71 47 76 -121 -96 -29 17 -38 -76 -54 87 -166 -104 -91 36 122
2119A22p5m4j71K06k89K73k05L53Qj12R4l15J79l8j30K84j54j68M06k23J46K0
$$ 122 47 3 -168 38 -251 22 -183 170 178 66 160 -155 24 -14 -144 140 -14 -182 224 1 147 167
2141A67l32L28l10J69k06o3J64J79k38J72J13j32k5n1j11m2K30oJ08kj67K92l9
$$ 167 -165 163 -147 22 -184 -247 -83 96 -142 30 143 11 -14 -65 -176 -218 12 6 114 112 -55 237 198
2164A98k14j07N02m73J52P7P8k83O6O0m7q3j16J19K55j52j0j82J67J59j53J6n2
$$ 198 -16 -123 379 -94 58 135 213 -70 -4 56 9 -74 -190 -71 184 32 22 -160 7 166 13 29 -23
2187b3K1Q0KJ8j95R1p4Q6J57l42J28Q7p9N3J9j90J92kl31O66k93j43k2P9j09K31
$$ -23 -2 78 80 98 -97 -6 -80 6 163 -179 -51 36 -43 10 29 -161 31 29 -302 364 71 -72 -94 -15 -124 107
2213A07j54J13j57o7J08J03j30kK5P4j05K08j04J04k49R2q5j21K87j69J44J18
$$ 107 -47 66 -91 -158 -50 53 -77 -79 -54 20 -85 123 19 123 -126 -34 -119 -240 47 -122 22 140
2235A40O3J3m04P7o3L67k75o4Q9k9L7j47K26lp1J18j55N1K4J4n3P8j01J86k45
$$ 140 203 216 -188 -111 -174 193 -82 -146 -57 -86 -49 -196 30 27 -44 74 -81 -30 -6 8 -45 33 -68 118 -127
2260a27Q1M6M3n0N0j09k26J65k8K79p0J50l42J03q7Q0J15j26O8J5J67j85p9k4
$$ -127 -46 0 43 -7 43 -66 -292 -127 -155 124 54 204 -138 -35 -122 -42 73 -53 15 30 197 12 -67 -91
2284i1l7J04P4J22l66L16O0L89r29M01l41K20K14j01Qk3P3K12l05j15J45J25j45
$$ -91 -128 -24 50 172 -194 122 182 571 -358 43 -298 -78 136 35 43 20 93 305 0 -115 30 155 10
2307A0L47j64l62J93j15O0Q2j77L99j17j59K28j54J72j60k21r6L76K13l54J70
$$ 10 357 193 -169 24 -91 -31 51 -126 273 156 -3 225 71 243 83 -138 -234 142 355 1 171
2328A71J2r2k72O1j95M49k38m0K24k93J92j23K93j71J5j14k47M15M7J44k35p5
$$ 171 183 91 -181 -120 -315 134 -104 -144 80 -213 -21 -144 149 -22 -7 -121 -368 47 94 238 3 -72
2350g2J17q2L21k25j09J57l8O5n5k03O5p0J91J23j95r1j75L63k70J98mj98j21
$$ -72 45 -37 284 59 -50 107 69 134 79 -124 -59 -129 62 185 -10 -101 -276 87 -183 15 11 -187 -308
2373c08K37pO0j69M30j47o8k0j5M3j10K71k07p5j75L89J28k37N5j04q2J77j26
$$ -308 -71 -78 -18 -187 243 96 28 8 -7 36 -74 197 -10 -85 -260 129 257 20 75 -29 -111 66 -60
2396f0K8K11lj95J33j7K53m12Jk1J23K50k71o5n3L69p5j78l0J0J10q9J67l73L11
$$ -60 -32 179 176 -19 114 97 350 -62 -61 -82 41 291 20 -45 -98 271 196 18 -12 -2 108 19 186 -187 124
2421A24m40L07q5J58M0k97M19l69J61p3j5O7n1N6J02o5l8p6j46J47J49J11Nn17
$$ 124 -316 -9 -94 64 104 -193 226 -143 18 -55 -70 -3 -54 2 104 39 1 -75 -221 -74 75 186 191 -326
2445c26K4L90J9j47k5k11J82J80m43L33n9K0K32k08j3Q4k49J82K2J24o5J64k34
$$ -326 -302 88 107 -40 -65 -276 -94 86 -357 -24 -83 -63 169 -39 -52 32 -217 -35 -13 111 46 210 -24
2468b4j58L6R1R6r5q8J07R9K5n3O4J19j47N2j73J13k18l2J72K11j85Qj70K76j54
$$ -24 -182 -146 -55 41 -54 -142 -35 64 89 36 100 219 72 124 -49 64 -154 -186 -14 197 12 20 -150 126 -28
2493b8n0J53n4K95l96L29k10p9L23j96r1j12K40l34K20N1Mj70J41K4j51M2k0K7
$$ -28 -78 75 21 316 -80 249 39 -40 283 87 -4 -116 124 -210 10 61 65 -105 36 60 -91 -49 -69 -42
2517d2J28J6J50k89L13j28j35NN5j59L0N1J46j05%j77kL49P8m0j01P4l50K65j
$$ -42 86 102 252 -37 276 148 13 18 73 -86 -56 -5 141 36 36 -141 -143 206 284 244 143 217 -133 132 131
2542A31O7k16J87j47l5K1j70J11j88J23J87r3o3P0m6J59J2P1j53P1j82nK78k16
$$ 131 198 -18 169 22 -13 8 -162 -51 -239 -116 71 -22 -85 -15 -61 98 110 181 28 99 -83 -88 190 -26
2566b6r8J88n4j55K29j21j45K91j4o9K19l67K5k27K24J3J78q7J58k95J46p2P2
$$ -26 -124 64 10 -145 84 -37 -182 109 95 26 245 -122 -97 -324 -100 -87 91 4 162 -133 13 -59 13
2589A3J88r4k56J24M8j32K27l33K95k22j61K06R2k03L79l75K3J25j24m2K36J01
$$ 13 201 107 -149 -25 23 -109 118 -215 80 -142 -303 -97 -5 -208 171 -204 -181 -56 -180 -222 14 115
2611A15j63jj02K40N4j17J02j92J31o7O9M7k0j52J86J56l77q3J25J19j02m0Q4
$$ 115 -48 -49 -151 89 143 26 128 -64 67 0 69 116 96 -56 130 286 -91 -174 -49 70 -32 -72 12
2634A2J2N0P9j37k68M17L3k33j01Q7l48K66k8L08l50K13J7P8K19m12L6K3j7J80
$$ 12 24 74 153 16 -252 165 198 -35 -136 -49 -397 -131 -159 149 -201 12 29 107 326 -86 -50 -27 -44 136
2658A36j48J87k18k76K42N1M7J4j5j30P0j15K47M8l81L47N4m45K66P1J57m0j73
$$ 136 -12 175 -43 -319 -77 -26 21 35 20 -110 -40 -155 92 140 -241 106 160 -285 -19 52 209 169 -4
2681dpj20J60j82L00k18N8j52J33o5J26p5k6J60N4j88N2o8K19J92m21J14J8j70
$$ -4 -11 -131 29 -153 147 -71 -13 -165 -32 -97 29 -46 -72 88 142 -46 6 -62 157 349 -72 42 60 -110
2705a10K15j02j57J2M8L5n1J28M4m3p6J4J1L30l90K00k01oJ40l06L66m3n4p0J11
$$ -110 105 3 -154 -142 -94 -59 -110 18 62 19 -57 -43 -32 298 -92 108 -93 -99 41 -265 101 58 4 -66 45
2730D5r5P2k46L90k63p8R0P6J06j54K77l84J44O9j9m4k06L32pj15N5j32n7K04
$$ 45 -50 22 -224 166 -97 -175 -85 -9 97 -57 220 -164 -20 49 30 -14 -220 112 105 -10 45 -87 -144 60
2754F0P8k6M3k56rJ30J02j30j19J04J42R4q5k95L42k34J31j46j0Q1l15J36P4k3
$$ 60 138 112 155 -101 -110 20 122 -8 -127 -23 119 213 128 -167 175 -59 72 -74 -84 -3 -318 -182 -108 -131
2778a31JK88j72J69mK22j16j44J1k96J07K14k69K22r5M1K66l65L51j59n24L73
$$ -131 -130 158 -14 155 151 373 257 113 124 -172 -65 149 -120 102 7 48 314 -51 300 141 -383 -10
2800a0O3J28m35K89R6r2j13j75K16k4K79n38L88J38l64L00j91o8j28J16K6k88
$$ -10 53 181 -254 35 131 39 -74 -249 -33 -57 222 -316 72 210 -154 146 -45 -113 -241 -125 -99 -387
2822c87M74j76O3k11M22k03J21J38k38N8j49J59j6k51q6L55k20K62l39L41n0q0
$$ -387 87 -89 -26 -237 185 -18 103 241 3 61 -88 71 55 -196 -282 73 -147 115 -224 117 67 -13
2844a3j33J80q8J46j20K66q4k03%K2j70j3L91k67J20j90L27L1j79p1RN8Pj55K4
$$ -13 -146 34 -54 92 -28 238 154 -49 -49 -27 -197 -210 181 -86 34 -156 171 202 23 -48 -39 19 26 -129 -105
2869a05J96j99n5j5RO6j36J93L58m90K52l62L32K48k54j96J33m9N7J3J65M5l24
$$ -105 91 -108 -163 -178 -169 -103 -239 -46 312 -178 74 -288 44 292 38 -158 -25 -74 -17 -4 161 206 -118
2892a18j45L8J22Q0J4k2J67k45o8J20J8J51j08k8r3m0J51o0K2P5j15J24L0j99
$$ -118 -263 -225 -103 -23 -9 -31 136 -109 -177 -57 -39 112 4 -24 -117 -157 -6 -66 -44 31 -84 40 70 -129
2916a29K65j8j15J46j41l0Q8l4k99L48m5P6r3J4J5j76J10j31J20K88j76k28K39
$$ -129 136 118 3 149 8 -22 66 32 -267 81 36 112 19 33 48 -128 -18 -149 -29 259 83 -145 94
2939I4k73P5J5O2J82k71K23o6J17j25j65QN5J15p5K0r2K14l5k89L21j32Q2l40
$$ 94 -179 -104 -89 -27 155 -116 107 41 158 33 -132 -124 -69 46 -29 -9 -101 113 78 -211 110 -22 60 -280
2963b80K84k11K1J80L8j34O1j45J79k5m5k46N76m32Q9K82j51J4lj82K48j5j88
$$ -280 4 -207 -186 -6 32 -102 -41 -186 -7 -32 -77 -323 253 -179 -90 192 41 55 52 -130 118 103 -85
2986h5J2j7j33L49k04j5J7Q4K99k61J27k88K05j57K63m8N1N6n0l18L20j37M0l88
$$ -85 -73 -90 -223 126 -78 -93 -76 8 307 46 173 -115 90 -67 196 148 199 255 205 -113 207 70 110 -278
3010b78L14R9k1l28J45K86k03k22k57N77k29Q3k49j80L57K08l4k89m5J92M5k3
$$ -278 36 135 114 -214 -69 217 14 -208 -465 112 -117 -34 -283 -463 -106 102 68 -221 -266 -74 -29 -52
3032e2N3K25l32n0K05J9J28k37M25p57R0L26KJ4j93J42Q0j07m8L01n11J16K63
$$ -52 1 226 -106 -156 49 68 196 -41 384 -373 -283 43 45 59 -134 8 88 -19 -67 234 -277 -161 102
3055A02J23l39J21K17l12O4J39q9K84j34k89J12q4K18j48q6O9K3m6L5%J57o3j04
$$ 102 225 -114 7 224 -88 -24 115 26 310 176 -113 -1 -85 133 -15 -101 -32 -9 -55 -20 -20 137 74 -30
3079c0j99N4K06k68M09j60j70L58l78R8K38r4M4J15k14M6M1j40J17Qk72R0Q6R1
$$ -30 -229 -175 31 -237 172 12 -158 200 -178 -80 158 64 108 223 9 55 96 -44 73 81 -191 -101 -15 76
3103G6k24K08J37j81j49K37o8k3k39L88k97Q8j56K16K06l33K50j88R8j79J19K18
$$ 76 -148 60 197 16 -133 104 36 13 -226 162 -135 -47 -203 13 219 -114 136 -52 46 -133 -14 204
3125B04n99K51L11l53L94k78M0N6k0m3P6N6k52l8nL58j72k57K79K55j79Q6k24
$$ 204 -395 -144 167 -186 208 -70 -30 26 6 -37 39 95 -157 -195 -200 158 -14 -271 8 263 84 170 -54
3148e4J19M5J69m24Q7K35J1J69m12J04J54j96J10r8J6K10j86o9K0k8j53K37k65
$$ -54 65 110 279 -145 -58 177 188 357 -55 49 203 7 117 19 35 245 59 -10 10 -18 -171 66 -199
3171a99K24r3J53l58K89r9J9O9r9l1N3N5j47L36J1J48n08J27M9j37k3K84j85J00
$$ -199 25 -68 85 -273 16 -83 -64 5 -94 -125 -72 -17 -164 172 183 331 -177 -50 -1 -138 -161 123 -62 38
3195C8j05K2J15N3j04P4j75K20j21J48j15o0j36pK36j36J91j40j53J11J30j84
$$ 38 -67 -45 70 123 19 93 -82 138 17 165 50 -10 -146 -153 83 -53 138 -2 -155 -44 86 -98
3217i8J08k1m1K6j72K68j88L82j10K7p8Nj53K11k5q1p9Q0J37m47K76R4k44J53
$$ -98 10 -11 -52 -26 -198 70 -118 264 154 181 103 108 -45 166 141 60 -19 61 198 -249 27 121 -123 30
3241C0N1o8m5O8o3j03K36l51L22M6j65j78L35o8k77P0K43P3k88K93j41j79o2M56
$$ 30 81 13 -32 36 -27 -130 106 -245 77 123 -42 -220 115 47 -230 -160 83 156 -132 161 20 -159 -221 235
3265B35l66K67n6J8j75J31k08m5J13K24j24l09L50K45j02k27J10j71J05lj54K35
$$ 235 -131 136 80 98 -77 54 -154 -199 -86 138 14 -295 55 300 198 -29 81 -90 15 12 -142 93
3287I3j38P1l78K70K45k44l7O0R6j58J53N1j93J72j28K08m25J49m3N3k7J56k09
$$ 93 -45 26 -352 -82 163 -81 -118 -58 38 -120 33 84 -109 63 -65 143 -282 -133 -176 -123 -150 6 -203
3310b03l2L1P2J03J13k30L79l82J46N1J06l32J08J62j93K41j90j03qK5j28J86
$$ -203 -235 -204 -132 -29 84 -146 233 -149 -3 48 154 -178 -70 92 -101 140 -50 -153 -161 -136 -264 -78
3332g8J71j22m5N2k05K89L7m01K63n5O0l7L1K11J9l03J71m3J0J14q0j06K8K24
$$ -78 93 -29 -74 -22 -227 62 99 -302 -39 -94 -34 -71 -40 171 190 -113 58 15 25 139 59 -47 -19 205
3356B05k3l19K29rj53m5Q1j12J77J19l20L67j04j55K3J28l4j31lp9J3L75l06J1
$$ 205 182 -137 92 83 -70 -115 -34 -146 31 150 -170 197 93 -62 -39 89 55 -76 -79 -158 -145 230 -76 -65
3380f5K43Nk27J33j44Q7j78K73p0j21O2J3J46j28j49K7k26M14m7J49l88J29J86
$$ -65 178 183 -44 89 -55 32 -146 127 57 -64 -2 11 157 29 -120 -93 -319 95 48 197 -191 -62 124
3403A24m4j66J18PO8L9l7J04m65L99j80K3O6R8j35j88L67qk88kK5O5R9K02j25
$$ 124 80 -86 32 39 107 146 109 213 -252 147 -33 -10 56 154 19 -169 198 190 -98 -100 -75 -10 89 291 166
3428A66P2k01N6j76K29p3k93K93l1n6L0l8j00M7J36KJ50K8j81J0o1o1J9k50K36
$$ 166 238 37 93 -83 146 73 -220 73 42 -14 16 -22 -122 -75 61 63 213 241 60 70 9 -52 -33 -283 -47
3453d7P0k66J46K82j04k58kJ55j53J03J85k30n5K63j66k9P6NM4k16N44l98k1K4
$$ -47 23 -243 -97 185 81 -177 -179 -24 -177 -74 111 -119 -174 89 -77 -106 -30 -25 19 -197 347 -51 -72 -48
3477d8k4L88j89N5n2j25j18O6n4J21P2j85pK74O4r5k60j26L10r5J2L0N0J61j21
$$ -48 -72 316 127 182 130 5 -113 -47 -101 20 92 -93 -100 174 238 143 -117 -243 67 -28 -16 14 64 225 104
3502A04p7p1J84m44J55R9J98l41L58j97Pr0J96k0j29o0Q2KJ6J44q6m1J02l74L20
$$ 104 27 -44 140 -304 -149 -50 148 -193 165 -32 -25 -115 81 61 -68 -128 -46 -44 -28 116 30 -11 91 -283 37
3527C7N9j35J51k81N0J72l6O5ro1j89J67N4n6J02q0J1j2j13J03L6m2o5p4K27J65
$$ 37 96 -39 112 -169 -119 53 17 82 73 12 -177 -10 44 -12 90 10 21 9 -104 -1 35 -7 -72 -146 81 246
3553B46m91L17q7n6N6k15L68j43n7J16KL8j64N2J97j69j55j05K38k3L75l30p7
$$ 246 -245 72 -15 -71 -15 -230 138 -5 -62 54 56 94 -70 -18 179 10 -145 -250 -12 -35 340 10 -67
3576f7j92K21n3P3L9j59L00k00r2K41Kr0K5j76Q9l01L31R5K3L4j71R9J3j79J06
$$ -67 -259 -38 -91 -18 21 -138 162 -38 -130 111 113 23 48 -128 -39 -340 -9 86 109 143 -28 71 84 -95 11
3601A1J6k84N17j88l85N82j68p8J46l75jK69k62N6J42m3L6m1l18R0L72k32J96
$$ 11 27 -257 260 72 -313 269 101 23 169 -206 -207 62 -200 -144 -2 -45 -9 -50 -368 -278 94 -138 58
3624E8j24j6K05j71J44k76J80L16l16j06J19M5L0l2q6r9L84l89k10K40L60k41
$$ 58 -66 -82 123 -48 96 -180 0 316 0 -106 13 58 88 56 -30 -129 255 -134 -344 -104 256 15
3646A5m6K65j53n4k2K92k43m1j1N7j09L9K17Rl18J19l07L37j73K13M7l20K16L
$$ 15 -31 234 81 27 5 297 54 13 2 59 -50 -11 206 215 -103 16 -291 46 -127 86 133 -187 29 32
3670C2m0M0O9j94L5J25L0p3K70n46J23K13j41j50kL13L2r0j79k06N17l47j8K11
$$ 32 -8 32 101 -93 -58 67 97 24 294 -252 -129 84 -57 -207 -209 104 136 46 -133 -339 178 -169 -187 24
3694B4K8O9k41J80k04N6R9j83k8K73j04R3j77N5J96m1Oq6j31J1K59k26L7k7K00
$$ 24 52 121 -120 60 -144 -88 11 -172 -200 73 -31 62 -115 -60 136 95 101 15 -116 -105 154 -72 -35 -62 138
3719A38j81m3Q6R6j32k01K55P1j4N7k04J37l18M71j17k8k3j59K72j89j14R7M7
$$ 138 -43 -86 0 96 -36 -237 18 89 75 132 -72 65 -253 218 101 73 50 -109 163 -26 -140 -43 4
3742DL1n2oJ18L3K2nL6k93P5l02N18l4m46M98k97J65l07K54O4J37j77j20P3N8
$$ 4 35 -17 -23 95 128 150 145 181 -112 -37 -339 179 145 -301 197 -100 65 -242 12 76 213 36 -84 -11 47
3767D7mR1J12j96j19K4J00OJ23k35l93L95K68l85K9J44J91k50k4J01N0R3k93L64
$$ 47 43 134 246 50 -69 -45 55 61 184 -51 -444 -49 219 -166 -137 7 198 -52 -76 25 75 168 -125 239
3791B39k44L8m0K1P3j65J09n3J65m20L25O1j13k6l8j20L2K28j67K9Q9K00l24R2
$$ 239 -5 33 -7 14 87 -78 31 -22 143 -277 48 109 -4 -30 -68 -188 -156 72 -95 -66 23 223 -101 -9
3815ij55L9j26J24k9K14n1j8j93R9N33m89L2m3lK78n01M00Pk36J59Q8J40k05j19
$$ -9 -164 -125 -251 -127 -156 58 7 -11 -204 -105 428 -61 -29 -72 -75 203 -298 102 109 -127 32 120 260 55 -64
3840f4j65L63k35K35k5J29k11M6J20j36N7k56L8K9K8J86j16J51j55J72j68r3L37
$$ -64 -229 134 -101 134 109 238 27 73 193 57 114 -142 -104 -75 -47 139 23 174 19 191 23 -70 267
3863B67j84l8q5J13j34N0k43K37j52J94k27J85J16l73K40K02j58J25m4J73m23
$$ 267 83 45 -40 73 -61 -11 -254 -17 -169 25 -202 -17 99 -274 -34 168 10 135 91 264 -159
3884a59k21M54Q6k06o5Q7P7j24M3J17j57K03k69P6j27L71j88J50nk42L9p6M5K1
$$ -159 -380 74 160 -46 -111 -24 53 -71 -28 89 -68 135 -134 -58 -185 186 -2 148 143 -99 -60 -136 -91 -70
3908g0J69k18j17J78M3K27j03j57J04k39L11p3k92N08j32q5J0k48K70k08K81k95
$$ -70 99 -119 -236 -58 -15 212 109 -48 56 -183 128 55 -237 271 139 54 64 -184 86 -122 159 -136
3930a36M4M39j32j85O3j2qj54J83j95j12LJ33L4Q5k2J18j92L1l2m2q6J28K41l85
$$ -136 -92 347 215 30 93 81 73 -81 102 -93 -205 -202 -69 -35 50 28 146 -46 -15 -47 -89 -175 -47 194 -191
3955a91j46O33l49j3N1P6r5j54M5K46j1j82J52j00pl2K83k13K61l87J46k39L4
$$ -191 -337 296 -53 -66 -15 61 -34 -188 -143 103 92 -90 62 -38 -45 -77 206 -7 254 -133 13 -226 -192
3978a92K36lp2J1J19r2k6J53l6j94r2J47J73l9J2k30N4L51j18l07j03J77J49p3
$$ -192 44 41 -31 -20 99 7 -19 134 98 -96 -188 -41 132 93 105 -125 -71 280 162 -145 -248 -71 78 5
4002EJ96rl16J19K02j25j31J77O5j21k52K68p0j58K24k36K57J09m2j05j23lo2
$$ 5 201 192 -124 -5 197 72 -59 118 183 62 -190 78 8 -150 74 -162 95 204 162 57 -66 -69 -131
4025a31J51j49P8L75n16J93J30k12m3J76R6L5m87l6K64R8j28j01K05J46q2J03
$$ -131 20 -129 -51 324 -192 1 131 -81 -124 52 148 183 -304 -340 -76 22 -106 -207 -2 144 62 165
4047A65k03j42J29R4K11Q2n24M97l07M9O5p9p6n8O6K8Q6K0k5J12j11l5J98j22
$$ 165 -38 -180 -51 43 254 336 -188 309 2 51 116 37 -39 -97 -31 -3 83 103 78 190 79 44 242 120
4071A20k38K04nm4jJ41j29m6m6j24Q3K81K8m6j77J72j20k74K28j9j00j92K51J10
$$ 120 -118 86 81 37 36 177 48 2 -44 -168 -85 196 224 178 1 173 53 -221 7 -12 -112 -304 -53 57
4095E7j83N9N7rJ59j79K26m17M06k58KJ78l72N35l68L47j86j04n0J14k39PM40
$$ 57 -126 -67 -10 -19 140 -39 187 -230 176 -82 -80 98 -274 261 -107 240 54 -50 -100 14 -225 -218 222
4118B22m62K59Pj41M2J07Q2k57L6L0k4J0K11k95k18M05j81L63k92j86K48q2K40
$$ 222 -240 19 26 -115 -73 34 116 -141 -105 -75 -99 -89 122 -173 -391 14 -167 196 -96 -282 -34 -116 124
4141A24O9j90K06m01J54O8M0ol08J66Q6J32o0k16j8K46k5j93J13qk9o3N1j4K69
$$ 124 193 3 209 -192 -38 30 70 64 -244 -78 8 140 80 -136 -154 92 67 -126 -13 -21 -50 -113 -62 -76 193
4166A93l60J5J77m2J48l34J70o6J42L0n9K0Q9r0p9q8J92P5j04j27j26L70j82Q2
$$ 193 -167 -152 25 -17 131 -203 -33 -99 43 73 14 34 123 33 -46 -134 58 133 29 -98 -224 146 -36 46
4190D6q4j0K0L66k85j08j89L33k81J65q4j45J00K22J9j92m6N1K15l92K75L30l34
$$ 46 -38 -48 -28 338 53 -55 -244 89 -192 -27 -111 -256 -156 66 85 -107 -153 -102 113 -279 -4 326 -8
4213hM3k04J56j03k4K8J9J72J99k59j78M8J12M7R2k44P4J81o79N35K7m1l8K76
$$ -8 35 -169 -13 -116 -140 -112 -93 79 278 19 -159 -111 1 48 140 -104 -30 151 -528 7 34 -7 -45 231
4237B31k42o6m0J63K28k80j54L65l86L54l09qJ3R9J93l15M81j77j5l02Q7K9l18
$$ 231 -11 -77 -117 46 274 -6 -160 205 -181 173 -136 -144 -131 -32 161 -154 327 150 135 -167 -80 -51 -369
4260c69L27Oj63L95j71J78j71j13M3K35k29k1J92r6m5M96m42n4j89L78j52qpJ8
$$ -369 -42 -36 -199 196 25 203 32 -81 -38 197 -32 -53 139 43 -2 494 52 -2 -191 187 35 27 20 38
4284C8l9J53n3k67K95kp7%P5j9Q8j16K3m6n6j15M72k56%l5J4o2l15J87R4j5J30
$$ 38 -1 152 99 -168 127 125 48 48 123 104 192 76 99 53 -3 -118 354 98 98 63 77 15 -300 -113 -19 -34 96
4311I6k28L5k04k3M65m44J80K13j68pL5p6J76j08j13M55k69O5o2p6j50P5P6k36
$$ 96 -132 -97 -301 -324 141 -303 -123 90 -78 -85 -50 -126 50 -58 -171 284 15 80 18 -58 -208 -133 -57 -293
4335b93L30R0j41K4l6j15J40K4Q9j06Q9k01M67j65k34M9K3J82m31L35j88m4J6
$$ -293 37 127 -14 10 -26 -141 -1 23 112 6 95 -106 361 196 -38 11 34 216 -215 120 -68 -112 -96
4358i6J41J18k73K6K49m70M71n09L68P2j33K62l68J08K07n3l9m6P0r2L6j2j33
$$ -96 45 163 -110 -84 165 -305 166 -343 25 97 -36 226 -142 -34 173 120 81 35 105 13 49 37 -96
4381i6j08pJ77o2M7O8jj15J50J25l65m3K66k51K22N3O0k34N3O4m6n0R2l0K8K2
$$ -96 -204 -211 -34 -96 -49 19 18 -97 53 178 -187 -230 36 -215 7 60 120 -114 -61 3 -43 -93 -1 -31 -3 19
4407A9M2j53J02J28j26J2j95L6M2K22j1j7j79mK18k94K68l49J45J28K35m42J24
$$ 19 61 -92 10 138 12 24 -171 -135 -93 129 118 101 -78 -82 136 -158 110 -239 -94 34 269 -173 -49
4430d9K65j29L3j94J84k84J36J65j32K87o12K51K12k27N3j36J81o7OK8o7P6p7
$$ -49 216 87 120 -74 110 -174 -38 127 -5 282 -330 -79 133 -94 -41 -177 4 -63 -57 -29 -96 -20 -97
4453i7K32j19N2J79m0l92K50k57Q1J16j25O7j12J82n5J10P1j35m5N4J08l56J92
$$ -97 135 16 68 247 207 -185 65 -192 -111 5 -120 -53 -165 17 -38 72 143 8 -37 17 125 -231 -39
4476c9j4J10Nn1k8j10J54l4N2l4K8m4pj63J38j7M6m72K79K1N0J22j30M05l13k3
$$ -39 -53 57 62 11 -17 -127 27 -7 45 11 39 -5 -12 -175 -37 -54 -8 -480 -201 -180 -130 -8 -138 267 -46 -69
$$ [...]
8191b23
##END NTUPLES=NMR FID
##END=
