##TITLE=1H_DE-105K_TFA
 200.13MHz, CDCl3,
 8 sc
 
 5.8.2025
##JCAMPDX= 6.0         $$ Bruker NMR JCAMP-DX V2.0
##DATA TYPE= NMR FID
##DATA CLASS= NTUPLES
##ORIGIN= UXNMR, Bruker Analytische Messtechnik GmbH
##OWNER= pz
$$ XWIN-NMR		Version 3.5
$$ Tue Aug  5 15:58:00 2025 Russian Standard Time (UT+4h)  she@DPX200
##.OBSERVE FREQUENCY= 200.1313
##.OBSERVE NUCLEUS= ^1H
##.DELAY= (6, 6)
##.ACQUISITION MODE= SIMULTANEOUS
##.ACQUISITION SCHEME= undefined
##.AVERAGES= 8
##.DIGITISER RES= 18
##SPECTROMETER/DATA SYSTEM= spect
##.PULSE SEQUENCE= zg30
##.SOLVENT NAME= CDCl3
##.SHIFT REFERENCE= (INTERNAL, CDCl3, 0, 14.3821)
##AUDIT TRAIL= $$ (NUMBER, WHEN, WHO, WHERE, WHAT)
$$ ##TITLE= Audit trail, XWIN-NMR		Version 3.5
$$ ##JCAMPDX= 5.01
$$ ##ORIGIN= Bruker BioSpin GmbH
$$ ##OWNER= she
$$ F:/spectra/data/she/nmr/H-C/1/audita.txt
$$ ##AUDIT TRAIL=  $$ (NUMBER, WHEN, WHO, WHERE, WHAT)
(   1,<2025-08-05 15:56:46.04 +0400>,<she>,<DPX200>,
      <created by zg, POWCHK disabled, PULCHK disabled
       configuration hash MD5:
       00 E9 B6 7A A2 85 ED C7 34 08 36 98 17 FE 4E 26
       data hash MD5: 16K
       22 09 8D 6C 58 A5 34 89 84 7F 8D EA F8 68 86 C4>)
$$ ##END=
$$ 
$$ hash MD5
$$ 8B 7A 6E CC AB B1 4E B4 8F 76 9D A5 23 F5 AD 2B
##$RELAX= 
##$RELAX= 
##$RELAX= 
##$RELAX= 
##$RELAX= 
##$RELAX= 
$$ Bruker specific parameters
$$ --------------------------
##$DU= <F:/spectra>
##$EXPNO= 1
##$NAME= <H-C>
##$PROCNO= 1
##$TYPE= <nmr>
##$USER= <she>
##$AMP= (0..31)
100 100 100 100 100 100 100 100 100 100 100 100 100 100 100 100 100 100 
100 100 100 100 100 100 100 100 100 100 100 100 100 100 
##$AQSEQ= 0
##$AQ_mod= 1
##$AUNM= <au_zg>
##$AUTOPOS= <>
##$BF1= 200.13
##$BF2= 200.13
##$BF3= 200.13
##$BF4= 200.13
##$BF5= 200.13
##$BF6= 200.13
##$BF7= 200.13
##$BF8= 200.13
##$BYTORDA= 1
##$CFDGTYP= 0
##$CFRGTYP= 5
##$CHEMSTR= <none>
##$CNST= (0..31)
1 1 145 1 1 1 1 1 1 1 1 1 1 1 1 1 1 1 1 1 1 1 1 1 1 1 1 1 1 1 1 1 
##$CPDPRG= <>
##$CPDPRG1= <>
##$CPDPRG2= <>
##$CPDPRG3= <>
##$CPDPRG4= <mlev>
##$CPDPRG5= <mlev>
##$CPDPRG6= <mlev>
##$CPDPRG7= <mlev>
##$CPDPRG8= <mlev>
##$CPDPRGB= <>
##$CPDPRGT= <>
##$D= (0..31)
0 0.7 0 0 0 0 0 0 0 0 0 0.03 0 0 0 0 0 0 0 0 0 0 0 0 0 0 0 0 0 0 0 0 
##$DATE= 1754395005
##$DBL= (0..7)
120 120 120 120 120 120 120 120 
##$DBP= (0..7)
150 150 150 150 150 150 150 150 
##$DBP07= 0
##$DBPNAM0= <>
##$DBPNAM1= <>
##$DBPNAM2= <>
##$DBPNAM3= <>
##$DBPNAM4= <>
##$DBPNAM5= <>
##$DBPNAM6= <>
##$DBPNAM7= <>
##$DBPOAL= (0..7)
0.5 0.5 0.5 0.5 0.5 0.5 0.5 0.5 
##$DBPOFFS= (0..7)
0 0 0 0 0 0 0 0 
##$DE= 6
##$DECBNUC= <off>
##$DECIM= 32
##$DECNUC= <off>
##$DECSTAT= 4
##$DIGMOD= 1
##$DIGTYP= 9
##$DL= (0..7)
0 120 120 120 120 120 120 120 
##$DP= (0..7)
150 150 150 150 150 150 150 150 
##$DP07= 0
##$DPNAME0= <>
##$DPNAME1= <>
##$DPNAME2= <>
##$DPNAME3= <>
##$DPNAME4= <>
##$DPNAME5= <>
##$DPNAME6= <>
##$DPNAME7= <>
##$DPOAL= (0..7)
0.5 0.5 0.5 0.5 0.5 0.5 0.5 0.5 
##$DPOFFS= (0..7)
0 0 0 0 0 0 0 0 
##$DQDMODE= 0
##$DR= 18
##$DS= 0
##$DSLIST= <SSSSSSSSSSSSSSS>
$$ [...]
##$SUBNAM0= <"">
##$SUBNAM1= <"">
##$SUBNAM2= <"">
##$SUBNAM3= <"">
##$SUBNAM4= <"">
##$SUBNAM5= <"">
##$SUBNAM6= <"">
##$SUBNAM7= <"">
##$SUBNAM8= <"">
##$SUBNAM9= <"">
##$SW= 18.0517328524113
##$SWIBOX= (0..15)
0 0 2 0 0 0 0 0 0 0 0 0 0 0 0 0 
##$SW_h= 3612.71676300578
##$TD= 16384
##$TD0= 1
##$TE= 0
##$TE2= 300
##$TE3= 300
##$TEG= 300
##$TL= (0..7)
0 120 120 120 120 120 120 120 
##$TP= (0..7)
150 150 150 150 150 150 150 150 
##$TP07= 0
##$TPNAME0= <>
##$TPNAME1= <>
##$TPNAME2= <>
##$TPNAME3= <>
##$TPNAME4= <>
##$TPNAME5= <>
##$TPNAME6= <>
##$TPNAME7= <>
##$TPOAL= (0..7)
0.5 0.5 0.5 0.5 0.5 0.5 0.5 0.5 
##$TPOFFS= (0..7)
0 0 0 0 0 0 0 0 
##$TUNHIN= 0
##$TUNHOUT= 0
##$TUNXOUT= 0
##$USERA1= <user>
##$USERA2= <user>
##$USERA3= <user>
##$USERA4= <user>
##$USERA5= <user>
##$V9= 5
##$VALIST= <valist>
##$VCLIST= <CCCCCCCCCCCCCCC>
##$VD= 0
##$VDLIST= <DDDDDDDDDDDDDDD>
##$VPLIST= <PPPPPPPPPPPPPPP>
##$VTLIST= <TTTTTTTTTTTTTTT>
##$WBST= 1024
##$WBSW= 4
##$XGAIN= (0..3)
0 0 0 0 
##$XL= 0
##$YL= 0
##$YMAX_a= 133800
##$YMIN_a= -178068
##$ZGOPTNS= <>
##$ZL1= 120
##$ZL2= 120
##$ZL3= 120
##$ZL4= 120
##$ABSF1= 10
##$ABSF2= 0
##$ABSG= 5
##$ABSL= 3
##$ALPHA= 0
##$AQORDER= 0
##$ASSFAC= 0
##$ASSFACI= 0
##$ASSFACX= 0
##$ASSWID= 0
##$AUNMP= <proc_1d>
##$AZFE= 0.1
##$AZFW= 0.1
##$BCFW= 1
##$BC_mod= 2
##$BYTORDP= 1
##$COROFFS= 0
##$CY= -3
##$DATMOD= 1
##$DC= 2
##$DFILT= <>
##$DTYPP= 0
##$F1P= 0
##$F2P= 0
##$FCOR= 0.5
##$FTSIZE= 0
##$FT_mod= 4
##$GAMMA= 1
##$GB= 0.15
##$INTBC= 1
##$INTSCL= 1
##$ISEN= 128
##$LB= 0.25
##$LEV0= 0
##$LPBIN= 0
##$MAXI= 10000
##$MC2= 0
##$MEAN= 0
##$ME_mod= 0
##$MI= 1.114404
##$NCOEF= 0
##$NC_proc= 0
##$NLEV= 6
##$NOISF1= 3.799351
##$NOISF2= 2.8
##$NSP= 1
##$NTH_PI= 0
##$NZP= 0
##$OFFSET= 14.38212
##$PC= 1
##$PHC0= -1200.99
##$PHC1= 12.7923
##$PH_mod= 1
##$PKNL= yes
##$PPARMOD= 0
##$PSCAL= 0
##$PSIGN= 0
##$REVERSE= no
##$SF= 200.129724274929
##$SI= 16384
##$SIGF1= 3
##$SIGF2= 2
##$SINO= 400
##$SIOLD= 16384
##$SREGLST= <1H.CDCl3>
##$SSB= 0
##$STSI= 0
##$STSR= 0
##$SW_p= 3205.1282051282
##$SYMM= 0
##$S_DEV= 0
##$TDeff= 0
##$TDoff= 0
##$TI= <>
##$TILT= no
##$TM1= 0
##$TM2= 0
##$TOPLEV= 0
##$USERP1= <user>
##$USERP2= <user>
##$USERP3= <user>
##$USERP4= <user>
##$USERP5= <user>
##$WDW= 1
##$XDIM= 8192
##$YMAX_p= 0
##$YMIN_p= 0
$$ End of Bruker specific parameters
$$ ---------------------------------
##NTUPLES= NMR FID
##VAR_NAME=  TIME,          FID/REAL,        FID/IMAG
##SYMBOL=    X,             R,               I
##VAR_TYPE=  INDEPENDENT,   DEPENDENT,       DEPENDENT
##VAR_FORM=  AFFN,          ASDF,            ASDF
##VAR_DIM=   8192,          8192,            8192
##UNITS=     SECONDS,       ARBITRARY UNITS, ARBITRARY UNITS
##FACTOR=    0.0002768,     1,               1
##FIRST=     0,             0,               0
##LAST=      2.2672688,     0,               0
##MIN=       0,             -178068,         0
##MAX=       2.2672688,     133800,          0
$$ Real data points
##PAGE= N=1
##DATA TABLE= (X++(R..R)), XYDATA
$$ [...]
1926C00j94r7J92n4ro9j44R7l66k73L06L40o4j28p3J21L98j60j7Q2L91l79k38
$$ 300 106 9 201 147 138 69 -75 22 -344 -617 -311 29 -35 -163 -236 -115 283 123 106 188 579 200 -38
1949c8J79k6k72J32l77K05j76J32l3p1K87P2J10Q1n1K40J95q5m97k80K64J18m49
$$ -38 141 115 -157 -25 -402 -197 -373 -241 -274 -345 -58 14 124 205 154 394 589 504 7 -273 -9 109 -340
1972c40J1J96J76j29o4K81j10J13K13n93N28J53l29J23l72J3K16j8j22K06m9j81
$$ -340 -329 -133 43 -86 -150 131 21 134 347 -246 282 435 106 229 -143 -130 86 68 -54 152 103 -78
1994g8l7k50O16j69J79n99M15K2J72j6q9j04K42j97j85k3J22J71o39L41j28J33
$$ -78 -115 -365 251 82 261 -338 77 99 271 255 166 62 304 107 -78 -101 21 192 -447 -106 -234 -101
2016a01j29L57JP0p8n1L7J34p9P7m71K71j51K2k38m32N23J78k44J42J64J34M78
$$ -101 -230 127 128 198 120 69 106 240 161 238 -233 38 -113 -91 -329 -761 -238 -60 -304 -162 2 136 614
2039F14l76j20nMK0k65K20l51K70n7l54M14l77M53j16l5R7M8P6Q8%k19L53o13
$$ 614 238 118 113 117 137 -128 92 -259 11 -46 -400 14 -363 90 -26 -61 36 84 160 248 248 29 382 -231
2063b31K29J18P6j23l8oj30L40l89k65J73J66P2P4J26L3M1r9l5K2j1J41l18k48
$$ -231 -2 116 192 69 31 25 -105 235 -154 -419 -246 -80 -8 66 192 225 266 167 132 154 143 284 -34 -282
2087b82mL27k60j34j10L92J81k15J50j08J71J02M5l32P0J00l14R4N2lo6l65L33
$$ -282 -286 41 -219 -353 -463 -71 110 -105 45 -63 108 210 255 -77 -7 93 -221 -127 -75 -78 -144 -509 -176
2110a76lK65l78J49K92j38K1l6j34L27N9j65j13j14J33M6l35K63MK73m21J21J64
$$ -176 -179 86 -292 -143 149 11 32 -4 -138 189 248 83 -30 -144 -11 35 -300 -37 -33 240 -181 -60 104
2133A04m01L93k63l1M24k2Q0J05k56J23k32J54m90K51O1j97L9j0J8K91k09J17
$$ 104 -297 96 -167 -198 226 204 284 389 133 256 24 178 -312 -61 0 -197 -158 -168 -150 141 -68 49
2155D9J2J60J24j74L12m66J07k0l47J37j02J55j65r2J38J89J48l39K63J56j1j35
$$ 49 61 221 345 171 483 17 124 104 -243 -106 -208 -53 -218 -310 -172 17 165 -174 89 245 234 99
2177I9jK04o0l28K77n07K30O5j86k8j79L16J28M3l61J50N27k57m0r0J67R5l25
$$ 99 98 302 242 -86 191 -316 -86 -21 -207 -235 -414 -98 30 73 -288 -138 389 132 92 2 169 264 -61
2200f1j71Q9K45J19l36q9R4j8n9m0j5K15K89j45J02j35P9J0j27J24J75k32r7j56
$$ -61 -232 -143 102 221 -115 -204 -110 -128 -187 -227 -242 -27 262 117 219 84 163 173 46 170 345 113 16 -140
2224a40o8J36J7l92M36L36k43p4P7k92N54L0j47J46m54J66j04L6Kl07O4J68l8
$$ -140 -208 -72 -55 -447 -11 325 82 8 85 -207 347 377 230 376 -78 88 -16 20 22 -285 -221 -53 -91
2247i1J19j0o7k97O02j21J3J18l70M32J4m64J31L6ln1l37J36J17p8m2R5K49j71
$$ -91 28 18 -49 -346 256 135 148 266 -104 328 342 -122 9 45 42 -9 -346 -210 -93 -171 -213 -118 131 -40
2271d0K0J66j5J85J21k38k35N9k3n2j29K43k47M8J55n0j99M62l44K33k26L08l8
$$ -40 -20 146 131 316 437 199 -36 23 0 -52 -181 62 -185 -137 18 -32 -231 231 -113 120 -106 202 164
2294A64j70r8O3J19k93L14m59N01r8j13k09K87R8m5k78J09P0J52j09J53l77K2
$$ 164 -6 -104 -41 78 -215 99 -360 141 43 -70 -279 8 106 61 -217 -108 -38 114 5 158 -219 -197
2316a97M8Q0M1j37N9K9QJ06j02l07M11k68R9J32q5L25m45J91L32k42J6j27K46
$$ -197 -149 -69 -28 -165 -106 -77 -69 37 -65 -372 39 -229 -130 2 -83 242 -203 -12 320 78 94 -33 213
2339B13j19p9l26J30M2J34o0j40M61k25J34l60K03j7J59mJj55j25M9k07J93Q7
$$ 213 94 15 -311 -181 -139 -5 -65 -205 256 31 165 -195 8 -9 150 146 147 -8 -133 -84 -291 -98 -11
2362a1L99n46P7R0N5k02K63k37%J37j51J23N3k3j04j10p5R8L1K42o2J50j67j5
$$ -11 388 -158 -81 9 64 -138 125 -112 -112 25 -126 -3 50 27 -77 -187 -262 -164 -133 109 47 197 30 15
2386A5M1j52M9j33J69R8Q6k9l90K32Ok22O2l5J29L7M4j23j67M18j25M15m12k24
$$ 15 56 -96 -47 -180 -11 87 173 144 -246 -14 -8 -230 -168 -203 -74 -37 7 -116 -283 135 10 425 13 -211
2410b11K67j1J9R4j30n8K31m12P5J24R4j31J4j36K15j57N2j11K24j73R4j2Q7O1
$$ -211 56 45 64 158 28 -30 201 -211 -136 -12 82 -49 -35 -171 44 -113 -61 -172 52 -121 -27 -39 48 109
2434A09k41Q1j80R0M32n15J46k52M36M9l8P5k23O9k8J74m6n5n7J4q1n4K33k86
$$ 109 -132 -51 -231 -141 291 -224 -78 -330 106 155 117 192 -31 38 10 184 138 83 26 40 -41 -95 138 -148
2458a48l40N43k03L03m3j65O8K20k20R2J48k03QJ35j73m21M19n3J16k15J00J21
$$ -148 -488 55 -148 155 112 -53 15 235 15 107 255 52 60 195 22 -399 20 -33 83 -132 -32 89
2480H9j4k00J41m5K52k0j83J59l02J78M4J0J4j35k57K68K28k29K48l53qK81q9
$$ 89 75 -125 16 -29 223 203 20 179 -123 55 99 109 123 -12 -269 -1 227 -2 246 -107 -115 166 77
2503G7j54J53o3j60N04k13j64j73L08j80K94%n87J18J11k24K90O4Q1Ko8P8P8j0
$$ 77 -77 76 13 -147 357 144 -20 -193 115 -65 229 229 -358 -240 -129 -353 -63 1 82 84 16 94 172 162
2527A62l8K7j31m2M7j46k4K73r4j79J29r6J23k1L92l28j00pK0j59L65q5J63l44
$$ 162 124 151 20 -22 25 -121 -145 128 34 -145 -16 -112 11 -10 382 54 -46 -53 -33 -192 173 88 251 -93
2551i3j25J82K19l28K35j57K81k54K15k95L46q7j82K94k22J28j50J53j00j60q
$$ -93 -218 -36 183 -145 90 -67 214 -40 175 -120 226 139 -43 251 29 157 7 160 60 -100 -108
2572a08K81k00l48P26l43j39m2M8J85p5K6k27L45j08q2K12k07K9j82L08j81R7
$$ -108 173 -27 -375 351 8 -131 -173 -125 60 -15 11 -216 129 21 -61 151 -56 -27 -209 99 -82 15
2594A5M7m2L2k71M62l24L16j61J65n4l25J93n4n5J49j41k67K71L14m20K20Rpk13
$$ 15 62 20 52 -219 243 -81 235 74 239 185 -140 53 -1 -56 93 -48 -315 -44 270 -150 70 79 72 -141
2618a41J87o5J17o4M7K11l99J14L06k48q0l9K7k03L90q9q3l9j2l5J72J94l61R7
$$ -141 46 -19 98 34 81 292 -107 7 313 65 -15 -54 -27 -230 160 71 -12 -51 -63 -98 74 268 -93 4
2642DJ70k69J21J47k82J23P1o8j38n9K24R6j40j3J50J83o7l45o3J98j55J34k59
$$ 4 174 -95 26 173 -109 14 85 17 -121 -180 44 140 0 -13 137 320 253 -92 -155 43 -112 22 -237
2665b37J46J64m30J97M25l45L3J62j31J1j88K89Q2k94L17r7k89K75j9J26k19r2
$$ -237 -91 73 -357 -160 265 -80 -47 115 -16 -5 -193 96 178 -116 201 104 -185 90 71 197 -22 -114
2687a14k14L47K4j79L22j45k60N21k59J55l10L42k14j24K79k99J78k56L86k18
$$ -114 -328 19 43 -136 186 41 -219 302 43 198 -112 230 16 -108 171 -128 50 -206 180 -38
2707c8j69L56m3k11p5K78j85K14p2o3j5K15r1j40k01M81l44K99n6l50L01j27j32
$$ -38 -207 149 106 -105 -180 98 -87 127 55 -8 -23 192 101 -39 -240 241 -103 196 140 -210 91 -36 -168
2730a68L21j51r4K89l77K7L53j29k61L17k30J34o3O7j3l5j6p6j50R0R2J63n42
$$ -168 153 2 -92 197 -180 -153 200 71 -190 127 -103 31 -32 35 22 -13 -29 -105 -255 -165 -73 90 -452
2753d52O80q4j01J7k31J99j5J71l82J94j0r6J12J27k0j55P0O6J60j07j8m14L86
$$ -452 228 144 43 60 -171 28 13 184 -198 -4 -14 -110 2 129 109 -46 24 90 250 143 125 -289 97
2776I7M4k7n47P06l31lL41o81N34m44L84J03r4p0R4q6j23R2qK07q2j04n5L0J38
$$ 97 141 114 -433 273 -58 -61 280 -401 133 -311 73 176 82 12 106 20 -103 -11 -19 188 106 2 -53 -23 115
2801A15n0r6L08l28j37R8J54r9J2K4P4N1L4m47L01N5j03j36R5j12j79M54l08K82
$$ 115 65 -31 277 -51 -188 -90 64 -35 -23 1 75 126 160 -287 14 69 -34 -170 -75 -187 -366 88 -220 62
2825F2k44L44l15J69J38j62K25J33m78L5j02K09j86K30J5j25p7L50k98J88k48
$$ 62 -182 162 -153 16 154 -8 217 350 -128 -93 -195 14 -172 58 73 -52 -129 221 -77 111 -137
2846a37MK40o7J51k46Q2k34L25n6p2P1l8k29K99J41n95K05K32L5p0O1q8k35L25
$$ -137 -133 107 40 191 -55 27 -207 118 62 -10 61 23 -206 93 234 -361 -156 76 111 41 102 14 -221 104
2870A04R5n9j24J36J54n22Q4L3p7J22k00L2K15M0j03J52K9l48K87j36J63M7j7
$$ 104 199 140 16 152 306 -216 -132 -99 -176 -54 -254 -222 -7 33 -70 82 111 -237 50 -86 77 124 107
2893A07m24J63RL7J31N4j71K42k87J34J1J57o7r8J6k45N13m26J92P5j00k12K31
$$ 107 -317 -154 -145 -108 23 77 -94 148 -139 -5 6 163 96 -2 14 -231 282 -144 48 123 23 -189 42
2916D2n4j58R7J57k18O0P3j3l3K09k73n3J32M8k06%J08j32J97L7k42Q5q0L91l21
$$ 42 -12 -170 -73 84 -134 -74 -1 -14 -47 162 -111 -164 -32 16 -190 -190 -82 -214 -17 20 -222 -137 -217 174 -147
2941a47L3M0NJ18j69k2J60q6n3L33j53j50J03m6j41J33j16J29j85M74n08N20k3
$$ -147 -114 -74 -69 49 -120 -142 18 -68 -121 212 59 -91 12 -34 -175 -42 -158 -29 -214 260 -248 272 249
2964B49l26J4J12q4m7J12O2J56m21P6K58k70K47J31k47j06kJ47r2o6j30M33o8
$$ 249 -77 -63 49 -35 -82 30 92 248 -173 -97 161 -109 138 269 22 -84 -86 61 -31 -97 -227 206 138
2987A38r2m6j31K18k56jJ0K26N9l21Q0J97P3j21nO5O6j65p3L92m28LK31l63M67
$$ 138 46 0 -131 87 -169 -170 -160 66 125 -196 -116 81 154 33 28 93 159 -6 -79 313 -115 -112 119 -244 223
3012B23j68Q0j86J70O7j2l12J66j3j00K12j84j79O51n47K85j47j86L34j26l6P2
$$ 223 55 135 -51 119 186 174 -138 28 15 -85 127 -57 -236 415 -132 153 6 -180 154 28 -8 64
3034F4j5k14K94l26P4K18l15J67R9j41j9J20M5K3j4K8R3j26J45j68L7J21j85L4
$$ 64 49 -165 129 -197 -123 95 -220 -53 46 -95 -114 6 51 74 60 88 181 55 200 32 69 190 5 39
3058C9j83J89O7J47p2k48L45j14j32N6R7Pl12Q7K24k78J06j2k03K30j08j12P6
$$ 39 -144 45 112 259 187 -61 284 170 38 94 191 198 -114 -27 197 -81 25 13 -190 40 -68 -180 -104
3081a04L42m12K30j5Q4k79Q7K33j89m0j2M8r1L5J93l2o9m8J09k9k07K51p6o8n9
$$ -104 238 -174 56 41 125 -154 -67 166 -23 -63 -75 -27 -118 -83 110 78 9 -39 70 41 -166 85 9 -59 -118
3106a18K63o9j39j15Q6J66J84l21j01K00m7M0k30K09O9K0n4j53K79q0m3o6K81
$$ -118 145 76 -63 -178 -92 74 258 -63 -164 36 -11 29 -201 8 77 97 43 -110 169 89 46 -20 261
3129B61p6j31R9m61K32K35k52K07J77j63q3r0J29j66L6K20j0j18l6K02j09j44
$$ 261 185 54 153 -308 -76 159 -93 114 291 128 45 -45 84 -82 -46 174 164 46 10 212 103 -41
3151d1J05m4k24J65J25M2m2p4j67K81j41K42k48N3m4mn9K07l23K63j38j08J59
$$ -41 64 20 -204 -39 86 128 86 12 -155 126 -15 227 -21 32 -12 -16 -75 132 -191 72 -66 -174 -15
3174a5k7K14k1j29J08k45J61j0R6j99N5Lj38j34K10M4P6L8mj73M17k00m65L00
$$ -15 -42 172 151 22 130 -115 46 36 132 -67 -12 -9 -147 -281 -71 -27 49 87 83 -90 327 127 -338 -38
3198c8P1lk16N8J50L25l99l2J91Ok19j03K85j49j53K94j27J46j03j6M8K66j96
$$ -38 33 30 -186 -128 22 347 -52 -84 107 113 -106 -209 76 -73 -226 68 -59 87 -16 -32 16 282 86
3221H6k57j40L80k04K6K8j31L36J05m29L08r5Ok75K32q6J34j18L57L9j73k55O9
$$ 86 -171 -311 69 -135 -109 -81 -212 124 229 -200 108 13 19 -256 -24 -110 24 -94 263 302 129 -126 -57
3244e7K52k15K69lk26j26J6k4M18l56J24k64R8J48K4m1m9k39K80j24l0K26M0q0
$$ -57 195 -20 249 246 20 -106 -90 -114 304 -52 72 -192 -94 54 78 37 -12 -251 29 -95 -125 101 141 61
3268F1r7p8K02j68J61j57j89L73k7l09L21J8qj25j66oJ33J33l98P72m73M09l84
$$ 61 -36 -114 88 -80 81 -76 -265 108 81 -228 93 111 103 -22 -188 -194 -61 72 -326 446 -27 382 -2
3291bK25j21k09Qm1K47R1j24m37O13m00K09r9rJ97j40r3k89J73J25j3K23k48P4
$$ -2 223 102 -107 -99 -140 107 198 74 -363 250 -150 59 -40 -49 148 8 -85 -374 -201 -76 -89 134 -114 -40
3315d0ON2J06j30Mo1k08J12K64k74K81j63J25n9R2o4q6K59k85N2M3K3l62K98j95
$$ -40 -34 18 124 -6 -2 -63 -271 -159 105 -169 112 -51 74 15 107 43 -43 216 -69 -17 26 49 -313 -15 -210
3340b10L66k09p9L53k48J93k04%J93k78J76K76m42L35m59K15J8q1J39l5K07j85
$$ -210 156 -53 -132 221 -27 166 -38 -38 155 -123 53 329 -113 222 -237 -22 -4 -85 54 19 226 41
3362D1m1jQK1O3j99L53j48j00m6J49P7j05J5j2K44l41n4k3j68K93O4j90J28J1
$$ 41 0 -1 7 28 91 -108 245 97 -3 -49 100 177 72 87 75 319 -22 -76 -99 -267 26 90 -100 28 39
3387C9j12J56L4j27j23N0J28J3k45R2P5J84k67K12k03j9P9q4O9J76o5J3j25jj45
$$ 39 -73 83 117 -10 -133 -83 45 58 -187 -95 -20 164 -103 109 -94 -113 -34 -118 -49 127 62 75 -50 -51 -196
3412a96K20j40M03O4l13k07K73km6n7K80m88K25j22j4N1J44j98K63l51L26j79
$$ -196 24 -116 287 351 38 -169 104 102 56 -1 279 -209 16 -106 -120 -69 75 -123 140 -211 115 -64
3434f4K06q4j13l5J11K00j15P0m15M14K00n01J43on8J11n5j87N0M4r7L98m92K55
$$ -64 142 58 -55 -90 21 221 106 176 -239 175 375 -126 17 11 -47 64 9 -178 -128 -84 -181 217 -275 -20
3458b0k12OJ05R3Q8r7LJ25Q0k89L15l48M4P0o3J41j73J44l4p6J78l50M15j31j02
$$ -20 -232 -226 -121 -28 60 -37 -34 91 171 -118 197 -151 -107 -37 -100 41 -132 12 -22 -98 80 -270 145 14 -88
3483h8R9m9j93K65l8Q1j32R6n4N4M7k42J88j2R3l00J00J99j02j07o7M24j40%p7
$$ -88 11 -38 -231 34 -4 77 -55 41 -13 41 88 -154 34 22 115 -185 -85 114 12 -95 -162 262 122 122 45
3508D5J72p1J45m26K90j48l6J01r7m7K25j49j5J1j46R0J29kP1q5m28K93R9j47
$$ 45 217 146 291 -135 155 7 -29 72 -25 -72 153 4 -11 0 -146 -56 73 71 142 57 -371 -78 21 -126
3532a26J04n5L1K40k74J08L2P3k66N0J35j61M77k91Q4j77k04K51k95M16r4j72
$$ -126 -22 -77 -46 194 -80 28 60 133 -133 -83 52 -109 368 77 161 -16 -220 31 -264 152 58 -114
3554a14P8J7KR2k82N10n04K03r5J35J50l11l2l0L45j55q8J73j45J24j29j58L01
$$ -114 -36 -19 -17 75 -207 303 -201 2 -93 42 192 -119 -151 -181 164 9 -79 94 -51 73 -56 -214 87
3577H7l18J91K05j51n7L8j06J18j41M4K78k08J03k21K26k99M56j16j25J57j22
$$ 87 -231 -40 165 14 -43 -5 -111 7 -134 -90 188 -20 83 -138 88 -211 245 129 4 161 39
3598C9j41L13j94j01J21qnk3J5J06j95L68l78K52l87M09k50J80l42L43j25Q6r9
$$ 39 -102 211 17 -84 37 29 24 1 16 122 -73 295 -83 169 -218 191 -59 121 -221 122 -3 83 -16
3621a6k0n3L8J7L2M1k06J44J3j08K8J99m24M49k30N2K55k18l0J79j61K18m69L04
$$ -16 -36 -89 -51 -34 -2 39 -167 -23 -10 -118 -90 109 -315 134 -96 -44 211 -7 -37 142 -19 199 -270 34
3645C4j4j14J08M6J11l74L36l26L62j48k21K74j16K10j44j99KK43q3o4qj33L83
$$ 34 20 -94 14 60 171 -203 133 -193 169 21 -200 74 -42 168 24 -175 -173 70 -13 -77 -85 -218 165
3668A65k37P3N9J4R8J9j5j61K22m4k55M31m06J08J53k55j36J41O3j75K45q7p7
$$ 165 -72 1 60 74 172 191 176 15 237 193 -62 369 -37 71 224 -31 -167 -26 37 -138 107 20 -57
3691e7p0J52O2l71M26mj06L5j31K32j74r3L84k74J47j80j40K22rR5j54q7q6L79
$$ -57 -127 25 87 -284 142 138 32 67 -64 168 -6 -99 285 11 158 -22 -162 60 51 146 -8 -95 -181 198
3715A98k02j16k7J03r7L22k50J9R9Q3k33J06j00oJ80p6l0J97m6K45k57Kp6l1j05
$$ 198 -4 -120 -147 -44 -141 181 -69 -50 49 132 -101 5 -95 -101 79 3 -27 170 124 369 112 114 38 7 -98
3740i8J23J16k77K23o4J24l87O5J87K00j55p6l96K31K70k11k9L72k24L0j26m8
$$ -98 25 141 -136 87 23 147 -240 -175 12 212 57 -19 -415 -184 86 -125 -154 218 -6 24 -102 -150
3762a50k51K98Q9j45J14K31O9l28J27L0k2l37K72J38m47L36J71j63q1j36J57n2
$$ -150 -401 -103 -14 -159 -45 186 255 -73 54 84 62 -275 -3 135 -312 24 195 32 -49 -185 -28 -80
3784h0j13L54l83M83j55j83P1J48j59n8J80l66J60K53n7r7l16L46l4rR4j95K16
$$ -80 -193 161 -222 261 106 -77 -6 142 -17 -75 105 -261 -101 152 95 -2 -318 28 -6 -15 79 -116 100
3807A00l71K92R2j03o1K59k0k33nok4J11k42L45k2j36J9J71l45R2O1K62o7l1J27
$$ 100 -271 21 113 10 -51 208 188 -45 -50 -56 -80 31 -211 134 112 -24 -5 166 -179 -87 -26 236 169 138 265
3832B65k78K39o1l59lK39k3j88N8R7k56J53L15j13j27J09j1k99q1K78L45k68j05
$$ 265 -13 226 165 -194 -197 42 19 -169 -111 -14 -270 -117 198 85 -42 67 56 -243 -324 -46 299 31 -74
3855g4K02k99L8R8R3J16k47j07K23K03k03j78L03k00N7O9k47K61N9p5j43J67k23
$$ -74 128 -171 -133 -35 58 174 -73 -180 43 246 43 -135 168 -32 25 94 -153 108 167 92 -51 116 -107
3878a07K81J31j60m40L98r1J00J1k56M43m85L64j62J06l83J62K31k9r4j79O3j45
$$ -107 174 305 145 -295 103 12 112 123 -133 310 -175 189 27 133 -250 -88 143 114 20 -159 -96 -241
3900b41Q2L24k69mQR9j16J75K64m67J37Q5%o0k67K93k08J3L06l69K08K22l01J06
$$ -241 -159 165 -104 -108 -100 -1 -117 58 322 -145 -8 77 77 17 -250 43 -165 -152 154 -215 -7 215 -86 20
3924B0M4Rj57J44K18k09j52P7qp2m4J96p0K56l8j99Q8n2j22K36k05K53k39j40
$$ 20 64 73 -84 60 278 69 -83 -6 -14 -86 -130 66 -4 252 214 15 103 51 -71 165 -40 213 -26 -166
3948a66K92k69q0P6L39k69j70L15j06j6K7J33Pj31O1l0k62L37M2j34j42J51m18
$$ -166 126 -143 -223 -147 192 -77 -247 68 -38 -54 -27 106 113 -18 43 13 -249 88 130 -4 -146 5 -413
3971d13J25L66j89N7L68l56J14j31j28J65o8K93j40l2L0R1m4k41j13K77M1k20
$$ -413 -288 78 -111 -54 314 -42 72 -59 -187 -22 -90 203 63 31 61 152 108 -133 -246 31 72 -148
3993a48J30O0M48m15k41J34J6k0KJ29l35L53j42P9j03j3M5k55M34n8k89R7J10
$$ -148 -18 42 490 75 -166 -32 -16 -36 -34 95 -240 113 -29 50 -53 -66 -21 -276 158 100 -189 -92 18
4016A8J83K4J95l60j08J15L6k62K3K9m6K41k34p3K38k9M8K7j98J94Mr9K26k50
$$ 18 201 225 420 60 -48 67 103 -159 -136 -107 -153 88 -146 -219 19 -10 38 65 -133 61 65 -34 192 -58
4040e8n4R1j17q7J75R5r7J43Q0m00M26l44J40j09K09l1j89n7k4J83j35J70K4j07
$$ -58 -112 -21 -138 -225 -50 45 -52 91 171 -229 197 -147 -7 -116 93 62 -127 -184 -208 -25 -160 10 34 -73
4064g3j81J54J43j75J71P0j11j07J69l50L33M5j68L8M7L36m50j2PL27j18J24m07
$$ -73 -254 -100 43 -132 39 109 -2 -109 60 -290 43 88 -80 -42 5 341 -109 -121 -114 213 95 219 -188
4087a88K97J08j28j63P8J12k22J55k72L83l91M56n89M54k26j01J68k3L09p4r0
$$ -188 109 217 89 -74 4 116 -106 49 -223 160 -231 225 -364 90 -136 -237 -69 -92 217 143 53
4108E3m2k35L14M7J35k03J89l00J16P2j21j97j48L94L3o9q8J30m4K6k3K59p12
$$ 53 11 -224 90 137 272 69 258 -42 74 146 25 -172 -320 74 107 38 -50 80 36 62 39 298 -414
4131d14M39J49r9qO0n0j36P3R7j8q1J13M1j88J82N0k61M9mJ88k36j13JJ77J73
$$ -414 25 174 75 67 127 77 -59 14 111 93 12 125 166 -22 160 210 -51 -2 -6 182 -54 -167 -166 11 184
4156A84j36p2N4j48J79j20P6M6j91K1K4J15o9J93l00R1j9K1P6k36L36r4l00K39
$$ 184 48 -24 30 -118 61 -59 17 63 -128 -107 -83 32 -37 156 -144 -53 -72 -51 25 -211 125 31 -269 -30
4180c0K66l70K86j38j48J6N2K85k02O0J09O1l04k8j92L51k07K59k50m2K6O6L7
$$ -30 236 -134 152 14 -134 -118 -66 219 17 77 186 247 -57 -85 -277 74 -133 126 -124 -166 -140 -74 -37
4203c7j9P4J75n5J3j81r8L84k44k2j6J56K1o45N22R9k55K25j23N5m2j2L21k60
$$ -37 -56 18 193 138 151 -30 -128 256 12 -10 -26 130 151 -494 28 127 -128 97 -26 29 -13 -25 296 36
4227C6j08j69L18k65M65k79K51k36j83K48M4k10K9J03pn8JL7R9j59K20J3k53L14
$$ 36 -72 -241 77 -188 277 -2 249 13 -170 78 122 -88 -59 44 37 -21 -20 17 116 -43 177 190 -63 251
4251B51k71L90l37J8kl7Q4l9q7K22j09l5k81K22K37l07J29j25L00r3mk23K80k54
$$ 251 -20 370 33 51 49 12 96 57 -30 192 83 48 -233 -11 226 -81 48 -77 223 130 126 -97 183 -71
4275g1L8J05k01N4Jj18K91J12r4n0k01q2J42n0K01m1j06J13k1k73L15k98J75J78
$$ -71 -33 72 -129 -75 -74 -192 99 211 117 67 -134 -216 -74 -124 77 36 -70 43 22 -251 64 -234 -59 119
4299A19j58J41l6j66m1J87J3Mnj79J92j8J60k69J42k32R3K29l63N15R5l87j82
$$ 119 -39 102 66 -100 -141 46 59 63 58 -121 71 53 213 -56 86 -146 -53 176 -187 328 423 36 -146
4322a46K77j30K05j99k8r4J18K8m9J22j10K7j4j17J73J80k07K26l30J54j15N3
$$ -146 131 1 206 7 -21 -115 3 31 -18 104 -6 21 7 -110 63 243 36 262 -68 86 -29 24
4344B4l0j11j06K46O2Q8l82L71j22j45KK74j28m3J11R7P8j40l85K59k9j45M69
$$ 24 -6 -117 -223 23 85 173 -209 162 40 -105 -103 171 43 0 111 208 286 146 -239 20 -9 -154 315
4367C15m48q1L95k04J68kQ8k81K19k44K22j81k42J17J51RJ08M9k74j31J84QJ78
$$ 315 -133 -214 181 -23 145 143 231 -50 169 -75 147 -34 -276 -159 -8 1 109 158 -116 -247 -63 -55 123
4390A23M9k77P1j54K40l10L08j33k7L90k04l7j10j05r5K33p9J5K44j49l86M72
$$ 123 172 -105 -34 -188 52 -258 50 -83 -110 280 76 39 -71 -176 -271 -38 -117 -102 142 -7 -393 79
4412G9r7O9L09l39J4O8n6L1l29J99n4p9L59J01m71M58r1l03J42J63k03N4J49k60
$$ 79 -18 51 360 21 35 103 47 78 -251 -52 -106 -185 174 275 -196 262 171 -132 10 173 -30 24 173 -87
4436h7L36k43J37k68Q2K2J43n2k40J07n8K42k69J96k39L45n33K86J55P4k81P3
$$ -87 249 6 143 -125 -43 -21 122 70 -170 -63 -121 121 -148 48 -191 154 -379 -93 62 136 -145 -72
4458g2nL7J51l06L29J56l85J14j87K54j26j04L25k01L5RQJ15n15L22n1K61k32
$$ -72 -77 -40 111 -195 134 290 -95 19 -168 86 -40 -144 181 -20 15 24 32 147 -368 -46 -97 164 -68
4481f8O6K71l42j6pL47l91J64O4n24L28R2L03l58k8J61K03m48O4P2M7j2J8j20
$$ -68 -2 269 -73 -89 -96 251 -140 24 88 -436 -108 -16 287 -71 -99 62 265 -183 -119 -47 0 -12 6 -114
4505a14PQ4J12k05l7J70J60k36k1K37k62j85L49l20K38J53l01J00M4k54K73n1
$$ -114 -107 -23 89 -116 -153 17 177 -59 -80 157 -105 -290 59 -261 -23 130 -171 -71 -27 -281 -8 -59
4527e9q6K37K1qj83K33j69J92k01j34K58m29L36k71K59r7Rj12P7K80n34N40j74
$$ -59 -145 92 113 105 -78 155 -14 178 -23 -157 101 -328 8 -263 -4 -101 -92 -204 -127 153 -381 159 -15
4550a5n4M5J60r4K4K73k36L9L2k53L55k15l60M64Q8l06K3M0qJ88k49L60j91n1
$$ -15 -69 -24 136 42 66 339 103 142 174 -79 276 61 -299 165 253 -53 -30 10 2 190 -59 301 110 59
4574E9m2j64R8J01J5pR9k75QJ43m9J47o7J48k33K00p3j12J01n4j07K86r5m2k02
$$ 59 17 -147 -49 52 67 60 159 -116 -108 35 -14 133 66 214 -19 181 108 -4 97 43 -64 222 127 85 -117
4599a17J28q3K58n9k7q7p8l0O8K5J10J28m43L23j54K21j30L2p8M8l21M93l16K67
$$ -117 11 -72 186 127 100 13 -65 -95 -27 -2 108 236 -207 116 -38 183 53 85 7 55 -266 227 -89 178
4623A78j89R4J9J20l65K47p7J67l85qN7J10J38j62R2mK4r7p0K9J04p8m9k19M12
$$ 178 -11 83 102 222 -143 104 27 194 -191 -199 -142 -32 106 -56 36 32 56 -41 -111 -82 22 -56 -105 -324 88
4648H8q2j24L4J64k38K18m15K79K66k47K62k73J46j71n7L48l79J00O0j85K08j91
$$ 88 6 -118 -84 80 -158 60 -355 -76 190 -57 205 -68 78 -93 -150 198 -181 -81 -21 -206 2 -189
4670a89O4j73M74m52J73K48k47J18KJ17m6j43rN9N0k24J04K63k80j85J41L46k18
$$ -189 -125 -298 176 -276 -103 145 -102 16 18 135 89 -54 -63 -4 46 -178 -74 189 -91 -276 -135 211 -7
4693gk2pJ34O1j8p4R1k27K6r5K19j3j63L12l32p8L23k27j89M81j15n5K1j78J38
$$ -7 -29 -36 98 159 141 67 158 -69 -43 -138 81 68 -95 217 -115 -193 130 -97 -286 195 80 25 46 -132 6
4718Fm6j86L15l13K98m4J9J7r9j05J98J61j41r3J53j10K3J55K2k29J48m47L68
$$ 6 -40 -226 89 -224 74 30 49 66 -33 -138 60 221 80 -13 140 30 53 208 230 1 149 -298 70
4741G0k51R9K5K75k60J54j58Q0J03j83L03j22k03q2J85R9r6l1P0o7j21L10L2k19
$$ 70 -181 -82 -57 218 -42 112 -46 34 137 -46 257 135 -68 -150 35 134 38 7 77 10 -111 199 231 12
4765A2L07j51k21O6o8L1K95k54k22J18L04m15K26q7N5L9j22J8M2J87l28J40N0
$$ 12 319 168 -53 13 -55 -24 271 17 -205 -87 217 -198 28 -59 -4 35 -87 -69 -27 160 -168 -28 22
4788B2N3R9j92mK33k18l3J70k07R3J20q9J9l31J81J82k18J47Ok17J20L55m61J43
$$ 22 75 174 -18 -22 211 -7 -40 130 -77 16 136 47 66 -265 -84 98 -120 27 33 -184 -64 291 -170 -27
4812b7K11l61K59j33m7J5P9K13p2J01j40K27j84j75j0k51O11m36K30k54J66M3
$$ -27 184 -177 82 -51 -98 -83 -4 209 137 238 98 325 141 -34 -44 -295 316 -120 110 -144 22 65
4834F5K94n15K72J28k37m8L24r9k90k2M08n29K60k9K95m08K26k17j17J10k39M98
$$ 65 359 -156 116 244 7 -41 283 184 -106 -128 280 -249 11 -18 277 -131 95 -122 -239 -129 -368 130
4856A30k07J66k03j50L44M8R2k13K25k34k51K58m8J77k73K46r9p1Lm8O4L85j30
$$ 130 -77 89 -114 -264 80 128 220 7 232 -2 -253 5 -43 134 -139 107 8 -63 -60 -108 -44 341 211
4879B11j20k12K31k54K39j18j76L99o3o4l2k7j7m5O1j22k25K20K08k62L61j36
$$ 211 91 -121 110 -144 95 -23 -199 200 137 73 41 14 -3 -48 13 -109 -334 -114 94 -168 193 57
4901E7J23j55j69N25l16k7L16m05O6K54k10m01P11j4k83m19K61J54r5J92r6Mk07
$$ 57 180 25 -144 381 65 38 354 -51 15 269 59 -342 369 355 72 -347 -86 68 -27 165 69 73 -134
4924a34j91M91j15K1N8k02J1R0m6j38K91k2j27j17j65K74N4J6l0l05L65j82k5
$$ -134 -325 166 51 72 130 -72 -61 29 -17 -155 136 114 -13 -130 -295 -21 33 49 19 -286 79 -103 -128
4947a28K88j52OJ24l1k6j26O3j51J14j61J81K58k99P6Q6k8j71J62k70K44Ol03
$$ -128 160 8 14 138 107 81 -45 18 -133 -19 -180 1 259 -40 36 122 94 -77 85 -185 59 65 -238
4970b38K3K07k42J90K65Lj79R9o7l34N57l37J39J24j40K0j39L79k00j10K12j40
$$ -238 -215 -8 -250 -60 205 208 29 128 61 -273 284 -53 86 210 70 90 -49 330 130 20 232 92
4992I2J17l46r0J10K31k37K5J42M7J17j87m0j80K55q4J61K07k98j72J66o0J18
$$ 92 209 -137 -227 -117 114 -123 -98 44 91 208 21 -19 -199 56 -28 133 340 42 -130 36 -24 94
5014I4N2j95L34k68Rq0L59n5k19M8pJ9lO1k34J35o5Q5P5m49J28J5K72q7j43J78
$$ 94 146 -49 285 17 26 -54 305 250 31 79 72 91 88 149 -85 50 -15 70 145 -304 -176 -161 111 24 -119 59
5040E9m57L69P6N3J87m48J25K16j91k45L44o2J48k73J88J33m6n5m9o4J5k9P2j35
$$ 59 -398 -29 47 100 287 -161 -36 180 -11 -256 88 26 174 -99 89 222 176 121 72 8 23 -6 66 -69
5064f9J51l0k57p3M97l00Q0j29K91j41j00K02k43K08m29M7N03l13j48N07l65N2
$$ -69 82 52 -205 -278 219 -81 -1 -130 161 20 -80 122 -121 87 -342 -295 208 -105 -253 254 -111 -59
5086e9j94J6M61k52J18k89M64j55j36p5K24l01J80j19M2L50k41k5j5k51L22L8
$$ -59 -253 -237 224 -28 90 -199 265 110 -26 -101 123 -178 2 -117 -75 275 34 9 -6 -257 65 103
5108A03l30K64k24K1k35K95n7j04M92J25n82J46J58J10Q8m36qK53J17j07j39J15
$$ 103 -227 37 -187 -166 -401 -106 -163 -267 225 350 -232 -86 72 182 270 -166 -174 79 196 89 -50 65
5130F5j95L25k28K83m56J14O7J91k21pL6q7j1J28j27r3J69N7O3k34KJ59L26k90
$$ 65 -130 195 -33 250 -206 -92 -25 166 -55 -62 -26 -113 -124 4 -123 -216 -47 10 73 -161 -159 0 326 36
5154C6J01j05J54k51j9j44M20q6m17L41n6J91k74J29o3j58K06j66K58j18P9J44
$$ 36 137 32 186 -65 -84 -228 192 106 -311 30 -26 165 -109 20 -43 -201 5 -161 97 -21 58 202
5176B02m28K37o8j85K46l35K58L19l63J37j71J06M7k00L91l68J60J18k2J23l21
$$ 202 -226 11 -57 -242 4 -331 -73 246 -117 20 -151 -45 2 -198 193 -175 -15 103 81 204 -117
5197a17J19j50K23o0k88M04k33N1J76k45N9J1M38m71K67j53n3j21K81k0l30L20
$$ -117 2 -148 75 15 -273 131 -102 -51 125 -120 -61 -50 388 -83 184 31 -22 -143 138 118 -212 108
5219A08j76J81J85l88M7n1J00j89k07K60k2j53J09K17J57J17j18k02q7L06p5r5
$$ 108 -68 113 298 -90 -43 -94 6 -183 -390 -130 -152 -305 -196 21 178 295 177 -25 -112 194 119 24
5241B4L75m36O2O5J18j05k58K46k49J65JK60k86k21M2J12L49m12K57j4L9k66L91
$$ 24 399 -37 25 90 208 103 -155 91 -158 7 8 268 -18 -239 -197 -85 264 -148 109 95 134 -132 259
5264B59k76J29k9j74J50j00k1Q8n3J11kJ63k98J39n8J80k54L9K57k55RJ29j33
$$ 259 -17 112 83 -91 59 -41 -62 26 -27 84 82 245 -53 86 28 208 -46 -7 250 -5 4 133 0
5287@J72r6Q6rK6j03j81j9K27l18L51n6J74Qk17K3j21O3o7RJ08mk7j35M06j69
$$ 0 172 76 162 153 179 76 -105 -124 103 -215 136 80 254 262 45 68 -53 10 -57 -48 60 56 29 -106 300 131
5313A31n6m1k43pK54L4r0J4Q5O0j98J70l09K74Q8l30J66P6j70K8J92m44M62n8
$$ 131 75 34 -209 -216 38 72 -18 -4 81 141 -57 113 -196 78 166 -164 2 78 -92 -64 128 -316 146 88
5337H8q2J13k16J52j5K00k46J03K6L3o5k75K0J33M7r0K07k4k5mj7j48J57k6K8
$$ 88 6 119 -97 55 40 240 -6 97 123 156 91 -184 -164 -31 16 -74 133 109 84 80 63 -85 72 46 74
5362G4l9N9m4k31J6K05J52k12j4m9j64J44K41r7qP4j03R9l85J12Q5J16j52p2J21
$$ 74 35 94 50 -181 -165 40 192 -20 -34 -83 -247 -103 138 41 33 107 4 103 -282 -170 -85 31 -121 -193 -72
5387g2j27N3J51r7J56l0l7L04k41j83l72O02j5l25R6K14n1J8N1n0j3k73J38J10
$$ -72 -199 -146 5 -92 64 34 -3 301 60 -123 -495 107 92 -233 -137 77 26 44 95 45 32 -241 -103 7
5411Gj56J15K0J88J93j72m7j48J18j06jj78J87j69J62j57K13k11J89q7J4P3L6
$$ 7 -149 -34 -14 174 367 195 148 0 118 12 11 -167 20 -149 13 -144 69 -142 47 -40 -26 47 83
5434H3J11j98K78k83J23Oj52NJ72k19J61r8J48k69M1nN07l24j02R0J27n58M64
$$ 83 194 -4 274 -9 114 120 -32 -27 145 -74 87 -11 137 -132 -91 -96 411 87 -15 75 202 -356 108
5457A08q8k37K59J55k38O4N6j47k05K82J42k7k06J70j45r6K83K6pk94K41j90j0
$$ 108 20 -217 42 197 -41 23 79 -68 -273 9 151 124 -82 88 -57 -153 130 156 149 -145 96 -94 -104
5480a04J5j4Q7o2J19L4l13L1Q2L03l46O3Q8j09J47L04l69K57j27k7rj33K0J73
$$ -104 -89 -103 -16 -78 41 75 -238 -207 -125 178 -168 -105 -17 -126 21 325 -44 213 86 59 50 -83 -63 110
5504A10q8p4K5J18n3l3PR1j1N1j18O0j77J7J47j15j46K34M8j18k20J33N6q7K46
$$ 110 22 -52 -27 91 38 5 12 103 92 143 25 85 -92 -75 72 -43 -189 45 93 -25 -245 -112 -56 -143 103
5529A03m29K91J8L41k20J3K7j55j82L65k70N5J63K1k28M4P6j81K3K61j89L6L57
$$ 103 -326 -35 -17 324 104 117 144 -11 -193 172 -98 -43 120 141 -87 -43 33 -148 -125 136 -53 -17 340
5552C40n76M3K39j27J96k24J71N6M3k32j28J83k0j28K62j24j02K3k80L55m5J57
$$ 340 -236 -193 46 -81 115 -109 62 118 161 -71 -199 -16 -36 -164 98 -26 -128 -105 -385 -30 -75 82
5574H2j04J54l20K53j06k8L6J73j59j65J71K01j01P4j25R0J1n7M2o2j3j02j16
$$ 82 -22 132 -188 65 -41 -69 -33 140 -19 -184 -13 188 87 161 36 126 137 80 122 60 47 -55 -171
5597a71L31m66l5K22R2L9L44k71j87K87qj74Kk87Q5K23K44k69J62k19J42J2l55
$$ -171 160 -306 -341 -119 -27 12 356 85 -102 185 177 3 5 -282 -197 26 270 1 163 -56 86 98 -257
5620b57K17M29m21m3mj9J82Km28N91l38M1J84k52J4J84k15J74j95M08k88J12K61
$$ -257 -40 389 -32 -75 -79 -98 84 86 -342 249 -89 -48 136 -116 -102 82 -133 41 -154 254 -34 78 339
5643C39m81J32j34L04k92J1J50l2o3K30j03J08m8j19K96l96K44Q3j56O3j10k05
$$ 339 -142 -10 -144 160 -132 -121 29 -3 -66 164 61 169 121 2 298 -98 146 229 73 136 26 -179
5665a79M26j52j85pJ35j9R9m5j82K39N8%l63L40J04k55j45J63p2L34k41j17J32
$$ -179 247 95 -90 -97 38 19 118 73 -109 130 188 188 -175 165 269 14 -131 32 -40 294 53 -64 68
5688F8K95j42On4l91M57l47R9j38L67Q3l64J17j52J55k44k7M8L78k27k07J55J82
$$ 68 363 221 227 173 -218 239 -108 -9 -147 220 303 -61 56 -96 59 -185 -212 -164 214 -13 -220 -65 117
5711A17k64l7L78j25j62K66j3Pj00l5Rj25Q4j35J10J74j47J04k46M50j78j74j23
$$ 117 -147 -184 194 69 -93 173 160 167 67 32 41 -84 0 -135 -25 149 2 106 -140 310 132 -42 -165
5734a65M04j83j79%j49M15P6k77j2r5K40j23M3m7L7K48k33m6Q6m7Q9j22q7j6N1
$$ -165 239 56 -123 -123 -272 143 219 -58 -70 -165 75 -48 -5 -52 -15 233 0 -46 40 -7 82 -40 -127 -143 -92
5759i2J85k77J14J44j61J35k9pPJ92p5m02K60K55l58j3K31j49K35j29k4k73L6
$$ -92 93 -184 -70 74 -87 48 19 12 19 211 136 -266 -6 249 -109 -122 109 -40 195 66 42 -231 -195
5782a95L30j98K90m3j92J11QO3j97J86p6PJ6j20J33k02K13j10n1K0L9p3j4J44
$$ -195 135 -63 227 184 -8 103 111 174 -23 163 87 94 110 -10 123 -79 134 24 -27 -7 32 -41 -55 89
5806H9k11K36j13l1n9J56k34K41%K1j05p9J27M1p4J89j94k12L19k11qk4J12K32
$$ 89 -122 114 1 -30 -89 67 -167 74 74 95 -10 -89 38 79 5 194 0 -212 107 -104 -112 -136 -24 208
5830B08j86j41R6J88J1j8j61l3Q3R0q0M4p4k24J47R5q4M4j4M4J5k9k84J0J62O3
$$ 208 22 -119 -23 165 176 158 -3 -36 47 137 57 101 27 -197 -50 45 -39 5 -9 35 50 21 -263 -253 -91 -28
5856b8L65k89oj09N2oj25J14J34K35k60k92J15k8j3J75K11j89k03J44l6J3K74
$$ -28 337 48 42 -67 -15 -21 -146 -32 102 337 77 -215 -100 -128 -141 34 245 56 -147 -3 -39 -26 248
5879B48l00pR7n4P7k37P6M6K24m56L61J34k04J56l52M79j51l22J79O2k43K96j71
$$ 248 -52 -59 38 -16 61 -176 -100 -54 170 -286 75 209 5 161 -191 288 137 -185 -6 56 -187 109 -62
5902f2N9j71L3L5J08O3q7R8k10J47J12l1p5J1J60O7j46Jo4o7j43R7J49rK0J37
$$ -62 -3 -174 -141 -106 2 65 -22 76 -134 13 125 94 19 30 190 257 111 112 48 -19 -162 -65 84 75 95 232
5928B32l42J04P6q9J11K5k0k59J15n8K32p8RJ44m5L0k57O9j22K34k30n7L21r1
$$ 232 -110 -6 70 -19 92 117 97 -162 -47 -105 127 49 58 202 157 187 -70 -1 -123 111 -119 -176 145 54
5952E4j38K5O1k06J70O2k66R5J49N9j33o0R6j25k8K5K38m1j78o7K51lj43N5J5
$$ 54 -84 -59 2 -204 -34 28 -238 -143 6 65 -68 -128 -32 -157 -185 -160 78 37 -141 -208 43 40 -103 -48 -33
5977c3K02k63J01l5j5J30Q3r6q0R0j28n5J22p3p3q8M15m47Q5K41k03L01Q4m25
$$ -33 169 -94 7 -28 -43 87 170 74 -6 84 -44 -99 23 -50 -123 -211 204 -243 -158 83 -120 181 265 -160
6001a60L19L2k83J89q2j55K76j78K42j01k78M34k36k67P8K91j82j56L00j54M1
$$ -160 159 191 -92 97 15 -140 136 -42 200 99 -179 255 19 -248 -170 121 -61 -217 83 -71 -30
6022c0M0Q0r9K42k51R0k41J18P3m48M01l3M5J54M3j94K28j74k1Q3j36j48K17j01
$$ -30 10 90 -9 233 -18 72 -169 -51 22 -426 -25 -58 -13 141 184 -10 218 44 23 106 -30 -178 39 -62
6046f2K5k3J31k04J79j05K44l02K68j10k44K55o5p1J27J95k72L95m17j30J09P1
$$ -62 -37 -60 71 -133 46 -59 185 -117 151 41 -203 52 -13 -84 43 238 -34 361 -56 -186 -77 -6
6068fK22o0l78J33j00J64J34k60J00j9J41r0K87k08j79J77j10J29o6K27l41j5
$$ -6 216 156 -222 -89 -189 -25 109 -151 -51 -70 71 -19 268 60 -119 58 -52 77 11 238 -103 -118
6090a18K0q4O1J83n1L3R8m11L32R2k54J59m25M13J44lj42k14L52k57L4j61J86
$$ -118 -98 -182 -121 62 11 44 142 -269 63 155 -99 60 -365 48 192 189 47 -167 185 -72 -38 -199 -13
6113a3J24k40K88P6j05r5O3k0j00K25O8j34j10J40j86o3L17k08j50K42r7K08l25
$$ -13 111 -129 159 235 130 35 98 78 -22 203 271 137 27 167 -19 -82 235 27 -123 119 22 230 -95
6136i5K00j29o8J97k11J57p0l9k83L19j95J27J65J26o6L48l83J0j50K78k81j33
$$ -95 105 -24 -92 105 -106 51 -19 -58 -341 -22 -217 -90 75 201 135 483 100 110 -40 238 -43 -176
6158a76L96j32k30Q9J78j01K8J0l18L04K78l88k08J07J39l4P6j29J49j92K64l11
$$ -176 220 88 -142 -53 125 24 52 62 -256 48 326 -62 -270 -163 -24 -58 18 -111 38 -154 110 -201
6180b01L65p4J88l33o5J78j92J00O2L7%p2J03j0n9j4j32K4pn3M4M0J08J93k57
$$ -201 164 90 278 -55 -120 58 -134 -34 28 65 65 -7 96 86 27 13 -119 -95 -102 -155 -111 -71 37 230 -27
6205b7L13j29k11K11j99j77L33J53m11M42l33J32J47k73J46L6q6j39Kq7K05j2
$$ -27 286 157 -54 157 -42 -219 114 267 -144 298 -35 97 244 -29 117 153 67 -72 -70 -157 48 36
6227C6k00L0L5J24J32k46j85L88j17J5J23j9k37J97p4k16L5J86L0RJ25q3p7j86
$$ 36 -164 -134 -99 25 157 -89 -274 114 -3 12 135 116 -121 76 2 -214 -179 7 37 46 171 88 11 -175
6251a75J44r1J97m89M20l2j30J72Rm30L06K27j33q6n0J05J76j27q9P1j24J47k76
$$ -175 -31 -122 75 -414 6 -26 -156 16 25 -405 -99 128 -5 -91 -141 -36 140 13 -76 -5 -129 18 -258
6274b58J13L58j87M7k3k82J86J97m9R4k65J94j58j78J19J10O5k8m4j45J92j70
$$ -258 -145 213 26 73 50 -232 -46 151 102 196 -69 125 -33 -211 -92 18 83 55 11 -134 58 -112
6296a12K63j78J7L65j52j35j54J03Lk48R0O3j66L09k43J18j31Q9K91k29Q0o0l1
$$ -112 151 -27 -10 355 203 68 -86 17 20 -228 -138 -75 -241 68 -175 -57 -188 -99 192 -37 43 -17 -48
6319d8K25l4k71J21j54L09j22L0j87K14q8J39l32L39k3j82j66N8M29n1l4j42J94
$$ -48 177 143 -128 -7 -161 148 26 56 -131 83 -5 134 -198 141 118 -64 -230 -172 257 206 172 30 224
6342B24l80L98o1k62N9N9J26j29Q4m10K37P9j37J88P8J51j21m7l9k32L18p5m08
$$ 224 -156 242 181 -81 -22 37 163 34 118 -292 -55 24 -113 75 153 304 183 136 97 -135 183 108 -300
6365c00Q3N07j61l55K47j9J45k1k46J59j74m9J67k35L26km0Q2p1q0J78k61k0K9
$$ -300 -217 290 129 -226 21 2 147 126 -120 39 -135 -184 -17 -252 74 72 32 114 43 -37 141 -120 -140 -111
6389a11J76J81k77K15m36L33j57L88k11m9j17K7O8j0k80J75M4J20K17j74j52J15
$$ -111 65 246 -31 184 -252 81 -76 312 101 52 -65 -38 30 20 -260 -85 -41 79 296 122 -30 85
6411H5j25J49J62l56R2J62j00o9P7k85L42l1k94K54k5l5J53l40J36O1J3k72J29
$$ 85 -40 109 271 -85 7 169 69 0 77 -208 134 103 -191 63 38 3 156 -184 -48 13 26 -246 -117
6434a17J28Q3q6j6pk19P2J09O8k13J13K83j03r1K79k99oR5K27l66m8J27J03l95
$$ -117 11 94 8 -8 -15 -234 -162 -53 15 -198 -85 198 95 4 283 -16 -22 73 300 -66 -114 13 116 -279
6458b79J44K3M97l78k91K07K46j23j88R3K60p2k77J82r4L55k93J34J03j86n5N8
$$ -279 -135 -112 385 7 -284 -77 169 46 -142 -49 211 139 -138 44 -50 305 12 146 249 63 8 66
6480F6R4l33K08O5m1N0pj52j7J23J02k78L75k62M9J3P1l0k03P9Q1q9o5K25k88
$$ 66 160 -173 35 100 59 109 102 -50 -67 56 158 -120 255 -7 42 55 126 96 -107 -28 53 -36 -101 124 -164
6505a64J83K55k58J06J06l97K85l09q1K76K3j15J16j4k22L40j49n6K83l64K20
$$ -164 19 274 16 122 228 -169 116 -193 -274 2 25 -90 26 12 -210 130 -19 -75 208 -156 64
6526F4M1p8n6n4pj7J10J7R4Q5J4k76k6K68k2j56k12M22j75P4j88K90k06J20o0
$$ 64 105 27 -29 -83 -90 -107 3 20 114 199 213 -63 -89 179 157 1 -211 211 36 110 -78 212 6 126 66
6551F6k53k8K48J77k99L8K46k86O1M5P6r5K7J80k25J3j58J52k47L12n1j88q5R1
$$ 66 -187 -215 33 210 -89 -51 195 -91 -30 15 91 -4 23 203 -22 -9 -167 -15 -262 50 -1 -189 -274 -183
6575a83P1N2N8M8R1O7j40J45L3r8r0Q5j82K05M7M7k25J27k98j23K17J8Q0k88M10
$$ -183 -112 -60 -2 46 137 204 64 209 242 144 54 139 -43 162 209 256 31 158 -140 -263 -46 -28 52 -236 174
6600A74k95O2M0n9J16p6m3m2l1K65O5m00J30L7J93m41K72J8k35J97M8M1K7r2j63
$$ 174 -121 -59 -19 -78 38 -38 -81 -123 -154 111 176 -224 -94 -57 136 -305 -33 -15 -250 -53 -5 36 63 -29 -192
6625a92K01J77j56l65M62l02J84J77j88j27K47k19L2J22j16J01n2p4J32lJ04l29
$$ -192 9 186 30 -335 127 -175 9 186 -2 -129 118 -101 -69 53 -63 38 -14 -88 44 41 145 -184
6647a84K1L2J82J03j9k48R9j59K64j50j60K95j99J82j05J47P9l8k86J77j45J32
$$ -184 -163 -131 51 154 135 -113 -14 -173 91 -59 -219 76 -123 59 -46 101 180 142 -144 33 -112 20
6669B0O4p7L7l2K7r1J03p9J55j01M2k9L1L28k52l0l24L14j50J8pL50n45N8K03
$$ 20 84 7 44 12 39 -52 51 -28 127 26 68 39 70 398 146 116 -208 106 -44 -26 -33 317 -228 -170 33
6694C3k19J25q2J81p6J7R5n1K31j61j01j09M93j49j30Lp2K09j92j48J59j50K63
$$ 33 -186 -61 -143 38 -38 -21 74 23 254 93 -8 -117 376 227 97 100 28 237 45 -103 56 -94 169
6717A69J26k76j17J29J03j60j89K27J18k33J1J62J26l11J19j09K38j78J02M9k75
$$ 169 295 19 -98 31 134 -26 -215 12 130 -103 -92 70 196 -115 4 -105 133 -45 57 106 -169
6738a69K62j56j34R8J46K6k78M6P9N2J34j59M1P0k38J07K7n6K39K7K06k81j24
$$ -169 93 -63 -197 -99 47 73 -205 -159 -80 -28 106 -53 -12 58 -180 -73 -46 -102 137 164 370 89 -35
6761c5J41k65j93M21k52Q4J20J81k93JJ90K4l07J01J61q6o8J74o2P4r4K6L5J24
$$ -35 106 -159 -352 69 -183 -99 21 202 -91 -90 100 124 -183 -82 79 -7 -75 99 37 111 17 43 78 202
6785B02j01m8J0R9j13J72j79Pj5p6K55k56n4J63j16K51j58r8J10r9J05j24K11
$$ 202 101 53 63 162 49 221 42 49 34 -42 213 -43 -97 66 -50 201 43 -55 55 -44 61 -63 148
6808A48m9L5r4OJ0L2J00k94K12l10P2J33K27l93l5J00J45k9n6j2j0L96k44k98
$$ 148 99 134 40 46 56 88 188 -106 106 -204 -132 1 228 -165 -200 -100 45 16 -40 -52 -62 334 90 -208
6832b08N28k27M1l38K33k14K6J50j48J53k41J84N7L0O1j77%j06J86J89j14L5l35
$$ -208 320 93 134 -204 29 -185 -159 -9 -157 -4 -245 -61 -4 26 87 -90 -90 -196 -10 179 65 100 -235
6855b35K13J7r6k2Q1J88l26j7J76L6k19J45K17k47K53k63L2K96k46J77j39n1P
$$ -235 -22 -5 -101 -123 -42 146 -180 -197 -21 15 -204 -59 158 -89 164 -99 -67 229 -17 160 21 -30 -23
6878b3j47L4k2J84k65L40l15N29m44j01L03j13M1O8l0k32J92l75M24q7K02M2l64
$$ -23 -170 -136 -158 26 -239 101 -214 315 -129 -230 73 -40 1 69 39 -193 -1 -376 48 -39 163 205 -159
6901a59J20J55Pj64j04L04o3m11M70j25q8K22k03J93J07m38j53J36j8K33k10K72
$$ -159 -39 116 123 -41 -145 159 96 -315 155 30 -58 164 -39 154 261 -177 -330 -194 -212 21 -189 83
6923H3J57n0l03K03q5Jj47L94Jl11j26K26k56M56j36k14J22N4Kj07r6J84j55K83
$$ 83 240 190 -113 90 5 6 -141 253 254 -57 -183 43 -213 243 107 -107 15 69 71 -36 -132 52 -103 180
6947A80k4l66L60j24L5j72O5k6o6J94P5K4k07J30J02j47p0r0J58o1k4m3J3P3k76
$$ 180 156 -210 150 26 61 -111 -46 -72 -138 56 131 155 -52 78 180 33 -37 -127 31 -30 -54 -97 -84 -11 -287
6972b87J31k8N5j0J91j11K01J22m24O4N0J63K04m42rL53k11J40l07M4K43j62j46
$$ -287 -156 -184 -129 -139 52 -59 142 264 -160 -96 -46 117 321 -121 -130 223 12 152 -155 -111 132 -30 -176
6995a76L12j26K12Q1l70J83m3J19j02P7p1l45J06R9k3J53j29j05q3J93p3R2k2
$$ -176 136 10 222 303 -67 116 73 192 90 167 96 -249 -143 -44 -67 86 -43 -148 -231 -38 -111 -19 -41
7018d1M8J78k30Q5j05L25l33P9k16Q1J65m3J25j93J17L16k93J58l15K17j69j56
$$ -41 7 185 -45 40 -65 260 -73 6 -210 -129 36 -7 118 -75 42 358 65 223 -92 125 -44 -200
7040b00RJ23k52J52L10j22j29J37r1J18J38m72K25J22lk19j20M01k51r2j86L30
$$ -200 -191 -68 -320 -168 142 20 -109 28 -63 55 193 -279 -54 68 65 -154 -274 127 -124 -216 -402 -72
7062g2K54k93K93j48j74O5j2L1l3K48k64j27J66J09p9L10l89J17K28k77M8M3o7
$$ -72 182 -111 182 34 -140 -75 -87 -56 -89 159 -105 -232 -66 43 -36 274 -115 2 230 -47 1 44 -23
7085b3K03l13M33k02k42K89J18j93j14K0j35K59J52Om07k27K83K89k34r0J49l81
$$ -23 180 -133 300 98 -144 145 263 70 -44 -24 -159 100 252 258 -149 -376 -93 196 -38 -128 21 -360
7107c60N53j23j82L4j94L58j90K4j98K82J83j53o2J01j79r7K97k69K63k56K33
$$ -360 193 70 -112 -78 -272 86 -104 -80 -278 4 187 34 -28 73 -106 -203 94 -175 88 -168 65
7128F5j86O6J70l70Q9L20o6k05J01r7M4J97l08L2L03qk30Mk3J20J30l4K68k66
$$ 65 -121 -55 115 -255 -166 154 88 -117 -16 -113 -69 128 -180 -148 155 147 -83 -79 -102 18 148 114 382 116
7152A16j78K84l40MO2J12n13N98k25L1j5K74j92L9l3n1J28j19m5J90q9m6P6j97
$$ 116 -62 222 -118 -114 -52 60 -453 145 -80 -49 -64 210 18 57 24 -27 101 -18 -63 127 38 -8 68 -129
7176a29N6P5L2k9k18M15j54l15K27o1J35k98M16k61J61J54m30L38l2k57J67K35
$$ -129 -73 2 34 5 -213 202 48 -267 -40 -101 34 -264 152 -109 52 206 -224 114 82 -175 -8 227
7198B27k29l01K01Q5pQ0k11M73l10j88KJ90J71k64O9k41N50o70J19M61k08p9J40
$$ 227 -2 -303 -102 -17 -24 56 -155 318 8 -180 -178 12 183 -81 -12 -253 297 -373 -254 207 -1 -80 60
7221F0O4l26L14m17K95O6Q6l26L51j45q9J01j39N1k8Q2J1l8Ok05K75r7k5J45K0
$$ 60 124 -202 112 -305 -10 56 142 -184 167 22 -67 34 -105 -54 -82 0 11 -27 -21 -226 49 -48 -73 72 92
7246I2m2k15M60k75J4n9j13L81k40j05P1O7R3mj19j9K05p4rk19m9J46j7L4O6j26
$$ 92 50 -165 295 20 34 -25 -138 243 3 -102 -31 36 129 125 6 -13 192 118 109 -110 -159 -13 -30 4 70 -56
7272e6m1K19j42j11L50j67k74M51n18K50J50m68J99p8J13J10K7J66j62j09O9L4
$$ -56 -97 122 -20 -131 219 52 -222 229 -289 -39 111 -357 -158 -236 -123 -13 14 180 18 -91 -22 12
7294A2p9j15K82Ql9J63k76J27j45J1p7LJ45k6J34k04K17j1j50o1J63lj39k47K31
$$ 12 -67 -182 100 108 69 232 -44 83 -62 -51 -128 -125 20 -6 128 -76 141 130 -20 -81 82 79 -60 -307 -76
7319g6j0Q3P8l6q9J92P4m54N06m84L70k15L46k39j34m1J37o0kK25j40p7k20R5
$$ -76 -86 -3 75 39 -50 142 216 -238 268 -216 154 -61 285 46 -88 -129 8 -52 -54 171 31 -46 -266 -171
7343a71Q2N5k20N3L76j21m2j06o9K89j04q4K6Q3J49r1j9P1k98O1J90l85J24L06
$$ -171 -89 -34 -254 -201 175 54 12 -94 -163 126 22 -62 -36 47 196 105 86 157 -141 -80 110 -275 -151 155
7367A55r4O1J56k00k00J40J12j24N6N6k12k6K32j88o4K18K12j92Q4n31J88j20
$$ 155 61 122 278 78 -122 18 130 6 62 118 -94 -120 112 -76 -140 78 290 98 182 -349 -161 -281
7389b81L00L7k16J90J6K3j07l5M4Q4K50k59N5j56n2m8J7K29k86O4j2K02j54kJ13
$$ -281 19 56 -160 30 46 69 -38 -73 -29 55 305 46 101 -55 -107 -155 -138 91 -195 -131 -143 59 -95 -97 16
7414A6k69M12k57N9K09k02K31m30M31j00j50K78j59k17L85m8l52P0K8K69l29J64
$$ 16 -253 159 -98 -39 170 -32 199 -231 200 100 -50 228 69 -148 237 189 -163 -93 -65 204 -125 39
7436C9J40l72K80j48J41J2k12N2j2J07K8M0j20l7j5j7J55m41N24j47k6L18j86
$$ 39 179 -193 87 -61 80 92 -120 -68 -80 27 55 95 -25 -62 -77 -94 61 -380 144 -3 -29 289 103
7459A03j33O4k0J07K21l27L40l42k02K51l10L38j70oO3L4Nk84N78l12j3l2j44
$$ 103 -30 34 14 121 342 15 355 13 -189 62 -248 90 -80 -86 -23 11 16 -268 310 -2 -15 -47 -191
7482a91l8L06j06j31K00l03M27K2k06j22J6J66l0O7J2J08qk18j8J46k2Oj78J70
$$ -191 -229 77 -29 -160 40 -263 164 186 -20 -142 -126 40 10 77 89 197 189 -29 -47 99 77 83 -95 75
7506G5m02L48l24N4J56Q7M0k36L86j93J5J56j78J03J06r2o1j44r1L63m23L91k76
$$ 75 -327 21 -303 -249 -93 -6 34 -202 184 -9 6 162 -16 87 193 101 40 -104 -195 168 -255 136 -140
7529a40J27N1m1l7L85l19j13L62m17J90m2N5j03M9j43M2Q5q4J11k01L41k54K03
$$ -140 -13 38 -3 -40 345 26 -87 275 -142 48 6 61 -42 7 -136 -94 -9 -93 18 -183 158 -96 107
7552A07j87N9m6L02k70N8n6L02l67L06l38J38k00L03k24j93K74R7L8j41L4J97
$$ 107 -80 -21 -67 235 -35 23 -33 269 -98 208 -130 8 -192 111 -113 -306 -32 65 103 -38 -4 193
7574A93l11p6K4l2K10R2m60K93J45j45J41j45j3J06P6k20K18p3J14j82k38L91
$$ 193 -118 -194 -170 -202 8 100 -360 -67 78 -67 74 -71 -84 22 98 -122 96 23 137 -45 -283 108
7596A08j61j13K42j15L61l07P4K45l95p3m4k3L34j90j17J55Oj80L16k41L15k39
$$ 108 -53 -166 76 -39 322 15 89 334 -61 -134 -178 -201 133 -57 -174 -19 -13 -193 123 -118 197 -42
7618d2J30m0k2k61K15m5O5J33l34L57r6L56n05J97m0N9M6J8k43k8k9J50j79j52
$$ -42 88 48 26 -235 -20 -65 0 133 -201 156 60 416 -89 108 68 127 173 191 -52 -80 -109 41 -138 -290
7642b90J02J99Pk8k1r9L31l39J10NJ03J11j01Q1P3Rl4k99Q3LM2j09j06M02Mj81
$$ -290 -188 11 18 -10 -31 -130 201 -138 -28 -23 80 191 90 171 244 253 219 -80 3 6 48 -61 -167 235 239 58
7668E8J65m46K52m6P6L3J08l89J48K43j91r1l5j14O5K15J3j64q6L89j55j86j7
$$ 58 223 -223 29 -17 59 92 200 -189 -41 202 11 -80 -115 -229 -164 51 64 -100 -186 203 48 -138 -155
7691a55J75L7Q9m36K26L7k92K22R4K2j53J60j29Q6O0K98m34J62n8k7j40J10L7
$$ -155 20 57 146 -290 -64 -27 -319 -97 -3 19 -134 26 -103 -17 43 341 -93 69 11 -16 -156 -46 -9
7714ij69K85mq5k27K06k28J17R4r0L30k8k77J44j67Q0Jj29J58J83j93R2m09L7
$$ -9 -178 107 103 18 -209 -3 -231 -114 -20 -110 220 192 -85 59 -108 -28 -27 -156 2 185 -8 84 -325 -288
7738b88J73L47m7k97J53L7l10Q7M0O9j33L70k02j9j35J0j82M27n4j25M77m70j5
$$ -288 -115 232 185 -112 41 78 -232 -145 -105 -36 -169 201 -1 -20 -155 -145 -327 100 46 -79 398 -72 -87
7761h7N8K35l23J21P7j37K3k14J14Q8J53j85m6j77J5L77lJ08l1L3k43Nr9K51k7
$$ -87 -29 206 -117 4 81 -56 -33 -247 -133 -45 108 -77 -123 -300 -285 92 89 197 166 199 -44 -39 -138 113 86
7786H6j06j82P1J80j90K33j61K0J58j76n8K4m2j25L14j26oMj0P4P0K43k25l6m5
$$ 86 -20 -202 -131 49 -141 92 -69 -49 109 -67 -125 -101 -143 -268 46 -80 -86 -82 -92 -18 52 295 70 34 -11
7811a1J16l04J35k97M81k15L0K34k35j02J20P8j77O3oK55l28M8J54j53J88j76
$$ -11 105 -199 -64 -361 120 -95 -65 169 -66 -168 -48 30 -147 -84 -90 165 -163 -115 39 -114 74 -102
7833a02J47J08p5o4kK8J42j91N7j26K12k05j43J52K2PK6J23k22o7kK55l5j2J24
$$ -102 45 153 78 14 12 40 182 -9 48 -78 134 -71 -214 -62 -40 -33 -7 116 -106 -173 -175 80 45 33 157
7858A57k76K47j50K9J65l24J68k24N34j31j65j13n9L14j77J3j01L6M6j08J51J22
$$ 157 -119 128 -22 7 172 -152 16 -208 326 195 30 -83 -142 172 -5 8 -93 -57 -11 -119 32 154
7880A54k20j99J73k89M85l04J07j70M35m4o9M8r1J89j03j31L0p8j91K01J96j58
$$ 154 -66 -265 -92 -381 104 -200 -93 -263 172 128 59 107 16 205 102 -29 1 -77 -268 -67 129 -29
7902b9p1j85K51J19o7j28J09M5k01K63j36K14j39P1j89J31k04K09O6k49L14j66
$$ -29 -100 -285 -34 85 18 -110 -1 44 -157 106 -30 184 45 116 -73 58 -146 63 129 -120 194 28
7924B8J19M0k39M3J28k0K05p56M50K5m6p6L9J57M7Q1l3Q4l42J77k57J83q5K04
$$ 28 147 187 -52 -9 119 99 304 -452 -2 23 -23 -99 -60 97 144 225 192 276 -66 111 -146 37 -48 156
7948A56J35k65J1j87K28J69k21j5o0J56k69K24N7l1k26J86m0j2k6j92qJ14k13
$$ 156 291 26 37 -150 78 247 26 11 -49 107 -162 62 119 88 -138 48 8 -4 -30 -222 -230 -116 -329
7971c29K12J57j19J82J19k50O6k05J18p5J59q8P9m1j0K20P6l04L18l50j11M47
$$ -329 -117 40 -79 103 222 -28 38 -167 -49 -124 35 -53 26 -15 -25 195 271 -33 285 -65 -176 271
7993B71p0k48l8K16j42k48O74m56j72L91O9Mj87J0j70K01k29j65K77nn6n0M4m9
$$ 271 201 -47 -85 131 -11 -259 415 -41 -213 178 247 251 64 74 -96 105 -124 -289 -12 -17 -73 -123 -79 -128
8017a28J94l84L49M5m8M0j82L1P2P1p8K05j34j77K22L9j82K28j38rL77k36j79
$$ -128 66 -318 31 76 28 68 -114 -83 -11 60 -18 187 53 -124 98 137 -45 183 45 36 413 177 -2
8040bN7J09j58J99l35P3J35j61J45J28l96P4N5j8J26K05m55K18J80j76J83j49
$$ -2 55 164 6 205 -130 -57 78 -83 62 190 -206 -132 -77 -95 31 236 -219 -1 179 3 186 37
8062C7JK14k73L6p1Pq5L63k57L0o4J41n7j0j79K09j18l4J81j95J77l25M74n6j44
$$ 37 38 252 -21 15 -56 -49 -134 229 -28 2 -62 79 22 12 -167 42 -76 -110 71 -124 53 -272 202 146 2
8087BO5k27M18k4l51J63Pj8J15k14j7o6N0J97j05k9Kj02o8qK28j6M7j90K63M1
$$ 2 67 -160 258 234 -117 46 53 35 150 -64 -81 -147 -97 100 -5 -34 -32 -134 -202 -210 18 2 49 -141 122 163
8113A63l53K32P5k91Q4l7oJ68R4r1j03J03j00J69k14j07L15o5L8k93L77M8j64
$$ 163 -190 42 117 -174 -90 -127 -133 35 129 38 -65 38 -62 107 -107 -214 101 36 74 -219 158 206 42
8136D2r2J77k27J55l26M78l45J62j38L5K16r9pJ73j20n00O17o9O5q9n8Q4k24J72
$$ 42 -50 127 -100 55 -271 207 -138 24 -114 -79 137 38 31 204 84 -416 201 132 197 108 50 134 -90 82
8160H2k21k02J75J05m1L17j2k03j34K90p5J8J22j99m7J6o6p8j37M70l51J45k49
$$ 82 -139 -341 -166 -61 -102 215 203 0 -134 156 81 99 221 22 -25 -9 -75 -153 -290 180 -171 -26 -275
8183b75J22J69n1j45J46k36L59n5
$$ -275 -153 16 -35 -180 -34 -270 89 34
8191C4
$$ Imaginary data points
##PAGE= N=2
##DATA TABLE= (X++(I..I)), XYDATA
0@%%%%%%%%%%%%Qj6J6j6J7k5L2m0M8n6P2q1R0j07J30j52J74j99K26k58K95l35
$$ 0 0 0 0 0 0 0 0 0 0 0 0 0 8 -8 8 -8 9 -16 16 -24 24 -32 40 -41 49 -58 72 -80 94 -105 121 -137 158 -177
34a77L78m27M81n40O03o74P52q34R24j025J135j255J387j530J685j859K049k255
$$ -177 201 -226 255 -285 318 -356 396 -438 486 -539 596 -659 728 -802 883 -976 1073 -1182
52a182K485k742L027l348L714m132M614n178N854o675P696r010J0779j3295J7191
$$ -1182 1303 -1439 1588 -1760 1954 -2178 2436 -2742 3112 -3563 4133 -4877 5902 -7393 9798
67I798k4101M0055j49657n4163J89065k0818m6957k0592Q8127P5758J0414o1070
$$ 9798 -14303 25752 -123905 -178068 10997 -9821 -56778 -77370 10757 86515 96929 35859
79C5859r806M8580L9392o0675n9989l871L614j9589k67k220k287j1709j0682P062
$$ 35859 26053 74633 114025 53350 -6639 -10510 -6896 -26485 -26752 -28972 -31259 -42968 -53650 -46588
93d6588K3100J0638K695q1L0743L5535j9200l4197K5745M5976K086n0245m3005
$$ -46588 -23488 -12850 -10155 -10236 20507 56042 36842 2645 28390 74366 76452 26207 -16798
106a6798Q190J4600k9237m8248j8913M1589M5650k8311l7467M2561P3169K6585
$$ -16798 -8608 5992 -23245 -71493 -90406 -48817 -3167 -31478 -68945 -26384 46785 73370
118G3370k3528j6700K6881K0910l2342n5940k7533J9926J1924m7869l9346K6496
$$ 73370 49842 33142 60023 80933 48591 -7349 -34882 -14956 -3032 -50901 -90247 -63751
130f3751L9791Q147p972J4674M6956K5437k0365k1833M411K1361m741m5981k5039
$$ -63751 -23960 -15813 -23785 -9111 37845 63282 42917 21084 25495 46856 42115 -3866 -28905
143b8905J9844M818k8654k1389J6590L7040N634k3531l157K3970K3939m355k6409
$$ -28905 -9061 -4243 -32897 -54286 -37696 -656 4978 -18553 -21710 2260 26199 21844 -4565
156d565P550L7882j046l4677j4222J9137K0005j8015l4296m070J4576J502k2932
$$ -4565 2985 40867 39821 5144 -9078 10059 30064 12049 -22247 -26317 -11741 -10239 -33171
169c3171k2847K1909M1055q37j9189J0941L5278K2774j4109k0304Q546J1780j7237
$$ -33171 -56018 -34109 6946 6109 -13080 -2139 33139 55913 41804 21500 30046 41826 24589
182B4589l9119k7813J0205J3991k2876k2003J7885L3447J5093p226N691L4579
$$ 24589 -14530 -42343 -32138 -18147 -41023 -63026 -45141 -11694 3399 -3827 1864 36443
194C6443K3944j0150k2416r570J1987k333l7579k6064J0599J0390j2479k0252
$$ 36443 60387 50237 27821 18251 30238 27905 -9674 -35738 -25139 -14749 -27228 -47480
206d7480N504L2065J5984q224m999J4353K4392J468k5035m445K2827N605k1101
$$ -47480 -41976 -9911 6073 -2151 -7150 7203 31595 33063 8028 3583 26410 32015 10914
219A0914k0915L558J6618o426k4010q060J1640J1472j0447k1105J0690L0485P168
$$ 10914 -10001 -6443 10175 3749 -20261 -28321 -16681 -5209 -15656 -36761 -26071 4414 11582
232A1582j0791Q2K1322J9558q747j8137Q4Q265m198k5051k6718L944J3353j0731
$$ 11582 791 873 22195 41753 33006 14869 14953 23218 19020 -6031 -32749 -28805 -15452 -26183
246b6183j5462P181K5449J7368m091j631J9313J8193l18j7873j4262P100K687
$$ -26183 -41645 -34464 -9015 8353 4262 2631 21944 40137 39819 21946 7684 14784 17471
259A7471k4494k2016K531J2980q6j4129j08K1755J5867r13p067L658J8693L693
$$ 17471 -7023 -29039 -26508 -13528 -13614 -27743 -27851 -6096 9771 8858 1791 5449 24142 27835
273B7835k0351j0341R764P688j0117j7805n07J3525J461j1821p583O815J4911
$$ 27835 7484 -2857 6907 14595 4478 -13327 -13834 -309 1152 -10669 -18252 -11437 3474
286C474j246j6215J271J8279Q828p730p473R629J4800m371j4703n382M576M394
$$ 3474 2228 -13987 -12716 5563 14391 6661 -812 8817 23617 19246 4543 -839 3737 8131
300H131j3074j9816J490J2773l77r456K48J8193J7254j747n126P195J0974K557
$$ 8131 -4943 -24759 -23269 -10496 -10873 -20329 -20081 -1888 15366 13619 8493 15688 26662 29219
314B9219j4204j6340K230L533j3805j7084k105J1943O884o433l96J4253J4717
$$ 29219 15015 -1325 905 4438 -9367 -26451 -28556 -16613 -9729 -16162 -16558 -2305 12412
327A2412N040o866j781J1998M482j4366j3127L99N797m450j5013l704R685N618
$$ 12412 17452 10586 8805 20803 25285 10919 -2208 -1809 3988 -462 -15475 -19179 -9494 -3876
341c876l921o322L544J4635M466j0153k180J0325R141l775r982K005J0078j020
$$ -3876 -7797 -14119 -10575 4060 8526 -1627 -3807 6518 15659 11884 1902 3907 13985 12965
355A2965j0460q406J048O591o055j4427j304J0113M616m982k679J1257J4330J668
$$ 12965 2505 -5901 -4853 1738 -4317 -18744 -20048 -9935 -5319 -10301 -12980 -1723 12607 14275
369A4275m033O64O750M762r792j4446j044L467o856j2067n197Q603Q118k655j451
$$ 14275 10242 10906 17656 22418 12626 -1820 -2864 603 -6253 -18320 -23517 -14914 -6796 -9451 -10902
384a0902Q128J1863O913n131m467O567N453q189j1938l546M505o15r549m374N461
$$ -10902 -2774 9089 16002 10871 6404 12971 18424 10235 -1703 -5249 -744 -1359 -10908 -15282 -9821
399i821O907J550n403N4J0915N600n561m966L525P478j595q990j795N668K657
$$ -9821 -2914 -1364 -6767 -6713 4202 9802 4241 -725 2800 10278 8683 -307 -2102 3566 6223
414F223m767p300o80P142l81q337l198N915O374j712n407N011R154K548l157l895
$$ 6223 1456 -5844 -6524 618 237 -8100 -11298 -5383 991 -721 -6128 -1117 8037 10585 7428 3533
430C533L008N015m587j0881k841K965O30p293n615N596Q365J190j467K679P877
$$ 3533 6541 11556 6969 -3912 -6753 -3788 -3158 -10451 -16066 -10470 -2105 -915 -2382 297 8174
445H174O868l479o371J261L188l300r901o678L742K284m841l987L060P755N266
$$ 8174 15042 11563 5192 6453 9641 6341 -3560 -10238 -6496 -4212 -9053 -13040 -9980 -2225 3041
460C041k691j425P053N998k211o420j486M430L2p701m233J537L352r17n649j369
$$ 3041 350 -1075 5978 11976 9765 3345 1859 6289 6321 -1380 -5613 -4076 -724 -1641 -7290 -8659
476h659O331L416l588k926K784O809Q80n075O13N340L022k150n248m29M097j710
$$ -8659 -2328 1088 -2500 -5426 -2642 4167 5047 -28 585 5925 8947 6797 1549 1120 5217 3507
492C507p688m167K010K942l289n051L410P169L095j55j04M623O660j566n820j935
$$ 3507 -4181 -8348 -6338 -3396 -6685 -11736 -8326 -1157 1938 1783 1679 6302 12962 11396 5576 3641
508C641K010q12p390o862J118K799j468k795P76N902O616p89j974L678M912N34
$$ 3641 5651 4839 -2551 -9413 -8295 -5496 -6964 -9759 -8983 -3081 3535 2746 772 4450 9362 9896
524I896n213l723K316Q84m922m808n42L159J844l888j762M064M635o58l594P31
$$ 9896 4683 960 3276 4160 -762 -5570 -6112 -2953 -1109 -4997 -6759 -2695 1940 1282 -2312 -1581
540a581N177J704l450j776J754K838m8n028j750L634J160l988m776P80M154n25
$$ -1581 3596 5300 1850 74 1828 4666 4618 -410 -2160 1474 2634 -1354 -6130 -5350 -1196 -1721
556a721m085M90M351L991J22k276J770N291N7m649l424J035J655l953n926j76
$$ -1721 -5806 -5316 -965 3026 3148 872 2642 7933 7990 3341 -83 952 2607 -1346 -7272 -7448
572g448L074J229j684j197M504N835Q84k178K55L706J281m652m720L90J139k476
$$ -7448 -4374 -3145 -4829 -6026 -1522 4313 5197 3019 3274 6980 8261 3609 -1111 -721 418 -2058
588b058m009j594L087L260r69j717K575N088J846l102j623L116J535k696l397
$$ -2058 -6067 -7661 -4574 -1314 -2283 -4000 -1425 3663 5509 2407 784 3900 5435 2739 -658
603f58r37K141Q04l826k503K195L011r75l392j97M437J817k591j031J987L977
$$ -658 -1595 546 1350 -2476 -4979 -2784 227 -748 -4140 -4337 100 1917 -674 -1705 282 4259
619D259P59l346n63K731J519k799m566l35K024j589m265r61K398K747M77j501
$$ 4259 5018 1672 1109 3840 5359 2560 -2006 -2341 -317 -1906 -6171 -7132 -4734 -1987 -1510 -3011
635c011K305N118K175j602j751J954K017l254n314j249O00o10k753k798K156M090
$$ -3011 -706 4412 6587 4985 3234 5188 7205 3951 -1363 -2612 -2012 -2622 -5375 -8173 -6017 -1927
651a927R71j099Q55M288L145j600k745J537J442j146l831k638J395J575k374k581
$$ -1927 -956 -2055 -1200 3088 6233 4633 1888 3425 4867 3721 -110 -2748 -1353 222 -2152 -4733
667d733N79L445J088k707q43L354K426j031k014K36L045J532k453j869R67J987
$$ -4733 -4154 -709 379 -2328 -3171 183 2609 1578 -436 -200 2845 4377 1924 55 1022 3009
683C009q33l867j194K346j57k483j884J288K694J481j952N96L771K421m88k864
$$ 3009 2176 -1691 -2885 -539 -696 -3179 -5063 -3775 -1081 400 -1552 -956 2815 5236 4748 1884
699A884P06J883j310m110k332O05R76j652k621J494L357J886o31m25K888L230
$$ 1884 2590 4473 3163 -947 -3279 -2674 -1698 -3350 -5971 -4477 -1120 766 135 -290 2598 5828
715E828j279k737n92J274m28k877l294O95K000o59j770j31L321K703j360j517
$$ 5828 4549 1812 1220 2494 2066 -811 -4105 -3410 -1410 -2069 -3839 -3970 -649 2054 694 -823
731h23K384J911k18k581j195J624J418j917k522J55K221J91k726j220K051J210
$$ -823 1561 3472 3254 673 -522 1102 2520 603 -1919 -1764 457 648 -2078 -3298 -1247 -37
747c7n82j984L05K595K097j567r75J798K822m02l029o54J838q34k841k584j60
$$ -37 -619 -2603 -2298 297 2394 827 -148 1650 4472 4070 1041 387 2225 1391 -1450 -4034 -4194
764d194J602K28j931K21L095L270j13j060J697K869m42k877j446q6N39k486l039
$$ -4194 -2592 -2364 -4295 -4074 -979 2291 2178 1118 2815 5684 5242 2365 919 833 1372 -1114 -4153
781d153p29K192P69j463r02L193L291j77j201Q17J705R88k065k319N78J196j017
$$ -4153 -4882 -2690 -1921 -3384 -4286 -1093 2198 2021 820 1637 3342 4330 2265 -54 524 1720 703
798G03k561j099J951J393k226r96O43K138K66j242r89K275J949p03r11L78K164
$$ 703 -1858 -2957 -1006 387 -1839 -2835 -2192 -54 212 -1030 -2019 256 2205 1502 591 969 3133
815C133N96k721j508J408M02k112k465l54J466P28j395n41K136L017O46j466Q16
$$ 3133 3729 1008 -500 908 1310 -802 -3267 -3621 -2155 -1427 -2822 -3363 -1227 1790 2436 970 1786
832A786K121N34j743k604l16Q80j190k951o95J308J780p11r62J843L129K66r73
$$ 1786 3907 4441 2698 94 -222 658 -532 -3483 -4178 -2870 -1090 -1801 -2763 -920 2209 2475 1502
849A502n01J007J314j311k659l38J162j52j929j378J667K002j063q29O84J372
$$ 1502 1001 2008 3322 2011 -648 -986 176 24 -1905 -3283 -1616 386 -677 -1506 -822 550
865E50J279j515q73J062J455l98j400r02K009Q29k106j304O60O83l04j964n15
$$ 550 1829 314 -559 503 1958 1560 160 -742 1267 2096 -10 -1314 -654 29 -275 -2239 -2754
882b754J401J177l97q31P41L011N83j452k92J532L08j420k477q05R59l70j992
$$ -2754 -1353 -176 -573 -1404 -663 2348 2931 1479 1187 2719 3027 1607 -870 -1675 -716 -1086 -3078
899c078r37J207J997N15j131J286K652J293j097j136O46R86j458k124j220L09
$$ -3078 -4015 -2808 -811 -296 -1427 -141 2511 3804 2707 1571 2217 3203 1745 -379 -1599 -1290
915a290O55j482j528R38K133M46j042L9J947J713q49j181L23J148J72j868j400
$$ -1290 -635 -2117 -3645 -2707 -574 -128 -1170 -1131 816 2529 1680 499 822 1970 2142 274 -1126
932a126J841N28j231j629j37J147M47j663p96J251J217N19j214L08K312J226j131
$$ -1126 715 1243 12 -1617 -1754 -607 -160 -1823 -2619 -1368 -151 368 -846 -538 1774 3000 1869
949A869p32O18P16p62k294r98M41K08j448j038L57K264N68o40M21J821J789n85
$$ 1869 1137 1755 2471 1709 -585 -1583 -1142 -934 -2382 -3420 -3063 -799 -231 -871 -450 1371 3160 2575
967B575j243J5Q71l36k068j558M0J217j068j683R36J526R74m6m63R58J405k28
$$ 2575 1332 1347 2218 1882 -186 -1744 -1704 -487 -1555 -3238 -2302 -776 198 152 -311 647 2052 1824
985A824j320j13N93P15j673j398P07J109m78q51q02J388O90q58q89O14J346N12
$$ 1824 504 391 984 1699 26 -1372 -665 444 -34 -885 -1687 -299 391 -467 -1356 -742 604 1116
1003A116j092p76J621J132o84q47k67J149O5k390n02j61R44k44j213J09J898O90
$$ 1116 24 -752 869 2001 1317 470 203 1352 1417 -973 -1475 -1636 -692 -936 -2149 -2040 -142 548
1021E48j53o4J147J188k78j306o49M52k59j442j488j78J259K2p92l4J631J385
$$ 548 395 331 1478 2666 2388 1082 433 885 626 -816 -2304 -2482 -1223 -1201 -1993 -2027 -396 989
1039I89Q3n16P55J114j76q28j441M19O09j281j369n5J118J23o83o78R64J225j9
$$ 989 1072 556 1311 2425 2249 1421 -20 399 1008 -273 -1642 -1697 -579 -456 -1139 -1817 -853 372 353
1058C53p11L6J298Q08r45j007P29J250m01j450m24M84N26j253r88k14J050K36
$$ 353 -358 -322 976 1784 839 -168 561 1811 1410 -40 -464 20 546 -707 -1695 -1909 -859 -623
1076f23j179qJ583J249J63n13L71J451Q0j151j117mL41q40j675l29O17N02p17
$$ -623 -1802 -1810 -227 1022 1185 672 1043 2494 2574 1423 306 302 643 -197 -1872 -2201 -1584 -1082 -1799
1095a799j60J288J491N35o27J46J231J08p79j362k42J004j100j289m34Q80R25
$$ -1799 -1959 -671 820 1355 728 874 2105 2213 1434 72 -170 834 -266 -1555 -1989 -1109 -184
1112a84n48p42Q48J309J53p00l39N05J289p03j121L13Q09m6q73r45O80O43m74
$$ -184 -732 -1474 -626 683 836 136 -203 302 1591 888 -233 80 889 843 -30 -975 -295 348 -126
1131a26p29l98R14N31q55m56R23Q98K24o77MR96K27o01r81k42N15j00j462o81
$$ -126 -855 -1253 -339 192 -663 -1119 -196 702 926 249 253 1249 1476 875 -106 -348 167 67 -1395 -2076
1151b076Q13Q31j40m44M71J721J77m69o8L27N55p02j531k46K37Lp01r35P80J181
$$ -2076 -1263 -432 -572 -1016 -545 1176 1353 884 816 1143 1698 996 -535 -781 -544 -541 -1242 -2177 -1397 -216
1171b16J64k66K92Q71O57j03r56j17J114n90j111m44L03M70n11r41N35P78J49
$$ -216 -52 -318 -26 845 1502 1399 443 326 1440 850 -261 -705 -402 68 -443 -1384 -849 -71 78
1190G8n42n64O10J193l70n15K79P76P18j106j27m7M62j91j176m92M80K14j150
$$ 78 -464 -1028 -418 775 405 -110 169 945 1663 557 430 383 845 654 -522 -1014 -534 -320 -1470
1209a470l44N40Q66L73m49K26J263R06l13o79K14L36k43j650m23P3Jm97q22J63
$$ -1470 -1814 -1274 -408 -35 -484 -258 1005 1911 1598 919 1133 1469 1226 -424 -847 -774 -773 -1270 -2092 -1929
1229a929J339N47k56J05R30J058k27j114L22L90m46p90o98J23N19l64n62rO17
$$ -1929 -590 -43 -299 -194 736 1794 1567 453 775 1165 719 -71 -769 -646 -127 -491 -1053 -1062 -445
1248d45N60n92l80R43N26n4l75j02N09M29m07q24J58M10K12q03r32N73L81k55
$$ -445 115 -477 -857 86 612 558 183 81 590 1019 612 -212 -54 356 568 -235 -1167 -594 -213 -468
1268d68q66N07M79N85k89k71R07N75R5o03l92L91J93j148o90n3K36o0l44K7J008
$$ -468 -1334 -827 -348 237 -52 -323 584 1159 1254 651 259 650 843 -305 -995 -1048 -812 -872 -1216 -1189 -181
1289a81N05q7J5J68J113p1j010j16j1M2q23q33L7O21J73m83Q1O47Q02K58j044
$$ -181 324 237 252 420 1533 1462 452 336 325 367 -456 -1289 -1252 -631 -458 -941 -860 -213 589 847 -197
1310a97O41O15j51l09m90k01P82o55o13j6K06O32n51n95O6R46R2o14l68J143O76
$$ -197 444 1059 908 599 109 -92 690 35 -578 -594 -388 244 -307 -902 -836 110 202 -412 -780 363 1039
1331A039n39k80M05M88j15m60o91J17J55n42q38r3O03K6j87Q1Q66P37K4j4K3N50
$$ 1039 500 220 625 1113 998 538 -153 -36 119 -423 -1261 -1354 -751 -725 -912 -831 35 772 796 782 805 1355
1353A355K88o45j141l02M98l25j158j32P00J24o5J41J66J254K62n23QN22N49m41
$$ 1355 1643 998 -143 -445 53 -272 -1430 -1562 -862 -738 -803 -662 -496 758 1020 497 505 1027 1576 1135
1373A135j098j79N07j64n45k75p2N94r1p45J13R85J65n78J67J76R07k70o98K69
$$ 1135 37 -142 365 201 -344 -619 -691 -97 -188 -933 -820 165 330 -248 -81 95 1002 732 34 303
1393C03L67K87n19p65J62K10k90j019N9M39N15m85J38J40R24M65l51o5L27M88
$$ 303 670 957 438 -327 -165 45 -245 -1264 -1205 -766 -251 -736 -598 -458 466 931 580 515 842 1330
1413A330o74o50k26K13p8r25j20J3O97M35m19M17L90P67m74l23K72M39p16l44
$$ 1330 656 6 -220 -7 -85 -1010 -1130 -1117 -420 15 -404 13 403 1170 696 373 645 1084 368 24
1433B4o71L80L5l20m52K90O80mj14K7L40O02k56r41O46M01k12j61o09J95M67l65
$$ 24 -647 -267 -232 -552 -1004 -714 -34 -38 -152 -125 215 817 561 -380 266 667 455 294 -315 -120 347 -18
1455a8m41Q9J50K77l56o17M79P57j89j56J41N49J51j64j65n1J25m4p18n44J95
$$ -18 -459 -370 -220 57 -299 -916 -437 320 131 -25 116 665 816 652 487 436 561 517 -201 -745 -550
1476e50n5M4m79J84M32O56n9j63P49M96N8p79L2L40k74j114j05m49M56J47n95
$$ -550 -605 -561 -1040 -856 -424 232 173 10 759 1255 1313 534 566 906 632 -482 -587 -1036 -580 -433 -1028
1497a028k65Q15N91J28k39J69R28J0p04P0J16j87l15n68K96J93jm59o27L42R48
$$ -1028 -1293 -478 113 241 2 171 1099 1109 405 475 591 404 89 -479 -183 10 9 -450 -1077 -735 213
1518B13n54m82N24L87J24l0k03L75N88j91l79P6K6J63j028k04j82J41j17k13p1
$$ 213 -341 -823 -299 88 212 182 -21 354 942 751 372 448 474 637 -391 -595 -777 -636 -753 -966 -1037
1539a037N61P57Pj63K50O23K25n37m26M70j92n61n89k69N49q9n50Q0O24O03P8
$$ -1037 -476 281 288 125 375 998 1223 686 260 730 538 -23 -612 -881 -332 -421 -971 -891 -267 336 414
1560D14p24M02P10r6k30n63R5K93J29q30j83M57K15m47k12o4R08m80LK84J38K31
$$ 414 -310 92 802 706 476 -87 8 301 430 -400 -583 -126 89 -358 -570 -634 274 -206 -203 81 219 450
1582D50k45n19M39M98j56m05O6j13M14o22n22rL45L35m92r2K77P64K84r2r7l4
$$ 450 205 -314 125 623 467 62 128 15 429 -193 -715 -724 -379 -44 -536 -628 -351 413 697 605 508 474
1604D74J64k42m73M45k31n29m43N4L64P0l2pJ48O18M36m82L7N01k55l66N2n78
$$ 474 638 396 -77 368 137 -392 -835 -781 -417 -347 -379 -386 -238 380 816 334 371 872 617 251 303 -275
1626b75O7J0n11q9J89J95P9l09M27O08L15m92q6l4O40k34k74j25K71k99j00m12
$$ -275 -208 -198 -709 -798 -609 -414 -335 -644 -217 391 706 214 128 94 734 500 226 101 372 73 -27 -439
1648d39J60L22m16j47j59L5O30P8k89K12O69l38k59L88J58R1l40m60J38j24j19
$$ -439 -279 43 -373 -520 -679 -644 -14 64 -225 -13 656 318 59 447 605 696 356 -104 34 -90 -209
1669b09l11j95k13Q50l06l17Q10K98K97l29j61N64l04ll55l66L89m54l5l58K88
$$ -209 -520 -715 -928 -78 -384 -701 109 407 704 375 214 778 474 471 116 -250 139 -315 -350 -708 -420
1690d20N99m03J05K0N00Kl70k0n5L82J32j94k77j4j79J54j95n3K50j49R0p39O30
$$ -420 179 -224 -119 -99 401 403 33 13 -42 340 472 278 1 -13 -192 -38 -233 -286 -36 -185 -95 -834 -204
1713b04K06L1k07j19O79p9j72k91O93O8k08n17R4L7k31m17k81L78M56m58K53K90
$$ -204 2 33 -174 -293 386 307 135 -156 537 605 397 -120 -26 11 -220 -637 -918 -540 -84 -542 -289 1
1735AN18j52j8MJ1K9l12k87j09k90K77l3j53k3K51K28Q8J5J32M38k44q4j61J96
$$ 1 519 367 349 353 364 393 81 -206 -315 -605 -328 -361 -514 -537 -286 -58 30 45 177 615 371 287 126 322
1759C22n9l84k65j9O62l16j72k34L23J2j46j07J70N62J2k13PJ4K09j82l11K34
$$ 322 263 -121 -386 -405 257 -59 -231 -465 -142 -130 -276 -383 -213 349 361 148 155 169 378 196 -115 119
1781A19l9Pk24l01P7K18k57r5L6L03K56M1k68O58J29j55k06J35j25k71l04j54
$$ 119 80 87 -137 -438 -361 -143 -400 -495 -459 -156 100 141 -127 531 660 505 299 434 309 38 -266 -420
1803d20K6j29J64o5k25O69k94K96J57K29m1J18k30k00L66k04k33l77P5J92J66
$$ -420 -394 -523 -359 -424 -649 20 -274 22 179 408 367 485 255 55 421 217 -16 -393 -318 -126 40
1824D0k59j14J84K33l15m5R5O14n63M15j69K23j8J7m19p9N7J96k76l39J37M79
$$ 40 -219 -333 -149 84 -231 -276 -181 433 -130 285 116 339 321 338 -81 -160 -103 93 -183 -522 -385 94
1846I4j32n63L74O4M06j72l2L14J4o8M9m07kK38k39m66L91j40L25j34l74N46K27
$$ 94 -38 -601 -227 -163 243 71 39 353 367 299 348 -59 -61 177 -62 -528 -137 -277 48 -86 -460 86 313
1869C13j48J7r2M05N8k26m57P2L8r0k50j90M08k05QL0M43j35K19q6R9k27K74j01
$$ 313 165 182 90 495 553 327 -130 -58 -20 -110 -360 -550 -142 -347 -339 -309 134 -1 218 132 231 4 278 177
1893A77j89k53N07J09o75K78l38J71M5j36o9L54Or8O2j6K57P5q4j63M25J09n16
$$ 177 -12 -265 242 351 -324 -46 -384 -213 -168 -304 -373 -19 -13 -111 -49 -65 192 267 183 20 445 554 38
1916C8j16r1J78k64j84m1L03Q7k40M9kN92j13P5NK27nl95j48J00J42n62J1j29
$$ 38 -78 -169 9 -255 -439 -480 -177 -90 -330 -281 -283 309 196 271 276 503 498 103 -45 55 197 -365 -354 -483
1940d83J10K26j18o1q1N08K34j60M5J33q0R0l30j5j04L48j91l69M35k43j02j59
$$ -483 -373 -147 -265 -326 -407 101 335 175 220 353 273 363 33 18 -86 262 71 -298 137 -106 -208 -367
1962c67J04J00K51O7k74K61J30N2m3k09K99J64n18r0r7K98m96J98l09L46R0r4
$$ -367 -263 -163 88 155 -119 142 272 324 281 72 371 535 17 -73 -170 128 -368 -170 -479 -133 -43 -137
1984a37j10Q9M22J49n76K63K22o4l5l49o8J95J5l99k25L22M77l90J89j20J93K10
$$ -137 -247 -158 264 413 -163 100 322 258 223 -126 -194 1 16 -383 -608 -286 191 -199 -10 -130 63 273
2006B73k89K6K57J43l23k76J29m3Rj3L4O2j0N1k65K65j52J94M14n51K62k65Q0
$$ 273 -16 10 267 410 87 -189 -60 -103 -94 -107 -73 -11 -21 30 -235 30 -122 72 486 -65 197 -68 12
2029A2K11j62k71J67k5r2j26K11l4p8L2j38M76j93j4m1J8L83O7k59M4K77l79p6
$$ 12 223 61 -210 -43 -68 -160 -286 -75 -109 -187 -155 -293 183 -10 -24 -65 -47 336 403 144 188 465 86 10
2053A0j32l5oj9N4%k2J68J00j35J21L22l11J8l0J24j03j70j18r8j44K06j86j00
$$ 10 -122 -157 -163 -182 -128 -128 -150 18 118 -17 104 426 115 133 103 227 124 -46 -164 -262 -406 -200 -386 -486
2077d86M53L3l0MR9R7R2j09p6J34K65m44k35K78M5j67J05r7R4kk48m0Q4J83K14
$$ -486 -33 0 -30 -26 73 170 262 153 77 211 476 32 -203 75 120 -47 58 -39 55 53 -195 -235 -151 32 246
2102B46k08q3J36K70l45J33p2nj47k5j16J03m8J25j40P1J79O2J03l79rM43r4N3
$$ 246 38 -45 91 361 16 149 77 72 -75 -100 -216 -113 -161 -36 -176 -105 74 136 239 -140 -149 294 200 253
2126B53m66L08J08m70k96M14J84j96k0nL7J22P2o7N6L30l16J30k25J31P2j63j33
$$ 253 -213 95 203 -267 -563 -149 35 -161 -181 -186 -149 -27 45 -22 34 364 48 178 -47 84 156 -7 -140
2149a40J69P0K17l28l51K58K85m01J1L84j23O4m7J56P3l9j43k21J81K31m60J39
$$ -140 29 99 316 -12 -363 -105 180 -221 -210 174 51 115 68 224 297 258 115 -106 75 306 -154 -15
2171a5Q6P9m95J27J96l38N24P5o1q1K95m23L10l6k96L4j23J07l15P9L03j18k56
$$ -15 71 150 -345 -218 -22 -360 164 239 178 97 392 -31 279 243 -53 -19 -142 -35 -350 -271 32 -86 -342
2194c42K19j8K79Q6M9k58K70k14l4j09k27L19m2j61jO5K71l40J00o3M23k99r7
$$ -342 -123 -141 138 224 273 15 285 71 37 -72 -299 20 -22 -183 -184 -119 152 -188 -88 -151 272 -27 -124
2217a24o0L75P1k10j18J13J4J44j42k32L66l07J98m03j12K14J04j51K87K8K13
$$ -124 -184 191 262 52 -66 47 61 205 63 -169 197 -110 88 -315 -427 -213 -109 -260 27 55 268
2238B68J14k25j67J31R2P5l30q1Q0O1k68K61J96m29J93k8P3n3K2J11r7J03M2m1
$$ 268 382 157 -10 121 213 288 -42 -123 -43 18 -250 11 207 -222 -29 -57 16 -37 -15 96 -1 102 144 103
2262A03r2j8L7N0K2l20J98J96k60k4N2K48k36o1L93m68N20j85l69L31O0M0m04
$$ 103 11 -7 30 80 102 -218 -20 176 -84 -108 -56 192 -44 -105 288 -180 340 155 -214 117 177 217 -187
2285a87j59J92L05j65k41n5K53p3k1O8J16K18l33J09K67j50R1j4j89M2n4n4N2
$$ -187 -346 -154 151 -14 -255 -310 -57 -130 -151 -83 33 251 -82 27 294 144 235 221 32 74 20 -34 18
2308A8J53k69K7L34k76P1j97J33q0L2L20k36l1P8m5L0j95J4j43P3L49j30j0j94
$$ 18 171 -98 -71 263 -13 58 -139 -6 -86 -54 266 30 -1 77 32 62 -133 -119 -262 -189 160 30 20 -174
2332a74j30k4N26l39R1K79k15k1K33k12j05n7J8K39k26R2J10J1J78l79m5L3K61
$$ -174 -304 -328 198 -141 -50 229 14 -7 226 14 -91 -148 -130 109 -117 -25 85 96 274 -105 -150 -117 144
2355A44O9k24J5J16jJ83k15j69K9k38L59l81N02m47L09o0k68K56M2K50r1K64j59
$$ 144 213 -11 4 120 119 302 87 -82 -53 -291 68 -313 189 -258 51 -9 -277 -21 21 271 180 444 285
2378B85j45J74l52o2K35l16L10j57R6k11J66r6m8K22q5n9j06K83K8J50j35j16
$$ 285 140 314 -38 -100 135 -181 129 -28 68 -143 23 -73 -121 101 16 -43 -149 134 162 312 177 61
2400F1J51j90J91l63J68P4j88k5Q4j05J76J38j27j77K72J90j99l7j57j47K99p
$$ 61 212 22 213 -150 18 92 -96 -121 -37 -142 34 172 45 -132 140 330 131 94 -63 -210 89 82
2422H2k10K22l2m66O74m68L19k84R4j06L25j07J45k39k77J07l2K65r4J77j01O0
$$ 82 -128 94 62 -404 270 -198 121 -163 -69 -175 150 43 188 -51 -328 -221 -253 12 -82 95 -6 54
2444E4l13K60n9j8n7q5M89j46j06j51k51N06l02J00J46K90l21j02o2K9K60P3k73
$$ 54 -259 1 -58 -76 -133 -218 271 125 19 -132 -383 123 -179 -79 67 357 36 -66 -128 -99 161 234 -39
2467c9J38j14rJ27j22j37K0J56p3K16j19N0l1j87k2j3J03J76Ok00N6oL5j20J26
$$ -39 99 -15 -24 103 -19 -156 -136 20 -53 163 44 94 63 -124 -146 -159 -56 120 126 -74 -18 -24 11 -109 17
2492A7L0K65j92j13Q1k06l8K59k84K10M2k4J9l6j5k0j62K57J05l55p2M8K44j28
$$ 17 47 312 120 7 88 -118 -156 103 -181 29 71 47 66 30 15 -5 -167 90 195 -160 -232 -184 60 -68
2516f8J84k60K82m5p6J14j44J74k07N1p7J28j24N4j7J19l15N8L38J04k84J04o2
$$ -68 116 -144 138 93 17 131 -13 161 -46 5 -72 56 -68 -14 -31 88 -227 -169 169 273 -11 93 31
2539C1N0j1j08L20l26k14K72pL3j85K96k19K16j27K9k90J91L00k63l0k67K34J4
$$ 31 81 70 -38 282 -44 -258 14 7 40 -145 151 -68 148 21 50 -240 -49 251 -12 -42 -309 -75 -61
2562f1J13R0J63m14j48P5J30p7O5J70k50j0J60n5J54l5k41L16j00m08K31OK12
$$ -61 52 142 305 -109 -257 -182 -52 -129 -64 106 -144 -154 6 -49 105 70 -171 145 45 -363 -132 -126 86
2585H6k20J03J99j67J13k27K76k7K29m92r8K77K56k05Ko4k3k14J04N9K49K7j39
$$ 86 -134 -31 168 1 114 -113 163 136 365 -127 -225 52 308 103 105 41 18 -196 -92 -33 216 243 104
2608A04K23k57N7m0J08l49K07j4m2j1l92L63J31K27n36Q9M32k46L1k2J23j33k6
$$ 104 327 70 127 87 195 -154 53 39 -3 -14 -406 -43 88 315 -221 -132 300 54 85 63 186 53 27
2631B7M7j53m7J25Q1j61j26J26J43q7J84j90P4j4k7j08J27Lj47K08j07K5k30M37
$$ 27 74 -79 -126 -1 80 -81 -207 -81 62 -25 159 -31 43 29 2 -106 21 24 -123 85 -22 3 -227 210
2655B10l59K66L8p64N05j03J90q6L1K36p0O9k47K94l30L21j95N1j71Q7j69J63
$$ 210 -149 117 155 -609 -104 -207 -17 -103 -72 164 94 163 -84 210 -120 201 6 57 -114 -27 -196 -33
2677c3J42k61J14j67J46K19j12L07k99j3j97q3J75q4K7K3J31M0j38j3M7P2k31
$$ -33 109 -152 -38 -205 -59 160 48 355 56 43 -154 -237 -62 -146 -119 -96 35 75 -63 -76 -29 43 -188
2700a88L03jm12N10m49N65m97J94J35k82l7R7M05m00K3K49j27k98R1P1j66K36
$$ -188 115 114 -298 212 -237 328 -169 25 160 -122 -159 -62 343 -57 -34 215 88 -210 -119 -48 -214 22
2722B2K45n71K25J60k46o0L37k66N0k25J29n5K67q7r0o8q7L51j47m5L11q5j81
$$ 22 267 -304 -79 81 -165 -225 112 -154 -104 -329 -200 -255 12 -75 -165 -233 -320 31 -116 -161 150 65 -116
2745a16Q7k59J43J5J78J4j4j20N0l97M41O0K43j73l01J38J40rM1J7j64q9l0o9
$$ -116 -29 -288 -145 -130 48 62 48 -72 -22 -419 22 82 325 152 -149 -11 129 120 161 178 14 -75 -105 -174
2769a74L38k69Q7Q0J29N8j52L3l4j40kJ48j83K65l44R6J20m34K81J15m3J03k45
$$ -174 164 -105 -18 62 191 249 97 130 96 -44 -46 102 -81 184 -160 -64 56 -378 -97 18 -25 78 -167
2792a67K91k88K6L90k18J3L46k69j04J72l08J07J97j94j81M3j4K96m7R5j2J35
$$ -167 124 -164 -138 252 34 47 393 124 20 192 -116 -9 188 -6 -187 -144 -158 138 91 186 174 309
2814C09l88K82l69K76r0J04k2nl7o4j20j94L30j7j5j30K56M7q8l7J07l32L14j05
$$ 309 -79 203 -166 110 20 124 102 97 60 -4 -124 -318 12 -5 -20 -150 106 153 65 28 135 -197 117 12
2838A2L30k85j97K37j79o2J74n3kj41m1L87j01l6j48M35m79K14P6J2l39K12j33
$$ 12 342 57 -140 97 -82 -144 30 -23 -25 -166 -207 180 79 43 -105 330 -149 65 141 153 -186 26 -107
2861a07j3M91m97n8L4K62k38O2J8J27J3j89J54k64J63J07K9J25j23m2k70L54l56
$$ -107 -120 371 -126 -184 -150 112 -126 -64 -46 81 94 -95 59 -205 -42 65 94 219 96 54 -216 138 -218
2884b18J53J83N4m4l37R1K56o8q4J15N6QL6J10l77K35l11q0L08l7j39n8J16K09
$$ -218 -65 118 172 128 -209 -118 138 70 -14 101 157 165 201 311 -66 169 -142 -222 86 49 -90 -148 -32 177
2908A77o8k69K2K15o1j03K86k66j42M30j03k0RR5q6j77O1M3J5%j87J95l30R1J79
$$ 177 109 -160 -138 77 16 -87 199 -67 -209 221 118 98 107 202 116 -61 0 43 58 58 -129 66 -264 -173 6
2933FQ9J84j24j90K04J3j9k21J99Pk53J35jJ11l02QJ62k15J55J68j47J13l56J94
$$ 6 95 279 155 -35 169 182 163 -58 141 148 -105 30 29 140 -162 -154 8 -207 -52 116 -31 82 -274 -80
2957h0J47q2k74K81J65k3j23p4J35j28K09j77K65j62j19J21Ln1l66M1L18j47J40
$$ -80 67 -15 -289 -8 157 134 11 -63 72 -56 153 -24 241 79 -40 81 84 33 -333 -292 26 -121 19
2980A9R1K3k51L8P0J05N8k9l04K6M17l14r3K15j04rO2j25K47j15J04j94QL56m7
$$ 19 110 133 -118 -80 -10 95 153 124 -180 -154 263 -51 -144 71 -33 -42 20 -105 142 27 131 -63 -55 301 254
3005B54k56K1J75r8j59j49K3L30J45j6m3l66M5j27L93k60K73k28J76j78J99j66
$$ 254 -2 19 194 96 -63 -212 -189 141 286 270 227 -139 -94 -221 172 -88 185 -43 133 -45 154 -12
3027a2j1j36K12J21l71L46j61n6J10o2J58k97K77j86k57L87n6K81l40L2J03L3
$$ -12 -23 -159 53 174 -197 149 -12 -68 42 -20 138 -159 118 -68 -325 62 6 287 -53 -21 82 115
3049A15qk46K3M2j76K8R0Qk28P31l67j89L92l84p1K54J02k33j55L21P3Q9j81q9
$$ 115 107 -139 -116 -74 -250 -222 -132 -124 -352 379 12 -177 215 -169 -240 14 116 -117 -272 49 122 211 30 -59
3073e9J08j74J9K40j70J09n4k9K7K63j35k83N6P8L46m89L06k61j05K43q0j43P6
$$ -59 49 -125 -106 134 -36 73 19 -10 17 280 145 -138 -82 -4 342 -147 159 -102 -207 36 -44 -187 -111
3096a11L4J33j65N2k23K15j52K74l3pL5k33J30L0n5J60l20L53j23J48k04j52K07
$$ -111 -77 56 -109 -57 -280 -65 -217 57 24 17 52 -181 -51 -21 -76 84 -236 117 -6 142 -62 -214 -7
3119gj40k7K09j2N2K58m41Q0J84l09j14P9R2J41N7J63m56L36N3k01k37K20N2k9
$$ -7 -147 -174 35 23 75 333 -108 -28 156 -153 -267 -188 -96 45 102 265 -191 145 198 -3 -240 -20 32 3
3143CO6K6O3j13J69j81j42P6j20L72j56j80q8J28R8km0j78K39k01K44K16k77j8
$$ 3 69 95 158 45 214 33 -109 -33 -153 219 63 -117 -205 -77 21 19 -21 -199 40 -161 83 299 22 4
3167Dk83J34n3K12J4o5Pj23L10l04J45P0k39K75j08K14l65L3J89M6k7m8j73KM
$$ 4 -279 -145 -198 14 28 -37 -30 -153 157 -147 -2 68 -171 104 -4 210 -155 -122 67 113 86 38 -135 -133 -129
3192a29K15l50K96L5r6P3j19J18k08K88R0j41k5j3Q7k24N1k35K86J37j43J05m42
$$ -129 86 -264 32 67 -29 44 -75 43 -165 123 213 72 47 34 121 -103 -52 -287 -1 136 -7 98 -344
3215c44J40K93k51p9J52M6J92k08J1J72k10Q0O7j00nk19K53J19m59M19J82K86
$$ -344 -204 89 -162 -241 -89 -43 149 -59 -48 124 -86 -6 61 -39 -44 -263 -10 109 -350 69 251 537
3237E37n43j08J79k06J83m01L34k7j08k4K27m1k7Q7k24M04m23J36P4L5l5R3m2
$$ 537 -6 -114 65 -141 42 -359 -25 -52 -160 -184 43 2 -25 62 -162 242 -181 -45 29 64 29 122 80
3260H0K99j77j72j34K18j51J96r7k0j89N4j5j32K48k61L48j08j09K03j35J42k65
$$ 80 379 202 30 -104 114 -37 159 62 42 -147 -93 -108 -240 8 -253 95 -13 -122 81 -54 88 -177
3282a77M31j96k93J86K05k64j21N5J72J04j61J34k1J6k71L33j64j37J14K18k10
$$ -177 254 58 -235 -49 156 -108 -229 -174 -2 102 -59 75 54 70 -201 132 -32 -169 -55 163 -47
3303d7m5K91q9N8j3k14J04r4M0r9j7J95k0P8j38j52K64j74Q9k9j7m07K52R1K68
$$ -47 -92 199 110 168 155 -59 45 -49 -9 -108 -125 70 50 128 -10 -162 102 -72 17 -12 -29 -436 -184 -93 175
3328A75m07L13K45j94j40j52Q5j27K51l9L04k22j24j3J13j74L05m47j0K62K16
$$ 175 -232 81 326 132 -8 -160 -75 -202 49 10 314 92 -32 -45 68 -106 199 -248 -258 4 220
3349B20k86m4K4O5n7J65nk08Mk18L79k3r7L42k03L2k86J35K2%K39n7R8k92L8k59
$$ 220 -66 -110 -86 -21 -78 87 82 -126 -122 -340 39 16 -81 261 58 90 -196 -61 -39 -39 200 143 241 -51 -13 -272
3375b72M95m33N44k18P7j23k00J8J47j5k01P5J84k04J07q7J39J87k68K82q9k37
$$ -272 223 -210 334 116 193 70 -130 -112 35 20 -181 -106 78 -126 -19 -106 33 220 -48 234 145 -92
3397i2O3J24j55l6O5k3j6K67j68j3j97K23p1K1L5k65L63l5k17L65k39j19J40R9
$$ -92 -29 95 -60 -96 -31 -54 -70 197 29 16 -181 42 -29 -8 27 -238 125 90 -127 238 -1 -120 20 119
3421A19q1J80l46L3K51k5n6j36r7J46J6j67K06k00J74o7N1J14M4rk70N20l53P0
$$ 119 38 218 -128 -95 156 131 75 -61 -158 -12 4 -163 43 -157 17 -50 1 115 159 150 -120 400 47 117
3445A17N7j8j04R6j62o1J33J57k98J06J67l23K69j17j39J60k40N07r8k52n6M6
$$ 117 174 156 52 148 -14 -75 58 215 -83 23 190 -133 136 19 -120 40 -200 307 209 -43 -99 -53
3467e3J68m29J69J93K50k58k86J07K40k81L5Q8PJ25KQ0l66Q8J58r2P2p7J72j15
$$ -53 115 -314 -145 48 298 40 -246 -139 101 -180 -145 -57 -50 75 77 157 -209 -121 37 -55 17 -60 112 -3
3491cN6m1p0p1J58K0j53OR8l03L70J0k36J70k05K31K03k88L03l78l4K27N5o0k06
$$ -3 53 12 -58 -129 29 49 -104 -98 0 -303 67 77 -159 11 -194 37 240 -48 255 -123 -157 70 125 65 -141
3516a41J54j47K87j86n9M58m09K9j49J75K94k46j76O5p4K8R9P9j67K7r4O5j49
$$ -141 13 -134 153 -33 -92 366 -43 -14 -163 12 306 60 -116 -51 -125 -97 2 81 -86 -59 -153 -88 -237
3539b37J32P2J12k30J3l7o8J27J51k24L12l16M22l61J78p6j63L02l91M91j17J1
$$ -237 -105 -33 79 -151 -138 -175 -243 -116 35 -189 123 -193 229 -132 46 -30 -193 109 -282 209 92 103
3561A03k03k6L23k42J13J21k49L8j14K98j90J76k60P8J40j98K0N6p8J83k40N5
$$ 103 -100 -126 197 -45 68 189 -60 -22 -136 162 -28 148 -112 -34 106 -92 -72 -16 -94 89 -151 -96
3583i6jj03J74Q4l63J29L08m1l28K35j97P6K12j05r0m2K03J8k10K09k13L6J94
$$ -96 -97 -200 -26 58 -305 -176 132 91 -237 -2 -199 -123 89 -16 -106 -148 55 73 -137 72 -141 -105 89
3606H9o0k8M7j23k08L54mk20J24j07p2J86l7k48L32k28K40Q0j42J05l77M34j47
$$ 89 29 1 48 -75 -283 71 67 -153 -29 -136 -208 -22 -59 -307 25 -203 37 117 -25 80 -297 137 -10
3629a0m8K1M5k5K37n90L04J39k61j54L42MMm4N8j19J49Oq7N5R4m6p2j36J59p6
$$ -10 -58 -37 8 -17 220 -370 -66 73 -188 -342 0 4 8 -36 22 -97 52 58 -29 26 120 74 2 -134 25 -51
3655e1J02L6Q6k39M0R1k3Q6l19K56k25J05P3L8p4J51p0j11OL04k20J22k37q6J1
$$ -51 51 87 173 -66 -26 65 42 128 -191 65 -160 -55 18 56 -18 133 63 -48 -42 262 42 164 -73 -159 -148
3680a48m4L91r4l59M6K33N7or0j12J53K94m91J74j2j36rM4M80m08k3J5J00J1L0
$$ -148 -192 199 105 -254 -208 25 82 76 -14 -126 27 321 -170 4 -8 -144 -153 -109 371 -37 -60 -45 55 66 96
3705I6l17M05j40j15J28q4j83O2K30N9r9j2M8l76O10n9k10M7j24L1o5k65R9L61
$$ 96 -221 184 44 -71 57 -27 -210 -148 82 141 42 30 78 -298 312 253 43 90 -34 -3 -68 -333 -234 127
3729A27m1j11j30O24k97l19K72j85K45m02J56K62j32J07j28r7q3K84l77J89k25
$$ 127 86 -25 -155 469 172 -147 125 -60 185 -217 -61 201 69 176 48 -49 -132 152 -225 -36 -261
3750b61M06l33L15k02R6L3J2K83k22Q7j45j2j87L46k18N4N9j47J41j0K6k61o2
$$ -261 145 -188 127 -75 21 54 66 349 127 214 69 57 -130 216 -2 52 111 -36 105 95 121 -140 -202
3773b02N2K36k85N6j04K33k4j48K35k56K37l1K5p8J8N7K1k49O4K4J04j50P4K07
$$ -202 -150 86 -199 -143 -247 -14 -38 -186 49 -207 30 -1 24 -54 -36 21 42 -207 -143 -119 -15 -165 -91 116
3797A16n4j5j80j74K18j54K60L52l21K3Q4k30j24L6P4K66l03mJ73k5j75Q3No1
$$ 116 62 47 -133 -307 -89 -243 17 369 48 71 155 -75 -199 -163 -89 177 -126 -130 43 18 -157 -74 -69 -130
3821a30M8p3K19k52J86JJ50l7k15N0j88K25J59%J22k35l3J61J5l68J41N1j4J33
$$ -130 -82 -155 64 -188 -2 -1 149 112 -103 -53 -241 -16 143 143 265 30 -3 158 173 -195 -54 -3 -17 116
3845A16j11j91J21Q4o6k0Q0p2P4q5q6K27K6j54k61J12J74O3j01j91L05l35J99
$$ 116 5 -186 -65 19 -47 -67 13 -59 15 -70 -156 71 97 -57 -318 -206 -32 31 -70 -261 44 -291 -92
3868i2J32j87k16N44j34j72N3Mk1j1n6J14J14j65R2q8l0Q5r7J59P1k7k58K28j04
$$ -92 40 -147 -363 181 47 -125 -72 -68 -89 -100 -156 -42 72 -93 -1 -89 -119 -34 -131 28 99 72 -186 42 -62
3893f2J11r4K34j4J24k69r2k7J12N5j22J07m43K99mj01L93j39n8q1J71k35N11
$$ -62 49 -45 189 175 299 30 -62 -89 23 78 -44 63 -380 -81 -85 -186 207 68 10 -71 100 -135 376
3916C76k88n3P9j20j16j01K07Q4k39J25j17J77NO9j16J25p4J60j22k52M47ol16
$$ 376 88 35 114 -6 -122 -223 -16 68 -171 -46 -163 14 19 88 -28 97 23 183 61 -191 256 250 -66
3939f6O3K20j08j52l4K21l12j8Q7J77j79K14j09K2K66k70J05L8o6j57R7J23p3
$$ -66 -3 217 109 -43 -77 144 -168 -186 -99 78 -101 113 4 26 292 22 127 165 99 -58 39 162 89
3962H9l39N08j28L7l55J18K87j01k45J70k55J82J4j36J77J94j00l21K93J30k36
$$ 89 -250 258 130 167 -188 -70 217 116 -129 41 -214 -32 -18 -154 23 217 117 -204 89 219 -17
3983a7N7R0L1j11r5k02lL51J12j63J3j07L3J21j08r8j45M49k81J17j17R8N5l35
$$ -17 40 130 161 50 -45 -247 -250 101 213 50 63 -44 -11 110 2 -96 -241 208 -73 44 -73 25 80 -255
4007b55L35j01PP7r0k64J47J76J43k68J87R1l06J08p5K61Kk25J64j04K02k8j69
$$ -255 80 -21 -14 63 -27 -291 -144 32 175 -93 94 185 -121 -13 -88 173 175 -50 114 10 212 184 15
4030A5L3j40k38L62l52L84Q3j25p1M9o0m3j73N48o05K29K83k16Q5j66J87q8K6
$$ 15 48 -92 -330 32 -320 64 147 22 -49 0 -60 -103 -276 272 -333 -104 179 -37 48 -118 69 -19 7
4053GJ66O2r2q7J15j37J04k84l7J22j12J77J15k19N8n9Q5ml3Q1r4K59Kk56J39
$$ 7 173 235 143 56 171 34 138 -146 -183 -61 -173 4 119 -100 -42 -101 -16 -20 -53 28 -66 193 195 -61 78
4078G8O9J88m8j65N1k66O1k69K57r2L6j31r4N88k42J6j6j43K10j48K7O2k9k90
$$ 78 147 335 287 122 173 -93 -32 -301 -44 -136 -100 -231 -325 263 21 37 21 -122 88 -60 -33 29 0 -290
4102b90L19L4L2R5k19k35J60J01O7K1k20P5j48K28R8k03k5K3K15m41L48K05n48
$$ -290 29 63 95 190 -29 -264 -104 -3 64 85 -135 -60 -208 20 118 -85 -110 -87 128 -313 35 240 -308
4125c08J90J04J46q9J1q3L96l08K38j91J00j56O0q2r3K21j49m7P5r3Q7J45l9l09
$$ -308 -118 -14 132 43 54 -29 367 59 297 106 206 50 110 28 -65 156 7 -40 35 -58 29 174 135 -174
4149a74m0J14k7K53l46L05J44k19j12J75j92%J13L4J66j83J2j13J1M6k7o2Mm1
$$ -174 -214 -100 -127 126 -220 85 229 10 -102 73 -119 -119 -6 28 194 11 23 -90 -79 -33 -60 -122 -118 -159
4173a59J1L42p3j31M3k69J66J60J70j68q7j46O9J95O0j81L65n44K24j96M4n7R6
$$ -159 -148 194 121 -10 33 -236 -70 90 260 92 5 -141 -72 123 183 2 367 -177 47 -149 -105 -162 -66
4196f6j43Q9M15m19mQ8o3J96j67P8Q9J87l78M9K10j07j52l0J38K63k01j86j24
$$ -66 -209 -120 295 -124 -128 -40 -103 93 -74 4 93 280 -98 -49 161 54 -98 -128 10 273 72 -114 -238
4219b38N2K11o5q5J83l27M21m18N09j78o3J36J93k86J01J8Rj7j01j70J8R9j66
$$ -238 -186 25 -40 -125 58 -269 152 -266 243 65 2 138 331 45 146 164 173 156 55 -115 -97 2 -164
4242a64L94k63Qk51M61j46k51M60k53J72k61Q8J70l71M32j44r6J56q0K8Qj48M3
$$ -164 230 -33 -25 -276 185 39 -212 248 -5 167 -94 -6 164 -207 225 81 -15 141 61 89 97 -51 -8
4265ho2J0J53j21K3jpJ8K05l55M36m8l27J42K6K5j67r4M7L60k57p0N7J87k22J4
$$ -8 -70 -60 93 -28 -5 -6 -13 5 210 -145 291 243 -84 58 84 109 -58 -152 -105 255 -2 -72 -15 172 -50 -36
4291c6p3M3J91J10l77%J96j45m97L19L48n9O6m1K24k21N8k09K13P9k59Pr5J78
$$ -36 -109 -66 125 235 -142 -142 54 -91 -588 -269 79 20 86 45 269 48 106 -103 110 189 -70 -63 -158 20
4315B0r4J49j23J62J2k42K3j54L31O5j36j76L12J25r8K45l33k27J31m1j87P5K92
$$ 20 -74 75 -48 114 126 -116 -93 -247 84 149 13 -163 149 274 176 421 88 -139 -8 -49 -236 -161 131
4338A31l06J73J96l12K72j62M9L7n7k99L44J90j99J74j59j50k73N08q8j55K10
$$ 131 -175 -2 194 -118 154 -8 41 78 21 -278 66 256 57 231 72 -78 -351 157 69 -86 124
4359A24k36j34K40j41L58m32R1j65L47R9l90L27j00j64K34J04l21K19p7K6j64
$$ 124 -112 -246 -6 -147 211 -221 -130 -295 52 151 -239 88 -12 -176 58 162 -159 60 -17 9 -155
4380a55KR6J16Oj0J52k8j81n8J60j38j80L38j65J91l23J36J88j71L02n29L14k54
$$ -155 -153 -57 59 65 55 207 179 -2 -60 100 -38 -218 120 -45 146 -177 -41 147 -24 278 -251 63 -191
4403a91K24J12r3k44K46l6j3J27l1R7m48L50k48K61r4L3J29j85Q8k56J73M6O7
$$ -191 33 145 52 -192 54 18 5 132 101 198 -250 100 -148 113 19 52 181 -4 84 -172 1 47 114
4426A14k22J22j58K78k12K72k80J90N6m7N4l19Q8N4J43k91oo7K29j77L77k37j21
$$ 114 -108 14 -144 134 -78 194 -86 104 160 113 167 -152 -64 -10 133 -158 -164 -231 -2 -179 198 -39 -160
4449a60mR4K53j79J21J8j56N0p6j13J23K30o9j47q6m9J7J08n6Pq6L5L2M10j96
$$ -160 -164 -70 183 4 125 143 -13 37 -39 -152 -29 201 132 -15 -101 -150 -133 -25 -81 -74 -160 -125 -93 317 121
4474A21j90J09J00np8p0j81J10R8j77O1L33j79J50j81m4K3J08P4m25L49k35K57
$$ 121 -69 40 140 135 57 -13 -194 -84 14 -163 -102 231 52 202 21 -23 0 108 182 -243 106 -129 128
4497A28k42L45l65j18M12j53P5k62M23J90n44k22J79M61k7l04n5K06K01m11J13
$$ 128 -114 231 -134 -252 160 7 82 -180 243 433 -111 -333 -154 307 280 -24 -79 127 328 -83 30
4518C0j53K23l0k98O01l67j16L15r7j64K60m70K93K3l23J95j32L07j79J25M6M5
$$ 30 -123 100 70 -228 373 6 -110 205 108 -56 204 -266 27 50 -273 -78 -210 97 -82 43 89 134
4540A34r4N4J77k74j84P5K8Q0o1M9K60j90n9J19k63NJ83N1M6j83P1l42L35j04
$$ 134 40 94 271 -3 -187 -112 -84 -4 -65 -16 244 54 -5 114 -149 -144 39 90 136 -47 24 -318 17 -87
4564h7j80J99K66m30J80K86j37k41J60R7k31P9j49n2J14L94k63j4L52o46L06j0
$$ -87 -267 -68 198 -232 -52 234 97 -144 16 113 -118 -39 -188 -240 -126 268 5 -9 343 -303 3 -7
4586gn1J68k0q7M24m59O2l5O4o0J00L7o0j66J55j27J13p8Q3j3J10q9j58Q4Jl0
$$ -7 -58 110 90 3 427 -32 30 -5 59 -1 99 136 76 -90 65 -62 51 -27 56 43 153 64 -94 -10 -9 -39
4612c9N1j22l4J54k18M20k73N2o5r5L17l01K21k50L45l25J00J50q5J5k91J58O5
$$ -39 12 -110 -144 10 -208 212 -61 -9 -74 -169 148 -153 68 -182 163 -162 -62 88 3 18 -273 -115 -50
4635e0j85j04L07p4j09K06R5J25l60j6K0R2J34K01j98k72K35k63M35n23M93j81
$$ -50 -235 -339 -32 -106 -215 -9 86 211 -149 -165 -145 -53 81 282 84 -188 47 -216 219 -304 189 8
4657HM7J34k42q6K33j1j49J39K0k22L26l02L6Jk4R5K45k71J64L4n6k38p2J33q7
$$ 8 55 189 -53 -139 94 83 -66 73 93 -129 197 -105 -69 -68 -92 3 248 -23 141 175 119 -119 -191 -58 -145
4682a45J73l0J44o8J78k33K0R5l33J37L19j08k90K12Nj27j02J96j5J0j10j0J70
$$ -145 28 -2 142 74 252 19 39 134 -199 -62 257 149 -141 71 76 -51 -153 43 28 38 -72 -82 88
4705H8j91K66p1J7Ok22K23j95j4J26K07l34O1q2J42jr7jK43l65N5K7L54k15J00
$$ 88 -103 163 92 109 115 -107 116 -79 -93 33 240 -94 -33 -115 27 26 -71 -72 171 -194 -139 -112 242 27 127
4730A27N1j96O7n0n7j0p7l1K66jj06kK7l2K07j80J20l82J81k06J72j03o8M86k71
$$ 127 178 -18 49 -1 -58 -68 -145 -176 90 89 -17 -19 8 -24 183 3 123 -259 -78 -284 -112 -215 -283 203 -68
4755f8j80J51J05K11j60m5L09l71M5J66m20N0J87j99M20k22L41n27K47J33k59
$$ -68 -248 -97 8 219 59 14 323 -48 -3 163 -257 -207 -20 -219 201 -21 320 -207 40 173 -86
4776h6K0J69k37L09j81j75N8J55j23n6K60j01J63l32J08K08j85r1J47j82J58j88
$$ -86 -66 103 -134 175 -6 -181 -123 32 -91 -147 113 12 175 -157 -49 159 -26 -117 30 -152 6 -182
4798a82J4j52K77k1R1Q0n6Q5J14m08l4L63j13O1k27qM94l27j68M5J03j08j64K33
$$ -182 -168 -320 -43 -64 27 107 51 136 250 -158 -192 171 58 119 -108 -116 378 51 -117 -72 31 -77 -241 -8
4822hk31K45J24j29j14J33Q9P4O4k42K0J76k02K48m13K2n2J08J44Q6j53J48m51
$$ -8 -239 6 130 1 -113 20 109 183 247 5 25 201 -1 247 -166 -144 -196 -88 56 142 -11 137 -314
4845c14L64l01K39l13K27J24k01L53k14K27k37k02J51k07K61K09k44j3J89n2j09
$$ -314 50 -251 -12 -325 -98 26 -175 178 -36 191 -46 -248 -97 -304 -43 166 -78 -91 98 46 -63
4866f3L6o7r8L18j55p7k9K17j26k4j06J46j8j65K89j38L21k20k69M95l33J51n6
$$ -63 -27 -94 -192 126 -29 -106 -135 82 -44 -68 -174 -28 -46 -211 78 -60 261 41 -228 267 -66 85 29
4889B9j78J18J0K6j84L67k34m7M4J08M3m94K81P2K38q7r7n7J30k08k01K63K26
$$ 29 -149 -31 -21 5 -179 188 -46 -93 -49 59 102 -392 -111 -39 199 112 15 -42 88 -120 -321 -58 168
4912A68j31qR3M9L7j85n5J5J03omN5j54R1r5J1m3p5J08j29Q8N31l35K9j12J58
$$ 168 37 29 122 171 208 23 -32 -17 86 80 76 131 -23 68 -27 -16 -59 -134 -26 -155 -67 464 129 158 46 204
4938B04k50K04p2r3o2j9L1O0o0J92m48M40k20J07K3L9O3k02N5p7K52k87K92k38
$$ 204 -46 158 86 -7 -69 -88 -57 3 -57 135 -313 127 -93 14 37 76 139 -63 -8 -85 167 -120 172 -66
4962f6K27L3j61Q2n2j98L12l83J25Q5J87j94Q3J51NJ3j07j72K03k97J46k08K93
$$ -66 161 194 33 115 63 -135 177 -206 -81 4 191 -3 80 231 236 249 142 -30 173 -124 22 -186 107
4985A07q9k06J72l21L22K13n34L97N6k60l9J94jj6j06J45J9K4m9j4r0K91j51k28
$$ 107 18 -188 -16 -337 -15 198 -336 61 117 -143 -182 12 11 -5 -111 34 53 77 28 14 -76 215 64 -164
5009a64K10k75J51n3J68j97L9P8J74j9J53l49N3JJ62k06j03L32j75J25l84Q9P6
$$ -164 46 -229 -78 -131 37 -160 -121 -43 131 112 265 -84 -31 -30 132 -74 -177 155 -20 105 -279 -190 -114
5032a14L5k52M19k23Q9L8J53k24O2l2k8R9N4J49k02J43k67N2K29J15l54L97j39
$$ -114 -79 -331 88 -135 -46 -8 145 -79 -17 -49 -77 22 76 225 23 166 -101 -49 180 295 -59 338 199
5055A99j19k32K69j40J45r9J81J32k17j69k14M51j63O8j91J0L52k54j92R1J15
$$ 199 80 -152 117 -23 122 23 204 336 119 -50 -264 187 24 92 -99 -89 263 9 -183 -92 23
5076B3J30m09M08j23j28L15J3l71K05J25j97k78L87K44k78k18K95r6M4m43K89
$$ 23 153 -256 152 29 -99 216 229 -142 63 188 -9 -287 100 344 66 -152 143 47 91 -352 -63
5097f3L04L1k51j16J17j32k3K68j9Kj64o0Q4J22k15k38K72J02K4l0J95r0k08J69
$$ -63 241 272 21 -95 22 -110 -133 135 116 118 -46 -106 -22 100 -115 -353 -81 21 45 15 210 120 -88 81
5121H1j70L66j90j31j73K3J68m7J27r9J81K4r2o8j39J05j32J62K92J6k37L6l5
$$ 81 -89 277 87 -44 -217 -194 -26 -73 54 -45 136 160 68 0 -139 -34 -166 -4 288 304 67 103 68
5144F8J64k67k40J61J03j60J05j54J13P3J5m5P0K35j57p7J22k21J28j42K99j79
$$ 68 232 -35 -275 -114 -11 -171 -66 -220 -107 -34 -19 -64 6 241 84 7 129 -92 36 -106 193 14
5166A4k90K08J43k16j2J26j5J27J66j94m4k79L25p1J2m02N59K52j23k24k6j0n3
$$ 14 -276 -68 75 -141 -153 -27 -42 85 251 57 13 -266 59 -12 0 -402 157 409 286 62 36 26 -27
5189b7K64l69O6J2R6%P5r1k47J16p5J23J04k87J22J75k5j5O9j22j33K25j3l3k41
$$ -27 237 -132 -66 -54 42 42 117 26 -221 -105 -180 -57 47 -240 -118 57 32 17 86 -36 -169 56 43 10 -231
5214b31L29o8o6J3j55q1M59mj54q6K72l54M63m49K07K3k44N2J33L4J30l44K23
$$ -231 98 30 -36 -23 -178 -259 200 196 42 -44 228 -126 337 -112 95 118 -126 -74 59 93 223 -121 102
5237A02k02K57k40J77j16Q9N7j37p7n4K42k62L89k27O0l00M94j24l5k41J00j78
$$ 102 -100 157 -83 94 -22 67 124 -13 -90 -144 98 -164 225 -2 58 -242 252 128 93 -148 -48 -226
5259b26J65N9r5M91j23j68j94J89k73M4J57m7J02k00L35p4L5Q9r3L0j42J47m83
$$ -226 -61 -2 -97 394 271 103 -91 98 -175 -131 26 -21 81 -119 216 142 177 266 173 203 61 208 -275
5282b75K06J73k2j21J31j71K42k93L38j99J95k09J43k39K78k54J88k91K70j17
$$ -275 -69 104 82 -39 92 -79 163 -130 208 9 204 -5 138 -101 177 -77 111 -180 90 -27
5302b7O2j50K13J35q3k71K27j15O9N6n1j77Q8j95J57q3P2k6l7P3L6K38q0j5k82
$$ -27 35 -115 98 233 150 -121 106 -9 60 116 65 -112 -24 -219 -62 -145 -73 -99 -136 -63 -27 211 131 116 -166
5327a66Q2k4K18j16j38K57k8l57M66k14r7Q4m4K44pj93L11j82Ko3j36K07p1P9
$$ -166 -84 -108 110 -6 -144 113 85 -272 194 -20 -117 -33 -77 167 160 -33 278 96 98 35 -101 106 35 114
5351A14k17P9L87l00j11L6r6L52l89R1M21m13k55M46k72J3O6K66l67K97N0k95
$$ 114 -103 -24 363 63 -48 -12 -108 244 -145 -54 367 -46 -301 145 -127 -114 -48 218 -149 148 198 -97
5373i7m8J89k41K21O5l49J27OR7M29m34j09K73j48lK91j92j04j1j24L72O9m41
$$ -97 -145 44 -197 24 89 -260 -133 -127 -30 399 -35 -144 129 -19 -22 269 77 -27 -38 -162 210 279 -162
5396a62K13n6o8K28j58r3j4j03M64l33j82J27J19k2m2K12j95L74k06p7k35L08
$$ -162 51 -5 -73 155 -3 -96 -110 -213 251 -82 -264 -137 -18 -40 -82 130 -65 309 103 26 -209 99
5418I9j76R5j53J6J32J11l29L3M2R7L6J39l7l34K89K19n24L19J27l40rJ37J09
$$ 99 -77 18 -135 -119 13 124 -205 -172 -130 -33 3 142 105 -229 60 279 -245 74 201 -139 -148 -11 98
5441I8l99K09J09L1j93Q4Q5k61L26J02q2m15J06P5N0K8P9JJ6m0J29j39P6R1j10
$$ 98 -301 -92 17 48 -145 -61 24 -237 89 191 109 -306 -200 -125 -75 -47 32 33 49 9 138 -1 75 166 56
5466E6J67k40m1L43J52o94K55J04j7J05k43J12m4N8j00K11r7J0j16qP0rMP2k27
$$ 56 223 -17 -58 285 437 -257 -2 102 85 190 -53 59 15 73 -27 184 87 97 -19 -27 43 34 38 110 -117
5491a17J8K55j23Q5n4p9l21M24p9j00N7k5J57k61j3j18M0O38k09O9r9N8j48P3
$$ -117 -99 156 33 118 64 -15 -336 88 9 -91 -34 -59 98 -163 -176 -294 -254 384 175 244 145 203 55 128
5515A28j70L8l3K7QM2J85l95J17m3J36J7m3Q5Q3j18q2j2P2J59j12Om9M1j55J04
$$ 128 -42 -4 -37 -10 -2 40 225 -170 -53 -96 40 57 14 99 182 64 -18 -30 42 201 89 95 46 87 -68 36
5541C6J16M3j35k78K10m8J16j86P5K04k22R4o9jp7L2L31k91pk05K20L1K00mj45
$$ 36 152 195 60 -218 -8 -56 60 -126 -51 153 -69 25 -44 -45 -122 -90 241 -50 -57 -262 -42 -11 189 185 40
5566D0j19p6K50O5k5n7n7K77j03r8J03m3J29k72k44K44l01L59j29j53L59n2l00
$$ 40 -79 -155 95 160 135 78 21 298 195 97 200 157 286 14 -230 14 -287 72 -57 -210 149 97 -203
5589b03M7K39k34J64n6K70l78J99M3K8J18m63J47K76j67P9j23q1K92k97J20j80
$$ -203 -156 83 -151 13 -43 227 -151 48 91 119 237 -226 -79 197 30 109 -14 -95 197 -100 20 -160
5611a60L20j25K88j67l89M73R1m12j3K18j30K39k48qj63K08o1P3j66K39J05j27
$$ -160 160 35 323 156 -233 240 331 -81 -94 124 -6 233 -15 -23 -186 22 -39 34 -132 107 212 85
5633H5j80J17l3J17l41K80m9nN0O3j37R3n8J6p9K6P6J11m0k4Q6k16J55k28m4K4
$$ 85 -95 22 -11 106 -235 45 -4 -9 41 104 -33 60 2 18 -61 -35 41 152 112 88 174 -42 113 -115 -159 -135
5659a35K26k38K95q5N3n0j96J94m3m8K4J13j24J37j06p6j10J56R2J33k96j35L15
$$ -135 91 -147 148 63 116 66 -130 64 21 -27 -3 110 -14 123 17 -59 -169 -13 79 212 -84 -219 96
5682I6R3j55J20K89m54n2k7l0K07j87q2K93n11N02k65L26r8k31J20J46M2j53k5
$$ 96 189 34 154 443 -11 -63 -90 -120 87 -100 -182 111 -400 102 -163 163 65 -166 -46 100 142 -11 -36
5705c6l38K55L78k89j3K38j95J79k60n3PK46m8k4n5L5J18J52m56K72l29L82k46
$$ -36 -374 -119 259 -30 -43 195 0 179 -81 -134 -127 119 71 47 -8 27 145 297 -159 113 -216 166 -80
5728h0k0L8J74Jj17j44R6J56r1J83n3L1l24K31l7J08l4n6k89M70l07o7R9J35m9
$$ -80 -100 -62 112 113 -4 -148 -52 104 13 196 143 174 -150 81 44 152 118 62 -227 243 -64 -131 -32 103 54
5753E4J43j74J35j77J20j32j12J88j02K23Mk31J39j98K71j36l62J03L63j24O9
$$ 54 197 23 158 -19 101 -31 -143 45 -57 166 170 -61 78 -120 151 15 -347 -244 119 -5 64
5774F4M8j00K34j92k88J27K34j08Q2k23k8J56K09j16q5L9J69k95M5k27R0J99q6
$$ 64 112 12 246 54 -234 -107 127 19 101 -122 -150 6 215 99 14 53 222 -73 -28 -255 -165 34 -52
5797e2Q9o0P9k67R7J87%L8p7k12J58O9r6k05L11j47j7O6J13q0o4m5L43k76K09
$$ -52 37 -23 56 -211 -114 73 73 111 34 -178 -20 49 -47 -252 59 -88 -105 -39 74 -6 -70 -115 228 -48 161
5822A61Kj53j32J44O6k09k5L30L0l72K94j79k17K96k45J74J06j75L13k82n0J67
$$ 161 163 10 -122 22 88 -121 -146 184 214 -158 136 -43 -260 36 -209 -35 71 -104 209 -73 -123 44
5844D4l45J79L24k48n7L20k77J40J59n5j66n0R8%k27j50K34J90J26k70l3Q4M9
$$ 44 -301 -122 202 -46 -103 217 -60 80 239 184 18 -32 66 66 -161 -311 -77 113 239 -31 -64 20 69
5867F9j78j66L85K5j67J63K3m04J27Q4K00m12J48M84l52O4j56r4L11p9j17j86
$$ 69 -109 -275 110 135 -32 131 154 -250 -123 -39 161 -251 -103 381 29 93 -63 -157 154 75 -42 -228
5889b28P2J10j64K16j36K66q9l4J73l93K43k98L10j10J47l11L02k99K80K03r9
$$ -228 -156 -46 -210 6 -130 136 47 13 186 -207 36 -262 48 -62 85 -226 76 -223 57 260 161
5910A61Rk95K66k0k39K33O9l38M30l12j04j49L60j56l8P6n5J95p7j65L9J65J95
$$ 161 170 -125 141 121 -118 115 184 -154 276 -36 -140 -289 71 -85 -123 -47 -102 93 16 -149 -110 55 250
5933B50k97N6J95k49J62j63J13j31K71l85J34K21k65P2l44K36J60o1J33n2j18
$$ 250 -47 9 204 -45 117 -46 67 -64 207 -178 -44 177 -88 -16 -360 -124 36 -25 108 56 -62
5954f2Q6K29m06M60m82J32j0K69k4o4j74j18K09j39K06j01J69j49J2k39K74n8
$$ -62 24 253 -153 307 -175 -43 -53 216 192 128 -46 -164 45 -94 112 11 180 31 43 -196 78 20
5976B0p5K45j16R0r6k3k24M09j33J00q6j25j04K3p9NJ53J27j05L9j7j63J76q4
$$ 20 -55 190 74 164 68 45 -179 230 97 197 111 -14 -118 -95 -174 -169 -16 111 6 45 28 -135 41 -43
6000d3ol6K21j56J08j90r5K78j66PM40n22K06K5lk53jK12L1o1q8J34J04j56M4
$$ -43 -49 -85 136 -20 88 -102 -197 81 -85 -78 362 -160 46 71 68 -185 -186 26 57 -4 -92 42 146 -10 34
6025C4J92l37J00K96n71P2L20K34k48j43J03r3r9K19j87R4j35K73m6j91J44j8
$$ 34 226 -111 -11 285 -286 -214 106 340 92 -51 52 -41 -140 79 -108 -14 -149 124 78 -113 31 13
6047A3k66J69Q8J4K43n19K68J28k6j5n3J64l46M03j73P9o7O2j73j17K11q2j3K45
$$ 13 -253 -84 4 18 261 -258 10 138 112 97 44 208 -138 265 92 171 104 166 -7 -124 87 5 -8 237
6071B37m54K38j62O5J75l9PO2q8NO6k19J66r1j55K59N9k8j23k2J96l37K08q7Q5
$$ 237 -217 21 -141 -76 99 60 67 129 41 46 112 -107 59 -32 -187 72 131 103 -20 -42 154 -183 25 -62 23
6096B3J10M3k16j43J25J64m6l12N7R4L4L37n66L11J8L3j20LP8J64j47l07L16m8
$$ 23 133 176 -40 -183 -58 106 60 -252 -195 -101 -67 270 -296 15 33 66 -54 -51 27 191 44 -263 53 5
$$ [...]
8191b02
##END NTUPLES=NMR FID
##END=
