##TITLE=1H_DE-105K
 200.13MHz, CDCl3,
 8 sc
 
 5.8.2025
##JCAMPDX= 6.0         $$ Bruker NMR JCAMP-DX V2.0
##DATA TYPE= NMR FID
##DATA CLASS= NTUPLES
##ORIGIN= UXNMR, Bruker Analytische Messtechnik GmbH
##OWNER= pz
$$ XWIN-NMR		Version 3.5
$$ Tue Aug  5 15:22:43 2025 Russian Standard Time (UT+4h)  she@DPX200
##.OBSERVE FREQUENCY= 200.1313
##.OBSERVE NUCLEUS= ^1H
##.DELAY= (6, 6)
##.ACQUISITION MODE= SIMULTANEOUS
##.ACQUISITION SCHEME= undefined
##.AVERAGES= 8
##.DIGITISER RES= 18
##SPECTROMETER/DATA SYSTEM= spect
##.PULSE SEQUENCE= zg30
##.SOLVENT NAME= CDCl3
##.SHIFT REFERENCE= (INTERNAL, CDCl3, 0, 14.3821)
##AUDIT TRAIL= $$ (NUMBER, WHEN, WHO, WHERE, WHAT)
$$ ##TITLE= Audit trail, XWIN-NMR		Version 3.5
$$ ##JCAMPDX= 5.01
$$ ##ORIGIN= Bruker BioSpin GmbH
$$ ##OWNER= she
$$ F:/spectra/data/she/nmr/H-C/1/audita.txt
$$ ##AUDIT TRAIL=  $$ (NUMBER, WHEN, WHO, WHERE, WHAT)
(   1,<2025-08-05 15:22:01.29 +0400>,<she>,<DPX200>,
      <created by zg, POWCHK disabled, PULCHK disabled
       configuration hash MD5:
       00 E9 B6 7A A2 85 ED C7 34 08 36 98 17 FE 4E 26
       data hash MD5: 16K
       97 66 20 2B 42 79 17 2A 28 9F A3 03 DC 3F B7 A6>)
$$ ##END=
$$ 
$$ hash MD5
$$ 22 46 69 90 2C 76 4E 3B D3 49 4D 7C B3 15 9C 0A
##$RELAX= 
##$RELAX= 
##$RELAX= 
##$RELAX= 
##$RELAX= 
##$RELAX= 
$$ Bruker specific parameters
$$ --------------------------
##$DU= <F:/spectra>
##$EXPNO= 1
##$NAME= <H-C>
##$PROCNO= 1
##$TYPE= <nmr>
##$USER= <she>
##$AMP= (0..31)
100 100 100 100 100 100 100 100 100 100 100 100 100 100 100 100 100 100 
100 100 100 100 100 100 100 100 100 100 100 100 100 100 
##$AQSEQ= 0
##$AQ_mod= 1
##$AUNM= <au_zg>
##$AUTOPOS= <>
##$BF1= 200.13
##$BF2= 200.13
##$BF3= 200.13
##$BF4= 200.13
##$BF5= 200.13
##$BF6= 200.13
##$BF7= 200.13
##$BF8= 200.13
##$BYTORDA= 1
##$CFDGTYP= 0
##$CFRGTYP= 5
##$CHEMSTR= <none>
##$CNST= (0..31)
1 1 145 1 1 1 1 1 1 1 1 1 1 1 1 1 1 1 1 1 1 1 1 1 1 1 1 1 1 1 1 1 
##$CPDPRG= <>
##$CPDPRG1= <>
##$CPDPRG2= <>
##$CPDPRG3= <>
##$CPDPRG4= <mlev>
##$CPDPRG5= <mlev>
##$CPDPRG6= <mlev>
##$CPDPRG7= <mlev>
##$CPDPRG8= <mlev>
##$CPDPRGB= <>
##$CPDPRGT= <>
##$D= (0..31)
0 0.7 0 0 0 0 0 0 0 0 0 0.03 0 0 0 0 0 0 0 0 0 0 0 0 0 0 0 0 0 0 0 0 
##$DATE= 1754392920
##$DBL= (0..7)
120 120 120 120 120 120 120 120 
##$DBP= (0..7)
150 150 150 150 150 150 150 150 
##$DBP07= 0
##$DBPNAM0= <>
##$DBPNAM1= <>
##$DBPNAM2= <>
##$DBPNAM3= <>
##$DBPNAM4= <>
##$DBPNAM5= <>
##$DBPNAM6= <>
##$DBPNAM7= <>
##$DBPOAL= (0..7)
0.5 0.5 0.5 0.5 0.5 0.5 0.5 0.5 
##$DBPOFFS= (0..7)
0 0 0 0 0 0 0 0 
##$DE= 6
##$DECBNUC= <off>
##$DECIM= 32
##$DECNUC= <off>
##$DECSTAT= 4
##$DIGMOD= 1
##$DIGTYP= 9
##$DL= (0..7)
0 120 120 120 120 120 120 120 
##$DP= (0..7)
150 150 150 150 150 150 150 150 
##$DP07= 0
##$DPNAME0= <>
##$DPNAME1= <>
##$DPNAME2= <>
##$DPNAME3= <>
##$DPNAME4= <>
##$DPNAME5= <>
##$DPNAME6= <>
##$DPNAME7= <>
##$DPOAL= (0..7)
0.5 0.5 0.5 0.5 0.5 0.5 0.5 0.5 
##$DPOFFS= (0..7)
0 0 0 0 0 0 0 0 
##$DQDMODE= 0
##$DR= 18
##$DS= 0
##$DSLIST= <SSSSSSSSSSSSSSS>
$$ [...]
##$SUBNAM0= <"">
##$SUBNAM1= <"">
##$SUBNAM2= <"">
##$SUBNAM3= <"">
##$SUBNAM4= <"">
##$SUBNAM5= <"">
##$SUBNAM6= <"">
##$SUBNAM7= <"">
##$SUBNAM8= <"">
##$SUBNAM9= <"">
##$SW= 18.0517328524113
##$SWIBOX= (0..15)
0 0 2 0 0 0 0 0 0 0 0 0 0 0 0 0 
##$SW_h= 3612.71676300578
##$TD= 16384
##$TD0= 1
##$TE= 0
##$TE2= 300
##$TE3= 300
##$TEG= 300
##$TL= (0..7)
0 120 120 120 120 120 120 120 
##$TP= (0..7)
150 150 150 150 150 150 150 150 
##$TP07= 0
##$TPNAME0= <>
##$TPNAME1= <>
##$TPNAME2= <>
##$TPNAME3= <>
##$TPNAME4= <>
##$TPNAME5= <>
##$TPNAME6= <>
##$TPNAME7= <>
##$TPOAL= (0..7)
0.5 0.5 0.5 0.5 0.5 0.5 0.5 0.5 
##$TPOFFS= (0..7)
0 0 0 0 0 0 0 0 
##$TUNHIN= 0
##$TUNHOUT= 0
##$TUNXOUT= 0
##$USERA1= <user>
##$USERA2= <user>
##$USERA3= <user>
##$USERA4= <user>
##$USERA5= <user>
##$V9= 5
##$VALIST= <valist>
##$VCLIST= <CCCCCCCCCCCCCCC>
##$VD= 0
##$VDLIST= <DDDDDDDDDDDDDDD>
##$VPLIST= <PPPPPPPPPPPPPPP>
##$VTLIST= <TTTTTTTTTTTTTTT>
##$WBST= 1024
##$WBSW= 4
##$XGAIN= (0..3)
0 0 0 0 
##$XL= 0
##$YL= 0
##$YMAX_a= 120275
##$YMIN_a= -140257
##$ZGOPTNS= <>
##$ZL1= 120
##$ZL2= 120
##$ZL3= 120
##$ZL4= 120
##$ABSF1= 10
##$ABSF2= 0
##$ABSG= 5
##$ABSL= 3
##$ALPHA= 0
##$AQORDER= 0
##$ASSFAC= 0
##$ASSFACI= 0
##$ASSFACX= 0
##$ASSWID= 0
##$AUNMP= <proc_1d>
##$AZFE= 0.1
##$AZFW= 0.1
##$BCFW= 1
##$BC_mod= 2
##$BYTORDP= 1
##$COROFFS= 0
##$CY= -3
##$DATMOD= 1
##$DC= 2
##$DFILT= <>
##$DTYPP= 0
##$F1P= 0
##$F2P= 0
##$FCOR= 0.5
##$FTSIZE= 0
##$FT_mod= 4
##$GAMMA= 1
##$GB= 0.15
##$INTBC= 1
##$INTSCL= 1
##$ISEN= 128
##$LB= 0.25
##$LEV0= 0
##$LPBIN= 0
##$MAXI= 10000
##$MC2= 0
##$MEAN= 0
##$ME_mod= 0
##$MI= 1.114404
##$NCOEF= 0
##$NC_proc= 0
##$NLEV= 6
##$NOISF1= 3.799351
##$NOISF2= 2.8
##$NSP= 1
##$NTH_PI= 0
##$NZP= 0
##$OFFSET= 14.38212
##$PC= 1
##$PHC0= -1201.658
##$PHC1= 13.9923
##$PH_mod= 1
##$PKNL= yes
##$PPARMOD= 0
##$PSCAL= 0
##$PSIGN= 0
##$REVERSE= no
##$SF= 200.129724274929
##$SI= 16384
##$SIGF1= 3
##$SIGF2= 2
##$SINO= 400
##$SIOLD= 16384
##$SREGLST= <1H.CDCl3>
##$SSB= 0
##$STSI= 0
##$STSR= 0
##$SW_p= 3205.1282051282
##$SYMM= 0
##$S_DEV= 0
##$TDeff= 0
##$TDoff= 0
##$TI= <>
##$TILT= no
##$TM1= 0
##$TM2= 0
##$TOPLEV= 0
##$USERP1= <user>
##$USERP2= <user>
##$USERP3= <user>
##$USERP4= <user>
##$USERP5= <user>
##$WDW= 1
##$XDIM= 8192
##$YMAX_p= 0
##$YMIN_p= 0
$$ End of Bruker specific parameters
$$ ---------------------------------
##NTUPLES= NMR FID
##VAR_NAME=  TIME,          FID/REAL,        FID/IMAG
##SYMBOL=    X,             R,               I
##VAR_TYPE=  INDEPENDENT,   DEPENDENT,       DEPENDENT
##VAR_FORM=  AFFN,          ASDF,            ASDF
##VAR_DIM=   8192,          8192,            8192
##UNITS=     SECONDS,       ARBITRARY UNITS, ARBITRARY UNITS
##FACTOR=    0.0002768,     1,               1
##FIRST=     0,             0,               0
##LAST=      2.2672688,     0,               0
##MIN=       0,             -140257,         0
##MAX=       2.2672688,     120275,          0
$$ Real data points
##PAGE= N=1
##DATA TABLE= (X++(R..R)), XYDATA
0@%%%%%%%%%%%%%%%%%qJ6j6J6j6J6k4L2l2L9m7N1n9O8p6Q8j01J13j27J43j60J77
$$ 0 0 0 0 0 0 0 0 0 0 0 0 0 0 0 0 0 0 -8 8 -8 8 -8 8 -16 16 -16 23 -24 27 -32 36 -40 48 -53 60 -67 76 -84 93
39I3j97K21k46K71k99L32l68M06m47M92n43N97o58P27q01Q85r82J091j214J358
$$ 93 -104 117 -129 142 -157 175 -193 213 -234 258 -285 312 -346 381 -420 465 -517 574 -640 718
59G18j529J733j983K300k712L274m092N395p797J3642n6827o0464J12164P1213
$$ 718 -811 922 -1061 1239 -1473 1801 -2291 3104 -4693 8949 -47878 -108342 3822 75035
73G5035p221k0230K7004L9916N771n1657m9662r793J2328m3407q0274p436N1582
$$ 75035 67814 47584 74588 114504 120275 68618 18956 9163 21491 -21916 -102190 -109626 -58044
86e8044k042l2574J1488N8660N7559N550k0020K2459M5601Q083m5185m7320J4840
$$ -58044 -60086 -92660 -81172 -22512 35047 40597 20577 43036 88637 96720 51535 4215 19055
99A9055K3923m6640n6933M980L5099L067l4836j0949M2726L4128j0443k4217P890
$$ 19055 42978 -3662 -60595 -55615 -20516 -17449 -52285 -63234 -20508 13620 3177 -21040 -13150
112a3150N1750K1720m5407j8643M4480K5041l1956m3470L83K7390j4479m8544
$$ -13150 38600 60320 14913 -3730 40750 65791 33835 -9635 -9252 18138 3659 -44885
124d4885k3324J8235L0244j0168l3326K7767O5523J5895k2092O68L7502K4755
$$ -44885 -68209 -49974 -19730 -29898 -63224 -35457 30066 45961 23869 24537 62039 86794
136H6794l4748m7305n137J0144j5092m6497l2281K9177L5734j7026j6748L1596
$$ 86794 52046 4741 -396 9748 -5344 -51841 -84122 -54945 -19211 -36237 -52985 -21389
148b1389N2579J5859k6053l983L4002J1673k7525l5449q041K4616k886m6198j7047
$$ -21389 31190 47049 20996 17013 51015 62688 35163 -286 -8327 16289 13403 -32795 -49842
161d9842L1241K0548k1680k8330J7192L8411j443k3896k38K9742L1681j0266k8988
$$ -49842 -18601 1947 -19733 -48063 -30871 7540 6097 -17799 -18037 11705 43386 33120 4132
174D132J6737L6223q660m1181k1759J6445N366m0231l3490J0667K4682P810j4911
$$ 4132 20869 57092 48432 7251 -14508 1937 7303 -32928 -66418 -55751 -31069 -23259 -38170
187c8170J458M8172L8794j0142j4872J6869K7566j1402m8036k1052J2116n828
$$ -38170 -36712 11460 50254 40112 25240 42109 69675 58273 10237 -10815 1301 -4527
199d527k9788k7510N082L3539Q245k0621O288L8883K6932j3080k0638J8341K7143
$$ -4527 -34315 -61825 -56743 -23204 -14959 -35580 -29292 9591 36523 23443 2805 21146 48289
212D8289j2682k8273q398J4978J1865k3663l0340Q905K1486r395l1002r459K8487
$$ 48289 35607 7334 -1064 13914 25779 2116 -28224 -19319 2167 -7228 -38230 -47689 -19202
225a9202J6782j9272p387K5423L1446R651j5126j702K7542R633k9268l1971k750
$$ -19202 -2420 -21692 -29079 -3656 27790 37441 22315 20613 48155 57788 28520 -3451 -6201
238f201J1094j9491m0221m974K5290J1548o322k688K4627L8384P282j6788J088
$$ -6201 4893 -14598 -54819 -59793 -34503 -22955 -29277 -31965 -7338 31046 38328 21540 22628
251B2628K0539P197k8415l0995O250J2157j8089k4529l042J9397J4467j4509j2789
$$ 22628 43167 50364 21949 -9046 -2796 9361 -8728 -33257 -36299 -16902 -2435 -16944 -29733
264b9733J8098K3960r84j9542j028K8701J1303k0181r324J5048J4882o821k6191
$$ -29733 -11635 12325 11341 -8201 -9229 19472 30775 10594 1270 16318 31200 24379 -1812
277a812q742J3907o57k4446k0830Q530K3442l221j6867J4052L2306J4551o659
$$ -1812 -10554 3353 2696 -21750 -42580 -34050 -10608 -13829 -30696 -16644 15662 30213 23554
290B3554p615J3513J6102j4674k9577j1013O892N7k6089j8980J8652K0867l638
$$ 23554 15939 29452 45554 30880 1303 -9710 -2818 -2761 -28850 -47830 -29178 -8311 -11949
303a1949p560R941K6264J3189j4408r712J1287J1286r523k4612n606J8928J065
$$ -11949 -19509 -9568 16696 29885 15477 5765 17052 28338 18815 -5797 -11403 7525 8590
316H590k2133q262J2470J2562p016j7993K549J8659M985j1268p138J6054K3329
$$ 8590 -13543 -21805 -9335 3227 -3789 -21782 -19233 -574 4411 -6857 -13995 2059 25388
329B5388n120j5725P745J6783j721k1126j6608N016M704j6594j9091N94J8029
$$ 25388 20268 4543 12288 29071 27350 6224 -10384 -5368 -664 -17258 -36349 -35755 -17726
342a7726J1668r615o05K6991K0316m137j0675L015J2909m632k4718j4472K968
$$ -17726 -6058 -15673 -16278 10713 31029 26892 16217 19232 32141 27509 2791 -11681 -8713
355h713M684j0170j8591L418K3062M532j1775P32J7153J4314o703j2737O288J3657
$$ -8713 -4029 -14199 -32790 -29372 -6310 -1778 -13553 -12821 4332 18646 11943 -794 5494 19151
369A9151J22j2782r158R997J1943j3947j8333K905R796m228j7724p114J3658J1032
$$ 19151 19273 6491 -2667 7330 19273 5326 -13007 -10102 -306 -4534 -22258 -29372 -15714 -4682
383d682n195m217J0265K1835R321j1056l466J4132M196j5951k0103m174O457q331
$$ -4682 -9877 -14094 -3829 18006 27327 16271 12805 26937 31133 15182 -4921 -9095 -2638 -10969
397a0969j8510l708J2343J3082k94o726J2570K2270K606j1641k697R877N647j5305
$$ -10969 -29479 -33187 -20844 -7762 -8056 -14782 -2212 20058 22664 11023 8326 18203 23850 8545
411H545j5461L570P437l807j2466o385J1818R653j0624j0306P690J3169N18j1649
$$ 8545 -6916 -3346 4091 284 -12182 -18567 -6749 2904 -7720 -18026 -10336 2833 3351 -8298
425h298K15J6881Q053o209n590M804J1408k573j8906p370O794j36j3959j3031
$$ -8298 -8083 8798 16851 10642 5052 9856 21264 18691 -215 -7585 -791 -927 -14886 -27917
439b7917O071J4666m21n642O561J5899J2200l721r639O331R135q476j7671p679
$$ -27917 -21846 -7180 -7601 -13243 -6682 9217 21417 17696 8057 14388 23523 15047 -2624 -10303
453a0303O441K178j4016q136J0001J1464J466o240O21J4610P802r535p926N917
$$ -10303 -3862 -1684 -15700 -23836 -13835 -2371 -905 -7145 -6524 8086 15888 6353 -1573 4344
467D344R643l967j3782m85J1254J258r665p623K758Q734m222j3767j58J1158N327
$$ 4344 13987 10020 -3762 -4247 7007 8265 -1400 -9023 -6265 2469 -1753 -15520 -15678 -4520 807
482H07o126m475J2123J4901k826o999J808P323P08j3300j3149J726L909p400j2032
$$ 807 -5319 -9794 2329 17230 14404 7405 9213 16536 17244 3944 -9205 -7479 -3570 -10970 -23002
497b3002N20J3942P949n769J210J3235J0493j234q788j530P758j083j3793r499
$$ -23002 -22482 -8540 -591 -6360 -5150 8085 18578 17344 8556 7026 14784 13701 -92 -9591
511i591K904P326n811j1731L391J2176J853o434l229P706R653l311q318L059J0765
$$ -9591 -6687 639 -5172 -16903 -13512 -1336 517 -5917 -9146 -1440 8213 4902 -3416 -357 10408
526A0408L760p881o338Q262O146r558j0726j449M331j181j0939n788Q266R111
$$ 10408 14168 6287 -51 8211 14357 4799 -5927 -7376 -3045 -4226 -15165 -20953 -12687 -3576
540c576k09l323N654J6190N262q162k880O098J836r093j3269l448M767k442r324
$$ -3576 -3785 -7108 -1454 14736 19998 11836 8956 15054 16890 7797 -5472 -8920 -4153 -6595 -15919
555a5919l805Q242J1171j704o050P745J1616N51o773l566N746N484p209q668J283
$$ -15919 -19724 -11482 -311 -2015 -8065 -320 11296 11847 5074 1508 7254 12738 5529 -3139 -1856
570a856O735O57j0207n489Q023L947p977p020K966Q513K294o536N96J0675P445
$$ -1856 4879 5536 -4671 -10160 -2137 1810 -6167 -13187 -10221 -1708 586 -5950 -5354 5321 12766
585A2766j756n791K078Q124l352j2878n419K663N29p427p643L777J0004K533k990
$$ 12766 11010 5219 7297 15421 12069 -809 -6228 -3565 -3036 -10463 -18106 -14329 -4325 -1792 -4782
600d782J674R692Q988m647p624L565M976m510j0280m926M855L043o288m960L811
$$ -4782 -3108 6584 15572 10925 3301 6866 11842 7332 -2948 -7874 -3019 24 -6264 -11224 -7413
615g413Q035J892p172j282R174L859n880m617L521P787q12p170q07O357K428n441
$$ -7413 622 2514 -4658 -5940 3234 7093 1213 -3404 117 7904 7092 -78 -885 5472 7900 2459
631B459q363J033O038l699r006n58P172N280k817k450P781Q829l7m721k296M126
$$ 2459 -5904 -4871 1167 -2532 -11538 -12096 -4924 356 -2461 -4911 2870 11699 11662 6941 4645 8771
647H771J855r894r030J367L422k975o492J34R366N650k932m74N112O999j54p807
$$ 8771 10626 732 -8298 -6931 -3509 -6484 -12976 -12842 -3476 2174 -758 -1232 3880 10879 10725 2918
663B918j788N603L43p402n981K833N319k542p030R01N733K122m091m989M610P292
$$ 2918 1130 6733 7076 -326 -6307 -3474 1845 -697 -7727 -6826 -1093 1029 -3062 -8051 -3441 3851
679C851j476m919J666P875M063n157m565M361L079m729p932l359L195J148p451
$$ 3851 2375 -2544 -878 6997 11060 5903 1338 5699 8778 4049 -3883 -7242 -4047 -2899 -10350
694a0350l922N866P784Q30l065L640R478K403m740l241J266K340m094r252k018
$$ -10350 -14272 -8406 -622 208 -2857 783 10261 12664 7924 4683 5949 8289 4195 -5057 -7075
709g075M111K19n017l010N139P233j645l803K582N925K078m231l771M274M844
$$ -7075 -2964 -2745 -7762 -10772 -5633 1600 -45 -3848 -1266 4659 6737 2506 -1265 3009 7853
724G853l404n307J47N169N87o872m299L630K008l434n052L69O394K863l584L24
$$ 7853 4449 -858 -711 4458 5045 -1827 -6126 -2496 -488 -3922 -8974 -8605 -2211 652 -2932 -2608
740b608O216O212o07n762Q82M382k544p267m359Q80J937k794n154K169O992K726
$$ -2608 3608 9820 9213 3451 4333 8715 6171 -1096 -5455 -4575 -2638 -5432 -10586 -8417 -1425 1301
756A301k146r62N942N287l519m811O55K680m36n509l698L757K687k608l694P03
$$ 1301 -845 -1807 4135 9422 5903 1092 1747 4427 3991 -1518 -5216 -1459 1228 -1380 -5074 -4371
772d371N431R86n327j208M499K803j792l548J795N549P93l966j700L275K746m040
$$ -4371 1060 2046 -3281 -4489 10 2813 1021 -2527 -732 4817 5610 1644 -56 3219 5965 1925
788A925o417K36L673k016m474o89L889N068p28k028L674N441Q05m141l110K970
$$ 1925 -4492 -4256 -583 -2599 -7073 -7762 -3873 1195 467 -1561 2113 7554 8359 4218 1108 4078
804D078J013o008m972M90K986l81l387l96N559L590j183k198K100M529l14m926
$$ 4078 5091 -917 -5889 -5399 -2413 -2794 -6181 -6577 -1018 2572 1389 -809 1291 5820 5506 580
820E80j101L222J290l201m179J704L780j243m088j054K493K544k876l843K659
$$ 580 -521 2701 3991 790 -3389 -1685 2095 852 -3236 -4290 -1797 747 -2129 -5972 -3313
835c313M981O3k575Q18M417L458l186l060J103J860j948n627l539L155J020l949
$$ -3313 1668 1731 -844 -26 4391 7849 4663 1603 2706 4566 2618 -3009 -6548 -3393 -2373 -6322
851f322j379K953N123J659k090J164M698K002k675l397j37K593k471n592o56K644
$$ -6322 -7701 -4748 375 2034 -56 1108 5806 7808 5133 1736 1599 4192 1721 -3871 -4527 -1883
867a883J105k397k175K308M328j060k495K37L160K634k680k602K814L453p20l475
$$ -1883 -778 -3175 -5350 -3042 1286 226 -2269 -2032 1128 3762 1082 -1520 1294 4747 4027 552
883E52n01K970O36m367l088P02J754j332l352j56M938K509j596k66L442L871o11
$$ 552 51 3021 3657 -710 -3798 -3096 -1342 -2674 -6026 -6182 -1244 1265 -331 -597 2845 6716 6105
900F105l673l01J761j063l688l523O93K396j371k974J322L924K354j992j112L283
$$ 6105 2432 2131 3892 2829 -859 -4382 -3689 -1293 -2664 -5638 -4316 -392 1962 -30 -1142 2141
916B141K679j792k746o55K447R43l457k262K318K075j268k950j37K846K67k868
$$ 2141 4820 3028 282 -373 2074 3017 -440 -2702 -384 1691 423 -2527 -2664 182 449 -2419
932b419j071J879K554O9k383J115M157P70k520j634J499J338k530m116j16J570
$$ -2419 -3490 -1611 943 1012 -1371 -256 3901 4671 2151 517 2016 3354 824 -3292 -3408 -1838
948a838J86k073j354K833L712l08j403J749L199M79l133k292J908N06k769k871
$$ -1838 -1652 -3725 -5079 -2246 1466 1158 -245 1504 4703 5182 2049 -243 1665 2171 -598 -3469
964c469m26K729R85k542p63K992K446r26k407P74L881l06l159r7J159K176j309
$$ -3469 -3895 -1166 -181 -2723 -3486 -494 1952 1026 -1381 -607 3274 2968 -191 -288 871 3047 1738
981A738l038M92K630o08k939j631J386J965k148j724J374K958R84p03m33L080
$$ 1738 -1300 -808 1822 1214 -1725 -3356 -1970 -5 -2153 -3877 -2503 455 1439 736 303 3383
997C383K350j891k586o4J112p58m386k125K197Q47j475q38J194L868J224j606
$$ 3383 5733 3842 1256 1192 2304 1546 -2840 -4965 -2768 -1921 -3396 -4234 -3040 828 2052 446
1013D46K05K317J728j739k810J86J991j059k823q88J687J251j637j988J073K515
$$ 446 651 2968 4696 2957 147 333 2324 1265 -1558 -2446 -759 492 -1145 -3133 -2060 455
1029D55k73k087p16L024J835j457j231J797K327K38k402j286J618M17k951k397
$$ 455 182 -1905 -2621 403 2238 781 -450 1347 3674 3912 1510 224 1842 2259 -692 -3089
1045c089k93J870m01k359J24L160J865l3l90J348K829k38k748j184R26L32k409
$$ -3089 -3382 -1512 -1913 -4272 -4148 -988 877 844 454 1802 4631 4393 1645 461 1387 1719 -690
1062f90k815J007K164r96j590L90K315J859j167j767J539K159l85k193n20K233
$$ -690 -3505 -2498 -334 -1330 -2920 -2530 -215 1644 477 -1290 249 2408 2023 -170 -690 1543
1078A543Q19j994j275J148J320q40k330p16J795L14j783j277J286K820l0j426
$$ 1543 2362 368 -907 241 1561 721 -1609 -2325 -530 -216 -1999 -3276 -1990 830 800 -626
1094f26R27K926M60j102k093M65Q33j727k506m13P88J138j427r39K342K701q1
$$ -626 301 3227 3687 2585 492 957 1790 63 -2443 -2856 -2068 -930 -2357 -3296 -954 1747 1666
1111A666j125K15K093M13k125j893J017R77j040k086q88K470P73j742p00J330
$$ 1666 541 756 2849 3262 1137 -756 261 1238 198 -1888 -2776 -306 467 -1275 -1975 -645
1127f45J940o87j748M34K134K33j274j072J257J876n67k250o4J699l97j853k191
$$ -645 1295 608 -1140 -706 1428 1661 387 -685 572 2448 1881 -369 -433 1266 869 -984 -3175
1144c175J337J502j311r26O14K152J595o61o05J962J316j079k119p75J141q90
$$ -3175 -1838 -336 -1647 -2573 -1959 193 1788 1127 522 2484 3800 2721 602 -173 968 78
1160G8k156j525J295J396l28j199O68L114N54j376l88J381J370j001k398M93J492
$$ 78 -2078 -3603 -2308 -912 -1240 -2439 -1771 1343 1897 521 133 1514 2884 1883 -515 -22 1470
1177A470m79j434j131J017J362j346j534L06J544J21j342p42K113J456r18m82
$$ 1470 991 -443 -1574 -557 805 -541 -2075 -1769 -225 -104 -1446 -2188 -75 1381 463 -19
1193a9J173J557M08j594j704J151J00j796j878LJ299J48j451k7K081J768L71j158
$$ -19 1154 2711 3119 1525 -179 972 1072 -724 -2602 -2599 -1300 -1152 -2603 -2630 -549 1219 1590 432
1211D32N80J788K15k088j104R36P9j192k004N25J587J49j160n65J375J688j023
$$ 432 1012 2800 3015 927 -177 759 838 -354 -2358 -1833 -246 -97 -1257 -1822 -447 1241 218
1228B18j161O76J430M10j707k67J397O39r03r03j7J135j69j906q99J073N77j014
$$ 218 -943 -267 1163 1573 -134 -401 996 1635 732 -171 -188 947 778 -1128 -2027 -954 -377 -1391
1246a391r46J105K041K44r78N38J142Q18q24j550k81P53m22j883o53R23J216j033
$$ -1391 -2337 -1232 809 1053 75 613 1755 2573 1749 199 -82 671 249 -1634 -2287 -1364 -148 -1181
1264a181n75J463J403L41p89m51J371N64j456j291J74R41j52j652l99J619K17
$$ -1181 -1756 -293 1110 1451 662 211 1582 2146 690 -601 -427 514 362 -1290 -1689 -70 147
1281A47p29o54M15J406j34j352L09J107N22l31o77N82J528r91j129l53N10q4j107
$$ 147 -582 -1236 -821 585 451 -901 -592 515 1037 706 29 611 2139 1148 19 -334 176 92 -1015
1300a015j222L54J114J87p86J13J982Q41n04l60J132O46p56j564q13O33r0j221
$$ -1015 -2237 -1883 -769 -582 -1368 -1255 727 1568 1064 704 1836 2482 1726 162 -651 -18 -108 -1329
1318a329j024N86J364j15p41N83J178R94j103l58O43J011o45j296L2P60L27q49
$$ -1329 -2353 -1767 -403 -518 -1259 -676 502 1496 393 35 678 1689 1044 -252 -220 540 867 18
1336A8j154M87R14o32j226J53Q80O22j304m8J430J005o1o54L71J037L61j349j013
$$ 18 -1136 -649 265 -367 -1593 -1440 -560 62 -1242 -1290 140 1145 1084 430 801 1838 2199 850 -163
1355a63J29L54j022j233l07J142N17n22k54J196J221N25r54M8J002j37r44q18
$$ -163 -34 320 -702 -1935 -2242 -1100 -583 -1105 -1359 -163 1058 1583 629 677 1679 1542 598 -220
1373b20K15N83n39j459K77R39L40p13o94R33J053o77o60K13P65N79q35j17Q05
$$ -220 -5 578 39 -1420 -1143 -204 136 -577 -1271 -338 715 38 -622 -409 356 935 100 -17 788
1392G88N35p12p02l1M45K3j538j58M08N78j92m88M79J203M79m59L8K58P85p70
$$ 788 1323 611 -91 -122 323 346 -1192 -1350 -942 -364 -556 -1044 -565 638 1117 658 696 954 1739 969
1412I69j188r4N41j78j029o24N63R54l00m43P10P36M29o93o77P66P18p49q77j05
$$ 969 -219 -313 228 50 -979 -1603 -1040 -86 -386 -829 -119 617 1046 353 -324 442 1160 411 -466 -571
1432e71R56o9r27j50O48L61l31p10L48N62O7n14k88Q53N04j08o83L83J064l54
$$ -571 385 316 -611 -761 -113 248 -83 -793 -445 117 184 -330 -618 235 739 631 -52 331 1395 1041
1452A041j050l01n1N36n69j437M44Q47K02j92J00J087N86k96l38M24L3%r40r17
$$ 1041 -9 -310 -361 175 -394 -1831 -1387 -540 -338 -530 -430 657 1243 947 609 1033 1066 1066 126 -791
1472g91K60L12m74n69J32J117K7o57J46J125o5j4n46J59P03k01p27J76L20L89
$$ -791 -531 -219 -693 -1262 -1130 -13 14 -643 -497 628 563 549 3 162 865 664 -63 113 433 822
1492H22n28p42j34P15j98r53k47N20P26m57l41Q24Q17M22p52K0Q04mr73n16J20
$$ 822 294 -448 -582 133 -65 -1018 -1265 -745 -19 -476 -817 7 824 1246 494 514 1318 1314 341 -175 -55
1513e5K36m66q51l36P76Q34p01P8O08N40K77m58l25O40m0k95r06P8P82k20p47
$$ -55 181 -285 -1136 -1472 -696 138 -563 -485 123 663 940 482 157 797 757 462 -444 -366 416 196 -551
1534e51m96R30L33m62n17N55M30n3o39j86J117L10j39n75J35P37j92p07j98L75
$$ -551 -1047 -117 216 -246 -763 -208 222 169 -470 -656 461 771 632 57 192 929 737 30 -168 207
1554B07p2r21m28L39N97M6l58J85J004N84n61m84N53L57n13r01J49L12j40l45
$$ 207 135 -786 -1214 -875 -278 -232 -590 -405 599 1183 622 138 691 1048 535 -366 -217 95 -45 -390
1574c90o98Q11M70r3o65L71N16M65q50j58N22M08p36k03nN53R9n73j7K2K97Mj011
$$ -390 -1088 -277 193 100 -565 -194 322 787 -63 -221 301 709 -27 -230 -235 318 417 -156 -173 -151 146 150 -861
1597h61K17N22K06k44k59O90O99k0j006K05O03p2n54p77L81L10o76l05lO92K89
$$ -861 -644 -122 84 -160 -419 271 970 950 -56 149 752 680 126 -651 -270 40 -636 -941 -944 -252 37
1618C7m14K16O00M62j88k81k64M79J44q93n60L44L28k21l76n3N96K9m50K91K81
$$ 37 -377 -161 439 901 713 432 168 647 791 -102 -662 -318 10 -211 -587 -640 -44 -15 -465 -174 107
1639A07M24m79l90L99M74K5k31k39L92K80n32o30J85kJ1l00n67N41O44j66n7K5
$$ 107 531 52 -338 61 535 560 329 90 482 762 230 -400 -215 -217 -206 -506 -1073 -532 112 -54 -111 -86
1661h6P72K10l41l00J87J92l24n09n00N82mo11j93N01K11K52l99L65N79K33n34
$$ -86 686 896 555 255 442 634 310 -199 -699 -117 -121 -732 -925 -424 -213 39 -360 5 584 817 283
1682B83k98K38L41l64o01M27K16p3k01j84K50J27m62l99J99O21J8k28n6N04N41
$$ 283 -15 223 564 200 -401 26 242 169 -32 -216 34 161 -301 -700 -501 120 138 -90 -146 358 899
1703H99l23n40M65k42K30o29j18K84j16m67j06P4L15L18n49N87L98K63j63m91
$$ 899 576 36 501 259 489 -140 -258 26 -90 -557 -663 -589 -274 44 -505 82 480 743 580 89
1723H9K8P76o12m05r8j98M88l54j83m4N17J75k75q8L30L99m51l6QK27j61k47j45
$$ 89 117 893 281 -124 -222 -420 68 -286 -469 -513 4 179 -96 -184 146 545 94 58 66 293 132 -115 -260
1746b60L24L15m32j46j5M44l73k20j01M00qK7r4J90P68j01n04k0l9N74p56n56
$$ -260 64 379 -53 -199 -214 230 -143 -363 -464 -64 -72 -45 -139 51 819 718 214 194 155 729 -27 -583
1768e83j49O14K1n73L65K95L44Q0j20j72O01k06m27L7O5K37n45m17J49p5L68k69
$$ -583 -732 -118 -97 -670 -305 -10 334 414 294 122 723 517 90 127 192 429 -116 -533 -384 -459 -91 -360
1790c60j65N91k81K69k16Q7O39j46o56L0M47M45m31m66L39L68j83q47K35n4L48
$$ -360 -525 66 -215 54 -162 -75 564 418 -238 -208 239 684 253 -213 126 494 311 -536 -301 -355 -7
1811gm06npL78R9j33n0P47K72n62l1k06K71m04m15k8K08J34m55j96O40K59j7j46
$$ -7 -413 -418 -425 -47 52 -81 -131 616 888 326 295 89 360 -44 -459 -487 -279 -145 -600 -796 -156 103 86 -60
1835f0j31L68M06j99m19M16j97N1o80M70r1M35n87j34L46L7k45l18K77P2K46J98
$$ -60 -191 177 583 384 -35 381 184 235 -445 25 -66 369 -218 -352 -6 31 -214 -532 -255 -183 63 261
1857B61k35K60K24P5m27k08M04K50q20k84J51j79K03k56K55M64J97j22p3k4N39
$$ 261 26 286 510 585 158 -50 354 604 -216 -500 -349 -528 -325 -581 -326 138 335 213 140 116 655
1878F55m20j24k11J93J74k81k62j32M50k91P4k98O00L5k29M2lL02o2l79K3J37
$$ 655 235 111 -100 93 267 -14 -276 -408 42 -249 -175 -473 127 162 -67 -25 -28 274 212 -167 -144 -7
1900gK75l02k50K92L18l78N8k12J66pk49J15R7O0R4N5j31M82K43m11k53K61r3
$$ -7 268 -34 -284 8 326 -52 6 -206 -40 -47 -296 -181 -84 -24 70 125 -6 476 719 308 55 316 223
1923B23j07l26n02N78j06J8L09l8P9Q5O9Q1oM3p3m11j8O83r17J45k1Q8L33l52
$$ 223 116 -210 -712 -134 -240 -222 87 49 128 213 282 363 357 400 327 -84 -102 581 -336 -191 -212 -124 209 -143
1947a43j99L38L77m33L5m3L27J28k87M09k77K43J4l38m27O94k19m30j36L8K95
$$ -143 -342 -4 373 -60 -25 -68 259 387 100 509 232 475 489 151 -276 418 199 -231 -367 -329 -34
1968c4k8k10J08K47j18K04j58M14O9j29j90l95L51j05l25j10l0J26P2k00p7N65
$$ -34 -62 -272 -164 83 -35 169 11 425 494 365 175 -220 131 26 -299 -409 -439 -313 -241 -441 -518 47
1990D7K42m05J02j10M10K1m36J50J85K05o32R3J52R7K6m14K37m0Mk03m4J72L77
$$ 47 289 -116 -14 -124 286 307 -129 21 206 411 -221 -128 24 121 147 -267 -30 -70 -66 -269 -313 -141 236
2013B36m7j51m2J33J91j92k25K75N6r0m98K36J26O9k77k1K54K18J32m74J82J19
$$ 236 189 38 -4 129 320 128 -97 178 234 144 -354 -118 8 77 -200 -221 33 251 383 -91 91 210
2035B10O1l75P6R3J77j10m93K30L50l44P2k44J16N46l09j9k55N60k60l71K71K69
$$ 210 271 -104 -28 65 242 132 -361 -131 219 -125 -53 -297 -181 365 56 37 -218 342 82 -289 -18 251
2057B51m1m64M47j16l9J84k50l57K66K76k98K09j88O0J52J50m13K42K19k42K8
$$ 251 210 -254 193 77 38 222 -28 -385 -119 157 -141 68 -120 -60 92 242 -171 71 290 48 76
2078G6P6r9k8l85P7J13K59p9l48N58kN3j56N9k5k15l3M0j08N12l68j94J09J55
$$ 76 152 53 25 -360 -283 -170 89 10 -338 220 218 271 115 174 149 -66 -99 -59 -167 345 -23 -217 -108 47
2102D7Q7k10JlL29m23j20M19j26K79r1k63J3K7N45l38j50n0l17L14q2j72J82K01
$$ 47 134 -76 -75 -78 251 -172 -292 127 1 280 189 -74 -61 -34 511 173 23 -27 -344 -30 -112 -284 -102 99
2126I9l13J67K54k5l3o0J57j42lj80o8Q6M6J10k67l0L5Q2lj0J48k0j69kJ68%K41
$$ 99 -214 -47 207 182 149 89 246 104 101 -79 -147 -61 -15 95 -172 -202 -167 -85 -88 -98 50 30 -139 -141 27 27 268
2153B68l55j11L96Om42K49j52MJ98q6k19p6M8P8N0J4P6j5J95j78J98J52l73j5
$$ 268 -87 -198 198 204 -238 11 -141 -137 61 -25 -244 -320 -272 -194 -144 -130 -54 -69 126 -52 146 298 -75 -90
2177i0J18m24N82o33J88J89K12m05Q8K06J07l2mj60J95K80m44J67O0r4J10k31
$$ -90 28 -396 186 -447 -259 -70 142 -263 -175 31 138 106 102 -58 137 417 -27 140 200 106 216 -15
2199a5J29K8%l29J83P8M3J3k52L39j70J64l92K19k3P3J90m77J98K32j38k46p4
$$ -15 114 142 142 -187 -4 74 117 130 -122 217 47 211 -181 38 15 88 278 -199 -1 231 93 -153 -227
2222b27J53M17n41k0J1L71j2O4r1n5N0o0j69J63k00L56m46l7J05L18j48j71L52
$$ -227 -74 343 -198 -218 -207 164 152 216 125 70 120 60 -109 54 -146 210 -236 -273 -168 150 2 -169 183
2245A83o3j05J05l88K68K35l37n8j0M9R6J70o0J45q1k31j73OK09j37P1J54m3N2
$$ 183 120 15 120 -268 0 235 -102 -160 -170 -121 -25 145 85 230 149 -82 -255 -249 -40 -177 -106 48 5 57
2269E7Q1l2j49L48j16j59l18J98pL3j03QR6J19o3nJ34Q3j19J16j32p9K9p7J66
$$ 57 138 106 -43 305 189 30 -288 -90 -97 -64 -167 -159 -63 56 -7 -12 122 205 86 202 70 -9 20 -57 109
2294A09m3j76L24l67m3J54j9p2L6O3P0o9k4j26L53j91L0J58o2q6q0o7J01k6j17
$$ 109 66 -110 214 -153 -196 -42 -61 -133 -97 -34 36 -33 -57 -183 170 -21 9 167 105 19 -61 -128 -27 -53 -170
2319a70q9L40j4p5n5J17rJ01J51j49k36K20J66r1O5j04k34J74j26nJ67mj24M2
$$ -170 -259 81 67 -8 -63 54 45 146 297 148 -88 132 298 207 272 168 -66 108 -18 -23 144 140 16 58
2343E8l20K63J00J05j33O3J30k4k24K1J15j76j47L92m18J46J95l5l02K54R6j70
$$ 58 -262 1 101 206 73 136 266 242 18 39 154 -22 -169 223 -195 -49 146 111 -191 63 159 -11
2365a1J6J13J46p5k34J30j52q7O8J03j45M49m52K19j70L1N1R9r6j94K04j02L76
$$ -11 5 118 264 189 -45 85 -67 -154 -86 17 -128 321 -131 88 -82 -51 0 99 3 -191 13 -89 287
2388B87o3l42J78j70k20L53K3j16o3M0MK24l08M39k17J6J04k33N0J33j17j6J23
$$ 287 224 -118 60 -110 -330 23 46 -70 -133 -93 -89 135 -173 266 49 65 169 -64 -14 119 2 -14 109
2411A09k37lK38j60J94j27R2l95J75j27K51J42j00oK25j07K1j57K2l65J04K13
$$ 109 -128 -131 107 -53 141 14 106 -289 -114 -241 10 152 52 46 271 164 185 28 50 -315 -211 2
2433Bn4n1J32O2k24J56j14k36L26k2J81m27L92J54k33j44j11L11o05N14M7q3L0
$$ 2 -52 -103 29 91 -133 23 -91 -327 -1 -23 158 -269 123 277 44 -100 -211 100 -505 9 56 -27 3
2456Ck98M45j14j39Q0n2L89n14L43K9j33N8J16k02M5P7l27k22O7P62l85k01J83
$$ 3 -295 150 36 -103 -23 -75 314 -200 143 172 39 97 213 11 56 133 -194 -416 -349 413 28 -173 10
2479A0L05l52j95M29k46J4K4L19j14k42J94k59J73k3l7K7j64R0Q4j62k2J74l6
$$ 10 315 -37 -232 197 -49 -35 -11 308 194 -48 146 -113 60 37 0 27 -137 -47 37 -125 -147 27 -9
2502iJ49p3k21J33J37j24J25q0nj70J30j05jJ99K4j94l3O4r9j09L07k17Q5L6K8
$$ -9 140 67 -154 -21 116 -8 117 37 32 -138 -8 -113 -114 85 109 -85 -118 -54 -153 -262 45 -172 -87 -51 -23
2527b3j08R8J17k12J16r0M3Ql36M13k56L23j28Rq2K05Q5j17oO3mm36K80l16L80
$$ -23 -131 -33 84 -128 -12 -102 -59 -51 -387 26 -230 93 -35 -26 -108 97 182 65 59 122 118 -318 -38 -354 26
2552B6j60o7K15j40l13L10K14J23k67J27J96n00K42J37j58J37j18l47J70L07k87
$$ 26 -134 -201 14 -126 -439 -129 85 208 -59 68 264 -236 6 143 -15 122 4 -343 -173 134 -153
2573a53K27R3O7l51l5J67p1P1l2K18Q9j93j49j04R3j01M63k07j18J01j67r7K96
$$ -153 74 167 234 -117 -152 15 -56 15 -17 201 290 97 -52 -156 -63 -164 299 92 -26 75 -92 -189 107
2596A07n3q7J69o9k00Rr0K00O4K9j68L6j89K81K69o23K91k19L45O3j83q1K51k72
$$ 107 54 -33 136 67 -133 -124 -214 -14 50 79 -89 -53 -242 39 308 -315 -24 -243 102 165 -18 -99 152 -120
2620a20j1K04J4J91k04j48j41R0M7Q2q9P1J48j02j26K22k38k0L46j57j54O3m4
$$ -120 -131 73 87 278 74 -74 -215 -125 -78 4 -85 -14 134 32 -94 128 -110 -130 216 59 -95 -32 -76
2643g6q7Q0J90k58J77J60j78r0J56m9j48J61o1j41K21k6J00k53J90n7O1k94M9
$$ -76 -163 -83 107 -151 26 186 8 -82 74 25 -123 38 -23 -164 57 31 131 -122 68 11 72 -222 -173
2666a73M18k75J8n6j61J53J75j69L01m30J07J02P0L3k06Q7j31N9O9j79Q5k83M90
$$ -173 245 -30 -12 -68 -229 -76 99 -70 231 -199 -92 10 80 113 -93 -6 -137 -78 -9 -188 -103 -386 104
2689A04k81K88n6Jj95L82k52j00J41j63K19K8j07m1K82j07j86N7k04N07k99Q1
$$ 104 -177 111 55 56 -139 243 -9 -109 32 -131 88 116 9 -32 250 143 -43 14 -190 317 18 99
2711I9m73M36K93l36N3j84J73o9k53K81m9K55p3Q8j98j27K66j17k0L6j31k13M64
$$ 99 -374 62 355 19 72 -112 61 -8 -261 20 -29 226 153 241 43 -84 182 65 45 81 -50 -263 201
2734B01j11k40K12j56p0J75L59m10J6Q6q6m52O59k84Lr7J87J74l6R6l41j62K46
$$ 201 90 -150 62 -94 -164 11 370 -40 -24 62 -24 -476 183 -101 -98 -195 -8 166 130 226 -115 -277 -31
2757c1j12K15j04J86r0l24L51k95R0J48l3l6K56Qk09l9K31j47rl6L8Pm4j02L23
$$ -31 -143 72 -32 154 64 -260 91 -204 -114 34 1 -35 221 229 20 -19 212 65 56 20 58 65 21 -81 242
2782B42k77r8L02n4l63J14J25O0j32J55m7m69M56J31k99K46j4j43K03p5N4J9j95
$$ 242 -35 -133 169 115 -248 -134 -9 51 -81 74 27 -442 14 145 -154 92 78 -65 138 63 117 136 -59
2805e9L3K02k67J11j91M50j60k84K45k71o7L81J19l05K9k33L76j89j9J72q8J20
$$ -59 -26 176 -91 20 -171 279 119 -165 80 -191 -258 123 242 -63 -34 -267 109 -80 -99 73 -15 105
2827A05j08R6J5oK00j99Q8N8l2J86o22M40k68j07J82n5Qn3K93l64K00j81O3N2
$$ 105 -3 93 108 102 302 103 191 249 217 403 -219 221 -47 -154 28 -27 -19 -72 221 -143 57 -124 -61 -9
2851iL3j26O4m8r6J88l8r1L8J01j06J94j30P2o2K71l49j07K83J15l40J31n7j94
$$ -9 24 -102 -38 -86 -182 6 -32 -123 -85 16 -90 104 -26 46 -16 255 -94 -201 82 197 -143 -12 -69 -263
2875b63L69pj40O9k08J38k43N30l13l30N92k82R2K1J34k8r0o9R0M2n9n5K17j05
$$ -263 106 99 -41 28 -180 -42 -285 245 -68 -398 194 -88 4 25 159 131 41 -28 62 104 45 -10 207 102
2899A02J67r4k21J66j84J80j81o7j4K90K12m35n0Q7j17O2L3R2m48L87J16M9LJ50
$$ 102 269 175 -46 120 -64 116 -65 -132 -146 144 356 -79 -129 -42 -159 -97 -64 28 -420 -33 83 132 135 285
2923B85l69R0N4K25l04J27n9J19k26j87K58ml10L08j0r1J16Mj42K85Q4m53K37
$$ 285 -84 6 60 285 -19 108 49 168 -58 -245 13 9 -301 7 -3 -94 22 26 -116 169 253 -200 37
2946C7O7k4j88K12J17k28j38J47j07K3nJ49j22j68M19j08j23J31l3q2J68j75J88
$$ 37 104 80 -108 104 221 -7 -145 2 -105 -82 -87 62 -60 -228 191 83 -40 91 58 -24 144 -31 157
2969A57j56L4k9k47J64pJ54p2j83L52J6k77K31k50O4J28J0K76k53k11J69m61N04
$$ 157 1 35 6 -241 -77 -84 70 -2 -185 167 183 -94 137 -113 -49 79 89 365 112 -99 70 -391 113
2992A13j31P5o7l11L79n3P8k31Q6R5l2O5l30K79J57m3j01J32j72k0n4L01k16o6
$$ 113 -18 57 -10 -321 58 5 83 -148 -62 33 1 66 -264 15 172 129 28 160 -12 -32 -86 215 -1 -67
3016f7K35k44M8NN3k2O6j06J1J22k3k9P2k92J3R6K19l14K67j74J36K2k90K73m0
$$ -67 168 -76 -28 -23 30 8 74 -32 -21 101 78 49 121 -171 -158 -62 157 -157 110 -64 72 94 -196 77 37
3041C7p8nJ46o9l4J55J90l08j63O3j00J9n4L01k09k1J97j70N2l1J78J14m1k0N7
$$ 37 -41 -46 100 31 -3 152 342 34 -129 -66 -166 -147 -201 100 -109 -130 67 -103 -51 -82 96 210 169 149 206
3066B06l89R5L41j87mj11l73P97j97k96K1J27p8K32lo2O9j46m9j02N5J47j73J67
$$ 206 -183 -88 253 66 62 -49 -422 375 178 -118 -97 30 -48 184 181 119 188 42 -7 -109 -54 93 -80 87
3090H7j06r6p0J16J14j18lO5j62J41R0J01j32l20K43K29r2K90n72M62k51J73j48
$$ 87 -19 -115 -185 -69 45 -73 -76 -11 -173 -32 58 159 27 -293 -50 179 87 377 -195 267 16 189 41
3113D1l35M79k85k45M18k86K99j20J5N21m09p1o1Q5l8P4Jj85J80j09L3j19R6l8
$$ 41 -294 185 -100 -345 73 -213 86 -34 -19 502 93 22 -39 46 8 82 83 -102 78 -31 2 -117 -21 -59
3137e9P9k4j6j23L6oJ57j32K88j22N4l0k57J5J73j23J59l8J75j63M6j15J68l92
$$ -59 20 -4 -20 -143 -107 -113 44 -88 200 78 132 102 -155 -140 33 -90 69 31 206 43 89 -26 142 -250
3161b50M38j42k5k65J06J69j7oM0q7R6j59j52L81jj69J08k54p4K71L7R4j16l2
$$ -250 188 46 21 -244 -138 31 14 8 48 -39 57 -102 -254 127 126 -43 65 -189 -263 8 45 139 23 -9
3185ik1J14j03K32j75N7j7J41j23j79Q3J62k36J71J61k38k9n5P3qL01l56QJ53
$$ -9 -30 84 -19 213 38 95 78 219 96 -83 0 162 -74 97 258 20 -9 -64 9 1 302 -54 -46 107
3209A07k66kJ89k37N59m92j76M33l63L88j36J5j7J03j44K10o7J7k52q3J84Q8J25
$$ 107 -159 -161 28 -209 350 -142 -318 115 -248 140 4 19 2 105 -39 171 104 121 -131 -214 -30 58 183
3232A83m23M08l25j6M90j11m1j47o1K13j46J5k42L15j3l00J23o0j58O8K32k41
$$ 183 -240 168 -157 -173 317 206 165 18 -43 170 24 39 -203 112 99 -201 -78 -138 -296 -228 4 -237
3254b37K53N2J09j95J52l43J86P6j50J45K8l08J90L05j99j29q4J28P5j63m2K63
$$ -237 16 68 177 -18 134 -209 -23 53 -97 48 76 -232 -42 263 64 -65 -149 -21 54 -109 -151 112
3276A12J16k49j74K99j16J13o1K08l50J71p0j10J43j35K79j71J17J75k71J8q7
$$ 112 228 -21 -195 104 -12 101 40 248 -102 69 -1 -111 32 -103 176 5 122 297 26 44 -43
3297d3L7N9j87q3K82J59r5o9m3J31n26K89j83K8K43k20M57k87Mj46J33J87k66
$$ -43 -6 53 -134 -217 65 224 129 60 17 148 -378 -89 -272 -244 -1 -221 236 -51 -47 -193 -60 127 -139
3320a39J98q5J08P1j24M03o20j1R3J78K55l10k46M48k07J79j49K0j66J98nJ29
$$ -139 59 -26 82 153 29 432 -188 -199 -106 72 327 17 -229 219 12 191 42 62 -104 94 89 218
3342B18j75J8j66J46j31J22j75J18n2k30M60j37J70j90K18l15K16p0p5k5l00L92
$$ 218 43 61 -105 41 -90 32 -143 -25 -77 -307 153 16 186 -4 214 -101 115 45 -30 -55 -355 37
3364C7J83k75J85m76J33RJ19J2K26k70NQ9L50m92J48j49L4J55M1K9L0Q1j75k44
$$ 37 220 -55 130 -346 -213 -204 -85 -73 153 -117 -112 -23 327 -165 -17 -166 -132 23 64 93 123 204 29 -215
3388b15J81p7r5J0J01J88k22K03q9j3J41j53r5Q5J98R7l85K20j85O0J01k71K64
$$ -215 -34 -111 -206 -196 -95 93 -129 74 -15 -28 113 -40 -135 -50 148 245 -140 80 -105 -45 56 -215 49
3411D9j01j10J90J76o3j53j20L39l67J13Q4j3k2j12K08j70r5M9J72o6k51J99Q0
$$ 49 -52 -162 28 204 141 -12 -132 207 -160 -47 37 24 2 -110 98 -72 -167 -118 54 -12 -263 -64 16
3434A6O0j05K33k31M6j49rJ13K39k51R2j41L06l44K35o0m7q6J56j21l7J41J06
$$ 16 76 -29 204 -27 19 -130 -139 -26 213 -38 54 -87 219 -125 110 50 3 -83 73 -48 -85 56 162
3457A62j88q0L36l74J63j30p3Q3K5M53j80j96K80j34j26J14q6K26m57K82j57J67
$$ 162 -26 -106 230 -144 19 -111 -184 -101 -76 377 197 1 281 147 21 135 49 275 -182 100 -57 110
3479A10R8j42l6N4J0j61l6J36J44j96J72k70K86k09M6J3k01N46j33k90o6K02k91
$$ 110 208 66 30 84 94 -67 -103 33 177 -19 153 -117 169 -40 6 19 -182 364 231 -59 -125 77 -214
3502b14Q0J98j60N5J91j02j83L68k38R6j74R4R6k25J14J27j09l32L41j98O10m80
$$ -214 -134 64 -96 -41 150 48 -135 233 -5 91 -83 11 107 -118 -4 123 14 -318 23 -175 435 -45
3524d5j27K46r8j7j15P0M4K72k38n9J76l3l5J58j91N7L5o3j68L80k01J15j68j95
$$ -45 -172 74 -24 -41 -156 -86 -42 230 -8 -67 109 76 41 199 8 65 100 37 -131 249 48 163 -5 -200
3548b00N4k6J77l1J84p7m0j88J88q6N0k28M6J29Q1o5j61J38j84J65L5K40l57j6
$$ -200 -146 -172 5 -26 158 81 41 -147 41 -45 5 -223 -177 -48 33 -32 -193 -55 -239 -74 -39 201 -156 -172
3572a72K37R7m8ro3q6LJ09j3k55L07k36Q7JL3q7j78J75K4j39K18l08M57m5j78
$$ -172 65 162 114 105 42 -44 -41 68 55 -200 107 -129 -42 -41 -8 -95 -273 -98 -74 -213 5 -303 154 109 -69
3597f9j68P4K47k77J29M4j93L07k18K3K50k49Q3J85o1n5o7r4L72l56L1j0o7qJ68
$$ -69 -237 -163 84 -193 -64 -20 -213 94 -124 -101 149 -100 -17 168 107 52 -15 -109 263 -93 -62 -72 -139 -147 21
3622B1r4o1L04J05l84M31j58j70j0L18o29N61m43K19Q0p6L4J23j77j12pJ41j42
$$ 21 -73 -134 170 275 -109 322 164 -6 -16 302 -327 234 -209 10 90 14 48 171 -6 -118 -125 16 -126
3645a26K57l42J92q6KM7j45j15L67j25k0j20P8K0N9J81K01j14l29J01K27l44P
$$ -126 131 -211 -19 -105 -103 -56 -201 -316 51 -74 -94 -214 -136 -116 -57 124 325 211 -118 -17 210 -134 -127
3668a27J95j70KJ06N0J34j42k12J26j50J46Q4P3j60k59M30k17K51j40l92N62k33
$$ -127 68 -102 -100 6 56 190 48 -164 -38 -188 -42 42 115 -45 -304 126 -91 160 20 -372 190 -43
3690d3Qo4p8P7K57k90n1O7J52o9j18K23k57J47K1q9N9J46N3j16O0j74K65j19p9
$$ -43 -35 -99 -177 -100 157 -133 -184 -117 35 -34 -152 71 -186 -39 -18 -107 -48 98 151 35 95 -79 186 67 -12
3715a2j66J69p1K15j50j8K14L4l21K09k57K75j27Q2kl16J87J29N8j85j18K19j39
$$ -12 -178 -9 -80 135 -15 -33 181 215 -106 103 -154 121 -6 76 74 -242 -55 74 132 -53 -171 48 -91
3738i1K25j48J21k46O9K80m95L11q3K0j0J18j22J13j11J73N9JO2j72j02p5J34
$$ -91 134 -14 107 -139 -70 210 -285 26 -57 -37 -47 71 -51 62 -49 124 183 184 246 74 -28 -103 31
3761C1R1r2NJ89Qj17J66n42M44O4l00R2J60k63J19r1Mj13N33o12K76J95m48L14
$$ 31 122 30 35 224 232 115 281 -261 183 247 -53 39 199 -64 55 -36 -32 -145 388 -224 52 247 -201 113
3785A13l26l2M12Pm26J71O6K67l60j4L65o1j67J4%r1J91l84MJ66J00l1j30K08
$$ 113 -213 -245 167 174 -252 -81 -15 252 -108 -122 243 182 15 29 29 -62 129 -255 -251 -85 15 -16 -146 62
3809F2k69K87k38p6N8l7L15j23n6J74k42L45l48J65J09m29K79m8K45l49Q0J64
$$ 62 -207 80 -158 -234 -176 -213 102 -21 -77 97 -145 200 -148 17 126 -303 -24 -72 173 -176 -96 68
3831F8j36j24N1j94M60j20L04k90nj09O5R0m7J43k46L05k71L32j45j64k8J80q5
$$ 68 -68 -192 -141 -335 125 5 309 19 14 -95 -30 60 13 156 -90 215 -56 276 131 -33 -61 119 34
3854C4j51j34L47j16o3L06k78J19j11q9QJ55j63J39j02n2P5K8J02j07K27o1k03
$$ 34 -117 -251 96 -20 -83 223 -55 64 -47 -136 -128 27 -136 3 -99 -151 -76 -48 54 -53 174 113 -90
3877i0M7n1J56r6J34j64R4K02l17J64r0J41j58L9L4N4j48j2M6J37l7j03P6N6j77
$$ -90 -43 -94 62 -34 100 -64 30 232 -85 79 -11 130 -28 11 45 99 -49 -61 -15 122 85 -18 58 114 -63
3902f3J5J69l64N57l67K4Jr1j64K38rK69j99j55J91k17K00r5J35l1k18J51K86
$$ -63 -48 121 -243 314 -53 -29 -28 -119 -283 -45 -54 215 16 -139 52 -165 35 -60 75 44 -174 -23 263
3925B63m46J34k12J65k09O46l75J73L0j36M9k50L26j90O5J1q1j22M03m34L35k27
$$ 263 -183 -49 -261 -96 -305 341 -34 139 169 33 82 -168 158 -32 33 44 -37 -159 244 -190 145 -82
3947h2M18m72L19j71j42J07p0J50N5l79J1L28P5k04O4j25n4K17K27k74l11K65
$$ -82 336 -136 183 12 -130 -23 -93 57 112 -267 -256 72 147 -57 7 -118 -172 45 272 -2 -313 -48
3969d8j55Q0L79l00J75j60qK40m02J92j18pK52k08pN6L75j82j16oO0j0J86j28
$$ -48 -203 -123 256 -44 131 -29 -37 203 -199 -7 -125 -132 120 -88 -95 -39 336 154 38 32 92 82 268 140
3993A40q2j1L8j26K5J23j66J55k70K34j47P5j62L08j74J64j67J95k72K22k2j48
$$ 140 58 47 85 -41 -16 107 -59 96 -174 60 -87 -12 -174 134 -40 124 -43 152 -120 102 80 -68
4015f8J72j61J46J37k81J50K3k07K3Q3K21m0j14j84M86m51J46q8k69K15p0R9p8
$$ -68 104 -57 89 226 -55 95 118 -89 -66 17 238 198 84 -100 386 -65 81 -7 -276 -61 -131 -32 -110
4038a10P8l6j22K09j16N8J35k91P0j68L88j77l0m4L83k32J09j91k22K99P5O1o1
$$ -110 -32 -68 -190 19 -97 -39 96 -195 -125 -293 95 -82 -112 -156 227 -5 104 -87 -309 -10 65 126 65
4061F5j5R1j01k17k2M73l32J38k12Q3L09n4k69n3J26J42j61N6j3l28K70J84j76
$$ 65 50 141 40 -177 -199 274 -58 80 -132 -49 260 206 -63 -116 10 152 -9 47 34 -294 -24 160 -16
4084a6r4K58k49P7K66p3k47M1J54k75K70Nl18M7J38J70k79kK34R0j83L4j94K21
$$ -16 -110 148 -101 -24 242 169 -78 -37 117 -158 112 117 -201 -154 -16 154 -125 -127 107 197 14 48 -146 75
4108G5j05Q8J67r5l02L61k18k18L35l4j37j44L58j66K1j71j34M35N5Q4m98J91
$$ 75 -30 58 225 130 -172 189 -29 -247 88 54 -83 -227 131 -35 -14 -185 -319 116 171 255 -243 -52
4130e2P9j81J91j53O2K82l42j17K19Q8p5J1J37LJ0l81L25o9j00N8J74nj74j10
$$ -52 27 -154 37 -116 -54 228 -114 -231 -12 76 1 12 149 152 162 -219 106 37 -63 -5 169 164 -10 -120
4154a20Q4Mp0k13J80K24q3J36j33J62j97J65j50k05j0N1o0M25j35R5k75J59l73
$$ -120 -36 -32 -102 -315 -135 89 6 142 9 171 -26 139 -11 -216 -226 -175 -235 190 55 150 -125 34 -339
4177c39N23L5k23j24J67lk55N40l59j0j1J39j69K57l2o0J37j23k24J49J11k55
$$ -339 184 219 -4 -128 39 36 -219 321 -38 -48 -59 80 -89 168 136 76 213 90 -134 15 126 -129
4199a29K87k07j07J36Q8k3J2J67k19N0j8l2K16m29J44M63n62J37l8K44k81J21
$$ -129 158 -49 -156 -20 68 45 57 224 5 55 37 5 221 -208 -64 399 -163 -26 -64 180 -101 20
4221B0K6j49K45K4J8l53K29j69R6J9k37J5L09m7j80M46m23J81O0k48J57q4K33
$$ 20 46 -103 142 166 184 -169 60 -109 -13 6 -231 -216 93 46 -134 312 -111 70 130 -118 39 -45 188
4244A88k6j60M2j00j47J38K7J37k6j7k18Q5M1l9K07l7k03J48rL63j83j47k11J29
$$ 188 162 2 44 -56 -203 -65 -38 99 73 56 -162 -77 -36 -75 132 95 -108 40 31 394 211 64 -147 -18
4268a8M0O8o8OM5l4JK49j66j32J15R7l34J22J6Pk93K90k51L40j76L1L3n6J32n5
$$ -18 22 90 22 28 73 39 40 289 123 -9 106 203 -131 -9 7 14 -279 11 -240 100 -76 -45 -12 -68 64 9
4294Ij65J28J45j64K07j04j39J81l21L17K9K3l47M54k40K3j31j28K35n3j03L36
$$ 9 -156 -28 117 -47 160 56 -83 98 -223 94 123 146 -201 253 13 36 -95 -223 12 -41 -144 192
4316A92k52J58m0K42k74k90J69m0R8J54k27m0J47K7K5K58m28J29k39J52L10j99
$$ 192 -60 98 58 300 26 -264 -95 -135 -37 117 -110 -150 -3 24 49 307 -121 8 -231 -79 231 32
4338C2j79J81k15K62j95j45K35j2J76k44O9R2k2J44rl71K86j2P0k79j05O3J30
$$ 32 -147 34 -181 81 -114 -259 -24 -36 140 -104 -35 57 35 179 170 -201 85 73 143 -136 -241 -178 -48
4361d8n5N2L4r1J56kM3Q2l63L29l41K0L16j45J21q2N2q7k02K96q4J38J6j0m62
$$ -48 -103 -51 -17 -108 48 46 89 171 -192 137 -204 -184 132 -13 108 26 78 -9 -211 85 1 139 155 145 -317
4386c17J38K1J85J18k25m1L03j01m8J22k23J09L9J33j96J55j79l42L06L6j16J76
$$ -317 -179 -158 27 145 -80 -121 182 81 33 155 -68 41 80 213 17 172 -7 -349 -43 -7 -123 53
4408E3Q4o3k72P7J22l5K10k71K06Mn8j6K1o3j91Q3J04J51q0q4j51L43j64Q5J58
$$ 53 137 74 -198 -121 1 -34 176 -95 111 115 57 41 62 -1 -192 -109 -5 146 66 -18 -169 174 10 95 253
4433B53j81j9j78N06m47k05N72j74j28Q8L3jqr1J7j18pJ80J28l20o8J58j03K5
$$ 253 72 53 -125 381 -66 -271 301 127 -1 87 120 119 111 20 37 -81 -88 92 220 -100 -168 -10 -113 -88
4457h8k53K65J36k23L39r3O4n5n9k0j18J77j62K41k5m89K64j09M29l92J07J8J23
$$ -88 -341 -76 60 -163 176 83 147 92 33 13 -105 72 -90 151 126 -363 -99 -208 221 -171 -64 -46 77
4480G7J6j7m12N70j89l4Ro7n7K8j96M69j05NO7l24P3q4M48r7j56P0j06jJ91j04
$$ 77 93 76 -336 234 45 11 20 -47 -104 -76 -272 197 92 97 164 -160 -87 -171 277 180 24 94 -12 -13 178 74
4506G4rj21J69R5k89k5K49p7J50k53J38k83K23j62L3L15k12j40j70K44J40M8l10
$$ 74 65 -56 113 208 -81 -106 143 66 216 -37 101 -182 41 -121 -88 227 15 -125 -295 -51 89 137 -173
4529a73K77Jj12P5p5K42l33K27q5n1J7J80Ll39K08M9j28j99O01m52l8O8r4Nk9
$$ -173 104 105 -7 68 -7 235 -98 129 44 -7 10 190 193 -146 62 111 -17 -216 385 -67 -105 -37 -131 -126 -155
4554a55K34k35J17J51j11N9QJ3k28K06j27O1m5K69k74O9J37j72j40J99p0k19K28
$$ -155 79 -156 -39 112 1 60 68 81 -147 59 -68 -7 -52 217 -57 12 149 -23 -163 36 -34 -253 -25
4577b5k92L91j70k19K68J40m3j20J31K1k61M28k7j63n5J19j67l9M85l58O3l69
$$ -25 -317 74 -96 -315 -47 93 50 -70 61 82 -179 249 222 59 4 123 -44 -83 402 44 107 -262
4599b62J96L3k12J03K42Q0k09O4J22j6p1k47J00J34k7k6K06j43k01J68j73J91
$$ -262 -66 -33 -245 -142 100 180 -29 35 157 141 70 -177 -77 57 30 4 210 67 -134 34 -139 52
4621E2qR9j28j5k5k25L46J5j01r2j80K29J1j09J82N5j16J94k2j86r8J47J16j33
$$ 52 44 143 15 0 -25 -250 96 111 10 -82 -262 -33 -22 -131 51 106 -10 184 162 -24 -122 25 141 8
4645Hj63L70m45K32q7J70k52n9L99l47K34m20K26P8K43J3M6j9n18L42p5L43o5
$$ 8 -155 215 -230 2 -85 85 -167 -226 173 -174 60 -360 -134 -56 187 200 246 227 -291 51 -24 319 254
4668B54m57J72p7l3JM51l65J43n5kl1k9k93J59R7qJ67O2k18m5L06j20O3k5k42
$$ 254 -203 -31 -108 -141 -140 311 -54 89 34 32 1 -28 -321 -162 -65 -73 94 156 -62 -107 199 79 142 117 -125
4693a25L11j29jk40J1K29k38J99M8J9j33j3r9K28j11j34L17j29R4j21q5K19J49
$$ -125 186 57 56 -184 -173 56 -182 17 65 84 -49 -62 -161 67 -44 -178 139 10 104 -17 -102 117 266
4716B66l10L9J20j26q2P0j0l8J17k1J1J24j68r3K36l05J45Jj37L00k51J04R1j17
$$ 266 -44 -5 115 -11 -93 -23 -33 -71 46 25 36 160 -8 -101 135 -170 -25 -24 -161 139 -112 -8 83 -34
4740c4K9o6j53K18m2P1k55L47j44j33K00k84K31k2J93m05P8K65j17J3l3Qj33L68
$$ -34 -5 -71 -224 -6 -48 23 -232 115 -29 -162 38 -246 -15 -37 156 -249 -171 94 -23 -10 -43 -35 -168 200
4764B00k02o5J90k48K89r0n2n3K25k93J09J9J27m4k57K21O2N2j81k5j08P0j50
$$ 200 -2 -67 123 -125 164 74 22 -31 194 -99 10 29 156 112 -145 76 138 190 9 -16 -124 -54 -204
4787b04M47k49j57K22k80L53k01J16k27Ok13K62K24m19M51K2k41Q6j80m1M47m94
$$ -204 243 -6 -163 59 -221 132 -69 47 -180 -174 -387 -125 99 -320 131 153 -88 -2 -182 -223 224 -270
4809b70K82q7J55jkQ3k95J95j79lo3J7J01J50O0k12m0P8M6j19K7K19k2k56J20
$$ -270 12 -75 80 79 77 160 -135 60 -119 -122 -185 -168 -67 83 143 -69 -109 -31 15 -104 -77 142 120 -136 -16
4834a6J76j56J31l21K51p1j87K43j31L8J1K76k73J46k4n6k1P2L2j97j61OK83J4
$$ -16 160 4 135 -186 65 -6 -193 50 -81 -43 -32 244 -29 117 93 37 16 88 120 -77 -238 -232 51 65
4858F5N2r6J48k80K20k17pk4J79j73J7K83o0j37K5J35j05p8l6M4n0J88K1j21P0
$$ 65 117 21 169 -111 109 -108 -115 -139 40 -133 -116 167 107 -30 -5 130 25 -53 -89 -45 -95 93 114 -7 63
4883F3oj12J14k49K78j44J24J11k00J19R6l70R7K17p0k07K27k15J09J07m11K70
$$ 63 57 -55 59 -190 88 -56 68 179 -21 98 194 -176 -79 138 68 -139 88 -127 -18 89 -322 -52
4905e2J08k32L06k76O3J22j80r7K40P1k98M9K33L9J61j86J34k28K8Q7K4j30p3
$$ -52 56 -176 130 -146 -83 39 -141 -238 2 73 -225 -176 57 96 257 71 205 -23 5 92 116 -14 -87
4928h7J32k44J58J29k22o4j7L68mk80J47J5Q2j77o5J07J35j58L0q6P5j08J27r7
$$ -87 45 -199 -41 88 -134 -198 -215 153 149 -131 16 31 113 -64 -129 -22 113 -45 -15 -101 -26 -134 -7 -104
4952a04j13K35O0j73M0j20J34N5O8M3l23R7j4j4J93J94o2k14J44j06J47l25qK11
$$ -104 -217 18 78 -95 -55 -175 -41 14 82 125 -198 -101 -115 -129 64 258 196 -18 126 20 167 -158 -166 45
4976D5k11J41j8J03q2M7J31k01J75M5j63r4P3j56l6J40J82k74J16r9J75j38r9
$$ 45 -166 -25 -43 60 -22 25 156 -45 130 175 12 -82 -9 -165 -201 -61 121 -153 -37 -136 39 -99 -198
4999a98P0MK21j72J33j86J08K20k80J70j23Q0J6J85m71L30n6J3j71j70O1K39J0
$$ -198 -128 -124 97 -75 58 -128 -20 200 -80 90 -33 47 63 248 -223 107 51 64 -107 -277 -216 23 33
5022C3J6r7m7J48k45K15j43J34k05q1R5P1N00m25N3j3m5Mj11M19m56L47l64J68
$$ 33 49 -48 -95 53 -192 23 -120 14 -191 -272 -177 -106 394 -31 22 9 -36 -32 -143 276 -180 167 -197 -29
5046b9J31jk17J93ll6J78m85M53k18J49k42R0o3N3L17l71J28o4L28l85M04m7m36
$$ -29 102 101 -116 77 74 38 216 -269 184 -34 115 -127 -37 -100 -47 270 -101 27 -37 291 -94 310 263 -173
5070a73J91k6K8N1K8M0Rk15P8J9J77j90J72n73L56J17j71J9J30k03J84j40l0K65
$$ -173 18 -8 20 71 99 139 148 -67 11 30 207 17 189 -384 -28 89 -82 -63 67 -136 48 -92 -122 143
5094A43m9k33K40R1j33R1o2j2j67k01j33L02o9L0K98n7k59K12k15J60l4J57n5
$$ 143 94 -139 101 192 59 150 88 76 -91 -292 -425 -123 -192 -162 136 79 -180 32 -183 -23 -57 100 45
5117D5k8K9k0j28K7L6K6L1J61j30N2J16J02j26k92J63J09q6k10L0R4L3J97k37
$$ 45 17 46 26 -102 -75 -39 -13 18 179 49 101 217 319 193 -99 64 173 87 -123 -93 1 34 231 -6
5141fl70L33K36J2k10o6J03k50L60j48J00j38K84k26k6K2J45l11J32q1R4j19J56
$$ -6 -376 -43 193 205 -5 -71 32 -218 142 -6 94 -44 240 14 -12 10 155 -156 -24 -105 -11 -130 26
5164B6L0q1m0L15l79j25L56K7K9j81m1K21j53p1j01O9J86k1j79L95k71k38J57
$$ 26 56 -25 -65 250 -129 -254 102 129 158 -23 -64 157 4 -67 -168 -99 87 66 -113 282 11 -227 -70
5187g0l42L25J76j50J7N1j6K6j54L97j84j46R9j57J72j30j4O1R2p9N4j70J68m4
$$ -70 -412 -87 89 -61 -44 7 -9 17 -137 260 76 -70 29 -128 44 -86 -100 -39 53 -26 28 -142 26 -18
5211a8J6K49k53J10p1P5J65j28j36j38J61Q2k33L07k80J37rJ59k28M2M5j6J4K4
$$ -18 -2 247 -6 104 33 108 273 145 9 -129 32 114 -119 188 -92 45 36 195 -33 9 54 38 52 76
5235G6j50J40r4N2N5j08O1l3j40k6R5J68k87J66J97Pj50K86j66k54R7J8j44J69
$$ 76 -74 66 -28 24 79 -29 32 -1 -141 -167 -72 96 -191 -25 172 179 29 315 149 -105 -8 10 -134 35
5259C5j00Q3j19J21K20k85o5J94j79n8J34J4J21k41M5K43M7n46J44K80P7p0k61
$$ 35 -65 18 -101 20 240 -45 -110 84 -95 -153 -19 -5 116 -125 -80 163 210 -336 -192 88 165 95 -166
5282a66J9K98m93L44J12j06n6R1J13k39K73k51k0J4JK78k17m1qj03L80k29j61
$$ -166 -147 151 -342 2 114 8 -48 43 156 -83 190 -61 -81 -67 -66 212 -5 -46 -54 -157 223 -6 -167
5305a67R5M4L7k14L08j05o6j36K98k41J36J47j11k36L33l7k85J28j81M99k26j92
$$ -167 -72 -28 9 -205 103 -2 -68 -204 94 -147 -11 136 25 -211 122 85 -200 -72 -253 246 20 -172
5327a72L04k00j14K90m00J15J24j46K10n7NK99m30K91k83J10P6j5o7j22K92pk00
$$ -172 132 -68 -182 108 -292 -177 -53 -199 11 -46 -41 258 -172 119 -164 -54 22 7 -60 -182 110 103 -97
5350i7q3J82l5K62n6j40L0k01K63O4j30%M1Lk8k1J11J68n84L74j64q1l5J95K42
$$ -97 -180 2 -33 229 173 33 63 -138 125 189 59 59 100 103 75 54 165 333 -251 123 -41 -122 -157 38 280
5375B80k72j80K72J45l82R2j21J03J13j22m7N4n1J92K58n00N17o79K20P0K2Q3
$$ 280 8 -172 100 245 -137 -45 -166 -63 50 -72 -119 -65 -116 76 334 -166 351 -328 -108 -38 -16 67
5397F7k71M25k76K63k77q4q1K84R7j82o8R9K19j34J17r5Kr1j14NK11k87P1K07
$$ 67 -204 221 -55 208 -69 -153 -234 50 147 -35 -103 -4 215 81 198 103 105 14 -100 -95 116 -171 -100 107
5421A07l09J06K23O4q5j26q9j59O6K94J28j94j76J9J07k8P7j59J54j81L07o4p2
$$ 107 -202 -96 127 191 106 -20 -109 -268 -202 92 220 26 -150 -131 -24 -52 25 -134 20 -161 146 82 10
5444A0k1j38K53J4J81l72M7J17k3L4k65K38n4N1k11L54M6j24k41N6j93lK80j21
$$ 10 -11 -149 104 118 299 -73 -26 91 68 102 -163 75 21 72 -139 215 261 137 -104 -48 -241 -244 36 -85
5468h5K17P3l12J03J7n1M0j74R7k63M73QQ0j06L3o6J48p3k82K0q4K68j32J41m4
$$ -85 132 205 -107 -4 13 -38 2 -172 -75 -338 135 143 223 117 150 84 232 159 -123 -103 -187 81 -51 90 46
5493D6J11p6j21k3J14n8k08J45J30Rj52J68j06P4Q5j28j1J94l90J52L1j59O3m5
$$ 46 157 81 -40 -63 51 -7 -215 -70 60 69 -83 85 -21 53 138 10 -1 193 -197 -45 -14 -173 -110 -155
5517a55O6K9p1K96l58P1L05k78J55k1k76K37r7J62qN9q9N3m1K7p5r1L9j93J68
$$ -155 -89 -60 -131 165 -193 -122 183 -95 60 39 -237 0 -97 65 57 116 27 80 39 66 -9 -100 -61 -254 -86
5542h6J96j30R3o9r5mR6p3J08J5j28Q2O7r9k8N25n25k27K70j45J42k47L18p1m3
$$ -86 110 -20 73 4 -91 -95 1 -72 36 51 -77 5 72 -27 -55 470 -55 -282 -12 -157 -15 -262 56 -15 -58
5567e8L5O3k14O6M9K92q3m33K89j97N1K82j86p4L03P8l83PP8j68J86o2j37M33
$$ -58 -23 40 -174 -108 -59 233 150 -283 6 -191 -140 142 -44 -118 185 263 -120 -113 -35 -203 -17 -79 -216 217
5591B17N4k50J5j41O2J85n8k47J32J32M1j05j32K03J16o9j38J01l00K03K36k61
$$ 217 271 21 36 -105 -43 142 84 -163 -31 101 142 37 -95 108 224 155 17 118 -182 21 257 -4
5613dJ43j84J90k2k00J69J5j07p3J11k98N18j41m36L89j65l1J53J1k76J93k57
$$ -4 139 -45 145 123 -77 92 107 0 -73 38 -260 258 117 -319 70 -95 -126 27 38 -238 -45 -302
5635c02M41k50P2n6rK23L2N2j33nJ5n9K4J63j68n5J04l1r9K95k24J7j27L31k21
$$ -302 139 -111 -39 -95 -104 119 151 203 70 65 80 21 45 208 40 -15 89 58 -41 254 30 47 -80 251 30
5660C0m42L61P9k80L60m05K11L24l13J40j88k06P9K45j5j47J60M8l1J8r6N2l5
$$ 30 -412 -51 28 -252 108 -297 -86 238 -75 65 -123 -329 -250 -5 -20 -167 -7 41 10 28 -68 -16 -51
5683e1j62K65k07K21q4p0oJ41j72J15r5K83k71j2K23J40k09o4j13L3j0J12j47
$$ -51 -213 52 -155 66 -18 -88 -94 47 -125 -10 -105 178 -93 -105 118 258 49 -15 -128 -95 -105 7 -140
5706a40K50M8j77j34K56k11J08j24j4L6J37j45k48J98J54l3k70L33L0n0R2m9J07
$$ -140 110 158 -19 -153 103 -108 0 -124 -138 -102 35 -110 -358 -160 -6 -39 -309 24 54 4 96 47 154
5729A54j56M9J95l91J08k5L06j50j51k7k3L24n9j26O7k36LJ93l4k14K01K65o1
$$ 154 -2 47 242 -149 -41 -66 240 90 -61 -88 -111 213 154 28 95 -141 -138 55 21 -193 8 273 212
5752B12j77jL0k3ll4L7J3k01K01J31j79M0K89l83n3K00k36L3j54L15j69MJ31p5
$$ 212 35 34 64 41 38 4 41 54 -147 54 185 6 46 335 -48 -101 99 -137 -104 -258 57 -112 -108 23 -52
5777e2l7M02j98rj19k80OK77M6J25l04K53k49J53j3K2k3j30J83J02k73J94j84
$$ -52 -89 313 115 106 -13 -293 -287 -10 36 161 -143 110 -139 14 1 23 0 -130 53 155 -118 76 -108
5800a08Q8M0oJ78j07j25j13j23J45K50j87n2r4K58n4j56k13L03J4J58J60l07l9
$$ -108 -20 20 14 192 85 -40 -153 -276 -131 119 -68 -120 -214 44 -10 -166 -379 -76 -62 96 256 -51 -90
5823i0k3J87J26q2M7q4L05m09n8j0N7j73M42m63K1J60M1N2j83L59k90M0K7pq8
$$ -90 -113 74 200 118 165 81 386 -23 -81 -91 -34 -207 235 -228 -207 -47 -6 46 -137 222 -68 -28 -1 -8 -96
5848i6J54P0J8Ok26p5K86l30K86n3J06l46L28o1k57J00j06L09k5q9k72L28k3J52
$$ -96 58 128 146 152 -74 -149 137 -193 93 40 146 -200 128 67 -190 -90 -196 113 88 -1 -273 55 32 184
5872A84k85L74l68m9K4J86P2l26l8J88M2j25K4LK66J54m56J23j36K38l8P5j50
$$ 184 -101 273 -95 -144 -120 66 138 -188 -226 -38 4 -121 -97 -94 172 326 -130 -7 -143 95 57 132 -18
5895a8K12k09m3K97O6p3n48J07R9L43k11j10M3p5J09j33M67m46O6K3K6p6N2j52
$$ -18 194 -15 -58 239 305 232 -316 -209 -110 233 22 -88 -45 -120 -11 -144 323 -123 -57 -34 -8 -84 -32 -184
5919a84K20l23L00nj15N0J14L4j63k8K81q7p1K37j82k5rR3J24k83J84j60Q7q6
$$ -184 36 -287 13 8 -107 -57 57 91 -72 -100 181 94 23 260 78 53 44 137 261 -22 162 2 89 3
5943CK04k47J08Pl34K85J19k55K89k03Q7j43j9M5j71K13l01K54q6M06m43K47J75
$$ 3 207 -40 68 75 -259 26 145 -110 179 -24 63 -80 -99 -54 -225 -12 -313 -59 -145 261 -182 65 240
5966B40j45J23k36J19k32N9K69l31K90o2N0O8k65k72J85K14k16K02J00k14J41
$$ 240 95 218 -18 101 -131 -72 197 -134 156 94 144 212 -53 -325 -140 74 -142 60 160 -54 87
5987H7P7l7J47l32K58J45l90K35k40O5k80M13l21K55J05k37K64l12K57K8rk87
$$ 87 164 127 274 -58 200 345 -45 190 -50 15 -265 148 -173 82 187 -50 214 -98 159 187 178 -109
6009a09J86q4R0O0k06J35J3j76J27O0l05J98J01j69J67k59R1L04m47L39j91J25
$$ -109 77 -7 83 143 -63 72 85 -91 36 96 -209 -11 90 -79 88 -171 -80 224 -223 116 -75 50
6031E0j06P5OJ17n2N8j31M2J17k10J5k58K92M6j61K76l08P8K26k75J11l64K12
$$ 50 -56 19 25 142 90 148 17 59 176 -34 -19 -277 15 61 -100 176 -132 -54 172 -103 8 -356 -144
6054a44K65p8r3J28j27P6j41J00K0J01j00K92m62J33K3K2j37Q9j06R0m8R4O3p7
$$ -144 121 43 -50 78 -49 27 -114 -14 6 107 7 299 -163 -30 -7 15 -122 -33 -139 -49 -97 -3 60 -17
6078a7k13Q3J61k28J73lJ64k40K64l4l72K51L6o1q8M7Q2j56K21j04J40j39J49
$$ -17 -230 -147 14 -214 -41 -44 120 -120 144 110 -262 -11 25 -36 -124 -77 5 -151 70 -34 106 -33 116
6101A16p9K6N1N8j38J70k26kJ91l95L23k20r4K85P7Pj17J05k36K26j27L39k75
$$ 116 37 63 114 172 34 204 -22 -24 167 -228 95 -125 -219 66 143 150 33 138 -98 128 1 340 65
6124F5J72l57J36N4j21K37L0o26N59l12J51J47j06j9M9J9J26j79O9K26k53r0j88
$$ 65 237 -120 16 70 -51 186 216 -410 149 -163 -12 135 29 10 59 78 204 25 94 320 67 -23 -211
6147b11K72k13n5M36l25J28Jq3KK51j23L9J01k43K5j91K02O9l23L76j78O6JJ37
$$ -211 61 -152 -207 229 -96 32 33 -50 -48 203 80 119 220 -23 2 -189 13 82 -241 135 -43 23 24 161
6171A61q6J60k66K2r2J6j34R9Q3R2k64L79j04K23q6j92M4J39k49O0j10R8q7m6
$$ 161 75 235 -31 -9 -101 -85 -219 -120 -37 55 -209 170 66 289 203 11 55 194 -55 5 -105 -7 -94 -140
6195a40L71m77J1J47J26J21j46j56J95r0L21j86k29J29J1K5j52j75J52k3J71Q5
$$ -140 231 -246 -235 -88 38 159 13 -143 52 -38 283 97 -132 -3 8 33 -119 -294 -142 -165 6 91
6217I1k67J80k54K43L44k47j64l6J63J57j52K8j57kK18l75Q6L89m17J20J27OO7
$$ 91 -176 4 -250 -7 337 90 -74 -110 53 210 58 86 -71 -73 145 -230 -144 245 -172 -52 75 81 148
6240A48l44J34J9J20J15L7l08O6J15l10J75J5k94N58j83m63N47j46j49q3K10m0
$$ 148 -196 -62 -43 77 192 229 -79 -13 102 -208 -33 -18 -312 246 63 -400 147 1 -148 -231 -21 -61
6262f1o3k19L76J49k76L25m52J74J10J06k85K27j36k49P8N7L90m37J88k42J46
$$ -61 -124 -343 33 182 -94 231 -221 -47 63 169 -116 111 -25 -274 -196 -139 251 -186 2 -240 -94
6283i4j96J82K37k61R6K05k85K57j73j29K92k71K74o7J1jj39m0R5K19j47j56K25
$$ -94 -290 -108 129 -132 -36 169 -116 141 -32 -161 131 -140 134 67 78 77 -62 -102 -7 212 65 -91 134
6306A34k71L24k15l5j3j3J83J1k45L60k38J7Q2j81J0m0q3J87p9J4O5n5L8j25K57
$$ 134 -137 187 -28 -63 -76 -89 94 105 -140 220 -18 -1 81 -100 -90 -130 -213 -26 -105 -91 -26 -81 -43 -168 89
6331H9o02P05k72M54k69j87kN9Q8l25K97r0o2K23j52K15j72l85O21k89Q5j19L19
$$ 89 -513 192 -80 374 105 -82 -84 -25 63 -262 35 -55 -117 106 -46 169 -3 -388 233 -56 29 -90 229
6354B29l01R2J16k62L18j48r3j26J56O0nK4O2J75m19L43J4r4J6j57P8l10M27k81
$$ 229 -72 20 136 -126 192 44 -49 -175 -19 41 36 60 122 297 -122 221 235 141 157 0 78 -232 195 -86
6378h6J66j44J97j64j37K56J33k25J5O1q9j08rJ41j7l3j28K92L9J8k65K35m52
$$ -86 80 -64 133 -31 -168 88 221 -4 11 72 -17 -125 -134 7 -10 -43 -171 121 160 178 -87 148 -304
6401c04N17k24j3K64l62J47j76K29k25P6L28l61j69M56k24J44R4k13N9j00K5R2
$$ -304 213 -11 -24 240 -122 25 -151 78 -147 -71 257 -104 -273 183 -41 103 197 -16 43 -57 -32 60
6423F0j08J22k72Q9M21m00J39j41r7Q4M03m14J38n3Q5Q4j41r8L44j43m3j0k79
$$ 60 -48 74 -198 -109 312 -88 51 -90 -187 -103 300 -114 24 -29 56 140 -1 -99 245 102 59 49 -230
6446b30K02k0o8m1j71K74L9M8K12m10J62n6J06J6r4J85k71J79p0j98N7M40k76
$$ -230 -28 -48 -116 -157 -328 -54 -15 33 245 -165 -3 -59 47 63 -31 154 -117 62 -8 -206 -149 291 15
6469A5q9K65j41lrj05q7J94k72L04l12M59m18K36o6J19j21L43l41L3lj67J76J94
$$ 15 -74 191 50 47 38 -67 -154 40 -232 72 -240 219 -199 37 -29 90 -31 312 -29 4 1 -166 10 204
6493B04k15N5Km49N49l74L46k02J3K88Q1j57k11K52k79K0K43p7j49K36j04O1r8
$$ 204 -11 44 46 -403 146 -228 118 -84 -71 217 298 141 -70 182 -97 -77 166 89 -60 176 72 133 35
6516C5k38K2J04R1j56M9R8o3K03k24L1q1J01k38L53n6R7j74J13k01m2L26l75J00
$$ 35 -203 -181 -77 14 -142 -93 5 -58 145 -79 -48 -129 -28 -266 87 31 128 -46 67 -134 -176 150 -225 -125
6540a25o3K02R4m2K14m76M22m14kK40K2j01K08k56r0r4M21k11p1Q5M3qm6r5K25
$$ -125 -188 14 108 66 280 -196 226 -188 -190 50 72 -29 179 -77 -167 -261 160 -51 -122 -37 6 -2 -48 -143 82
6565H2k69J83J30l18Q6M1K61l00M28k29k38K28p8J21mk5j82j18RK38k48K89Mj85
$$ 82 -187 -4 126 -192 -106 -65 196 -104 324 95 -143 85 7 128 124 99 -83 -201 -192 46 -202 87 91 -94
6589i4N8j05K33j04j9j01O3j81J6n0L28j00J70K59m60K45J5j99j55K41Rk35M24
$$ -94 -36 -141 92 -12 -31 -132 -69 -250 -234 -284 44 -56 114 373 -87 158 173 -26 -181 60 69 -166 258
6612B58p1oj79J5j08J46r7J58j95K34m53Q5L34QJ02l18J2J05j49J88O9j7j69j36
$$ 258 187 181 2 17 -91 55 -42 116 -79 155 -298 -213 121 129 231 -87 -75 30 -119 69 138 121 -48 -184
6636a84J89j35m2J55J65j97J42j9l5l1q8l4L17k3m76R1J15K69l17J79j34J43j5
$$ -184 5 -130 -172 -17 148 -49 93 74 39 8 -80 -114 203 180 -296 -205 -90 179 -138 41 -93 50 35
6659C5L24j36q9k87P1J26j45K4L06l2k09J33j26Q8J12l31J18K36l77L94l84K33
$$ 35 359 223 134 -153 -82 44 -101 -77 229 197 -12 121 -5 83 195 -136 -18 218 -159 235 -149 84
6681H4k79J90L1Q3k56JJ58j49j20L47j45R0K44k92Jm7j24J22r8Q0L02n10L75k27
$$ 84 -195 -5 26 109 -147 -146 12 -137 -257 90 -55 35 279 -13 -12 -59 -183 -61 -159 -79 223 -287 88 -139
6705a39L18k37N1J26j27J17P5K6k97j61m2K39J48J82k50P6p1K48q5O5l80l9J93
$$ -139 179 -58 -7 119 -8 109 184 210 -87 -248 -290 -51 97 279 29 105 34 282 197 262 -118 -157 36
6728C6rN6j87K16j69L62m94J11J92k56j9J11j49L70j78l1N7n1L8m08N37k46O8
$$ 36 27 83 -104 112 -57 305 -189 -78 114 -142 -161 -50 -199 171 -7 -38 19 -32 6 -402 135 -111 -43
6751d3N5N7n5m6J50j74K76J17l71J32j5j00N3Q3n8K7k56K64J24l82M61j76j26
$$ -43 12 69 14 -32 118 -56 220 337 -34 98 83 -17 36 119 61 88 -168 96 220 -162 299 123 -3
6774cm6r9j1L32j78j01o9L25K24l32M5K29k69L0j73k7J08K54o0k54l1J02q7K63
$$ -3 -49 -148 -159 173 -5 -106 -175 150 374 42 87 316 47 77 -96 -123 -15 239 179 -75 -106 -4 -91 172
6798A72k65J61p9Q8l06J25M1J46N0k01K39k28J08j1j69N7M3L7k40O6O4J85k20
$$ 172 -93 68 -11 77 -229 -104 -63 83 133 -68 171 -57 51 40 -129 -72 -29 8 -232 -166 -102 83 -137
6821a37O5J41j3j26m9J42j1J18q4L7plO2k80J46J57j29j39K63k59N8K2N5K18k88
$$ -137 -72 69 56 -70 -119 23 12 130 46 83 76 73 135 -145 1 158 29 -110 153 -106 -48 -26 29 247 -41
6846d1l67K52P8J33j51J27k75J53m2J09J30k47J35P4o0k11J89M3J87l56J76j04
$$ -41 -408 -156 -78 55 -96 31 -244 -91 -133 -24 106 -141 -6 68 8 -203 -14 29 216 -140 36 -68
6868f8L2j03P2j08J29K48k48J01j68K48p8j25j16J88O9j2lJ2m8q9K0j27K04J9
$$ -68 -36 -139 -67 -175 -46 202 -46 55 -113 135 57 -68 -184 4 73 61 58 70 22 -67 -47 -174 30 49
6892D9k4j32J12k38K35N3k78K45J64O8l22J0J04j30j43L5L17j3l78M71N2l24K4
$$ 49 25 -107 5 -233 2 55 -223 22 186 254 -68 -58 46 -84 -227 -192 125 112 -266 205 257 -67 -43
6915d3Q5M2k61L2J96m5J56j73J05j10K30l13m7j74M52n5J2m6R8k75p2J38K93m63
$$ -43 42 84 -177 -145 51 6 162 -11 94 -16 214 -99 -146 -320 132 77 89 43 141 -134 -206 -68 225 -238
6939b38M75j49j68J87k2k83P8L48l87J56J28j95N1J21j38k7K31j79Qj25L40k90
$$ -238 237 88 -80 107 85 -198 -120 228 -159 -3 125 -70 -19 102 -36 -63 168 -11 -3 -128 212 -78
6961g8l0J16JLj74L02L2o1j78J91J47mj51j75J51k27P7J54k6J27k91j45R9J01
$$ -78 -108 8 9 12 -162 140 172 111 -67 124 271 267 116 -59 92 -135 -58 96 70 197 -94 -239 -140 -39
6985c9k29K37K3j00m4k41M71j00J53J67k93K23M5l65J67k16p5J96j2J19p0OJ93
$$ -39 -268 -31 -8 -108 -152 -393 78 -22 131 298 5 228 273 -92 75 -141 -216 -20 -32 87 17 23 216
7008B16o1l8l44J23J52l8O5K07j49k84Q4K22q9J61Nl07J58k5p5j29J05k7L40l36
$$ 216 155 117 -227 -104 48 10 75 282 133 -151 -67 155 66 227 232 -75 83 58 -17 -146 -41 -68 272 -64
7032f4K17p9m3m8m6J29j4k43J65J39j21K8K11j73k43L63J49m52o4M95j22j86l74
$$ -64 153 74 31 -17 -63 66 52 -191 -26 113 -8 20 231 58 -185 178 327 -125 -189 306 184 -2 -376
7055c76L75J12j9r4J42j47j05K51J21k14J65k21J50j47L73m75P0K15Jk28kJ94
$$ -376 -1 111 92 -2 140 -7 -112 139 260 46 211 -10 140 -7 366 -109 -39 176 177 -51 -53 141
7077A41j5j60K55k76J33J90r1j81N5K11l65J24J85j69j66L67k94R7J9j22N3J27
$$ 141 126 -34 221 -55 78 268 177 -4 51 262 -103 21 206 37 -129 238 -56 41 60 -62 -9 118
7099A18k5j39O8l40K39j1Q9K40j64M9jP3m64K93K44k46N0j03N9o2l2N8R9Pk14
$$ 118 93 -46 22 -318 -79 -90 -1 239 75 124 123 196 -268 25 269 23 73 -30 29 -33 -65 -7 92 99 -115
7124a15L14j38J74j57q8L68l78J47P0l31J93MM2r2L5K22k84Q9J90m06qJ69j1P3
$$ -115 199 61 235 78 -10 358 -20 127 197 -134 59 63 105 13 48 270 -14 75 265 -141 -149 20 9 82
7148H2k87J27K9J57k20q6Q3J9n0J5J3qK83k8j01Q6o3l3j23K8L45m91M00k82J60
$$ 82 -205 -78 -49 108 -112 -198 -115 -96 -146 -131 -118 -126 157 129 28 114 51 18 -105 -77 268 -223 177 -105 55
7173E5J43l49K77j27l9k94M22k7o5J54l13N3J07J10j01k21J94J31k88M31k18O8
$$ 55 198 -151 126 -1 -40 -334 88 61 -4 150 -163 -110 -3 107 6 -215 -21 110 -178 253 35 103
7195A03K4l0lk36K4K0J54k13J97p9l8j83K20j15J51j6J16j26J73j06J70j34q6
$$ 103 127 97 94 -142 -118 -98 56 -157 40 -39 -77 -260 -40 -155 -4 -20 96 -30 143 37 207 73 -13
7218a3J57r5R8k13q2L86l02M34k84l3n8o1P7K4j4n2q3M0M8L01m67J57k1Q7p5L2
$$ -13 144 49 147 -66 -148 238 -64 370 86 53 -5 -66 11 35 21 -31 -114 -74 -26 275 -192 -35 -56 31 -44 -12
7244a2m0J04J90j98k12O4M8k1o8J31P9j97k1K78j79K09j06p9J10Q7k58J6m4L80
$$ -12 -52 52 242 44 -168 -104 -56 -77 -145 -14 65 -132 -153 125 -54 155 49 -30 80 167 -91 -75 -119 261
7268B61j35o9j33K72k44j54K99jk39K15L53o78J40mK18l28J9L55j53L5P0j0j84
$$ 261 126 57 -76 196 -48 -202 97 96 -143 72 425 -253 -113 -117 101 -227 -208 147 -6 29 99 89 -95
7291i5R9J20J8k53K42k48n0P4L91j66k02K16K44k71P6l07j35M07n9j05K02r8J4
$$ -95 4 124 142 -111 131 -117 -167 -93 298 132 -70 146 390 119 195 -112 -247 160 101 -4 198 100 114
7314A14O3k73Q6j33K31j90K29pj75o0M0L39j32j90O7O9k09J18j15R8J55k98J0
$$ 114 177 -96 -10 -143 88 -102 127 120 -55 -115 -75 264 132 -58 9 78 -131 -13 -128 -30 125 -173 -163
7337a63j3M35L3m83J89k2N5m4k6L60m25j03N4J17k68L32J89m60K88j23n6Q4j5
$$ -163 -176 259 292 -191 -2 -24 31 -13 -39 321 -104 -207 -153 -36 -304 28 217 -243 45 -78 -134 -50 -65
7360f5J36j24q4P9N2J4M6J83j61n9m0K3J05j21R0R0k26j57M61k61Jl4q7J56k8
$$ -65 71 -53 -137 -58 -6 8 54 237 76 17 -23 0 105 -16 74 164 -62 -219 242 -19 -18 -52 -139 17 -11
7385a1K49o9l28J62J50m77L34L9k00J22m9K95k41K15k90J11p5J2p3J03J59O6l58
$$ -11 238 169 -159 3 153 -324 10 49 -151 -29 -78 217 -24 191 -99 12 -63 -51 -124 -21 138 204 -154
7408a54K45q2N7J2n7J30k54O2j15J94j64j4K78j28l8J18k29K18k3l4L26n07J79
$$ -154 91 9 66 78 21 151 -103 -41 -156 38 -126 -140 138 10 -28 90 -139 79 56 22 348 -159 20
7431B0M2J90k64P5N1j30L87n39j08K85k62L89j59j66Q8J64j17r4OK13jm6j22K62
$$ 20 62 252 -12 63 114 -16 371 -168 -276 9 -253 136 -23 -189 -101 63 -54 -148 -142 71 70 24 -98 164
7455A64k52K58n7j44Q4j90L59l39m8J10j4Q0o3q8M42m30qQK07r1K61l00K7j51
$$ 164 -88 170 113 -31 53 -137 222 -117 -165 -55 -69 11 -52 -140 302 -128 -136 -128 79 -12 249 -51 -24 -175
7479a75p4J89J65j88K12J15j50p5j34k0K86Ok93J6O3L7j48L12m7j28L67l82R9
$$ -175 -249 -60 105 -83 129 244 94 19 -115 -135 151 157 -136 -120 -57 -20 -168 144 97 -31 336 -46 53
7502E3j93K3j3O4K51k53j28K75l57J40P8J23mo6j06J32J84m65L81j86m1K2o9J66
$$ 53 -140 -117 -130 -66 185 -68 -196 79 -278 -138 -60 63 59 -7 -113 19 203 -262 119 -67 -108 -86 -155 11
7526A1K06l61J12n7M5j84J96J85l21K20J10k01M78m24M1k93K46j02J98q3j46J60
$$ 11 217 -144 -32 -89 -44 -228 -32 153 -168 52 162 -39 439 15 56 -237 9 -93 105 22 -124 36
7548C6j22k74K71K69k94J3M8j0N0O8n1J51r8k7n4j27N44l85q0j15L49q5j80J42
$$ 36 -86 -360 -89 180 -114 -101 -53 -63 -13 55 4 155 57 30 -24 -151 393 8 -72 -187 162 77 -103 39
7572C9k23J00J70k96KK08J37qj45K9N1J42k97M8q3M7o3J04L8J71K28k53k58M8
$$ 39 -184 -84 86 -210 -208 0 137 129 -16 13 64 206 -91 -43 -126 -79 -142 -38 0 171 399 146 -112 -64
7596f4J37j84Q0Q6k16K34n9Q8j26M72n93l4M29o4k13N9j80L92k11j30K85k04P1
$$ -64 73 -111 -31 55 -161 73 14 102 -24 448 -145 -179 250 186 -27 32 -148 244 33 -97 188 -16 55
7619E5k3L5m58M95j46p2N12o27M42p8l88M02k61l5K94j15r2nJ78OJ9k96M6J11
$$ 55 32 67 -391 104 -42 -114 398 -229 213 135 -253 149 -112 -147 147 32 -60 -65 113 119 138 -158 -112 -1
7643aO0j23K2J07J83n2l39J41k14J83J29j62K1P2L0J33k39L1j14K25J65k19JK0
$$ -1 59 -64 -42 65 248 196 -143 -2 -216 -33 96 -66 -45 27 57 190 -49 -18 -132 93 258 39 40 60
7667F0j25O8N08l61k80K79k03J10L3l7J47l25j1K69l24J47J43Q9j39l07Q3J80
$$ 60 -65 3 511 150 -130 149 -54 56 89 52 199 -126 -137 132 -192 -45 98 187 48 -259 -176 4
7689DO7Q6k62K78j61j63j46M00k95L37l76K4J46J84k32J21J8j16J76k09J69k52
$$ 4 71 157 -105 173 12 -151 -297 103 -192 145 -231 -207 -61 123 -109 12 30 -86 90 -119 50 -202
7711b02L07j12k4K87j81oJ10n8K31l34P0O2k04RJ7J74n5k52K3k17O41k80m2M02
$$ -202 105 -7 -31 256 75 69 179 121 352 18 88 150 -54 -45 -28 146 91 -161 -138 -355 286 6 -36 366
7735C66m28O3j30R5j3J51k71J88j8O3k25K42r3P6J43l67M17k54r9j21O7J03r6
$$ 366 -62 1 -129 -34 -47 104 -167 21 3 66 -159 83 -10 66 209 -158 259 5 -94 -215 -148 -45 -141
7758a41M83j88m46N81n52J54J7M6L23l69L25l72Q9Q5j49K01J58k90P8J84m12M02
$$ -141 342 154 -292 289 -263 -109 -92 -46 277 -92 233 -139 -50 35 -114 87 245 -45 33 217 -195 207
7780B07k25l9J39j01O3J35r4k68R3O4j6J0J96j69J14nj21p0Q8j21J08O9l12J49
$$ 207 -18 -57 82 -19 44 179 85 -183 -90 -26 -42 -32 164 -5 109 104 -17 -87 1 -120 -12 57 -255 -106
7804a06J08j9r2K19j6k02J82M5k46K49o5M3k37L49j25N6k42O9q1J43k79K38M8
$$ -106 2 -17 -109 110 94 -108 74 119 -127 122 57 100 -137 212 87 143 -99 -30 -111 32 -247 -9 39
7827C9j53J05m3q6N4M7J9M8K6J61N5k03j15L9p4P7j25K8M0J14J03m0j50q1L03
$$ 39 -114 -9 -52 -138 -84 -37 -18 30 56 217 272 69 -46 -7 -81 -4 -129 -101 -61 53 156 116 -34 -115 188
7852A88r7j19o5R8K67m99N46l66P3r6J86j58P7k48L49m9J05n8k16oJ94j83j01
$$ 188 91 -28 -93 5 272 -227 319 -47 26 -70 116 -42 35 -213 136 87 192 134 -82 -88 106 -77 -178
7875a78O7K24l57N07j57q4L9j89R0p0L97m34R5p0K95l0o2L0N5j14M7o3k88L8J15
$$ -178 -111 113 -244 263 106 22 61 -128 -38 -108 289 -145 -50 -120 175 145 83 113 168 54 101 38 -250 -212 -97
7900i7J64j17L9%P6o5J42j97J85l03J88J43o3m5L8m1m0L20l61J24K4j71N42m26
$$ -97 67 -50 -11 -11 65 0 142 -55 130 -173 15 158 95 50 88 47 7 327 -34 90 114 -57 485 59
7924E9J36L6k19L5L1R0k08J00o5M2j45J33Q5k04J88p9K07k60J09K2k3q4P0J23
$$ 59 195 231 12 47 78 168 -40 60 -5 37 -108 25 110 -94 94 15 222 -38 71 93 70 -14 56 179
7948A79j05p9oJ66j18q0oK9l6R5k7n7L6J21j35j9j46Q8N2j79M9K94j76K63r3j46
$$ 179 74 -5 -11 155 37 -43 -49 -20 -56 39 12 -45 -9 112 -23 -42 -188 -100 -48 -227 -178 116 -60 203 110 -36
7974c6j25j8K31j02J58j42m2J11j39j16K67j00q6L05k19J95j23q0j6J6L06k99
$$ -36 -161 -179 52 -50 108 -34 -76 35 -104 -220 47 -53 -139 166 -53 142 19 -61 -77 -61 245 -54
7996e4No5P4j53J41J07r0p2j35K27j22n0K42l95L61k09K97j07m0K4j10J89r5J44
$$ -54 -49 -114 -40 -193 -52 55 -35 -107 -242 -15 -137 -187 55 -340 21 -188 109 2 -38 -14 -124 65 -30 114
8020A14j69K26K3l50L7K65k47NP5J79j54P7J47j34j37K9j85j09K24l8K30J41m18
$$ 114 -55 171 194 -156 -119 146 -101 -96 -21 158 4 81 228 94 -43 -14 -199 -308 -84 -122 108 249 -169
8043a69J91k15L62J34m17K72Q8N5l9j81q1r5J40j0PK6q2j6k3O9J03j22P0K3k48
$$ -169 22 -193 169 303 -114 158 246 301 262 81 0 -95 45 35 42 68 -14 -30 -53 16 119 -3 67 90 -158
8068a58J58o8K59o7k54J52j03J91p5r5J31l37L39j01L9J1k18J60j9K81m90L57
$$ -158 0 -68 191 124 -130 22 -81 110 35 -60 71 -266 73 -28 11 22 -196 -36 -55 226 -264 93
8090I3K1m7j71L42r2j20N2Q4j11K5J11o4k80J33N8m3L4o3J38j41J54Lk5J16m3
$$ 93 114 67 -104 238 146 26 78 162 51 76 187 123 -157 -24 34 -9 25 -38 100 -41 113 116 91 207 164
8115A64j46j37J15k37K81k9j40K23k65J49O8j26n8L51j91j44n2R8Q3k47J88j63
$$ 164 18 -119 -4 -241 40 11 -129 94 -171 -22 46 -80 -138 213 22 -122 -174 -76 7 -240 -52 -215
8137b15j7L01K8p8J88j02L9j26k67O8O8J93j62J69o0N1l1k8k8K74O6m26N9O8N6
$$ -215 -232 69 97 19 207 105 144 18 -249 -181 -113 80 -82 87 27 78 47 19 -9 265 331 -95 -36 32 88
8162H8j15K32j58L9j97J95l69M29k24oK04p0j60J97j60K30m2k47K13j50q9L29
$$ 88 -27 205 47 86 -111 84 -285 144 -80 -86 118 48 -112 85 -75 155 113 -134 79 -71 -160 169
8184A69l62R8P5J00k31J33n2
$$ 169 -193 -95 -20 80 -151 -18 -70
8191g0
$$ Imaginary data points
##PAGE= N=2
##DATA TABLE= (X++(I..I)), XYDATA
0@%%%%%%%%%%%%%qJ6j6J6k4L2l2M0m8N6o4P2q8J04j20J37j61J84k08K40k72L07
$$ 0 0 0 0 0 0 0 0 0 0 0 0 0 0 -8 8 -8 8 -16 16 -16 24 -24 32 -32 40 -48 56 -64 73 -88 96 -112 128 -144 163
35A63l47L91m39M91n47O10o80P55q36R25j023J130j245J372j514J669j839K026
$$ 163 -184 207 -232 259 -288 322 -358 397 -439 486 -537 593 -652 720 -794 875 -964 1062
53A062k234K465k725L023l362L753m214M761n422O249p314Q741j0766J3888j9408
$$ 1062 -1172 1293 -1432 1591 -1771 1982 -2232 2529 -2893 3356 -3958 4783 -5983 7905 -11503
68a1503L2114j20907l9961J06075m8340P236M9284Q0410K1024j2876j5719L1656
$$ -11503 20611 -100296 -140257 -34182 -82522 -75286 -26002 54408 75432 62556 46837 78493
80G8493K0842k7051p1566m464M0340j9420o5163n380L3191J8752k9470l6826J2969
$$ 78493 99335 72284 718 -3746 36594 17174 -47989 -53369 -20178 -1426 -30896 -67722 -54753
93e4753M4573L290k9000j1619M9253N5372j4886k9801L4190M4010r863n1870l1642
$$ -54753 -10180 -6890 -35890 -47509 1744 57116 42230 12429 46619 90629 80766 28896 -2746
106b746J3503l884n2492m6234O78L9232J9339k9242N881P6316N0031j4816j8249
$$ -2746 10757 6873 -45619 -91853 -91175 -51943 -32604 -61846 -55965 20351 70382 55566 37317
119C7317K1731L1587k1432n9799k9116P570L418l1261m3555J5860N6199M126k8664
$$ 37317 59048 90635 69203 9404 -19712 -12142 -8724 -39985 -83540 -67680 -11481 -7355 -36019
132c6019J0408M6804K8719k4321k8743J9535K9329r292l3904j7140K8666K4589
$$ -36019 -25611 21193 49912 25591 -3152 16383 45712 36420 2516 -14624 14042 38631
144C8631l4467l6801J5158K5658j3635m3108j0277L5788J6281j8192p208K6689
$$ 38631 4164 -32637 -17479 8179 -5456 -48564 -58841 -23053 -6772 -24964 -32172 -5483
156e483M7072J7339k7379m011L5604P385m2952m5164k614J3535k6523m2584j336
$$ -5483 41589 58928 31549 27538 63142 70527 27575 -17589 -20203 -6668 -33191 -75775 -77111
169g7111L1557K8587j640j0198L5770N2783J084k9588m172K4034L710m3638l6895
$$ -77111 -45554 -16967 -18607 -28805 6965 59748 60832 31244 27072 51106 54816 11178 -25717
182b5717R578J3559j3637k8090p262L3064K3596k2393j6989K4675L2259k599k8650
$$ -25717 -16139 -2580 -16217 -44307 -51569 -18505 5091 -17302 -34291 -9616 22643 20044 -8606
195h606L375L7237J0639k0781j3905J0751K1449r664m2188j4831J7345n05l2683
$$ -8606 -5231 32006 42645 21864 7959 18710 40159 30495 -11693 -26524 -9179 -9684 -42367
208d2367k5965J9987L4662j753j0998K1330L8494K4712r804j9120J3414J6884
$$ -42367 -68332 -48345 -13683 -15436 -26434 -5104 33390 58102 48298 29178 42592 59476
220E9476k4567m3849j9248J2671l99l3951j6278K6337K6783L625r151R087L6362
$$ 59476 34909 -8940 -28188 -15517 -15916 -49867 -66145 -39808 -13025 -9400 -18551 -9464 26898
233B6898J7603k0689j5572J4298J8495j3771l4785k359K3569k329k4907j4757
$$ 26898 44501 23812 8240 22538 41033 27262 -7523 -9882 13687 11358 -13549 -28306
245b8306R132J8151r617k6730K288K5756J2886j3437q772K8415L1383o791j6095
$$ -28306 -19174 -1023 -10640 -37370 -35082 -9326 3560 -9877 -18649 9766 41149 34358 18263
258A8263N842J5740o93k9509k8249L310O721j8599k5347K26L0525J6704j2624
$$ 18263 24105 39845 39152 9643 -18606 -15296 -8575 -27174 -52521 -52295 -21770 -5066 -17690
271a7690L682L1311K3669k698j7191j872J6072m311l0085k0844N462J3021j2213
$$ -17690 -14008 17303 40972 38274 21083 19211 35283 30972 887 -19957 -14495 -1474 -13687
284a3687k4926Q588K7283M355j3210m463J7554J9745r031j7756N503J9850N889
$$ -13687 -38613 -30025 -2742 1613 -11597 -16060 1494 21239 12208 -5548 -45 19805 25694
297B5694j7903j3295J7745J3778j8615k1405j04J0812j832k2677j0263J8252J7174
$$ 25694 7791 -5504 12241 26019 7404 -14001 -14105 -3293 -5125 -27802 -38065 -19813 -2639
310b639k049q029J1392L0928R340j8793n581J2609K821j9647k6725n429J0527
$$ -2639 -4688 -12717 -1325 29603 38943 20150 14569 27178 29999 10352 -16373 -21802 -11275
323a1275n081j7407m848J8098K3108j353j0650J5984K3585Q00j6708q514R934
$$ -11275 -16356 -33763 -38611 -20513 2595 1242 -9408 6576 30161 30961 14253 5739 15673
336A5673O810j7537j8955K178J1919R75j7680q861J8421J1764j3601j1178Q685
$$ 15673 22483 4946 -14009 -11831 88 1063 -16617 -25478 -7057 4707 -8894 -20072 -11387
349a1387J7680K903j3620O10J8987J2047o178j3800K493J4862p545k6299j0042
$$ -11387 6293 9196 -4424 -3814 15173 27220 21042 7242 9735 24597 17052 -9247 -19289
362a9289O660K017j4174j2979J0759K0694N289l076N010J9591J7176r736j5672
$$ -19289 -12629 -10612 -24786 -37765 -27006 -6312 -1023 -4099 911 20502 37678 27942 12270
375A2270N173P492j1405k2895j0752Q745L857j3475p888R602J6401N296j0376
$$ 12270 17443 24935 13530 -9365 -20117 -11372 -7515 -20990 -28878 -19276 -2875 2421 -7955
388g955J08J9166R260j1616r175P377J3070m189j5949j517J0661K330j1822j5409
$$ -7955 -7847 11319 20579 8963 -212 7165 20235 16046 97 -1420 9241 11571 -251 -15660
402a5660K152J1879o655j7031N53J5682J0331n514l181J6200J7150o45r608l428
$$ -15660 -13508 -1629 -8284 -25315 -24762 -9080 1251 -4263 -7444 8756 25906 25261 15653 12225
416A2225P682J751j9427j8272K201N687p065j3326J152J8813J0004m828J6J1876
$$ 12225 19907 21658 2231 -16041 -13840 -8153 -15218 -28544 -27392 -8579 1425 -3403 -3387 8489
430H489J3750j2j4706l519J0704j03j5193j1591N388J0388o536j2922K930J1268
$$ 8489 22239 22227 7521 4002 14706 14603 -590 -12181 -6793 3595 -2941 -15863 -12933 -1665
444a665L812p456q599Q746J2935l619r900L577J4111O637j0572o632R236N305
$$ -1665 2147 -5309 -13908 -5162 7773 4154 -5746 -2169 11942 18579 8007 1375 10611 15916
458A5916r547j3745n440O473J546j3491o347J1242J3499Q78n928P225J7873L637
$$ 15916 6369 -7376 -12816 -6343 -4797 -18288 -24635 -13393 106 984 -4944 2281 20154 23791
472B3791j0614n660K734L601r316j7605k943Q968L65r364l952J2318J3402l232
$$ 23791 13177 7517 10251 13852 4536 -13069 -16012 -7044 -6679 -16043 -19995 -7677 5725 2493
486B493o395O406J0765J432q936p252O826O793p244j0766N40R612J504j3470n695
$$ 2493 -3902 2504 13269 14701 5765 -1487 5339 12132 4888 -5878 -5338 4274 5778 -7692 -13387
501a3387R003M203o741p507K234J2615M464o794M82J1944J0469m363j0949J211
$$ -13387 -4384 -181 -6922 -14429 -12195 420 4884 -1910 -1428 10516 20985 16622 5673 6884
515F884P680o411j5101p644K356M300o465q264O521J4881N428l180n0J2658R201
$$ 6884 14564 8153 -6948 -14592 -12236 -7936 -14401 -22665 -16144 -1263 4165 985 935 13593 22794
530B2794q301r472J847L825l938j2767o629O418M586o140o502L485J1358K008
$$ 22794 14493 5021 6868 10693 6755 -6012 -12641 -6223 -1637 -7777 -14279 -10794 564 2572
544B572r633k40J0645N002m683n051L928J0484L2q716k844N403L403r110j2852
$$ 2572 -7061 -7301 3344 8346 3663 -1388 2540 13024 13056 4340 1496 6899 10302 1192 -11660
559a1660J326O800n075q467l20J0115R241j965k034Q625J1197R37q499n171N934
$$ -11660 -10334 -3534 -8609 -17076 -17396 -7281 1960 -5 -2039 6586 17783 18720 10221 5050 10984
574A0984N17j3104j0096J232M671j673p541L0J1494O629k456l285N176R854r39
$$ 10984 11501 -1603 -11699 -10467 -5796 -7469 -15010 -14980 -3486 3143 687 -2598 2578 12432 11493
589A1493j0640o87O878J247p111o811L715O821l068q017k037N671L797o483p327
$$ 11493 853 166 7044 8291 1180 -5631 -1916 4905 1837 -6180 -8217 -2546 1251 -5232 -12559
604a2559O088Q959j208m573K457R466N758o328n002L078L168m314j1458n229O360
$$ -12559 -6471 2488 1280 -3293 -836 8630 14388 8060 3058 6136 9304 4990 -6468 -11697 -5337
619e337J080p778k993P493R709J657m592L358R555K389o321o625J162M299n307
$$ -5337 -4257 -12035 -15028 -7535 2174 3831 -761 2597 12152 14541 8220 1595 2757 7056 1749
634A749j0729o13O027K003m677l899O982P449j662n032P89O357L138n685n377
$$ 1749 -8980 -9593 -3566 -1563 -6240 -10139 -3157 4292 2630 -2402 -1613 4744 7882 2197 -3180
649c180N610N750l118o488l30O121N25q482m756K783L468k354o433J179J0111
$$ -3180 2430 8180 5062 -1426 -1756 4365 4890 -3592 -8348 -5565 -2097 -4451 -10884 -9705 406
664D06M312l731m04O952O938k890q078l17L253k872q398p012K248N308l140m870
$$ 406 4718 987 583 7535 14473 11583 3505 3188 6441 3569 -4829 -11841 -9593 -4285 -7425 -12295
680a2295M088R201M365l271j577P070M710m707n790q64L386J90p294m402M652
$$ -12295 -8207 994 5359 2088 511 7581 12291 7584 1794 930 4316 4506 -2788 -7190 -2538
695b538L734l512n339J001O625Q10n828q96N083M710n34m134K442P501Q20n416
$$ -2538 1196 -2316 -7655 -6654 -29 781 -5047 -5943 -860 3850 3316 -818 1624 9125 9945 4529
711D529l065K432K516o425q090p3L310o94m083j283O338P682k85k484M328O188
$$ 4529 1464 3896 6412 -13 -8103 -8176 -4866 -5560 -9643 -10926 -4588 3094 2809 325 4653 10841
727A0841J095o704m168L281N86o286n819k28M614R75n299o08O438M313j684l855
$$ 10841 11936 5232 1064 4345 4931 -1355 -7174 -7402 -2788 -1813 -7112 -7720 -1282 3031 1347 -2508
743b508K358O231p64n322j080L899L165k852n355J684M301j284n711k999L041
$$ -2508 -150 6081 5317 -5 -1085 2814 5979 3127 -2228 -544 3757 2473 -3238 -6237 -3196
758c196L167m312m088L745N284J480k099J74N993L570l372m207J50K392k167p777
$$ -3196 -29 -4341 -8429 -4684 600 2080 -19 155 6148 9718 6346 2139 2289 4681 2514 -5263
774e263l173M301J547l061j832L404O432J931l153K48M679K066l406n780O80L721
$$ -5263 -8436 -4135 -2588 -5649 -7481 -4077 2355 4286 1133 1381 6060 8126 4720 -1060 -380 3341
790C341k594n688k75L558K752l033l082L081M227m59l910j106M523L415l993k706
$$ 3341 747 -4941 -5216 -1658 1094 -1939 -5021 -1940 2287 1828 -2082 -3188 1335 4750 757 -1949
806a949L774L601p55m158j658L555M60m961l858P76L049j96m655J328O354L019
$$ -1949 1825 5426 4671 513 -1145 2410 2870 -2091 -5949 -5173 -2124 -2320 -6975 -5647 707 3726
822C726j077r55L017M022j526n330j742J426o3m960m611K158L973j157k659J761
$$ 3726 2649 1694 4711 8733 7207 1877 135 1561 1498 -3462 -8073 -5915 -1942 -3099 -5758 -3997
838c997N153L207k374k056L112L019j656l900j299L185J396m853k271J913K475
$$ -3997 1156 4363 1989 -67 3045 6064 4408 508 -791 2394 3790 -1063 -3334 -1421 1054
853A054j281m150m02L893O56k771j468K662M886J08l235J549M852N70k981l540
$$ 1054 -227 -4377 -4779 -886 -230 -3001 -4469 -1807 3079 3187 -48 1501 6353 6923 3942 402
869D02R87J221l407n133l94K033J503k261j348M816M577J0j694J057L572P55l976
$$ 402 1389 2610 -797 -5930 -6324 -4291 -2788 -5049 -6397 -1581 2996 3006 1312 2369 5941 6696 2720
886B720k846J426O88k122l941n58L714R07l234q72L203K795j359l232J210L898
$$ 2720 -126 1300 1988 -134 -4075 -4633 -919 -12 -3246 -4118 -915 1880 521 -2711 -1501 2397
902B397M73k215j195J915L535j708l884P01K424q15l564k978J938K106k161k146
$$ 2397 2870 655 -540 1375 4910 3202 -682 19 2443 1628 -1936 -4914 -2976 -870 -3031 -5177
918e177J693L727K512j754l97L640K273k467l422m41J563p67m563j539J856J619
$$ -5177 -3484 243 2755 1001 604 4244 6517 4050 628 187 1750 983 -3580 -5119 -3263 -1644
934a644m25j770J470M748R92k497q66K723J642k443l311N86K534n74k954j115
$$ -1644 -2069 -3839 -2369 2379 3371 874 8 2731 4373 1930 -1381 -795 1739 1165 -1789 -2904
950b904K154K136j870k686J104K771k66k448p79L132K475j815j018J542K451J53
$$ -2904 -750 1386 -484 -3170 -2066 705 439 -2009 -2788 344 2819 1004 -14 1528 3979 4132
966D132l295j508J701J93k665l259L78K721M7k361J137L543K436k20j793J314
$$ 4132 837 -671 1030 1223 -1442 -4701 -4323 -1602 -1555 -3916 -2779 764 3200 2980 1187 2501
982B501K625q39l613j674R52P27k830k838J618K463j2j369n3K742K585j848j927
$$ 2501 5126 4287 674 -1000 -48 679 -2151 -4989 -3371 -908 -920 -2289 -2342 400 2985 1137 -790
999g90J907J903j83k719r69K881P56k268j951O79J593q16l191r62K671R25j547
$$ -790 1117 3020 2837 118 -851 2030 2786 518 -1433 -754 839 23 -3168 -4130 -1459 -534 -2081
1016b081j185J999L698k54r86O06K202R99k154k629j71J044j893l165j255K300
$$ -2081 -3266 -1267 2431 2177 1191 1797 3999 4998 2844 215 44 1088 -805 -3970 -5225 -2925
1032b925J608j480p87K798K904K30r85k41K134N70k435j947J72J855q55k968j42
$$ -2925 -1317 -2797 -3584 -786 2118 2348 1363 1122 3256 3826 1391 -556 -384 1471 616 -2352 -2494
1049b494K471J65j869r12J063K244k56k782R35K316J112p90j554J847K479j136
$$ -2494 -23 142 -1727 -2639 -1576 668 412 -2370 -1435 881 1993 1203 -351 1496 3975 2839
1065B839k518j99J103q3k829k435J084J622m02j365R44K719K380j426n28J783
$$ 2839 321 122 1225 1142 -1687 -4122 -3038 -1416 -1818 -3183 -2239 480 2860 1434 906 2689
1081B689J445j393k492q94J319n08k621q99J102J826o2j831Q67L150J93j488j133
$$ 2689 4134 2741 249 -645 674 166 -2455 -3354 -2252 -426 -488 -2319 -1452 1698 1891 403 -730
1098g30J391J680j086k057L50J908K49j685j512J291J684j906j654L66J364M94
$$ -730 661 2341 1255 -802 -452 1456 1705 20 -1492 -201 1483 -423 -2077 -1711 -347 147
1114A47j743p23K522J717j70j387N49K201J29k415j246O47K51j852k008l4K216
$$ 147 -1596 -2319 203 1920 1750 363 912 3113 3242 827 -419 228 479 -1373 -3381 -3415 -1199
1131a199L67r29N47J840J953o1j984Q54J872p54k113j618Q75O92j467j884J125
$$ -1199 -832 -1761 -1214 626 2579 2518 534 1388 3260 2506 393 -1225 -350 342 -1125 -3009 -1884
1148a884J697M68j310p50J651J599r59j393N12K187J70j685n80K065L69r42j804
$$ -1884 -187 281 -1029 -1779 -128 1471 512 -881 -369 1818 1988 303 -277 1788 2157 1215 -589
1165e89k71J364o17k310p23J373J005o80q60J764K440M37q79J6J246Q93j932k435
$$ -589 -860 504 -113 -2423 -3146 -1773 -768 -1448 -2308 -544 1896 2333 1454 1470 2716 3609 1677 -758
1183g58K06N05q96j701j015J809J390p99n31J560J585N02j052o70J610N53j467
$$ -758 -552 -47 -943 -2644 -3659 -1850 -460 -1259 -1790 -230 1355 1857 805 135 1745 2298 831
1200H31j026M01P91M9k358j97J445L26j098j026J17J946j48j574M18J846J134
$$ 831 -195 206 997 1046 -1312 -1509 -64 262 -836 -1862 -1745 201 53 -1521 -1103 743 1877
1217A877o89j126J345J388p66j652p55N49J44j626j913R10J374K36r99P5K697
$$ 1877 1188 62 1407 2795 2029 377 -378 171 315 -1311 -3224 -2314 -940 -704 -1703 -1628 1069
1234A069J343j168o43Q57R01m88k171p70J028L27j372r93O86J632k97r30p4J885
$$ 1069 2412 1244 601 1458 2359 1871 -300 -1070 -42 285 -1087 -2080 -1394 238 -59 -989 -1063 822
1252H22L58j066o04K59J565k81j319o6J179O05j268j282Q15N25n96j033o25J184
$$ 822 1180 114 -490 -231 1334 1053 -266 -332 847 1452 184 -1098 -283 242 -354 -1387 -2012 -828
1270h28P55o99o67J484J443N65j432q0J618k69j564r26J1J63l83j702J28J804
$$ -828 -73 -772 -1439 45 1488 2053 621 541 2159 1890 326 -600 -589 -426 -809 -2511 -2383 -579
1288e79N32o12q3J077J681l86j010K9P48k1j265j118N25Q17p02r68J2J118N83
$$ -579 -47 -659 -742 335 2016 1630 620 649 1397 1376 111 -1007 -482 335 -367 -1335 -1323 -205 378
1307C78j199n37J352P86m67p93R5J545N36r94l75P09O07p35j439m30R04j11j663
$$ 378 -821 -1358 -6 780 313 -480 -385 1160 1696 702 327 1036 1643 908 -531 -961 -57 -168 -1831
1326a831l17O64J107L3o11Q07J902L10p42n73N00O29r55j727l99M33J52p16r40
$$ -1831 -2148 -1484 -377 -344 -955 -148 1754 2064 1322 749 1249 1878 923 -804 -1203 -770 -618 -1334 -2274
1345b274J249Q27j67l06M60J173M05j142o38J181M05m86p04j15Q19K36j236o18
$$ -2274 -1025 -198 -365 -671 -211 962 1367 225 -413 768 1173 687 -17 -132 687 923 -313 -931
1363i31N80L28l57j249L12J242n0n74K3J373R96l53r99N99N50j22j202q14K31
$$ -931 -351 -23 -380 -1629 -1317 -75 -125 -699 -676 697 1693 1340 341 940 1490 1368 166 -648 -417
1382d17K83q62j016M84P78N29k57j27J301P64o52l35n8P25l12j131n72P26Q6k61
$$ -417 -134 -996 -2012 -1528 -750 -221 -478 -605 696 1460 808 473 415 1140 828 -303 -875 -149 -63 -324
1402c24o19J21R63J65p33k43M57Q39k80j194N83J054j44m27j96M56O16j171n28
$$ -324 -943 -822 141 306 -427 -670 -213 626 346 -848 -265 789 645 218 22 478 1094 -77 -605
1421f05L20J88R4j430J47M31J091m67m56R39J040Ko40m05O31K09r84m25q49O27
$$ -605 -285 -97 -3 -1433 -1286 -855 236 -231 -687 252 1292 1294 654 249 880 1089 105 -320 -1169 -542
1441e42Kq64O8J087P76m90m19M12J301j67r11m4L72n2k98j054K08O37j30l74k61
$$ -542 -540 -1404 -1336 -249 527 37 -382 30 1331 1164 253 209 581 529 231 -823 -615 22 -108 -482 -743
1462g43N05N89o58m96O61N98k07n91j63J049Q08n59m11j4M53J9j527j41P02l24
$$ -743 -238 351 -307 -803 -142 456 249 -342 -505 544 1352 793 382 368 821 840 -687 -828 -126 -450
1482d50l86m91L37P22M39k47K01P14O74k53o99qN33p51o47n77J72P59p75q13Q79
$$ -450 -836 -1327 -990 -268 171 -76 125 839 1513 1260 561 553 1086 335 -312 -889 -717 42 -733 -1546 -667
1503f67N57L66m53k17J280J05r28l45N64P69m04n68J35L61R1r10m98K74O18m76
$$ -667 -110 256 -197 -414 866 971 43 -302 262 1031 627 59 194 555 646 -264 -762 -488 130 -346
1523c46q43J34J166j32j8l05O79P67j63j40l08K77J96j180n74L34M04l86q48L59
$$ -346 -1189 -1055 111 -21 -39 -344 335 1102 939 799 491 768 964 -216 -790 -456 -52 -438 -1286 -927
1543i27Q85J71k83Q1N76O09k17q49j52P16L46j167m35O94J72r7q65K87N16N1m69
$$ -927 -42 129 -154 -73 503 1112 895 46 -106 610 956 -211 -646 48 220 123 -742 -455 61 112 -357
1564c57m83M95P62j36q34N02O17j97k60j89N24K14l70q36R1L19O0n49l28O02L52
$$ -357 -840 -345 417 281 -553 -51 566 369 109 -80 444 658 288 -548 -457 -138 -78 -627 -955 -353 -1
1585aJ53k96N22M77K42o70k10qL13n45l49n13L63M44n03J30J95N61k03k52M38
$$ -1 152 -144 378 855 1097 427 217 209 522 -23 -372 -885 -522 -78 -581 -451 -256 305 102 -150 288
1606B88O00j42m08p64N30O03n87o66K18O48j87k59q26O33M14l13l12n1Q11k44
$$ 288 888 746 338 -426 104 707 120 -546 -328 320 133 -126 -952 -319 95 -218 -530 -581 230 -14
1626a4m0k25P12M55l33m72K22M38m34p13m64L90J50j96n78M46Q48J12j94L3P09
$$ -14 -54 -279 433 888 555 83 305 743 309 -404 -868 -478 -328 -524 -1102 -656 192 304 110 143 852
1647H52L04n57m19M8P1M3p14j76J47K29l30l46M06Q18m83N9l32O52K78m87j05
$$ 852 1156 599 180 228 299 342 -372 -548 -401 -172 -502 -848 -442 376 -107 -48 -380 272 550 63 -42
1668d2K8O79n5o73j42M63K06m43m50q5K11K5l33l41M62O17J14m63N16Q50l08m60
$$ -42 -14 665 610 -63 -205 258 464 21 -429 -514 -303 -278 -611 -952 -490 127 241 -222 294 1144 836 376
1690C76j94Q0M70j099j83L4M70j97m89O8M29O02l85j89M89K67l29k80nM68j58
$$ 376 182 262 732 -367 -550 -516 -46 -243 -732 -664 -235 367 -18 -207 282 549 220 -60 -65 403 245
1711B45j59m85J33O82k72o41j39N21K81k82l65L1P28n02oK16O15q6ll53K11m3
$$ 245 86 -399 -266 416 144 -497 -636 -115 166 -116 -481 -450 278 -224 -230 -14 601 515 512 159 370 327
1733C27j42l25k72M4K88n46q8L55Q42k09m31LO27J62l16l75q1O37o28m56p1M31
$$ 327 185 -140 -412 -368 -80 -626 -714 -359 483 274 -157 -154 473 635 319 -56 -137 500 -128 -584 -655 -224
1755b24J44M6n27O19L85j25l45jK84M09m80o32N30L95k51m28j7J95K50m78k02
$$ -224 -80 -34 -561 58 443 318 -27 -28 256 665 185 -447 83 478 227 -201 -218 -23 227 -251 -453
1776d53K64M25m65m79J89M80N20m55o6L79J33l6k62m88P13l27l24m25r4M26%k23
$$ -453 -189 236 -229 -708 -519 -39 481 26 -40 339 472 436 174 -314 399 72 -252 -677 -771 -345 -345 -568
1798e68L54L81L27j83m20L63L31P1n68n0j96J65k81k14K93K04k50k05K79K31L25
$$ -568 -214 167 494 311 -109 254 585 656 88 38 -158 7 -274 -488 -195 9 -241 -446 -167 64 389
1819C89n13p6M6L78R0m22J55M22M1m82k71K67K85k79n25j71N21J9k98P4K36M68
$$ 389 -124 -200 -154 224 314 -108 47 469 510 28 -243 24 309 30 -495 -666 -145 -126 -424 -350 -114 354
1841C54q5jR5K45j14l4m66J31N8k17k81l18L60L7J3l6J83L84j12k90J52L58j06
$$ 354 269 268 363 608 494 460 -6 125 183 -34 -315 -633 -273 -236 -223 -259 -76 308 196 -94 58 416 310
1864C10m12K18J61k79P8l99J88M83q9n55NM5J71O6l47j22O76m1l75J04K75L50
$$ 310 -102 116 277 -2 76 -323 -135 348 259 -296 -291 -246 -75 -9 -356 -478 198 157 -218 -114 161 511
1886E11k54k47P2K24k36m27k3K09O3l6j52L73n9M22m01J05R5R5J4m16M7K9J99
$$ 511 257 10 82 306 70 -357 -380 -171 -108 -144 -296 77 18 440 39 144 239 334 348 -68 -21 8 207
1909B07j99m62K9N11k83j55j2N22N8l19K9j31L58k12J55j98J62K07m63QK70K24
$$ 207 8 -454 -425 86 -197 -352 -364 158 216 -103 -74 -205 153 -59 96 -102 60 267 -196 -188 82 306
1931C06n66k44L08L49m83M9K2K96K49k23k17J13M99r8k33p3j68Q9k2n94J61L52
$$ 306 -260 -504 -196 153 -330 -281 -259 37 286 63 -154 -41 458 360 127 54 -114 -25 -47 -641 -480 -128
1953a28J61k19N3J30J14K7l86O52L65n77l60K38l10K23p5m67J40N01k01J53n82
$$ -128 33 -186 -133 -3 111 138 -248 404 769 192 -168 70 -240 -17 -92 -559 -419 82 -119 34 -548
1974e48M91R4l1k05J77J68j4j76mL50K23m19j39j53L67K7n95J91K46m55J20K28
$$ -548 -57 37 6 -199 -22 146 132 -44 -48 302 525 106 -33 -186 181 208 -387 -196 50 -405 -285 -57
1996e7l05N01P9j14J56J16j42P2m68P2J20j51j65l6k1J66K30l15L32K78l83k01
$$ -57 -362 139 218 104 260 376 234 306 -162 -90 30 -121 -286 -322 -343 -177 53 -262 70 348 -35 -236
2018b36K3J62L83j80m4l01P49m55j66J17J27k77O5l42J32K69j49j24p0N05NJ38
$$ -236 -213 -51 332 152 108 -193 556 101 -65 52 179 -98 -33 -375 -243 26 -123 -247 -317 188 193 331
2040C31k90J45R3j03l78J11k1K4N7l56K28L08j56l48J13M28J61k65K32j84N1p6
$$ 331 41 186 279 176 -202 -91 -112 -88 -31 -387 -159 149 -7 -355 -242 186 347 82 314 130 181 105
2062A05j13l14K52J66l3m01J81K71k06j4J28L9J17P6l89Q2K30J53m81J03L31k05
$$ 105 -8 -322 -70 96 63 -338 -157 114 -92 -106 22 61 178 254 -135 -53 177 330 -151 -48 283 78
2084G8K78o17M64j22l52j15J15K41k12p1L52O6l7J65r7j16Q1L58l57j04q7J0k02
$$ 78 356 -261 203 81 -271 -386 -271 -30 -242 -313 39 105 68 233 136 20 101 459 102 -2 -89 -79 -281
2107b81M3n3J28J99Nq8pM10k79r6L87r1j07p0l49L2K39j29L6J9J70j15O6k57L28
$$ -281 -238 -291 -163 36 41 -47 -54 356 77 -19 368 277 170 100 -249 -217 22 -107 -71 -52 118 3 69 -188 140
2132A40j25O0l1k48J49L98k22n37J75L85p8j85M5K37l1l53J51j81J44p9J52j2
$$ 140 15 75 44 -204 -55 343 121 -416 -241 144 66 -119 -74 163 132 -221 -70 -251 -107 -186 -34 -46
2154d6PL65j30l9J0j20K3k18J20Km0L9n80N91j49R5mr4L88k05m2K8k2J11nl57
$$ -46 -39 326 196 157 167 47 70 -148 -28 -26 -66 -27 -607 -16 -165 -70 -74 -168 220 15 -27 1 -21 90 85 -272
2180b72K64J84N4m50Q3M46k68Pl2k88J10L5K59J7m6Rql21J76K80j82l4rj07L88
$$ -272 -8 176 230 -220 -137 309 41 48 16 -272 -162 -127 132 149 103 112 104 -217 -41 239 57 23 14 -93 295
2205B95l70J59j92J99j81R0q0K83J72o5k75P9l13J53o6J58p3K57k22k54L34n5
$$ 295 -75 84 -108 91 -90 0 -80 203 375 310 35 114 -199 -46 -112 46 -27 230 8 -246 88 33
2227C3j23o1J20j5K9R1j52L21k25K92n98N07k69M3J20k62j28M37m62l71N51p1
$$ 33 -90 -151 -31 -46 -17 74 -78 243 18 310 -288 219 -50 -7 113 -149 -277 160 -302 -673 -122 -193
2249a93J66j0j37K12Q0l01O3J64K19l94J02k07K60k69K90r5R9k2n5k5J16l3j7
$$ -193 -27 -37 -174 38 118 -183 -120 44 263 -131 -29 -236 24 -245 45 -50 49 27 -28 -53 63 30 13
2272A3J56j00k66R8K82k53J16o2K20n2j68L1o0J93l11l6L8L89k02J60j29J27J9
$$ 13 169 69 -197 -99 183 -70 46 -16 204 152 -16 15 -45 148 -163 -199 -161 228 26 186 57 184 203
2295B03J39l07k95J8M35l54K01k26O4K47l64M05r6L3j91J3n2L16j93%K3J62l18
$$ 203 342 35 -260 -242 193 -161 40 -186 -122 125 -239 166 70 103 -88 -75 -127 189 -4 -4 19 181 -137
2318a37K04j57J75KJ85m17KJ45J75l31J96R9O5l80k4M01k05qk5Q1Q6m1j1j66J57
$$ -137 67 -90 85 87 272 -145 -143 2 177 -154 42 141 206 -174 -198 203 -2 -10 -35 46 132 91 80 -86 71
2343G1Q6j15R4j38j9K5l33K89O4J30m4j11N4J98k61j93J92P8M3k08R2k4O4q9K32
$$ 71 157 42 136 -2 -21 4 -329 -40 24 154 110 -1 53 251 -10 -203 -11 67 110 -98 -6 -30 34 -55 177
2368A77m8j46o4L59j66k86K01J55k42R8r5J91n4j56J86o4K11k27Q1j5j11J59j18
$$ 177 129 -17 -81 278 112 -174 27 182 -60 38 -57 134 80 -76 110 46 257 30 111 96 -15 144 26
2391B6l69M40j68L7j21Q8L97k33j29L8M8j54J9m2J31k2nj18l1K48oL2J4q6j02
$$ 26 -343 97 -71 -34 -155 -67 330 97 -32 6 54 -100 -81 -123 8 -14 -19 -137 -168 80 74 106 120 34 -68
2416f8K17l40n3K8m3M20l12J8Q7R3k02L68m20L80j26l34L89k83J83O1n8%J12k06
$$ -68 149 -191 -244 -216 -259 161 -151 -133 -46 47 -155 213 -207 173 47 -287 102 -181 2 63 5 5 117 -89
2440h9J27k5P9j43M9M9j18J74j89J71j00j58J22J91k2nN1lk56PL25j69k24K68
$$ -89 38 13 92 -51 -2 47 -71 103 -86 85 -15 -173 -51 140 118 113 164 161 -95 -88 237 68 -156 112
2464A12j4r1MJ2r9R6q3J15J4kk1l15J65L80m44K32N2o4l8p0M91k41k70J05j24
$$ 112 98 7 11 23 -76 20 -63 52 66 64 43 -272 -107 273 -171 61 113 49 11 -59 432 191 -79 26 -98
2489i8N2K1J30k30J27K08l73K00R4j22k8J89j00J85k35M3j13J97j16k19K92k54
$$ -98 -46 -25 105 -125 2 210 -163 37 131 9 -19 170 70 255 20 63 -50 147 31 -188 104 -150
2511a50J37L96l09o4P6k55K36j51M3o6J77r4J36m2j58J7P2J61m0k31J0J1L41k54
$$ -150 -13 383 74 10 86 -169 67 -84 -41 -107 70 -24 112 70 -88 -71 1 162 122 -109 -99 -88 253 -1
2535aj24j63M18j85J90L8k65K90l06K07k1J72k58K08l51p7K26Rm12L59J19n3k7
$$ -1 -125 -288 130 -55 135 173 -92 198 -108 99 78 250 -8 200 -151 -228 -2 7 -405 -46 73 20 -7
2558gP7l34L32j91O3J7jk2J33j53K43j89j33L9L57j84p2L6oL42j94j4m9j1K71
$$ -7 70 -264 68 -123 -60 -43 -44 -66 67 -86 157 -32 -165 -126 231 47 -25 11 5 347 153 139 90 79 350
2583C50l89n7J65r5K6j22J84k26L04j94m2J36N2j01K2l33K37J47k7j20J91N1j33
$$ 350 -39 -96 69 -26 0 -122 62 -164 140 -54 -96 40 92 -9 13 -320 -83 64 37 -83 108 159 26
2606B6J01j66j30O2J63j42L45l10J27Jj35Q4J83j28j59P5J63m48L43o4L04kk67
$$ 26 127 -39 -169 -107 56 -86 259 -51 76 77 -58 26 209 81 -78 -3 160 -288 55 -9 295 293 26
2629B6k10K53n2j20Q1%k54j7J84J48j65J13Q9n3J8J09o1J17k11K46l02L1J88p6
$$ 26 -184 69 17 -103 -22 -22 -276 -293 -109 39 -126 -13 76 23 41 150 89 206 -5 241 -61 -30 158 82
2653H2l85K92L7J28j70J7j83K37k38L34r0j34J60j96j43L00l7Q5j75j31M84k38
$$ 82 -303 -11 26 154 -16 1 -182 55 -183 151 61 -73 87 -109 -252 48 11 96 -79 -210 274 36
2675C6L2j20pJ80j46K01j72K37k50q4QK73k72j78L25l9KJ21k44J46K92m04j08
$$ 36 68 -52 -59 121 -25 176 4 241 -9 -93 -85 188 -84 -262 63 24 26 147 -97 49 341 -63 -171
2698a71M14l9l31K4K98l57J6mJ11K1j51L2N0K77k34n2P0K82l25K44Jk10j9O3k20
$$ -171 243 204 -127 -103 195 -162 -146 -150 -39 -18 -169 -137 -87 190 -44 -96 -26 256 -69 175 176 -34 -53 10 -210
2723b10L74l40J52j76K45j87L9p2J49N67l10p4l35J66Q6j24P2mo0Q5O0R6q1n3
$$ -210 164 -176 -24 -200 45 -142 -103 -175 -26 541 231 157 -178 -12 74 -50 22 18 -42 43 103 199 118 65
2747F5J99l92q7K91J57k79L5k1J39j86J47j55J57k34L38k88J03j49J39K24k33
$$ 65 264 -128 -215 76 233 -46 -11 -32 107 -79 68 -87 70 -164 174 -114 -11 -160 -21 203 -30
2768c0j2q6j19M91m5k64L1J56L33m11k38M1K76j06M6J56n3M4l0l58J52l0k4j1
$$ -30 -42 -128 -247 244 199 -65 -34 122 455 44 -194 -153 123 17 63 219 166 210 180 -178 -26 -56 -80 -91
2792i1J50J27l15Q4j08J68n3L67j07n3j11k63J35J9o6j86K86Q8O4j28M7r9J37
$$ -91 59 186 -129 -45 -153 15 -38 329 222 169 58 -205 -70 -51 -117 -303 -17 71 135 7 54 -45 92
2815I2j22m3l9K74l84L33l00K89m76K15P4K77l15J66J73n6j83P4j77n6L22k77
$$ 92 -30 -73 -112 162 -222 111 -189 100 -376 -161 -87 190 -125 41 214 158 -25 49 -128 -184 138 -139
2837a39J08J37q3l34K56M8K4Ll8N6J43k51n2N7P0j51J80R8k18j13K36J95n21N7
$$ -139 -31 106 23 -311 -55 -7 17 20 -18 38 181 -70 -122 -65 5 -146 34 132 -86 -199 37 232 -289 -232
2861b32j6M94j05L6L6o3Q9k93K59k37m7K57j04k69m2K32Q5k29K13N2k6l6j91P
$$ -232 -248 246 141 177 213 150 239 -54 205 -32 -79 178 74 -195 -237 -5 80 -149 64 116 90 54 -137 -130
2885a30J96j56Q9L5N9j38l9p0K61m4%ok0k12K3R7J87l14K34k32J26n6O1Q9K8k41
$$ -130 66 -90 -1 34 93 -45 -84 -154 107 63 63 57 37 -175 -152 -55 132 -182 52 -180 -54 -110 -49 40 68 -173
2911a73J94PJ58j69j9j34K87k32L2J05q3j14K05K2m4P8r4J12J1L6j61J9J64o8
$$ -173 21 28 186 17 -2 -136 151 -81 -49 56 -27 -141 64 86 42 120 26 138 149 185 24 43 207 139
2935A39n2j20l0L06m41J54j42P6j0J4P1J49k53p0K29K16Op2j27j8j50L37j08j42
$$ 139 87 -33 -63 243 -198 -44 -186 -110 -120 -106 -35 114 -139 -209 20 236 242 170 43 25 -125 212 104 -38
2959c8k2K0r3J22k56M70l18N5j69K84m06J44L04Q8p4j18J45k54J39k0L1rk63K23
$$ -38 -60 -40 -133 -11 -267 203 -115 -60 -229 55 -351 -207 97 185 111 -7 138 -116 23 3 34 25 -238 -15
2983a5O7J58l37k52P27k51j33J68J2k28q4K63k36j34K59j33K3K03k69R1M6j5k88
$$ -15 52 210 -127 -379 348 97 -36 132 144 -84 -168 95 -141 -275 -16 -149 -126 77 -192 -101 -55 -70 -358
3006c58L45J9K6l1N3Pj46J60l10L61k13L43k74J9J9K65m18L35j16k49jL2J39l8
$$ -358 -13 6 32 1 54 61 -85 75 -235 126 -87 256 -18 1 20 285 -133 202 86 -163 -164 -132 7 -31
3030c1J03j20J3L4RM6l9j27J7J02k25L03j28J49J39P9j42q3l67L75K0k00J59j37
$$ -31 72 -48 -35 -1 8 54 15 -112 -95 7 -218 85 -43 106 245 324 182 99 -268 107 127 -73 86 -51
3054e1J45K2R9j29K8J19l77L10j72r6N7K36k81M1k30j95O40k25K01M0l26o1J41
$$ -51 94 116 215 86 114 233 -144 166 -6 -102 -45 191 -90 -49 -279 -474 166 -59 142 182 -144 -205 -64
3077f4K25j85l65k1L17K25q7l4k74J98p7R0P1o4p1K43m7J1O6l17N0K39j81j4J80
$$ -64 161 -24 -389 -410 -93 132 45 11 -263 -65 -142 -52 19 -45 -116 127 80 91 157 -160 -110 129 -52 -66 114
3102A14l32K18l0j6P6K49j45j49l2p9K14O6k24k00K70M6J3l06L31K4kl39M0M09
$$ 114 -218 0 -30 -46 30 279 134 -15 -47 -126 88 154 -70 -270 0 46 59 -247 84 108 106 -233 -193 216
3126B16k09o8p7M31j33o7J3j45k27K79n2k44K61r6j79L57k27J18N2l96M27p4K80
$$ 216 7 -61 -138 293 160 93 106 -39 -266 13 -39 -283 -22 -118 -297 60 -167 -49 3 -393 34 -40 240
3149B40m71J92L4m2J14o7p6K65j14N6k71J8J75j32J6J56j38lJ93j7j59J32j31
$$ 240 -231 -39 -5 -47 67 0 -76 189 75 131 -140 -122 53 -79 -63 93 -45 -48 145 128 -31 101 -30
3172c0O6k11J75J07j20J41p1J5r2K39k2L18m56J85j18l56R3J26O5J93j68J67j09
$$ -30 36 -175 0 107 -13 128 57 72 -20 219 197 515 59 244 126 -230 -137 -11 54 247 79 246 137
3195A37k6n9R1k2nk35LL2J98J80l27K25k72OK12j43j52J65J61l29K48l6n8r6J25
$$ 137 111 52 143 121 116 -119 -116 -84 114 294 -33 192 -80 -74 138 -5 -157 8 169 -160 88 52 -6 -102 23
3220B3j6Q4j12J47l00J91j04kQ8l61N06k34j68L99k65J63n0O5k20J98q0K07j5
$$ 23 7 91 -21 126 -174 17 -87 -89 -1 -362 144 -90 -258 141 -124 39 -11 54 -166 32 -48 159 144
3243A44l81M69n6k46j92K67J92k01J99m02J30K36p4j57K06k15j33K70j84K09j16
$$ 144 -237 232 176 -70 -262 5 197 -4 195 -207 -77 159 85 -72 134 -81 -214 56 -128 81 -35
3264c5NJ7j99J58R7j74J76r7l6%O6O9K85n05N29m85L24j98j06N5K31k35L64j39
$$ -35 -30 -13 -212 -54 43 -131 45 -52 -88 -88 -22 47 332 -173 356 -129 195 -3 -109 -54 177 -58 306 167
3288A67k21j7L4N1O1n0m8J21l00L32o4k3j58N7N1j77o9M81j91r3m3J61P6j36j76
$$ 167 -54 -71 -37 14 75 25 -23 98 -202 130 66 43 -115 -58 -7 -184 -253 228 37 -56 -99 62 138 2 -174
3313a74R1M4L7N1k00j34L23J02M2j85J17o1l43L49j19J23r4r5O1M7NL9P4k49L78
$$ -174 -83 -39 -2 49 -151 -285 38 140 182 -3 114 53 -290 59 -60 63 -31 -126 -65 -18 -13 26 100 -149 229
3338B29L6j73j31Q8k6k01L29j91L26m02l5K15j9J23k81j43J59j44L95m08J56J22
$$ 229 265 92 -39 49 23 -178 151 -40 286 -116 -151 64 45 168 -113 -256 -97 -241 154 -254 -98 24
3360B4K49m4k01K3qJ61k12Q6k59J78P7k0K76n89K79j54J68j77K24j12K09K9k37
$$ 24 273 229 28 51 43 204 -8 78 -181 -3 74 54 330 -259 20 -134 34 -143 81 -31 178 207 -30
3383c0P2o6o5J50m5j15j3j20M31q8k2J0k55K52j29K4K92l35K68k15J23jN2k60
$$ -30 42 -24 -89 61 16 -99 -112 -232 199 111 89 99 -156 96 -33 -9 283 -52 216 1 124 123 175 -85
3407h5K33m96N63j56Q0j48j68K01N2j05l0L1J22k11L07o0m5K11j5l32J84K8j19
$$ -85 148 -348 215 59 139 -9 -177 24 76 -29 -59 -28 94 -117 190 130 85 296 281 -51 133 161 42
$$ [...]
8191A82
##END NTUPLES=NMR FID
##END=
