##TITLE=1H_DE-104_oil2_TFA
 200.13MHz,CDCl34,
 8 sc
 
 28.7.2025
##JCAMPDX= 6.0         $$ Bruker NMR JCAMP-DX V2.0
##DATA TYPE= NMR FID
##DATA CLASS= NTUPLES
##ORIGIN= UXNMR, Bruker Analytische Messtechnik GmbH
##OWNER= pz
$$ XWIN-NMR		Version 3.5
$$ Mon Jul 28 14:46:18 2025 Russian Standard Time (UT+4h)  she@DPX200
##.OBSERVE FREQUENCY= 200.1313
##.OBSERVE NUCLEUS= ^1H
##.DELAY= (6, 6)
##.ACQUISITION MODE= SIMULTANEOUS
##.ACQUISITION SCHEME= undefined
##.AVERAGES= 8
##.DIGITISER RES= 18
##SPECTROMETER/DATA SYSTEM= spect
##.PULSE SEQUENCE= zg30
##.SOLVENT NAME= CDCl3
##.SHIFT REFERENCE= (INTERNAL, CDCl3, 0, 14.3821)
##AUDIT TRAIL= $$ (NUMBER, WHEN, WHO, WHERE, WHAT)
$$ ##TITLE= Audit trail, XWIN-NMR		Version 3.5
$$ ##JCAMPDX= 5.01
$$ ##ORIGIN= Bruker BioSpin GmbH
$$ ##OWNER= she
$$ F:/spectra/data/she/nmr/H-C/1/audita.txt
$$ ##AUDIT TRAIL=  $$ (NUMBER, WHEN, WHO, WHERE, WHAT)
(   1,<2025-07-28 14:44:43.28 +0400>,<she>,<DPX200>,
      <created by zg, POWCHK disabled, PULCHK disabled
       configuration hash MD5:
       00 E9 B6 7A A2 85 ED C7 34 08 36 98 17 FE 4E 26
       data hash MD5: 16K
       5F 40 8D 59 8B 33 14 6C 10 B0 C8 8A B3 DD 67 84>)
$$ ##END=
$$ 
$$ hash MD5
$$ 84 4A E1 2A 14 A8 26 F7 73 4B 8F 22 F5 88 91 D1
##$RELAX= 
##$RELAX= 
##$RELAX= 
##$RELAX= 
##$RELAX= 
##$RELAX= 
$$ Bruker specific parameters
$$ --------------------------
##$DU= <F:/spectra>
##$EXPNO= 1
##$NAME= <H-C>
##$PROCNO= 1
##$TYPE= <nmr>
##$USER= <she>
##$AMP= (0..31)
100 100 100 100 100 100 100 100 100 100 100 100 100 100 100 100 100 100 
100 100 100 100 100 100 100 100 100 100 100 100 100 100 
##$AQSEQ= 0
##$AQ_mod= 1
##$AUNM= <au_zg>
##$AUTOPOS= <>
##$BF1= 200.13
##$BF2= 200.13
##$BF3= 200.13
##$BF4= 200.13
##$BF5= 200.13
##$BF6= 200.13
##$BF7= 200.13
##$BF8= 200.13
##$BYTORDA= 1
##$CFDGTYP= 0
##$CFRGTYP= 5
##$CHEMSTR= <none>
##$CNST= (0..31)
1 1 145 1 1 1 1 1 1 1 1 1 1 1 1 1 1 1 1 1 1 1 1 1 1 1 1 1 1 1 1 1 
##$CPDPRG= <>
##$CPDPRG1= <>
##$CPDPRG2= <>
##$CPDPRG3= <>
##$CPDPRG4= <mlev>
##$CPDPRG5= <mlev>
##$CPDPRG6= <mlev>
##$CPDPRG7= <mlev>
##$CPDPRG8= <mlev>
##$CPDPRGB= <>
##$CPDPRGT= <>
##$D= (0..31)
0 0.7 0 0 0 0 0 0 0 0 0 0.03 0 0 0 0 0 0 0 0 0 0 0 0 0 0 0 0 0 0 0 0 
##$DATE= 1753699482
##$DBL= (0..7)
120 120 120 120 120 120 120 120 
##$DBP= (0..7)
150 150 150 150 150 150 150 150 
##$DBP07= 0
##$DBPNAM0= <>
##$DBPNAM1= <>
##$DBPNAM2= <>
##$DBPNAM3= <>
##$DBPNAM4= <>
##$DBPNAM5= <>
##$DBPNAM6= <>
##$DBPNAM7= <>
##$DBPOAL= (0..7)
0.5 0.5 0.5 0.5 0.5 0.5 0.5 0.5 
##$DBPOFFS= (0..7)
0 0 0 0 0 0 0 0 
##$DE= 6
##$DECBNUC= <off>
##$DECIM= 32
##$DECNUC= <off>
##$DECSTAT= 4
##$DIGMOD= 1
##$DIGTYP= 9
##$DL= (0..7)
0 120 120 120 120 120 120 120 
##$DP= (0..7)
150 150 150 150 150 150 150 150 
##$DP07= 0
##$DPNAME0= <>
##$DPNAME1= <>
##$DPNAME2= <>
##$DPNAME3= <>
##$DPNAME4= <>
##$DPNAME5= <>
##$DPNAME6= <>
##$DPNAME7= <>
##$DPOAL= (0..7)
0.5 0.5 0.5 0.5 0.5 0.5 0.5 0.5 
##$DPOFFS= (0..7)
0 0 0 0 0 0 0 0 
##$DQDMODE= 0
##$DR= 18
##$DS= 0
##$DSLIST= <SSSSSSSSSSSSSSS>
$$ [...]
##$SUBNAM0= <"">
##$SUBNAM1= <"">
##$SUBNAM2= <"">
##$SUBNAM3= <"">
##$SUBNAM4= <"">
##$SUBNAM5= <"">
##$SUBNAM6= <"">
##$SUBNAM7= <"">
##$SUBNAM8= <"">
##$SUBNAM9= <"">
##$SW= 18.0517328524113
##$SWIBOX= (0..15)
0 0 2 0 0 0 0 0 0 0 0 0 0 0 0 0 
##$SW_h= 3612.71676300578
##$TD= 16384
##$TD0= 1
##$TE= 0
##$TE2= 300
##$TE3= 300
##$TEG= 300
##$TL= (0..7)
0 120 120 120 120 120 120 120 
##$TP= (0..7)
150 150 150 150 150 150 150 150 
##$TP07= 0
##$TPNAME0= <>
##$TPNAME1= <>
##$TPNAME2= <>
##$TPNAME3= <>
##$TPNAME4= <>
##$TPNAME5= <>
##$TPNAME6= <>
##$TPNAME7= <>
##$TPOAL= (0..7)
0.5 0.5 0.5 0.5 0.5 0.5 0.5 0.5 
##$TPOFFS= (0..7)
0 0 0 0 0 0 0 0 
##$TUNHIN= 0
##$TUNHOUT= 0
##$TUNXOUT= 0
##$USERA1= <user>
##$USERA2= <user>
##$USERA3= <user>
##$USERA4= <user>
##$USERA5= <user>
##$V9= 5
##$VALIST= <valist>
##$VCLIST= <CCCCCCCCCCCCCCC>
##$VD= 0
##$VDLIST= <DDDDDDDDDDDDDDD>
##$VPLIST= <PPPPPPPPPPPPPPP>
##$VTLIST= <TTTTTTTTTTTTTTT>
##$WBST= 1024
##$WBSW= 4
##$XGAIN= (0..3)
0 0 0 0 
##$XL= 0
##$YL= 0
##$YMAX_a= 269228
##$YMIN_a= -203076
##$ZGOPTNS= <>
##$ZL1= 120
##$ZL2= 120
##$ZL3= 120
##$ZL4= 120
##$ABSF1= 10
##$ABSF2= 0
##$ABSG= 5
##$ABSL= 3
##$ALPHA= 0
##$AQORDER= 0
##$ASSFAC= 0
##$ASSFACI= 0
##$ASSFACX= 0
##$ASSWID= 0
##$AUNMP= <proc_1d>
##$AZFE= 0.1
##$AZFW= 0.1
##$BCFW= 1
##$BC_mod= 2
##$BYTORDP= 1
##$COROFFS= 0
##$CY= -3
##$DATMOD= 1
##$DC= 2
##$DFILT= <>
##$DTYPP= 0
##$F1P= 0
##$F2P= 0
##$FCOR= 0.5
##$FTSIZE= 0
##$FT_mod= 4
##$GAMMA= 1
##$GB= 0.15
##$INTBC= 1
##$INTSCL= 1
##$ISEN= 128
##$LB= 0.25
##$LEV0= 0
##$LPBIN= 0
##$MAXI= 10000
##$MC2= 0
##$MEAN= 0
##$ME_mod= 0
##$MI= 1.114404
##$NCOEF= 0
##$NC_proc= 0
##$NLEV= 6
##$NOISF1= 3.799351
##$NOISF2= 2.8
##$NSP= 1
##$NTH_PI= 0
##$NZP= 0
##$OFFSET= 14.38212
##$PC= 1
##$PHC0= -1198.933
##$PHC1= 14.19254
##$PH_mod= 1
##$PKNL= yes
##$PPARMOD= 0
##$PSCAL= 0
##$PSIGN= 0
##$REVERSE= no
##$SF= 200.129724274929
##$SI= 16384
##$SIGF1= 3
##$SIGF2= 2
##$SINO= 400
##$SIOLD= 16384
##$SREGLST= <1H.CDCl3>
##$SSB= 0
##$STSI= 0
##$STSR= 0
##$SW_p= 3205.1282051282
##$SYMM= 0
##$S_DEV= 0
##$TDeff= 0
##$TDoff= 0
##$TI= <>
##$TILT= no
##$TM1= 0
##$TM2= 0
##$TOPLEV= 0
##$USERP1= <user>
##$USERP2= <user>
##$USERP3= <user>
##$USERP4= <user>
##$USERP5= <user>
##$WDW= 1
##$XDIM= 8192
##$YMAX_p= 0
##$YMIN_p= 0
$$ End of Bruker specific parameters
$$ ---------------------------------
##NTUPLES= NMR FID
##VAR_NAME=  TIME,          FID/REAL,        FID/IMAG
##SYMBOL=    X,             R,               I
##VAR_TYPE=  INDEPENDENT,   DEPENDENT,       DEPENDENT
##VAR_FORM=  AFFN,          ASDF,            ASDF
##VAR_DIM=   8192,          8192,            8192
##UNITS=     SECONDS,       ARBITRARY UNITS, ARBITRARY UNITS
##FACTOR=    0.0002768,     1,               1
##FIRST=     0,             0,               0
##LAST=      2.2672688,     0,               0
##MIN=       0,             -203076,         0
##MAX=       2.2672688,     269228,          0
$$ Real data points
##PAGE= N=1
##DATA TABLE= (X++(R..R)), XYDATA
0@%%%%%%%%%%%%%mJ2j6J6j6K0k8L2l8M6n2O0p2Q5r7J12j28J44j64J88k12K37k67
$$ 0 0 0 0 0 0 0 0 0 0 0 0 0 0 -4 8 -8 8 -8 12 -16 16 -22 24 -28 32 -40 45 -52 60 -68 76 -88 100 -112 125 -142
36a42L01l37L78m21M66n19N76o36P04p77Q56r44J040j146J261j389J534j694J872
$$ -142 159 -178 200 -221 245 -274 302 -334 370 -407 449 -495 545 -601 660 -729 805 -889 983
55I83k074K305k571K880l246L688m233M926n837P093q935J1891j7384L0764j20291
$$ 983 -1091 1214 -1357 1523 -1723 1965 -2268 2658 -3179 3914 -5021 6870 -10514 20250 -100041
70a00041j03035L73860o6999k96799K07616K54626k29920j23090J44606j9103
$$ -100041 -203076 170784 103785 -193014 14602 269228 39308 -83782 60824 41721
80D1721n6608J06370q0305j82657J03370J39822j30395q0834J10774O2119j7941
$$ 41721 -14887 91483 11178 -171479 -68109 71713 -58682 -139516 -28742 33377 15436
91A5436L768r114L764N4612L3276m8193p5768p241O7855O142r2948l0158O8018
$$ 15436 19204 10090 13854 68466 101742 53549 -22219 -29460 38395 44537 -48411 -78569 -10551
104a0551M642m6297K1566J4995j7382O8627L8875j11534k4857J29604N629q8157
$$ -10551 -5909 -52206 -30640 -15645 -33027 35600 74475 -37059 -61916 67688 73317 -14840
116a4840L4894L3114o9973L881N7669n4768m7241P2721R695q9086m83N9062o815
$$ -14840 20054 53168 -16805 -12924 44745 -10023 -57264 15457 25152 -63934 -64417 -5355 -12170
129a2170l045L2470j0686j6088L6789K4071k7176j3695K1463k856l4871j1119
$$ -12170 -15215 17255 6569 -9519 27270 51341 24165 10470 31933 29077 -5794 -16913
141a6913R557j3941j1967J7940j12k8112J4173M8770k203k6756K5366J7878k7137
$$ -16913 -7356 -21297 -33264 -15324 -15436 -43548 -29375 19395 17192 -9564 15802 33680 6543
154F543Q886K2871l2733j2080L3916k3353n2214K3702L7427k5500j4473K3545
$$ 6543 15429 38300 5567 -6513 27403 4050 -48164 -24462 12965 -12535 -27008 -3463
166c463r477j5435L2834J2965k4134J6594K7771k2214j8920J5093N404p374J12
$$ -3463 -12940 -28375 4459 17424 -6710 9884 37655 15441 -3479 11614 17018 9644 9756
179I756r059k2269j139J6533o345j6818J3171K0879p389j0156J4336J8058j459
$$ 9756 697 -21572 -22711 -6178 -12523 -29341 -16170 4709 -2680 -12836 1500 19558 18099
192A8099m084N078n922j0178J1414K34k6339K50J4724j9756j6653K3283R712j8252
$$ 18099 14015 19093 13171 2993 14407 14641 -11698 -11448 3276 -16480 -33133 -9850 -138 -18390
206a8390N259K0714r349o758K5624O028j6381J0119Q682k4270o196J8219p677
$$ -18390 -13131 7583 -1766 -8524 17100 23128 6747 16866 25548 1278 -4918 13301 5624
219E624j9475N192L346j7233j787J6832j956m085K0773N477j7541R182K2821q953
$$ 5624 -13851 -8659 -5313 -22546 -24333 -7501 -9457 -13542 7231 12708 -4833 4349 27170 18217
233A8217j5527R471M534j7663o386Q425r036q807J2573q16j7249J0768K0019r599
$$ 18217 2690 12161 16695 -968 -7354 1071 -7965 -16772 -4199 -5015 -22264 -11496 8523 -1076
247a076r803J5316P532j0998K443J1945n792o042Q480n876j5619P668J0080j3297
$$ -1076 -10879 4437 11969 971 3414 15359 9567 3525 12005 6129 -9490 -1822 8258 -5039
261e039q574Q055j39r955L669J0663j626J734J2022k961q588J1967Q378j4154
$$ -5039 -13613 -5558 -5697 -15652 -11983 -1320 -2946 -1212 10810 7849 -739 11228 19606 5452
275E452m965J0129n687j7228J318Q294q279l297J2014l12p204J1931Q942j0407
$$ 5452 487 10616 4929 -12299 -10981 -2687 -10966 -14263 -2249 -2561 -9765 2166 11108 701
289G01K58J2196l928j1865M520N532r708l804P753m561o430J0015L125j0758K156
$$ 701 959 13155 9227 -2638 1882 7414 -2294 -6098 1655 -2906 -9336 679 3804 -6954 -4798
304d798R705m231p081N955N898n014q79N771m122k440R090j614j0447M364O377
$$ -4798 4907 676 -6405 -450 5448 434 -445 5326 1204 -1236 7854 6240 -4207 157 6534
319F534r746r059Q090M400p633Q73Q957k378j937R569O22p285N160N754j0193
$$ 6534 -3212 -12271 -4181 219 -7414 -6541 2416 38 -1899 7670 8292 1007 6167 11921 1728
334A728o952N395j47q649O58N735k862r73P621j025l502Q342M555q081k465P216
$$ 1728 -5224 171 24 -8625 -7967 -2232 -5094 -6067 1554 529 -2973 5369 9924 1843 -622 6594
350F594p69p870M13M207m758k471M996k952l130O949J741q556Q38Q120j829o629
$$ 6594 5825 -2045 -1632 2575 -2183 -4654 342 -2610 -5740 1209 2950 -5606 -4768 3352 1523 -5106
366e106N422O063n356j551O162k765l464O288n07r532j02N774m321o261N296N079
$$ -5106 316 6379 1023 -528 5634 2869 -595 5693 5186 -4346 -4448 1326 -2995 -9256 -3960 1119
382A119n268K93N498m66M9O172j632n815L233L132o765m133N377J343p530k32
$$ 1119 -4149 -3856 1642 1176 1225 7397 5765 -50 3183 6315 -450 -4583 794 2137 -5393 -5625
398e625M661k265j20N356j478l289M531K881n434o60P052l47p626J227M398l736
$$ -5625 -964 -3229 -3349 2007 529 -2760 1771 4652 -782 -1442 5610 5263 -2363 -1136 3262 -474
414d74j408M847k273n123L167K187m765m88O771k79n839K177M453k022p1L519
$$ -474 -1882 2965 692 -4431 -1264 923 -3842 -4330 2441 2162 -3677 -1500 2953 931 860 4379
430D379k130l211K639p3m770J121N065k564n340K725L819l103M06M310k686k617
$$ 4379 2249 -962 1677 1604 -3166 -2045 3020 456 -4884 -2159 1660 -1443 -1037 3273 587 -2030
446b030L726J46m010K443M691m038n453L896K640m436R64M099k881k503L504m89
$$ -2030 1696 1842 -2168 275 4966 928 -4525 -629 2011 -2425 -1461 2638 -243 -2746 758 269
462B69k865L543M321m836l670M008J276l850J135K870k968j776K291j427j332
$$ 269 -2596 947 5268 432 -3238 770 2046 -1804 -669 2201 -767 -2543 -252 -1679 -3011
477c011M571J644m011j137M517L44l374J428K370l843j277J599j157r98L270N13
$$ -3011 1560 3204 -807 -1944 2573 2917 -457 971 3341 -502 -1779 -180 -1337 -2335 935 1448
493A448m463n69M691L93l437K464L147l941j467K491l14m69K820R8m526P3L406
$$ 1448 -3015 -3584 1107 1500 -1937 527 3674 -267 -1734 757 443 -26 2794 2892 -1634 -1561 1845
510A845j815l311L582J510m065q91J910n65J270K738o20k143J494K318k273j131
$$ 1845 30 -3281 301 1811 -2254 -3145 -1235 -1800 -530 2208 1588 -555 939 3257 984 -147
526a47L128j91m805o00K118j619L74K117j441j948K267K573j330j035M168n70
$$ -147 2981 2790 -2015 -2615 -497 -2116 -1742 375 -1066 -3014 -747 1826 496 -539 3629 3059
542C059m378M87K315j342m64J920k063j817J946J490k501N40L538j587l684Q84
$$ 3059 -1319 -832 1483 141 -323 1597 -466 -2283 -337 1153 -1348 -808 2730 1143 -2541 -1657
558a657K213j225N11J690j234j055J284L14j265J209K528k440l045J303J058j671
$$ -1657 556 -669 -158 1532 298 -757 527 841 -424 785 3313 873 -2172 -869 189 -1482
574a482L41J541j169j034K224P86j613J473K385k914k978K611J467l074K93J692
$$ -1482 -1141 400 -769 -1803 421 1207 -406 1067 3452 538 -2440 171 1638 -1436 -1143 549
590E49j598j482K927Q82j482J881J493l362k037L536M5k810J682Q85k952q8J924
$$ 549 -1049 -2531 396 1278 -204 1677 3170 -192 -2229 1307 1352 -1458 224 1109 -1843 -1931 -7
607gr46m73L203M12l416j32K896p42j709J868O32k213M56O51j368P24J538j12
$$ -7 -953 -1426 1777 2189 -1227 -1359 1537 795 -914 954 1586 -627 -171 480 -888 -164 1374 1262
625A262k480q62K842l34k446J433J030j192k84J352J44K99J244k26k123J37K244
$$ 1262 -1218 -2080 762 428 -2018 -585 445 -747 -1031 321 465 764 2008 1782 -341 -204 2040
642B040j582j586J638M0l064R3J878n59N53J549m65j870J430J792j310l15K306
$$ 2040 458 -1128 510 550 -2514 -2421 -543 -1102 -549 1000 535 -1335 95 1887 577 262 2568
659B568q16k429K22M42m92J02J048j205j179R74J225j320q38K808l9j714lJ532
$$ 2568 1752 -677 -455 -13 -505 -403 645 -560 -1739 -765 460 -860 -1698 1110 1071 -643 -646 886
677H86N3n71O13k25j371J124P90k087k67J892p61k921J554J837j120k83J579r00
$$ 886 939 368 981 756 -615 509 1299 -788 -1055 837 76 -2845 -1291 546 -574 -857 722 -178
695a78p45J640O37j236L46J905j959j933J547O19j277K55O23j147l74R61J9n42
$$ -178 -923 717 1354 118 464 2369 410 -1523 24 643 -634 -379 244 -903 -1277 -316 -297 -839
713h39J169J503j498j104J185K78r83R9O29o17k12K58r4n49N52J399j362p77J482
$$ -839 330 1833 335 -769 416 694 -289 -190 439 -178 -390 -132 -226 -775 -223 1176 -186 -963 519
732E19O02j370L76N20r52l58J021Q0j123J353L85k178j27K346o97j100J206qp92
$$ 519 1121 -249 127 647 -305 -663 358 438 -685 668 1053 -1125 -1252 1094 397 -703 503 495 -297
751b97j02P28l94N3J266k02j654J4J441q99p70J026N2r29k67K36M46J00M88M69
$$ -297 -399 329 -65 -12 1254 1052 -602 -588 853 -46 -816 210 262 -667 -934 -698 -252 -152 336 805
771H05q14K44J065p69n72N07K48q14k31J95o62n5P11m75q72J321J326j359l01
$$ 805 -9 235 1300 531 -41 466 714 -100 -331 -136 -798 -853 -142 -617 -1489 -168 1158 -201 -502
790e02J614l04q25K33P65j108L06M38p98o03J074r5r95J57J078j63j265M14M21
$$ -502 1112 808 -17 216 981 -127 179 617 -181 -784 290 195 -800 -643 435 272 -993 -579 -158
809a58k42K91O13K0m29N77K21q70J38J038o74r02j62j09j13j71P08k29j98J008
$$ -158 -400 -109 504 524 95 672 893 23 161 1199 525 -377 -539 -648 -761 -932 -224 -453 -651 357
829C57J45p53N94J069q40n56M79M7m89k53K68k32p36Q77k72o94J037Q96j368k92
$$ 357 502 -251 343 1412 572 16 495 542 53 -200 68 -164 -900 -23 -295 -989 48 944 -424 -716
849g16J068P7o50K17N87l35k96J46l58k01J068J88p01o32O58j13n44N09M31m71
$$ -716 352 429 -221 -4 583 248 -48 98 -260 -461 607 795 94 -538 120 7 -537 -28 403 -68
869f8m51L16k02j11J141L82j105O1Q09m35p57K99N93p06j68L18m21M13O23j86
$$ -68 -519 -203 -405 -516 625 1007 -98 -37 772 337 -420 -121 472 -234 -402 -84 -505 -92 531 345
889C45r80L16Q00m43k28M34J94p26l60K61J00J82N24j53p60M72K84l56rO45L34
$$ 345 -635 -319 481 38 -190 244 438 -288 -648 -387 -287 -105 419 266 -494 -22 262 -94 -103 542 876
910H76p49m89L79l68M6Q48p26n12O31L78q07NJ017K6n78l12K58J97k29P06k16
$$ 876 127 -362 17 -351 -305 543 -183 -695 -64 314 -493 -488 529 555 -23 -335 -77 120 -109 597 381
931C81p73P29k64m92LP17M9p99k51N51k8o6N44j59p36J201k57r38O52J025n73
$$ 381 -392 337 73 -419 -416 301 350 -449 -700 -149 -177 -243 301 142 -594 607 350 -588 64 1089 516
952E16j023M26mQ3qJ97n60j40K19K76p96Q52O75k95q06L33M90j66j62O11n74l15
$$ 516 -507 -81 -85 -2 -10 187 -373 -513 -294 -18 -814 38 713 418 -388 -55 435 269 107 718 144 -171
974a71K54l07k69N02M54l21q17L91Q06r16L12N85l07l68K06j62j95Q30K45q55
$$ -171 83 -224 -493 9 463 142 -675 -284 522 -394 -82 503 196 -172 34 -128 -323 507 752 -103
994a03k38N38o2p0j44O69k90m08j72j49k2Q40k10o30O4L76O8j37M09J55j5p24
$$ -103 -341 197 135 65 -79 590 300 -108 -280 -429 -451 389 179 -451 -387 -11 57 -80 329 484 469 -255
1016b55M15k63n2O30j37m97k10M65rj97K59J47m66n1P9j92PO43k19n87L01O12
$$ -255 160 -103 -155 475 338 -159 -369 96 87 -110 149 296 -170 -221 -142 -334 -327 316 97 -490 -189 423
1038D23k19k87P73m71l37K4j11J53Q4J31o1n03P8L35M0j78O81k92j50j74J15K3
$$ 423 204 -83 690 219 -118 -94 -205 -52 32 163 102 -401 -323 12 52 -126 555 263 113 -61 54 77
1060G7j80L41j90l25J01M84j76l32O83K3q34P9K30m9m03M18N0k59N29l4q9J31
$$ 77 -103 238 48 -277 -176 308 132 -200 483 506 -328 -249 -19 -68 -471 -53 -3 -262 267 233 144 275
1082B75N21m57o40m4L81j64L04N8n03m4L87m95O1N00J40j8n87K17J15L09j95P2
$$ 275 796 339 -301 -345 36 -128 176 234 -269 -313 74 -421 -360 140 280 262 -325 -108 7 316 121 193
1104A93R1j10k11j2kJ48L02m56k78K01L05l86K9K47J28l92L5Q2l15O02L28q53
$$ 193 284 174 -37 -49 -51 97 399 -57 -335 -134 171 -215 -186 61 189 -203 -168 -86 -401 201 529 -324
1126c24jN57k44l05N74J27n79J50K86n11K61J80Q5n10K03K41o8m7m8Q4l61L80
$$ -324 -325 232 -12 -317 257 384 -195 -45 241 -270 -9 171 256 -254 -51 190 122 75 27 111 -250 130
1148A30j82m9N5K78m20j59K02M78k37r3P6J29j55k92K42j74K6N75m55l87J37K42
$$ 130 -52 -101 -46 232 -188 -347 -145 333 96 3 79 208 53 -239 3 -171 -145 430 -25 -412 -275 -33
1170c3J65k67N39o6l69J01r7K17n7m5k42l08N80m45L83j98J66R1j97j80J20M9
$$ -33 132 -135 404 338 -31 70 -27 190 133 88 -154 -462 118 -327 56 -142 24 115 -82 -262 -142 -93
1192i3L77j87j32P2L1J34k89K80K84j73k77p2R5j19Nj56j50J80R7O7j76O7O05
$$ -93 284 97 -35 37 68 202 -87 193 477 304 27 -45 50 -69 -64 -220 -370 -190 -93 -26 -202 -135 470
1215D70k29k13R3Q4r1O3K12l97j90n2J3j27J94K42k31L1J74R7k6J88K7m39R6J78
$$ 470 241 28 121 205 114 177 389 -8 -198 -250 -237 -364 -170 72 -159 -128 46 143 117 305 332 -107 -11 167
1239A67k22J03n6M9j15k07J84k52k2M07J29k40j53L39k55K51P2L18k01n25M10
$$ 167 -55 48 -8 41 -74 -281 -97 -349 -371 36 165 -75 -228 111 -144 107 179 497 296 -229 181
1260A81N9l68K01K41m30K74m76O1L51j45J9J16L3k35K05k07M74k40j69Q3j01M8
$$ 181 240 -128 73 314 -116 158 -318 -257 94 -51 -32 84 117 -118 87 -120 354 114 -55 28 -73 -25
1282b5p6K50l65j0L8K60j59K98j0J7L2l83K80j60j05J59K9q3r7o9L26l98L63j00
$$ -25 -101 149 -216 -226 -188 72 -87 211 201 218 250 -133 147 -13 -118 41 70 -13 -110 -179 147 -251 112 12
1306A2O3j30N2Q6j53J57k33L79j45K79n49J16L01r8p4R6k87L6J88p1n4k15J80
$$ 12 75 -55 -3 83 -70 87 -146 233 88 367 -182 -66 235 137 63 159 -128 -92 96 25 -29 -244 -64
1329f4K1m8p5K46K27k97N1o4K53k61j74J92k80M25j46l96O05j51J75k37l3J23
$$ -64 -43 -91 -166 80 307 10 61 -3 250 -11 -185 7 -273 152 6 -390 215 64 239 2 -31 92
1351I2J57k95J90l11L79j58l77J21J73L54m85j13L20j95M2p1K61jk04M01j29k44
$$ 92 249 -46 144 -167 212 54 -323 -202 -29 325 -160 -273 47 -148 -106 -177 84 83 -121 280 151 -93
1373i3j5L30m14J31r6K11j4n2K0O2k51j10r1J69N41m42R1qK17j74L27k66J20k35
$$ -93 -108 222 -192 -61 -157 54 40 -12 8 70 -181 -291 -382 -213 328 -114 -23 -31 186 12 339 73 193 -42
1397d2K72r1n5m4m7M4m20L32l4M2J10M02o48L89j17m12R9J83R3m1l8l3K99l3l95
$$ -42 230 139 84 40 -7 37 -383 -51 -85 -43 67 469 -179 210 93 -319 -220 -37 56 15 -23 -56 243 210 -185
1422a85j25K01P6n5K95k66L01k03J99k87J54p0j27K79K4k69J30k37N0K2J9l9J44
$$ -185 -310 -109 -33 -88 207 -59 242 39 238 -49 105 35 -92 187 211 -58 72 -165 -115 -93 -74 -113 31
1445C1j52L78j65k30K97lk01K79N9m02m7J57k6J5j86O3l7K00K2O8J53k50L0j97
$$ 31 -121 257 92 -138 159 156 -45 234 293 -109 -156 1 -25 -10 -196 -133 -170 30 52 120 273 23 53 -144
1469a44Q6P3K0n8j55K06k4J14k14J26j29m7J64qj6L72k30P1k00M5r6m4K17J08
$$ -144 -58 15 35 -23 -178 28 4 118 -96 30 -99 -146 18 10 -6 366 136 207 7 52 -44 -88 129 237
1493B37k43m8R7r7J02l0l5J40l53M14l1n25N12L01m57N9J43Ll05J02j7q2j16J99
$$ 237 -6 -54 43 -54 48 18 -17 123 -230 184 153 -372 140 441 -16 43 186 189 -116 -14 -31 -113 -229 -30
1517c0p7j45L01k19K77l09j32P0L03J6K50m70K17n1Q0j3K5J88m33K46j58l6j99
$$ -30 -107 -252 49 -170 107 -202 -334 -264 39 55 305 -165 52 1 81 68 93 281 -152 94 -64 -100 -299
1540b99K44J15K3j71J07j98L73j55p6J3O4J08j01k33N04k76q9j38J23P1K42j10
$$ -299 -55 60 83 -88 19 -179 194 39 -37 -24 40 148 47 -186 318 42 -47 -185 -62 9 251 141
1562A41l47J12j2J25p7j20L74Ok90K42o6K63l51k19K97l70M64n7j26j07K34N3
$$ 141 -206 -94 -106 19 -58 -178 196 202 -88 154 88 351 0 -219 78 -292 172 115 -11 -118 116 169
1584A69k93J9O9J10J67J15k85r0l5k8R2O9l34K30L6k00K24J83j64J23p0k36K20
$$ 169 -124 -105 -36 74 241 356 71 -19 -54 -82 10 79 -255 -25 11 -189 35 218 54 177 107 -129 91
1607I1q2l37K28J62R6q2K80m52j93M02j69l1m2n7M28n54K41J55l7J87k49J04k04
$$ 91 9 -328 -100 62 158 76 356 -96 -289 113 -56 -87 -129 -186 242 -312 -71 84 47 234 -15 89 -115
1630a15K15k67J34M2j22J15k28J47j60K36Pj18K77j58J32K71n17K8J29q0mp7q6
$$ -115 100 -167 -33 9 -113 2 -226 -79 -239 -3 4 -114 163 5 137 408 -109 -81 48 -32 -36 -113 -199
1653a99K22j30K06R9l51K57k51K40k79J25J33K17k61L10j68k2j41K11j10m7o5
$$ -199 23 -107 99 198 -153 104 -147 93 -186 -61 72 289 28 338 170 148 7 218 108 61 -4
1674dj19ok3N5j00N28m21j6K51J5j51r8J07l3Q1o0N3n3n3J15j85K0J27lR8m17
$$ -4 -123 -129 -152 -97 -197 331 -90 -106 145 160 9 -89 18 -15 66 6 59 6 -47 68 -117 -97 30 27 125 -292
1700b92M30J19k21O6j09j49j97M71o4k11J9P8oJ03P6R6k88M1K5l0M3K08j76j34
$$ -292 138 257 36 102 -7 -156 -353 118 54 -157 -138 -60 -66 37 113 209 -79 -38 -13 -43 0 208 32 -102
1724a02K17NP6j36P5j19k60L16p3O9J0k3Pk06R3K12j57j11J11J6j18M22m31J04
$$ -102 115 120 196 60 135 16 -244 72 -1 68 78 55 62 -144 -51 161 4 -107 4 20 -98 324 -107 -3
1748cj38l5J46n5J32J07l42J54J09k3K28m72R4Q3J74k72q0K79l6Oj54K77j79J66
$$ -3 -141 -176 -30 -85 47 154 -188 -34 75 52 280 -192 -98 -15 159 -113 -193 86 50 56 -98 179 0 166
1772A66N1m49j9L85J03m78M35J75k51k43K19J63j30k38p9J4R6k16L85p7PP9r6
$$ 166 217 -232 -251 134 237 -241 194 369 118 -125 94 257 127 -111 -190 -176 -80 -296 89 12 19 98 2
1795Bn8P1K3j36p8Q6K60j27l4j05L65l02P1m0J02M2j60k31K2J23J50j69K88l04
$$ 2 -56 15 38 -98 -176 -90 170 43 9 -96 269 -33 38 -2 100 142 -18 -249 -227 -104 46 -123 165 -139
1819a39L09m54K72N5k56L42j38R6l37R9K05k06l8L53M3k40P3PN1QrN4j46q1J60
$$ -139 170 -284 -12 43 -213 129 -9 87 -250 -151 54 -152 -190 163 206 -34 39 46 97 105 96 150 4 -77 83
1844H3j93J09l27L10k12L24J9Q2k72j77K90j24m0J99P6k41K73k36k39M21k28K31
$$ 83 -110 -1 -328 -18 -230 94 113 195 -77 -254 36 -88 -128 71 147 -94 179 -57 -296 125 -103 128
1866A28n4k89K89j4j42J00k7J2K04k54k86K53l5O2M2M20n31L42n40K64p2O3r2
$$ 128 74 -215 74 60 -82 18 -9 3 207 -47 -333 -80 -115 -53 -11 409 -122 220 -320 -56 -128 -65 -157
1889a57K85r4L0r2Q3p3k24lM40j76j76J46J02j90J35j40k33J74R0j62J56R8k31
$$ -157 128 34 64 -28 55 -18 -242 -245 195 19 -157 -11 91 -99 36 -104 -337 -163 -73 -235 -79 19 -212
1912b12K67O4Kj13J36j24q1j44L50j6M7k65j44P5M9Q3j34J33O0O2K6l6j7m5k19
$$ -212 55 119 121 8 144 20 -61 -205 145 129 176 -89 -233 -158 -109 -26 -160 -27 33 95 121 85 68 23 -196
1937a96K38j71M9L7M0J65l83k1L47j50m9J16K44k94P3k68K3J37m6J1K44L5l44
$$ -196 42 -129 -80 -43 -3 162 -221 -242 105 -45 -94 22 266 -28 45 -223 -200 -63 -109 -98 146 181 -163
1960a63J16L68k95K5k9Oml57K22J76M6n2J1k9r6L49l40J17k04K48K52m02k1kQ2
$$ -163 -47 321 26 51 22 28 24 -333 -111 65 111 59 70 41 -55 294 -46 71 -133 115 367 -35 -56 -58 24
1985B4p4K4r5K46j93m7K87k06P6j2pk19Q5j34M11l35K84j7j26l2K06k09L6r2J64
$$ 24 -50 -26 -121 125 -68 -115 172 -34 42 30 23 -196 -111 -245 166 -169 115 98 -28 -60 146 -63 -27 -119 45
2010D5n1J49l9j38p6R3j5l7J9l7L8P3r0j27kJ78j0J90k4P3q9J13j43p3K16k69
$$ 45 -6 143 104 -34 -110 -17 -32 -69 -50 -87 -49 24 -66 -193 -195 -17 -27 163 139 212 123 236 93 20 236 -33
2036c3K32k70L30m3o2n2m3j17P5k26K82j8j16J82K4m54L53P6j39k1j32M61j82
$$ -33 199 -71 259 216 154 102 59 -58 17 -209 73 55 -61 121 145 -309 44 120 -19 -40 -172 289 107
2059A07k05L9J55j75J64o3j87J69P4q8j99J46k7J99p1JO3q7l98N64l93n7O05k34
$$ 107 -98 -59 96 -79 85 22 -165 4 78 -10 -209 -63 -90 109 38 39 102 15 -383 181 -212 -269 336 102
2083A02k17j55J45p4k2K55j18j71J97l1p9J51R6p3M9J7j4J72m88J79K58o3K7j06
$$ 102 -115 -270 -125 -199 -221 34 -84 -255 -58 -89 -168 -17 79 6 55 72 58 230 -258 -79 179 116 143 37
2107C7l8l15J56R1K6j34Q1j16J44J5l23L14J8j3J10N5j02p6K93j03j79J64k81
$$ 37 -1 -316 -160 -69 -43 -177 -96 -212 -68 -53 -376 -62 -44 -57 53 108 6 -70 223 120 -59 105 -176
2130a76J17k7Q0K31j93KK14l19J33k23K81m40K35J77j60K01K3k34O6K18m39l5
$$ -176 -59 -86 -6 225 32 34 248 -71 62 -161 120 -320 -85 92 -68 133 156 -78 -12 206 -233 -268
2152b68K54K15m24qJ34K18l04K0L63k05R9k9j02J41J96l58LN4r7O5J36J0k69J3
$$ -268 -14 201 -223 -231 -97 121 -183 -163 200 -5 94 65 -37 104 300 -58 -55 -1 -98 -33 103 113 -156 -143
2176a43J4M4J95j96K8J90l20L05j60P5J42j23J81k65n0kL92l39j66K69n7K0k7
$$ -143 -129 -85 110 -86 -58 132 -188 117 -43 32 174 51 232 -33 -83 -85 307 -32 -198 71 14 34 7
2199Gj3J47l4k20o6L47j33l4J33P4nl55N4j46M88m64L25k07j39M51k73k4K00j70
$$ 7 -6 141 107 -113 -179 168 35 1 134 208 203 -152 -98 -244 244 -220 105 -102 -241 210 -63 -87 113 -57
2223e7r8Q0J13r9MQ3k2pq6j40K57o1K48m2O2j67j34l1m3P4L15q5j96J26o2j93
$$ -57 -155 -75 38 -61 -57 26 4 -3 -89 -229 28 -33 215 173 235 68 -66 -97 -140 -66 249 164 -32 94 32 -161
2249a61N29m86J77k30L98k76n8r0R7MK0L3J3K0j15J55l00L52j18J66o0j60J09
$$ -161 368 -118 59 -171 227 -49 -107 -197 -100 -96 -76 -43 -30 -10 -125 30 -270 82 -36 130 70 -90 19
2272A9Q2j86M5j45K47K2o2O7p7N5rk56P6J39j69j49L78P8k03l4N7m07J86J40m4
$$ 19 101 -85 -40 -185 62 84 22 89 12 67 58 -198 -122 17 -152 -301 77 155 -48 -82 -25 -432 -246 -106 -150
2297a50N06k78L8j21j01j01M45n53K52pJ67K7j87K32k32K52k58J86j43j02J30
$$ -150 356 78 116 -5 -106 -207 238 -315 -63 -70 97 124 -63 169 -63 189 -69 117 -26 -128 2
2318BJ07p1j13q8L20k89O1L7Q2Q8k31J34K9j1j21K52o6K7q9k23L9J41N5m4j81
$$ 2 109 38 -75 -163 157 -132 -71 -34 48 136 -95 39 68 57 -64 188 122 149 60 -163 -124 17 72 28 -153
2343a53o0K94j09k66j26M76k02L75m94L53k0o2j04K9q5rK90m9M4J35m63K57N5
$$ -153 -213 81 -28 -294 -420 56 -146 229 -265 88 68 6 -98 -69 -154 -163 127 78 122 257 -206 51 106
2366A06M1j15j20K85n5j66Q0J03l60q2lK54O7R0o0N1l01K68j46l2J40j99N8J80
$$ 106 147 32 -88 197 142 -24 56 159 -201 -283 -286 -32 35 125 65 116 -185 83 -63 -95 45 -154 -96 84
2390H4P9l08M6J65J14m59M43j01j17q0N24m25j22K04r4L0p2J63r9K57m34p5L37
$$ 84 163 -145 -99 66 180 -279 164 63 -54 -134 390 -35 -157 47 -47 -17 -89 74 -25 232 -202 -277 60
2413F0p1L8K07j92j67O9K2k36K53o5p7J76M9n7n9KRJ65L4l42O7K04j03j41M1K51
$$ 60 -11 27 234 42 -125 -56 -34 -270 -17 -82 -159 17 66 9 -50 -48 -39 126 160 -182 -115 89 -14 -155 -114 137
2439A37J4j66o6M0K23j71j18m2L43k18j02m8K7J44K1p4K56j73J07k22P0j89m0
$$ 137 151 -15 -81 -41 182 11 -107 -149 194 -24 -126 -174 -147 -3 18 -56 200 27 134 -88 -18 -207 -247
2462b47J67OJ87N5l9q8J40l88K32j59n7J52L83m98N9J73J0j49O7J90l42J13L92
$$ -247 -80 -74 113 168 129 41 181 -207 25 -134 -191 -39 344 -154 -95 78 88 -61 6 196 -146 -33 359
2485C59j91q4k7j35k6NJ27J82l96L31j28r3J35k86L40j40p6K25l46R6J24J12j18
$$ 359 168 84 57 -78 -104 -99 28 210 -186 145 17 -76 59 -227 113 -27 -103 122 -224 -128 -4 108 -10
2508a0P7q7J26k90J74J08j83J19L2q0m3n6j38M10k45M08m32J42j71K54l7k27L84
$$ -10 67 -20 106 -184 -10 98 -85 34 66 -14 -57 -113 -251 159 -86 322 -110 32 -139 115 78 -149 235
2531B35N8j85J64m94M9k0J89Nm8K0j21J38M01n0m01K05l21K61k48L22l53n2M68
$$ 235 293 108 272 -222 -173 -193 -4 1 -47 -27 -148 -10 391 341 -60 145 -176 85 -163 159 -194 -246 222
2554B22k89l8J01K08j39j54M16k04j2k43J91M4nk20J20n4o3L10j19j74N4J06J61
$$ 222 -67 -105 -4 204 65 -89 327 123 111 -132 59 103 98 -122 -2 -56 -119 191 72 -102 -48 58 219
2577B19k98K36m2j70J64l02J97J9q6j08K8J45J78j23L7j7k18J89k4K2K39k11p9
$$ 219 -79 157 115 -55 109 -193 4 23 -63 -171 -143 2 180 57 94 77 -141 48 24 46 285 74 -5
2600eJ71j98J15j04K82j24k64q5L81k1k03J8j38J21J6k20M71K5j78M7k11r3L47
$$ -5 166 -32 83 -21 261 137 -127 -212 169 148 -55 -37 -175 -54 -38 -258 213 238 60 107 -104 -197 150
2623A50k31R9j39L78k73k29K28K10K0l13J23O0l05K86J54k70r0J86m9O8j82K38
$$ 150 -81 18 -121 257 -16 -245 -17 193 213 -100 23 83 -222 64 218 -52 -142 44 -5 63 -119 119
2645A19j07J85k12Q4L22k94k3k75M60j08k27J12J68j73J73r3j7j62L06j42j67
$$ 119 12 197 -15 69 391 97 74 -201 259 151 -76 36 204 31 204 111 94 -68 238 96 -71
2666g1J97l55J21J11J62q5k39J00J21P1L7k32k5m7L74l16L20k66k05K28k7J96
$$ -71 126 -229 -108 3 165 80 -159 -59 62 133 170 -62 -87 -134 240 -76 244 -22 -227 1 -26 170
2688A70p9j15q1J75J75m83L04k55K0J44j19J36MQ8J00q1K50k06j30o0K66j56k54
$$ 170 91 -24 -105 70 245 -238 66 -189 -169 -25 -144 -8 -4 84 184 103 353 147 17 -43 223 67 -187
2711a87M7J93q3q8o9J51m7qR4K22l05j55M17k96j62K99J23n8q9l04L36K10q7k47
$$ -187 -140 53 -30 -118 -187 -36 -83 -91 3 225 -80 -235 182 -114 -276 23 146 88 -1 -305 31 241 154 -93
2735i3J93M8k20M4J01Q6j66J73j05p9J23jj40pj62J17K50l06j32J71m8J74k72
$$ -93 100 148 -72 -28 73 159 -7 166 61 -18 105 104 -36 -43 -205 -88 162 -144 -276 -105 -153 21 -251
2758b51J11j38L17j20o6M28j97k53M90n01Q4J39j74Q8J55j97M6k4K11k01r8R9
$$ -251 -140 -278 39 -81 -147 281 84 -169 321 -180 -96 43 -131 -43 112 -85 -39 -63 148 -53 -151 -52
2780e2j14K88l76K15K14j76j92L67k35J10k51J61P3j02k6Q6K12j97O7L9j22j12
$$ -52 -166 122 -254 -39 175 -1 -193 174 -61 49 -202 -41 32 -70 -96 -10 202 5 72 111 -11 -123
2802a23J29k41J38J31Pl5L43r3l21P4n6N5r3K62k37n4J93j69J02r0J11k33K0L40
$$ -123 6 -235 -97 34 41 6 349 256 -65 9 -47 8 -85 177 -60 -114 79 -90 12 -78 33 -200 -180 160
2826A60k46JJ6N3R0j50m3R6K32l96K40Pj02p1K98k09j93J42r8M53j5k3m89K26
$$ 160 -86 -85 -69 -16 74 -76 -119 -23 209 -187 53 60 -42 -113 185 -24 -217 -75 -173 280 265 242 -247 -21
2850b1m68N37Q9l39O4L09r0r1J43j37k60K41L35l69M0nj99K01j6N5m9K5m1J5J87
$$ -21 -489 48 137 -202 -138 171 81 -10 133 -4 -264 -23 312 -57 -17 -22 -221 -20 -36 19 -30 -5 -46 -31 156
2875A56J8k23J05P5k71L14J76j76j64j6K45m95J33J82p4k73K72m4J94k49O3k14
$$ 156 174 -49 56 131 -140 174 350 174 10 -6 239 -256 -123 59 -15 -288 -16 -60 134 -115 -52 -266
2897b66K97j44L01j04k49K91k39K39r3p7j99L09%j0j01K34n7j08q5L14l12r8K20
$$ -266 31 -113 188 84 -165 126 -113 126 33 -44 -243 66 66 56 -45 189 132 24 -61 253 -59 -157 63
2920F3Jn8J40p7l0L5j43m9J71M8l08J79j67p3K7K72l6K4K12j77j19J39k37KL93
$$ 63 64 6 146 69 39 74 -69 -118 53 101 -207 -28 -195 -268 -241 31 -5 19 231 54 -65 74 -163 -161 232
2945B32l93K53j84J72K24l43J93j27n1J84kk16K03l57l9L89m2k87l0J34K08o2
$$ 232 -161 92 -92 80 304 -39 154 27 -24 160 158 -58 145 -212 -251 138 96 -191 -221 -87 121 59
2967E9M6k70L17M4l58K50J34j39k92mJ93K8J36j84N8m8r4J61o7N0j81L17Rn44
$$ 59 105 -165 152 196 -162 88 222 83 -209 -213 -20 8 144 -40 18 -30 -124 37 -30 20 -161 156 165 -379
2991c79L05K84j83o6j65L22J7n6P4k62j40L39m11L14j45n1K19k0j73J70j53K90
$$ -379 -74 210 27 -39 -204 118 135 79 153 -109 -249 90 -321 -7 -152 -203 16 -4 -177 -7 -160 130
3013A30k1k06J74j02j31J88j43j00M58l86M7J57l50K68Q9q0J33k80J18J86j17
$$ 130 109 -97 77 -25 -156 32 -111 -211 247 -139 -92 65 -285 -17 72 -8 125 -155 -37 149 32
3034C2j28lK54k70J32j34J50o2J20J64k92l5j03J42K2L8O0J67l69R0K46m83M85
$$ 32 -96 -99 155 -115 17 -117 33 -29 91 255 -37 -72 -175 -33 -11 27 87 254 -115 -25 221 -262 223
3057B23j66K49k37j04r3K01o2mj62K02O6j53q7P0k78K47L54l51J87o2P1j90J19
$$ 223 57 306 69 -35 -128 73 11 7 -155 47 113 -40 -127 -57 -335 -88 266 -85 102 40 111 -79 40
3080D0j33J16M8j00q0j38K80j06R0j42R5R4j34j39K70r3k52M24q4M5j98K63k60
$$ 40 -93 23 71 -29 -109 -247 33 -73 17 -125 -30 64 -70 -209 61 -32 -284 140 56 101 -97 166 -94
3103i4q1J77l9P9r7p4O9L6r0J79n0j17j82R3J33j29Q1K1r7M31m34J99K3l50L57
$$ -94 -175 2 -37 42 -55 -129 -60 -24 -114 65 15 -102 -284 -191 -58 -187 -106 -85 -182 249 -185 14 37 -313 44
3128D4m00M99k07L17l73K26j78J19n1Q9q4J37J4r2P3q8n7J21p6n4J08l31M50k9
$$ 44 -356 143 -64 253 -120 106 -72 47 -4 85 1 138 152 60 133 45 -12 109 33 -21 87 -244 206 177
3152A77j31N6k42J12K6Q7k25J26L20m67n9pL20j3j2K4p2N2l66K37K35k58p4J75
$$ 177 46 102 -140 -28 -2 85 -140 -14 306 -161 -220 -227 93 80 68 92 20 72 -294 -57 178 -80 -154 21
3176B1L4k66J58Lj36l7o6M7L11J93m58J54K02M0k17K22j98N1l62J92K05K12j68
$$ 21 55 -211 -53 -50 -186 -223 -289 -242 69 262 -196 -42 160 200 -17 205 7 58 -304 -112 93 305 137
3199A37K44m06M7J96q3q3r1j92J92q3L56J4l4P8k09j12q6L08k49RL87p8k05L9
$$ 137 381 -25 22 218 135 52 -39 -231 -39 -122 234 248 214 292 83 -29 -115 193 -56 -47 340 262 57 96
3223I6k09L76l05L13j99J27k73J38m4J81p2k81K84j46r3K19m0M5p7P6j82J44k81
$$ 96 -113 263 -42 271 72 199 -74 64 20 201 129 -152 132 -14 -107 112 72 117 40 116 -66 78 -203
3246b03R6L80k00k45K21P7j80K32J3j49j06m9J87j92K08k47R9m5J08k48J63r4
$$ -203 -107 273 73 -172 49 126 -54 178 191 42 -64 -113 74 -118 90 -157 -58 -103 5 -243 -80 -174
3268a74l0L49p2kj82O6q6K53l9j8K1J18m41K18K47k98ML07o9M5k08j12j21K66
$$ -174 -204 145 73 71 -111 -45 -131 122 83 65 86 204 -237 -19 228 -70 -66 241 172 217 9 -103 -224 42
3292D2K0P9k32J83k2J63j58m2p1m8J25j68J83l23k9K81J03j40J09k09L64mj76
$$ 42 62 141 -91 92 70 233 75 33 -38 -86 39 -129 54 -269 -298 -17 86 -54 55 -154 210 206 30
3315C0k3k83K87R0m9Lr1r6J67p3M0M6N6r7K5j18K49J17o2k44K18K0k69J47K02
$$ 30 7 -276 11 101 52 55 -36 -132 35 -38 2 48 104 7 32 -86 163 280 218 -26 192 212 -57 90 292
3340B92l11q4J8L99l90J47j04J79j83NO6j79J54N4j74K28o0%k34J94NJ36o8j51
$$ 292 -19 -103 -85 314 -76 71 -33 146 -37 -32 34 -145 9 63 -111 117 57 57 -177 17 22 158 90 -61
3364f1L48k13j54j6K55m3n2J4r6R0j37K49l86J70n7J40m4Oj4L7m27L01P1J45k20
$$ -61 287 74 -80 -96 159 116 64 78 -18 72 -65 184 -202 -32 -89 51 7 13 -1 36 -391 -90 -19 126 -94
3389i4n2K64J22l70mMQ3Q8q3K44l66k3L20l34kK88o1K41l76M8l1M23j78l52n9
$$ -94 -146 118 240 -130 -134 -130 -47 41 -42 202 -164 -187 133 -201 -203 85 24 265 -111 -63 -94 329 151 -201 -260
3414b60M76l68J63J71J49k67J03k70mJ00j24Q0J23n9J34j8l17K17M3m26M47k1
$$ -260 216 -152 11 182 331 64 167 -103 -107 -7 -131 -51 72 13 147 129 -188 29 72 -354 93 72
3436G2q3P9l0L61m47P8m9K93nj79j08j09K10J00p3j53J14k60L94j20J03k4J35
$$ 72 -11 68 38 399 -48 30 -19 274 269 90 -18 -127 83 183 110 -43 71 -189 205 85 188 164 299
3459B99l34m0K6M3j86M10K36k89j47O6l1j7j6J48m82K10N1L64k43l07L23j9O7
$$ 299 -35 -75 -49 -6 -192 218 454 165 18 84 53 36 20 168 -314 -104 -53 311 68 -239 84 65 132
3482A32j2L4k91K8K35k15p3J25o2J90Q9j21J53j46j21p6Q1j0L9k8k25K20M1Q5
$$ 132 120 154 -137 -109 126 -89 -162 -37 -99 91 180 59 212 66 -55 -131 -50 -60 -21 -49 -274 -54 -13 72
3506G2Oj50j01M85k86k20J98j19j7M82n13J05o9K56L3j22m4O9j02K08Mj24j39
$$ 72 78 -72 -173 312 26 -194 4 -115 -132 350 -163 -58 -127 129 162 40 -4 65 -37 171 175 51 -88
3529h8K41k42k18K75R1j46J8K34l38j54K11J15L4l8m0Q2m4L1k05K19r9%j68K52
$$ -88 153 -89 -307 -32 59 -87 -69 165 -173 -327 -116 -1 33 -5 -45 37 -7 24 -181 38 -61 -61 -229 23
3553B3l0%K57l43j75J57J22K50m04R6n7L95j63k68q1L66j40J3j44K30j25j46K82
$$ 23 -7 -7 250 -93 -268 -111 11 261 -143 -47 -104 291 128 -140 -221 145 5 18 -126 104 -21 -167 115
3576A15k07K08M5j20j15qL12k15j54J78J07k56k47K05K39j02m0K3j57K0K34k55
$$ 115 -92 116 161 41 -74 -82 230 15 -139 39 146 -110 -357 -152 87 -15 -55 -32 -189 -169 65 -190
3598a90K47j67J6kJ31j50L84j98k23K20O9j75k6%q5J43L20l59J59Q5r6j74J37
$$ -190 57 -110 -94 -96 35 -115 269 71 -152 68 137 -38 -64 -64 -149 -6 314 -45 114 199 103 -71 66
3621F6o7k7L46k28p7K6J99k53l2K17j82k34K28r4K0K34r5o0J03L0j74J31r0J05
$$ 66 -1 -28 318 90 13 39 238 -15 -47 170 -12 -246 -18 -112 -92 142 47 -13 90 120 -54 77 -13 92
3645I2l64M23J72k37m4k14K76j31j54J73j44J41r5K22rl34M40j95k98K24K4K18
$$ 92 -272 151 323 86 42 -172 104 -27 -181 -8 -152 -11 -106 116 107 -227 213 18 -280 -56 -32 186
3667A86k63j7k2P0J69j09k34O9M44m18M0M06m88P9o6L15o9j51j59K56p2n5k58
$$ 186 -77 -94 -116 -46 123 14 -220 -151 293 -125 -85 321 -167 -88 -154 161 92 -59 -218 38 -34 -89 -347
3690c47J99L01k07L6mJ13m48M34m3n4n7j19L20K1j4k24J19q4K5N4J60j77j55J34
$$ -347 -148 153 -54 -18 -22 91 -357 77 34 -20 -77 -196 124 145 131 -93 26 -58 -33 21 181 4 -151 -17
3714a7p7O7K8j9P8m04L94k66M10l28L47j79jj10l8N2Oj50K77p7k0qj59K9r0J30
$$ -17 -94 -27 1 -18 60 -344 50 -216 194 -134 213 34 33 -77 -115 -63 -57 -207 70 -7 -27 -35 -194 -165 -255 -125
3740a25P0K40r1J21l71%K26j86O5J2j0j34J13K46l54O0J12K38k47J20n2J0k41
$$ -125 -55 185 94 215 -156 -156 70 -116 -51 -39 -49 -183 -70 176 -178 -118 -6 232 -15 105 53 63 -178
3763a78M50m49l1J46K2O6j52L1M7L83l42j21L6N6n7o0N70m43qP4L9j87J04K33
$$ -178 272 -177 -208 -62 -40 26 -126 -95 -48 335 -7 -128 -92 -36 -93 -153 417 -26 -34 40 79 -108 -4 229
3787B29l66R9J56K87o85L63k7K2k99J87J08j84O9J82jn6Q1j94K2L6J03j00o8N
$$ 229 -137 -38 118 405 -280 83 56 78 -221 -34 74 -110 -41 141 140 84 165 -29 -7 29 132 32 -36 -31
3811c1J87q5j31m4J48M0k9K22r0k76m0P6J57l66J95ML2j95K33L6k92O7R4L1K08
$$ -31 156 71 -60 -104 44 84 55 277 187 -89 -129 -53 104 -262 -67 -63 -31 -226 7 43 -249 -182 -88 -57 151
3836A51j28K40k99J4k6J99j59p8Q2Q5J6q1P6K6r0Q1k60R3J84j96K90l12N2k19
$$ 151 23 263 -36 -22 -48 151 -8 -86 -4 81 97 16 92 118 28 109 -151 -58 126 -70 220 -92 -40 -259
3860b59J99LK04l93m4N81l59R7k24K03J46jj17j89nJ77K2J31k99j51L07M09k93
$$ -259 -60 -57 147 -246 -290 291 -68 29 -195 8 154 153 36 -153 -158 19 41 172 -127 -278 29 438 145
3883A45j68J78l75N15k33r2k30M34o1l07L26l58m3J87K85l01K47r0j29J12o6K28
$$ 145 -23 155 -220 295 62 -30 -260 174 113 -194 132 -226 -269 -82 203 -98 149 59 -70 42 -24 204
3905B04j24J46j20P9J14n36L52j13j44K07K14l17r1J16j7j1J65M3p3k2j60K41
$$ 204 80 226 106 185 299 -237 115 2 -142 65 279 -38 -129 -13 -30 -41 124 167 94 72 -88 153
3927A53m4k00J07j34J64k5N6j88K69o4J6k70J72p4j9m1l9q1L09j22k8j32j25K92
$$ 153 109 -91 16 -118 46 21 77 -111 158 94 110 -160 12 -62 -81 -122 -161 -242 67 -55 -83 -215 -340 -48
3951d8JP5O5l40L26r0M1l3J50k23k12J8J29J83j9M6o2J13L05o73NK94j63n8L8
$$ -48 -47 28 93 -247 79 -11 30 -3 147 -76 -288 -270 -141 42 23 69 7 120 425 -248 -243 51 -112 -170 -132
3976a32L90j55l6n0j7j24K32l04L20l05K04j68q6J35J11L47j52n52J93M3P0k6
$$ -132 258 103 67 17 0 -124 108 -196 124 -181 23 -145 -231 -96 15 362 210 -342 -149 -106 -36 -62
3998f2J45J17j02k37K04q7p6K01R6l3l53J98k5j3l1J70j21K02k87O0r9M7R2j16
$$ -62 83 200 98 -139 65 -22 -98 103 199 166 -187 11 -14 -27 -58 112 -9 193 -94 -34 -133 -86 6 -110
4022a10j0K26N7j12q1r3j26K24P2j88P7O3K37J09k42j43k40M05p5l5j09J80M4
$$ -110 -120 106 163 51 -30 -123 -249 -25 47 -141 -64 -1 236 345 103 -40 -280 125 50 15 -94 86 130
4045A30j45n2P5r4j9m5L12j76kL14l78L72m47J39j79L78l21M3J78k40L32m58L27
$$ 130 -15 -67 8 -86 -105 -150 162 -14 -16 298 -80 292 -155 -16 -195 183 -138 -95 83 -157 175 -283 44
4068D4k2J67M8j93JR6o7K7l59J57N9J41j52j07JK0R2J31j60O3J16k21pk0K30l27
$$ 44 22 189 237 44 45 141 74 101 -258 -101 -42 99 -53 -160 -159 -139 -47 84 -76 -13 103 -118 -125 -145 85 -242
4094b42K25j10P2J77k30k7K44j88J1J16J24m18L04J16k32K1O0J76k44J29j86J52
$$ -242 -17 -127 -55 122 -108 -135 109 -79 -68 48 172 -246 58 174 -58 -37 23 199 -45 84 -102 50
4116E0R0k73J21r7k1L06j49L0k0K05Q8m86K72j04J51j34l0j87J99o4J08R0q6l8
$$ 50 140 -133 -12 -109 -130 176 27 57 37 242 330 -156 116 12 163 29 -1 -188 11 -53 55 145 59 21
4140B1L7R4M6j33j45K24j78K49n9j20j19M6L81o02l0M40M2N0l40K51j65L5M3j84
$$ 21 58 152 198 65 -80 144 -34 215 156 36 -83 -37 344 -258 -288 152 194 244 -96 155 -10 25 68 -116
4164a16J02Kj27Q8K37k23q0M07k31K4k18J77K0j18K11k35J32j94O2M06l60L08
$$ -116 -14 -12 -139 -51 186 -37 -117 290 59 83 -135 42 62 -56 155 -80 52 -142 -80 326 -34 274
4186B74k25j02J62l2k35J91q1K73n5j07L2j08k17L35J9k82J60j2j32J0K34j34
$$ 274 49 -53 109 77 -158 33 -48 225 170 63 95 -13 -230 105 124 -158 2 -10 -142 -132 102 -32
4208c2L35m06Q6J13n3m5j55J00n1O0J74r0m8Q6l87K92m2Q6J19k1qk75J14J41k81
$$ -32 303 -103 -17 96 43 -2 -157 -57 -108 -48 126 36 -12 74 -313 -21 -63 23 142 121 113 -162 -48 93 -188
4233a88L54j01K8N9Qn8N6j68J04j07p6N28n30j90K80k0K66k71%n5MR4K75k06P
$$ -188 166 65 93 152 160 102 158 -10 94 -13 -89 439 -91 -281 -1 -21 245 -26 -26 -81 -77 17 292 86 93
4258I3k65RJ83q4J68k27J34J71j11J19k33P8j38J68qj04N2k59K41Q5J01l66L78
$$ 93 -172 -163 20 -64 104 -123 11 182 71 190 -43 35 -103 65 57 -47 5 -254 -13 72 173 -193 185
4281A85m75M52j71Q3L12k29j21J3r0L7k43J60Q0R6j37mO2k37K45k3j74O8p5K19
$$ 185 -290 162 -9 74 386 157 36 49 -41 -4 -247 -87 -7 89 -48 -52 10 -227 18 -5 -179 -111 -186 33
4305C3j34N43o59O0K27k04L29j30R6j89j66j03Q27m76j80L73j42k66o6K42K0k50
$$ 33 -101 442 -217 -157 70 -134 195 65 161 -28 -194 -297 530 54 -126 247 105 -161 -227 15 35 -215
4327b15J76J12M9r8n1J89O3k27pO9n3kK79n32N06j88N8k8NJ61k10r0O7R5J47l65
$$ -215 -39 73 122 24 -27 162 225 -2 -9 60 7 5 284 -248 258 70 128 100 105 266 56 -34 33 128 275 -90
4353i0J05J65j43N6j48Qj94K11r1m0K74j20M8j44J18M6J08j89J8j28J41J79Nk11
$$ -90 15 180 37 93 -55 -47 -241 -30 -121 -161 113 -7 41 -103 15 61 169 -20 -2 -130 11 190 195 -16
4377a6J41j37j34K93k29K67k59K30k18J24j24k12K72m6o0K55K2k51J81k93J20
$$ -16 125 -12 -146 147 -82 185 -74 156 -62 62 -62 -274 -2 -48 -108 147 169 -82 99 -194 -74
4398g4K36j86J49n8rl7j23L93o4n66K32J98j24K04k52k9o6K23j28K44Q3k31r4
$$ -74 162 -24 125 67 58 21 -102 291 227 -339 -107 91 -33 171 -81 -110 -176 47 -81 163 246 15 -79
4421g9JJ87k69L1J16j9N3J25R7J2k9j46j53j21J24R6l1K52M9j80P8j14k29k7K10
$$ -79 -78 109 -160 -129 -13 -32 21 146 243 255 226 80 -73 -194 -70 26 -5 247 296 116 194 80 -149 -176 34
4446C4j37J44j74J21R6l21L74r6r5n5K00j74K49q0j09K28m44J16R1m8M09k58k62
$$ 34 -103 41 -133 -12 84 -237 137 41 -54 -109 91 -83 166 86 -23 205 -239 -123 -32 -80 329 71 -191
4469a91RL68j86M8k16K02m9K47n98O18l80K93r6k81J84K65j76J37o6j48J77j78
$$ -191 -182 186 0 48 -168 34 -15 232 -366 252 -128 165 69 -212 -28 237 61 198 132 -16 161 -17
4491a7q1J14J08k41r9Q7P6Q6J13r0K48k74j98K7J79j6q9J52o4J11R7l87J20j42
$$ -17 -98 16 124 -117 -216 -129 -53 33 146 56 304 30 -168 -141 38 22 -67 85 21 132 229 -158 -38 -180
4515a80j59L51P7m8p7L22m57O6MJ7k90M35j76J60j96K37k52K49P8k52K27L5k54
$$ -180 -339 12 89 41 -36 286 -171 -105 -101 -84 -374 61 -115 45 -151 86 -166 83 161 -91 136 171 -83
4538h3j14L27l2p6j96K17k5j10J63j95K8L18l54M4l1K99o6o9K44l76r0K29l64
$$ -83 -197 130 98 22 -174 43 18 -92 71 -124 -96 222 -132 -88 -119 180 114 45 289 -87 -177 52 -312
4561c12L75J02j6j67l0R7N0R4j26R4j47L4o9R2M8l48L13j06l08P44l34N7J60k36
$$ -312 63 165 149 -18 -48 49 99 193 67 161 14 48 -21 71 119 -229 84 -22 -330 414 80 137 297 61
4585F1j01q8R5K35l32J56M5m5J14j36J56j92J86l34r6L60ON9j28J26k62L0J45
$$ 61 -40 -128 -33 202 -130 26 71 26 140 4 160 -32 154 -180 -276 84 90 149 21 147 -115 -85 60
4608F0k1O9j77J14K10k84q7J78J79l03j29K23k75K11j1l8m3K5K32M0l31K49r8
$$ 60 39 108 -69 45 255 -29 -116 62 241 -62 -191 32 -243 -32 -43 -81 -124 -99 133 173 -158 91 -7
4631gM5k6K0j42k29K11J98j91Q7J7J8j7Op7k59K76K91j01j94K23Q3k98L34k79
$$ -7 38 12 32 -110 -339 -128 70 -121 -34 -17 1 -16 -10 -87 -346 -70 221 120 -74 149 232 -66 268 -11
4655a1k30K38j04J14k38K55j26J44l5M0K02l67M00l43L1j32K50Q6p4j48k04J15
$$ -11 -241 -3 -107 7 -231 24 -102 42 7 47 249 -118 282 -61 -30 -162 88 174 100 -48 -252 -137
4677a37j15K84J35L3j56j07q0N3j13P7J13k9l2RJ09j20m2L5j77K54j26m7M73j94
$$ -137 -252 32 167 200 44 -63 -143 -90 -203 -126 -13 -42 -74 -65 44 -76 -118 -83 -260 -6 -132 -179 294 100
4701A00J47n09L36j43m2o0J52L5J56q8j69Q7O7N5rnj89O1j33k14L04p7L58l74
$$ 100 247 -262 74 -69 -111 -171 -19 16 172 84 -85 2 69 124 115 110 -79 -18 -151 -365 -61 -138 220 -154
4725a54N5K19n3r5K9j2l3J65k8p5l03K03K38j14j67J00L2k98J49K65p5Rm1k19
$$ -154 -99 120 67 -28 1 -11 -44 121 93 18 -285 -82 156 42 -125 -25 7 -291 -142 123 48 57 16 -203
4749b03L60J77l45J78kj23J0N4J40k57k4q3r1K71R5j98N54o20L39k58J13j59K54
$$ -203 157 334 -11 167 165 42 52 106 246 -11 -35 -118 -209 62 157 -41 513 -107 232 -26 87 -72 182
4772A82Pj02J51k71R2j46K10o5K6j21J42l5j81K75l11QK0O8K84k42K38j41Nj69
$$ 182 189 87 238 -33 59 -87 123 58 84 -37 105 70 -111 164 -147 -139 -119 -51 233 -9 229 88 93 -76
4796g6k08K40J36r1q0j51J87K53k46q5N33l04j78K45P3j63j34kO2J7o9O1O2k48
$$ -76 -284 -44 92 1 -79 -230 -43 210 -36 -121 412 108 -70 175 248 85 -49 -51 11 28 -41 20 82 -166
4820a66J86J53j25J0j84J03K6K32k3k84K9Q9p2J93k99J35kk27J84J08j22K42k75
$$ -166 20 173 48 58 -126 -23 3 235 212 -72 -43 46 -26 167 -132 3 1 -226 -42 66 -56 186 -89
4843h9K15j40k57J53l1j06K67J79j50K22m20J61K6k98P7K08NN0j53q1Pj89J79
$$ -89 126 -14 -271 -118 -149 -255 12 191 41 263 -157 4 30 -268 -191 17 22 72 -81 -162 -155 -344 -165
4866a65J08K6J42j53K5K61o30O11k71k69M79r4P5l5j6j80J3K39k23r8J8J24k15
$$ -165 -57 -31 111 -42 -17 244 -386 225 -46 -315 164 70 145 110 94 -86 -73 166 -57 -155 -137 -13 -228
4889b28K55L76l17rj5j35J08j29N0J61J50n79L08q5K14k88K67j39QJ38k27j27
$$ -228 27 403 86 77 62 -73 35 -94 -44 117 267 -312 -4 -89 125 -163 104 -35 -27 111 -116 -243
4911b43K33M7kL14l41J44J1k85J31n7P8j68J63k18J8M93l52J78j09K1k33J13K94
$$ -243 -10 37 35 349 8 152 163 -122 9 -48 30 -138 25 -193 -175 318 -34 144 35 56 -177 -64 230
4934B30j63j76R8k0O4J06k09OK97l7k26m6M3k0Q2J0j91p6J52M5k44L88J09n4n2
$$ 230 67 -109 -11 -31 33 139 -70 -64 233 196 -30 -76 -33 -53 29 39 -152 -228 -76 -31 -275 113 222 168 116
4959A16K03l42rJ78l99J47K3L6J50l44N69m71K25j99M24k88mk04M93j67o1q2J34
$$ 116 319 -23 -32 146 -253 -106 -83 -47 103 -241 328 -143 82 -117 307 19 15 -189 304 137 76 -6 128
4982A28j20j70M87m43J58k1Pj07K0K94k33l0%r4J33Q6O2l03k18M08J64k70N5Q0
$$ 128 8 -162 325 -118 40 19 26 -81 -61 233 0 -30 -30 -124 9 95 157 -146 -364 44 208 -62 -7 73
5006G3O1M3k20J8k55K32N9R7k54J14q6K13j44O2J3J7l6Pq5J36L7j36J15j66k35
$$ 73 134 177 -43 -25 -280 -48 11 108 -146 -32 -118 95 -49 13 26 43 7 14 -71 65 102 -34 81 -85 -320
5031c20M04m6J65m07J6M54m77K18q6j56L47J21l80J36O0J8J40o9k72J90q1o5k1
$$ -320 84 38 203 -204 -188 266 -211 7 -79 -235 112 233 -147 -11 49 67 207 138 -134 56 -25 -90 -111
5054a11J06k4K9K86j28k54n2J06K9o8M8J73O7l50M10k65M13l24j53P6rK75k94
$$ -111 -5 -29 0 286 158 -96 -148 -42 -13 -81 -33 140 207 -143 267 2 415 91 -62 14 5 280 -14
5077a4M9j85J89J99j8m05MM26j85q2n3L56j91k46N7K5r1N7M17j65q7n3k50R0K06
$$ -14 35 -150 39 238 220 -185 -181 245 60 -22 -75 281 90 -156 -99 -74 -165 -108 309 144 57 4 -246 -156 50
5102E0O3j41Qk0p4L42m42J14J44J42m08L90J3j50o4k43m8M60j64N3J1k00J95O5
$$ 50 113 -28 -20 -40 -114 228 -214 -100 44 186 -222 168 181 31 -33 -276 -324 136 -28 25 36 -164 31 96
5126I6j89j9L23j88LO4j01J76m2j59Mj1L91l6k30l08L21l64L02j36q8J65K09o0
$$ 96 -93 -112 211 23 26 90 -11 165 123 -36 -32 -43 348 312 82 -226 95 -269 33 -103 -191 -26 183 123
5150A23k68J2J23K15k74Q1J8J03j40M6%k1k0M4K12k52j97L12m0K51l87j06L23
$$ 123 -145 -133 -10 205 -69 12 30 133 -7 39 39 18 -2 42 254 2 -195 117 77 328 -59 -165 158
5173A58l29K41J20k04m3P8R5m0j73K47J46m20J53q0mK57l26m5K12j43J43L9k24
$$ 158 -171 70 190 -14 -57 21 116 76 -97 150 296 -124 29 -51 -55 202 -124 -169 43 -100 43 82 -142
5196a42K27k73L46j70j77J19J90r1J0O5k42L38j89J4K42k29J77k5n1k37j15N37
$$ -142 85 -188 158 -12 -189 -70 120 29 39 104 -138 200 11 25 267 38 215 190 139 -98 -213 324
5218C24l64J74j21J32k3L5L5N6n15L06k2k87K24J02j5j31qK04p6j13L68m82j0
$$ 324 -40 134 13 145 122 157 192 248 -267 39 17 -270 -46 56 41 -90 -98 106 30 -83 285 -197 -207
5241b07K86j07l3K1R9j4l2o2k4J24l7L1J37l50L10k21J17p4k01K89R9j98r3L15
$$ -207 79 -28 -61 -40 59 45 13 -49 -73 51 14 45 182 -168 142 -79 38 -36 -237 52 151 -47 -140 175
5265A75n2r0q6K66j73j57q1J12j35L81K2j03j8l41M12O0m50L22j30J26r9J51j3
$$ 175 123 33 -53 213 40 -117 -198 -86 -221 160 182 79 61 -280 132 192 -258 64 -66 60 -39 112 99
5288I9k69O3N9K06L3m68L19j88J72J3Q3j4J03l26M4M12l25LQ0N9j71Jk46M46j61
$$ 99 -170 -107 -48 158 191 -277 42 -146 26 39 122 108 211 -115 -71 341 16 19 99 158 -13 -12 -258 188 27
5313B7q8J12J71l87J57P4O3p5j49K43m39K33J61Qj68n7L00j28j48K97j93n8J06
$$ 27 -61 51 222 -165 -8 66 129 54 -95 148 -291 -58 103 111 -57 -114 186 58 -90 207 14 -44 62
5336F2K56j21l77J40J12J30M7j57j37k9N8R3m9Q3k62K00j93J37j67L44k15N7j87
$$ 62 318 197 -180 -40 72 202 249 92 -45 -74 -16 77 28 111 -151 49 -144 -7 -174 170 -45 12 -175
5359a75J21l1p1q4L64k92L61J05m91j76N86j20R4k60K77K59o48M72m98J11j4J54
$$ -175 -54 -85 -156 -240 124 -168 193 298 -193 -369 217 97 191 -69 208 467 -181 291 -207 -96 -110 44
5381D4%j31J39R0n9J91j85Q7k92MK53N0m49L25k16K60m1r9Np7M4RJ37k92K25j21
$$ 44 44 -87 52 142 83 274 89 176 -116 -112 141 191 -258 67 -149 111 70 -29 -24 -101 -57 -48 89 -203 22 -99
5407i9J48Q4j61k35L80j25O4k87J62O2p5j23n4L08j04o9J47l69L08J95k82M50
$$ -99 49 133 -28 -263 117 -8 56 -231 -69 -7 -82 -205 -259 49 -55 -124 23 -346 -38 157 -125 325
5429C25k06k99QM49m52K39K7R8p3j77J1K12l65j47K98j28L69K3p5pj58L0K02K5
$$ 325 119 -180 -172 277 -175 64 91 189 116 -61 -50 162 -203 -350 -52 -180 189 212 137 130 -28 2 204 229
5453B29k14m2q8j3r7J4K47j97R9Q7R3J51m32L32j07Q2j38j52J06J12J05k83P7
$$ 229 15 -27 -115 -128 -225 -211 36 -161 -62 25 118 269 -163 169 62 144 6 -146 -40 72 177 -106 -29
5476b9N3J24k35J19R4l28J90oJ45j95j14K85l4P0j28J53j22l3j15J60j69K68j09
$$ -29 24 148 -87 32 126 -202 -12 -18 127 -68 -182 103 69 139 11 164 42 9 -106 54 -115 153 44
5499D4n2k02L52j54n2J11l0q8K53lm24L55j33j04O4K4R6k01L53k87j35J30j16
$$ 44 -8 -210 142 -12 -64 47 17 -71 182 179 -245 110 -23 -127 -63 -39 57 -144 209 -78 -213 -83 -199
5522a99K23j82K52j33N0p0N3O3k14K24k30R0L43k13j38O9N2q9j80M08k32J45Q7
$$ -199 24 -158 94 -39 11 -59 -6 57 -157 67 -163 -73 270 57 -81 -12 40 -49 -229 179 -53 92 179
5545A79P7l29J91N6l46%K57J22j12q3l6O9j18j8J01R4O1k77J60j11q0K76o34O21
$$ 179 256 -73 118 174 -172 -172 85 207 95 12 -24 45 -73 -91 10 104 165 -112 48 -63 -143 133 -501 120
5569A20k66K26j5J61m6k34j22J58K36l09p9M5j00p8L07N9j0P0l79J21J6J6o2J98
$$ 120 -146 80 65 226 180 -54 -176 -18 218 -91 -170 -125 -225 -303 4 63 53 123 -256 -135 -119 -103 -165 33
5593C3Q7J47l62J07O9l17K05J52l06K86L38m55L7j0L9J64k02k88N27l03J27J08
$$ 33 120 267 -95 12 81 -236 -31 121 -185 101 439 -16 21 11 50 214 12 -276 251 -52 75 183
5615A83m01K31J81j12J04L14o68L38j40R1n3j17M0l37L49m5J31l16N4M94k57J92
$$ 183 -218 13 194 82 186 500 -168 170 30 121 68 -49 -9 -346 3 -42 89 -227 -173 321 64 256
5637B56n9k36K86k92K61l60K50o2j07J70J30J58j56j85m5J26j55n7j11R6J69L6
$$ 256 197 -39 247 -45 216 -144 106 44 -63 107 237 395 239 54 9 135 -20 -77 -188 -92 77 113
5659A13p0l44K24m2J6k3L38j23q3k6J66J36m40k6O2K25k58K73k9j10P4j11j39
$$ 113 43 -301 -77 -119 -103 -126 212 89 6 -20 146 282 -158 -184 -122 103 -155 118 89 -21 53 -58 -197
5682a97L63o8j03m7l8o7O7N3j49P6K21j31k9K10k42j46J26m4j2K29M4k92J41K15
$$ -197 166 98 -5 -52 -90 -157 -90 -37 -186 -110 111 -20 -49 161 -81 -227 -101 -145 -157 72 116 -176 -35 180
5706A80j06r3j9J23m3LO5j80O8j89j3L04K40k98j9k32J76K1p4P4l1kJ51j14j1
$$ 180 74 -19 -38 85 42 45 110 -70 -2 -191 -204 100 340 42 23 -209 -33 -12 -86 -12 -43 -45 106 -8 -19
5731a9o6n8K59p5k7J33j06J22k18N7n0K49j25J11m60J48J56j33mM0l0k80M08j82
$$ -19 -85 -143 116 41 14 147 41 163 -55 2 -48 201 76 187 -273 -125 31 -102 -106 -66 -96 -376 32 -150
5755a50K90k48J89r6k63L82R2r7J47k14J4J2j75K45k79M13j70k79K47k9J62j60
$$ -150 140 -108 81 -15 -278 104 196 99 246 32 46 58 -117 128 -151 262 92 -187 60 31 193 33
5777C3L8k4k00r4L18l14J73K01J06J27k02l9l4k43o8J48j7n5J61k9J09l22J14
$$ 33 71 47 -153 -247 71 -243 -70 131 237 364 162 123 89 -154 -222 -74 -91 -146 15 -14 95 -227 -113
5800a13Q7Q7M9j81rP0M5Q6j46J56k22K23l00l9L27j07l38J37K64K8k3j29j09P5
$$ -113 -26 61 110 -71 -80 -10 35 121 -25 131 -91 132 -168 -207 120 13 -325 -188 76 104 81 -48 -157 -82
5824h2OJn1L49k64L70m00k9K07k25K0K52q2n2k49K69J38j48j54L51j78R5l99K14
$$ -82 -76 -75 -126 223 -41 329 -71 -100 107 -118 -98 154 72 20 -229 40 178 30 -124 227 49 144 -255 -41
5848d1j10l8K95k12L24q8j89K28l68K91j44j44K30j44N9M0j60L22m9k41J51q2
$$ -41 -151 -189 106 -106 218 130 -59 169 -199 92 -52 -196 34 -110 -51 -11 -171 151 102 -139 12 -70
5870g0j63M13k75n2K41j65L53j96n3P0Nj39K50k95J58k57J90j88J51K82n61N06
$$ -70 -233 180 -95 -147 94 -71 282 86 33 103 108 -31 219 -76 82 -175 15 -173 -22 260 -301 205
5892B05k63j99O3j2J20MK59j63L48l94K50j52k59J34j06J70l4K43k07J69l43L61
$$ 205 -58 -257 -194 -206 -86 -82 177 14 362 -32 218 66 -193 -59 -165 5 -29 214 7 176 -167 194
5914A94pj32k35J6L04k43K07l0n2n0n2J22l13J46J13O5K05l41M8j86J29L04n8
$$ 194 187 55 -180 -164 140 -103 104 74 22 -28 -80 42 -271 -125 -12 53 258 -83 -35 -221 -92 212 154
5937A54m7n1M9p2M8j20j2l5K19m06L41O2j83j93m1N01m63K46k43L61M7l36L38
$$ 154 107 56 105 33 81 -39 -51 -86 133 -273 68 130 -53 -246 -287 214 -249 -3 -246 115 162 -174 164
5960A64l30K03L38k39L8l8k45Q9J06n8j26K01n9J19m29L86q4j03M29m46J65j51
$$ 164 -166 37 375 136 174 136 -109 -20 86 28 -98 103 44 163 -266 120 36 -67 362 -84 81 -70
5982g0K67j39J42o6k68j30L99J5l9J5r0J9n3K58l78K65k82K69k11K58l8k3j34
$$ -70 197 58 200 134 -134 -264 135 150 111 126 36 55 2 260 -118 147 -135 134 -77 181 143 120 -14
6005a4J49O9k37n3j34L4R2K32k63K9k0K36j38K5j75K70k36O2l6Q9p5K5n1L00k29
$$ -14 135 204 -33 -86 -220 -186 -94 138 -125 -96 -116 120 -18 7 -168 102 -134 -72 -108 -19 -94 -69 -120 180 -49
6030d9Q0Q4R2j18P0j77j74O2J17J5l5L3NN9k5m4Mp9J56j33J92oO6j68j18K62n09
$$ -49 31 115 207 89 159 -18 -192 -130 -13 2 -33 0 5 64 39 -5 -1 -80 76 -57 135 129 195 27 -91 171 -338
6057c38J76J98j83J54j7j55J01%kl8L05k57J76K30m21K67k10Q7n2K53n5l67N1
$$ -338 -162 36 -147 7 -10 -165 -64 -64 -66 -104 201 -56 120 350 -71 196 -14 73 21 274 219 -148 -97
6080i7K19k00lL11j75JJ56k83p1P2J21j43KP4J55l76K74K57k11j28J08j53J51
$$ -97 122 -78 -81 230 55 56 212 -71 -142 -70 51 -92 -90 -16 139 -237 37 294 83 -45 63 -90 61
6103F1j61J74Q1l43L34m4j17J27j72J8P9j57N3K15o2k24O2p6J26j66L9J9N2J09
$$ 61 -100 74 155 -188 146 102 -15 112 -60 -42 37 -120 -67 148 86 -138 -76 -152 -26 -192 -153 -134 -82 27
6127B7Jn7K07k95N3J24j85l9J73n3o9J23j32L54j89J82j61p6k70L68M2r8r3R1
$$ 27 28 -29 178 -117 -64 60 -125 -164 9 -44 -113 10 -122 232 43 225 64 -12 -282 86 128 30 -63 28
6151B8J54l27J33J13J3j20k54J01K90lk57J54m8q8K1K09j49p1K89p07M79Q5j83
$$ 28 182 -145 -12 101 114 -6 -260 -159 131 128 -129 25 -23 -111 -90 119 -30 -101 188 -519 -40 45 -138
6174a38l8J74m0J17j10P5m5L63l03j09M0K12k04p1K66L9r4k6k80R6J49J31o4r3
$$ -138 -176 -2 -42 75 -35 40 -5 358 55 -54 -14 198 -6 -77 189 228 134 108 -172 -76 73 204 140 47
6198D7m4kJ26rk38L04l13j02P3j2O5l1J9J19k2M6L7k16L57n3J68l01O9j16N6R3
$$ 47 3 1 127 118 -120 184 -129 -231 -158 -170 -105 -136 -117 2 -20 26 63 -153 204 151 319 18 87 -29 27 120
6224A20j94J35r8j00M9r5K13J98l37m1J27J21k49j0q9KL82l07J34L73m90J30n3
$$ 120 -74 61 -37 -137 -88 -183 30 228 -109 -150 -23 98 -151 -161 -250 -248 134 -173 -39 334 -156 -26 -79
6247g9J78R6j38J05l29M83l09J32l67N91k91m0M7k96J23J53J7J08k36K1l46L08
$$ -79 99 195 57 162 -167 316 7 139 -228 363 72 32 79 -217 -94 59 76 184 -52 -31 -377 -69
6269f9J94q6k51M09k93O0J07j90K65k89J42p0K64n10J35J17L6J89k22K19k2j01
$$ -69 125 39 -212 197 -96 -36 71 -119 146 -143 -1 -71 193 -317 -182 -65 -29 160 -62 157 135 34
6291C4j76L51m5m40K58j5j44L57j48K06k32p5J89j44L61k93J66m44M42N7k44J17
$$ 34 -142 209 164 -276 -18 -33 -177 180 32 238 6 -69 120 -24 337 44 210 -234 208 265 21 138
6313A38j37l2J27k52K27O0k11K66l2p6j19k51K10K66m61K05j47K55k49L14j07
$$ 138 1 -31 96 -156 71 131 -80 186 154 78 -41 -292 -82 184 -277 -72 -219 36 -213 101 -6
6334fm1J19J58j64J64j06K9j07K1J77j17l67N07k26k7R1k93RP0m2J39K20m81O47
$$ -6 -47 72 230 66 230 124 153 46 67 244 127 -240 267 41 14 105 -188 -179 -109 -151 -12 208 -273 374
6358C74l67K28m58p3K11N6L4K61k69M09m60j25J75jj20L61n0j54P8j80j94M87
$$ 374 7 235 -223 -296 -85 -29 5 266 -3 406 -54 -179 -4 -5 -125 236 186 32 110 -70 -264 223
6380B23m91L61J1k48J10j14J74K1n1J63j78o7J29p6J31k14j8J90j47j11O3N2L2
$$ 223 -268 93 104 -144 -34 -148 26 47 -4 159 -19 -86 43 -33 98 -116 -134 56 -91 -202 -139 -87 -55
6403e5n1N2K51j68j23Lj81J68K25j27j37K53k75L38k57k06Q5L92k09%j56J02j23
$$ -55 -106 -54 197 29 -94 -91 -272 -104 121 -6 -143 110 -165 173 -84 -290 -205 187 -22 -22 -178 -76 -199
6426a99J77J32p7r9K83k49L08o15K98Q7p7N8rr9J33q5j7K69j39Rj35N3l84K10
$$ -199 -22 110 33 -66 217 -32 276 -339 -41 46 -31 27 18 -81 52 -33 -50 219 80 89 -46 7 -377 -167
6450a67l5K63q7n6J29j58K58j32J98n6k25K35k14J09J05k72J48K54n25M49R8m29
$$ -167 -202 61 -26 -82 47 -111 147 15 213 157 -68 167 -47 62 167 -105 43 297 -228 221 319 -110
6472a10J62j08K68l17J80j53J29jk50K39L85j18l52p4j1J01R2j48K63j67J44j12
$$ -110 52 -56 212 -105 75 -78 51 50 -200 39 424 306 -46 -120 -131 -30 62 -86 177 10 154 42
6494D2J53j86pj73J16o6J37k10M09n6j77P3k36K53j30J75m4L7k09NL12j63K07
$$ 42 195 9 2 -171 -55 -121 16 -194 215 159 -18 55 -181 72 -58 117 73 110 -99 -94 218 55 262
6517B62o49N09j98J15j05j1M6K29j15p2k18J23L63m51L00l41L64Q9l96K7L7K67
$$ 262 -387 122 -76 39 -66 -77 -31 198 83 11 -207 -84 279 -172 128 -213 151 240 -156 -129 -92 175
6539A75j89O1k40K86P6o8p1K24j52j23K57m48l4J39J54M1q4nL72k12M3j76l5q3
$$ 175 -14 47 -193 93 169 101 30 254 102 -21 236 -212 -246 -107 47 88 4 -1 371 159 202 26 -9 -92
6563i2K11j46J32k56J1q2J39N3l02M8K84j85L39l45L10l15J51K04l04r0L22j33
$$ -92 119 -27 105 -151 -140 -222 -83 -30 -332 -284 0 -185 154 -191 119 -196 -45 159 -145 -235 87 -46
6585d6K31j90J2j52j66J68J03j95o1M65k78J86K85n36K09R8j92K61l4Rk88j56
$$ -46 185 -5 7 -145 -311 -143 -40 -235 -296 169 -109 77 362 -174 35 133 -59 202 168 177 -111 -267
6607b67K75j80L21k85k6K14M3q3q6J46R2n23M61l6k39K07J37j09o59M58J02J7
$$ -267 8 -172 149 -136 -162 52 95 12 -74 72 164 -359 102 66 -173 34 171 62 -597 -139 -37 -20
6629b0K07l40M3K29m6j79K59J67l54j45K96j15j66J81r9J27M5K1J20j38j03j87
$$ -20 187 -153 -110 119 73 -106 153 320 -34 -179 117 2 -164 17 -82 45 90 111 231 93 -10 -197
6651a97J56j74J95k42K26j32L0k4l4J86K0R8m38K32L99l70J82J03o0j46j1J1k2
$$ -197 -41 -215 -20 -262 -36 -168 -138 -162 -196 -10 10 108 -330 -98 301 -69 113 216 156 10 -1 10 -12
6674a2m7J42K5M7l01J01J75k92P0K04Pq9k79j4J35K91l95J14P8k6N4j4J7o6p6
$$ -12 -59 83 108 155 -146 -45 130 -162 -92 112 119 30 -249 -263 -128 163 -232 -118 -40 -66 -12 -26 -9 -75 -151
6699a51K91k1%m2P4R3q4j81K31l48P3L61k56J7j43l29L60k8K75k17L7j17J1JJ26
$$ -151 140 119 119 77 151 244 160 -21 210 -138 -65 296 40 57 -86 -415 -55 -83 192 -25 12 -105 -94 -93 33
6724C3l2m1J85k24l3N5M7P8j99J82j14J87j39J07K27l80Q5p5r5K97k14K5P9k80
$$ 33 1 -40 145 -79 -112 -57 -10 68 -131 51 -63 124 -15 92 319 -61 24 -51 -146 151 -63 -38 41 -239
6748b39L20l7j40J3R5K9l30L33l61K90j03J70k5kR7m47J85O8K09j8r3J87k05k77
$$ -239 81 44 -96 -83 12 41 -289 44 -317 -27 -130 40 15 13 110 -337 -152 -84 125 107 14 201 -4 -281
6772b81L48j13l4p2n7L37j38N2j49NJ21K14l84L25oM6k63J36n7j15q5j6M0O1m4
$$ -281 67 -46 -80 -152 -209 128 -10 42 -107 -102 19 233 -151 174 168 214 -49 87 30 -85 -170 -186 -146 -85 -129
6797a29j14J02p8J72K02q9J24j62k39K48K13j95R2m8R3k84O9k04M8M8L13J21k43
$$ -129 -243 -141 -219 -47 155 66 190 28 -211 37 250 55 147 99 192 -92 -23 -227 -179 -131 182 303 60
6820F0k71R0L61j59p1q8L7m0o1J82k35J52J33K50k44o7j71O5RJ1J43k71L61m84
$$ 60 -211 -121 240 81 10 -78 -41 -81 -142 40 -195 -43 90 340 96 29 -142 -77 -68 -57 86 -185 176 -308
6844c08M19k35J57j04m0K22J71k05j38k1p1k22M67O2l76M05q5L0o6r2J38k68L4
$$ -308 111 -124 33 -71 -111 111 282 77 -61 -82 -153 -375 92 154 -222 183 98 128 62 -30 108 -160 -126
6867a26J97j7k05L80k65l7J73k61l2L90k78R2j76K64K9j45k65K02j17OK54m3J67
$$ -126 71 54 -151 229 -36 -73 100 -161 -193 197 -81 11 -165 99 128 -17 -282 -80 -197 -191 63 20 187
6890A87l66L42l5J59l32N3l2l53N73k85K75k59J17k87k1K5R1J29j16L03n32L21
$$ 187 -179 163 128 287 -45 8 -24 -377 196 -89 186 -73 44 -243 -264 -239 -148 -19 -135 168 -364 -43
6912d3J31k08j39K90k14L86r2j05j53l3M8j29M07j40j55K85j06p5K32l21J88l22
$$ -43 88 -120 -259 31 -183 203 111 6 -147 -180 -132 -261 146 6 -149 136 30 -45 187 -134 54 -268
6934b68L30n32L33J40j99K57J14j30k52n1L48J31J6m59J74J15j22J37l59J23q0
$$ -268 62 -470 -137 3 -196 61 175 45 -207 -258 90 221 237 -222 -48 67 -55 82 -277 -154 -234
6955b34L72k53M0J7J60j07m04M31J55k67m2J26K87j91j72J21j6k3k53O09l20k19
$$ -234 138 -115 -75 -58 102 -5 -409 22 177 -90 -132 -6 281 90 -82 39 23 0 -253 356 36 -183
6977a83J91j99K24P1k81K02J13p0Pl2P0r7J89k89J92m28M37J9j22J30j63L4r0
$$ -183 8 -191 33 104 -177 25 138 68 75 43 113 16 205 -84 108 -320 117 136 14 144 -19 15 -75
7000g5j11K17j49J32k00J81L0k57K11J02q0L9q5k0K3M3j47L83l20M31l22n6o8
$$ -75 -186 31 -118 14 -186 -5 25 -232 -21 81 1 40 -45 -65 -42 1 -146 237 -83 348 26 -30 -98
7023i8J03m6l33N44n2j35J34m06K53r4Q5l25M23l5K43l99L06l60L02J0j11J24
$$ -98 5 -41 -374 170 118 -17 117 -289 -36 -130 -45 -370 53 18 261 -138 168 -192 110 120 9 133
7045A33l16J15k7M8k01L94l18K96j87J67P2n1k10J17j49M33l04L00l22L8j57K64
$$ 133 -183 -68 -95 -47 -248 146 -172 124 -63 104 176 125 -85 32 -117 316 12 312 -10 28 -129 135
7067A35p7J68k01k31N00K2k09K4k50M9k30K35J35k36N5p4L20j11k66J92J02j42
$$ 135 58 226 25 -206 294 316 107 131 -119 -70 -300 -65 70 -166 -111 -185 135 24 -242 -50 52 -90
7089i0R7J5j3Rn7k03K61lk24K29o3k07K13j07J72%J33k99K05q7P1k34m5L12J5
$$ -90 7 22 9 18 -39 -242 19 16 -208 21 -42 -249 -36 -143 29 29 162 -137 68 -19 52 -182 -227 85 100
7114A00j91j59K30j35nJ45M8Q7j63M3K7J13k37rK05J08j06l18K31p7J75R4l57
$$ 100 -91 -250 -20 -155 -160 -15 33 120 -43 0 27 140 -97 -106 99 207 101 -217 14 -63 112 206 -151
7137a51K59k46R4J57L0p2o6j79K23R2m84L59J49m0P2m11J48L85k61j89O4J75l50
$$ -151 108 -138 -44 113 143 71 5 -174 49 141 -343 16 165 125 197 -214 -66 319 58 -131 -67 108 -242
7160b42K60oK2J81j94j05O7p7L98K0m67J05M3M2j94N09m87K71j63R4L12m37Q5
$$ -242 18 12 34 215 21 -84 -17 -94 304 324 -143 -38 5 47 -147 362 -125 146 -17 77 389 -48 37
7183C7j22k37K46Nj0j65M08j73J28J30l28q5M61l34K17l3l67M20j37o1l43L41
$$ 37 -85 -322 -76 -71 -81 -246 162 -11 117 247 -81 -166 295 -39 178 145 -222 198 61 0 -343 -2
7205bn2L40k86l9q6l1L62j63j94K21o7j04j63L62Q3N2j71k93L83j92J95j70j94
$$ -2 -54 286 0 -39 -125 -156 206 43 -151 70 3 -101 -264 98 181 233 62 -231 152 -40 155 -15 -209
7228b09N37j03Nk85k64K47q7M8J31J1l6m6K6J03P0l15P1J58l43J67L9j68K02K30
$$ -209 328 225 230 -55 -319 -72 -159 -111 20 31 -5 -51 -25 78 148 -167 -96 62 -281 -114 -75 -243 -41 189
7252A89j26j01Q7k5j7J64l33KL93n6l87M0K38lj34K65m19J88N4j3N9J5n9R2j69
$$ 189 63 -38 49 24 7 171 -162 -160 233 177 -210 -170 68 65 -69 196 -223 -35 19 6 65 80 21 113 -56
7277e6n1K18k78P4J67q8L2q6M1N4M37m41k63K26J15l82N35l21N6j34p6K61l51
$$ -56 -107 111 -167 -93 74 -14 18 -68 -27 27 464 23 -240 -14 101 -281 254 -67 -11 -145 -221 40 -311
7300c11J96L94j85j83P8J86P3l24m1P6J27K26r7j46Ok23L15l03J57j9J30n4j7
$$ -311 -115 279 94 -89 -11 175 248 -76 -117 -41 86 312 215 69 75 -148 167 -136 21 2 132 78 61
7323F1j35k9L40J8Q4j50l4n77L16J26j85K44l5P2k76J54J09r0m1j76K82k56R1
$$ 61 -74 -103 237 255 339 189 155 -422 -106 20 -165 79 44 116 -160 -6 103 13 -28 -204 78 -178 -87
7346h7j34J27K70j80P8RK50o65K19K25r8j08K11k62K70j0J0k10k1M24n22K58l2
$$ -87 -221 -94 176 -4 74 83 333 -332 -113 112 14 -94 117 -145 125 115 125 -85 -106 318 -204 54 22
7369B2l1k42J33j5L00q6J00j60k94K32L69l36k14J59k5k0J38j38Q0q3J06K4J2
$$ 22 -9 -251 -118 -133 167 81 181 21 -273 -41 328 -8 -222 -63 -88 -108 30 -108 -28 -111 -5 19 31
7392C1k79L28j28r6j69K63n8M3N4p9j52J55K21k42J74J8p6J18k64J51k5j75J97
$$ 31 -248 80 -48 -144 -313 -50 -108 -65 -11 -90 -242 -87 134 -108 66 84 8 126 -138 13 -12 -187 10
7415A0J36k10n5L45m76Q5K87k17J79l8r2K62k01O0j59j01J29j21L90K93m09J23
$$ 10 146 -64 -119 226 -250 -165 122 -95 84 46 -46 216 15 75 -84 -185 -56 -177 213 506 97 220
7437B20m67j37J23J53J30l8k9K51j82m52L70J33l00N7M92l06j33K89j57j86K2
$$ 220 -247 -384 -261 -108 22 -16 -45 206 24 -428 -58 75 -225 -168 324 18 -115 174 17 -169 -147
7458a47J08K40l06K53J15k51On6l0J87j99k12L33p8R9j39J49r2O5J09k59K02p4
$$ -147 -39 201 -105 148 263 12 18 -38 -68 119 -80 -292 41 -37 62 -77 72 -20 45 154 -105 97 23
7481B3j7K86k46p1J20r0j27J08L21n27K45rJ52K4l75O2o7p5L59J21j84M2L0J03
$$ 23 6 292 46 -25 95 5 -122 -14 307 -220 25 16 168 192 -183 -121 -188 -263 96 217 33 75 105 208
7505B08k95O6j59L2K06R9l17M6K93k50n9J37k8j4k6K96J17l61k38K70J32k63m3
$$ 208 -87 -21 -180 -148 58 157 -160 -114 179 -71 -130 7 -21 -35 -61 235 352 -9 -247 23 155 -108 -151
7528a51K29o6Q1p7k24K21j7q8K56l47J52j59M11m15M64k79j00L9j56J55j0J61
$$ -151 78 12 93 16 -208 13 -4 -92 164 -183 -31 -190 221 -194 270 -9 -109 -70 -226 -71 -81 80
7550H0R7k87K59j88K02k47K3L0p8K2NK31j41r7l10N37l43J31J50j19o7PJ09q3
$$ 80 177 -110 149 -39 163 -84 -61 -31 -109 -87 -82 149 8 -89 -399 138 -205 -74 76 -43 -110 -103 6 -77
7574g7j94P8M71n50L27O9k35P2J26r7k66L52n9K4k1l3N7L5j33J64l4J1k78R6k07
$$ -77 -271 -193 278 -272 55 124 -111 -39 87 -10 -276 76 17 41 20 -13 44 79 -54 110 76 87 -191 -95 -302
7599c02N10j08j4R2p7l15N54l79k47J82J32%q3K86l47J40r7J5rn2J13l0j86K53
$$ -302 208 100 86 178 101 -214 340 -39 -286 -104 28 28 -55 231 -116 24 -73 -58 -67 -119 -6 -36 -222 31
7623C1J36k7j47R7r8K71N5m80r4M59j96Q5R0j93O8j35K0O3l01K96J27j70JK32
$$ 31 167 140 -7 90 -8 263 318 -162 -256 203 7 92 182 -11 57 -78 -58 5 -296 0 127 -43 -42 190
7647A90k08j72Q4M4n2K00N3o5n8j26L18R4j98q3J8R6j28L5M9m75M98l05J78q3
$$ 190 -18 -190 -106 -62 -114 86 139 74 16 -110 208 302 104 21 39 135 7 42 91 -384 114 -191 -13 -96
7671i6K37k56L3j56J45J9k56L3K72M8j07n8M06k62J82j03J18j69k51M76l34L5
$$ -96 141 -115 -82 -238 -93 -74 -330 -297 -25 23 -84 -142 264 2 184 81 199 30 -221 255 -79 -44
7693d4j35L73k80K7L13k75j8l4R0j3j9n3O1j76L80j13nn7j69L64k59L34k42l15
$$ -44 -179 194 -86 -59 254 -21 -39 -73 17 4 -15 -68 -7 -183 197 84 79 22 -147 217 -42 292 50 -265
7717b65K27N7K27l42N4j4R2p7J38k7j26k1J9J9J21m58L35j6o5J60N5j37K53k23
$$ -265 -38 19 246 -96 -42 -56 36 -41 97 70 -56 -77 -58 -39 82 -376 -41 -57 -122 38 93 -44 209 -14
7741a4l38K94J85l60J79M8k64J81K12k0k09K58j13M4L9k60K53l49J23P2R6p6K40
$$ -14 -352 -58 127 -233 -54 -6 -270 -89 123 103 -106 152 39 83 122 -138 115 -234 -111 -39 57 -19 221
7764B21m90R7J95r6L8j06J64N4k62P6J6p6L24j66O7J1q1J84j60k6NN3J36Q1l51
$$ 221 -269 -172 23 -73 -35 -141 23 77 -185 -109 -93 -169 155 -11 56 67 -14 170 10 -16 -11 42 178 259 -92
7789i2m6K5r0J60J4P3p0k89N78j66j25o9J70J46k23q5K31o1J27j62k29p3J21l1
$$ -92 -138 -113 -203 -43 -29 44 -26 -315 263 97 -28 -97 73 219 -4 -89 142 81 208 46 -183 -256 -135 -166
7813a66R5K07K00k73m23N86o4Q6j44r9j45J36J82k27K15j65R4j12R4j20K0J24
$$ -166 -71 136 336 63 -360 226 162 248 104 5 -140 -4 178 -49 166 1 95 -17 77 -43 -23 101
7835A01l06K92j0p6nr7Q1L18l34k81M40K34k81r7J76r3k3l0Q9n8N9q3P0R8p3l89
$$ 101 -205 87 77 1 -4 -101 -20 298 -36 -317 123 357 76 -21 155 62 39 9 98 40 99 16 86 184 111 -278
7861b78J73PJ94l2o4L1K0k81k31O30k3n0k96K09L11j28k27nJ50r4k89M51k63j78
$$ -278 -105 -98 96 64 0 31 51 -230 -461 169 146 96 -200 9 320 192 -35 -40 110 16 -273 178 -85 -263
7885b63M15r7k27J99L4O4j52J83j50j2j78L44l04L5P1o3PK20q4Q3k88L38P2q0
$$ -263 152 55 -172 27 61 125 -27 156 6 -6 -184 160 -144 -109 -38 -101 -94 126 42 125 -163 175 247 167
7909A67k11p5k21K68o2oJ96L2j53K1j05J63l29K23M72m92K41k39j5M4j12NK95
$$ 167 -44 -119 -340 -72 -134 -140 56 88 -65 -44 -149 14 -315 -92 380 -112 129 -110 -125 -81 -193 -188 107
7932A07j23q5o9N7L00k72K20L1j02L8j2Qo0k60J59J89J13j58l5k94L5J67J49j90
$$ 107 -16 -101 -170 -113 187 -85 135 166 64 102 90 98 38 -222 -63 126 239 81 46 -248 -213 -46 103 -87
7956h7L12k70J64r9K6P4k76J88O2J00k32K4K91l23J9j72K08k94L63q3Pm3J15k0
$$ -87 225 -45 119 20 46 120 -156 32 94 194 -38 -14 277 -46 -27 -199 9 -285 78 -5 2 -41 74 54
7980E4J56l93J53j49L53k09k1j02J66L09l61N1L43l31k89M07l42M40M5l69j39
$$ 54 210 -183 -30 -179 174 -35 -56 -158 8 317 -44 7 350 19 -270 137 -205 235 280 -89 -228
8001b28K12o7k91M38k76J64r3j7M60m43J24j51RL09j47j09J09n4j57k2J02K41
$$ -228 -16 -83 -374 64 -212 -48 -141 -158 302 -141 -17 -168 -159 150 3 -106 3 -51 -208 -230 -128 113
8023A13p1O2j67J04j58K7K28j42j61r7N77m49K03j28J12q4k8L8j72N1J71R8J04
$$ 113 42 104 -63 41 -117 -90 138 -4 -165 -262 315 -134 69 -59 53 -31 -59 -21 -193 -142 29 127 231
8046B31r2J10k83j47pK81O0j57J39jq9J36l38J69n2K01r8J47j74k76K03j26J2
$$ 231 139 249 -34 -181 -188 93 153 -4 135 134 45 181 -157 12 -40 161 63 210 36 -240 -37 -163 -151
8069a51R9j92L06R6m9k37L60Q3m34k57N31O6m48K18K89j59k6K9j49%l3J2R0o2
$$ -151 -52 -244 62 158 109 -128 232 315 -119 -376 155 221 -227 -9 280 121 95 124 -25 -25 -58 -46 44 -18
8093a8n1J07m3J73n9k69L29j89%n3R4q5R9K18m67J68L1r3m3O6j03k9K89R2r6j66
$$ -18 -69 38 -5 168 109 -160 169 -20 -20 -73 21 -64 35 253 -214 -46 -15 -108 -151 -85 -188 -217 72 164 68 -98
8119i8K16l5m4mJj27R0J33J1k84r0K05k56J69p6J41O7l2k76K47J60j26K08o0J10
$$ -98 118 83 39 35 36 -91 -1 132 143 -141 -231 -26 -282 -113 -189 -48 19 -13 -289 -42 118 -8 200 140 250
8144B50J16p5r4k76j13K64J06l18K4j0Q8K7M2J23j74m6L58j27m02L83j06j79J51
$$ 250 366 291 197 -79 -192 72 178 -140 -116 -126 -38 -11 31 154 -20 -66 292 165 -237 146 40 -139 12
8167A2K10k86J60k05J29J0q8P9K7k24K11Jj72K47j44j2k3m8Q4J7L77n37Q8K61
$$ 12 222 -64 96 -109 20 30 -58 21 48 -176 35 36 -136 111 -33 -45 -68 -116 -32 -15 362 -175 -87 174
8191A74
$$ Imaginary data points
##PAGE= N=2
##DATA TABLE= (X++(I..I)), XYDATA
0@%%%%%%%%%%Qj6J6j6K4l2M0n4O2p2Q8j04J28j52J76k08K44k84L27l76M31m92
$$ 0 0 0 0 0 0 0 0 0 0 0 8 -8 8 -8 16 -16 24 -30 32 -40 48 -56 72 -80 96 -112 132 -152 175 -201 230 -262
32b62N61o36P18q11R13j024J146j280J424j583J758j949K159k386K634k907L203
$$ -262 299 -337 381 -430 483 -541 605 -675 749 -834 924 -1025 1134 -1252 1382 -1525 1678
49A678l528L888m284M718n203N749o358P044p830Q742r807J1073j2611J4521j6968
$$ 1678 -1850 2038 -2246 2472 -2731 3018 -3340 3704 -4126 4616 -5191 5882 -6729 7792 -9176
64i176K0235k4845L1884m4078P1091k40872R5931L05456l14504L2217J41059j06026
$$ -9176 11059 -13786 18098 -25980 45111 -195761 -99830 205626 -108878 -76661 64398 -41628
76d1628j5011K38618j07253j78310J60405J27687j95840n8526Q5716k6841j8565
$$ -41628 -56639 181979 74726 -103584 56821 184508 -11332 -69858 15858 -10983 -29548
87b9548Q0190o7475r4133P0202Q4695n4756n6593K3447O0846J1451k9880l914
$$ -29548 50642 -16833 -110966 -40764 43931 -10825 -67418 -43971 16875 28326 -1554 -5468
99e468L2948J0599J3328J0762n3578m3709P0884L0049j02167l5041N8870l1939
$$ -5468 27480 38079 51407 62169 8591 -35118 35766 65815 -36352 -71393 -12523 -44462
111d4462l0535P3053l126n9129Q1275O4814r5461k0596J15326O452q1321Q080
$$ -44462 -74997 -1944 -5070 -64199 17076 81890 -13571 -34167 81159 87611 6290 14370
123A4370R203n5635J1928M2492n1151l4125N7189J3199m7551M172M1218J2459
$$ 14370 23573 -32062 -20134 22358 -28793 -62918 -5729 7470 -40081 -35909 5309 17768
135A7768q3K749j4026j1441K7294K5511l0714l4010K2841J9839l4604k3714K4985
$$ 17768 17685 20434 6408 -5033 22261 47772 17058 -16952 5889 25728 -8876 -32590 -7605
148g605N986k2029P485M700k6391K0819N0157k1602k8593L9961J3606l4535J2095
$$ -7605 -1619 -23648 -16163 -11463 -37854 -17035 33122 11520 -17073 22888 36494 1959 14054
161A4054K7496k8761j9844K1531j9786m0155K2537K6755k5763n607K3719q014
$$ 14054 41550 12789 -7055 14476 -5310 -45465 -22928 3827 -21936 -27543 -3824 -11838
173a1838m330K8237R219j1325Q906Q489j4969r039J0788j967j7977n61M650j6314
$$ -11838 -16168 12069 21288 9963 18869 27358 12389 3350 14138 12171 -5806 -6367 -1717 -18031
187a8031j1331J5306J0605j0907n553J6953J0258n991R212J1714j1623J617J4099
$$ -18031 -29362 -14056 -3451 -14358 -19911 -2958 7300 1309 10521 22235 10612 12229 26328
200B6328j8265j8178K1898P364l3124j2301J8369m508j3395J7040R279j4846J0460
$$ 26328 8063 -10115 11783 19147 -13977 -26278 -7909 -12417 -25812 -8772 507 -14339 -3879
213c879J8185j5979k720K9495L264k2045O71O577j3523n852J0542p377j3677J0796
$$ -3879 14306 -1673 -4393 25102 28366 6321 6992 13569 46 -5806 4736 -2641 -16318 -5522
227e522L807k2443K039K5039j971j3356J2421J2648q582n10J5323k659j1385Q600
$$ -5522 -1715 -24158 -22119 2920 949 -12407 14 12662 4080 3570 18893 16234 4849 13449
241A3449J245k0932j010J3653j3701j7103J1555P545j0905K462J7117k01n857
$$ 13449 14694 -6238 -7248 6405 -7296 -24399 -12844 -5299 -16204 -13742 3375 3174 -2683
254b683J1998M778j0205P112J0777j3661j1656P440j327j4347l3R488l011n519
$$ -2683 9315 14093 3888 11000 21777 8116 -3540 3900 2573 -11774 -11807 -2319 -5330 -10849
268a0849O939M78o832J0899J0674j1374l957J4343K1j4469L244J2327n807q830
$$ -10849 -3910 -3432 -10264 635 11309 -65 -4022 10321 10342 -4127 -883 11444 5637 -3193
282c193P483m14j2124M983O429j2393m215J2794j47r836O658J1809m170l264R864
$$ -3193 4290 3876 -8248 -3265 3164 -9229 -13444 -650 -797 -10633 -3975 7834 3664 400 10264
297A0264n29q085O539L011j4201l804P636m908r609N131P847m110j131P843K14
$$ 10264 9735 1650 8189 11200 -3001 -6805 831 -4077 -13686 -8555 -708 -4818 -5949 1894 2108
312B108j946R023J828j0239K065O970r388r347P079M787q824j924Q674j586n673
$$ 2108 162 9185 11013 774 2839 9809 421 -8926 -1847 2940 -5884 -7808 866 -720 -6393
327f393P488L094p616M083O933p163o245Q453M089p516n32O990k860n442M329
$$ -6393 1095 4189 -3427 656 7589 426 -5819 2634 6723 -793 -1325 5665 2805 -2637 1692
342A692r79o936M081M232q590k198Q538K102n669L029P555j993k824M683p57n625
$$ 1692 713 -6223 -2142 2090 -6500 -8698 -160 1942 -3727 -698 6857 4864 2040 6723 5966 341
358C41L947K56j0569k131P421j759p576M259P621m048j731Q191N66l751N395J408
$$ 341 4288 4544 -6025 -8156 -735 -2494 -10070 -5811 1810 -2238 -3969 4222 4788 1037 6432 7840
374G840q586m77O746l683p372L929M917o418l282N713n66k162M508n17n284L650
$$ 7840 -746 -1223 5523 1840 -5532 -1603 3314 -3104 -6386 -673 -1239 -3401 1107 590 -4694 -1044
390a044N414l878k871O685K755o927j239N666k268l442K842j578n687K489L050
$$ -1044 4370 492 -2379 4306 7061 134 -1105 4561 2293 -1149 1693 115 -5572 -3083 -33
405c3m693j187P117J346o356J755P363j925k675M770j237n801J638K691m956j762
$$ -33 -4726 -5913 1204 2550 -3806 -2051 5312 3387 712 5482 4245 -1556 82 2773 -2183 -3945
421c945N238k65o126J053N855j577j796L848q88l314L175J444l565P32M231j885
$$ -3945 1293 1028 -5098 -4045 1810 233 -1563 2285 1397 -1917 1258 2702 -863 -131 4100 2215
437B215n759K267M341l337k190M100j816l587L390J815l552K042M496l364n454
$$ 2215 -3544 -1277 3064 -273 -2463 1637 -179 -3766 -376 1439 -2113 -71 4425 1061 -4393
452d393L927M550m182j236M025k460l656L654M45k961K047L990m168l728M558
$$ -4393 -466 4084 -98 -1334 2691 231 -3425 229 674 -2287 -240 3750 -418 -4146 412
467D12L175m202N0L575k415k979K541k51j668K631J213m414j323M275J261l867
$$ 412 3587 -615 -565 3010 595 -2384 157 -94 -1762 869 2082 -2332 -3655 620 1881 -1986
483a986J186L037k625j700L444N55j468K292j34m341p69M196m6m715J410K643
$$ -1986 -800 2237 -388 -2088 1356 1911 443 2735 2601 -1740 -2509 1687 1641 -3074 -1664 979
499I79l670j395L286J401p11K523M66l639L66L595r85k890J817J705m593j841
$$ 979 -2691 -4086 -800 601 -110 2413 2879 -760 -394 3201 2216 -674 1143 2848 -1745 -3586
515c586K720J39m53J767o27k171J127K729j160j614L171O39l951k29L149o07r19
$$ -3586 -866 -727 -1180 587 -40 -2211 -1084 1645 485 -1129 2042 2681 -1270 -1499 1650 1043 124
532A24J733r67k846J690K083k408j735K389K79m308O41M684n92p98K186j203j354
$$ 124 1857 890 -1956 -266 1817 -591 -2326 63 342 -3966 -3325 1359 767 -31 2155 952 -402
549d02J782J673k390r50K488j594m553J146L447j451j69J591q46j028J924P14
$$ -402 1380 3053 663 -287 2201 607 -3946 -2800 647 -804 -973 618 -228 -1256 668 1382
565A382q95L81K006k359l226J645K228j789k50J649r40j180J854J094j757K82
$$ 1382 487 868 2874 515 -2711 -1066 1162 -627 -877 772 -168 -1348 506 1600 -157 125
581A25J811k047l198K846K611k856o18K413j103j826K732J248k531M61J731l023
$$ 125 1936 -111 -3309 -463 2148 -708 -1326 1087 -16 -1842 890 2138 -393 68 1799 -1224
597a224k190M049J187k781R83J576k298n52K856p12r60J749L82m130n81K977k58
$$ -1224 -3414 635 1822 -959 24 1600 -698 -1250 1606 894 -66 1683 2065 -2065 -2646 331 73
614G3k288J595J618k061K31K147l39k04J589j82k677k47K233p73k446K77J623
$$ 73 -2215 -620 998 -1063 -832 1315 976 772 2361 2179 -498 -745 1488 715 -1731 -1454 169
631A69j487q12K011M61p41J068k26j516M68K973p43k493J785Q86k925J89J915
$$ 169 -1318 -2130 -119 342 -399 669 443 -1073 -605 2368 1625 -868 917 1803 -1122 -933 982
648I82o30n63J081j337k182J294K179j474n16K087l74j885J116J483n9n3P35r99
$$ 982 352 -211 870 -467 -2649 -1355 824 -650 -1166 921 547 -1338 -222 1261 1202 1149 1884 885
666H85j178N51J030j768j261J734K49k317K14J633K21k99L86N07o15R10R26j307
$$ 885 -293 258 1288 -480 -1741 -7 242 -2075 -1861 -228 -7 -306 80 587 -28 882 1808 501
684E01p84J985o45k583R68J969j493r74O95l34j008J754Q45j290J60J811j452
$$ 501 -283 1702 1057 -1526 -558 1411 -82 -1056 -361 -695 -1703 51 896 -394 -234 1577 125
701A25j665K270Q12j498K18N26r75n82R65j16n96L35J338j638j165J416R93j187
$$ 125 -1540 730 1542 44 262 788 -187 -769 196 80 -516 -181 1157 -481 -1646 -230 763 -424
719d24k45J196j98m83K39N44n41j72J003r04j357J656M60j895J53J586r11m07
$$ -424 -669 527 329 -154 85 629 88 -84 919 15 -1342 314 774 -1121 -968 618 -293 -700
737g00J253k9r80J016P77j839m16J975l46j853O39M49j042l8J316O7l68R78J00
$$ -700 553 524 -456 560 1337 -502 -918 1057 711 -1142 -503 -54 -1096 -1134 182 249 -119 859 959
756I59j440K71J301k88j188Q29J81q89l91K9L34j31M00L74j154N65O95o20p24
$$ 959 -481 -210 1091 803 -385 444 625 -264 -655 -626 -292 -423 -23 351 -803 -238 457 -163 -887
775h87J214P99r89n14Q96k4m93N90j86j017N35Q49j273q77J466j50r04r2J059
$$ -887 327 1126 137 -377 519 495 2 592 406 -611 -76 773 -500 -1377 89 -61 -965 -1057 2
794BJ94j4N84j94n67R35M82j317l67J479r12j681L84O51L6l16J44J98k91M44N67
$$ 2 196 182 766 572 5 940 1422 105 -262 1217 305 -1376 -992 -341 -305 -621 -477 -279 -570 -126 441
815D41n51M59J143q53j126M72Q27r23k7R5j67m76O59N7j001N30R30p06q79O95
$$ 441 -110 349 1492 639 -487 -15 812 -111 -138 -43 -210 -686 -27 30 -971 -441 489 -217 -1096 -401
835d01J049o72P4O76l07k04L55K21p99M37N78j267q08N86M41l37mL77l55J20K77
$$ -401 648 -24 50 726 419 215 570 791 -8 429 1007 -260 -1068 -482 -41 -378 -382 -5 -360 -240 37
856C7M30n83Q22M29j222m74O55J92m15pL04k20o94O81m7m16J024N60j587j29J057
$$ 37 467 -116 706 1135 -87 -561 94 286 -129 -136 168 -52 -746 -65 -112 -528 496 1056 -531 -660 397
877C97l17k35o6P45m15p77L94J92o8M07M98j353L92O78k26o75M23M63p25l55N40
$$ 397 80 -155 -221 524 109 -668 -274 -82 -150 257 755 -598 -206 472 246 -429 -6 457 -268 -623 -83
898h3J87l41O39k47p94J64R57o40p7L67O9k09p00R11O5J19M4O7j211O45M01l37
$$ -83 104 -237 402 155 -639 -475 482 -158 -235 132 201 -8 -708 203 268 387 431 498 -713 -68 333 -4
920dm5K85j00p38j43L15M71k56L28J98n92L93P07j044J8Q65q6r49J74L37k10r7
$$ -4 -49 236 136 -602 -745 -430 41 -215 113 311 -281 112 819 -225 -207 658 572 -377 -203 134 -76 -173
942a73J82n31l03Q97J21n34L92O71k31q82J73N99k28J15P3m64j76L05N0o31N63
$$ -173 9 -522 -825 72 193 -341 51 722 491 -391 -218 381 153 268 341 -123 -299 6 56 -575 -12
963a2N07l74m96k24O70m22j8P68l74m23M03O05m59N05K85p50o71N56K11n07L1
$$ -12 495 121 -375 -599 71 -351 -369 399 25 -398 5 610 151 656 941 191 -480 76 287 -220 -189
984a89L81n69l06O05n3q9L98L26o45n57O01O10p23K90K53l42n22K45N71l85P59
$$ -189 192 -377 -683 -78 -131 -220 178 504 -141 -698 -97 513 -210 80 333 -9 -531 -286 285 -100 659
1005F59k44p70P9K38M29n11J80J1m85Q6J23M91j16K71Oq53K67O11n9j19j78K80
$$ 659 415 -355 -276 -38 391 -120 60 71 -414 -328 -205 286 170 441 447 -406 -139 472 413 294 116 396
1027C96n39l56M74J59j70J97j05m64M36J72k70j40M07K05n74j73N77J61k70R6
$$ 396 -143 -499 -25 134 -36 161 56 -408 28 200 -70 -210 197 402 -172 -345 232 393 123 219
1047B19l83k06N30K97m31J51j61K13n97N0J61K26k10P7M8j0K41N48n15K06k49
$$ 219 -164 -370 160 457 26 177 16 229 -368 -318 -157 69 -141 -64 -16 -26 215 763 248 454 205
1068B05J9k69n28N87%l51M52k68k56M45K31q14N92N06l84n24l9Q09n87M01L05
$$ 205 224 -45 -573 14 14 -337 115 -153 -409 36 267 -547 45 551 167 -357 -396 413 -174 227 532
1089E32p81J36L94j44q5J67J47q16K55J42N3j50j73L27Qj91J85K27K0j55nr7j33
$$ 532 -249 -113 281 137 52 219 366 -450 -195 -53 0 -150 -323 4 12 -179 6 233 253 98 93 -4 -137
1112a37J75K60k22k24L26l28J2L27l27L8K39L5l56k4M75J43m27J90k24j7k05M96
$$ -137 38 298 76 -148 178 -150 -138 189 -138 -100 139 174 -182 -206 269 412 -15 175 -49 -66 -271 225
1134B25k70J30K72l95k24J00L05o1r4K59o8n83J84L82o8k85K09J88l97j02K76
$$ 225 -45 85 357 -38 -262 -162 143 82 -12 247 179 -404 -220 162 94 -191 18 206 -191 -293 -17
1155a7K26j01P1q2l07j73J68L05k1O6Q3l21j3K98O8l35J28Rl56r3N88j01k15N15
$$ -17 209 108 179 97 -210 -383 -215 90 69 135 218 -103 -116 182 250 -85 43 52 -304 -397 191 90 -125 390
1179C90n03l3K80J90k73J10j2j48l31K66J7K8j91K18o9l70M99K45k71L40j3l87
$$ 390 -113 -146 134 324 51 161 149 1 -330 -64 -47 -19 -210 8 -61 -431 68 313 42 382 369 -18
1201a8j88K43K82k47N0k37l0j06J52L9l00J20L52k1k96M29k16L7j31L21O9m20
$$ -18 -206 37 319 72 122 -115 -145 -251 -99 -60 -360 -240 112 91 -205 224 8 45 -86 235 304 -116
1223a16L83j56k39M4O40m47j62L2J54m36K23J4l57L00L57o1l09M30k13M0j11k1
$$ -116 267 111 -128 -84 556 109 -53 -21 133 -303 -80 -66 -423 -123 234 173 -136 294 81 121 10 -11
1245a1J92M1k54l5n9k68J04j71K99L78m9j39k14L60P9l33K43J66m66K3L15k29
$$ -11 181 222 -32 -67 -126 -394 -290 -461 -162 216 167 28 -186 174 253 -80 163 329 -137 -114 201 -28
1267b8r9Q4J31l25J73R3j05J52k27K47k43L58k73L33J28k07j39l15J17J69o4l2
$$ -28 -127 -43 88 -237 -64 29 -76 76 -151 96 -147 211 -62 271 399 192 53 -262 -145 24 -40 -72
1289g2J27Ko1J67k92j30M10j49J67j38r7K19o2OQ1j96j36j00K53q8K4J28j88k34
$$ -72 55 57 -4 163 -129 -259 151 2 169 31 -66 153 91 97 178 -18 -154 -254 -1 -89 -65 63 -125 -359
1313c59M69K05j84k44M8K78k78J81k49O6k9j14J80j09M3J38n95P09n1k98K6mJ39
$$ -359 110 315 131 -113 -65 213 -65 116 -133 -67 -96 -210 -30 -139 -96 42 -553 156 105 -193 -167 -171 -32
1336c2K13k0p5M7m11J90K74n68N10K24o38J99J68l73J50N1N0K07k97L27l7oM74
$$ -32 181 161 86 133 -278 -88 186 -382 128 352 -286 -87 81 -292 -142 -91 -41 166 -131 196 159 153 627
1359F27m10j45r1K01l07j13K25l20K29k42K73K22k75O7J60k2o2L51l34L3K58r9
$$ 627 217 72 -19 182 -125 -238 -13 -333 -104 -346 -73 149 -126 -59 101 79 17 368 34 67 325 226
1381B26l08L93m92K06p3K10K8n04J48J53k6M3q5K02P0J72k78j81J42K28j14j15
$$ 226 -82 311 -181 25 -48 162 190 -314 -166 -13 -39 4 -81 121 191 363 85 -96 46 274 160 45
1403D5j03j03K0l8J71J55k52J49j08j14K66j26Kk0K1q3K48k15R3jJ83l96J14K71
$$ 45 -58 -161 -141 -179 -8 147 -105 44 -64 -178 88 -38 -36 -56 -35 -118 130 -85 8 7 190 -206 -92 179
1427A79k33J43P4p3j08Q4q0J63M42p6m06k23NJ23o7j0p8j83P6K17R2o2L23p4l84
$$ 179 -54 89 163 90 -18 66 -14 149 591 515 109 -114 -109 14 -53 -63 -141 -324 -248 -31 61 -1 322 248 -136
1452a36O2j18J27j6K27k32j3j11J82P0J6j45J66J7n3KK1J21p9j25l9o5J14j53
$$ -136 -74 -192 -65 -81 146 -86 -99 -210 -28 42 58 -87 79 96 43 45 66 187 108 -17 -56 -121 -7 -160
1476a60K42L7q3j68J6J60j01P5L0r6O1R3m1q1N2K55j08l32N5P3K38l52L59q0k36
$$ -160 82 119 36 -132 -116 44 -57 18 48 -48 13 106 65 -16 36 291 183 -149 -94 -21 217 -135 224 144 -92
1501i2j3n1O5J83m18J70K43l22K85Mk6j1L9j9M3ooN2kj94M7k74L46j33J94k77
$$ -92 -105 -156 -91 92 -326 -156 87 -235 50 54 28 17 56 37 80 74 68 120 118 -76 -29 -303 43 -90 104 -173
1527a73L72j17q5m6L2L02k08j39r1J43o0J95j33K01Q2k71P1m86M35J97k85l05
$$ -173 199 82 -3 -49 -17 285 77 -62 -153 -10 -70 125 -8 193 275 4 75 -411 24 221 -64 -369
1549c69N39J34l5p8j41J14l73K45j6l1O0n8J29k68Kj9j40K92K60j88l6O4J51j22
$$ -369 170 304 269 191 50 164 -209 36 20 -11 49 -9 120 -148 -146 -165 -305 -13 247 59 23 87 238 116
1573A16R5p5j02K06j08k03j09K62J24j58K2l52J75J47j34J22k43K48j93Q6J4p6
$$ 116 211 136 34 240 132 -71 -180 82 206 48 70 -282 -107 40 -94 28 -215 33 -160 -74 -60 -136
1595a36M72j67k24L0J39N5j49j74K51j39kO2o5o9L31m5k84R4j97L72J0k6j63K5
$$ -136 336 169 -55 -25 114 169 20 -154 97 -42 -44 18 -47 -116 215 170 -114 -20 -217 155 165 139 -24 1
1619AJ8mq6O6o2l8K85m57J53Q1L12m88j51L71L73l74O0j81K51k49j3j67J63jM2
$$ 1 19 15 -71 -5 -67 -105 180 -277 -124 -43 269 -219 -370 1 374 0 60 -121 130 -119 -132 -299 -136 -137 -95
1644i5P4J00n8q0l8K60J5j09J21n2k66M53o45K22j00J10K65k34k77O74m40J82
$$ -95 -21 79 21 -59 -97 163 178 69 190 138 -128 325 -320 -98 -198 -88 177 -57 -334 340 -100 82
1666H2j56%J39O9m1K75k36k30L25l5l34J38j02K52k13n6k95K66K55q7J54m0j28
$$ 82 -74 -74 65 134 93 368 132 -98 227 192 -142 -4 -106 146 -67 -123 -418 -152 103 16 170 130 2
1689BK90Nm37j4L34j5k18K2J30j49j16J73k73J04J05J2L7J18j21j68O4J27j83
$$ 2 292 297 -140 -154 180 165 -53 -31 99 -50 -166 7 -266 -162 -57 -45 -8 110 -11 -179 -115 12 -171
1712a71J66l6j06J39n2K25j69j18KJ31j99K75K5k11n0J92m6j02J82j03j0K29j28
$$ -171 -5 -41 -147 -8 -60 165 -4 -122 -120 11 -188 87 112 -99 -149 43 -3 -105 77 -26 -36 193 65
1735F5m2q3J63j77j49M41k07K01l36J92J23L6l79J16p4K19o7j4j11J7j66K46j23
$$ 65 23 -60 103 -74 -223 218 11 212 -124 68 191 227 -152 -36 -110 109 42 28 -83 -66 -232 14 -109
1758a09r8j1J29N01j99L4k76L3J50j65O6k93J66M9L09n02K61j14j17K71j31P8
$$ -109 -207 -218 -89 412 213 247 -29 4 154 -11 55 -238 -72 -23 286 -216 45 -69 -186 85 -46 32
1780C2J6j13L28m35J97L89l42L75p13L17j85K92k30j50NL80m5k48m5J14M7n1L95
$$ 32 48 -65 263 -172 25 414 72 447 -266 51 -134 158 -72 -222 -217 163 118 -130 -175 -61 -14 -65 330
1803C30j07j67k55K97j19J48j30q5J16rj20L81l57o2o9RM8J28q6Q7j26L59l37
$$ 330 223 56 -199 98 -21 127 -3 -88 28 19 -101 280 -77 -139 -208 -199 -151 -23 -109 -22 -148 211 -126
1826a26Q7%m9k3N7J83k46K49l19L33k54J97k83O2J91J60j90j1Q4j88J24K0r5O3
$$ -126 -39 -39 -88 -111 -54 129 -117 132 -187 146 -108 89 -194 -132 59 219 29 18 102 -86 38 58 -37 26
1850B6k9L0k15K87p3K10lo9k65K85j07k34p1P4M88l32J43r3J87k03j10J38l9r4
$$ 26 -3 27 -188 99 26 236 233 164 -101 184 77 -157 -228 -154 334 2 145 52 239 36 -74 64 25 -69
1874f9M6jO6K8Q0k35M10j05k62J91j83j90M1J14L4o9j4r3J84J19j73L23n14J53
$$ -69 -23 -24 42 70 150 -85 325 220 -42 149 -34 -224 -183 -69 -35 -104 -118 -211 -27 92 -81 242 -272 -119
1898a19K06M1r2P8j35l2J37k2l3l68K61O9j35K07j55j20M58l60J21O5J7r8J3q0
$$ -119 87 128 36 114 -21 -53 84 62 29 -339 -78 -9 -144 63 -92 -212 246 -114 7 72 89 -9 4 -76
1922g6k5L61k69l3n3k1l5M37n26K14P4L0q8N4M4j47K15j35j60K35o4j73K08m4
$$ -76 -101 260 -9 -42 -95 -116 -151 286 -240 -26 48 78 -10 44 88 -59 156 21 -139 96 32 -141 67 23
1946B3j2o4Q9r2J66r5M2o7O4k72L62j3j59k62K27J18R2j50k10K44k87L40k4Q6
$$ 23 11 -53 36 -56 110 15 57 -10 54 -218 144 131 -28 -290 -63 55 147 -3 -213 31 -256 84 60 146
1970A46m18J02K82l2j10j47N6J68kj61m7K52k73MJ57K81l53J59r4j75R2Q1m5J83
$$ 146 -272 -170 112 80 -30 -177 -121 47 45 -116 -163 89 -184 -180 -23 258 -95 64 -30 -205 -113 -32 -77 106
1994A06j94K25j31j20K20k59K02N0N1j56r9j16J98M2Q4M4l01N3J90K19j56l9K79
$$ 106 -88 137 6 -114 106 -153 49 99 150 -6 -105 -221 -23 19 103 147 -154 -101 89 308 152 113 392
2017C92m22O1l11L61k2q9J54L7n3q8J54j84Q6j13J74k82K08r9L7J56m02J19L2
$$ 392 -30 31 -280 81 59 -30 124 161 108 20 174 -10 76 -37 137 -145 63 -36 1 157 -245 -126 -94
2040i4j7q3K68m37L97o9k84M01j66J54P6k32K70l43M13m28J22K12pk79J9K87k13
$$ -94 -111 -194 74 -363 34 -35 -319 82 -84 70 146 -86 184 -159 254 -174 -52 160 153 -126 -107 180 -33
2063c3J28j16Q7l51J49lq6P9M17k32J26k34L3J86k95K32k02qQ1j12K69p8q9j5
$$ -33 95 -21 66 -285 -136 -139 -225 -146 271 39 165 -69 -36 150 -145 87 -115 -123 -42 -154 115 37 -52 -67
2087f7j67OK20K3J06o9J86l50r4L14K5r5k1J45j63k2K5k05K70%Q0j00j31K41j97
$$ -67 -234 -228 -8 15 121 52 238 -112 -206 108 133 38 17 162 -1 -23 2 -203 67 67 147 47 -84 157 -40
2112d0j23J78lm81O59j67j65pQ3k20M11j00j14K57k12j7q7J80l5J99k65L05K7
$$ -40 -163 15 12 -469 190 23 -142 -149 -66 -286 125 25 -89 168 -44 -61 -148 32 -3 196 -69 236 263
2135B63j51R9j57j8p1J74k22L14m57J42OL17j22ok86K90k9j59J49j96o1o2K52
$$ 263 112 211 54 36 -35 139 -83 231 -226 -84 -78 239 117 111 -175 115 86 -73 76 -120 -181 -243 9
2158IR8j2j49k2o0K67k0m9j5n9K42j70R2l37J29K05Q4j38k2j78K44m4k42l07P51
$$ 9 107 95 -54 -76 -136 131 111 62 47 -12 230 60 152 -185 -56 149 233 95 73 -105 139 95 -147 -454 297
2183B97j61q0p4RJ80K9l15j42L79J64m11L64j73n3O3k67P8J79k43M08m45M05m06
$$ 297 136 56 -18 -9 171 200 -115 -257 122 286 -125 239 66 13 76 -191 -113 66 -177 231 -214 191 -215
2206b15J93J32j82J64k1N9M8k14j60P0P1k15j67L99j03K26L0j05jmp8K88j96K88
$$ -215 -22 110 -72 92 71 130 178 -36 -196 -126 -55 -270 -437 -38 -141 85 115 10 9 5 -73 215 19 307
2230C07m01L24k8k95J06m0j34L20n04L94j92J55K6l7j82L20o1J9k23K61q1p5J00
$$ 307 -94 230 202 -93 13 -27 -161 159 -345 49 -143 12 38 1 -181 139 78 97 -126 135 54 -21 79
2253G9kp6L8J46l4k63J58k66p2L3K77j15K36O9l13K38j26K93l11j70J32J58j46
$$ 79 77 1 39 185 151 -112 46 -220 -292 -259 18 -97 139 208 -105 133 7 300 -11 -181 -49 109 -37
2276c7J79k91J80j55J25K20m45J61J38j86J0k1J27j16J7m7R3J94j01j01P8p9j8
$$ -37 142 -149 31 -124 1 221 -224 -63 75 -111 -101 -122 5 -111 -94 -141 -48 146 45 -56 22 -57 -75
2299g5J04K15k12R8N0m37K75O3l6K15j74r1l40M38m4o7J12q3j85m0L29J60m58
$$ -75 29 244 32 130 180 -257 18 81 45 260 86 -5 -345 93 49 -18 94 11 -174 -214 115 275 -183
2322a83K98oRk40J46k2J27k44J28K87l43NK06j99q7k7J10j20R7j13J52J65J26
$$ -183 115 109 118 -122 24 2 129 -115 13 300 -43 -38 168 -31 -118 -145 -35 -155 -58 -171 -19 146 272
2345B72j72mNr6K28k06o0R2m2o4j62J84o2r5J84J9J30r4k00O5P7Q0n5K46j74j49
$$ 272 100 96 101 5 233 27 -33 59 17 -47 -209 -25 -87 -182 2 21 151 57 -143 -78 -1 79 24 270 96 -53
2371e3P6q3j54L11K5l58N6Q3l1L05j08Q4pj73R9l1j20j49J14L66k31j57q3J47
$$ -53 23 -60 -214 97 122 -236 -180 -97 -128 177 69 153 146 -27 72 41 -79 -228 -114 252 21 -136 -219 -72
2395g2R5J89k00mO6J07k34J31M5Jj83K6o6K07l18K16o8J51j11J98%j18j08m3J27
$$ -72 23 212 12 8 74 181 -53 78 123 124 -59 -33 -99 108 -210 6 -62 89 -22 176 176 58 -50 -93 34
2420C4P9k44Q5l8M30k70j26nK08j35Q8j38R0L1J35j03k03K2K04l23L03J32k45
$$ 34 113 -131 -46 -84 346 76 -50 -55 153 18 106 -32 58 89 224 121 -82 -60 144 -179 124 256 11
2443A1j65K31J97L8l04n8o7m8J41J99k72q0k4K33k18K35M7nK7n90M34%J38n6J41
$$ 11 -154 77 274 312 8 -50 -117 -165 -24 175 -97 -177 -201 32 -186 49 96 91 118 -472 -38 -38 100 44 185
2468A85k09j5K73K2l49J17l7J13j7p1r2J35k54K05Q9j17J17m56J86L7K50j38J19
$$ 185 -24 -39 234 256 -93 24 -13 100 83 12 -80 55 -199 6 95 -22 95 -361 -175 -138 112 -26 93
2491I3j72j22L43n8q9K6J2q5N9p5m5J41P1k32Q2J30l76K20J17J04p3L8P1k19R
$$ 93 -79 -201 142 84 -5 21 33 -52 7 -68 -113 28 99 -133 -51 79 -297 -77 40 144 71 109 180 -39 -30
2516c0J76j95j84L87k80K57J01K9l71J47j44O4OJ65k35j68L78n6j5l66L44j29
$$ -30 146 -49 -233 154 -126 131 232 261 -110 37 -107 -43 -37 128 -107 -275 103 47 32 -334 10 -119
2538a19j9P2j15K41k01K73k23L21k82q3l4J01K63jk7mj49j03o1K21p3K29k13o8
$$ -119 -138 -66 -181 60 -141 132 -91 230 -52 -135 -169 -68 195 194 167 163 14 -89 -150 71 -2 227 14 -54
2562e4mJ21k0j12L85m67K30o0n0N3k18J97O6lj94J1M24l43R4j78L08n5K08l66
$$ -54 -58 63 43 -69 316 -151 79 19 -31 22 -196 1 67 64 -130 -119 305 -38 56 -122 186 131 339 -27
2586b7k03K34N2k05J83n8j02M49j10m29J84J01r1J12j37J69l60M34k94j58J63
$$ -27 -230 4 56 -149 34 -24 -126 323 213 -216 -32 69 -22 90 -47 122 -238 196 -98 -256 -93
2607i3j28J40M26l97R0j53J17P5k03L46k87m9j17K75J6j06j11l2J99j66J97L6
$$ -93 -221 -81 345 -52 38 -115 2 77 -126 220 -67 -116 -233 42 58 -48 -159 -191 8 -158 39 75
2629G5j83L19k84K72k12K2k92K76k12R9K27k93J43K68j89m9r9K11k38R3R2oj24
$$ 75 -108 211 -73 199 -13 9 -283 -7 -219 -120 107 -186 -43 225 36 -13 -112 99 -139 -46 46 40 -84
2652h4lK66j42J16l39N47j44k73J9J01l7j2k36J38K04j53K6r1K17k01N6J89j50
$$ -84 -87 179 37 153 -186 361 217 -56 -37 64 27 15 -221 -83 121 -32 -6 -97 120 -81 -25 164 14
2675A4L4k71K34k75M43K5k38J83L1k05j95L44j30Q5l7K83l41J1J05m2j11K31n9
$$ 14 48 -223 11 -264 179 204 -34 149 180 -25 -220 124 -6 79 42 325 -16 -5 100 58 -53 178 119
2698A19k72L25nr0k37K02J63j31R6k10J02m0j06JJ63k72K37O3k83J26j86K28p0
$$ 119 -153 172 167 77 -160 42 205 74 170 -40 62 22 -84 -83 80 -192 45 108 -175 -49 -235 -7 -77
2721g7rK8Q9lN5j08L1k1r8L27m5k24K01j59J50r8J57k39jJ83O5j0K5m64J15M58
$$ -77 -86 -58 31 28 83 -25 6 -15 -113 214 169 -55 146 -13 137 39 196 -43 -44 139 204 194 219 -245 -130 328
2747C28l61j79M59l74K01j99J73j4n0l6k35N29j98k71L43k42M49m21J65q6K2J53
$$ 328 -33 -212 247 -127 74 -125 48 34 -16 -52 -287 242 44 -227 116 -126 323 -98 67 -19 3 156
2769A56n5m04M31k66J59Q1k57L70l28o3J33k23K33l4L15k21j02l8J14N2o7l4Q9
$$ 156 101 -303 128 -138 21 102 -155 215 -113 -176 -43 -266 -33 -67 248 27 -75 -113 1 53 -14 -48 41
2792D1j74J43LP9J7q8J96j36Q9j08L27m77K09l8n9J42k64K66l22L32j57P0j78
$$ 41 -133 10 13 92 109 21 217 81 170 62 389 -88 121 83 24 166 -98 168 -154 178 21 91 -87
2815h7m3L86l46k9K6J52J51j97J52k92M2L8P6j14O0O7j05j69J66p4m2J99Rq9O3
$$ -87 -130 256 -90 -119 -93 59 210 13 165 -127 -85 -47 29 -85 -25 42 -63 -232 -66 -140 -182 17 26 -63 0
2840@O9j43j08K84k10j16L98j54J21j39k00J94j45M0L5K23j03p8MJ60l69M17l85
$$ 0 69 -74 -182 102 -108 -224 174 20 141 2 -198 -4 -149 -109 -74 149 46 -32 -28 132 -237 180 -205
2863b05K99k39K42k75K37q8j0J95j76n0J5K33J5j93pK19l02J18k46J96j22L03
$$ -205 94 -145 97 -178 59 -29 -39 156 -20 -70 -55 178 193 0 -7 212 -90 28 -218 -22 -144 159
2885A59k61K1J56j92L55m43K07j84J24j15j2J45o9J8p2L5J69l0J04k49nL19l43
$$ 159 -102 -81 75 -117 238 -205 2 -182 -58 -173 -185 -40 -109 -91 -163 -128 41 11 115 -134 -139 180 -163
2908a63K54o6j27j4M51m05k1J81r5R3J0k06J00J73k56K92j47R6j11l6Q5K07l19
$$ -163 91 25 -102 -116 335 -70 -91 90 -5 88 98 -108 -8 165 -91 201 54 150 39 3 88 295 -24
2931b4P5p9Q7k42M19j85l82K79J43j71o2m8n1K18j30J16J25k01j03OK91O0k45
$$ -24 51 -28 59 -183 236 51 -331 -52 91 -80 -142 -190 -241 -23 -153 -37 88 -113 -216 -210 81 141 -104
2954a04kK03k73Q0K43l11J41K04j33L8J1k40O5K17l79M38j68M8L2N2k11J5M75
$$ -104 -106 97 -176 -96 147 -164 -23 181 48 86 97 -143 -78 139 -240 198 30 78 110 162 -49 -34 441
2977D41k09l6l86K67J9j24kk18m6J70K51l0j95K68k05J46Ql25L16j1k23J47K54
$$ 441 232 196 -190 77 96 -28 -30 -248 -294 -124 127 97 -98 170 -35 111 119 -206 110 99 -124 23 277
3000B77l67K6L50l72J03j9j15J11j44k8L2K16p0K10m04J92m3O8p9j6J58n2NJ8
$$ 277 -90 -64 286 -86 17 -2 -117 -6 -150 -178 -146 70 0 210 -194 -2 -45 23 -56 -72 86 34 39 57
3024E7J24k34J26p1m4R5j11P2m3K28o5j38J62j19n7L30l20j20J42J01k07J85j72
$$ 57 181 -53 73 2 -42 53 -58 14 -29 199 134 -4 158 39 -18 312 -8 -128 14 115 -92 93 -79
3047g9Qm5j11J89J6j17L22k21N5l75K4L51jj00L09m30J35N1rJ44L7m14J60K73
$$ -79 -71 -116 -227 -38 -22 -139 183 -38 17 -358 -334 17 16 -84 225 -205 -70 -19 -28 116 153 -261 -101 172
3071A72o6p8M8J49l10J06J61j1j51k65L64pk20K58J7J7r0l6j22J2q8l6J97mj02
$$ 172 106 28 76 225 -85 21 182 171 20 -245 119 112 -108 150 167 184 94 58 -64 -52 -140 -176 21 17 -85
3096h5Q1J34j58K37k33K3k20P4M39k13j45J13J53l89J50q8K20k06L49l92O1l8
$$ -85 -4 130 -28 209 -24 -1 -221 -147 292 79 -66 47 200 -189 -39 -127 93 -113 236 -156 -95 -133
3118a33qN8J21j04Q4m07P46l16L12N9m71J14k30J15N7k87L24L6q8j03K48p1K02
$$ -133 -141 -83 38 -66 18 -389 357 41 353 412 -59 55 -175 -60 -3 -290 34 70 -18 -121 127 56 258
3141B58l64k1J43j7K51k02N6j89r8K24j4O1jm9n7K3o5MJ03j82JL5J42K4j34kM9
$$ 258 -106 -127 16 -1 250 48 104 -85 -183 41 27 88 87 38 -19 4 -61 -57 46 -136 -135 -100 42 66 -68 -70 -21
3168b1J08M5j6P4l96M1K13k08j12K36j41K41N7m10L73k13Q9J66j01J16j30O2j75
$$ -21 87 132 116 190 -206 -165 48 -160 -272 -36 -177 64 121 -289 84 -129 -40 126 25 141 11 73 -102
3191a02l0K2R6q7M31j37l07K43j19P5N1M3q7o7m3j74J00K11L8j60l8J1N2K66j81
$$ -102 -132 -110 -14 -101 330 193 -114 129 10 85 136 179 92 25 -18 -192 -92 119 157 -3 -41 -30 22 288 107
3216A07j06R3l36K71k66Q2L0Q4nJ70Q5n07L62p7J1j02m4L57n17L92j36Q6O1j21
$$ 107 1 94 -242 29 -237 -155 -125 -41 -46 124 209 -298 64 -13 -2 -104 -148 209 -308 84 -52 34 95 -26
3240b6j6r0j2j7K30r8J14k01J8J37j32J88q6j55Q6L3n6Q4k22Q8L50j39j47J75
$$ -26 -42 -132 -144 -161 69 -29 85 -116 -98 39 -93 95 9 -146 -60 -27 -83 1 -221 -133 217 78 -69 106
3264A06k90J87k29J94k53K59j26J38p0J52L7J9k78J82o2J78j04j65L6p4m4M08
$$ 106 -184 3 -226 -32 -285 -26 -152 -14 -84 68 105 124 -154 28 -34 144 40 -125 -89 -163 -207 201
3286B01j54j9P3l00K86Q8k92o9K53p7L0r8K35k25j39K59J26m15L81r4PJ44n8k43
$$ 201 47 28 101 -199 87 175 -117 -186 67 -10 20 -78 157 -68 -207 52 178 -237 144 50 57 201 143 -100
3310a00q1L43n3L4j01j20K4J25r9L9J27l37J40M17r0k50N7L1j49j64L39q8l5k8
$$ -100 -181 162 109 143 42 -78 -54 71 -28 11 138 -199 -59 358 268 18 75 106 -43 -207 132 44 9 -19
3334a9J07j58K18j78L3MR9L6r9L52m27j07J27L0N9Qk36K3Q6J9K10p2k4k99K8K21
$$ -19 88 -70 148 -30 3 7 106 142 43 395 -32 -139 -12 18 77 85 -151 -128 -42 -23 187 115 91 -208 -180 41
3360D1J29l69K61j48J96n8m3R0J16k41L38l41R6k26L75k9j73j15J51j15J65%k50
$$ 41 170 -199 62 -86 110 52 9 99 215 -26 312 -29 67 -159 216 187 14 -101 50 -65 100 100 -150
3383a50j20M14r5l2O8J13j01k52K06j64K8j31L02k11P6M6J32j71K09pk10J29P
$$ -150 -270 144 49 17 85 198 97 -155 51 -113 -85 -216 86 -125 -49 -3 129 -42 167 160 -50 79 86
3406H6JM8q6j79J90l07K16P7J41J2m42J46q4K31j06k31L12k35L06p3J30k49P6
$$ 86 87 135 49 -130 60 -247 -31 46 187 199 -243 -97 -181 50 -56 -287 25 -210 96 23 153 -96 -20
3429b0K2j08R0j29J78l3q7r6jl6K37J42j23j38O6K6K36j90J94l85L04q9j67p0
$$ -20 2 -106 -16 -145 33 0 -87 -183 -184 -220 17 159 36 -102 -36 -10 226 36 230 -155 149 60 -107 -177
3453a77R3O3l38K99J9k20J72J24J63l88j9P4J90J76k91M4j35O0L69l08n1J64j69
$$ -177 -84 -21 -359 -60 -41 -261 -89 35 198 -190 -209 -135 55 231 -60 -16 -151 -91 278 -30 -81 83 -86
3476h6P3l4M1Rq8L65k59M4N0q1q1j3R7k46J90R0k3K07j80M6m44M4L80p0k57L89
$$ -86 -13 -47 -6 3 -85 280 21 65 115 34 -47 -60 37 -209 -19 71 48 255 75 121 -323 -279 101 31 -226 163
3502A63q8J9j15O0m6k40K21o5J75J6j49qJ12L5l4k94K83L0nQ5k62J05J2n9J56
$$ 163 75 94 -21 39 -7 -247 -26 -91 84 100 -49 -57 55 90 56 -238 45 75 70 155 -107 -2 10 -49 107
3527A07m8n4K19p7r3l1l0k0pK21j5k92L32q7j80J8K4R1j3j35k1N3MK1J65k30p2
$$ 107 59 5 224 147 54 23 -7 -27 -34 187 172 -120 212 125 -55 -37 -13 78 65 -70 -91 -38 -34 -13 152 -78 -150
3554a50J33K15l6k57m0N9J27j79J84j39m7L27l03Q0l3k00L69l8j4Q5j58Pp5P8
$$ -150 -17 198 162 -95 -135 -76 51 -128 56 -83 -130 197 -106 -26 -59 -259 110 72 58 143 -15 -8 -83 -5
3578ej82J93k15J15r8K2M02m41J98m0o3L98l25P9J26l26P4K61k68N1j50J42K2
$$ -5 -187 6 -209 -94 -192 -170 232 -209 -11 -51 -114 284 -41 38 164 -162 -88 173 -95 -44 -194 -52 -30
3601c0K47k96LM41m85k1K00kj14P8j23J01K55k22j14L18J32l71J9l3%p6J32J27
$$ -30 217 -79 -76 365 -120 -141 59 57 -57 21 -102 -1 254 32 -82 236 368 -3 16 -17 -17 -93 39 166
3625A66j54J74k33j69L81j52K56k97l07K01J91k83O1R8k3P3r0J57k6J4r8J18l9
$$ 166 12 186 -47 -216 165 13 269 -28 -335 -134 57 -226 -165 -67 -90 -17 -107 50 24 38 -60 58 19
3648A9j33K4J03J3RO9q5J37j15J36k87K66m09J81J76l18K95l38L76k57j2L15j15
$$ 19 -114 -90 13 26 35 104 19 156 41 177 -110 156 -253 -72 104 -214 81 -257 119 -138 -150 165 50
3671E0N5k2l1j45k1P5k57J13k0K15J4k9J63m2j05J32p4r5p9j28L48K6k20J51n
$$ 50 105 83 52 -93 -114 -39 -296 -183 -203 12 26 -3 160 118 13 145 71 -24 -103 -231 117 143 -77 74 69
3696F9j40J3J87k18P4J24K9N3p8k78O4J6J66p3L5J31nk73k1K24J86m51rJ71p5
$$ 69 -71 -58 129 -89 -15 109 138 191 113 -165 -101 -85 81 8 43 174 169 -104 -125 99 285 -166 -175 -4 -79
3721g9k4l3P0K28l55L11k04J5n5J41kP4l01M46k42q7K44J45m39j91L73Q4L00p75
$$ -79 -103 -136 -66 162 -193 118 -86 -71 -126 15 13 87 -214 232 -10 -97 147 292 -147 -338 35 119 419 -356
3745c56M67j65J00J98Nm07K17j38J53m4j24K67l50J99J08o9m9j91N2J02J03j01
$$ -356 111 -54 46 244 249 -158 59 -79 74 30 -94 173 -177 22 130 61 12 -179 -127 -25 78 -23
3767b3J02P3j85P9k6j60QP4P3Mp7Rk11J87K44k87J1J03R9k5J95l99K01M3j49j8
$$ -23 79 152 -33 46 20 -140 -132 -58 15 19 -58 -49 -260 -73 171 -116 -105 -2 97 72 267 -132 69 112 -37 -55
3793e5p7M27l25K39j91n7L92l35l44N52j53k45J85J09m6j21q4K07q5j75J67Q2
$$ -55 -132 295 -30 209 18 -39 353 18 -326 226 73 -172 13 122 76 -45 -129 78 -7 -182 -15 67
3815F7k02K19M3q5M5j92K15n5k6p3K0j15JQL09k67J13j3j35m2N8q2O1j78J75j75
$$ 67 -135 84 127 42 87 -105 110 55 29 -44 -24 -139 -138 -130 179 -88 25 12 -123 -165 -107 -189 -128 -306 -131 -306
3841c06M30o5j06P1l44L11J43j45J0P9j06N4o6kJ49r1J86o9j93j08J26p6l4L37
$$ -306 124 59 -47 24 -320 -9 134 -11 -1 78 -28 26 -40 -42 107 16 202 133 -60 -168 -42 -118 -152 185
3865A85l75J40j22oO5j77L40m4j42L38l78J70j56J36j09n9J79m2J72n5J2Q6m63
$$ 185 -190 -50 -172 -178 -113 -290 50 6 -136 202 -176 -6 -162 -26 -135 -194 -15 -57 115 60 72 158 -305
3888c05J21L57R0j28j35K83j48m66J14L08K4k10K15J07k53K4J77l41K31P5K0o5
$$ -305 -184 173 263 135 0 283 135 -331 -217 91 115 -95 120 227 -26 -2 175 -166 65 140 160 95
3910I5N0L9q4m0J87j01j35k68M40k5k17p5J24Rk21P2J30K2K59l84L6O8k14K39
$$ 95 145 184 100 60 247 146 11 -257 183 158 -59 -134 -10 -1 -222 -150 -20 2 261 -123 -87 -19 -233 6
3934Fj74RK47k6j03k13N02P6j90k6k37L22l77K19L0k13O4k00M87q3j32O2J77k64
$$ 6 -168 -159 88 62 -41 -254 248 324 134 108 -129 193 -184 35 65 -148 -84 -284 203 120 -12 50 227 -37
3958c7k60J98J61m0p7j11K66j4j08O9j36j22J93J5K60n30M37k18k8J67k44j13
$$ -37 -297 -99 62 22 -55 -166 100 86 -22 47 -89 -211 -18 -3 257 -273 164 -54 -82 85 -159 -272
3980b72K10J9j56K14o6r5J51M0j28J20j82P3k03J48K52j62r3J66J87q3j9j51J01
$$ -272 -62 -43 -199 15 -51 -146 5 45 -83 37 -145 -72 -275 -127 125 -37 -130 36 223 140 121 -30 71
4003G1j76J15n9j34j24J10K15K2J4l51K95O1j61K37k9m7j49Q2m8J79Q2l12PJ30
$$ 71 -105 10 -49 -183 -307 -197 18 40 54 -297 -2 59 -102 135 106 59 -90 -8 -56 123 205 -107 -100 30
4027C0J42K3j55k3n7K51k03J3N7j25O2n6K08l09J14nL28j94k15N6J32j47K4J09
$$ 30 172 195 40 17 -40 211 8 21 78 -47 15 -41 167 -142 -28 -33 295 101 -114 -58 74 -73 -49 60
4051F0k74N12k80p4N9N0j6k29K11K9o5q8J01K45q2k92l2K58l18K70j50J69Ln08
$$ 60 -214 298 18 -56 3 53 37 -192 19 48 -17 -105 -4 241 159 -133 -165 93 -225 45 -105 64 67 -441
$$ [...]
8191b73
##END NTUPLES=NMR FID
##END=
