##TITLE=1H_DE-102_oil_TFA2
 200.13MHz, CDCl3,
 8 sc
 
 32.8.2025
##JCAMPDX= 6.0         $$ Bruker NMR JCAMP-DX V2.0
##DATA TYPE= NMR SPECTRUM
##DATA CLASS= NTUPLES
##ORIGIN= UXNMR, Bruker Analytische Messtechnik GmbH
##OWNER= pz
$$ XWIN-NMR		Version 3.5
$$ Wed Aug 13 14:12:05 2025 Russian Standard Time (UT+4h)  she@DPX200
##.OBSERVE FREQUENCY= 200.1313
##.OBSERVE NUCLEUS= ^1H
##.ACQUISITION MODE= SIMULTANEOUS
##.ACQUISITION SCHEME= undefined
##.AVERAGES= 8
##.DIGITISER RES= 18
##SPECTROMETER/DATA SYSTEM= spect
##.PULSE SEQUENCE= zg30
##.SOLVENT NAME= CDCl3
##.SHIFT REFERENCE= (INTERNAL, CDCl3, 0, 15.4858)
##AUDIT TRAIL= $$ (NUMBER, WHEN, WHO, WHERE, WHAT)
$$ ##TITLE= Audit trail, XWIN-NMR		Version 3.5
$$ ##JCAMPDX= 5.01
$$ ##ORIGIN= Bruker BioSpin GmbH
$$ ##OWNER= she
$$ F:/spectra/data/she/nmr/H-C/1/pdata/1/auditp.txt
$$ ##AUDIT TRAIL=  $$ (NUMBER, WHEN, WHO, WHERE, WHAT)
(   1,<2025-08-13 14:10:46.40 +0400>,<she>,<DPX200>,
      <created by zg, POWCHK disabled, PULCHK disabled
       configuration hash MD5:
       00 E9 B6 7A A2 85 ED C7 34 08 36 98 17 FE 4E 26
       data hash MD5: 16K
       47 2F 78 B4 CA A2 4E 7A 38 E5 BA 3C 0F 00 2F E7>)
(   2,<2025-08-13 14:10:48.75 +0400>,<she>,<DPX200>,
      <Start of raw data processing
       efp BC_mod = 2 LB = 0.25 FT_mod = 6 PKNL = 1 PHC0 = -1717.638 PHC1 = 8.79228 SI = 16K 
       data hash MD5: 16K
       02 88 F4 A7 00 93 CA 58 48 3E C5 94 10 08 04 CB>)
(   3,<2025-08-13 14:11:11.67 +0400>,<she>,<DPX200>,
      <pk PHC0 = 157.3899 PHC1 = 5.2 
       data hash MD5: 16K
       4F 5E 2B CF 1C F2 E7 23 1E 45 CA 3C 0D FB DA 35>)
(   4,<2025-08-13 14:11:15.15 +0400>,<she>,<DPX200>,
      <abs ABSG = 5 
       data hash MD5: 16K
       7E 9D 70 F0 51 C3 FA 5A DE 11 EE E4 AF C7 28 88>)
$$ ##END=
$$ 
$$ hash MD5
$$ 63 C6 26 22 AC B4 EE DC 55 60 98 41 B5 CE 71 89
##$RELAX= 
##$RELAX= 
##$RELAX= 
##$RELAX= 
##$RELAX= 
##$RELAX= 
$$ Bruker specific parameters
$$ --------------------------
##$DU= <F:/spectra>
##$EXPNO= 1
##$NAME= <H-C>
##$PROCNO= 1
##$TYPE= <nmr>
##$USER= <she>
##$AMP= (0..31)
100 100 100 100 100 100 100 100 100 100 100 100 100 100 100 100 100 100 
100 100 100 100 100 100 100 100 100 100 100 100 100 100 
##$AQSEQ= 0
##$AQ_mod= 1
##$AUNM= <au_zg>
##$AUTOPOS= <>
##$BF1= 200.13
##$BF2= 200.13
##$BF3= 200.13
##$BF4= 200.13
##$BF5= 200.13
##$BF6= 200.13
##$BF7= 200.13
##$BF8= 200.13
##$BYTORDA= 1
##$CFDGTYP= 0
##$CFRGTYP= 5
##$CHEMSTR= <none>
##$CNST= (0..31)
1 1 145 1 1 1 1 1 1 1 1 1 1 1 1 1 1 1 1 1 1 1 1 1 1 1 1 1 1 1 1 1 
##$CPDPRG= <>
##$CPDPRG1= <>
##$CPDPRG2= <>
##$CPDPRG3= <>
##$CPDPRG4= <mlev>
##$CPDPRG5= <mlev>
##$CPDPRG6= <mlev>
##$CPDPRG7= <mlev>
##$CPDPRG8= <mlev>
##$CPDPRGB= <>
##$CPDPRGT= <>
##$D= (0..31)
0 0.7 0 0 0 0 0 0 0 0 0 0.03 0 0 0 0 0 0 0 0 0 0 0 0 0 0 0 0 0 0 0 0 
##$DATE= 1755079845
##$DBL= (0..7)
120 120 120 120 120 120 120 120 
##$DBP= (0..7)
150 150 150 150 150 150 150 150 
##$DBP07= 0
##$DBPNAM0= <>
##$DBPNAM1= <>
##$DBPNAM2= <>
##$DBPNAM3= <>
##$DBPNAM4= <>
$$ [...]
##$SUBNAM3= <"">
##$SUBNAM4= <"">
##$SUBNAM5= <"">
##$SUBNAM6= <"">
##$SUBNAM7= <"">
##$SUBNAM8= <"">
##$SUBNAM9= <"">
##$SW= 18.0517328524113
##$SWIBOX= (0..15)
0 0 2 0 0 0 0 0 0 0 0 0 0 0 0 0 
##$SW_h= 3612.71676300578
##$TD= 16384
##$TD0= 1
##$TE= 0
##$TE2= 300
##$TE3= 300
##$TEG= 300
##$TL= (0..7)
0 120 120 120 120 120 120 120 
##$TP= (0..7)
150 150 150 150 150 150 150 150 
##$TP07= 0
##$TPNAME0= <>
##$TPNAME1= <>
##$TPNAME2= <>
##$TPNAME3= <>
##$TPNAME4= <>
##$TPNAME5= <>
##$TPNAME6= <>
##$TPNAME7= <>
##$TPOAL= (0..7)
0.5 0.5 0.5 0.5 0.5 0.5 0.5 0.5 
##$TPOFFS= (0..7)
0 0 0 0 0 0 0 0 
##$TUNHIN= 0
##$TUNHOUT= 0
##$TUNXOUT= 0
##$USERA1= <user>
##$USERA2= <user>
##$USERA3= <user>
##$USERA4= <user>
##$USERA5= <user>
##$V9= 5
##$VALIST= <valist>
##$VCLIST= <CCCCCCCCCCCCCCC>
##$VD= 0
##$VDLIST= <DDDDDDDDDDDDDDD>
##$VPLIST= <PPPPPPPPPPPPPPP>
##$VTLIST= <TTTTTTTTTTTTTTT>
##$WBST= 1024
##$WBSW= 4
##$XGAIN= (0..3)
0 0 0 0 
##$XL= 0
##$YL= 0
##$YMAX_a= 203666
##$YMIN_a= -256112
##$ZGOPTNS= <>
##$ZL1= 120
##$ZL2= 120
##$ZL3= 120
##$ZL4= 120
##$ABSF1= 15.76562
##$ABSF2= -2.286235
##$ABSG= 5
##$ABSL= 3
##$ALPHA= 0
##$AQORDER= 0
##$ASSFAC= 0
##$ASSFACI= 0
##$ASSFACX= 0
##$ASSWID= 0
##$AUNMP= <proc_1d>
##$AZFE= 0.1
##$AZFW= 0.1
##$BCFW= 0
##$BC_mod= 2
##$BYTORDP= 0
##$COROFFS= 0
##$CY= -3
##$DATMOD= 1
##$DC= 0
##$DFILT= <>
##$DTYPP= 0
##$F1P= 0
##$F2P= 0
##$FCOR= 1
##$FTSIZE= 16384
##$FT_mod= 6
##$GAMMA= 0
##$GB= 0
##$INTBC= 1
##$INTSCL= 3.241238e-09
##$ISEN= 128
##$LB= 0.25
##$LEV0= 0
##$LPBIN= 0
##$MAXI= 10000
##$MC2= 0
##$MEAN= 0
##$ME_mod= 0
##$MI= 1.114404
##$NCOEF= 0
##$NC_proc= -8
##$NLEV= 6
##$NOISF1= 3.799351
##$NOISF2= 2.8
##$NSP= 0
##$NTH_PI= 0
##$NZP= 0
##$OFFSET= 15.48576
##$PC= 1
##$PHC0= -1560.248
##$PHC1= 13.99228
##$PH_mod= 1
##$PKNL= yes
##$PPARMOD= 0
##$PSCAL= 0
##$PSIGN= 0
##$REVERSE= no
##$SF= 200.130007192608
##$SI= 16384
##$SIGF1= 3
##$SIGF2= 2
##$SINO= 0.751879
##$SIOLD= 32768
##$SREGLST= <19F.Aceton>
##$SSB= 0
##$STSI= 16384
##$STSR= 0
##$SW_p= 3612.71676300578
##$SYMM= 0
##$S_DEV= 0
##$TDeff= 16384
##$TDoff= 0
##$TI= <>
##$TILT= no
##$TM1= 0
##$TM2= 0
##$TOPLEV= 0
##$USERP1= <user>
##$USERP2= <user>
##$USERP3= <user>
##$USERP4= <user>
##$USERP5= <user>
##$WDW= 1
##$XDIM= 16384
##$YMAX_p= 417516002
##$YMIN_p= -2442449
$$ End of Bruker specific parameters
$$ ---------------------------------
##NTUPLES= NMR SPECTRUM
##VAR_NAME=  FREQUENCY,     SPECTRUM/REAL,   SPECTRUM/IMAG
##SYMBOL=    X,             R,               I
##VAR_TYPE=  INDEPENDENT,   DEPENDENT,       DEPENDENT
##VAR_FORM=  AFFN,          ASDF,            ASDF
##VAR_DIM=   16384,         16384,           16384
##UNITS=     HZ,            ARBITRARY UNITS, ARBITRARY UNITS
##FACTOR=    0.220516191357247, 1,           1
##FIRST=     3099.16520717005, 0,            0
##LAST=      -513.551555835732, 0,           0
##MIN=       -513.551555835732, -2442449,    0
##MAX=       3099.16520717005, 417516002,    0
$$ Real data points
##PAGE= N=1
##DATA TABLE= (X++(R..R)), XYDATA
$$ [...]
7029C2906201J010674J905164K363220K722490K563037J909635J858596K364531
7021D9603548K948187K391619K854993K715993M084950L552183L270895M217209
7013G5639577M531163M649915M997323L960979K214519N6527l261240l911018
7005H8877745m649114o012782n200072m948507m425470m318251l224538l472520
6997E2626491l294084l329059k521040k718536j968026j876744j979810k289474
6989C2649718k155342j021475l75057j211176j388754q34642n53463q63773r28207
6980B3317829n26872k55482p62072q52925q78664J12920m22263r85667j62436
6971A8584368n15190n93100N1399n13815m25361o79908m20683K33968l33841r49478
$$ plain form
7029 32906201 33916875 35822039 38185259 40907749 43470786 45380421 47239017 49603548
7021 49603548 52551735 54943354 57798347 60514340 64599290 68151473 71422368 75639577
7013 75639577 80170740 84820655 89817978 93778957 95993476 96050003 92788763 88877745
7005 88877745 84228631 78215849 73015777 68067270 63641800 59323549 56099011 52626491
6997 52626491 49332407 46003348 43482308 40763772 38795746 36919002 34939192 32649718
6989 32649718 30494376 29472901 29097844 27886668 26497914 25663272 25109809 24246036 23317829
6980 23317829 22790957 22535475 21773403 20920478 20041814 20154734 19732471 18746804 18584368
6971 18584368 18069178 17476078 17527477 17013662 16588301 15908393 15487710 15721678 15387837 14438359
6961A4438359n46268l81298m06944k30059L45790k37923m83759K35569l51857
6952A2381610N4082n27494q74156Q09427l21758L122j50062j58521k65682m01715
6942A0548853o05902j82340J67572M4249l29917p04072k03253J24602M60029m66229
6932H853592m88770q8328q56481n36197K06685j77666K92274k80882K040n03629
6922F422638l29134L37409J04916j29834k8379L1120q79519p46574L51460l0164
6912E103939J45581l36614M44603j59271m78914j2242J41169J56988j37579n52968
6902D314692m68008k52813m33024k82480M22371j57811k13134k9911M7702k20696
6892B726888L68705j74438j1842p4472K22407O03743q42653q25744n97497n53452
$$ plain form
6961 14438359 13892091 13510793 13103849 12873790 13219580 12981657 12497898 12733467 12381610
6952 12381610 12435692 11908198 11034042 11843469 11521711 11524833 11374771 11216250 10950568 10548853
6942 10548853 9942951 9760611 9928183 9972432 9642515 8938443 8735190 8859792 9319821 8853592
6932 8853592 8364822 8276494 7420013 6883816 7090501 6912835 7205109 6924227 6926267 6422638
6922 6422638 6093504 6430913 6535829 6405995 6377616 6408736 5529217 4782643 5134103 5103939
6912 5103939 5249520 4912906 5357509 5198238 4719324 4707082 4848251 5005239 4867660 4314692
6902 4314692 3846684 3593871 3160847 2878367 3300738 3142927 2929793 2899882 2947584 2726888
6892 2726888 3095593 2921155 2909313 2834841 3057248 3660991 2818338 1992594 1395097 841645
6882H41645L74590N12907n3972j75429N73098K81125n89024p11198J92772O07850
6872A854364j11753j97346k68399r71374P9537N31548L51190n4509N49193j76947
6862A585504p01350M55110K72661k81388n14226K72801J45177j43552k4595l25917
6852G40225o05822q7304J9708J16557L98856j94117M72049m80302K29957L92760
6842A002567n42091K08342J2417O0623m48844k2048L65183j05359M88144M8114
6832A067048k7211n60386K12979M60408n66598J35481l99903l68163O50231R51243
6822A555129l71324m36089j42314N6497k72276J92802m69789m8985q181R9386
6812A54856P4296J83574j17314O24190l05735K58153K76944m73081j86694k45561
$$ plain form
6882 841645 1216235 1729142 1675170 1499741 2072839 2353964 1764940 1053742 1246514 1854364
6872 1854364 1742611 1545265 1276866 305492 385029 916577 1267767 1213258 1762451 1585504
6862 1585504 884154 1339264 1611925 1330537 816311 1089112 1234289 1090737 1066142 740225
6852 740225 134403 47099 66807 183364 582220 388103 860152 379850 609807 1002567
6842 1002567 460476 668818 681235 741858 293014 270966 636149 530790 1018934 1067048
6832 1067048 1039837 479451 692430 1152838 586240 721721 321818 -46345 603886 1555129
6822 1555129 1183805 747716 605402 661899 389623 582425 112636 63651 55470 154856
6812 154856 229152 412726 295412 919602 613867 872020 1148964 675883 489189 243628
6802B43628M74223J76358p46793p3838P33589p91202k24604N13613M64117k31203
6792E37888j82824L83166k94022N03326J86002N80566l75016M2031j93930k36781
6782I50406M67233m4517j31936n74344J2326R93292N37806j72494k47696L40042
6772B130118j6258l25152m26770N78016K64862J82218L46711L0448J00470l23314
6762B541349N33125J53412P04652n1842n80943K1241N48297O58550N88843k19438
6752D897246J0937r4255J75356M01829R87431K53985O4031P63853L39615M73507
6742H273535J659673K19979J192301J141878K31745k23345O50800J068630N79327
6733A4794523n15907k49946N3391p6314k79635o02588K11870L83877Q61704k98488
$$ plain form
6802 243628 717851 894209 147416 73578 807167 15965 -208639 304974 769091 537888
6792 537888 355064 738230 444208 947534 1133536 1714102 1339086 1381117 1187187 950406
6782 950406 1417639 1373122 1241186 666842 679168 1672460 2210266 2037772 1790076 2130118
6772 2130118 2113860 1788708 1361938 1939954 2204816 2387034 2733745 2764193 2864663 2541349
6762 2541349 3074474 3227886 3932538 3880696 3299753 3320994 3869291 4527841 5116684 4897246
6752 4897246 4908183 4813928 4989284 5391113 6378544 6632529 6696560 7460413 7800028 8273535
6742 8273535 9933208 10153187 11345488 12487366 12719111 12495766 13146566 14215196 14794523
6733 14794523 14278616 14028670 14082061 14005747 13726112 13123524 13335394 13719271 14580975 14282487
6723A4282487K56975M73523N37084J054121J398886N73081J496696O37617J588433
6714B2298903J062759J140019J444527L09669K92689J421533J087255J92654N55274
6705B9805282m5449l6555P53833n9550o45350m98430j5817J30820K21316o817
6695B9603283j049416p63351O65113K939K18637N29963O50706N39490L2589J518085
6685C1948038J027584J242617J181239O59477Q52979Q61937N2654M48837k14898
6676C8060464o21158j181260K79089p88000n19543m26791j214537q76042o99527
6667C2012695j76793n74615o93414j030851n57554M6476m05772l12317m13650
6658B7894205q13379J155322L40188o35917q9603k97709J99388J71673M10656
$$ plain form
6723 14282487 14539462 15012985 15550069 16604190 18003076 18576157 20072853 20710470 22298903
6714 22298903 23361662 24501681 25946208 26255877 26548566 27970099 29057354 29250008 29805282
6705 29805282 29759833 29723278 30477111 30417561 29772211 29273781 29257964 29388784 29610100 29603283
6695 29603283 28553867 27790516 28455629 28458568 28677205 29207168 29857874 30397364 30429953 31948038
6685 31948038 32975622 34218239 35399478 36058955 36911934 37773871 37826525 38275362 38060464
6676 38060464 37439306 36258046 36537135 35749135 35229592 34802801 33588264 32712222 32012695
6667 32012695 31835902 31261287 30567873 29537022 28979468 29025944 28620172 28307855 27894205
6658 27894205 27080826 28236148 28576336 27940419 27850816 27553107 27752495 27924168 28334824
6649B8334824K47538m6939l17518M83094k53011o23308j464552p14769m74228
6640B5171131r16939q65183j121979m53958r41068j167620n25655K805o7165n5131
6630A9059238J55681N1557l74852j72760j88599q66311L31956J68453n34199k95442
6620A7334722p26705L54151o19359l94651o2330K5167n27813k34431j65456K84594
6610A5267889l08580k41862k56503K8197l94595m83157N15834j86937l53248J44708
6600A3731746n31161q08692q9874K62925M4604n29697l38192Q1085r8841j02136
6590A1621767m2234m42343m1101m2462J93567j40937J70819j62962J76523q2935
6580A1207702j81526q2419m25047l64566J9453k13604J13310j5928m50262o30051
$$ plain form
6649 28334824 28582362 28535423 28217905 28700999 28447988 27824680 26360128 25645359 25171131
6640 25171131 24254192 23389009 22267030 21813072 20872004 19704384 19178729 19181534 19114369 19059238
6630 19059238 19214919 19266476 18891624 18718864 18530265 17663954 17995910 18164363 17630164 17334722
6620 17334722 16608017 16962168 16342809 15948158 15885828 15910995 15383182 15148751 14983295 15267889
6610 15267889 14959309 14717447 14460944 14489141 14094546 13611389 14127223 13940286 13587038 13731746
6600 13731746 13200585 12391893 12302019 12564944 12609548 12079851 11741659 11822744 11723903 11621767
6590 11621767 11579533 11137190 11096089 11053627 11247194 11106257 11277076 11114114 11290637 11207702
6580 11207702 11026176 10943757 10518710 10154144 10173597 9959993 10073303 10057375 9607113 8977062
6570H977062j39186K03297L79476m2815k30769k47720R3572p97830k06942O5002
6560H053147l28002k31011j33014J22740l4016K23657m07219N1425p17113L87431
6550F988025k67701K3878j000563j14516L18301m31112K12735m00332K33759M45193
6540F007667N4475n15251l47893n30490J53508N03131n30473m0008o9907J44965
6530D829724O11528m56996o23445L77808K72271q89743j74738N31931l01195J46361
6520D323506M79617k67853j00314m98588K501K20286k90018k63457m5325N42245
6510D102600m20223K00786o86756j75967L17061L08318k08426r374k42376m62280
6500B723363M41089o34272M619L54031m2645L38824n44880k09690J48900J032030
$$ plain form
6570 8977062 8837876 9041173 9420649 9377834 9147065 8899345 8992917 8195087 7988145 8053147
6560 8053147 7725145 7494134 7361120 7483860 7449844 7673501 7266282 7317707 6600594 6988025
6550 6988025 6720324 6744202 5743639 5629123 5947424 5516312 5729047 5328715 5562474 6007667
6540 6007667 6062142 5546891 5198998 4668508 4822016 5325147 4794674 4754666 4684759 4829724
6530 4829724 5441252 4984256 4360811 4738619 5010890 4121147 3946409 4478340 4177145 4323506
6520 4323506 4803123 4535270 4434956 3936368 3938869 4159155 3869137 3605680 3560355 4102600
6510 4102600 3682377 3883163 3196407 3020440 3337501 3645819 3437393 3428019 3185643 2723363
6500 2723363 3164452 2530180 2534799 2888830 2846185 3185009 2640129 2430439 2579339 3611369
6490C611369p26859p00648L03641J35889j49947M80291K2554j9197l72929l16545
6480B267619k55412q7807N34631n71055N41317j68957l03295K17532J31970k12235
6470B094308O36158l60046R31886k38077l63085N64141k98998j31091L64376J14664
6460C314236J5390m40337m8290J6709j21666M72690j29388j60472K07045N5443
6450C181360k60801l76481n10926J51358M20950n4777M76510k78631j88435N8493
6440B618620m24300k60805Q63361L80779q69576q63410K27905M13386O28840m02717
6430B312083R7341O1191j33012m52189j39289J7427J80149L65831m04248j39552
6420A765732k5911m31275q2349M36309Q99775r1897m02880Q2633j66466P307K0600
$$ plain form
6490 3611369 2884510 2183862 2487503 2623392 2473445 2953736 2976290 2957093 2584164 2267619
6480 2267619 2012207 1924400 2459031 1887976 2429293 2260336 1957041 2174573 2306543 2094308
6470 2094308 2730466 2370420 3302306 3064229 2701144 3265285 2966287 2835196 3199572 3314236
6460 3314236 3329626 2889289 2840999 2857708 2736042 3208732 3079344 2918872 3125917 3181360
6450 3181360 2920559 2544078 2033152 2184510 2605460 2550683 3027193 2748562 2560127 2618620
6440 2618620 2194320 1933515 2796876 3177655 2308079 1444669 1672574 2085960 2714800 2312083
6430 2312083 2409424 2470615 2337603 1885414 1746125 1763552 1943701 2309532 1905284 1765732
6420 1765732 1739821 1308546 1226197 1662506 2562281 2470384 2067504 2150137 1983671 1990978 2011578
6409B011578K25531j8564Q15036n53576j78038n537l43009M29354j59922Q8116
6399B310969J67244k02970q02797J84232J33054p36804P50342K73203l42497J32609
6389A866585k40009j010627l22378M53896J28130M67808m469j65287m13115O50801
6379A411335K25620k63114O97804k02874k54815m8553L50678m5958k31274r15560
6369G23289k59853j1325M16314l89546M42246P5771L71207n85817j88M06597J79046
6358A367741L12231j98985L83296p08085J29234k71931l35469j77782K86715K91256
6348A078221L82954Q8364K83464m20347M49939K67917l87638j42799K76068k5536
6338A850607n45210L50695J57718M66007j88871K56133m89456n10207R2589K84473
$$ plain form
6409 2011578 2237109 2218545 3033581 2480005 2301967 2296430 1953421 2382775 2222853 2310969
6399 2310969 2478213 2275243 1472446 1656678 1789732 1052928 1803270 2076473 1733976 1866585
6389 1866585 1626576 615949 293571 747467 875597 1343405 1338936 1173649 760534 1411335
6379 1411335 1636955 1373841 2071645 1868771 1613956 1565403 1916081 1870123 1638849 723289
6369 723289 463436 452111 868425 478879 921125 996896 1368103 782286 782098 1188695 1367741
6358 1367741 1679972 1480987 1864283 1156198 1285432 1013501 678032 500250 786965 1078221
6348 1078221 1461175 1549539 1833003 1412656 1862595 2130512 1742874 1600075 1876143 1850607
6338 1850607 1305397 1656092 1813810 2279817 2090946 2347079 1857623 1347416 1440005 1724478
6328A724478n05863j19791P36956j80796l22001j95372m8528j31738j8017j15689
6318H23639l6522P53371k86378l203j63054J38617J24468L11195j69019j64160
6308A328954j79420M96945J35159j72135l48741j31509N25598Q0678J5786l88172
6298A363143J23915O2070l34131K50647k34299L76810Q1479J89577M63962k34010
6288B109163N9969k55596j06243n87963r9668l42227M12536N74065q2718q67344
6278H13974k81072l2439q5163L99499L70135J78349k38207J82858M34195j191084
6268E51045m21755Q0245L94598k93785N26124L71298O94175L19656r22882o04532
6258F94187m1139P29976o58767n73397J043031K326K13026k11703m24742K69132
$$ plain form
6328 1724478 1218615 1098824 1835780 1654984 1332983 1137611 1089083 957345 939328 823639
6318 823639 787117 1540488 1254110 1250907 1087853 1226470 1350938 1662133 1493114 1328954
6308 1328954 1149534 1646479 1781638 1609503 1260762 1129253 1654851 1735529 1751315 1363143
6298 1363143 1487058 1549128 1214997 1465644 1231345 1608155 1689634 1879211 2343173 2109163
6288 2109163 2169132 1913536 1807293 1219330 1119662 777435 1189971 1764036 1681318 813974
6278 813974 532902 500463 415300 814799 1184934 1363283 1125076 1307934 1742129 551045
6268 551045 129290 209535 604133 310348 836472 1207770 1901945 2221601 1298719 694187
6258 694187 653048 1383024 724257 150860 1193891 1196217 1409243 1197540 772798 1041930
6248A041930R5831M48829j92084P189p62088j65857o7722P7392q0801K41003k66783
6237C76839M41510j157930q6478Q18435l99667M11476J65080K26902O3116L8820
6227H98103j18021L51949l65415J46885k54222k3535m4711k659n2870K95770l84231
6216D47043K07051k16639Q298M68707M6399k92430k29357P16409l05085P676P64392
6205A622464k84855k41900k43639j57162k20394l31879K26586K74084M43944r9920
6195I87329L89208M1436n43026L538j79053m23809Q9590L11416m0759K14106p6454
6184G73522j26851o0864J63688j67085j6929J63988L14753K30001K70014m08072
6174A136165n18724L68865j28642j89457l60027O87470R8608j97900J03422K11220
$$ plain form
6248 1041930 1137761 1586590 1394506 1401695 639607 473750 406028 483420 402619 643622 376839
6237 376839 818349 -339581 -426059 392376 -7291 404185 569265 796167 859283 898103
6227 898103 780082 1132031 766616 913501 659279 635744 591033 588374 535504 831274 447043
6216 447043 654094 437455 445753 914460 960859 668429 439072 1155481 850396 858072 1622464
6205 1622464 1337609 1095709 852070 694908 474514 142635 369221 643305 1087249 987329
6195 987329 1376537 1417973 874947 878485 699432 275623 365213 676629 635870 849976 773522
6184 773522 646671 585807 749495 582410 565481 729469 1044222 1274223 1544237 1136165
6174 1136165 617441 986306 857664 668207 308180 995650 1094258 896358 999780 1211000
6164A211000k67454o7803P8706m17930J38467l40577L09673M31617J76634J48571
6154A400904L66308r7082l75046N30313k05079j67835k1460K46003k16550o11361
6144H49115M32530M5732m50047l10260o5090n04659j76168J327042k73710l39006
6134E35479O09545N57746n7793n90509l8739k98510m547j39056q416K55568n49013
6123B71755k70610J82924J72402p13453L99513J016246O3481m41987n42576l60933
6113b23238N72944K77168j25449p40434K77242M06978j46141M89964j46597o77623
6103c5186M15370J40481J43486J04068k13257R3961l62283k74633J6149L16882
6093C45038j48971J82374m93489J37577P55316q39704m3906L60683k46042j10441
$$ plain form
6164 1211000 943546 875743 954449 536519 674986 334409 644082 1075699 1252333 1400904
6154 1400904 1767212 1670130 1295084 1825397 1620318 1452483 1431023 1677026 1460476 849115
6144 849115 1281645 1327377 877330 567070 501980 -2679 -178847 1148195 874485 535479
6134 535479 1145024 1702770 1644977 1054468 1015729 717219 712672 573616 565200 820768 271755
6123 271755 1145 184069 356471 -356982 42531 1058777 1122258 680271 137695 -223238
6113 -223238 349706 626874 501425 -239009 38233 445211 299070 789034 642437 -35186
6103 -35186 380184 520665 664151 768219 554962 648923 286640 12007 28156 345038
6093 345038 196067 378441 -115048 22529 777845 -61859 -105765 254918 8876 -101565
6083a01565O3299L07283m93601K7620N888l09656L79278N80998p4797L7007Q24568
6072A246322l03440j52724k193K37382l41300J68675n15236K27659K60184k14423
6062F10906o0745P60714j04449p05913o1156l707K49282m68720K09969L47605
6052G73786r7893q74359M73654M31580n4997l56092k44271N66122J95642m6071
6042G67101L72969j83197j19531M64045o0574K2255M24545K28825k64974q65698
6032G85766j10960o42L36583n35663K67655J35665p2789m10863L5804J68852O2439
6021F61847m71922J33537N94007P54756L87203j11338J12146k92991L1817N4821
6011A853883O3738L81014l53957j86511n7846l4620M82847K14373m61371O3471
$$ plain form
6083 -101565 -38266 269017 -224584 -196964 -191076 -500732 -121454 459544 384747 421754 1246322
6072 1246322 942882 790158 787965 1025347 684047 852722 337486 565145 825329 610906
6062 610906 550161 1310875 1206426 500513 439357 435650 684932 216212 426181 773786
6052 773786 675893 -198466 275188 706768 651771 295679 51408 617530 813172 767101
6042 767101 1140070 956873 837342 1301387 1240813 1263068 1687613 1916438 1651464 785766
6032 785766 674806 674164 1010747 475084 742739 878404 805615 394752 430556 599408 661847
6021 661847 189925 323462 917469 1672225 2059428 1948090 2060236 1767245 1799062 1853883
6011 1853883 1917621 2298635 1944678 1758167 1700321 1665701 2148548 2362921 1901550 1965021
6001A965021j49619l23974O5988q7650p4212o1462N98644N12413r36774J11373
5991A619748K60551L40599Q36666o4556k82446R9770N84011j11865J22959j02952
5981C302485l12707P3290P16886m59019K54883M17304l2801m69739K05253L04778
5971D000613k84560K46446n50233N93157M85891p47376M04720j46073M17650O63452
5961E083687N03574m67584k13392L22734j27221L71483k36592m06415L29572J437803
5951F597649l2699R2845K73710k16149N42449O89407M46293l33085l56775k64058
5941G439587l86682k28406K56913p69253n60416L77109p6633L23267j26733p53628
5931E495125j09661Q92710O40063q1058m11862l05717L2091J70807m38811K23494
$$ plain form
6001 1965021 1815402 1491428 1557416 1469766 1395554 1334092 1932736 2445149 1508375 1619748
5991 1619748 1880299 2220898 3057564 2993008 2710562 2810332 3394343 3282478 3405437 3302485
5981 3302485 2989778 3063068 3779954 3320935 3575818 3993122 3960321 3490582 3695835 4000613
5971 4000613 3716053 3962499 3412266 4005423 4491314 3743938 4148658 4002585 4420235 5083687
5961 5083687 5587261 5119677 4906285 5229019 5101798 5473281 5236689 4830274 5159846 6597649
5951 6597649 6564950 6657795 6931505 6715356 7257805 7947212 8393505 8060420 7703645 7439587
5941 7439587 7052905 6824499 7081412 6312159 5751743 6128852 6052219 6375486 6248753 5495125
5931 5495125 5385464 6278174 6918237 6837179 6425317 6119600 6151691 6322498 5883687 6107181
5921F107181L9338q1711O55745P81772j40614q7197k14282p54609M82128O7491
5911F855242j33178n76195O8761k76069k83069J63988Q50937N29071K21365k22827
5901G198026K73702j80598l09344K84249k45572M95248M1322k82283O18943L7759
5891G931452L08644l23247o2975Q54000k44385n45878j21219Q94024m3180j13303
5881H533933K83686k08885P2755Q2217K91506O51387J84366P42397K02779R8607
5871A0934748l22135K35952L66298r3860O38084J52943r3496J65794N19635K31967
5861A2735930L99230K19865K75780j93905L24023J373115J200672M77832M50898
5852A7263440N83323J068725R82053J019710J209568R72789M19508J147255J594118
$$ plain form
5921 6107181 6146519 6064808 6720553 7502325 7361711 7274514 7060232 6305623 6787751 6855242
5911 6855242 6722064 6145869 6214630 5938561 5655492 5819480 6670417 7199488 7420853 7198026
5901 7198026 7471728 7291130 6981786 7266035 7020463 7515711 7557033 7274750 7893693 7931452
5891 7931452 8240096 7916849 7853874 8707874 8463489 7917611 7796392 8690416 8647236 8533933
5881 8533933 8817619 8608734 8681489 8763706 9055212 9706599 9890965 10633362 10836141 10934748
5871 10934748 10612613 10848565 11214863 11121003 11759087 11912030 11818534 11984328 12503963 12735930
5861 12735930 13135160 13355025 13630805 13436900 13760923 15134038 16334710 16812542 17263440
5852 17263440 17846763 18915488 19897541 20917251 22126819 23099608 23519116 24666371 26260489
5843B6260489J436177J907492J921996J346319J758095K078546K009064J888987
5835D0607165J866729K738111L076085L820919L656832M248894N022429N697860
5827G0735024O713335P640105R125684J0746733J2535215J5666511J8621406K0667332
5819A72451345K1979758K0412164J8253509J2083684J213114q712389j3934190
5812B23746995j3431086j1324768q777211p018865o288017m821395l067069j997763
5804A67020821k73270M81719K304309L759072O884602P918157P152850O145538
5796B01393798N080527K296470k667275o577043p060399o683178o365961n952810
5788A73464129o704698o946097o951579o813009n341064n367005o045464n032823
$$ plain form
5843 26260489 27696666 29604158 31526154 32872473 34630568 36709114 38718178 40607165
5835 40607165 42473894 45212005 48288090 52109009 55765841 60014735 65037164 70735024
5827 70735024 77448359 85088464 94214148 104960881 117496096 133162607 151784013 172451345
5819 172451345 194431103 214843267 233096776 245180460 246393574 237681185 223746995
5812 223746995 210315909 198991141 190213930 183195065 176907048 172085653 169018584 167020821
5804 167020821 166747551 167229270 169533579 173292651 180177253 188095410 195248260 201393798
5796 201393798 206474325 208770795 206103520 199526477 192466078 185782900 179416939 173464129
5788 173464129 166759431 159813334 152861755 146048746 140707682 135340677 129295213 124262390
5780A24262390n678830m642429l322531l562229l210025l832755m183180l557090
5772I2273321l498810l381303k321982l470765m159671l197683k969448l408428
5764F5865231k335562k128119k428345k113081k671505j025786j579455k219077
5756D9364301j755626j802078j270301k066798q53660j445107k194457o61534
5748C7314740j241148j536062p12224r65167p83014j088523j175397j255414j313158
5739B7244633j002630q08895j65281l39339p75011j305427j3539l59303m63071
5730B2012137q64442m49742r29386n29592q57994r41321l51343p40274l51421
5721A5996622n17248p40462L58736l68332l77433j48051k13931l48729o1571q0000
$$ plain form
5780 124262390 118583560 113941131 110618600 107056371 103846346 100013591 95830411 92273321
5772 92273321 88774511 85393208 83071226 79600461 75440790 72243107 69273659 65865231
5764 65865231 63529669 61401550 58973205 56860124 54188619 53162833 51583378 49364301
5756 49364301 47608675 45806597 44536296 42469498 41615838 40170731 37976274 37314740
5748 37314740 36073592 34537530 33825306 32860139 32077125 30988602 29813205 28557791 27244633
5739 27244633 26242003 25433108 25267827 24928488 24153477 22848050 22834511 22475208 22012137
5730 22012137 21147695 20697953 19768567 19238975 18380981 17439660 17088317 16348043 15996622
5721 15996622 15479374 14738912 15097648 14729316 14351883 14203832 13989901 13641172 13579601 13499601
5711A3499601p00544J19637m14993p85941O8951k798j049138m25331Q4235R56557
5701A1350236J68922q73546L11457K16717n029o44916k97927L80783k33819l40006
5691A0032872P7137k5150r33812k64400K93560K33819n80505K53121j70653n74250
5681H341739k94636J10300l8224j29876L00791n81275m7202k10545M6012j39426
5671G357658o62768p0816J35223k21229o29164p1489K09786p84484j52159j48884
5661D961674J01768L98633K02785o86026k74876q13894K63158j22102K30726O78574
5651D940420j65986k39119n64953k60661m18632n7562J68218J15697L4546J60214
5641C712182p03868M34515m8054O26640J3759l86588j77179k74916K05110j13876
$$ plain form
5711 13499601 12799057 12918694 12503701 11717760 11786711 11783913 10734775 10309444 10393679 11350236
5701 11350236 11519158 10645612 10957069 11173786 11168757 10523841 10225914 10606697 10372878 10032872
5691 10032872 10110009 10084859 9151047 8886647 9180207 9414026 8833521 9086642 8915989 8341739
5681 8341739 8047103 8157403 8119179 7989303 8290094 7708819 7661617 7451072 7497084 7357658
5671 7357658 6694890 6624074 6759297 6538068 5908904 5837415 6047201 5262717 5110558 4961674
5661 4961674 5063442 5462075 5664860 4978834 4703958 3890064 4153222 4031120 4261846 4940420
5651 4940420 4774434 4535315 3970362 3709701 3291069 3233507 3401725 3517422 3551968 3712182
5641 3712182 3008314 3442829 3394775 4021415 4035174 3648586 3471407 3196491 3401601 3287725
5631C287725O38709l67040m95642J27363J79106l65010n16868L88722k5577J48977
5621C000465m4508K14095j35444k07634n57212K3088l87354k48300l193J27517
5611A781520L58167j09050K20559j01647L53905P1486j36857J02081L12252k83637
5601B568779p40825k41390J09010L56290m16801M12181J364J9600L78654k9014
5591B417848k13467K23469M565q54207K13876K47011R2747J59859k49905K71576
5581B313372L1504m01056l11271K90874k96558j15660N15460j63390l3476j032039
5571G97760n1493L23232K0283j506j60418Q60379K00978k58756M36589J08116
5561B275164n09992m2026J06146K6660m1615O77940J66739k32323q13215J62822
$$ plain form
5631 3287725 3926434 3559394 3063752 3191115 3370221 3005211 2488343 2877065 2851488 3000465
5621 3000465 2955957 3170052 3034608 2826974 2269762 2292850 1905496 1657196 1654003 1781520
5611 1781520 2139687 2030637 2251196 2149549 2503454 2574940 2438083 2540164 2852416 2568779
5601 2568779 1827954 1586564 1695574 2051864 1635063 2047244 2048608 2068208 2446862 2417848
5591 2417848 2204381 2427850 2432415 1578208 1792084 2039095 2131842 2291701 2041796 2313372
5581 2313372 2344876 1943820 1632549 1923423 1626865 1511205 2026665 1863275 1829799 797760
5571 797760 746267 1069499 1089782 1088276 927858 1788237 1989215 1730459 2167048 2275164
5561 2275164 1765172 1723146 1829292 1855952 1814337 2492277 2659016 2426693 1613478 1776300
5551A776300J90287L14352L74675O0236k64323k0327M99426o54783K72272l60015
5541B188100P50458k88725P6089O6142M26983j52101K69447l64376k48986m66629
5531B256402J55942N63005k63778P9205j4624O74656n7398j17121n7904L74080
5521C592465k87251j93691N85011Q66929l99146j16687M97080K09629K31001L23462
5511E308802M09329r7522o5344O39710J01860j004968L40523m24549m99663L7114
5501D745292N35191k48789J26557L09314k23481n55767J41006N4563k94237M67091
5491E056740M79593O59974m12429L917o3488O26149N25521Q23281k07304j05247
5481G386707n02846K80217R47754n321J03408k307Q58982m4537l00742m15219
$$ plain form
5551 1776300 1966587 2280939 2655614 2715850 2451527 2431200 2930626 2275843 2548115 2188100
5541 2188100 2938558 2649833 2725922 2792064 3219047 3066946 3336393 2972017 2723031 2256402
5531 2256402 2412344 2975349 2711571 2790776 2776152 3450808 3393410 3276289 3218385 3592465
5521 3592465 3305214 3111523 3696534 4563463 4164317 4047630 4544710 4754339 4985340 5308802
5511 5308802 5718131 5620609 5555265 6194975 6296835 5291867 5632390 5207841 4708178 4745292
5501 4745292 5280483 5031694 5158251 5467565 5244084 4688317 4829323 4883886 4589649 5056740
5491 5056740 5536333 6196307 5783878 5787795 5724307 6350456 6875977 7699258 7491954 7386707
5481 7386707 6883861 7164078 8111832 8106511 8209919 8207612 9066594 9022057 8721315 8306096
5471H306096k00496j55706M9315K855L31185J40129k90538m86983L85131N97491
5461H678479p77537m5583k94511L74984r21272o55685K12537O81536K01890j87837
5451G267001r06088K88457k56583K88912N29644m32726K2073j83484L05375P33762
5441G656343K55895K70117K52038o92032j22458J44260Q4476o27730l7638k52251
5431F931020p23363O42512Q9057o05190q3651J43416n81732o85739J56454m40225
5421D842559O49819P04492K4620l89503k95106M4688k09519J73641j50508J94426
5411E589609l55039j15670K69051K84274k79812R4580O5421K42180O44573J15251
5401F554418m88313O57823n25539m88385k07078m06590l83507L1437O67071J07384
$$ plain form
5471 8306096 8105600 7949894 7999209 8002064 8333249 8473378 8182840 7695857 8080988 8678479
5461 8678479 7900942 7855359 7560848 7935832 7014560 6358875 6571412 7252948 7454838 7267001
5451 7267001 6360913 6649370 6392787 6681699 7211343 6778617 6800690 6617206 6922581 7656343
5441 7656343 7912238 8182355 8434393 7742361 7619903 7764163 7848639 7220909 7183271 6931020
5431 6931020 6207657 6850169 6939226 6334036 6250385 6393801 5812069 5126330 5282784 4842559
5421 4842559 5492378 6196870 6221490 5831987 5536881 5581569 5372050 5545691 5395183 5589609
5411 5589609 5234570 5118900 5387951 5672225 5392413 5486993 5552414 5794594 6439167 6554418
5401 6554418 6066105 6723928 6198389 5710004 5502926 5096336 4712829 4744266 5411337 5518721
5391E518721o54237J87661N51292n01316M84147r29305l59183m26201L69535N66035
5381D807149p00429l1425O16987j95167J8802M0202O00508j83651k47982k29584
5371D495410K83397q62584Q07746J08019L31315J77567j17698J75498o96057p07776
5361C994837J85254L91159p37268j98338M70217L97810M11648n82808P8959j91227
5351D220243l98677O26635K58350m27015k79490N21413P22383n05265n12275K30729
5341D457031O5926L18543k43276l98783j04042r9854k84302O59477M3748k07492
5331D206976m19394O6102O13727K26919m30223j05356M75434P0399l98639K78742
5321D584687p10599K47073J23997q4774l85609J5178K95423n427j15708Q2668
$$ plain form
5391 5518721 4864484 5052145 5603437 5102121 5586268 4656963 4297780 3871579 4241114 4807149
5381 4807149 4106720 4075295 4692282 4497115 4515917 4556119 5156627 4972976 4724994 4495410
5371 4495410 4778807 3916223 4723969 4831988 5163303 5340870 5223172 5398670 4702613 3994837
5361 3994837 4180091 4571250 3833982 3635644 4105861 4503671 4915319 4332511 4411470 4220243
5351 4220243 3821566 4448201 4706551 4279536 4000046 4521459 5243842 4738577 4226302 4457031
5341 4457031 4522957 4841500 4598224 4199441 4095399 3995545 3711243 4370720 4414468 4206976
5331 4206976 3787582 3853684 4467411 4694330 4264107 4158751 4634185 4704584 4305945 4584687
5321 4584687 3874088 4121161 4245158 4160384 3774775 3789953 4085376 4079949 3964241 4046909
5311D046909J70438l45885O9871M55330j07011k93125N3892j68233L78636o99960
5301C560862j89772P92226L94088o50452P6218Q9257o39690K90632p8885K35059
5291C879543M58078k6099J54779J31143P5710P5402l18977m66169r320M49537
5281D403627n1682j2845K58348J09108p3698l77820k24021l41690o56219J04562
5271C137670L13769L99189L27303l85257M7095K10988j086857K36851N47170M26999
5261D174920l71576L96064K38952K14208k52146p78015K58118J35944p9983P3338
5251D009824K10005Q0928M4136P08720K1399J3293j112494m34558l04141K72741
5241C509853O53105N74702n91842q80122P949L91195L22059l08040M5528j86989
$$ plain form
5311 4046909 4217347 3871462 3941333 4396663 4289652 3996527 4050419 3882186 4260822 3560862
5301 3560862 3371090 4163316 4557404 3906952 3983170 4072427 3432737 3723369 3644484 3879543
5291 3879543 4337621 4311522 4466301 4597444 4673154 4748556 4429579 3963410 3954090 4403627
5281 4403627 4351945 4339100 4597448 4706556 4632858 4255038 4031017 3689327 3033108 3137670
5271 3137670 3451439 3850628 4177931 3792674 3839769 4050757 2963900 3200751 3747921 4174920
5261 4174920 3803344 4199408 4438360 4652568 4400422 3622407 3880525 4016469 3936486 4009824
5251 4009824 4219829 4300757 4344893 5053613 5075012 5088305 3975811 3541253 3237112 3509853
5241 3509853 4162958 4737660 4145818 3265696 3273645 3664840 3986899 3678859 3724387 3537398
5231C537398J70311l14007n1295n2845j72103R2097P2901j33095k90237K63423
5221C122548J243894n49696k67003J16140k52418l64958K69988M68901P5366l68015
5211C494747r59916M36610P23058k63764K59137k95869j38686o19808N05514j64652
5201B976371l41864K53783J06215N61932N96983l80650J55922r8131N03452k35764
5191D098249j51698m15138l55537K41261k15357L53606L00373l46926l7849M16422
5181C887406K83279q00493N1221J73228n78240k04237l52253P87263L09213q0266
5171C476121J04469M09150n1928o76836l77029O73632N28469j35609K12294m15861
5161C746872K14732J69075M2530m59811N1209M12309n15208R8893J30047l63648
$$ plain form
5231 3537398 3707709 3393702 3342407 3289562 3117459 3209556 3282457 3149362 2859125 3122548
5221 3122548 4366442 3816746 3549743 3665883 3413465 3048507 3318495 3787396 3862762 3494747
5211 3494747 2534831 2971441 3694499 3430735 3689872 3394003 3255317 2635509 3141023 2976371
5201 2976371 2634507 2888290 2994505 3556437 4153420 3772770 3928692 3830561 4334013 4098249
5191 4098249 3946551 3531413 3175876 3417137 3201780 3555386 3855759 3508833 3470984 3887406
5181 3887406 4170685 3370192 3421413 3594641 3016401 2812164 2459911 3247174 3556387 3476121
5171 3476121 3580590 3989740 3937812 3260976 2883947 3557579 4086048 3950439 4162733 3746872
5161 3746872 3961604 4130679 4173209 3713398 3764607 4176916 3661708 3760601 3890648 3527000
5151C527000l0611O45803l07873k4321k75181N90757j92653L79055m576j80843
5141D126557K49767J70884l23845m3530L33340k2678j48295k29171M64791l14041
5131D263779J4582M85526j59085J41543k28633O6392q0489k79398K62950n0249
5121D436918M62761k53372N1331l11792O80428K52174l87256N02449J34962l56448
5111E212155j8102j48359j96361M27078k23072K22785K41045J13565L81389j31322
5101E880801l88749K19104n41146O69843Q27848k43009P5040j72400l95302k17430
5091E714600O19685N22948k5689L0982q69817k8086J013494p9109O6765k8643
5081F937130p09691p6492j94530j11698l5906Q1874P31575M31993p5322o62678
$$ plain form
5151 3527000 3496389 4142192 3834319 3809998 3534817 4125574 3932921 4311976 4307400 4126557
5141 4126557 4376324 4547208 4223363 4179833 4513173 4490495 4342200 4113029 4577820 4263779
5131 4263779 4278361 4763887 4604802 4746345 4517712 4584104 4503615 4224217 4487167 4436918
5121 4436918 4899679 4646307 4697638 4385846 5066274 5318448 4931192 5433641 5568603 5212155
5111 5212155 5194053 5045694 4849333 5276411 5053339 5276124 5517169 5630734 6012123 5880801
5101 5880801 5492052 5711156 5170010 5839853 6667701 6424692 6499732 6327332 5932030 5714600
5091 5714600 6334285 6857233 6831544 6862526 5992709 5964623 6978117 6899008 6965773 6937130
5081 6937130 6227439 6150947 5956417 5844719 5808813 5890687 6622262 7054255 6978933 6316255
5071F316255J10740N00673N3K78307L23732k91814J73681O04085l56720k41852
5061G417140j03428M39418k33376p39110M95105J64546K12575n67023J69193r2740
5051G162300N33625O68848o27334J90742q10529j2525k5608o1147Q92726J33150
5041H044248k76531J7013K22390L66930J03618j39406p07380o68736J87884k2744
5031G127286M00500R27919k09294o4620n3700p63422P14782J74305J28940j89430
5021H193266k08452K38350J52010N18371n34364Q8296n22557M30827n56741K53443
5011H052449R8906l61913p1346J16880j14776J56183O14694k86653J49814J42676
5001H496914J99465q2411j48840k98373n39109J02137P0918j23029k71487m008
$$ plain form
5071 6316255 6426995 6927668 6927721 7206028 7529760 7237946 7411627 8015712 7658992 7417140
5061 7417140 7313712 7753130 7519754 6780644 7275749 7440295 7652870 7085847 7255040 7162300
5051 7162300 7695925 8364773 7737439 7928181 7117652 7105127 7079519 7018372 7911098 8044248
5041 8044248 7767717 7784730 8007120 8374050 8477668 8338262 7630882 6962146 7150030 7127286
5031 7127286 7527786 8455705 8246411 8181791 8128091 7364669 8079451 8253756 8382696 8193266
5021 8193266 7984814 8223164 8375174 8893545 8359181 8447477 7924920 8355747 7799006 8052449
5011 8052449 8151355 7789442 7718096 7834976 7720200 7876383 8491077 8204424 8354238 8496914
5001 8496914 8696379 8613968 8465128 8166755 7627646 7729783 7800701 7677672 7406185 7402177
4991G402177L12701M12804r6516p23132M22681p7300j11701j71511L95545K03474
4981G969222q01270l69924N9724P3192J87568K53044j91699k61201m71858L93879
4971F840677L20373j76541J42943j40778J27109o0188K89532m36768j88770q25619
4961E891970L96903K11910J06400M38346J25866m00995m83306j52974q1195K75900
4951F328825j01307L99082L21563r0372n6186n12248o26091j07821N82787p7462
4941F060770o3105k89460N67787o03159p448O87492m42080m12675r884j10694
4931E377544J8354Q03988J50865m26561j71108j8321M29540J00723l75615l51386
4921E538023o93755J7529j55434O41865K83188J86954j68389k74872M57179K62214
$$ plain form
4991 7402177 7714878 8127682 8031166 7308034 7730715 7653415 7541714 7370203 7765748 7969222
4981 7969222 7167952 6798028 6857752 6930944 7118512 7371556 7179857 6918656 6446798 6840677
4971 6840677 7161050 6984509 7127452 6986674 7113783 7053595 7343127 6906359 6717589 5891970
4961 5891970 6288873 6500783 6607183 7045529 7171395 6770400 6287094 6134120 6052925 6328825
4951 6328825 6227518 6626600 6948163 6857791 6801605 6289357 5663266 5555445 6138232 6060770
4941 6060770 5997665 5708205 6275992 5672833 5665385 6352877 5910797 5498122 5488238 5377544
4931 5377544 5395898 6199886 6350751 5924190 5753082 5734761 6164301 6265024 5889409 5538023
4921 5538023 4844268 4861797 4706363 5348228 5631416 5818370 5649981 5375109 5832288 6094502
4911F094502M8833k91337M6922p4827J78653L40559k09099K35397L7757k3891
4901F383469k22522L84358O81948k02148l3432K35387L2426k64730P05304K35940
4891G936000J35294Q6177m28882M8190l27766K4574j71545L40796O1872m64497
4881G240213K42796L11727J31575L38453J38680j59461J35737J81722n1425j28316
4871H381701J9570k33350k50860M79003n81189N28082m3035j7813k25725k75265
4861G781119n84087L06527K34120l59426n19097J76424L98950J05621o56825m25298
4851F458028l63874l98546N85506M51908L97421l98246K81748l40608P95057K70150
4841G738544o5132M32807n73121l47509j5508L33221N50071j6899N63021j13841
$$ plain form
4911 6094502 6143335 5851998 5898920 5824093 6002746 6343305 6134206 6369603 6407360 6383469
4901 6383469 6160947 6545305 7227253 7025105 6991673 7227060 7259486 6994756 7700060 7936000
4891 7936000 8071294 8157471 7728589 7776779 7449013 7473587 7302042 7642838 7704710 7240213
4881 7240213 7483009 7794736 7926311 8264764 8403444 8243983 8379720 8561442 8510017 8381701
4871 8381701 8401271 8167921 7917061 8396064 7814875 8342957 8299922 8282109 8056384 7781119
4861 7781119 7197032 7503559 7737679 7378253 6859156 7035580 7434530 7540151 6883326 6458028
4851 6458028 6094154 5695608 6281114 6733022 7130443 6732197 7013945 6673337 7468394 7738544
4841 7738544 7673412 8106219 7533098 7185589 7170081 7503302 8053373 8036474 8599495 8485654
4831H485654Q0591j5265n83669n7746j94740k675L49924o60866o64238O90636
4821G427606n03036K61261L44856j5212j85227J6779N47992R445l49366k85966
4811G269132l71591N97766N29384l48670O25798o8217L41542K32379J14638p03976
4801H218185k5000m3110j73978o1679J90440M53972l16634K74105L9081p078r9367
4790H448937j38426K52572r3613O49076J65153p43724O3245L49008J35688M65570
4780I553486p802Q81010L29458k62436j47552J3200l17773K22628K87960j92000
4770A0360179K56473Q53180K8913L8649m49165p1933k70464j44128J247802k48178
4760A1601328J74415N93063l14677K9673J99696q43619J164005M44752K95531
$$ plain form
4831 8485654 8566245 8550980 7967311 7909565 7714825 7712150 8062074 7401208 6736970 7427606
4821 7427606 6924570 7185831 7530687 7515475 7330248 7347027 7895019 7904464 7555098 7269132
4811 7269132 6897541 7495307 8024691 7676021 8301819 8233602 8575144 8807523 8922161 8218185
4801 8218185 8193185 8150075 7976097 7914418 8104858 8558830 8242196 8516301 8555382 8548304 8448937
4790 8448937 8310511 8563083 8469470 9118546 9283699 8539975 8603220 8952228 9087916 9553486
4780 9553486 9545684 10426694 10756152 10493716 10346164 10359364 10041591 10264219 10552179 10360179
4770 10360179 10616652 11469832 11498745 11537394 11088229 11016296 10745832 10601704 11849506 11601328
4760 11601328 11775743 12368806 12054129 12083802 12283498 11439879 12603884 13048636 13344167
4751A3344167M51468L00890r18403K25485J425478M00404j95141P56668M68992
4742A6260008o32788O65699j50645M98499K76672n24383K20900j97078O33618
4733A7050502m15974P21859N42957j51177k84657K15073l42326j24337J064752
4724A8276672Q18799j23307L93988M88198L93151J387164P66004j07941R65454
4715B3258182R12383Q13354j5967Q6313N61341n1440P71498Q20687L91992J21301
4705B7669644L03323J73615N12903N70020O63103P3839J083121J342337J414472
4696C3806377N72910R77570Q88095J508554J744291K097963K182782K674404K071626
4687D8524572L113453L077071J748051J725937J486776J488649J585458J034412
$$ plain form
4751 13344167 13795635 14096525 13178122 13403607 14829085 15229489 15034348 15791016 16260008
4742 16260008 15627220 16292919 16142274 16640773 16917445 16393062 16613962 16416884 17050502
4733 17050502 16634528 17356387 17899344 17748167 17463510 17678583 17336257 17211920 18276672
4724 18276672 19095471 18972164 19366152 19854350 20247501 21634665 22400669 22292728 23258182
4715 23258182 24170565 24983919 24967952 25054265 25615606 25564166 26335664 27156351 27548343 27669644
4705 27669644 27972967 28146582 28659485 29229505 29892608 29966447 31049568 32391905 33806377
4696 33806377 34379287 35356857 36244952 37753506 39497797 41595760 43778542 46452946 48524572
4687 48524572 51638025 54715096 56463147 58189084 59675860 61164509 62749967 63784379
4679F3784379l93020k06752r60998l98008K41258J42693Q1965j80214Q44223J181858
4669F4137384J184662R24515R83048J229509Q81524J117428K194996R79714J872072
4660G5504852K966146L502872K942040M472296M138882N091817N424944M717795
4652A08761644L673035K935674J066642j056419j664323k897697k715721k523551
4644A05579284k404737k258620k033899q82342n84610j47764K42948J607458R49191
4635A00066909O515Q30833J40769j320133j869333j600659k411351j264696r90271
4626I1588583l2751J07805O45722P74690J263016J040549N10654N75727q64964
4617I5609031k374207l245088l682066k350340k739072k912463k522566j353346
$$ plain form
4679 63784379 63391359 63184607 62223609 61825601 62066859 62209552 62291517 62111303 62955526 64137384
4669 64137384 65322046 66246561 67229609 68459118 69340642 70458070 72653066 73632780 75504852
4660 75504852 78470998 81973870 84915910 89388206 93527088 98618905 104043849 108761644
4652 108761644 112434679 115370353 116436995 115380576 113716253 110818556 108102835 105579284
4644 105579284 103174547 100915927 98882028 97999686 97415076 97267312 97510260 99117718 100066909
4635 100066909 100073424 100904257 101045026 99724893 97855560 96254901 93843550 92578854 91588583
4626 91588583 91555832 91663637 92309359 93084049 94347065 95387614 95898268 96473995 95609031
4617 95609031 93234824 89989736 86307670 83957330 81218258 78305795 75783229 74429883
4609G4429883j582008j193158j58750o98858o90071J79135k35197J78776l14414
4600F9915338p0940j410668n87076k29205j284884o19164k28914j506594j769241
4591F2208652k286604k851311j822366k109272k114784j961480k881353k007081
4583D4174401j677160j630362j160471j285855j581407j931553j268946J84906
4575C3823553k67158j203407p71927l60345q70624j28164k8763m48640j351975
4566B8392550k65313j52024l85036n0789k38924j37342m20975m71082K71969q53837
4556B5689197m60732p2316l4163j25243n37773P1657n27711m95331m32739L18460
4546B3393306l3965n80857p1758J32087J34541p73315o51800Q88011j18492o31237
$$ plain form
4609 74429883 72847875 71654717 71495967 70797109 70107038 70286173 70050976 70229752 69915338
4600 69915338 69844398 68433730 67846654 67617449 66332565 65713401 65484487 63977893 62208652
4591 62208652 59922048 57070737 55248371 53139099 51024315 49062835 46181482 44174401
4583 44174401 42497241 40866879 39706408 38420553 36839146 34907593 33638647 33823553
4575 33823553 33556395 32352988 31581061 31220716 30350092 30221928 30193165 29744525 28392550
4566 28392550 28127237 27975213 27590177 27539388 27300464 27163122 26742147 26271065 26543034 25689197
4556 25689197 25228465 25156149 25121986 24996743 24458970 24530627 24002916 23507585 23074846 23393306
4546 23393306 23359341 22778484 22706726 22838813 22973354 22200039 21548239 22436250 22317758 21686521
4536B1686521N56944R60502l02149l61122j028567n0125m57751J70653M80385
4527B1655291k73791l85768l48288m57572R72686l95864q9882R1465O6951P25912
4517B1561140m12322k07575R3788L32928n6894k87273K3510n61783l33872L66456
4507B0518103P24431m32497r2881j88531l74832P24352M25067j30391m2993n39421
4497B0590407Q68213j0742m74585J37633j98616J81142N98193O58670J0323K9753
4487B2390391j51206j82849j18825M41796m10O59932P45622k94819K85855J72385
4477B3947872L02781M4079K67740k26578M83585K12672q5770L96937j1703j32092
4467B5199523J94065O83391P89657P81404P88397J19630L09759P98316L66368
$$ plain form
4536 21686521 22243465 23203967 22901818 22540696 21512129 21462004 21004253 21174906 21655291
4527 21655291 21381500 20995732 20647444 20189872 21162558 20766694 20676812 20768277 20835228 21561140
4517 21561140 21148818 20941243 21035031 21367959 21311065 21023792 21047302 20485519 20151647 20518103
4507 20518103 21242534 20810037 20717156 20528625 20153793 20878145 21303212 21172821 21129828 20590407
4497 20590407 21458620 21447878 20973293 21110926 20912310 21093452 21691645 22350315 22360638 22390391
4487 22390391 22239185 22056336 21937511 22379307 22378897 23038829 23784451 23489632 23775487 23947872
4477 23947872 24250653 24294732 24562472 24335894 24819479 25032151 24946381 25343318 25331615 25199523
4467 25199523 25393588 26076979 26866636 27648040 28436437 28556067 28865826 29664142 30030510
4458C0030510o45000k66746M40581O16472r1073j50868l36875J11828L41251J25044
4448C0175124J10090K78000R82529L58635J01258P7817J267865J027422P79737
4439C5158477N02583N98392P67902O24584Q83347J016268N34464J266317J626117
4430D2978451J266754J597966J205965M08223J502777N12452J75229L88939N6436
4421E0093192j174863j126997o85379m94193j26269l88698q29495o7450n73745
4412D4626103q55630j27718Q52162J53390q3266n8008l0329j2274o8005N65275
4402D4961700L33416k31118M00750M27337M37038J23556Q46518M28584M69909
4393D8197690o8330j90087n73538q50126l42835j180626O66365R6106o58717K3830
$$ plain form
4458 30030510 29385510 29118764 29559345 30175817 30084744 29933876 29597001 29708829 30050080 30175124
4448 30175124 30285214 30563214 31545743 31904378 32005636 32083453 33351318 34378740 35158477
4439 35158477 35661060 36259452 37027354 37651938 38535285 39551553 40086017 41352334 42978451
4430 42978451 44245205 45843171 47049136 47457359 48960136 49472588 49647817 50036756 50093192
4421 50093192 48918329 47791332 47105953 46611760 46485491 46096793 45267298 45199848 44626103
4412 44626103 43770473 43642755 44494917 44648307 44565041 44507033 44476704 44464430 44396425 44961700
4402 44961700 45295116 45063998 45464748 45892085 46329123 46452679 47299197 47727781 48197690
4393 48197690 48129360 47939273 47365735 46515609 46172774 44992148 45658513 45754619 45095902 45119732
4383D5119732M97336O07144N00329M96414O91683M59435R21322J406221J189228
4374E1888844J485486J140169J004117K176932J563603O06016J490923J414394
4366F2770484J440292J079585J079722Q03289J89067r54594p26674p21893o52673
4357F4306605n31681q31526K44170M38261Q07117P65416J277666Q27562J096466
4348F8400056J061519J324632J720576J029746K256561J382165J206679R06317
4340G9288251N26438J648247J090235O50313O12269j23898k35027Q14900K90426
4331H4562154J198720P29916K82277O47204Q78324Q72329J736339J838749J580552
4322I4326564K093838L149619L866245L484850L897642M949119M328471M875198
$$ plain form
4383 45119732 45617068 46224212 46724541 47220955 47912638 48372073 49293395 50699616 51888844
4374 51888844 53374330 54514499 55518616 57695548 59259151 59865167 61356090 62770484
4366 62770484 64210776 65290361 66370083 67173372 67362439 66407845 65681171 64959278 64306605
4357 64306605 63774924 62943398 63187568 63625829 64432946 65198362 66476028 67303590 68400056
4348 68400056 69461575 70786207 72506783 73536529 75793090 77175255 78381934 79288251
4340 79288251 79814689 81462936 82553171 83203484 83815753 83691855 83456828 84271728 84562154
4331 84562154 85760874 86490790 86773067 87420271 88298595 89170924 90907263 92746012 94326564
4322 94326564 96420402 99570021 103436266 106921116 110818758 115767877 120096348 124971546
4314A24971546N173873M852779O573186P051188O965590P917238Q229955P006195
4306A78741550M685659J849810k068465n799914p190458p157754p019265o610761
4298A49430402n260798m765676m134460l995749l155022k534411k124077j548015
4290A21912194m18868r71433k82041J421940Q14682J107212N60351Q85039N17311
4281A25546387P10933K49363J219165K143946J299272J849713L074606M356525
4273A40449910M042874L704398M644753N468545N561112M715556L482652L754267
4265A75824067M322617M108633O209416O940052R154297J2066648J4277878J7309509
4257B50213117K1126351K4165774K5914718K6664891K6659261K3330224J3904753
$$ plain form
4314 124971546 130145419 134998198 141571384 148622572 155588162 163505400 171735355 178741550
4306 178741550 183427209 185277019 183208554 177408640 170218182 163060428 156041163 149430402
4298 149430402 144169604 139403928 135269468 131273719 128118697 125584286 123460209 121912194
4290 121912194 121493326 120521893 120239852 121661792 122476474 123583686 124144037 125029076 125546387
4281 125546387 126257320 126506683 127725848 129869794 131169066 133018779 136093385 140449910
4273 140449910 144492784 148197182 152841935 158310480 163871592 168587148 172069800 175824067
4265 175824067 180146684 184255317 190464733 197404785 206559082 218625730 232903608 250213117
4257 250213117 271339468 295505242 321419960 348084851 374744112 398074336 411979089
4250D11979089L319028m391531m634649j779838J334197Q85656j493754n028073
4242D00190125j0658506j5973591j7767687j6911619j6173806j6001833j5289959
4235B91413124j3342209j3264457j2192427j0883047r048580q581300q798848
4228B15302256q372235p990025p802780p621890p669585p087459o288078n905849
4220A56564355o084690m821287m995920n169632m064107m262240l619176l224620
4212A20322683k895926k772998k617177k667498k451655j669592j506528j768108
4204A01973201j505878j507858j956022k672489k790063j529031j716722k010890
4196H6284248j205002j509018j414261j058169m20707m92025p15020j388782p91980
$$ plain form
4250 411979089 415298117 410906586 406271937 404492099 405826296 406711952 405218198 400190125
4242 400190125 389531619 373558028 355790341 338878722 322704916 306703083 291413124
4235 291413124 278070915 264806458 252614031 241730984 232682404 224101104 215302256
4228 215302256 206930021 198939996 191137216 183515326 175845741 168758282 162470204 156564355
4220 156564355 150479665 145658378 140662458 135492826 131428719 127166479 123547303 120322683
4212 120322683 117426757 114653759 112036582 109369084 106917429 105247837 103741309 101973201
4204 101973201 100467323 98959465 97003443 94330954 91540891 90011860 88295138 86284248
4196 86284248 85079246 83570228 82155967 81097798 80677091 80185066 79470046 78081264 77289284
4187G7289284j045853o64526M5406j949118l73364k09246o91992j021773o03379
4178G0775439o49668j032717l32309p0002l56371p26344o58211j055485q74172
4169F5020160j764536j242955j230541j566257j158309j101851j143752l44016
4161E5467943j605009j470937j07979j024945l65579L0807j219055n13741m23324
4152D8768181m89250j103932k30635j188233o15593n67592M6238j090807k94676
4143D3233701m69327n94802K64857o5588n39602q87431o77057j457946l10276
4134C8496529p51954m56347j08315n38377J49931k94789n79132p16845j175590
4125C4025111p51218l32425N06516n40551l38698P3819l72371p21150n75284k04666
$$ plain form
4187 77289284 76243431 75578905 75624311 73675193 73301829 73092583 72400591 71378818 70775439
4178 70775439 70125771 69093054 68760745 68690743 68334372 67608028 66949817 65894332 65020160
4169 65020160 63255624 62012669 60782128 59215871 58057562 56955711 55811959 55467943
4161 55467943 53862934 52391997 52284018 51259073 50893494 50924301 49705246 49191505 48768181
4152 48768181 48278931 47174999 46944364 45756131 45140538 44572946 44619184 43528377 43233701
4143 43233701 42764374 42169572 42434429 42368841 41829239 40941808 40264751 38806805 38496529
4134 38496529 37744575 37288228 37179913 36641536 36791467 36496678 35917546 35200701 34025111
4125 34025111 33273893 32941468 33447984 32907433 32568735 32642554 32270183 31549033 30973749 30769083
4115C0769083L12651M5010r03718k2424J61044o49153J98136l08278l58014J62381
4105B9406718o77812n43209m15798L1182m87115l88055k65661K05287L33104j015907
4095B6182734q01025m28997l91480m09851O41502m13825n77194o35164k23454
4086B2943246o1376l38468R6699j02478L78435r916j43270m55433o92364L14773
4076B1929848o14716j55296K18177m47673J82566k60248j17878K13974j93890
4067B0754864L20754P3011j43959q54497J05091K1408R2454K10133k13501n70119
4057A9795639q75455L47846M43072o22641p44130L9061q35J89177j54604j58367
4047A8258763K70578m70583L35102L2033j94435l93030N04421k58951j09185l47324
$$ plain form
4115 30769083 31081734 31126744 30223026 30200602 30361646 29712493 29910629 29602351 29244337 29406718
4105 29406718 28728906 28185697 27769899 27801081 27313966 26925911 26660250 26865537 27198641 26182734
4095 26182734 25381709 24952712 24561232 24151381 24792883 24379058 23801864 23166700 22943246
4086 22943246 22881870 22543402 22640101 22537623 22916058 22906142 22762872 22307439 21615075 21929848
4076 21929848 21315132 21159836 21378013 20930340 21112906 20852658 20734780 20948754 20754864
4067 20754864 21075618 21148629 21004670 20150173 20255264 20276672 20369126 20579259 20365758 19795639
4057 19795639 18920184 19268030 19711102 19088461 18344331 18383392 18382557 18571734 18417130 18258763
4047 18258763 18529341 18058758 18393860 18425893 18231458 17838428 18342849 18083898 17974713 17627389
4037A7627389o39673m46804L84272n24408m38822M66444J22477k46009J83429
4028A6488295J06147k45087k53429L22257Q2338k57858m8089l75328j55653l81355
4018A5282238J39970J79166L5612J02472M0984l60408L57504q81094m58914N00568
4008A4938098J32776L07323L00564n41510O1553m9379j82344j17166J46044l9344
3998A4956615L40520O09531L21884n19963r26973M24576L14236j26200k16148
3989A5178078n28583N74439l58759j32687j56660k54889j14681M39605k25150
3980A4420713L81136N19866j13056o94328o9l28329P87586K85916m46647Q0537
3970A4893325n55924J68691J42168n96720M49680J055474p44826n11196l10824
$$ plain form
4037 17627389 16987716 16540912 16925184 16400776 15961954 16428398 16550875 16304866 16488295
4028 16488295 16594442 16349355 16095926 16418183 16500521 16242663 16194574 15819246 15663593 15282238
4018 15282238 15422208 15601374 15636986 15739458 15780442 15420034 15777538 14896444 14437530 14938098
4008 14938098 15070874 15378197 15678761 15137251 15198804 15149425 14967081 14849915 14995959 14956615
3998 14956615 15297135 15906666 16228550 15708587 14781614 15206190 15520426 15394226 15178078
3989 15178078 14649495 15223934 14865175 14732488 14575828 14320939 14206258 14645863 14420713
3980 14420713 14801849 15321715 15208659 14514331 14514262 14185933 14973519 15259435 14812788 14893325
3970 14893325 14337401 14506092 14648260 14051540 14501220 15556694 14811868 14300672 13989848
3961A3989848R38474N91188J32991m51740K22693M04485k78936K68238L49033
3952A6166274K22679J8532q2753J25323j97490O28527K12687l92925l38552n44491
3942A5817811J51005J572232Q67342J6661J37645j28279P52380j85386m9244R71223
3932A9923390l79025J42524m92341K1005K06638q7237J19199p6715l11877o54699
3922A8410862R8290j36186K06513J53050R77524l11351j220048k47518L8762k89670
3912A7680228L55773K97544P8883m24014K38757o2314R0411P57569m87844n8416
3902A8466577K86727K69203N86070k48548K3477l08925L05972K24923j21911J38219
3892A9621784L10826N60863P15046l32424j72651L78121R6806p91626k33324J265167
$$ plain form
3961 13989848 14928322 15519510 15652501 15200761 15423454 15827939 15549003 15817241 16166274
3952 16166274 16388953 16407485 16324732 16450055 16252565 16881092 17093779 16700854 16362302 15817811
3942 15817811 15968816 17541048 18408390 18425051 18562696 18434417 19186797 19001411 18952167 19923390
3932 19923390 19544365 19686889 19194548 19215553 19422191 19334954 19454153 19377438 19065561 18410862
3922 18410862 18509152 18372966 18579479 18732529 19710053 19398702 18178654 17931136 17969898 17680228
3912 17680228 18036001 18333545 18412428 17988414 18227171 18164857 18255268 19012837 18524993 18466577
3902 18466577 18753304 19022507 19608577 19360029 19383506 19074581 19380553 19605476 19483565 19621784
3892 19621784 19932610 20493473 21208519 20876095 20703444 21081565 21178371 20386745 20153421 21418588
3882B1418588L68948n60962j96809J512866L72376l83676j03205N56841P6749
3873B3061716K52484J094649K53095r5406L47091M88585R50914N67781Q84541
3864B7805450O16828R41725P19298J130476P84674Q89746P78865O26258Q25246
3855C5118566K78179K23211N71202L04969r4041p58032L42272q15780l04367L84914
3845C5251093r95061k12085o35645j96327l50043m87172k52240l81146n05915
3836C1235459r7879n53974l00660o86235n96311J05849o4605o10961p42497O1217
3826B7749403n1109l73514O08396K34388k30663m24646m45925k82044o06085k05677
3816B5972524k26509n89140O94614K34006m00949m48260o14459m92708m16657
$$ plain form
3882 21418588 21787536 21226574 21029765 22542631 22915007 22531331 22428126 22984967 23061716
3873 23061716 23314200 24408849 24661944 24566538 24913629 25402214 26353128 26920909 27805450
3864 27805450 28422278 29364003 30083301 31213777 31998451 32888197 33667062 34293320 35118566
3855 35118566 35396745 35619956 36191158 36496127 36402086 35644054 35986326 35170546 34866179 35251093
3845 35251093 34256032 34043947 33408302 33211975 32861932 32374760 32122520 31741374 31235459
3836 31235459 31137580 30583606 30282946 29596711 29000400 29106249 29041644 28430683 27688186 27749403
3826 27749403 27698294 27324780 27933176 28167564 27936901 27512255 27066330 26784286 26178201 25972524
3816 25972524 25746015 25156875 25851489 26085495 25684546 25236286 24621827 24129119 23712462
3807B3712462k58515K58495L9431K78907K92677k45502l18612k12984k50727o49084
3797B2646548L46231N02671O92291o00891q101j73831R81473M87813j058331l90360
3787B3425513N20396L38486k6440m55006L06356J85522j7526k15516m11544J14770
3777B3765011j1939m44780L69278J50277N61655J72685n48247k93716L63670L36466
3767B4420360k32715K3167p19081j51409j64159J96421M14223L91598o07240k84179
3757B3286986K26239R0133M26310K78445k12890n11634L49953k48507l81898R284
3747B3312421L14190K1858P27716R0444n61334O83790m28562J54105k09870N15614
3737B4620372j539J77955m80127R6334M07204R71068M21364J20228n77042o72938
$$ plain form
3807 23712462 23453947 23712442 23751873 24030780 24323457 24077955 23759343 23546359 23295632 22646548
3797 22646548 22992779 23495450 24187741 23586850 23578749 23404918 24386391 24874204 23815873 23425513
3787 23425513 23945909 24284395 24257955 23802949 24109305 24294827 24277301 24061785 23650241 23765011
3777 23765011 23753072 23308292 23677570 23827847 24389502 24562187 24013940 23720224 24083894 24420360
3767 24420360 24187645 24210812 23491731 23340322 23176163 23372584 23786807 24178405 23571165 23286986
3757 23286986 23513225 23603358 24029668 24308113 24095223 23583589 23933542 23685035 23303137 23312421
3747 23312421 23626611 23648469 24376185 24466629 23905295 24589085 24160523 24314628 24104758 24620372
3737 24620372 24618833 24796788 24316661 24412995 24820199 25791267 26212631 26332859 25755817 25082879
3727B5082879O3428o572L71892P28331N95229m38009l01320J46780J10949K07539
3717B6561126Q9183J040380J86485m40711j63838N56430m76422m09835J53550
3708B7096348K08208P3018m97010J33172L19490L84081j5711k63832k43897j15810
3698B7078057J59297l99794n50055M35405o36324L43706o00991j7441M27640n24430
3688B5715070K4753L09291k94082k36014j59739K95172L47301p04278K60714L73254
3678B5931442P5845J27085k22059n52334K18188K76985R1817m14271K27917M31084
3668B6191699o50542O8512K98709K41532L3713o13597O13679J96576k70639L01334
3658B6410976K01567M99397k56929j13255P80432P95420q91613K92666J62401
$$ plain form
3727 25082879 25146307 25139735 25511627 26239958 26835187 26397178 26095858 26242638 26353587 26561126
3717 26561126 26650309 27690689 27877174 27436463 27272625 27829055 27352633 26942798 27096348
3708 27096348 27304556 27377574 26880564 27013736 27333226 27717307 27701596 27437764 27193867 27078057
3698 27078057 27237354 26837560 26287505 26722910 26086586 26430292 25829301 25811860 26239500 25715070
3688 25715070 25739823 26049114 25755032 25519018 25359279 25654451 26001752 25297474 25558188 25931442
3678 25931442 26007287 26134372 25912313 25359979 25578167 25855152 25946969 25532698 25760615 26191699
3668 26191699 25541157 25609669 25908378 26149910 26183623 25570026 26183705 26380281 26109642 26410976
3658 26410976 26612543 27111940 26855011 26741756 27522188 28317608 27425995 27718661 27881062
3649B7881062M56352K15502o2475r4311R8953J93460m33726R41457l71161q416
3639B8816697M84670k62906R32149R34698j91990L60930L451J17193M36844k85532
3629C1346204K95341L6267K74329r7542L57213K09208M30064M08846K4754k34157
3619C3050527K09635q3501J084287J407286M81915L20682P11984J94049L96227
3610C7773091N04367K66118R94747N37643P51469R98769L04252N15963R41703
3601D3588122O15389L59350N94267P22323L29531M36230P93546J097224P91517
3592D9327499L58544Q61632J416476Q67838P12893J257284J809861J087551J614240
3583E9313818J974169J604903J696219J764982J288958K625322K138360K519298
$$ plain form
3649 27881062 28337414 28552916 28490441 28396130 28495083 28688543 28254817 29196274 28825113 28816697
3639 28816697 29301367 29038461 29970610 30905308 30713318 31074248 31077699 31194892 31631736 31346204
3629 31346204 31641545 31677812 31952141 31854599 32211812 32421020 32851084 33259930 33284684 33050527
3619 33050527 33260162 33176661 34260948 35668234 36150149 36470831 37182815 37376864 37773091
3610 37773091 38277458 38543576 39538323 40075966 40827435 41826204 42130456 42646419 43588122
3601 43588122 44203511 44562861 45157128 45879451 46208982 46645212 47438758 48535982 49327499
3592 49327499 49686043 50547675 51964151 52831989 53544882 54802166 56612027 57699578 59313818
3583 59313818 61287987 62892890 64589109 66354091 67643049 70268371 72406731 74926029
3575G4926029K195372J086146N48295o09374L42677J58782l97365J47674R1068
3566G8489304N99447m22450r367l03669K46398m4448J95891R29127K01533Q28144
3556H0709910L42421k31246O84430K072030P08106l6122O80185Q98271P13389
3547H6541374N66356J16322Q54512R47391O29618J205602J321829R62188O61771
3538I3806963O19492J426809M04173R33787R37599J254898M62523M77285J015686
3529A01339215j66648J026469P21371J17451J215912J119530J29582R76765P52522
3520A07232169J095948R75073J080736Q60918J020308J113541J603784K318184
3512A17300661J177753J211469J919004J401506J933135J898119K530024K304781
$$ plain form
3575 74926029 77121401 78207547 78755842 78146468 78489145 78647927 78250562 78398236 78489304
3566 78489304 79088751 78666301 78656934 78353265 78599663 78555215 78751106 79680233 79881766 80709910
3556 80709910 81052331 80821085 81505515 83577545 84285651 84249529 84929714 85827985 86541374
3547 86541374 87107730 87224052 88078564 89025955 89655573 90861175 92183004 93145192 93806963
3538 93806963 94426455 95853264 96257437 97191224 98128823 99383721 99846244 100323529 101339215
3529 101339215 101172567 102199036 102920407 103037858 104253770 105373300 105502882 106479647 107232169
3520 107232169 108328117 109303190 110383926 111244844 112265152 113378693 114982477 117300661
3512 117300661 118478414 119689883 121608887 123010393 124943528 126841647 129371671 131676452
3504A31676452K196847K965329K185988L307525K705630K838692K534179K459754
3496A52870396L151800K763277L684298L773014L721529M640192M581864N782346
3488A84968716N842145O175054O845450Q000057Q989961R330520R893800J1527360
3480B51573063J2179868J3277668J4752779J5740142J6656731J7329849J7626924
3473C59137024J7712084J5518409J2879276Q891818L377391j989720q047341j2162289
3465C95316652j5425031j6331022j5624937j4635087j4668251j3870949j2848962
3458B91912413j2107795j1858000j0531956j0591726r549452q475255q571981
3451B20226248q060453p014453p097059o324774n728076n101621m937223m448392
$$ plain form
3504 131676452 133873299 136838628 139024616 142332141 145037771 147876463 150410642 152870396
3496 152870396 156022196 158785473 162469771 166242785 169964314 174604506 179186370 184968716
3488 184968716 190810861 196985915 203831365 211831422 220821383 230151903 240045703 251573063
3480 251573063 263752931 277030599 291783378 307523520 324180251 341510100 359137024
3473 359137024 376849108 392367517 405246793 414138611 417516002 415526282 407478941 395316652
3465 395316652 379891621 363560599 347935662 333300575 318632324 304761375 291912413
3458 291912413 279804618 267946618 257414662 246822936 237273484 228798229 220226248
3451 220226248 212165795 205151342 198054283 191729509 186001433 180899812 175962589 171514197
3443A71514197m568736l170499l599133l649229k888895l252664l146744k775091
3435A44463206k654875k707064k646169k803259j896990k059861j811248j136522
3427A26747218j719059k406322j460600j798582j993407j578133j068530k143116
3419A12579469j421320p44397j178291n78720j099586j276001o47745r78942j06605
3410A04547862m11484k78196k36783j80685N38359K15971J46639M77393Q59434
3401A05678510M64389P3034l93602p63692j104063j238641j515430k220302k152640
3392I6827563j733297j204978m46381j323304j198866j148747j257675r25826
3384H7588489j286926j072203m58348n37395l22078j050744k90295M2644P0821
$$ plain form
3443 171514197 166945461 163774962 160175829 156526600 153637705 150385041 147238297 144463206
3435 144463206 141808331 139101267 136455098 133651839 131754849 129694988 127883740 126747218
3427 126747218 125028159 122621837 121161237 119362655 117369248 115791115 114722585 112579469
3419 112579469 111158149 110413752 109235461 108656741 107557155 106281154 105633409 104654467 104547862
3410 104547862 104136378 103858182 103621399 103440714 103979073 104195044 104341683 104819076 105678510
3401 105678510 106142899 106215933 105822331 105058639 103954576 102715935 101200505 98980203 96827563
3392 96827563 95094266 93889288 93442907 92119603 90920737 89771990 88514315 87588489
3384 87588489 86301563 85229360 84771012 84233617 83911539 82860795 82570500 82613144 82683965
3375H2683965j39066M30019R71531P38744M82380P49610P39948L31942p52806
3366H6236267j262320p51826j511763j047649j834706j282577j776674j074459
3358G5694293j134311j316907j361496j014035j390073r77454r00478o76229q85580
3349F6037730r87849o63414j37557P6412o09261j97132l985j77490L0407L12160
3339F3680021M10633k01927k57703J66778n47556J84137N55584j36081N20811
3330F4374697n9167K74706K59325M93936N41973l7814R25759P40766K95022P76238
3320F8585441P19215N74716Q46209N27603J255662M85121M79389N09497P63425
3311G4746278O62930P99808J356694P62717P41561N24056O14916J72224J153823
$$ plain form
3375 82683965 82544899 82974918 83946449 84685193 85167573 85917183 86657131 86989073 86236267
3366 86236267 84973947 84222121 82710358 81662709 79828003 78545426 76768752 75694293
3358 75694293 74559982 73243075 71881579 70867544 69477471 68500017 67599539 66923310 66037730
3349 66037730 65049881 64386467 64248910 64325322 63716061 63518929 63514944 63337454 63367861 63680021
3339 63680021 64090654 63888727 63631024 63797802 63250246 63434383 63989967 63853886 64374697
3330 64374697 64315530 64590236 64849561 65343497 65885470 65847656 66773415 67514181 67809203 68585441
3320 68585441 69304656 69879372 70725581 71253184 72508846 72993967 73473356 73982853 74746278
3311 74746278 75409208 76209016 77565710 78328427 79069988 79594044 80208960 80381184 81535007
3302H1535007R78604l14520k86660P50578J118714J80664k75852P31581L72996
3293H4791112Q50865Q34480P19163P61317P88486J678820J148467R92590J057730
3284I3623030J688662J800705J835772R74370J827460J968673J951536J730839
3276A07401047Q25753J661485J740076J823176K192327J303794J429645J528108
3268A19905411Q09436J205536J887552O33570P61621m08191p81232j35744m68889
3259A23409070k99837n09310j191842o74125p54028p98198k0522p30764p90616
3250A17639828L6472k21227p34826j102966q89744O7733j32202m01402K65350
3241A14527016M64366M82657O30062K47254L83895P37626p07304o83742j293120
$$ plain form
3302 81535007 82513611 82199091 81912431 82663009 83781723 83962387 83686535 84418116 84791112
3293 84791112 85641977 86476457 87195620 87956937 88745423 90424243 91572710 92565300 93623030
3284 93623030 95311692 97112397 98948169 99922539 101749999 103718672 105670208 107401047
3276 107401047 108226800 109888285 111628361 113451537 115643864 116947658 118377303 119905411
3268 119905411 120714847 121920383 123807935 124441505 125203126 124794935 124013703 123877959 123409070
3259 123409070 123109233 122599923 121408081 120733956 119979928 119181730 119161208 118430444 117639828
3250 117639828 117676300 117455073 116720247 115617281 114727537 114795270 114663068 114261666 114527016
3241 114527016 114991382 115474039 116104101 116351355 116735250 117472876 116765572 116081830 114788710
3232A14788710j299885q45933j015320k209700j991515k238199k657000k514928
3224A00016230j572622j855705j563404k052729k088008k306995j575619j520292
3216H5480856j498991j805337j930245o55631j451927j625691r69945o60010j141285
3207G3741794j376797j492884m31984j131418l79203j258287q76643m00611l81856
3198F6012111j211601l81119j15891n20006J61715n69466p04554r8027n10342
3189F2062820l02633p73876k66981n91458m52808M05229l32156j9196m70544J18806
3179E9377203K58688l24655m8854L17794L70844L20013J94434O2507N79233j4818
3169F1092389M67906K37766P80742J077469Q06724J438569J062775M63298P06782
$$ plain form
3232 114788710 113488825 112642892 111627572 109417872 107426357 105188158 102531158 100016230
3224 100016230 98443608 96587903 95024499 92971770 90883762 88576767 87001148 85480856
3216 85480856 83981865 82176528 80246283 79590652 78138725 76513034 75543089 74883079 73741794
3207 73741794 72364997 70872113 70440129 69308711 68929508 67671221 66794578 66393967 66012111
3198 66012111 64800510 64419391 64303500 63783494 63945209 63375743 62671189 62573162 62062820
3189 62062820 61760187 60986311 60719330 60127872 59675064 60080293 59748137 59728941 59258397 59377203
3179 59377203 59635891 59311236 59262382 59580176 59951020 60271033 60465467 60527974 61107207 61092389
3169 61092389 61560295 61798061 62578803 63656272 64462996 65901565 66964340 67427638 68134420
3160F8134420J085016N92827J5888L78792Q20560L04231j69947O71509N45155
3151G2378451M47922P99198J02551o8804P04577M48038k39146L17544P69911J190508
3141G6850750J360376P95720J045038J981772K130336K244791J335402K176585
3133H9920770K288266K493299J902124N61108Q72604K02333n27405j373480q19710
3124I5519909p72029r01369j215509j232521q45291o00022l9712J148472j23051
3115I0938877m32090K79671J572761M53697M27302J043101R12075L01407K9367
3106I5526168J135343M89579m90869N24763n95695m40282k20261j349636n95752
3097I3983358j172474j412163j578506k509463k159004q19541j414144j106290
$$ plain form
3160 68134420 69219436 69812263 69828151 70206943 71027503 71331734 71161787 71833296 72378451
3151 72378451 72826373 73625571 73728122 73659318 74363895 74811933 74572787 74890331 75660242 76850750
3141 76850750 78211126 79006846 80051884 82033656 84163992 86408783 87744185 89920770
3133 89920770 92209036 94702335 96604459 97165567 98038171 98240504 97713099 96339619 95519909
3124 95519909 94747880 93846511 92631002 91398481 90553190 89953168 89913456 91061928 90938877
3115 90938877 90506787 90786458 92359219 92812916 93240218 94283319 95195394 95496801 95526168
3106 95526168 96661511 97151090 96660221 97184984 96589289 96149007 95928746 94579110 93983358
3097 93983358 92810884 91398721 89820215 87310752 85151748 84332207 82918063 81811773
3089H1811773r25327j179214q15171n96775j021700j191481j179768J43028n56519
3080G4488846j343565j760469r80779n38302j055053j587488j437636j891898
3072F3893656j957239j635036j636735k035250j955494r44200j809107j776114
3064E0144481l55296j141458j549238j448140j259111r78553r65947o92240r18142
3055D0836356j177589n0273k29457j218117q95806k26198j042277j71589j385256
3046C4439794p85137l36238n85624n63515o77294p29153q13553j128824M2880
3037B8863336j81062j8553k04910j062188n45106q3106p44270j004547m81204
3028B4538390l41379M86488k83181p78841o03739n87706l55087N787j78475m70482
$$ plain form
3089 81811773 80886446 79707232 78892061 78295286 77273586 76082105 74902337 75045365 74488846
3080 74488846 73145281 71384812 70404033 69865731 68810678 67223190 65785554 63893656
3072 63893656 61936417 60301381 58664646 56629396 54673902 53729702 51920595 50144481
3064 50144481 49789185 48647727 47098489 45650349 44391238 43412685 42446738 41754498 40836356
3055 40836356 39658767 39608494 39379037 38160920 37265114 37038916 35996639 35825050 34439794
3046 34439794 33654657 33318419 32732795 32169280 31491986 30762833 29949280 28820456 28863336
3037 28863336 28682274 28663721 28458811 27396623 26851517 26768411 26024141 25019594 24538390
3028 24538390 24197011 24683499 24400318 23621477 23017738 22430032 22074945 22080732 21902257 21431775
3018B1431775n33561j05604K46865k118p19648k66982o80516n02274m54135m95668
3008A7918134L0473o2826q6038o88167n21871m098P5286M93956o59012p05243
2998A5790594l58350O33883l39410o0725j74024j98592m30538L29386L8145p40512
2988A4489857o61457J96528j66418N7005p25969n71765J71114N1859M51835K81564
2978A3574153n28414r50913O5033K51266J95975n11131o73892k69192j27928j11662
2968A0913295J90290l7042l55520K11209k80506k70462K62111q42774Q5897J2339
2958I888837M97756j30774n06120q9184l42069Q9322m16855N60565P93720n31158
2948I814040r65804o08122J49798O70131q4156o50254n89332k64597N10889k66977
$$ plain form
3018 21431775 20898214 20792610 21039475 21037357 20317709 20050727 19370211 18867937 18413802 17918134
3008 17918134 17948607 17885781 17799743 17111576 16589705 16585607 16660893 17154849 16495837 15790594
2998 15790594 15432244 16066127 15726717 15665992 15491968 15293376 14862838 15192224 15230369 14489857
2988 14489857 13828400 14024928 13858510 13915515 13189546 12617781 12788895 12840754 13292589 13574153
2978 13574153 13045739 12094826 12159859 12411125 12607100 12095969 11422077 11152885 11024957 10913295
2968 10913295 11103585 11066543 10711023 10922232 10641726 10371264 10633375 9790601 9876498 9888837
2958 9888837 10386593 10255819 9749699 9660515 9318446 9407768 8990913 9551478 10345198 9814040
2948 9814040 8848236 8240114 8389912 9060043 8975887 8325633 7736301 7471704 7982593 7715616
2938G715616L48066l45465k95944j29510k10079L01950k14031L79279l21056J1804
2928G240630j69453j50245n41484O866m87748L49228j89693J21234P2507k08115
2918F043727L92845Q56851m81381n7439j76658o68712L60656J04663l99742m52647
2908E522163P8870n05045K37528p66649L82008N46552J7392j72871J11073P18140
2898F169161l91188m32729o2371l13240K43461p4057J79627m36177K96222k941
2888E175768l66796J6648M25267j81000k5833k08865r2687n6528j10156M09967
2878D985785m06473J21975L65115n85867j14982r4794J7864j94707J98960o091
2868D286785j83121n08121N67828L25878l27077p0425l82953n75775L33524p7213
$$ plain form
2938 7715616 8063682 7718217 7422273 7292763 7082684 7384634 7170603 7549882 7228826 7240630
2928 7240630 7071177 6920932 6379448 6386314 5898566 6247794 6058101 6179335 6251842 6043727
2918 6043727 6436572 7293423 6812042 6754603 6577945 5909233 6269889 6374552 5974810 5522163
2908 5522163 5601033 5095988 5333516 4566867 4948875 5495427 5512819 5339948 5451021 6169161
2898 6169161 5777973 5345244 5282873 4969633 5213094 5139037 5318664 4882487 5178709 5175768
2888 5175768 4808972 4825620 5250887 5069887 5044054 4835189 4742502 4685974 4575818 4985785
2878 4985785 4579312 4701287 5066402 4480535 4365553 4270759 4288623 4093916 4292876 4286785
2868 4286785 4103664 3595543 4163371 4489249 4162172 4091747 3708794 3133019 3466543 3389330
2858C389330K01378Q6759p5196L01279k96968L1751j92071k85053K27222n5383
2848C333048k63399k46217L15101n3183p489O80712l45856o92150J26434Q06009
2838C653010J38271o06098n03803N58421m8961n34384N570P64314Q06235l00154
2828C932421k83187k58477l76801O04036p05129N80535M16416k39310R7805k58896
2818C509413o64380p0794j65350N92155m12527K28415k14844k88255j68500J11858
2808B457191J01282m01512q1282K03550J21975K33868L35736q8216j86748j10572
2798B585272j21380L72489k74248k03052l9410j36758J81279l98081M60847m3911
2788B383047n25725K81140K21120o34838k2010q228n97142O89795O49183m87360
$$ plain form
2858 3389330 3590708 3677467 3602271 3903550 3606582 3638333 3446262 3161209 3388431 3333048
2848 3333048 3069649 2823432 3138533 3085350 3077861 3758573 3412717 2720567 2847001 3653010
2838 3653010 3791281 3185183 2681380 3239801 3190840 2656456 2662026 3426340 4232575 3932421
2828 3932421 3649234 3390757 3013956 3617992 2912863 3493398 3909814 3670504 3768309 3509413
2818 3509413 2845033 2774239 2608889 3201044 2788517 3016932 2802088 2513833 2345333 2457191
2808 2457191 2558473 2156961 2075679 2279229 2401204 2635072 2970808 2882592 2695844 2585272
2798 2585272 2463892 2836381 2562133 2359081 2319671 2182913 2364192 1966111 2426958 2383047
2788 2383047 1857322 2138462 2359582 1724744 1702734 1694506 1097364 1787159 2436342 1948982
2778A948982n27684O64771r7615j0534O22302l70061p8838J37710j47049m09837
2768A732147R2454n0273P5123j79446J54394K40768n65077J47319L61344n84650
2758A424103j77800k05643M33945K80627l56915N4682j9390j76324K09734n08474
2748I58545K99590J95930l93171n31745r9938J67705J15982N28070j04134k12415
2738I24419J06344L1208K76881J84418q16897j89468N76482J39699k41769k91468
2728F99849J87458l7751M46433j86304j35337M06795m85462j90681J36260n16394
2718C24866L02966j47331N40785l95268L73792m13074j76787j1914O10681M42687
2708A451403j68193j77628p00212K3523M20610N28484n8236k36425p4078m72087
$$ plain form
2778 1948982 1421298 2086069 1988454 1977920 2600222 2230161 2151323 2289033 2141984 1732147
2768 1732147 1824601 1774328 1849451 1670005 1824399 2065167 1500090 1647409 2008753 1424103
2758 1424103 1246303 1040660 1474605 1755232 1398317 1452999 1433609 1257285 1467019 958545
2748 958545 1258135 1454065 1060894 529149 429211 596916 712898 1240968 1136834 924419
2738 924419 1030763 1061971 1338852 1523270 706373 516905 1093387 1233086 991317 699849
2728 699849 887307 849556 1295989 1109685 974348 1381143 895681 705000 841260 324866
2718 324866 627832 480501 1021286 626018 999810 586736 409949 398035 1008716 1451403
2708 1451403 1283210 1105582 405370 428893 849503 1377987 1319751 1083326 1009248 537161
2698E37161o81653L48575K36205N80910M50968j64234l03713K83995k94957O54557
2688A647814k45928n69594M65138j17335M8053j00326k79518K43245o08289J29669
2678F12929K94254O4483J18337n37729M92542N70723j0679o61153n20493K62488
2668F85702k27J04913j2387J34257J05546m11460n29528K02215j29214n31901
2658c82084l34998M06890N25939J443935j15813m00843o18877n63541Q98696l17311
2648E41993n71020K47977K23172J42388l58284k65183l55483L98102M71710m43952
2638C1420k34465K10207j27535l32960N24126o2222k51487N50167o6199J19577
2628C60629J21715N09097k0873n15915J9506j47325Q8724M57603m96395J77935
$$ plain form
2698 537161 -144492 204083 440288 1021198 1472166 1307932 1004219 1288214 993257 1647814
2688 1647814 1401886 832292 1297430 1180095 1228148 1127822 848304 1091549 483260 612929
2678 612929 907183 971666 1090003 552274 1044816 1615539 1604860 943707 423214 685702
2668 685702 685475 790388 778001 912258 1017804 606344 76816 279031 149817 -382084
2658 -382084 -717082 -310192 215747 1659682 1543869 1143026 524149 -39392 859304 541993
2648 541993 -29027 218950 442122 584510 226226 -38957 -394440 3662 475372 31420
2638 31420 -203045 7162 -120373 -453333 70793 8571 -242916 307251 241052 360629
2628 360629 482344 991441 970568 454653 474159 326834 415558 873161 376766 554701
2618E54701n48172q5761R0590K12593l48538M53806L17073J38864l76524m53494
2608d4862L37819m87587j20243L83097j6204l7347l21224l10079J026764J78551
2598E88685k87963l0323J83575p14993O31647K987j62500J85444k7550l10277
2588E8732M35327L6069K98332k60907o2244n12389J16601j20606L40038M87287
2578H16240P7269n87397k730K61357N17146l29520j056875L23308p5084P91609
2568G35323K28648K61599l56912p47204o2442j94071K19271l08925M32078J05179
2558C12544M235K67688k98362J33351j90293O95471m0275L06966k23048q56165
2548A12112M74063l67898o6612q8042j50118K49733k85183j74680J29621K92570
$$ plain form
2618 554701 6529 -79232 11358 223951 -124587 329219 646292 785156 408632 -44862
2608 -44862 292957 -194630 -314873 68224 52020 14673 -306551 -616630 410134 588685
2598 588685 300722 270399 453974 -261019 370628 373615 211115 396559 369009 58732
2588 58732 494059 530128 828460 567553 505309 -7080 109521 -11085 328953 816240
2578 816240 893509 306112 303382 564739 1081885 752365 -304510 18798 -56286 735323
2568 735323 963971 1225570 868658 121454 59012 -135059 84212 -224713 207365 312544
2558 312544 316779 584467 286105 419456 229163 924634 884359 1191325 968277 112112
2548 112112 586175 218277 151665 63623 -86495 163238 -121945 -296625 -167004 125566
2538A25566K18505l16968J83344o10084K89704O36303K34309m17317l01037k4789
2528A7536M0149n37751l24865J082714J03588L16495n89767m32030N05684m93212
2518c11459l1425P63526j68348k93342L53660o429n03655N77032L30773O03853
2508A314186l05416j129067O19806k19277j86295M93150j71685J42247j61477
2499C96172l77686o5621M65195j04140N6632j98121j98494Q3159K79431k37486
2489I9041N43373p3388K78306J19353k13736j54518K46468O4937J99817l3250
2479A076403R7118R791k59494q2027L5308K79650J56619L98684m1926J9987P3420
2468A763533n28073m89618N07556o7841n54451l71506J51882j45737N68644j31687
$$ plain form
2538 125566 344071 27103 210447 -399637 -109933 526370 760679 343362 42325 17536
2528 17536 57685 -480066 -804931 277783 381371 697866 108099 -323931 181753 -311459
2518 -311459 -342884 420642 252294 -41048 312612 306183 -197472 379560 710333 1314186
2508 1314186 1008770 -120297 499509 280232 93937 587087 415402 557649 396172
2499 396172 18486 -47135 418060 313920 370552 172431 -26063 57096 336527 99041
2489 99041 642414 569026 847332 966685 752949 598431 844899 909836 1109653 1076403
2479 1076403 1173521 1183312 923818 841791 877099 1156749 1313368 1712052 1670126 1690113 1763533
2468 1763533 1235460 745842 1253398 1185557 631106 259600 411482 265745 834389 702702
2458G02702P7457L9735p27276N91748J72585n3664j25242k13641J76070m7481
2448E92993r6245l74391P6637O55233M37703q0475j63173n54500L760L60026N96425
2437A453993k39409l34311o1700O85143m07691m35592k10198J29923O55692j36363
2427A099487l64171k96620L7066K48636L45391j6698o30748K10258k91421l73921
2417c2741m21944L16045J99570K57379p31160O00J058954k6388j44481J32267
2407F08101J97367m69784J024129m45568l86587m2152L92206j03987r0241k87660
2397C95824M30210J34613j05478k62345o4558O2982m06500o0195N22551L4599
2387F81703m19330Q06563M02559n03807j98015o5671l48246k28453L79141J51460
$$ plain form
2458 702702 780159 819894 92618 684366 856951 803287 678045 464404 640474 592993
2448 592993 496748 122357 198994 854227 1291930 1211455 1048282 493782 497542 857568 1453993
2437 1453993 1214584 880273 818573 1503716 1096025 660433 450235 580158 1235850 1099487
2427 1099487 735316 438696 475762 724398 1069789 1053091 422343 632601 341180 -32741
2417 -32741 -454685 -138640 60930 318309 -412851 -412251 646703 620315 475834 608101
2407 608101 805468 335684 1359813 914245 527658 485506 877712 773725 683484 395824
2397 395824 826034 960647 855169 592824 528266 591248 184748 124553 647104 681703
2387 681703 262373 1068936 1471495 967688 769673 704002 355756 127303 506444 657904
2377F57904K33840j23566q16909P63951N27861M1272L34907q8258j61488j87175
2367A182339l19637J44757P54528M18656j45630n9080R3916q50304k16220N87886
2357A591211N89328N1113N32918R17808K24926M00243M32278j45987N1950O42595
2347E288383J18770Q31127J119947O28874P54579J019182R11133Q14021J671682
2338A3157698P77170K050807K556053L160732M246359M465548L573146L718233
2330C7705746K910827R28815j429501l196490m182081l424126j780159k580747
2322B4952284k131297j771290j026943j722833j681543j862495r22785j23995
2314A3709103j314199j059544q62123j177271q84481p84874j14655p44259r53909
$$ plain form
2377 657904 891744 768178 -48731 715220 1243081 1284353 1619260 1531002 1369514 1182339
2367 1182339 862702 1007459 1761987 2180643 2035013 1975933 2069849 1219545 1003325 1591211
2357 1591211 2180539 2231652 2764570 3682378 3907304 4307547 4739825 4593838 4645788 5288383
2347 5288383 5407153 6238280 7358227 7987101 8741680 9760862 10671995 11486016 13157698
2338 13157698 13934868 15985675 18541728 21702460 25948819 30414367 33987513 37705746
2330 37705746 40616573 41545388 40115887 36919397 32737316 29313190 27533031 24952284
2322 24952284 22820987 21049697 20022754 18299921 16618378 14755883 13833098 13709103
2314 13709103 12394904 11335360 10473237 9295966 8411485 7626611 7511956 6767697 5813788
2305E813788k23353r0001j12175j77533p05058M072N02744M09972P0180j177428
2295D315208q17255q3576j21687L32407o94753m10325j80024M2740m38854O9122
2285B013003m92090M43633l27684k59589J84134K02507P3603k08302O67823n33842
2275A763196j94967Q3156K38462j68347m65512L0164k2839M13735K1784k36642
2265A462190k43301o2169L28667O52955l77731m91276p2379o6967L6208n11601
2255F54596p47103J84775r2232K43899j02450j40988n7425K62124J08617m06115
2245i2302P99699o93969L37321K31917N9489j67594j63129L46122L87324N2593
2235A097471K52543l80482m78980N29175l00120K25324j42039j01623j93966k03817
$$ plain form
2305 5813788 5590435 5500434 5388259 5210726 4505668 4509740 5012484 5422456 5492636 4315208
2295 4315208 3497953 3414377 3292690 3625097 2930344 2520019 2339995 2382735 1943881 2013003
2285 2013003 1520913 1964546 1636862 1377273 1561407 1763914 1837517 1629215 2297038 1763196
2275 1763196 1568229 1651385 1889847 1721500 1255988 1286152 1263313 1677048 1698832 1462190
2265 1462190 1218889 1156720 1485387 2138342 1760611 1269335 1196956 1129989 1166197 654596
2255 654596 -92507 92268 36 243935 141485 497 -56928 205196 313813 -92302
2245 -92302 707397 13428 350749 582666 642155 474561 311432 657554 1044878 1097471
2235 1097471 1350014 969532 490552 1019727 719607 944931 802892 701269 507303 303486
2225C03486M6864l66631M53035P6410O5116m63819K87513J72032r2664j31188
2215C50154K57036K0936m8038K79140k85484o69917J02890L02946K49405N83001
2205A142069m92856m25086p39303Q29764J96587m71808P55746o41743o40673O1486
2195d25817L84519L78564M7495j20721K55825m8333m22575n33768J13970j85912
2185e56753J06680K91359J34875R6878j72031l84108M0901M72427l77100k55901
2175f02773J7530j76413N35606J27917O80603k99201J61021m08367l0239N25451
2165E31135M5472j40901J29002q62436l83182j08104J71625J078007o2878l66982
2155C0758M60674K75665o56041J97000Q9903N28500m01311K3030O20936m07230
$$ plain form
2225 303486 350350 -16281 436754 513164 578280 114461 401974 574006 481342 350154
2215 350154 607190 628126 580088 859228 573744 -96173 6717 309663 559068 1142069
2205 1142069 649213 224127 -515176 314588 511175 39367 795113 153370 -487303 -425817
2195 -425817 -41298 337266 384761 264040 519865 471532 48957 -484811 -370841 -556753
2185 -556753 -450073 -158714 -23839 73039 -98992 -483100 -442199 30228 -346872 -602773
2175 -602773 -585243 -761656 -226050 -98133 582470 283269 444290 35923 5684 531135
2165 531135 576607 435706 564708 -297728 -680910 -789014 -617389 460618 397740 30758
2155 30758 491432 767097 111056 308056 397959 926459 525148 548178 1169114 761884
2145G61884l04777P57936j55500r38827O10950Q5680N5738q82670o30260J84857
2135d54989j19252L89455L24133L38974k50573P0600m8682k75929j34634j48277
2125c09174L39991n21039j43322M16898M12818K74362m33726L67092L55366j50363
2115F08903j31777l97372J50129M59822l31439n5059p074P1306p59124J03032
2105b88653K39268n1867o8312j60355K24975m292j75985k14634q4051P10440p83620
2094f57086M06175j36171j33209M67678M45544n29394k93029K85487j49517l35124
2084f28646k04278J05840N37192j66774K47811j67536l85895K60940K56411o27214
2074g72149L16934N38197k44392l55604O47969L97871m28946M9696k63969j26090
$$ plain form
2145 761884 457107 1215043 1059543 120716 731666 817346 873084 -9586 -639846 -454989
2135 -454989 -574241 -184786 139347 478321 227748 298348 249666 -26263 -160897 -309174
2125 -309174 30817 -490222 -633544 -216646 196172 470534 36808 403900 759266 608903
2115 608903 477126 79754 229883 689705 358266 303207 296133 367439 -391685 -288653
2105 -288653 -49385 -101252 -169564 -329919 -104944 -109236 -285221 -499855 -583906 126534 -657086
2094 -657086 -250911 -387082 -520291 -52613 392931 -136463 -429492 -144005 -293522 -628646
2084 -628646 -832924 -727084 -189892 -356666 -108855 -276391 -662286 -401346 -144935 -772149
2074 -772149 -455215 82982 -161410 -517014 130955 528826 99880 149576 -114393 -240483
2064b40483J16756m83963K74921m74984J27958O79099k51101j78792J09895l6661
2054c57355K0782K67095n29710m8161K54011j1895j46587j8375Q27317m61602
2044b04480k19503K67045j69280N30768o88243N44681k69682j93490O05013M78567
2034F81396o70218m93533M38896k29627o30599Q44409o4718N7967k56643P6165
2024b46505K97907m91766n11152o2893P3808L99762M8988k10329r3510j69889
2014i65579M63961j98346l2372q4699q825j89910L34702k4842K00364Q25247k94053
2003B5648j11277m48000J1892N87127N04083o24789O0210o76978j09430M79582
1993c01932O17619j5478O88436j16424p24507j094879R3819P75138q0914l27949
$$ plain form
2064 -240483 -123727 -607690 -332769 -807753 -679795 -696 -251797 -430589 -320694 -357355
2054 -357355 -336573 -69478 -599188 -647349 -393338 -405233 -551820 -570195 257122 -204480
2044 -204480 -423983 -156938 -326218 204550 -483693 60988 -208694 -402184 202829 681396
2034 681396 11178 -482355 -43459 -273086 -903685 -59276 -123994 -66027 -322670 -246505
2024 -246505 51402 -440364 -951516 -1014409 -940601 -540839 -491851 -702180 -795690 -965579
2014 -965579 -501618 -699964 -732336 -817035 -825860 -1015770 -681068 -705910 -505546 319701 25648
2003 25648 -85629 -533629 -521737 65390 569473 -55316 4894 -672084 -781514 -301932
1993 -301932 315687 300209 988645 872221 147714 -947165 -853346 -78208 -159122 -487071
1983d87071n26212K21346L48091l42746N55430l97680k06489L43946M53449l83875
1973d21811J75539j533o64227J022517R40769m93452m57597q3423j58256o21074
1963g62548J46833J128822o38780j87408P36568P2387n06566j46840J44151O8480
1953E5099m67814P5844l6390L08359m8008L39852k61081l20894j54651J85666
1943c24018J92822K0062m87357j74372m4126M21778l58911P68491O4575j21651
1933d2707Q84273m61525l29491j55795K91744R3695n13854L08335n51640p24795
1923a201760L12390N01735K55386P68943o63672K36255k55442n03754O80576K15595
1913C46252M88833n45485m91441K28662p8656m54071Q7357k79163k80785R9255
$$ plain form
1983 -487071 -1013283 -791937 -443846 -786592 -231162 -628842 -835331 -491385 -37936 -421811
1973 -421811 -246272 -247805 -912032 110485 1051254 557802 100205 16782 -141474 -762548
1963 -762548 -615715 513107 -125673 -313081 423487 495874 -10692 -157532 -13381 55099
1953 55099 -412715 -336871 -373261 -64902 -112910 226942 -34139 -355033 -509684 -324018
1943 -324018 -131196 -111134 -598491 -772863 -816989 -395211 -754122 14369 78944 -42707
1933 -42707 841566 380041 50550 -105245 186499 280194 -233660 74675 -476965 -1201760
1923 -1201760 -889370 -387635 -132249 636694 -26978 209277 -46165 -549919 130657 346252
1913 346252 835085 289600 -201841 26821 -51835 -505906 -418549 -697712 -978497 -879242
1903h79242O14369r6329k16231j59782k8229K48699N68358J16701r82867n76305
1893a390858M89275P04645j25916J35512O04451k98780k7738J99986M7212K1819
1883C59608q57775k39382L53247k0240l15042O49151l84842L19312j28488L40933
1873G6482k49064l3175p99730k14815R37159K91192J06872l15461l24725j31463
1863f56728N61135L80179M40202r0053k31234o31845J93987m83143N7647K76302
1853a83551k24255l44903K58794M20681l28880j30569L4967m7944O3570K83841
1843a98249J90154n79531k89450l07449L35960O91587R24590j43486l38248O8145
1833C54023l20611L99035M92374o7524m95632l66403m26868m81261J19501P0234
$$ plain form
1903 -879242 -264873 -361202 -577433 -737215 -765444 -516745 51613 168314 -814553 -1390858
1893 -1390858 -901583 -196938 -322854 -187342 417109 118329 90591 290577 337789 359608
1883 359608 -498167 -737549 -384302 -404542 -719584 -70433 -455275 -135963 -264451 76482
1873 76482 -172582 -205757 -1005487 -1220302 -283143 8049 114921 -200540 -525265 -656728
1863 -656728 -95593 284586 724788 634735 403501 -228344 -34357 -517500 -459853 -183551
1853 -183551 -407806 -752709 -493915 -73234 -402114 -532683 -497716 -545660 -482090 -198249
1843 -198249 -8095 -587626 -877076 -1184525 -848565 -156978 767612 624126 285878 354023
1833 354023 33412 432447 924821 857297 361665 -4738 -431606 -912867 -793366 -723132
1823g23132K5538j08534J1842O96245O92092L45916n96530j116919k7837Q90018
1813H8699K35643j84273r36420J69531P23970q22184l07733K04824q6086N82346
1803c31683k9020p1721o04926J17318P12716n60703k15330M55120j4876K98493
1793b44612L5100k03831m7151L9244r3893q479n70171J47702P03330q3625N8854
1782b67532K27855j19544r08562K02765O7189R28384L75704n26677m69482N4262
1772d35638L33882K29065p79067Q23327l99572O4051M27603K56575o7440m87729
1762c4943o6803j49139j7028k68194K51793P33133k26443R1144K54740p807l68427
1751A92026m71371J48029m37812p83152R96558Q3701k66435M48413L88663k37966
$$ plain form
1823 -723132 -697594 -806128 -794286 -98041 594051 939967 343437 -773482 -801319 88699
1813 88699 324342 140069 -796351 -626820 97150 -725034 -1032767 -827943 -914029 -331683
1803 -331683 -360703 -432424 -1037350 -920032 -207316 -768019 -983349 -528229 -543105 -244612
1793 -244612 -209512 -413343 -460494 -421250 -515143 -523622 -1093793 -946091 -242761 -326386 -267532
1782 -267532 -39677 -159221 -1067783 -865018 -797829 130555 506259 -20418 -489900 -435638
1772 -435638 -101756 127309 -651758 171569 -228003 -163952 263651 520226 452786 -34943
1762 -34943 -101746 -250885 -267913 -536107 -284314 448819 222376 313520 568260 560453 192026
1751 192026 -279345 -131316 -569128 -1352280 -355722 -272021 -538456 -90043 298620 60654
1741F0654n27479j22562J14317M37037j65101j58552M38151M97902k46180J63990
1731D92177K15594L7193j408938m22360R54324P32288j82649L1188q03848Q0140
1721b74891J28210o9875L54213r85114L32629Q56206j14587o28411k81285K72853
1711d10052j50378J55339O5775l88714M37553O30173m90503K1715l11473J85585
1701b54980M50200j94216n83684O2583j85307N87181J87850L7785J38117l52083
1691a06554N1833K55881M7756k62539J67708K02055k26781r3419K50715J3827
1681C00482l65374P7113l66585k88983N89418l39508o08799J99375Q676K24142
1671e70043K86354L10837J6998N2750k63803m06126k45702M49730k59071J32088
$$ plain form
1741 60654 -466825 -589387 -475070 -38033 -203134 -361686 76465 574367 328187 492177
1731 492177 707771 744964 -663974 -1086334 -132010 600278 417629 448817 -355031 -274891
1721 -274891 -146681 -216556 137657 -847457 -514828 341378 226791 -401620 -682905 -410052
1711 -410052 -560430 -405091 -339316 -728030 -290477 339696 -150807 -129092 -440565 -254980
1701 -254980 195220 1004 -582680 -520097 -705404 -118223 69627 107412 245529 -106554
1691 -106554 -54721 201160 248916 -13623 154085 356140 129359 35940 286655 300482
1681 300482 -64892 12221 -354364 -643347 -53929 -393437 -1002236 -802861 -794185 -570043
1671 -570043 -283689 27148 44146 96896 -166907 -573033 -818735 -369005 -628076 -495988
1661d95988l0858N37458j7068P1426K93280k12217k53883n3039j522n62482m57070
1650a181963M27847K82378M46779N26205o46744o43705o2331N6888m808O81023
1640a18431j29912J39708n68646Q5829M29518J061361n30468n47643L13407P67609
1630I02332k1346r64983M56571j94008p08259K89213O9874K82272j74652o29097
1620f92083l19375m2344J151181j16709J4297J49336o85201N11499k59646m87954
1610g76999j23781O96484M47459J53228o2059N7257m92382l04852q2290L50831
1600a37104j41470m9023N95070P4571n95887L57761l92795K11816P05647l11916
1590C16670j87838p1894M33625j70844m17378m65256O34434k88668M68719K34307
$$ plain form
1661 -495988 -526846 10612 -6456 64970 358250 146033 -107850 -160889 -162411 -724893 -1181963
1650 -1181963 -754116 -471738 -24959 501246 -145498 -789203 -851534 -794646 -799454 -118431
1640 -118431 -248343 -108635 -677281 -591452 -161934 899427 368959 -178684 134723 902332
1630 902332 880986 -83997 372574 178566 -529693 -240480 -170606 111666 -62986 -692083
1620 -692083 -1011458 -1053802 97379 -19330 -5033 144303 -540898 -29399 -289045 -776999
1610 -776999 -900780 -204296 243163 396391 334332 391589 -100793 -405645 -487935 -137104
1600 -137104 -278574 -327597 267473 342044 -253843 103918 -288877 -77061 628586 316670
1590 316670 128832 56938 490563 319719 -97659 -562915 71519 -217149 251570 485877
1580D85877j83645m42824j99895K97328J37810j30078n1258p4061J56877O4272
1570F0403r1986j45532n28425K84454M64907k4255j72826P1242L74436K22615
1560E15033p64685P38167M4454o8067k8256m32355M19879q7477q46110o4523m2969
1549f16909Q96328J63594M8644j28691l39614k14762J86726K95381p51141R00231
1539D39787m44115n2036M94646o47241p3191k06945k86489k08672j4287L09347
1529f89196N61939K08952o58133J5167k40141o5753n172J17672N69914J22904
1519f1847k23600K69541K49191r51800m57365J028017M16506J20817k75937M54502
1509E68025m64854j35667j73553l3032n3367k32320L00495J131401j70531j135074
$$ plain form
1580 485877 302232 -140592 -340487 -43159 94651 -35427 -86685 -160746 -3869 60403
1570 60403 -31583 -177115 -705540 -421086 43821 19566 -153260 -82018 292418 515033
1560 515033 -249652 488515 532969 464902 436646 4291 424170 336693 -509417 -573940 -616909
1549 -616909 279419 443013 491657 362966 23352 -191410 -4684 290697 -460444 439787
1539 439787 -4328 -56364 438282 -208959 -282150 -489095 -775584 -984256 -998543 -689196
1529 -689196 -127257 81695 -576438 -561271 -801412 -867165 -872337 -754665 -184751 -61847
1519 -61847 -285447 -15906 233285 -718515 -1175880 -147863 268643 389460 113523 568025
1509 568025 103171 -32496 -206049 -239081 -292448 -524768 -224273 907128 736597 -398477
1499c98477N21185j59902n67162N1370O5811K4156L58299k85215m95860M86292
1489c99503k47665J68832M85800k43687l10614l6975j19939j88021K35201L44068
$$ plain form
1499 -398477 122708 -37194 -604356 -552986 -487175 -463019 -104720 -389935 -885795 -399503
1489 -399503 -647168 -478336 7464 -236223 -546837 -583812 -703751 -891772 -656571 -312503
$$ [...]
##END NTUPLES=NMR SPECTRUM
##END=
