##TITLE=1H_DE-102_oil_TFA
 200.13MHz, CDCl3,
 8 sc
 
 12.8.2025
##JCAMPDX= 6.0         $$ Bruker NMR JCAMP-DX V2.0
##DATA TYPE= NMR FID
##DATA CLASS= NTUPLES
##ORIGIN= UXNMR, Bruker Analytische Messtechnik GmbH
##OWNER= pz
$$ XWIN-NMR		Version 3.5
$$ Tue Aug 12 14:11:04 2025 Russian Standard Time (UT+4h)  she@DPX200
##.OBSERVE FREQUENCY= 200.1313
##.OBSERVE NUCLEUS= ^1H
##.DELAY= (6, 6)
##.ACQUISITION MODE= SIMULTANEOUS
##.ACQUISITION SCHEME= undefined
##.AVERAGES= 8
##.DIGITISER RES= 18
##SPECTROMETER/DATA SYSTEM= spect
##.PULSE SEQUENCE= zg30
##.SOLVENT NAME= CDCl3
##.SHIFT REFERENCE= (INTERNAL, CDCl3, 0, 14.3821)
##AUDIT TRAIL= $$ (NUMBER, WHEN, WHO, WHERE, WHAT)
$$ ##TITLE= Audit trail, XWIN-NMR		Version 3.5
$$ ##JCAMPDX= 5.01
$$ ##ORIGIN= Bruker BioSpin GmbH
$$ ##OWNER= she
$$ F:/spectra/data/she/nmr/H-C/1/audita.txt
$$ ##AUDIT TRAIL=  $$ (NUMBER, WHEN, WHO, WHERE, WHAT)
(   1,<2025-08-12 14:09:23.21 +0400>,<she>,<DPX200>,
      <created by zg, POWCHK disabled, PULCHK disabled
       configuration hash MD5:
       00 E9 B6 7A A2 85 ED C7 34 08 36 98 17 FE 4E 26
       data hash MD5: 16K
       F2 1B 52 3F B0 2B 7A C1 9F 9B 7F 99 1C AA 61 92>)
$$ ##END=
$$ 
$$ hash MD5
$$ 67 9D D9 99 0E 4B 22 E5 DF 94 25 14 D2 40 6D 62
##$RELAX= 
##$RELAX= 
##$RELAX= 
##$RELAX= 
##$RELAX= 
##$RELAX= 
$$ Bruker specific parameters
$$ --------------------------
##$DU= <F:/spectra>
##$EXPNO= 1
##$NAME= <H-C>
##$PROCNO= 1
##$TYPE= <nmr>
##$USER= <she>
##$AMP= (0..31)
100 100 100 100 100 100 100 100 100 100 100 100 100 100 100 100 100 100 
100 100 100 100 100 100 100 100 100 100 100 100 100 100 
##$AQSEQ= 0
##$AQ_mod= 1
##$AUNM= <au_zg>
##$AUTOPOS= <>
##$BF1= 200.13
##$BF2= 200.13
##$BF3= 200.13
##$BF4= 200.13
##$BF5= 200.13
##$BF6= 200.13
##$BF7= 200.13
##$BF8= 200.13
##$BYTORDA= 1
##$CFDGTYP= 0
##$CFRGTYP= 5
##$CHEMSTR= <none>
##$CNST= (0..31)
1 1 145 1 1 1 1 1 1 1 1 1 1 1 1 1 1 1 1 1 1 1 1 1 1 1 1 1 1 1 1 1 
##$CPDPRG= <>
##$CPDPRG1= <>
##$CPDPRG2= <>
##$CPDPRG3= <>
##$CPDPRG4= <mlev>
##$CPDPRG5= <mlev>
##$CPDPRG6= <mlev>
##$CPDPRG7= <mlev>
##$CPDPRG8= <mlev>
##$CPDPRGB= <>
##$CPDPRGT= <>
##$D= (0..31)
0 0.7 0 0 0 0 0 0 0 0 0 0.03 0 0 0 0 0 0 0 0 0 0 0 0 0 0 0 0 0 0 0 0 
##$DATE= 1754993362
##$DBL= (0..7)
120 120 120 120 120 120 120 120 
##$DBP= (0..7)
150 150 150 150 150 150 150 150 
##$DBP07= 0
##$DBPNAM0= <>
##$DBPNAM1= <>
##$DBPNAM2= <>
##$DBPNAM3= <>
##$DBPNAM4= <>
##$DBPNAM5= <>
##$DBPNAM6= <>
##$DBPNAM7= <>
##$DBPOAL= (0..7)
0.5 0.5 0.5 0.5 0.5 0.5 0.5 0.5 
##$DBPOFFS= (0..7)
0 0 0 0 0 0 0 0 
##$DE= 6
##$DECBNUC= <off>
##$DECIM= 32
##$DECNUC= <off>
##$DECSTAT= 4
##$DIGMOD= 1
##$DIGTYP= 9
##$DL= (0..7)
0 120 120 120 120 120 120 120 
##$DP= (0..7)
150 150 150 150 150 150 150 150 
##$DP07= 0
##$DPNAME0= <>
##$DPNAME1= <>
##$DPNAME2= <>
##$DPNAME3= <>
##$DPNAME4= <>
##$DPNAME5= <>
##$DPNAME6= <>
##$DPNAME7= <>
##$DPOAL= (0..7)
0.5 0.5 0.5 0.5 0.5 0.5 0.5 0.5 
##$DPOFFS= (0..7)
0 0 0 0 0 0 0 0 
##$DQDMODE= 0
##$DR= 18
##$DS= 0
##$DSLIST= <SSSSSSSSSSSSSSS>
$$ [...]
##$SUBNAM0= <"">
##$SUBNAM1= <"">
##$SUBNAM2= <"">
##$SUBNAM3= <"">
##$SUBNAM4= <"">
##$SUBNAM5= <"">
##$SUBNAM6= <"">
##$SUBNAM7= <"">
##$SUBNAM8= <"">
##$SUBNAM9= <"">
##$SW= 18.0517328524113
##$SWIBOX= (0..15)
0 0 2 0 0 0 0 0 0 0 0 0 0 0 0 0 
##$SW_h= 3612.71676300578
##$TD= 16384
##$TD0= 1
##$TE= 0
##$TE2= 300
##$TE3= 300
##$TEG= 300
##$TL= (0..7)
0 120 120 120 120 120 120 120 
##$TP= (0..7)
150 150 150 150 150 150 150 150 
##$TP07= 0
##$TPNAME0= <>
##$TPNAME1= <>
##$TPNAME2= <>
##$TPNAME3= <>
##$TPNAME4= <>
##$TPNAME5= <>
##$TPNAME6= <>
##$TPNAME7= <>
##$TPOAL= (0..7)
0.5 0.5 0.5 0.5 0.5 0.5 0.5 0.5 
##$TPOFFS= (0..7)
0 0 0 0 0 0 0 0 
##$TUNHIN= 0
##$TUNHOUT= 0
##$TUNXOUT= 0
##$USERA1= <user>
##$USERA2= <user>
##$USERA3= <user>
##$USERA4= <user>
##$USERA5= <user>
##$V9= 5
##$VALIST= <valist>
##$VCLIST= <CCCCCCCCCCCCCCC>
##$VD= 0
##$VDLIST= <DDDDDDDDDDDDDDD>
##$VPLIST= <PPPPPPPPPPPPPPP>
##$VTLIST= <TTTTTTTTTTTTTTT>
##$WBST= 1024
##$WBSW= 4
##$XGAIN= (0..3)
0 0 0 0 
##$XL= 0
##$YL= 0
##$YMAX_a= 202265
##$YMIN_a= -245124
##$ZGOPTNS= <>
##$ZL1= 120
##$ZL2= 120
##$ZL3= 120
##$ZL4= 120
##$ABSF1= 10
##$ABSF2= 0
##$ABSG= 5
##$ABSL= 3
##$ALPHA= 0
##$AQORDER= 0
##$ASSFAC= 0
##$ASSFACI= 0
##$ASSFACX= 0
##$ASSWID= 0
##$AUNMP= <proc_1d>
##$AZFE= 0.1
##$AZFW= 0.1
##$BCFW= 1
##$BC_mod= 2
##$BYTORDP= 1
##$COROFFS= 0
##$CY= -3
##$DATMOD= 1
##$DC= 2
##$DFILT= <>
##$DTYPP= 0
##$F1P= 0
##$F2P= 0
##$FCOR= 0.5
##$FTSIZE= 0
##$FT_mod= 4
##$GAMMA= 1
##$GB= 0.15
##$INTBC= 1
##$INTSCL= 1
##$ISEN= 128
##$LB= 0.25
##$LEV0= 0
##$LPBIN= 0
##$MAXI= 10000
##$MC2= 0
##$MEAN= 0
##$ME_mod= 0
##$MI= 1.114404
##$NCOEF= 0
##$NC_proc= 0
##$NLEV= 6
##$NOISF1= 3.799351
##$NOISF2= 2.8
##$NSP= 1
##$NTH_PI= 0
##$NZP= 0
##$OFFSET= 14.38212
##$PC= 1
##$PHC0= -1572.589
##$PHC1= 30.59228
##$PH_mod= 1
##$PKNL= yes
##$PPARMOD= 0
##$PSCAL= 0
##$PSIGN= 0
##$REVERSE= no
##$SF= 200.129724274929
##$SI= 16384
##$SIGF1= 3
##$SIGF2= 2
##$SINO= 400
##$SIOLD= 16384
##$SREGLST= <1H.CDCl3>
##$SSB= 0
##$STSI= 0
##$STSR= 0
##$SW_p= 3205.1282051282
##$SYMM= 0
##$S_DEV= 0
##$TDeff= 0
##$TDoff= 0
##$TI= <>
##$TILT= no
##$TM1= 0
##$TM2= 0
##$TOPLEV= 0
##$USERP1= <user>
##$USERP2= <user>
##$USERP3= <user>
##$USERP4= <user>
##$USERP5= <user>
##$WDW= 1
##$XDIM= 8192
##$YMAX_p= 0
##$YMIN_p= 0
$$ End of Bruker specific parameters
$$ ---------------------------------
##NTUPLES= NMR FID
##VAR_NAME=  TIME,          FID/REAL,        FID/IMAG
##SYMBOL=    X,             R,               I
##VAR_TYPE=  INDEPENDENT,   DEPENDENT,       DEPENDENT
##VAR_FORM=  AFFN,          ASDF,            ASDF
##VAR_DIM=   8192,          8192,            8192
##UNITS=     SECONDS,       ARBITRARY UNITS, ARBITRARY UNITS
##FACTOR=    0.0002768,     1,               1
##FIRST=     0,             0,               0
##LAST=      2.2672688,     0,               0
##MIN=       0,             -245124,         0
##MAX=       2.2672688,     202265,          0
$$ Real data points
##PAGE= N=1
##DATA TABLE= (X++(R..R)), XYDATA
0@%%%%%%%%%%%%%mJ2j6J6j6J6k4L2l6M4m9N7p2Q3r1J04j21J39j59J81k05K32k62
36a39K94l27L64m07M54n03N55o14O79p48Q24r09J003j106J219j343J479j633J806
55I48j999K223k478K775l132L558m083M752n633O845q624J1491j6840L0007j20756
70a00946j44178L38899L8744k26130P0158J83290r9798q7957N1240l577k886O0780
82G7639r7239j23375J09088Q9367j30977k0844J51030N006j24352M406R8585K5687
94F4021m0540j871K5108j7755m1168n067K4434J7878j9353m8144j7563M2166K9499
107A1645l7519p228Q0876r82j16700M566J23828j909p7322K5380M4415l6478k6381
120a3809K7907J0726r785o076m0400l5504M2604L5288l5371K930M8366j8188m6206
$$ y = [0, 0, 0, 0, 0, 0, 0, 0, 0, 0, 0, 0, 0, 0, -4, 8, -8, 8, -8, 8, -16, 16, -20, 24, -25, 32, -40, 43, -48, 56, -65, 74, -85, 96, -109, 123, -139, 155, -172, 192, -215, 239, -264, 291, -323, 356, -392, 432, -477, 526, -580, 639, -704, 775, -858, 948, -1051, 1172, -1306, 1469, -1663, 1895, -2188, 2564, -3069, 3776, -4848, 6643, -10197, 19810, -100946, -245124, 93775, 132519, -93611, -23453, 159837, 60039, -27918, 23322, 19745, 16859, 77639, -19600, -142975, -33887, 55480, -75497, -96341, 54689, 59695, -64657, -60251, 38334, 64021, 23481, 21610, 46718, 28963, -12205, -17272, 7162, 25040, 5687, -42457, -60020, -17854, 11645, -25874, -33102, 47774, 46792, -69908, -65342, 58486, 56577, -20745, 4635, 49050, 12572, -13809, 14098, 24824, 15039, 8963, -31437, -66941, -24337, 10951, -24420, -21490, 26876, 8688, -37518]
133c7518L3281N6592j8701l8015K3141J0013m7517o044M1894J930k3732j0462
145a5138j6815l86L5564O179l0801K1053M5483m4946n3008O4050N2257n4694k6555
158a7757L3139r575k4449J5865J0367p091N515j1271l5231J1461M3938p631k0955
171a3675K7464O209l2678P393L4194j467j8762p243j447j0635j1388R612J6380
184C957r57j3638j0964M347J9302J0019o179j882J2457J493k7886m775M3495O496
198C5285m6696n550K4055j5451j7124K0414J2564j3721n248J977q072J2262K6321
211B1016r960j5088K1855l37k8455J4964K9606j9354k8017Q473M955k1537k761
224b4640K3892J588j4166K593J067L076K1153N244j6471N427J5032j7904k2050
$$ y = [-37518, -4237, 52355, 33654, -4361, 18780, 28793, -18724, -24768, 17126, 19056, -4676, -15138, -31953, -32339, 3225, 9404, -21397, -344, 45139, 193, -52815, 11235, 63492, 8798, -17757, 15382, 5807, -18642, -2777, 7590, 499, 6014, -5257, -40488, -29027, 14911, 7280, -13675, 13789, 19998, -12680, -5287, 28907, 27440, 8678, 1435, -12, -10647, -22035, -12423, 3957, 3000, -10638, -21602, -17255, 2047, 12066, 5887, 4005, 16462, 17955, -9931, -14706, 28789, 35285, -11411, -16961, 7094, -8357, -25481, -5067, 7497, -6224, -11472, -9495, -17567, -5305, 21016, 11056, -4032, 17823, 17486, -10969, 3995, 33601, 14247, -13770, -5297, -342, -21879, -24640, -748, 840, -13326, -10733, -9666, -6590, 14563, 19807, 3336, 8763, 23795, 5891, -16159]
237a6159K2534K3926k9062k6000K1823O134k4007M456K0867l919j0978L82K044
250g959N196J3501L402j2329M819J3168j7078j2146K5922P793k9631j1339J4702
263a979j099j7057L974J8044l064j1361M328N168Q273J2043p052r180J2140K607
277A5785k1758m253K4670J760l1870l384K4966o566j8925J4794J5022j0770q523
290i052L285N056N979L428o037m275J0802J146j9595M870K4753j0091k6391P742
304h380J5023j0735j1296J0886J1347q449p252M658N605P662J620j2104J201J3174
318A2960r894j7290J1829J7853j3946k0604J3303J6098j4176p735J7674M217j1218
331i29l721L117M461L167m046o980L664P479p764j1378J4547J3893j8057j2141
$$ y = [-16159, 6375, 30301, 1239, -24761, -2938, 3196, -20811, -16355, 4512, 593, -10385, -10003, -7959, -2763, 10738, 14140, 1811, 6630, 19798, 2720, -9426, 16496, 24289, -5342, -16681, -1979, -3078, -20135, -16161, 1883, -1181, -12542, -8214, -3046, 5227, 17270, 10218, 1038, 13178, 15785, -5973, -10226, 14444, 16204, -15666, -19050, 5916, -650, -19575, -4781, 10241, -529, -9052, -5767, -711, 5268, 8696, 2659, -1616, 9186, 10332, -9263, -4393, 20360, 10269, -16122, -8380, 6643, -4092, -15388, -4502, 6845, -1604, -8856, -4198, 1407, 9069, 10689, -1415, -214, 12960, 3066, -14224, -2395, 15458, 1512, -19092, -5789, 10309, -3867, -11602, 6072, 10289, -929, -4650, -1533, 2928, 6095, 2049, -4931, -1267, 6212, -1552, -12930, 1617, 15510, -2547, -14688]
345a4688J6801O662j3713k173J2912K688j0379l386N859L552K135l906q802O330
359a08P296j4093p062J7425O212j7400n202J7348M698j4139K891J3958m684q972
373a832J893P71P05J745n238m536N342K915q683l058J4575L563j6570K91J6057
388G940k938r885N232Q616l644p126R79L524N90K48n149n136P630J268j3550J557
404i844J5565k361j3293M918J3068l602p895Q475N373p790k252K208l235J192
418E27K179o879j994N898q85p026L879J0144m431r349P410O808p474j200O646
433D253J426m205k174J706J779M07j680l775l69M528m153p807P328P953p815n316
449g914P729N409m836k104P349R10p248R68K201k858J134J071m234n81L301j773
$$ y = [-14688, 2113, 8775, -4938, -7111, 5801, 8489, -1890, -5276, 583, 4135, 6270, 2364, -6438, -108, 7188, -6905, -13967, 3458, 9670, -7730, -12932, 4416, 9114, -5025, -2134, 11824, 7140, -1832, 61, 832, 1537, 3282, -1956, -6492, -1150, 1765, -6918, -9976, 4599, 8162, -8408, -8117, 7940, 5002, -4883, 349, 8965, 5321, -1805, -826, 2698, 3288, 3536, -1613, -6749, 881, 2149, -11401, -9844, 5721, 3360, -9933, -5015, 8053, 4451, -3444, 5031, 10404, 2614, 362, 2570, -665, 527, 2706, -4173, -6167, -269, -1154, -8180, -4301, 5843, 1412, -7937, -527, 6281, -1193, -2393, 4253, 5679, 1474, -700, 1006, 2785, 3192, 1512, -2263, -2632, 1896, -2257, -10064, -2736, 5217, -2598, -7914, -185, 5224, 388, -1716, 5633, 6543, -705, 263, 2464, -394, 740, 1811, -2423, -3004, 297, -1476]
465a476l334M756M910o155m324P414J766p877K392P213l260m557K423K091k61
480A721J55m6k399J19L052n060l203Q335J188r704J001Q012j867n780M463N837
496E824n278m107M949K15k921L428rl982K093J772m013J016N215j840o756K041
512b353N649m685m408O557K484o007q72L726J410o7j66L5l43Q82l39l667J385
529g79N682m144o544N031M123n554k415O260J817p368q86O937j172l395L964O94
545B251l288K462M61k835L015L302n324m507N396K853q367r14Q937k412p291L943
561b318M101j741M7J750r00k66J546j800k037M884J470p705n32P299k402o293
577d897M349L903m123m235K980L356j991j209K373J09L87K29j987J602M413k492
$$ y = [-1476, -4810, -54, 4856, -1299, -5623, 1791, 3557, -4320, -1928, 5285, 2025, -2532, -109, 1982, 1721, 1876, 1830, -569, -450, 2602, -2458, -5661, 2674, 3862, -5842, -4841, 3171, 1304, -4476, -13, 5824, 546, -3561, 1388, 1603, -1318, 2110, 2101, -1881, 212, 1984, -2029, -1013, 4202, 2362, -4394, -2353, 3296, -1389, -5797, 760, 3244, -2763, -3635, 91, 1501, 1434, 1268, 1303, 960, 1842, 1503, -2164, -779, 4903, 759, -5785, -754, 3369, -2185, -4600, 1660, 3477, -3891, -4777, 2160, 988, -2407, 1557, 2251, -1037, 1425, 1886, -949, 2066, 5368, 44, -4463, 933, 3786, -4581, -5495, 3442, 1030, -6261, -2318, 1783, 42, 89, 1839, 939, 673, 2219, 419, -1618, 3266, 4736, -2969, -3501, 3798, 1396, -4897, -548, 3355, -768, -5003, -2023, 1333, -658, -1867, 506, 615, 1002, 1231, -756, 846, 5259, 2767]
593B767n540J096N139k069o388L304N439m662m350M057K452j099m44m55N47J853
609A647o52k648J362M324j969n479K683N159m325l201M862J298m595k057K447
624a144K124k080j111J259L30J093n7j633K309L450l308m180L041L745l478l862
640c502M130K738n073j673M170o8j193L78j550K39K402j282k391K711L160l350
656a54k949M325K424m345J56L786j607k779M39R32j72r11n22o2L9J072p15p65
674a808K704J675l072r48L176J026k893j253L608L04m081M9L355j201j569R97
690F9j183j95J347j402r63K598J434l260p90N061K2m096K198L084l361j664K045
707I44l5j287J14j95p76J32P07j203r2K849m60l020J642K636j208j839J605K018
$$ y = [2767, -2773, -1677, 3462, 1393, -4995, -1691, 3748, -914, -5264, -1207, 1245, 146, -298, -753, -206, 1647, 995, -1653, -291, 4033, 2064, -3415, -732, 4427, 102, -3099, 1763, 3061, -1534, -3591, -1144, 980, -1100, -2211, -952, -622, 471, 414, -1219, 1090, 4540, 1232, -2948, 93, 3838, 360, -3502, 628, 3366, -1707, -3380, 790, 722, -471, -93, -1643, -1404, 998, -284, -2675, 36, 3196, -154, -3103, 1222, 3646, -699, -543, 3243, 1636, -1143, -704, 228, 56, -855, -1377, -1439, -1400, -328, -1043, -1808, 896, 2571, -501, -1449, 1727, 2753, -140, -1393, 2215, 2519, -1562, -1513, 1842, 641, -928, 69, -1114, -1309, 38, -1364, -2327, 271, 1705, -1555, -2345, 2716, 2738, -1358, 840, 3924, 563, -1101, 944, 909, -378, -264, -459, -1235, -1103, -396, -1599, -1691, 1158, 698, -2322, -680, 1956, 748, -1091, 514, 2532]
725B532j551k245K462O99j715k10M15j690P13N1j662N86K312o99k265J653L160
742B546j923k258L776P50l791L30K271j417l58N19j97q73K40J7q15P17J677j602
760c91j907K526O48k067N50K181k57j788R3K131l69j493O13K24j376O53m46p97
778a272J130Q52j996n96K360N68k462N31L029j412k662K029J338j576K04P11q16
795d0P2K58m63p2J016K62k360o0K391j307j765K040Q90j227j228J559J245q33
813C78o34J435m60q65O85o56k1J052o93j685Q79J123q00j198J392J445k785n65
831a973K268M25j351Q86O18n54qJ82L09M5M01m94j828N98J740k203j132K342k00
850G1j817L91J430M75r95M99J011p35j98O87l42L86P31k007l59J107M06j663j40
$$ y = [2532, 981, -1264, 1198, 1897, 182, -28, 387, -1303, -590, -539, -2201, -1615, 697, -2, -2267, -614, 2546, 623, -1635, 2141, 2891, -900, -570, 1701, 284, -74, 445, 248, -625, -385, -368, -1183, -466, 1211, -391, -2298, 228, 876, -1191, -641, 1540, 1283, -505, -412, 1719, 1350, -143, 470, 694, -682, -29, -475, -1272, -142, 710, -1286, -1882, 478, 1046, -1416, -885, 2144, 732, -1930, 99, 1437, -139, 65, 776, -40, 32, 290, -173, -245, 771, 1033, -1327, -1387, 1004, -303, -2068, -28, 862, -365, -1593, -34, 1211, 378, -256, 1179, 719, -146, 539, -117, -138, 914, 221, -1464, -585, 538, -262, -1460, -68, 1377, -1408, -1973, 295, 720, -631, 255, 873, 319, 311, 493, 802, 847, 1248, 754, -1074, -476, 1264, -939, -2071, 271, 71, -1746, -1355, 75, 550, -445, 54, 1065, 330, 132, 819, 477, 863, 1594, -413, -772, 335, 741, -922, -1062]
869a062J572m58k121M22K210n23p75P07K29k38P18p5J89P00j49j190j108J403
887D51K64j750K50J228j235j439J416R24l0n69L31L72o55O76N23j93N98j2j807
906f57K94J569o91j078O92L75j135j127J052J170q53L9L45m52K89N51Q9M04M20
925A296o84j065L37Q27J87j843Q20M77j351n60J675J82o17k10K06O6j86L66L89
944C12j42M26k05j301J079J283j458l76R53O1j442k65J170K87j311N78J53m59
962f57O41L09m87L38P41j220l51P97J052r81q17R59J84j163N53J027o79l37J96
981A05o06n4K33J95j51k03P84o34o27J858N7j086K73P21q20o22N65N96r6m17j43
1002g2j77l71R44o1p81K79K82r27K37P88N57n66k75N72qp14Q31N34p86kj68m72
$$ y = [-1062, 510, 52, -2069, -1647, 563, 40, -735, -28, 201, -37, 681, 606, 795, 1495, 1346, 156, -952, 451, 715, -1035, -785, 443, -792, -2231, -815, 109, 79, -490, -159, 213, -442, 234, 757, 564, 1162, 1150, -657, -363, 1206, 515, -563, 129, 504, -631, -1758, -706, 464, -389, -350, -5, -457, -168, 383, 472, 876, 1296, 612, -453, -116, 711, 898, -945, -125, 352, -999, -1559, 116, 298, -319, -529, -323, -257, -443, -77, 312, 170, 596, 391, -910, 169, 1452, -6, -382, 571, 632, -810, -1075, 95, 382, -929, -351, -198, -657, -16, 293, -194, 144, 885, -335, -686, 111, 1163, 182, -635, 324, 508, -655, -102, 925, 246, -91, 105, -501, -555, -322, -127, -278, -481, 303, -331, -958, 900, 957, -129, 144, 865, 45, -577, -12, 584, 488, 71, -72, -249, -620, 324, 263, -518, -239, 43, -884, -647, 141, 698, 132, -143, 429, 421, -293, 538, 1072, 286, 284, 116, -356]
1024c56j00L04K46p20j04L87m50K01J186P0r52O02K21r06M22R32j61p41l71L49
1044E9j40q5P26p83l95O08k41j000P37O61Om89k2O93L2j89Q87k34p95O78l09j041
1066f36N55M19o20n95M02j68l49M76P89l87k24P76j76p12J167J40k75n09q5j0
1086b2j4M48p2q68j54O55l84l91Q45l6k83M6l4M79j15K01J90l43J50j24r5l81
1108c02M62J88o46k26J62j4K5K7P64p72pP92m80k69Q20M3p30JN32l67o9K62J67
1131C63o18K51M30q97n8J073m87l46L8L30l98J54L21J21l28J91N6n30M16K85k60
1152A07j51J80l51j5M60Q7k79m69O0N54n00k2M63mm28J55%M34j58M0j11J57J16
1175C25K44p71L12M88k85p55L06L91m00l64N01J37m94oJ31QJ76O32l85m1L23m94
$$ y = [-356, -456, -152, 94, -626, -730, -343, -793, -592, 594, 664, -288, 314, 535, -371, 51, 983, 822, 81, -290, 59, -81, -166, 560, -223, -618, -10, -251, -1251, -514, 147, 153, -336, -358, 335, 367, 178, 1065, 831, 36, 714, 405, -636, -81, 338, -282, -877, -475, -643, -992, -516, 273, -114, -338, 438, 262, -450, 717, 857, 582, 73, -12, -22, -36, 412, 340, -528, -682, -27, -411, -802, 43, 7, -276, -230, -264, 215, 100, 301, 491, 148, 298, 174, 79, -302, 160, 348, -298, -524, -362, -376, -351, -324, 440, -332, -339, 453, -27, -296, 524, 567, -163, -162, 370, 3, -66, 196, 363, -255, -4, 426, -471, -529, 544, 57, -289, -251, 79, -319, -165, 156, 277, -51, 140, 196, -334, 82, 367, 107, -44, 136, -215, -230, 230, 317, 38, -431, -371, 183, -317, -339, 124, 120, -308, -153, -153, 281, 123, 163, 52, 209, 325, 569, -202, 110, 598, 313, -442, -136, 255, -145, -509, -8, 129, -365, -371, -240, -232, -56, 576, 191, 150, 473, -21]
1197b1k51Q28Q5l82k73j87K41n77j45Q02l73k08k61K01M88O7M44n56K58K72L0
1218D82p78R19K51j140M5K94J20n76R6L8K26l23o6oj00J033k66m60L53J21m04
1239a41K27O20J6m77m89M10k07o61L36J48L4j33k54K67L48J24j5q2RN23o47K2
1261b2Q04q9q76j50N58j61l27L70j34J08n15m8j17N38M95l82l54M83J14n33L09
1282G1P09n32j44n15L78k37J33M41k40l01N8k50m7O64J91n13P9L58l89j16M81
1303B79J93k34m00j53R0J14M57k15n4j17k61k2L55J27J25k0m98J15NJ28J40L08
1325D62l48l91J05K49n1M04n6j37m89k0K54J88M07l83l83m6n9j09J94J85P71r56
1347b09j94O02j50P0L82P7l43j81j73j2L48k9K50p48k38J58R9L39N79n96k10J5
$$ y = [-21, -272, 556, 641, 259, -14, -201, 40, -537, -682, 120, -253, -461, -722, -521, -33, 34, 478, -78, 180, 452, 482, -296, 623, 874, -266, -221, 73, 193, -383, -287, -249, -23, -346, -412, -418, -518, 515, 249, -211, 142, 263, -141, 86, 706, 722, 245, -244, 166, -41, -702, -366, -218, -184, -317, -571, -304, 44, 168, 153, 71, 80, 603, -44, -22, 782, 693, -183, -333, 225, 64, -263, 107, -27, 81, -434, -482, -599, -61, 434, 52, -302, 181, 295, -238, 71, 780, 248, 104, -411, -33, -270, -137, 304, 64, -237, -179, -429, -476, 188, 379, -134, -55, 303, -86, -202, 279, 472, 238, -162, -315, -225, -111, 346, 131, 77, -40, -301, -323, 32, 159, 284, 264, -234, -119, -114, 14, 154, 462, 114, -277, -172, 77, 26, 430, 374, 237, -252, -272, -18, 170, 577, 194, -189, -235, -294, -403, -209, -24, 747, -209, -403, 199, 49, 119, 501, 578, 235, 54, -119, -131, 217, 188, 438, -310, -548, -390, -291, 48, 627, 31, -179, -164]
1369a64n3NM78L34k38j47m63K36k0M18L18l90p68n0N6L66Q7J17k92m54N53k12
1391b83K72J55M21l64k61k56M25j25J26oj64j41j41J51K67Q8K45o11l22K44J53
1412a27K5L34M41j23q90k00P22M34k16J6n67P5k49l8M98K90n60k20l72J55M72
1433a00k91P92K44n44n87N64K36K04k32r2j60j59j86J95J23P9l14l94J69K74K39
1454F0M5J29K04p29j47L28M16J58k65j86m26M33j08K86K54j54n97l03L30L92j30
1475a0K9K65n05j68L0M29K71j29j87j97p9j0Q0M65J04j54n22m74P91J48k5K05
1497C57k84n8o30P8O28M79p8m62l32j75N60J02o5R0J63o02o16M57O88L60m59j52
1519D9l85k53L56M36M5J99n45k78J78k7M42K40J61n14o59o0R70o9Q9l10k60j90
$$ y = [-164, -217, -212, 266, 600, 362, 215, -248, -12, -32, 386, 704, 314, -454, -504, -448, -82, 5, 122, -170, -624, -71, -283, -11, 144, 565, 201, -60, -316, 109, -16, 110, 104, -60, -201, -342, -191, 76, 164, 409, -202, -524, -280, -127, -102, 232, 673, 550, -340, -540, 182, 616, 400, 416, -151, -76, -325, -363, 135, 425, -135, -355, -727, -572, -100, -391, 401, 645, 101, -486, 78, 314, 518, 286, 194, 34, -125, -311, -116, 7, 86, -228, -622, -453, -179, 60, 105, 234, 438, -291, -438, -110, 306, 464, 199, 13, -413, 20, -88, 198, 452, 298, -299, -602, -272, 120, -10, 19, 284, -221, -389, -359, 70, 341, 212, 25, -172, -251, -261, -181, 284, 388, 234, -288, -762, 29, 177, 152, 357, 73, 15, -615, -537, 91, 570, 492, 30, -302, -477, 83, 185, 120, 210, 373, -229, -845, -388, 300, 660, 201, 49, -336, -589, -233, 203, 248, 447, -98, -376, -198, -225, 217, 457, 618, 104, -555, -615, 355, 286, 375, 65, -195, -385]
1541c85l68O11K91J43j50o69J66k94Q63K02j31k10m3n29Q0N85J38Mk87l8l14q
1563c43P77l37Jj30l04KK22L19J00p1j93m62J64J54O44K73q13J3l80j33M56J21
1585H0K24M70r46m79K62N69J29j74k48K29j28k06L93L45k36l36o2k92J09J67L99
1606B69k08k45j27j40J53M87Q5j42k41J34k52N2N50P2k79l09p9rj17J44M24j04
1628A18K10p34l02P14J84J66l01n28M75j46j71M29L95m8n23m79L66J95K74J17
1648D11o57o8K25l11L50K70m2j28l54k22j7Q44M3J77l45m69q6J83J70M91M1m40
1670F6k52k27K28J82J85L2j99k27N5k5K16m4J43K31n17l13J97O90J05n16m1j52
1692a83L21k20q6O60k78p0p89K90M64j70N12n06l79O59l09K5K16K83m64l5J0J69
$$ y = [-385, -753, -142, 149, 292, 142, -527, -361, -655, 208, 410, 279, 69, 26, -503, -423, 162, 300, 304, 17, -21, -335, -343, 434, 97, 98, -32, -336, -334, -112, 207, 307, 236, 43, -419, -255, -101, 543, 816, 3, 16, -364, -497, -41, 80, 304, 774, -172, -651, -389, 180, 309, 135, -113, 116, -12, -218, 175, 520, 284, -52, -114, -406, -297, -130, 269, 61, -184, -311, -451, -298, 189, 274, 132, -109, 25, -227, -175, 375, 447, 168, -141, -220, -229, -346, -202, 222, 118, 328, -406, -708, 6, 190, 356, 55, -473, 2, -144, -315, 114, 509, 461, -62, -541, -175, 20, 294, 411, -246, -314, -89, -400, -50, 220, 178, 50, -304, -526, -543, 301, 344, 521, 176, -293, -379, -196, -26, 465, 506, 66, -186, -413, -185, -3, 182, 214, 15, -212, -157, -182, 34, -10, 133, 364, -153, -466, -269, 421, 526, 10, -31, -183, 138, -82, -168, 492, 214, 144, -645, -355, 109, -61, 451, -55, -434, 225, -84, -59, 157, 440, -24, -59, -49, 120]
1714A20k09O32J4n22l06j58J12K37J76L5l48M00o20K67J43L76%n02k2K41J40j27
1736G9K8J19j43k06j07n2N08p4j62Pp9p5kL77L09n42m9k62J96M80J2j67n2p1j22
1761e0k16J98K69J09k45k15K52l42J92K88J51j90k16k09L26K93k55K2J29m91R1
1782a09RL29J46L3o57J77j32N1J09K20J14n63L2K36j39K06J18P1j50k22j03K64
1804D0J5M1j13j7m59K56J73K30Ql7j81k15J62q0K98R5m01k05j1K68j47K77K22
1827B19m7j89j36P4J90R4j52j59J5m3l40N59k2J73j42n27O54k27K23J97n68J03
1849e1O9k10M9K46J56j17l05K99k91K52j86K33l4k42n0K9M9M0K60L0k38k1J02
1872F9J72J84l1m06k56JQK25lJ01J27j29l24J48L19J6l35l0K77k52n9L58j02J88
$$ y = [120, -89, 543, 557, 35, -271, -429, -317, -80, 96, 131, -217, 183, -437, -170, -27, 349, 349, -153, -175, 66, 206, 79, 107, 226, 83, -123, -230, -282, 226, 152, -10, -3, -82, -157, -159, 218, 527, -15, -64, -326, -130, 350, 362, 195, 143, 72, -50, -266, -68, 201, 310, 65, -150, 102, -240, -48, 240, 391, 201, -15, -224, 102, 395, 140, 162, 291, -200, -109, -100, 229, 375, 408, -249, -72, -204, -153, -44, 176, 290, -273, -241, -5, -144, 62, 180, 251, 101, -121, -224, 40, 55, 96, -17, -34, -493, -237, -64, 166, 174, 137, -44, -259, -97, -177, 121, 216, -185, -390, -401, -133, -280, -3, 219, 172, -17, -153, -79, 111, 205, 53, -106, -91, -134, -474, 85, 63, 236, 94, -433, 221, -6, 217, 414, -154, -51, 18, -192, -143, 103, 259, 142, -163, 136, -155, 97, -89, 144, 110, -132, -182, -153, -104, -64, 196, 226, -12, -33, 69, 241, 425, 394, -12, -268, -267, -259, -34, -37, 64, 191, 62, -262, -114, 205, 221, -114, -144, 133, -119, -178, 180, 78, 266]
1896B66m31O3J00j74J75J76k28K76p54K23N81k79L43l70M31m15K28n0p4L52k40
1917A99k99n6L48j95k48J78J70j65k41k77O92K83l00l2N5k40J65m15M48Pm0k74
1939b37K6J04P9j37L6J76j30l00k8O82p0j18j83K40j36r2K66j01n4l05K99L0o0
1962a3K25k48K78k4l16o6J35M13q7l45k4j60L02k36M8N42k71k53k88M75K24m31
1984a20M4P6J46l74l2L59L33k17r1j14k56L06j34K55K19k33l26N5j15O45l48N0
2006A28J97l62J9J30J21K03k46m40l7K47R2k12j1L86p1m56k20N83J81k01k40J28
2028h1j5MJ03Q9P9M2m26n7J58O5J99l44J91j21j85L37K7O8K4L4l5m53K89L25k16
2053A01j4l04j22K09J20q6NK35m6k62L0o1K19J47Kk32N28o55J07k5K73j69o0P3
$$ y = [266, -165, -102, -2, -176, -1, 175, -53, 223, -531, -308, 273, -6, 337, -33, 398, -17, 211, 161, 87, 439, 199, -100, -156, 192, -3, -251, -73, 97, -68, -309, -586, 106, 389, 89, 57, 112, -128, 37, -378, 70, 77, 37, -237, -211, -107, -28, -165, -129, 47, -83, -383, -411, 271, 201, 83, -100, 140, 4, -88, 178, 77, 23, -282, 17, 47, -13, 212, -36, 242, 218, -98, -164, -29, 384, 297, -48, -72, -232, 70, -166, -118, 424, 153, -100, -388, 87, 311, -120, -76, 0, 146, -228, -260, 99, 432, 215, 124, 10, -246, 60, -74, 181, 400, 167, -159, -104, -219, 426, 78, 128, 325, -37, -18, 112, 233, 436, 190, -250, -287, -40, 52, -160, -171, 215, 144, -312, -532, 51, 232, 31, -209, -81, -96, -92, 11, 100, 179, 221, -205, -262, -104, -39, 160, -184, 7, -114, -299, 38, 65, 133, 157, 191, 156, -297, -8, 317, 101, 87, -217, -339, -130, -10, -96, -91, 144, 98, -164, -134, -195, 24, 171, 173, -59, 469, -186, -79, -104, 169, 0, -60, 13]
2077A3l83K71K10P0k04J14l77k30K76L70m68Q0M24k7j68j57K67J54j28N2k98K66
2099A27k00m4L33N3l1n90L38J90j95j88K53j91K66l31J14L12k44L9j8P4N1k92
2121a74J05Q7J11p5q8o9L25j54Q3k49L75l96q0J42P2J39m34j7J96J48jk19L45
2144A72j03l44J28J34J32k24R6O6K58l65j42J08K32k8k10J32oM8k51J57K13j64
2166C9r1p9j50M74J23m64L3J03o4K2L1K66j14n03L54K06k42M3J85K8K6m15J67
2189b2K94k39j89N9M8LK24k82J42J53l72j7J14J61o3j79K28m0k4j57K20J72N2
2212B86j57m10O60o7l84K10K32m07j56M08j72K6r6k77M96p9l59J09R6P3J90j49
2234G3m79M66q3k05M47n5K5k86k9K01m08L30l4K72j42m18K14R7J42J26l94L85
$$ y = [13, -370, -99, 111, 181, -23, 91, -286, -516, -240, 130, -338, -258, 166, 139, -29, -186, 81, 235, 107, 159, -139, 127, -73, -117, 216, 269, 238, -352, -14, 176, -19, -207, 46, -145, 121, -210, -96, 216, -28, 11, -7, 67, 118, -174, -69, 18, 129, 54, -34, -103, 222, 68, 151, -98, 277, -119, -199, -57, 15, 154, -280, -297, -101, 47, 46, -173, 172, 69, -275, -147, -13, 119, -105, -9, 57, 315, -50, -192, -84, 148, 120, -90, 42, 36, 84, -167, -10, 203, 39, -52, -131, -281, 193, 316, -148, -115, -12, -76, -54, -23, 243, 129, -374, -20, 186, -56, -13, 172, 200, 226, -189, -22, 272, 33, -156, -97, -49, -46, 178, -104, 38, 191, -181, -198, -84, 77, 14, -165, 63, 23, -1, -158, 62, 234, 286, 129, -281, 379, 312, -72, 138, 370, -37, -193, 215, 43, 69, -27, -304, 192, 113, -246, -137, -41, 32, 222, 73, -406, 60, -23, -228, 219, 164, 189, -97, -126, 75, -333, -3, -37, 235, 93, -325, -111, -14, 128, 254, -140, 245]
2256B45j18k24k99L12L84m73k09K20N36j61n58R8K35J51j38k26N03j38m48L57
2276D9K71j15k23J44R9k74Q1l58L82K04l81q2J10N04l24k13J94l7J55j79J84l77
2298a86M40q4j78P9Q9l06J3o3M81o9m97k9M66j92k58L10L7p9k14J49J56K89m66
2321a12k33O51k34k93J53K87j53k98K72N6l7qm21N02r2k55J33K32J9j34o4j36
2343a65K61k14J05J14K16m6o05M74K6j16k16j60M27k49J59j67L55l33J66j90J94
2364C6J07l62J45K71K9K8m25l28N93K19l62m6K03J59l06j04M33j79l50n5M09O6
2386A81l23j1L74l60Q2P8J89k07q2k52M01Lk89Q7K52j32J08l81J24J01J48J00
2408A91o5PN5j41N3j57L29k22n5N2k88J27M7P3n1k27J65J81j97n1L4R7L3L54k85
$$ y = [245, 127, -97, -396, -84, 300, -173, -382, -162, 374, 213, -345, -247, -12, 139, 1, -225, 278, 140, -308, 49, 320, 205, -18, 126, 225, -49, 32, -326, 56, 260, -121, -203, -93, 411, 87, -126, 68, 31, 186, 7, 191, -186, 254, 170, -8, 71, 160, -146, -133, -196, 285, 216, -281, -310, 156, -36, -294, 16, 53, -26, -240, -91, 65, 354, -112, -345, 306, 72, -221, -68, 219, 66, -232, 40, 96, 59, 51, -370, 132, 40, -215, -82, 150, 169, 35, -29, -165, 96, -118, -13, 101, 317, 271, -334, 140, 166, 50, -166, -326, 101, -148, 11, -156, 199, -134, 32, -158, 36, 143, -219, -74, 197, 226, 254, -171, -499, 94, 313, -49, -95, 108, 267, -39, -143, 290, 111, -239, -294, 115, 181, -142, -153, 221, -139, -57, 21, 210, 3, -79, -331, 70, 73, -216, -129, 123, -9, 99, -282, -158, -57, 91, 191, 126, 133, 188, 47, 100, -57, 272, 50, -5, 47, -241, -114, -67, 6, -45, -272, -107, 74, -123, -174, -140, -43, -10, 344, 59]
2433E9P5j15N0p2o6l7j26J01K09j00q1O4LJ0J55j11j82K74J7l17L0L53j80j13
2457a00j2k9J91j31l5j25K55K63k78o8Q6M03n16k9M4L26o33K85L21l97j52L83
2479E2j65o5M66k57K76m81J9l8L74rn9n2M4j22J57k34J12J5Qj45l1K69J32m08
2503a42j10L48k22j3j00m9L06J82k88p0J97K99m60P1K67m55K50J4K2n2j1q9J75
2526G0m9p3j18J07J93k01o8R7J31j42o0ON58n58J65K7l8n5k24K56K35k13j85J70
2550C1K8J94k36j33k14J36R0j83K45j94L81j89O3k04L66k30L0j23L8J88r2J94
2572A86k38P8m32L32J72N0k96K14j0j96r4K37J76r9m5Jl3j01j82N10l15KJ51j73
2596a05K54j37J88k3k56J86l39k0L58k11K51k72J74j99J13l2RJ20j61J40o0j93
$$ y = [59, 134, 19, 69, -3, -69, -106, -232, -131, 78, -22, -103, -39, -36, -26, 129, 18, -164, 110, 127, -190, -160, 193, 13, -100, -112, -141, 50, -81, -116, -241, 14, 277, -1, -69, 17, 420, -96, -125, -81, 245, -388, -103, 218, -179, -331, 52, -113, -178, 288, 31, 307, -174, -155, -193, 181, 172, 113, 61, 105, -17, 140, -94, 18, 33, 41, -104, -135, 134, 266, -142, -252, 96, -126, -139, -239, -288, 18, 200, -88, -158, 39, 338, -122, -51, 216, -239, 11, 25, 47, -5, -16, -105, 70, 21, -52, -170, -63, 130, -71, -139, -42, 89, -53, -113, -107, 451, -107, 58, 85, 47, -8, -232, 24, 259, 46, -139, 31, 59, 253, 17, -116, -330, -194, -104, -287, -42, -236, 145, -44, 19, -185, 181, -49, -19, -142, -104, 84, -8, 186, -52, 26, -406, -74, 98, 148, -148, 66, 56, -140, -234, 3, 179, 80, 35, 36, 3, -98, -280, 230, -85, -83, 68, -105, 149, 12, 200, 177, -79, 107, -232, -252, 106, -105, 146, -126, 48, -151, -38, -70, -61, 59, -102, 38, -22, -215]
2618b15l8M45k97J80ml38J55Q8Q0k15J28p4JM91l79K6J15m81J34K03j56r0K24
2641a7M58m69P7k51o0K72K04k17J67k51L5jo3Q3O3M3l80N01j52N7%j91L26Ok02
2666C8j15K20k03o2q9L05l52o9O5L86j68r2JL63m7l49K88K9J3m08Q1L29l18J94
2690D0k6ok6j41J20L49p6j68k42K96k76J76q7lL70k66j77k26K57M79l39j27O9
2713c0O6l9r2j82J65N2J53j62J66l01K8L62l63K66k22P7K5Q1n0J48r3r8J60j66
2737d9j65K87O7k00j08J94J31o6j32R8k64J34j05J37J29k11J40J13l54K29j09
2758a04J19R5p8J13j22Q6k89J82J40k00j27J82J19j99M00k47j17K17j92J38r2
2779B4k47J04R2k81K69n3J28p3J48l27RJ8L94Rm66K97o7J31J0j27P6j50l7lK8
$$ y = [-215, -253, 192, -105, 75, 71, -267, -112, -24, 56, -159, -31, -105, -104, 387, 8, 34, 149, -332, -198, 5, -151, -241, -17, 441, -28, 49, -202, -262, 10, 214, -3, 164, -87, -52, -53, -116, -33, 30, 73, -307, 194, 42, 99, 99, -92, 234, 240, 38, -77, 143, -60, -122, -211, 94, -258, -327, -262, 124, -44, -136, -135, 228, 181, -168, 120, 149, 162, -246, -165, 164, -154, 40, 14, 8, -18, -159, -39, 310, 234, 66, -176, 120, -156, 20, -67, -70, 300, 34, -143, -369, -112, 367, 28, -99, -30, 36, -3, -95, -277, -112, -60, 93, -69, 97, -204, -176, 186, -177, 89, -133, -56, -31, 50, 0, 148, 55, -43, 117, -49, -214, 73, 140, -60, -168, 26, 157, 91, -41, 57, -207, -73, -178, -41, 88, -123, 17, 130, -224, 5, -104, 15, 110, 32, 145, 23, 109, -180, 2, 142, -58, -185, -3, 116, -83, 317, 70, -47, 170, -22, 116, 24, -223, -119, -27, -308, -39, -92, 36, -37, 111, -216, -207, -189, 205, 214, -252, 45, -22, 109, 119, -8, 68, -82, -119, -122, -94]
2804i4J83p3j12L9L27j46m93K08J53J68k29J47J00k83J07q3R6L19l12j12R1k36
2826b35K59LJ42l31K20R5m50M60l48J45K13m5J1l12K57j06K16l40K24j71J14Q4
2848A05l42J99J01j93J51K0oJ21j13j53k5J42r0M5R4j60P1k2M6O4j47J36j23K66
2872A87m94K75k43K59J72k08J47q8J36j57L5M69j42l50q6K40J29l70J46J26q6
2893I7l09L3p2L99k1j14l8r4K29m0j51N86l96k9K42l14J09O8j93Kk63J28Q9l06
2917c58N67l14j79L30K59m91P6L57l01mj59K73RJ84k38o2J4R7k33J12K26M7k81
2940f9l5J23j6M46l89O1J40m29j56L81J23J23n05J33P0J97m83K84J48j40n7j66
2962b16L16k36K06rK49k20l2J62j45Q8q1k32L15R1j89j46K34j3k23o0J80p5j42
$$ y = [-94, 89, 16, -96, -57, 270, 124, -369, -161, -8, 160, -69, 78, 178, -105, 2, -81, 15, 334, 22, -90, 1, -235, 24, 27, 169, -162, 58, 153, -297, 163, -185, -40, 173, 128, 139, -173, 84, -22, 194, -146, 78, -93, 21, 105, -237, -38, 63, -130, 21, 41, 35, 156, 43, -110, -135, 7, -83, -38, 56, -104, -33, -55, -9, 55, -92, 44, -79, 187, -307, -32, -275, -16, 156, -52, 95, 7, 143, -14, 21, 490, 348, -2, -88, 152, 281, -89, 57, 183, 97, -212, -179, -251, 148, 127, 13, -25, -119, 110, 70, -81, 505, 109, 80, 322, 8, 117, 185, -8, -6, -269, -141, -52, -358, 209, -105, -284, 46, 305, -186, -110, 247, -54, -58, -217, 56, 65, 249, 11, -51, -37, 60, -173, -61, 165, 212, -69, -104, 19, 3, 449, 60, 121, 261, -168, -324, 57, 180, 303, -202, -69, 1, 198, -285, -1, 147, 7, -50, -216, 100, -136, 70, 61, 310, 90, 58, 220, 75, 163, 82, -150, 165, 256, 67, -79, 155, 142, -81, -141, 39, -36, -178]
2985a78J90Q2j14K97k03k25P4J31o6J99j88j35L3R6L28j53Q3n41N38j77k50K26
3007D7J89j69l70J09k1R9K74j46M2K5p5m9K4L83l95lk0l0m6Q9K48l15O7j36P9
3032a00J18K9N1rj85K61l10K90q4J72n5j64N4n8j36J08K6O5o8rj8L4M5K6j15k50
3058b82K55j23M26j04r3p2o7j8O0o7K51r4j48K15r8j09J55n2j18p1J90R8k2k5
3082H7j89M98m13k3k19K69j47J00k7J12m6j9k79K89j60p1J0P7J12P1J85j94m1
3105a8L69m77K62QM7M1Q3l40j75L39j79J17p3m8j68K57j16j38L31j07j36K3PP7
3129a4q0L71j83R6j34J11o9J2k1j36N5P1k02J37K4J4j27q7r7M30K01j97j01k41
3153a67K38j90O9j76J45L37M9l20l2J51n4M9J25k76N7k00j84N20m14M05k43P7
$$ y = [-178, 12, 94, -20, 277, 74, -151, -77, 54, -12, 187, -1, -136, -103, -7, 321, 168, 251, -290, 248, 71, -179, 47, 236, 67, -303, -194, -215, -116, 158, 12, 54, 79, 4, -45, -21, 362, -33, -36, -56, -86, -132, -43, 205, -110, -43, -179, -100, 18, 47, 98, 89, -96, 165, -145, 145, 61, 233, 178, 14, 68, 10, -126, -18, 8, 73, 5, -4, -22, 12, 57, 83, -32, -282, -27, -150, 276, 172, 79, 7, -60, -78, -18, -85, 166, 72, -76, 139, 41, -68, 87, 35, -83, -154, 36, 134, 112, 87, -102, 396, -17, -40, -259, 10, -137, -37, -64, 48, 2, -17, -296, -7, -167, -238, -228, -151, -39, 32, 217, 23, -18, 351, -126, 136, 144, 191, 232, 315, -25, -200, 139, -40, 77, 4, -44, -212, 45, -71, -209, 122, 15, -121, -98, -91, -14, -94, 277, 94, 190, 56, 167, 98, 110, 89, -47, 8, 79, -123, 14, 38, 52, -75, -162, -259, 171, 372, 175, 74, -167, 71, -119, -50, -226, -81, 256, 305, -15, -47, 104, 50, 99, 224, -52, 5, -195, -379, 141, -273, 132, -111, -34]
3175c4q2l9N55l24j25K23j34q8Q5k53M10k04p0L08k99J8K92j03k87n5K99k24l
3198a34M63l77J31L0k83K09J03k01J88m7o1m6j10K71Mp3J21l37N2L4k69K16K67
3221A51j08j3Qk01L10j31J07k91N2K54k29M1J55j13n1R0J41k06p6K52j01p1L14
3244B84m16L9K63j35M6p5J10k90K60r2K21j64j2J34m5K28m36Q4r2N0L8j85J82
3267co2K74k49L82l53p0M3j12L49r3k1j94J51k08K61j54K14k53K27r8p5K1J03
3290H0j57j12L20j24j37K86m21J24J90r2J76l44Q1K78n7j38j00P7Q8l24M29l22
3312a99K56J9j78L15o7m5l71R1J15J49lj04k17Q4K31m36L17j24K24N8l18J73j4
3335d4p0j14J53j70K24j69L12j36Q8l13L33k81J5o6L13N0j21k30OJ85J74K18l83
$$ y = [-34, -116, -155, 400, 76, -49, 174, 40, -48, 37, -216, 194, -10, -80, 228, -71, -53, 239, 136, -151, -206, 93, -131, -134, 329, -48, 83, 113, -170, 39, 142, -59, 129, 82, 21, -25, -135, 136, 140, 67, 188, -149, -97, -63, -332, -116, 151, 43, 30, 38, -163, 147, 16, 123, -168, -116, 138, -91, -50, 105, -8, -59, 31, 172, -34, -110, 142, 41, -30, 284, -132, -93, 170, 35, 81, 6, 116, -174, 86, -6, 215, 51, 39, 173, 128, 356, -80, 4, -88, -38, 0, -185, -3, -65, 209, -40, 342, -11, -81, -38, -150, 199, 106, 85, -109, 42, -166, 95, -59, 155, -98, 129, 31, -44, -23, 80, -77, -189, 131, 7, -130, 156, -265, -141, 49, -43, 133, -211, -130, 148, 91, -47, -147, -70, 18, -306, 123, -199, 57, 76, -102, 213, 146, 101, -270, -179, -64, 85, 82, -22, -239, -155, 76, -360, -43, -167, 57, 115, -203, -30, -44, -114, -228, -75, -245, -21, -190, 122, -14, 74, -239, 94, -187, -172, -238, 75, 125, 4, -226, -220, -35, 139, 357, -26]
3358b6K91k95J28l16K24j23J09m3l4K95k97p2K30q5J81J34m02k12N5K50J47j13
3380B6o7n8J43J12L3j07O6j02l16K63Q5R3m5o6J2j16m06M52k5N0j4J42j17k43
3404b05n7K42K0j72K09rl4J36l51J20J57o4K01l20K21J44l7j97o8J12n01O40l3
3427A54j27j6k8J60m15J06K92j76k60L18Q6Q8k28M0n4p7n5K08kk94J89L84l08
3450a5P4j01J72k15J00k94K95k91K40j5O2L5R8p5O8j77LJ13R4k71m5Pj10J32J60
3475D4lj02J3k1qj55M05p3n0j08l8K19J21r6J60l09k35L23m13M50R0m27M4K48
3499G9k37j7K14k3q8M5j55K50l68N16k13l5K43q3K8k53p4L9l9K01J23j79P5n2
3523cJ28j60K3ok77L51j11L03l46j12K40L7k02J9K27j20M6pk3k18J84J03j45j59
$$ y = [-26, 265, -30, 98, -218, 6, -117, -8, -51, -85, 210, -87, -159, 71, -14, 167, 301, -101, -313, -258, -8, 139, 26, -41, -99, 44, 156, 189, 82, 148, 46, -270, -7, 78, 171, 126, 60, 72, -44, -450, 2, -23, 27, 13, 155, 38, -205, -262, -20, 0, -172, 37, 28, -6, 130, -221, -101, 56, -8, 193, -127, 94, 238, 201, 4, -64, 48, -453, 187, 154, 27, 11, -17, 143, -272, -166, 126, -50, -310, 8, 94, 182, -46, -6, -60, -137, -192, 16, 14, -280, -91, 293, -15, 59, -42, 130, -85, 15, -279, 16, -275, -35, -50, 12, 47, 145, 70, 138, -39, -36, 77, 171, -100, -145, -138, -248, -116, 44, 41, -61, -48, -69, -77, -232, 173, 100, 50, -58, -96, 123, 244, 148, 308, -1, -236, 87, -326, 124, 214, -213, -169, 79, -158, -175, 39, 16, -72, -27, -182, 68, -300, 216, 3, -32, 211, 128, 156, -97, -171, -132, -171, 30, 153, -26, 49, -3, 125, -35, -12, -18, -295, 56, -55, 248, -98, -210, 30, 67, -135, -116, 111, -9, 37, 30, 7, -211, -27, 76, -69, -228]
3547b28M78k43L77k96k28J97L1m2k01K51P0Q1m70K96Q1l49J73j11j58R9J32oJ54
3570H8o2j18J57Q0m77L28J36j84M30l69l17J28KK9L16j10k8o8J8j96J48K18l09
3593a60N09k97J2RJ06k64L30j41l12K15k59J85P5j5J97k2j01j78J23r2J61j99
3615a18K88k06N4J30l9j89M6p4J10j15L20j00k6j68J03m6k4Q8k70P0K30R9k01
3638c8J76m4%K8k27Q7M21k99m74L58L18l08j03K61k29K9j07J94J79m94M24j65
3660a3K3K42l06k30J02K37k12j26K79n3k31M26q0J33Q5k78j31k56K73O3J42j06
3682a7M9k09K53J09k98L63n27L77j38j3J36k96j31M22j81J54j61q4J96K54k49
3703Ij98L00j28O6o8op9R5j32J63j21Q5J53j86K18k56l44O40m48K67J38k52K89
$$ y = [-228, 250, 7, 384, 88, -140, 57, 88, 46, -155, 96, 166, 247, -223, 73, 154, -195, -22, -133, -291, -192, -60, -66, 88, 26, -92, 65, 145, -332, -4, 132, -52, 378, 9, -308, -180, -178, -149, 167, 57, 29, -39, -21, -217, -69, 149, -160, 349, 52, 64, 73, 179, -85, 245, 104, -208, 7, -252, -67, 8, -7, 190, 168, 67, -111, 12, -80, 81, -118, 170, -36, 18, 148, 109, -80, -34, -108, 2, -113, 207, 107, 81, -87, 16, -30, -54, 34, -236, -166, 64, 163, -38, 138, 94, 94, 122, -105, -18, 403, 104, -370, -12, 306, -2, -105, 156, -73, -44, -151, 43, 222, -272, 152, -13, 10, 252, -54, -284, -182, 55, -157, -283, -4, -57, -288, 138, 58, 191, 276, -2, -133, -389, -116, -53, 89, -17, 32, -177, 76, 185, -113, 250, -277, 100, -38, -51, 85, -211, -342, 80, -101, 53, -108, -192, 4, 258, 9, -189, 111, -17, 49, -19, -25, -104, -9, -141, 22, -99, -14, 139, -47, 171, -85, -429, 211, -237, 30, 168, -84, 205]
3726B05n9o3k3j13j2J26L7p3p4K8n2J6K06R8m04m1N2L17rq4j76o2J4K06J07l48
3752a81N24m24M2l46M45j08R7P7m52N17j79n6K78k39k5j18J53n6L13n86N72l29
3774h1P2J51j28J32k29K70l56J81j48j98M25j26N9k44J05K79n37L65K03j92n3
3795e0J39L5k26J59k38L86j97j42J18N5J18j63Mk44K51J37K35m37P4K20j22k59
3817a47K25L4j31O8k32K01r1k26M56j74k24k8O7R5j96M50N6k21k42J30L8k8N0
3840g0NO6J4J15j26K5r3J41K49k61l6K2j20J99r0K20j03l21N9L20j1m25J17K96
3864A92k0l44L33l43N3J80j50J99J45l6l01P1j66K58l56K72j7J70p2o3Jp1R5j10
3888h0m3P8k8J28K77m54L02k79K9O7o5J33o1k5P6o3k10Q6M2J0L23M9l82K79m75
$$ y = [205, 146, 83, 60, -53, -65, 61, 98, 25, -49, -21, -73, -57, 149, 247, -157, -198, -146, 171, 162, 78, -98, -160, -146, 60, 167, -181, 343, -81, -39, -385, 60, -48, 49, 126, -326, 191, 12, -44, 234, -5, -30, -148, 5, -51, 262, -324, 248, -81, -9, 142, 14, 146, -83, 187, -169, 12, -136, -334, 91, -35, 24, -220, -115, 164, -373, -8, 195, 3, -50, 89, 124, -102, 57, -181, 205, 8, -134, -16, 39, 157, -6, -2, -246, 5, 142, 377, -60, 14, 234, 112, -147, 78, 112, -19, 49, -183, 18, -73, -299, 157, -17, -241, -269, -202, -107, -303, 147, 203, -18, -260, -130, -92, -120, -70, -65, 1, 15, 130, 4, 29, -64, 77, 326, 65, 29, 51, -69, 130, 40, 260, 157, -164, -105, 215, 204, -221, -104, 192, 172, -172, 161, -182, -129, 51, -99, 100, 245, 209, -92, -21, -187, 71, -285, -13, -30, 140, 68, 5, 6, -65, 30, -80, -123, -45, -73, 55, 332, -122, 180, -99, -70, -3, -68, 65, 4, -21, 55, -8, -218, -132, -90, -80, 243, 292, -90, 189, -286]
3913b86N85j64k13K2K72j88l1J44k81l3K5J16J33K95j98J04j98O3k55MK9J39L3
3936A17R9j21j34K33l66K76k82J27j23L11m50L60n2L5p8Q5j02o8J82k45J44R8
3958D6j07j04M01l86J25K46m6l02J68J19j42Q0j20K0mk19L74j85K96k05J01k42
3980h6O4N4k5k64L18R4k36kR7J10j83k3J54j06q1J45l4j5j67L35K6k25J39K13
4004C02l82RR1K14j06l8k81J09n6J76j47J86p2K8M3r6J71k65J12j47LN3Q1J5J56
4029A59j22Q8k89O3K25K16k78j32J42J08l63O3K96k42K5k20M32l78N16k13k40
4050a44R9K73k17J06j10O3k2p1K04k29Q6n2N6j16Qk11K23O4j43L73j85j01m0N6
4074c0Qp1K05Ro2N5ok70J3K14N3k00R9k06J80j62L90k83L3J20j22M4J53l03m5
$$ y = [-286, 299, 135, -78, -56, 216, 28, -3, 141, -140, -173, -148, -32, 101, 396, 198, 302, 104, 167, -88, -84, -55, 84, 117, 216, 95, -39, 194, -172, 104, -178, -51, -174, 137, -313, 47, -5, 30, -48, 37, -65, -133, 49, -196, -52, 46, -61, -165, 236, -150, -25, 221, 175, -127, 41, 160, 18, 98, -22, -2, -6, -225, 149, -36, 260, 55, 156, -86, -22, 32, 7, -257, 61, 155, -81, -83, 14, 124, -59, -82, 72, -34, -115, 30, -4, -19, -186, 149, 175, -50, 89, 302, -80, -71, 20, 234, 128, 90, -191, -82, -138, 38, -109, 77, 5, 33, 76, -20, 151, -114, -2, -149, -146, -93, -12, 3, 159, 37, 125, -164, -101, 124, 340, 62, -70, 72, 180, -183, -120, 176, -66, -41, -261, 171, -207, 309, 96, -144, -45, 228, 11, 117, 7, 70, 48, -23, 181, -48, 38, -14, 42, -74, -66, -277, -54, 10, -133, 240, 55, -46, -86, -30, -22, -93, 112, 121, 59, 114, 108, -162, -149, 65, 118, -82, 17, -189, -9, -171, 219, -64, -31, 89, -33, 11, 164, -139, -184]
4099a84K12l6j4m3K13l40J11o6M1J80j1L5K00l92J45mj63J36Q9j3m9k32M08k20
4123Ck5j14J32k1J08M5R4k17J11k90K42j24K84k30N3K72m68k4K59m5nl7J61j21
4147D3Q0K8p8j9j41J01L5j50J49n3k01L97l08J17k7M9k92M53j58P1K0Q2k92qk
4172a04M45n02K54J30l15R0N9J19l38L39n0j73k2o9J62j18M2K2K18l94K6K26K35
4195B82k41k89J37l3J13J41l53p9K95J22n7j6P4k57O0q5K89k70j62N86j01k6l4
4218I6r0j20N46m54J11l12j99O27p6Qm7N0l00J51K0L2j91P8J7P8J83k97Q2KJ79
4243A74l67K79k09J21l07J45K07j03l1p7Q8Q4L3k01k4J96n2q5J27J82n0l2j86
4266h8M5j33J39k3k4K99n90K81M04j40j27j39J28q5K2o8K65k67J34l88J08K34
$$ y = [-184, 28, -8, -22, -65, 148, -192, -81, -147, -106, 74, 63, 98, 298, -94, 51, 47, -116, 20, 109, 96, 47, -185, 223, 3, -22, -136, -4, -25, 83, 128, 222, 5, 116, -174, 68, -56, 228, -2, 51, 323, -145, -169, 90, 45, 40, 3, 164, 43, 123, 151, 73, 54, -87, 14, 49, -101, 48, -5, -206, 191, -117, 0, -27, 22, -270, 183, 25, 96, 116, 198, -94, -102, -104, 341, -161, 93, 223, -92, -2, 57, 176, -162, 177, 127, -46, -68, -137, 25, -93, -51, -29, 189, -205, -179, 47, 282, 41, -248, -111, -144, -31, 110, -243, -322, -27, 95, 38, 22, 96, -161, -101, -186, 103, -167, -329, 257, 156, 130, 96, 6, -114, 432, -22, 89, -223, -422, 205, 129, 137, 90, 140, -160, -9, 11, 43, -148, -70, -53, 25, 208, -89, -7, -5, 174, -193, 86, -123, -2, -309, -164, 43, -60, -91, -168, -80, 4, 37, -164, -188, 8, -44, -129, -2, 180, 130, 98, -88, -43, -176, -37, -60, -84, 215, -375, -94, 310, 170, 43, -96, 32, -53, -31, -99, 166, -101, 33, -355, -247, -13]
4288a3r0J2M9P3k15M56m25P5J78K3PK9l72K32j97M5K16J26j71l98L56J28k86J89
4312B7N7Q0l09M1K11J12j26R7K8j05l60M40o9m4j5O6j98R8R6k01kJ30k94J21K89
4337A70o5k49M7M5J10j22O3m4J24j29N7L07m76N6K71j94J69k94km9K29j28l06
4360d10M23O7j22oN0J87j57r3K0j94L4J37M3M3j79K38P9L6j70j59K56j4J06k53
4384c8K55k50q3n9K58J58j99k4K80j89j8k90Q0M7J10o4J69O1j34J00k70P4O9m4
4408aR4j23o2K37Q4n7j76j1O4o8m2N6N7l50M50j18J24k20J15m5K95l34k46J09
4432a68K27j4j5J6j89J72m4K51r1P7l57k24J47J40J60j54J42j14R4j78Kj52M10
4455A38k13j04J75K9J36Q4k66k68K86p0K9k33K65R3J50l07Pj3K84j23l6j02K0
$$ y = [-13, -103, -91, -42, 31, -184, 272, -153, -78, 100, 123, 130, 159, -213, 19, -178, -133, 83, 209, 38, -360, -4, 124, -162, 27, 84, 164, -145, -104, 107, 219, 93, 190, 218, 113, -247, 193, 124, 80, 65, 131, -67, 31, 127, -74, -76, 54, -240, -119, 170, 105, -144, -97, -52, 58, -64, -1, -45, 79, -50, 7, 314, -162, -106, 165, -29, 140, -154, -156, -205, 24, -104, -410, 13, 80, -42, -48, 2, 189, 32, -61, -41, -235, -201, -64, -21, 22, -157, 81, 160, 196, 26, -133, 123, 109, 215, -38, 217, -33, -116, -175, 83, 241, 42, 18, 298, 109, 91, -199, -119, -72, 38, -26, 143, 204, 70, 170, -100, -26, 43, -1, 93, -30, -92, 145, 229, 172, -4, -15, 49, -19, -61, -5, 52, -298, 152, 34, 158, -62, 53, 8, 303, -31, -277, -168, 59, 45, 30, 46, -143, 29, -15, 236, 145, 222, -135, -359, -212, -72, 88, -66, 76, -38, 56, -122, -120, -272, 138, -75, -179, -4, 25, 161, 245, -21, -289, -3, -73, -44, -277, -12, 81, 231, -76, -69, -82, 202, 79, 43, -59, -39]
4478c9j17K59j13J94r6k18K19n9k01m9K61k45M04k14J01l5j21k7R2J18KJ94l18
4501hm9J17J52q2k64J08L5J23j3o2r4j23R2M7OQ6L18k52j08j51J92j16j06L98
4525B46k77Q4L0m6K94k40qJ26l37J96K10j63k26j5k4J74qK1k12L52j87m8K2J4
4549b2J31l14L09l87M14r8L1q7J15j83LL28r8lj22l07K84L0q6jR0Rj00r6O1J05
4575FL21m78j1L4J14N4k13J88j06K04M4j9O3j64o2o4mO5N0Rq8j19K10k46O1k92
4601d43M16k19K52J28l35K34k4Q5j46K9K46k58J80j80k79J65J20j33J24J03P8
4622A43j69M7J65l31k0K44l9o4J53j38n2J61k4l7kj21K65j88j79K56Jj06J23j38
4646e0L7J19K8j96N7J55q7k66m4J47K36j99j45K38K0n6P3J6j08j36K1K26j48j02
$$ y = [-39, -156, 103, -10, 184, 88, -130, 89, 30, -171, -220, 41, -204, 200, -14, 87, 52, -69, -96, -4, 114, 116, 310, -8, -57, 60, 212, 130, -134, -26, 9, 132, 119, 57, -37, -160, -68, -21, -15, 71, 389, 137, 29, -122, 70, -46, -152, 246, -31, 53, 83, 37, 331, 91, 83, 209, -128, 68, 278, 115, -111, -126, -150, 24, 16, 37, -175, 177, -10, -58, -36, -22, 109, -205, 104, -283, 131, 33, 64, -23, 92, -91, -88, 240, 142, 139, 17, -290, -6, 24, -62, -63, 27, 36, -64, -160, -99, 6, 327, -151, -162, -128, -14, 40, -173, 15, -91, 113, 157, 138, 201, 37, -25, -89, -93, -28, 22, 31, -57, -176, 34, -212, -151, -443, -27, -246, 6, 134, -201, 33, 9, 94, -52, -23, 223, -35, 145, -35, -314, -149, -29, -162, -38, 65, 143, -26, 21, 186, -145, -165, 79, 40, -24, 129, -9, -61, 100, 76, 39, 37, -84, 181, -7, -186, 70, 71, -35, 88, -50, -13, 106, 134, -62, -5, 150, 63, -203, -247, -100, 136, -63, -208, 30, 50, -6, 67, 83, -25, -161, -140, 86, -62, -164]
4670a64M72j94k9k3jM2k53K7Q8Q7r4K96l78K78n6j49R0j20P1L4K7k26K09l2m1
4695c9J28o4p7P1j29M14l04o6l8L0O2op6o9K4K0KK09k57K47K7k33K25q8K59k57
4721A5O5k0o0k44K22j04M02k75j57K69q3j12L23l05Q4K6p9n3K17p4n0P5QJ27o7
4746A50J05k17r0p8K6J6P2Mj51J47%kN7j27Q4j7J2J84J7j27k0l33L65J17l10L1
4772h5j54M36k3j72j01k9J79k59q2N00m7k45j5q5J45J4K15n2k37K68k56K70k97
4795a12o4nJ55J13j00N2J72j3m08N3M37j69l8p4O4j82O0k36J3M88m47K83P2j18
4819dn5j88J05J41J39M1m70J92QJ24k04R3K51O1k23J82J07n89K47r6K94r4l4K22
4843B50q4j61O5K78k98P4k21j57J93J91l17M36mq0l40L35j5j04k69J2K61K11k84
$$ y = [-164, 308, 114, 85, 62, 61, 103, -150, -123, -35, 52, -42, 254, -124, 154, 98, -51, 39, -81, -10, 24, 51, -175, 34, 2, -39, 89, 25, -52, 19, -110, 304, 0, -66, -104, -74, -12, -18, -94, -163, -139, -119, -117, 92, -165, 82, 109, -124, 101, 13, 272, 15, 80, 60, 0, -244, -22, -126, 276, 1, -156, 113, 30, -82, 241, -64, 20, 46, -33, -86, 131, 57, 7, 82, 90, 217, 150, 255, 38, -52, -130, -104, -88, -16, -12, -163, -16, -16, -18, 39, -88, -4, -21, -9, 175, 192, 65, 45, -288, 77, 194, -116, -85, -239, 197, 174, 2, -99, -128, 51, -208, -290, 210, 163, -82, -97, -182, -37, -23, 192, 140, -97, 171, -85, 185, -112, -176, -181, -26, 87, -13, 39, 211, 198, -210, -157, 280, 111, 73, -1, 63, -119, -59, -295, -282, 206, -241, 42, 114, -4, -59, -247, -142, -1, 138, 179, -291, -99, -91, 33, -171, -78, 173, 234, 11, 193, 300, -289, -42, -138, 156, 62, 28, 250, 166, 5, 70, 348, 50, 124, -97, -254, -61, 130, -187, 249, 245, 165, -175, 160, 145, 41, -228, -216, 45, 256, -28]
4866b8r2K31mk18k02O04l00m4J92k12K60l94K57N6j49m4k01M22k10K71k12nm7
4889f9n0K70o8j93J31j62J06J21j92J20j34M7K9J93k01K93l34r6K27K7K9j52J84
4912A26k09K13P7R8n32J94J84j05l72L83k2k00M00j83J26q4j19O0j96n6M18r2
4934A09l00K80p2r8L42k40J20o1OJ2l25J93J80o5j64q6K95K63m30J9J89j08r1
4957c2J83j37k8j01J14k62M05nk00r1P3O7J47L3l54K5M39k68O6j4l65J96j23J39
4981i3kP3q9k28N10Q7j96j70K86r2k72J40l3K99j70Q9o1J13k88M06l53k68K98
5004a4j26L9J15J35j05j28MK91k56K0j50M2K01j6j92p6J75l2j8j25L64m2k25J41
5028B2l9j42R2J36k95L40l83K39n3K3n7J3K77k46J85j23J46k80J98Q0o8N7j58
$$ y = [-28, -120, 111, 107, -111, -313, 291, -9, -53, 139, -73, 187, -207, 50, 106, -43, -87, -288, 134, -76, 195, -17, -22, -69, -119, 151, 83, -110, 21, -141, -35, 86, -106, 14, -120, -73, -44, 149, -52, 241, -93, -189, 38, 65, 94, -58, 126, -83, 130, 207, 305, -227, -33, 151, 46, -326, 57, 35, -165, 235, 52, 178, 94, -25, 35, -161, -217, 201, 109, -191, 89, 17, -81, 261, 21, 141, 80, 86, 98, -227, -34, 146, 81, -83, -169, 126, 389, -41, -22, 167, 59, -32, 151, 14, -14, -115, -1, -263, 142, 137, -63, -154, -81, -14, 133, 166, -188, -163, 276, 8, 74, 60, -305, -109, -232, -93, -95, -22, -111, -339, 171, 258, 62, -108, 178, 86, -186, -46, -79, 220, 50, 139, 78, 191, -97, 309, -44, -312, -14, -140, -101, 14, 149, 44, -84, -80, 211, -45, -25, -175, -133, 68, 52, -140, -216, -41, -73, -91, -216, 148, 106, -119, 22, -17, -159, -67, 69, -226, 114, -269, -30, -83, -60, -117, -104, 173, -73, 112, -11, 135, -145, 53, 133, 65, 122, -36]
5051c6j31r3J95R1Q1j35M0j64J37nO3R9k25r6J63J98l44o4K75J37j94l90K22j42
5075c18J82L7M6PL4k00J24K06K0k97JM38o49O16k59J3q7j89J08K19O6l26k8L10
5099G4J03l59J62R4J9J44l04l6j56K00K58j89K7j36j23N02k28L6n9O6j2j16J35
5122A02j44pO2q5k2K5J46j73l2J33L24m28k08K69K21l19K90j53l7o6k18L33k9
5145a6j7J97jj40q5K53l26K25o3k1L1l83K35J89M5j17k5J10j28j83J88J89k92
5168a35K07l94N52k30j69K24j81K11m9r0l7J89j03J65q0qj96J53J59k55m9J92
5190G6m8k73K43K22J9j59J6K4L6k99K52Qk30M0J47k02k36L36L5J02j90R0P3j37
5214e5Q0j47j24K85J07j38K9o8N8j35J24J37l5l20J86L6K47l86R9J08k52K65k10
$$ y = [-36, -167, -260, -65, 26, 107, -28, 12, -152, -15, -20, 43, 142, -83, -179, -16, 182, -162, -226, 49, 186, -8, -398, -176, -318, -136, -99, -53, -46, -12, -212, -88, 118, 138, -159, -158, 280, -369, 247, -12, 1, -86, -275, -167, 52, 118, -208, -236, 74, 177, -182, -20, 74, 93, 237, -67, -103, -259, -59, 199, 10, 37, -99, -222, 280, 52, 88, 29, 95, 83, -33, 102, -42, -49, 13, -72, -94, -69, 77, -96, -128, 5, 329, -99, -307, -38, 183, -136, 154, 1, -36, -102, -320, 13, -16, -33, 164, 163, 23, -62, 191, -135, 90, 27, 6, 37, -346, -111, 78, 123, 6, -19, 91, -37, -220, -32, 157, -135, 72, -322, 230, 0, -169, 55, -126, 85, 36, -54, -91, 98, -5, 160, 80, 72, -124, 29, 188, -67, -116, 76, 28, -245, -2, 220, 239, 80, 96, 120, 156, -143, 109, 117, -113, -73, 74, -128, -364, -28, 7, 109, -81, 9, 82, -55, 25, -122, -246, 39, 146, 8, 37, -31, 27, -108, 16, 153, 118, -202, -16, 20, 267, -119, -20, 88, -164, 101, -109]
5237a09J72j05L18j97j56M0J88J9k61K66j33q5k08L99r1l90N53l89J79j19o5N0
5259a24K69l07J05j18J44nM6Q5l26L26R6j99Q3j38k0J93L2j15j72K70K7k25o5
5282a38K89j82k9J08M5k45P7p0J80L8n1q3j80L80J11k17J3L21l76r7M64m25J09
5305D2PK80l65k8j1J55r1K04l82K09l4j85QJ41l5k2P4J38j92L57l31J24j26j21
5329a84K75k09p8J95K0K9Mk25L54k64R6m5O7n2M80o02R1O7r2R3k42K63j11rk6
5354a05K27K80l76Q8k6J51m65L03k16L80l65K8L88m62P3J35j79M22k20l1J47k71
5376i4J53r5%L64m46j85M19L5k37K11j75k45K67J4npJ0j55k2J10J77p8n5K55k26
5401a0M3np8j42J27J67J15l39J88o7K07k15j8j20J09O3l33K94j39J55r5PK88j39
$$ y = [-109, 63, -42, 276, 79, -77, -37, 151, 170, -91, 175, 42, -43, -251, 148, 57, -333, 220, -169, 10, -109, -174, -124, 145, -162, -57, -175, -31, -36, 10, 95, -231, 95, 191, -8, 75, -63, -83, 110, 142, 27, -145, 125, 152, -73, -138, 151, -31, -60, 48, 93, -152, -75, -145, 35, 73, 22, -61, -241, 139, 250, 33, 46, 367, -9, -106, 358, -67, 42, 49, 329, -36, -64, -75, 80, -11, 193, -189, 20, -14, -199, -191, -50, -85, -107, -33, 105, -87, 270, -61, 63, -63, -184, 91, -118, -196, -1, 19, 48, 52, -173, 181, -83, 13, -32, 35, -17, 463, -139, -48, 19, -73, 20, -222, 41, -70, -79, -105, 122, 402, 26, 114, 88, 239, -226, 77, -139, 241, -124, -96, 292, -170, -97, 38, -141, 281, 61, 30, 177, -94, 59, -36, -36, 328, -118, -303, 116, 151, -86, 125, -50, -295, -28, -14, -19, -26, -16, -171, -193, -83, 94, 16, -39, 216, -10, 33, 28, -50, -192, -65, 102, 217, -122, 66, -1, 206, -9, -27, -147, -38, 25, -308, -14, -153, 2, -93, -86, 202, 63]
5425F3J85n00K50M1J88k36j56k2K20J5k01J34p8J87m1K29m00M55k60M2O6j9lk95
5449a36O9M05m35O6j08m8K15j98K48M2k73N11k69j31J58k02J55r8J72k28K04j70
5471e1l2K97l10L06j94J21J98k26k61P5k03J0K47K46j60K01j49j09J9o0K97k71
5493iK9J20j36m2J81k54m8L57k34j37R5J06k24J65J4R9j43K33k92J44n0j17J07
5516c6K59k47o5N7j39N78l40p6M4j69J11J92Pj44j31L36l12k06J98L5J71Q3l64
5539a58J13OL14j1k94K8p3P2J14k05Q1M5P1l84K56no2K8O5K41j84k5Q8k09l5J45
5565B2m8j14j29L16k99L44j44p3Rq4L59j6J4M8k93J94k86kj13N35k19J1q5L0K46
5590B23k76O7J7l15K85J94j98j32L3l2K6J76N2k24j00K48j07j2J96M6m2l15L44
$$ y = [63, 248, -252, -2, 39, 227, -9, -165, -187, 33, 48, -153, -19, -97, 90, 49, 278, -122, 333, 73, 115, 181, 162, 159, -136, -67, 338, -97, -31, -139, -187, 28, -170, 78, 120, -153, 358, 89, -42, 116, -86, 69, -29, 143, -85, 119, -51, -83, 214, -96, 210, 16, 137, 335, 109, -152, -77, -280, -270, -23, 223, 63, 264, 115, 6, 25, -35, 262, -9, 20, 140, 4, -38, 143, -111, -159, 198, -36, -173, -78, 28, -196, -31, -17, 82, -61, 172, -120, 24, -26, -143, -36, 223, -24, -89, -32, -171, 407, 67, -9, 35, -134, -23, 169, 176, 32, -99, 237, -75, -281, -83, -48, 123, 206, -158, -45, -39, 275, 264, -30, -2, -75, -3, 111, -94, -13, 32, 103, -281, -25, -30, -92, -64, 1, 242, 58, 33, 121, -88, -123, 22, -26, -140, -269, 47, -252, 92, -52, -125, -116, -200, 159, 143, 157, 205, -88, 106, -180, -182, -295, 240, 21, 32, -53, -23, 223, -53, 14, 31, -284, 1, 195, -3, -135, -102, -134, -108, 68, 120, -104, -204, 44, -63, -75, 121, 167, 125, -190, 154]
5613A54j2l49J81rj08K8rJ16K93l95P7P6P7j85m37N07K70j59j46J60q1Q9J11l63
5637a14K45j45j31K21k07M03k27j86j9J48j61l8K21J08l3k73J19JK95l24q4K00
5659A9N9p6j11J31O5p4q7R9m2j66R7J08Jq7K94j72K28n54M00l2O8Nl3J24q3j40
5685D1j44J24j78m4L9J75j0j4J22j00j84q0J59l2l7L54l79n8J28Q7P9o4K3J49
5709A56l08K33l88K31K19l77J35j7K10P2l31K64k64m2J07K61j90k26K09J12k5
5730D1j53o5J82Q0k20k06J83L29r0j45K12rn9j3K20k36mK7m7j0m7M1RK2O0m4j65
5757a07J33j54Q8k22L39j75m0K97k7q1k13J19K8L30j9m9j71Jq6r1K9N6k5J32o7
5782B5o0L92l25j95j50j50O06j30L0o1J25l35J30j8k6o0o3PM09k48P1K08n8k51
$$ y = [154, 142, -207, -26, -35, -143, -115, -124, -8, 285, -110, -33, 43, 120, -65, -502, 5, 275, 116, -30, 130, 49, 138, 249, -114, 131, -14, -145, 76, -131, 272, 45, -141, -160, -12, -173, -211, 10, 118, 85, -188, -69, -68, 227, -97, -181, 19, 78, 2, -109, 22, 87, 13, -74, 25, -17, -183, -86, 22, 23, -64, 230, 58, 286, -268, 132, 100, 168, 173, 140, 264, 181, 41, -103, 21, -157, -201, -162, 13, 3, -11, 111, 11, -173, -253, -94, -126, -163, 191, -188, -246, -118, -31, 48, -16, 7, 156, -152, 81, -307, -76, 143, -234, -99, -116, 94, 166, -165, 99, -165, -207, -100, 161, -29, -255, -46, 66, 41, -112, -177, 5, 85, -135, -341, -158, 171, 81, -64, 148, 139, 80, 67, 287, 51, 47, 74, 27, 17, -30, 11, 20, 42, 102, 58, -107, 26, -128, -40, -262, 77, -98, -138, 159, 132, 51, -162, -43, -15, 315, 296, 247, 76, 77, -9, -100, -71, -15, -40, 92, 25, -35, 357, 32, -163, -313, -463, 143, 13, 43, -18, 107, -228, -98, -116, -142, -202, -265, -258, 151, -97, -26, 182, 124, -127]
5806a27K08O3j37M4j93J35J2K68j92N6j66L7R5k48J16J62j22P1l2O3q1k27N06
5829C11l73K16k27N5K4K24j87m8nQ6J31j33L3j67J72R2k41j7P2j05l10N71l36
5852a62L74k7l96K75K3o7k10J01J02K80j77k74K91l18J72O6o8J15k0j13j13K94
5874A48k13J66q1k34K95J3q6J28k94K86m39L42KP6l1J14j62K3o4N0M2J48j82j16
5898f9N6K37k09J3O7n4O1j11K41j79o6J44l32K15k8P3j51J31P7k22J11r5Q9P7
5922G6l09M82j22kl60K65j36K49J77m06J66k7o8p5j50O9J57J71k14R2J47l7j39
5945FK8K6mK7l48L22K30l38K74k11k42L54l5j01J73k39J23q3j18L45k71M1jK01
5969A59R8m02K80n5l5j25K42j56J42r0J76Q5n10M27k6k09n5mK97l19J09q3J92
$$ y = [-127, 81, 144, 7, 51, -142, -7, 5, 273, 81, 137, -29, 8, 103, -145, -29, 133, 11, 82, 50, 113, 32, -195, 311, -62, 154, -73, -18, 6, 230, 43, -5, -10, 76, 207, 74, 107, -60, 112, 204, -37, -54, 18, -87, -397, 174, -162, 212, 185, -211, 64, 87, 20, -190, -89, 13, 293, 116, -158, 133, -185, -13, 53, -15, 100, 80, -33, -146, 148, -65, 101, 20, -214, 81, 94, 8, 136, -158, 128, -311, 31, 33, 109, 78, 192, 30, 53, -11, 39, 81, 229, 47, -69, -13, 224, 15, 28, 95, 41, 102, -9, 232, 53, -13, 131, -201, 14, -14, 59, -92, 39, 116, -106, 5, -90, -1, 76, -233, 249, 127, 125, -235, 30, -106, 143, 320, -86, 80, 53, -15, -90, -240, -171, -14, 157, -57, 35, 182, 145, 6, 34, 60, 56, 83, -265, 57, 287, -51, 223, 12, -230, 124, 89, -12, 161, -78, 45, -38, -156, 189, -82, -41, -42, 159, 257, -145, 135, 80, 45, -80, 162, 6, 148, 58, 234, 319, -191, 236, 210, 1, -54, -58, 239, -80, 29, -54, 138]
5992A38j54K0O8o9p1k4K54k95M5L15r8Kl22q7J51J52j49nK29j41J31J52j68J86
6016B60p2k03q2j0J62rk05K75l0j72P6J36K2k81K82j76J80k07L4n3K23k14o3O7
6040f0K59M1l29j38l8J64J89k59J22K89j85rL1K8k11J84mj25k20J22K7N5N2L18
6064C03k86r6j26O6J06j11J87j63K65m7j39J44k59K74r4Q6q4R5j35k51K14P9q6
6087e8J57M1l08J06M14m77K38j89j67M14j15k01j1K73j80J61K05k85j23L72l75
6108a08N3PJ14k16k23N92j19k21K09J63l45O7q3j64L13k5N2J38k30J10J19q3q
6131A12j10j79J67n6J07j73j82N74m80L65j97J3J77o8m9l75L04K18k53j71j3L41
6153G2j86j86J68k0K39q7K22j00j97k32J65J09L28k48k81M7K66k51k41N41j44
$$ y = [138, -16, 4, 72, 3, -68, -92, 162, -133, -88, 227, 129, 131, -191, -278, -127, 25, -124, -129, 100, -41, 90, 242, 74, 260, 188, -15, -97, -107, 55, 46, -159, 116, 86, -86, -10, 126, 148, -133, 149, -27, 153, -54, -20, -73, 150, -64, -127, -60, 199, 240, -89, -227, -265, -101, 88, -171, -49, 240, 55, 46, 77, 105, -106, 78, 74, -51, -271, -149, -122, -67, -15, 303, 17, -79, -205, -139, -33, -144, 43, -120, 145, 98, -41, 103, -156, 118, 24, 110, 26, 121, -14, -265, -51, 28, -58, 99, 140, -168, -62, 352, -125, 113, -76, -243, 171, 56, -145, -156, 117, -63, 98, 303, 18, -105, 267, -108, -55, -48, 66, -150, -373, 219, 100, -121, 88, 251, -94, -27, -110, -274, 39, 14, 66, 204, -26, 84, 203, 120, 112, 2, -177, -10, -66, 41, -132, -314, 260, -220, 145, -52, -39, 138, 70, 21, -354, -50, 168, -85, -256, -269, 72, -114, -300, -132, -152, 87, 0, 222, 122, -75, -307, -142, -33, 295, 47, -234, -187, 79, -172, -413, 128, -16]
6174a6j95K21k5K5J17p2j11P5j14R3K20m36J14j5K03k01J62J97m60L01K7n5j15
6197f0j51K62O6k08r0J56j8l12M48k38J14J26l7k58L26j76j51L31j55L54l50j65
6219a86p7K67OK71k43J68l60K61N0m3P5l25J93k30K14O5j99O8k43M71k30q9K29
6242A13k58K20p9R5r7o1j90K66q5j6l06J32L44%l24M11M8p3N0l6O1l63o0J5M3
6267a50J95m5K70k41j83J01O6N8l10K63j82L59k35K7l5k00K95q3J74k27J51k3
6289D5j91R8nP8LJ05k55K31j04l34L98j26NK50O0m08O0J65N8nR5l17K49k6J03
6314B32k70R9J27j21J7l09L93j93J40J71m62J74J14k35J98j31j44L10nK2n3R7
6336A71j5k82J78n9j12k70K56j38M68k39P9j86K5J03K0Q0lk86N13O5n73J33J00
$$ y = [-16, -211, 10, -15, 10, 127, 55, -56, 19, -95, -2, 218, -218, -104, -119, 84, -117, 45, 242, -218, 83, 110, 55, -60, -211, 51, 117, -91, -181, -25, -43, -355, 93, -145, -31, 95, 58, -200, 126, -50, -201, 130, -25, 329, -21, -186, -263, 4, 10, 281, 38, 206, -154, 107, 157, 114, 189, -136, 57, -173, 41, 106, -93, -25, -268, 203, -27, -116, 113, -145, 75, -4, 91, -6, -67, -257, 9, -76, -92, -398, -266, 78, 78, -246, 165, 213, 140, 190, 154, 215, -148, -208, -193, -150, 45, 0, 270, 29, -154, -53, 13, 71, -239, 24, -158, 201, -34, -7, -42, -242, 53, -30, 144, -83, 68, 45, -146, -48, -53, 25, 28, 133, -122, 109, 5, -329, 69, -57, -52, 198, 258, -150, -90, 75, 133, 128, 223, -94, 155, 129, 232, -38, 61, 188, 67, 84, -225, 168, -25, 115, 286, -176, -2, 112, -123, 75, -56, -200, 110, 105, 127, 74, 171, 156, -126, 52, -7, -119, -389, -133, -271, 197, -42, 37, -149, -124, -21, -1, 79, 76, -210, 303, 368, -205, -72, 28]
6359B8J10j33J73k84J40k96L51j60J25J8k92J79M7J21j3k81K07p9j10O6Q2J46
6381A45n8j77L3j55K65K2n9J30oj89M24m20k5J87m5j73J18Q4j79j29K10J08j89
6404g8K22O9l80N8M00m5j12k36j40L49L1l12M61m95L09p9j74P9Q5M6r2q2k1J80
6428D3j36J71%j42N3l0q9J31l3L34j43j60Q6K0k10j56K22J84l8M2m26M26l65L35
6452A19j03j33L4J64P5l80K35J2J61l20L1J48k3J26J01k17k20J19l9J72k8K4j0
6475D8q3P7j04L17k49q7m7L6J09K4l0n0O7m5J0Q9j24J32j55K27k52K54K5j20j01
6500c2k8j26j44J94%K45j49j1J80j41k12K35L24l36%n5K10q4r0j10J98r8Jl4J8
6525d5Q7k09LJ12r1J49J12j1Rm3L8k73QJ67R3j84K49l16k9J64l9j68lJ03j2K9
$$ y = [28, 138, 5, 178, -106, 34, -262, 89, -71, 54, 72, -220, -41, 6, 127, 114, -167, 40, -39, -149, -83, -1, 145, 87, -90, -57, -212, 53, 75, 16, 146, 140, -49, 375, -45, -70, 117, 72, -101, 17, 101, -78, -207, 3, 111, -78, 144, 213, -167, -109, 291, 246, 134, -102, -242, 107, 138, -174, 287, -208, 101, 22, -152, -73, 12, 58, -34, -116, -137, 43, -93, 78, 78, -64, -11, -41, -130, 1, -32, 302, 159, -1, 85, 105, -105, -261, -39, 145, 107, 149, -277, 149, -216, 119, 16, -117, -83, 81, 156, -224, 11, 23, 184, -136, -105, 43, 20, 146, 247, 30, -190, -71, -110, 62, 34, 58, 48, -35, 42, -62, 255, 6, -81, -128, -92, 17, 41, 11, -39, 28, -17, -7, 82, -42, 90, -65, 162, -90, 164, 189, 69, -32, -60, -186, -330, -136, -136, 109, -40, -51, 129, -12, -224, 11, 335, -1, -1, -56, 154, 70, -20, -130, 68, -30, -29, -63, -45, 42, -167, -164, -52, -143, 6, 118, 107, 116, 73, 111, -162, -154, 13, 106, -78, 171, -145, -174, -10, -49, -217, -220, -117, -129, -100]
6551a00j3L40j17l42K49J88l19J39N8j7J1j81m1J09k03K15j73K31j23j6L79j95
6573G9K21l21j20M4J43r0m2M6N5L33m90nQ9R6ll0J15k59J6J5N4N7N2j10R4m0l8
6600c9K91m09M06k53J54q4j70n0L31K2k55l8K26m25L94j91oJ9j62J33K18J39m00
6623a49J43J49j40p7J07m8R2r3K5Mmj10L05j23L6j09q1M06k95m1J74k27j03J88
6647B9N8j65N8k3J60j6L6j37m0pJ93k62o2l2K65l5j55P9J52k43J71j04k30L92
6671H2R0l0j93p2L20k55J70m04L17j33J97j14j32j52N43m42J18L51k07j41o2J48
6693aj34K02m74K31L58m29K64k12J85J11k28K89k36L8n6j66K38R7J57l15KM5J98
6716A64j64K03j72J78l79L95K96n54l0Q8Jn8j4K48j36k72J92N6j04J87J46r3j3
$$ y = [-100, -113, 227, 110, -232, 17, 205, -114, 25, 83, 66, 77, -104, -145, -36, -239, -24, -197, 34, -89, -105, 274, 79, 300, -21, -141, -97, 46, -44, -86, -40, 15, 348, -142, -147, -58, 38, 35, 5, 120, -139, -123, -108, -54, 3, 55, -55, 39, -1, -39, 252, -157, 249, -4, 150, 66, -104, -154, 177, 199, -56, -94, 132, -293, 101, -90, -96, -77, -239, -106, 112, 251, -149, -6, 143, 3, -74, 33, -15, 77, -16, 9, 13, 9, -101, 204, 81, 117, 8, -73, 333, 38, -3, 171, -56, -159, 29, 87, -78, -20, -43, 117, 101, 137, 0, -40, -47, 146, -116, -178, -210, 55, 20, -135, -56, 96, -147, 24, -80, -310, 82, 172, 142, -51, -123, 197, -58, 112, -292, 25, -108, 89, -25, -157, -309, 234, -208, -90, 261, 54, -87, -149, -1, -135, 67, -407, -176, 182, -247, 17, -195, -10, 101, -127, 162, -74, -36, -92, -258, -20, 77, 234, -81, -79, -34, 164, 0, 203, 31, 209, -170, 225, 521, -33, -63, 25, 26, -32, -46, 202, 66, -206, -14, 42, -62, 125, 271, 178, 165]
6739A65K7k41l3Q5j4K85k73j19J82j03R2k9l2j63L44k74K77j22lO6l19K3J72M9
6763D2n2k25J81P3k22K88k69K15l7k05K40J8q2j71K35k18K0L44k99J60m0r2J02
6786Fl45M26k8jJ88l62J99Kn8j12J1p1L87k31%J18k19J13k66K84M6j94j33K18
6810b2K20k83K43J2k30m2L0k36M32M8l79J02n3J91l7J17p4M7J2k43P3k3J13J53
6834A71j34Q7J00m44L20j53l7J71k42j38J74M27k25m66O69n19J40R3m7Q0m0j04
6856a17j68J44J33M9l2Q4j59J47K9Q6l24K23l26K41J16l04O9q1L72l49j14L89
6878A08j96M1K54n4k32j1J11K17l09Q2j01j44n9P2M97j84n7p7J95j19n8J33k7
6901H2K6k09Q6j74K44m15L34j12n1J27K3K47j36o7J86m15K37K57k55R1j85k0J00
$$ y = [165, 192, -49, -82, 3, -11, 274, 1, -118, 64, -39, 53, 24, -8, -171, 173, -101, 176, 54, 51, 117, -202, -179, -7, 42, -10, -235, -54, 19, -203, 85, -184, 31, -6, -211, 29, 47, -35, -206, 29, -189, -169, 175, -124, 36, -4, -96, 6, -339, 87, 59, 58, 246, -116, 83, 85, 27, -85, -74, -145, 242, 11, 11, 129, -90, 23, -243, 41, 87, -107, -240, -22, 198, -85, 158, 170, -60, -102, -72, -308, 124, 172, -207, -105, -158, 33, -4, 113, 39, 86, 98, -145, -72, -95, 18, 171, 37, 124, 224, -220, 100, -53, -90, 81, -161, -299, -125, 302, 77, -389, 280, -239, -99, -6, -53, 27, -13, -117, -285, -141, -8, 41, 9, 93, -66, 81, 110, 196, -128, 95, -231, 10, 126, -178, -109, -190, 182, -167, -281, 108, -88, -47, 207, 153, -79, -90, 21, 238, -71, 11, -90, -234, -293, -221, 276, 92, 35, -42, 153, 34, -24, 109, 82, 108, -101, -15, -189, 55, -360, -26, -138, -189, -62, -39, 208, 72, 5, 191, -224, 13, 270, 15, 106, -79, -99, 1]
6924AO3J55l22M1J14k20M36l29j2o2J24m4j5M7o3L57j62m26L88j45J11j90J18
6947c5N6j88J34K9m1q8L40l10J68l09J13o6K25o2J12K59l92K22j96j41K08l4L5
6970C9J01k8k39O3J68j04J25j90K6m0K06j61L7J77k35K33q8k16L01J9k44Rj37
6993a78J10Q0K62l86j49K08J44j98J89p2O0j43J58j53p6K51M4j25j89K43k43L34
7015A71j27k13L23q5J26k26j11J85q5J01o5o2N8K68l04K0J85n8l25J98kN7kLR0
7040A20nj09k20K06m1j62K90K2p8n4j24M4J9Q1o2J44r7j45J1K95k40J89n7k49
7064b22L15q3m0J62j89J83k44L02k23J4Q2j51k9o0L28j91O0p2J5%K49n39K19K01
7088H7j90N4K16l60J75j16L06j01nK22m60N41k82K5k46L0J40o3j86M3K9K2j04
$$ y = [1, 64, 219, -103, -62, 52, -168, 268, -61, -73, -135, -11, -55, -70, -23, -86, 271, 109, -317, 71, -74, 37, -153, -35, 21, -167, -33, -4, -45, -133, 207, -103, 65, -244, -131, -197, 28, -34, 78, 337, -55, 167, -29, -170, 38, 4, 39, 140, 112, -127, -64, 104, 0, 125, -65, -39, -79, 127, -34, 3, 180, -55, 178, 90, -126, 175, 194, -50, -41, -178, -68, 12, 274, -112, -261, -53, 91, -107, 82, 10, 70, -73, 85, -68, -144, 107, 151, 26, -163, 80, -163, 171, 44, -169, 154, 69, 195, -31, -142, 43, -42, 59, -6, -68, -10, 258, -46, -26, 159, 101, -224, -26, -28, 29, 27, 30, 120, 115, 6, -214, -8, -49, -211, 79, 101, 23, -31, -155, -111, -92, -11, -73, 71, -26, -171, -160, 135, -105, 84, 27, -222, 93, 10, -30, 132, -57, 126, -118, 184, -39, -25, 57, -94, -123, -183, 145, -46, 14, -58, -43, -43, 206, -333, -114, 87, -103, -49, 167, -193, -18, -134, 172, 71, 66, 288, -172, 369, 87, 112, -134, -104, 36, -27, -213, -170, -141, -119, -223]
7111b23L39k10K59o4p5k98J67K47j12k94M16P4l25l9L02l5L5m01L00k4op0J48
7134A11k83J14P1p5J05m1k59K14K7j31J11JJ30N5Q7l68K35k86L63r4j95K22N9
7157A73n4k31J86k88J78J49p0l27K90j8N5k91L92l42P1J0P7K25j14Pk73J71j29
7180a53K93J92m11K21J20j17r3rj41L43r5m7J4k6j30J51j55m0j1N2J35P6k49J54
7204G4m5p7j22K39k4l40L70R9j46j05K90j78n0n9J89k12J15r7j3j47K41J45j58
7227a1K13k58J69j00K0j31j2J8K85k65j2j4R7K9J27j75o6R9j39J90j14LQ0N8q1
7252A0L5Q2r8O4l8L43l63k29m5J15O2j15J01J78Kj72K3J52o5k81K04Lj65L12j71
7277e6m2L08j78l13L33j76M1j58L50j07M2j21R5j70j23K38j5k7J22q7Q0m5j54
$$ y = [-223, 116, -94, 165, 101, 26, -272, -105, 142, 30, -264, 152, 226, -99, -138, 164, 129, 164, -237, 63, 39, 33, -37, 111, -172, -58, 13, -62, 43, 2, -257, -43, -16, -147, -36, -35, 95, 150, 237, -131, 104, -182, 181, 87, -108, 114, 173, 119, -112, 74, -214, -36, 113, 43, -284, 6, -12, 43, -248, 144, -198, -127, -117, -40, 185, 71, 78, -195, -24, -153, 140, 332, -79, 142, 262, 145, 52, 43, -98, 245, 150, 103, 117, 91, -39, 112, -43, -83, -94, -42, 93, 169, -80, 74, 29, -48, -170, 69, 45, -295, 75, 174, 28, -77, 213, 35, -15, -74, 115, -97, 18, -79, -92, -239, 2, 147, -11, 202, -56, 113, 13, 33, -98, -110, -92, 193, -72, -84, -98, -1, 28, 155, -20, -86, 13, -126, 64, -50, -47, 33, 91, 10, 45, 127, 29, 93, 55, 398, 35, -194, -239, -124, -62, -177, -76, 102, 104, -68, -45, 107, 42, -239, -35, -32, -197, 115, -56, -98, 210, 32, -281, 52, -124, -83, -241, 109, 2, 44, -77, 18, -152, -275, -37, -52, -79, 43, -44, 36, -9, -163]
7300a63K42m11K71P7r2k8k3K77J74l55O2J3Jj22J21M21m03l82M60mk60K84Kl41
7324a79M96l62k38K35o1M5J05j80O7j0J67J07j85k1r6J39j08L21r6r1R2Q1k22
7347FK7j06K65j34k4K3r0J14l04J24K03o3r6J35j61j28J99K56k43O1q2j03J11
7370a0R7k36Nj61K24k7R5J78m18J60K15q1j07j92L51j87J33j67M4J37j89K70l64
7393b30K44J88k26K6Q0k01KJ31Q6j24P2j53o9P3Q8j55J16M3J31j91R2L5kO3l26
7418b07P5MJ21J19j21r8j1J03p7N6N3J19j49O6Qj77r8L91j90j71K27K78o20M52
7442A53j04J22j12j24R2j0J76p5j77N1J89J31n36J21%k9L05j45j34K23j81k50
7464c14K63J70N3l01J62K0K0k49L03O2m80K83J32j84L22l56K68Q9k87K89k7k32
$$ y = [-163, 79, -332, -61, 16, -76, -104, -127, 150, 324, -31, 31, 44, 45, -77, 44, 465, 62, -320, 140, 136, -124, 160, 162, -179, 317, -45, -283, -48, -109, -64, 41, -139, -72, -82, 85, 192, 7, -14, -110, 29, -79, 242, 146, 55, 147, 228, 6, 33, -73, 192, 58, 34, 57, -33, 81, -223, -99, 104, 41, -55, 80, -81, -209, -10, 246, 3, 64, -18, -121, -10, 87, -149, -144, -305, -81, -108, -13, 165, -253, -93, 122, 41, -66, -258, 93, -94, 39, -128, -84, 53, -136, 134, -230, 14, 202, -24, 2, 82, -119, -117, 14, 100, -24, 48, -105, -174, -101, -13, -168, -52, -9, 122, -69, 23, 58, 56, 119, -207, -132, -128, -7, 112, -9, -107, -118, -15, -92, -36, 17, 136, -13, 53, 61, -116, -214, 177, -13, -184, 43, 321, -299, 153, 49, 171, 59, -65, 27, 17, 193, 118, -59, -8, 181, 312, -224, -103, -103, -132, 173, 28, -106, 117, -64, -314, -51, 119, 172, -129, 33, 53, 73, -176, 127, 189, -291, -8, 124, -60, 262, -94, 174, 263, -24, 265, 238, 6]
7486FJ52M6j91J03J7j54k1J16R7k34Q9L4j38M1J29j86J08k48K12j07N6k9K05k12
7510a09j83K32o0O2j06K60Nk7k64M37k33J5k0k95L13j84J32P6K1j46K35Q2l46
7533a03L13n34N00l32Q1J42K63m33J76j34J2K81m19L99l90K35l4M2j78qQ8j18
7555a51K05r0O8j73M8J38j99P8R4Q3m5Q5j01Q1K7r3M5R3k08O9O4j06j35Q2L8P0
7581F7m1M2j21j84K11j32r6K86J18k52L00l86J82m6m6J29K6J54l60P6L9J65k62
7604a31J59J22k4k26O1J86k45m7p3K92R7q8J12j18j22K4Q4j29K37r7k37M54k35
7627E6j87K26j01J18k1J1k15K7K88k23J21l6q1j17L05j56P6r9l35L78k44J82j6
7650d3J25j55m0P4kJ28o8j43K38k16r5P9J47k31K4J10L18o51M94o1q5j08K01J72
$$ y = [6, 158, 204, 13, 116, 133, -21, -42, 74, 171, -63, 26, 60, -78, -37, 92, -94, 14, -234, -22, -129, -73, -102, 103, -109, -292, -60, -120, -58, -164, 96, 101, 74, -190, 247, 14, 29, 9, -286, 27, -157, -25, 51, 72, -74, 161, 243, -103, 210, -324, 176, -156, -75, 67, 330, -103, 73, -61, -49, 232, -187, 212, -178, 57, 23, 65, -113, -121, -33, -151, 54, -36, 32, -141, -93, 45, -154, -76, 18, 101, 56, 141, 40, 121, 148, 55, 100, 193, -15, 54, 118, 12, -123, -41, -3, 67, 26, 68, -53, -237, -26, -158, -254, 32, 150, -102, 198, -188, -6, -52, -98, 31, 57, 211, -149, -73, -34, 131, -131, 28, 150, 126, -100, -39, 147, -98, -145, -218, 74, 171, 83, 195, 77, -45, -21, 63, -66, 171, 74, -163, 291, 56, -131, 95, -6, 112, 91, 102, -113, -86, 202, -21, 100, 64, -17, -134, 171, 15, 91, -8, -343, 35, -209, -27, -43, 82, -73, -113, -39, -41, 87, 19, -124, 114, -102, -197, -118, 29, -202, -178, -68, 250, -401, 93, 32, -53, -161, 40, 212]
7674B12l23L39k27J03k79J59K03j93j09K24M7k15j57K93j26j07J96J48j37k1l80
7695c50P39m69J34j71K20k30M1R0j02J29r5K0L8m7J53k6l60L97j32J79m24K19
7717d7o9k2ML06j94j83K08n7K7J59j14n7On3J95J38k49N1N7j63O6J83m6j70j45
7742a69L92j38l0j08O3L77k46k33P6M9k14K33k00K59j74k3J54j5l9J07l9q9O7
7765F0R4j48RJ44l16L5Q8j63K75N8k14L50j92j47J41J29m4k16J0p5n8O6L23l46
7789a37J10L5j15q9J78J98l8j25MP9K2j1j20j2N8K01k30m1q0J31M7O4j60j31O0
7814a02J66k17J16L55k37R7j91j0K27l0j22K05m01K10K28j98p6J47Ol88J65P1
7836B1j86L67pj58Ol7J73r2m5n9K6J04j66K25k57p6J42q9kM13l41Q8j52L7K40
$$ y = [212, -111, 228, 1, 104, -175, -16, 187, -6, -115, 109, 156, -59, -216, 77, -49, -156, 40, 188, 51, 30, -350, 389, -80, 54, -117, 103, -127, -86, 4, -98, 31, -64, -44, -6, -53, 100, 74, -286, 111, -21, 158, -266, -47, -116, -138, -134, 172, -22, -205, 3, -54, -27, 132, 18, -39, -33, -86, 109, 247, -2, 49, 106, -57, 9, 192, 146, -24, -169, 223, 85, 55, -53, 10, 387, 141, -92, -16, 33, -181, 52, -148, 111, -63, -86, 68, 53, 14, 121, 82, -7, 60, 154, 6, 15, 159, -157, -122, -34, -197, 78, 136, -78, 272, 80, -67, 74, 203, 159, -57, -47, -122, -180, -114, 209, -137, -27, 8, -107, -196, -18, 180, 142, 17, 21, 100, 122, 111, -9, -21, 37, 238, 8, -33, -113, 18, 65, 129, -31, -162, -102, 64, -153, -37, 318, 81, 178, -13, -23, 204, 174, 52, 257, -144, 66, 294, 96, 20, 167, 173, -215, -50, 21, -165, 202, 195, 37, 43, 6, 179, 87, 42, -17, 9, 113, -53, 172, -85, -161, -19, -108, -110, 303, -38, 50, -102, -65, 175]
7861A75j24J17O3l33J8J45k54O6J14j47J96l62K73J94j68K9r2J15L0Q0j24O0j2
7884E9jl0j07j63L57J18j32j98K20j90J03N5k72q6M78k62K6j18K27K40l36j7j36
7907a65q1M05j12n1p8P4Q6p1j51M32l49M1J11j16j87L26M7k99L4K48j60r5K71
7930A60N2r2k11K97k40N6p7J34j61K03j89j0M6k27L05P5L2J14j53k11J68J32n0
7953A53j58K23j51p3J03j16J71k31J26k14N6K20o2K4q7K46k03L7j01K5J92k88
7975a08J60o8p8p3k8L86j71K43o60L54N4j02m6J78R9l14L70L9k31J09j57J83p8
7998F1l09K12J64j27K4M7k41L20k87K38j75J33j23J03R0j99K34l56K21J13p6P9
8020A46n2J43J3m88K07K59l42o3Q5J32Rj45P7j44J17M2r0J50m7k03K05j45K19
$$ y = [175, 51, 168, 231, -102, -84, 61, -193, -127, -13, -160, 36, -326, -53, 141, -27, 2, -90, 25, 55, 135, 11, 71, 59, 58, 28, -79, -242, 115, 233, 101, -97, 123, -67, 36, 91, -181, -267, 211, -51, -25, -143, 84, 324, -12, -29, -165, -246, 159, 47, -4, -82, -8, 78, 7, -144, 288, -61, -20, 91, -25, -212, 114, 161, -138, -104, 144, -16, -111, 160, 212, 120, -91, 206, -34, 22, -55, 79, -82, 121, -68, -78, -32, -259, 46, 121, 153, 267, 114, -97, 71, 203, 153, -5, 218, 67, -6, 97, -19, 152, -79, 47, -167, -111, 109, 47, 71, -16, 230, 27, 64, -37, -12, 180, -108, 52, -16, -94, -167, -195, 191, 20, 263, -397, -43, 11, -91, -137, 41, 140, -174, 196, 235, 4, 113, -44, 139, 61, -248, -36, 128, 1, 25, 72, -169, 151, -136, 102, -73, 60, -63, 40, 130, -69, 165, -191, 30, 143, 67, 146, 94, 237, 250, -238, -31, 228, -114, -177, -92, 40, 49, -96, -19, -163, -46, -4, -94, 56, 9, -194, 11, -134, 85]
8043H5M0J32k74n6Q1k52J01K02l64J17L65k75K43%j61M15m89J65N6Q2j44J4m76
8066c93O94j74pj6l40L29j53j49K98k1j10J49j18q9%K02r0n5J8N2n06L85m3NK72
8091A40k32K72q9n28N97k84K07J24l01J03R5m2k37L06o8l4j79K35k6j49J42l24
8113b72R3L77o9j83Q9Q9J3k65j01L18m5R5j29n3j22j04J83K30k84J11J52J85l13
8136ej23J39L3n3k91O24m98k2K55L4J1J47l43Q5L37m68J50K66j59j05L6j10J03
8159D3R8j94J27P3k44J8Q4r8M6j07K9J13k37M29J8k07r3m4M32M3m30j65J89j57
8183b34K4K74J13k62N8R9J76m7
$$ y = [85, 125, 257, -17, -73, 8, -244, -143, 59, -305, -188, 177, -98, 145, 145, -16, 399, -90, 75, 131, 213, 69, 83, -393, 301, 127, 120, 104, -236, 93, -60, -209, 89, 68, -42, 107, -11, -100, -100, 102, 12, -43, -25, 27, -479, -94, -137, -132, 140, -92, 180, 91, -437, 160, -124, 83, 207, -94, 9, 104, 62, -175, 131, 63, 29, -150, 85, 59, -90, 52, -272, -179, 198, 129, -54, 35, 124, 137, -128, -229, 89, 44, 139, 10, -43, -165, -269, -86, 144, -140, -29, 123, 308, -5, -128, 11, 44, -9, -300, 324, -174, -196, 59, 93, 104, 251, -92, -7, 330, -138, 12, 278, 119, 14, 50, -60, 43, 141, -53, 74, 147, -97, -79, 5, -93, -47, -154, -125, -12, -249, 180, 198, -9, -102, -146, 286, 329, -101, -266, -77, -234, -210, 64, 177, -85, -27, 72, 248, 201]
8191B01
$$ Imaginary data points
##PAGE= N=2
##DATA TABLE= (X++(I..I)), XYDATA
0@%%%%%%%%%%Pj5J6j6J6k4L2m0N1n9P2q8J04j21J45j73K01k33K69l09L54m05M60
33B44n21N89o64P48q40R37j045J165j297J442j598J768j953K158k380K621k890
50a516L186l509L866m264M709n208N771o415P160q030R065j0322J1882j3878J6541
65I038k0296K6013l5891N7679j94207J06302K53627k92534j9116J55144o941p1995
77c3177P9539k8302j6778Q9650k2064j59682O4396J28871p9212q0197Q8818j3782
89A8080j03799J9078Q8675j6679m4025K3429L7895l3398l1710M2090O0927k434
101E8129m4942l0772K0340M0852j900n5653j4366N8327j6679j21922P566J45418
113D4398O849j08263J5512P9562j3916l2551K9167K1348j1659j2263l1111k6643
$$ y = [0, 0, 0, 0, 0, 0, 0, 0, 0, 0, 0, 7, -8, 8, -8, 8, -16, 16, -24, 27, -32, 40, -48, 56, -65, 80, -93, 108, -125, 144, -165, 189, -216, 244, -277, 312, -352, 396, -444, 493, -552, 613, -684, 758, -840, 928, -1025, 1133, -1247, 1374, -1516, 1670, -1839, 2027, -2237, 2472, -2736, 3035, -3380, 3780, -4250, 4815, -5507, 6375, -7503, 9038, -11258, 14755, -21136, 36543, -157664, -51362, 202265, -90269, -109385, 45759, 38818, -33177, 46362, 18060, 1282, 90932, 68868, -90814, -26418, 102453, 23241, -56956, 31862, 18080, -85719, -66641, 22034, 5355, -38670, -15241, 22654, -10744, -42454, -364, 60563, 58129, 13187, -17585, 2755, 43607, 41707, -13946, -28312, 30015, 13336, -108586, -101020, 44398, 51247, -57016, -41504, 38058, 24142, -8409, 20758, 42106, 30447, 18184, -12927, -39570]
125c9570M5903M1134m8672l0505L6238p988m6291K3009N2530j6736l8870K1883
137g935K3765k9150L728N2906p36m0333p355J673j090K0064L82l5119J845L1941
151A4586l6198m5892O3648N9512n9286l6044N2234J2216k7089J5291J8541j4824
163A6695r169j1200k5947R872L9674j2066l6346J7801J5973k9005N633L9598L75
176B1888k3481l271Q491Q47j866R892J1316j0693j9785j0340M478J3021K557j3060
190a0006p083Q686M140j4379K948M1527J0304m3918m868L5861o095k1694J7396
203A2819R688k4795j4963L407l384M397J8175r458k0325J9057J2579k0659J4091
216F29L4199j6266k9449J3774J5258j6229n503J9827k233k5076l600M601j542
$$ y = [-39570, 6333, 47467, -1205, -31710, 4528, -3460, -49751, -26742, 25788, 9052, -29818, -7935, 15830, -13320, -9592, 43314, 42578, 2245, -5110, -3437, -4527, 15537, 15919, -19200, -17355, 14586, -21612, -67504, -3856, 55656, -3630, -39674, 12560, 24776, -2313, 12978, 31519, 16695, 7526, -3674, -29621, -19749, 19925, 7859, -28487, -10686, 5287, -23718, -18085, 21513, 21888, -1593, -4864, 3627, 4474, 2608, 12500, 23816, 13123, -6662, -17002, -12524, 497, 3054, -10006, -17089, -8403, -4263, -18642, -15694, 25833, 36137, -7781, -12649, 23212, 17117, -4577, 12819, 22507, -2288, -17251, -13844, -17228, -12831, 5344, -4114, -24439, -5382, 7197, -13462, 629, 34828, 18562, -10887, 2887, 18145, 1916, -3587, 16240, 14007, -11069, -14669, -10068, -11610]
229a1610J0588K538j9292J833J9269o938j3000K5163K7381k3478k5578K4747J5104
242B6727k5953l098J7894j0613k1166j418M279L000O781J295j1155L156J7283
255G012n888q933K6051J1316k8568j0319K0484K879j7734Q5J4178p179j8519J708
269a3427Q206K152M634o450j0014J1825Q720j3362J70K6203M449k8179l758K7874
283A9043k628k5025Q764J3390j7220j3792N855O633J967O88l956j802J0146N888
297G951j2511L693K3508p735k7919Q037J9292j0599j4216R455R372j1070j0219
310a2961P280P694J763o03r574r2J3715m470j4494J2349J7748j3724j9566J2914
324b021J8131j4213j2610J5074M851j6363l679Q008M104K035l733m397M077P886
$$ y = [-11610, -1022, 1516, -17776, -15943, 3326, -3612, -16612, 8551, 35932, 12454, -13124, 11623, 26727, 774, -2324, 15570, 4957, -16209, -17627, -13348, -10348, -3567, -2272, -13427, -10271, 7012, 1124, -7809, 18242, 29558, 990, -9329, 11155, 14034, -3700, -3615, 10563, 3384, -15135, -13427, -5221, -3069, 1565, -4885, -14899, -3074, 5646, -7716, -7546, 18657, 23106, -5073, -8831, 19043, 16415, -8610, 154, 13544, -3676, -17468, -11613, -4980, -3013, -2325, -6281, -8083, 2063, 7951, -4560, -867, 22641, 14906, -13013, -4976, 14316, 3717, -10499, -1044, 8328, -2742, -12961, -5681, 2013, 3776, 3173, -6401, -6493, 7222, 2752, -11742, 607, 18355, 4631, -14935, -2021, 16110, 1897, -10713, 4361, 9212, -7151, -10830, -2822, 1282, 3317, -416, -4813, -736, 7150]
338G150m246r612J0827J2349j7697j5087J7195Q512j5647m084J3106K752j0792
351e274k003R211M595j172k721o028M126Q378j0847q123J5404N580j8777o691
365a4342J7077N561j5719o95J4443l080j1009M780O144N28J399l228l041M778
379C596L319p470m310J0273J934j7019l052J6134j499j2875N950J0573l505o908
393d859M008O861K92j178k698l844N201K936j2051j141J3895l657j5704L617J3186
408D864l719j0191O736P742p285k873O905K3J89L871m166k618O028n38p666J474
424a224P096n233j1413N354Q354p291l819Q351K503m433n55M095L118J80j524
439C559k817l19L833k452p133M947O914q585o954P598N313o186l146O646J776
$$ y = [7150, 2904, -6708, 4119, 16468, -1229, -16316, 879, 9391, -6256, -10340, 2766, 5518, -5274, -7277, 1934, 6529, 5357, 2636, -3392, 734, 9112, -1735, -9858, 5546, 11126, -7651, -14342, 2735, 8296, -7423, -8118, 6325, 3245, -7764, -2984, 3160, 3688, 5087, 1859, -1182, 3596, 6915, -555, -4865, 5408, 7342, -9677, -12729, 3405, 1906, -10969, -5019, 5554, 2049, -4859, -851, 6010, 6302, 5124, 2426, -1418, 3783, 6719, -5332, -6473, 7422, 3765, -11939, -8322, 4864, 1145, -9046, -2310, 5432, -1853, -4726, 2179, 2202, 2391, 6262, 2096, -522, 5506, 4968, -2698, -1224, 5872, 639, -10774, -5420, 2934, -4357, -8176, 175, 2678, -1755, -2310, 1785, 4903, 5083, 3559, 742, 423, 4256, 1804, -5329, -382, 6532, -2053, -9007, -1409, 3904, -2282, -5428, 1218, 2994]
454B994p020O17N669j227J45K180k839r74M106j053l742K636L352n852o345O797
470e56L319q060R36P704k950n103L487L858k97j385O64j536l62K930k729l473
486c553O592K638j0084k96Q804j149p048K630N721m929m960M830K471l797K249
501A19J364l424J533K796k706N58M270j609o458J609N857k952n842N722L128o787
517b822j631N129Q27j760o11l99N35K84L63j657J461M894k519n981M545N157n211
534F04l561N620J201p190k127O741M01n910K655K594l542J107K325j849K087L157
550D313m139l889N376L950p023k041Q537j675q881K950N900l415k063J321q76
565a655p98J867k90j111L595K449o030o02Q221j153p474L690M557n015n036L505
$$ y = [2994, -4026, -3409, 2260, 1033, 1178, 3358, 519, -455, 3651, 2598, -1144, 1492, 4844, -1008, -7353, -556, 2763, -5297, -4361, 3343, 393, -4710, -1223, 2635, 2338, 953, 1617, 81, -281, 2649, -80, -3553, 3039, 5677, -4407, -4703, 4101, 2952, -4096, -1466, 4255, -674, -5634, -804, 1667, -2130, 119, 1483, -1941, -408, 2388, -318, 240, 4510, 2901, -3557, -1948, 3909, 957, -4885, 837, 3965, -2822, -4453, 676, 1503, -257, -868, -1267, -732, -448, -85, -1742, -281, 4613, 2094, -3887, 658, 5815, 604, -2957, 2663, 3864, -3326, -5453, 1288, 1689, -4221, -1566, 1028, -2514, -1407, 918, -931, 1156, 4313, 174, -3715, 1661, 5611, -1412, -3453, 5084, 3409, -5472, -2522, 3378, -37, -2100, -779, -1655, -2453, -586, -876, -1987, 1608, 4057, -1973, -2575, 5646, 4493, -2981, 709, 5266, 251, -4785, -1280]
581a280L532k725l065K538R69j229J98m75J093L617j819m823K261N767j634n859
597b934K590N904m238n655M255L264l356j296j27j97J718q40j441J184L485j275
613A041m617K644N809l138l777M261K030n007k235L476J806k302k054J800N53
628B90n32j6j265J173K514k556l977L400M294k939l525L929L654m774k016M446
644B100P99k814k12n11p51J914q33k413J963K601k741l455M524L261m327q59M352
661B598q03l348J290J908n32p14m38K56Q5J36l62j538J641Q91l402j147L582J004
679A107k520j060L701J211l862N25M101p66k532Q84l61m95R05q38j768J589J091
696I12k988j337M167O42m350J489M180k817j905L178Q21j437K59L44n64r2M75
$$ y = [-1280, 2252, -473, -3538, -1000, -31, -1260, -1062, -1537, -444, 3173, 1354, -3469, -1208, 4559, 2925, -2934, -344, 5560, 1322, -4333, -78, 3186, -170, -1466, -1593, -1790, -72, -912, -2353, -1169, 2316, 1041, -3576, -932, 4877, 1739, -2038, 2223, 4253, -754, -2989, 487, 2293, -9, -2063, -263, 290, -242, -258, -1523, -350, 2164, -392, -4369, -969, 3325, 386, -3139, 790, 4444, -330, -2346, 2100, 2899, 85, -127, -638, -1389, 525, -308, -2721, -758, 1843, -898, -4353, 171, 3432, -895, -1754, 2598, 1795, -1553, -263, 1645, 1113, 399, -39, 217, 302, 438, 76, -1462, 179, 1070, -2332, -3479, 103, 1107, -1413, -2473, 1228, 2439, -1423, -898, 3203, 2437, -95, 789, 428, -67, 838, 0, -1768, -179, 912, -2076, -3413, 754, 1396, -2954, -1465, 2715, -102, -2007, 1171, 1992, 555, 814, 1158, 594, 502, 977]
713I77p47r55J553m78l347O98L183j465k231J978K201j244j754K347J751j910
729E57k17J215j172K72K01j279L4J591j165k633J200K908j806k450K745J729l605
746a875J16L326p55j055R66M67o13r3N66m13m96J107j628k273K527J241k693j41
764a719K516k52j950L42K313j68j587Q00P46r30M3L42p73J041L29j716p76K248
782H49L20k275n70K931j241k931K145J914j708l30J587p54j87Q84j72n4N53J78
800A139j814o17K427o28k216J805J205k105o40J268J020j077q74R93K13q38M73
817b66N05k59J180l32j380Q15J405p76j452P13J200k356j210K343P12j860l4J188
835A36p70J28P84n4K81K98m42q28M42J805j124j427J951K69k561J47J726k98j363
$$ y = [977, 230, -725, 828, 350, -2997, -2299, 884, -581, -2812, -834, 1367, 123, -1631, 716, 2467, 557, 340, 1555, 383, 655, 856, -423, -389, 1202, 37, -2596, -1396, 1512, -294, -2744, 1, 1730, -1875, -1759, 1567, 812, -243, 723, 1190, 577, 484, 1050, 637, 141, 1248, -380, -2653, -126, 1115, -1578, -1719, 797, 545, -1405, -1063, 1250, 1082, -505, 295, 1041, 111, 154, 496, -277, 764, 1093, -623, -1399, 849, 1169, -1106, -1676, 1255, 14, -2917, -772, 1142, -566, -896, 691, -63, -250, 634, 462, 408, 961, 1139, -675, -1292, 1135, 507, -1709, 96, 1301, -804, -1444, -176, 844, -233, -1107, -114, 99, -739, -266, 239, -20, 1160, 828, -552, 263, 1668, 892, -560, 153, 1353, -1003, -2213, 130, 842, -1018, -1052, 136, -634, -506, 278, 224, 505, 803, 361, -467, -25, 1780, 656, -771, 1180, 1449, -1112, -965, 761, 463, -900]
854i00m41J087l67o09R23K65J56N93p80n14K081N71j738l23J285l23k122J58K213
873A215q02j772L28N19p15O72K47K68N96l4q33m87J826P69j463l91J827j054j859
892a143J017J160j138r47L40m3j65l5O72L6K60O15j564N92K188p17j351Q58O86
911A321q43j460R71R64j427n98O20j92j78O09j59J56O17q67m49N16J594l7j421
930b63L51J321j325o93J497Q0j222r9k27lrL83K15l07K93k6o23R60R53r69p46
951d59P67K03r49P0J103M52j365m73N49k35L37M65o65j46L84n20m28M86J445r46
971G5r29R77O72j387L87J314q15n38M67j13n41N96K74n51j79R6J92r89J221M16
991F45j405O3Q91l20m15N26O73j32p67L8P14m71O70kq47K73j69n91r1Q93J62q86
$$ y = [-900, -1341, -254, -621, -1230, -307, -42, 114, 707, -73, -587, 1494, 2065, 327, 4, 1289, 966, -1156, -998, 1215, 413, -1359, -1031, -512, -1227, -555, -308, -40, 556, 522, -311, -798, 1028, 1797, 334, -57, 1770, 716, -1143, -126, 1034, -104, -1051, -711, -754, -919, -954, -282, -246, 14, 629, -935, -343, 1845, 1128, -223, 635, 1321, 478, -982, -11, 953, -474, -1072, -452, -644, -822, -213, -372, -216, 401, -466, -915, -399, 1195, 1158, -263, 88, 1409, 84, -609, 888, 968, -254, -353, -580, -583, -592, -209, 6, -301, -8, -34, -657, 303, 1256, 287, -459, 308, 511, -438, -368, 735, 1187, -178, -651, -102, -337, 0, 465, -200, -346, 38, -482, -910, -424, 1021, 75, -854, 123, 795, -592, -205, 1109, 294, -244, 223, 110, -431, 165, 439, -112, -291, -195, -3, -992, 229, 645, -760, -697, 194, -126, -541, -15, 658, 526, -241, -203, 511, 40, 710, 708, -139, 134, -35, -626, -717, 176, 338, -548]
1013e48n24P37N85r27J135L96n02k56Q9l22L36L03M01r77l48N16n9m77P80j89
1033A49j082K80L83l78j5J002j06j28j59L91K66J80L01l84j085M58J73q41L78
1052b17P08p74o32L5N36l50K76R55n18m35O87K24m41M95M16l15o74n7L92k70J0
1073E1L83o59o86N39J78q21J043M44o45j6J56M92r3L99K99n05q60Q49m99p29P19
1094C9N07q24n80N17j16J4M28j8n1k49O72l62J37Q01k68l81j07J20K3l75K1M82
1116D30q08k02Q09m38m02Q79j30o05Q2K31L43M5M0Q5n54O6M60m59k9O62q7q02
1138c84L64J10m30K09J06J24k35O1o2p0J36L34j86n84O54j63p5K78J96k20m54
1159b91K11K15j30J43K18j02n60m0q5M93k18K22k54m64O74J84n21M38L68l07n67
$$ y = [-548, -1072, -335, 250, -677, 458, 854, 352, 96, 185, -137, 199, 502, 903, -74, -422, 94, 35, -442, 338, 149, -933, -653, -270, -648, -663, 339, 233, 105, -54, 337, 603, 783, 1084, 700, -385, 73, 246, -595, -217, 491, -283, -915, -880, -344, -694, -418, 537, 19, -416, 271, 495, 54, 549, 965, 650, -24, -81, 311, 41, 51, 434, -225, -911, -372, -194, -1015, 28, 472, -173, -189, -33, 459, 366, 765, 1064, 559, -301, 548, 49, -680, 39, 546, -278, -858, -341, -457, -443, -15, -33, -84, -333, 339, -23, 114, 915, 647, 266, 159, 279, 302, -73, -52, 430, -378, -580, 229, -209, -611, 268, 138, -467, -385, -154, 189, 234, 274, 359, -195, -129, 331, -128, -157, 505, 418, -384, -20, 90, -340, -131, -25, 99, -136, -75, -137, -207, -71, 263, 77, -507, 147, -16, -91, 187, 383, 163, -291, -80, 135, 5, 148, 366, 264, -296, -336, -421, 72, -146, 76, -178, -642, 32, 216, -305, 133, 501, 194, -373]
1180c73O42K25k33k46J62M0p09J47N4l7N2M81m63l26P19n72L40K29L37k73l06
1201a10L69J16l19m6L95j96m52j62l0K43J79l68j55M1M70r2l84Q59O49j191p2
1222b56N57M85m12P7J61k27p07q5j21K36KJ02k51k34N07J7r0P01m8l30j8O1M73
1245F00m33J93R1k42l69k6k1K53j49l17k27O69n42o1J42R52K47j210M02N36l20
1266A68O0J98O4l24o02J01L4M81K3l37p51P57K24n87L24M98j17m40MP2L69O4K64
1289E47l30k37m76N18j38L07M8o14K18J29l28j8M03L57Nr05K56O40j51L72j35
1310D68l84k98M5N9J79K61J22p55k4K62J36l21L97J29l73j92L18q2J57p5l6J3
1332Fk13k0K08l5M58j93o06K51J05J56j1K06n4m12l75J13M00k57P48l34l61P7
$$ y = [-373, 269, 494, 261, 15, 177, 217, -492, -345, -291, -328, -276, 205, -258, -584, 135, -437, -97, 132, 469, 196, -110, 259, 375, 56, 10, 405, 209, -243, -405, -435, -192, -13, -381, -536, -495, -25, -117, -501, 358, 1007, -184, -256, 301, 786, 374, 451, 612, 385, -322, -407, -528, -292, -290, -188, -439, -673, -166, -149, -239, 462, 414, 84, 66, 127, 600, 167, 360, 451, 209, -160, -186, -207, 46, -103, -420, -647, 22, -520, -581, -439, 513, 760, -450, -48, 488, 168, 228, 426, 490, 166, -436, -335, -301, 180, 203, -134, -885, -128, 96, -491, -167, 331, 214, -226, -222, -150, 219, 283, 547, 217, -20, -496, 22, -116, 191, 239, -375, -157, -28, -356, -374, 29, 386, 391, -514, -258, 382, 231, 603, 468, 84, -214, -169, -110, 69, 330, 452, -303, -327, -65, 71, -250, 147, 276, -97, -289, 29, -53, 104, 29, -7, 6, -207, -227, -19, -54, 404, 211, -395, -144, -39, 117, 106, 312, 258, -154, -529, -416, -16, -273, 475, 141, -220, -143]
1354a43lO55k54L23l0o87j7M81j95K4K16l82n84K67K90q9L30k67k5m23p0P30L74
1377E21j00J71p89MJ51P7oM67k94m28l80j75O12Q7k00J19n5k19l9L92M28K01k34
1400C11l44k61N00l0K78O7k47l28m13L66J27rj24R7l24m03N40K75K78J65k55o73
1422d07M65M9L60K52j25m73p78K35J78M55k50mO4m35k88N16N89j08j36m06J79
1443f8j22K60K38J18j38P4j003P4P46J23kj92k42p2k61O46K00J9j48l78l30N61
1465A03M6k09O51j74p37k28L20P47l26r7o8m16j01J98M24P1j27m55L41n27M92
1486g2J80k49N77m07l33k2M88J59j20j96l7k02k29K56L42L28m54k99l99L88M24
1507A23K34l17j92K41m38l42Q25L11rm84L6m1l29K95Q25j44r76oK8L29J16J96
$$ y = [-143, -146, 509, 255, 578, 548, -139, -156, 325, 130, 154, 370, -12, -596, -329, -39, -128, 202, -65, -90, -513, -583, 147, 521, 421, 592, -197, -193, -42, 35, 29, 496, 202, -226, -606, -781, -169, -82, -282, -163, -218, -437, -476, -84, 344, 545, 311, -33, -294, 206, 176, 454, 521, 274, -54, -467, -101, 26, 17, -107, -10, -334, -737, -197, 78, 356, 521, 266, -407, 58, 107, 467, 719, 594, 121, -657, -422, -244, 211, -39, -43, 21, -414, -702, -186, 403, 295, 159, -247, -68, -190, 70, 308, 426, 288, 362, -641, -567, 179, 302, 300, 108, -134, -206, -467, 179, 379, 398, 250, -128, -458, 103, 149, -60, 591, 417, -320, -548, -228, 519, 193, 96, 28, -388, -489, -291, 133, 204, 77, -378, -37, -564, -72, 108, -141, 436, 29, -304, -326, 162, 321, 201, 5, -32, -234, -463, -207, 135, 463, 9, -290, -689, -301, 123, 357, 40, -152, 89, -349, -691, 134, 445, 436, -48, -12, -53, -382, -87, 738, 594, -382, -388, -360, -31, 85, 281]
1529B81l3P3o76m20N93N14L21n42j34j61J83k2M27O2j74n74l78J74P50m6L20p21
1551a83J43k28j80N24L85N7k96m31k6K67J30K50j37r8m09j52m7N74o6nl43M17
1573A46o51K71J97O77l46p17J4M30NP5P8L56j11n49l32L40M72j36j06m51PK12
1595a19k55M38M55k14j16j23j86J43N68J6k76m82p6m7L40L07k54J68m36k74J22
1616c01L99K18J9k80k75L2K23l4M79l4k61%o38R4N91P0L9p42J90p8N23j70J64
1639B28j3m6k59l14K26M64K75k11l97j02J12j56L08K19l8m42l84L12J87K48j71
1660D6K3j22j41j13O2M62K01l45l75J31K28J6J63Q1j68k78l17L29J92R4j6k40
1682h7k47R4r0J63R46m14o36j02K06L57j40n4K86l6m04l19M47K00K81l53k60l28
$$ y = [281, 248, 321, -355, -775, -182, 332, 653, 111, -23, -184, -1, -23, 404, 466, 292, -282, -660, -486, 264, 218, 538, -183, -40, -268, -448, 76, 461, 518, 222, -209, -235, 32, 162, 412, 275, 177, -232, -384, -431, 143, 77, 72, -271, 146, -505, -234, -37, 640, 294, -423, -409, 21, 26, 101, 179, 535, 424, -125, -457, -117, 355, 219, 113, -338, -331, -119, -374, 64, 519, 305, 189, 66, -120, 23, 591, 607, 331, -151, -227, -274, 66, 373, 119, 287, -149, -423, -301, 98, 316, 335, 55, -220, -188, 35, 1, 480, 446, 185, 185, -453, -359, 232, 302, 341, -401, -211, -289, 234, 64, 228, 215, 169, -90, -404, -178, 286, 561, 350, -47, -149, -37, -193, 115, 334, 296, -146, -530, -218, -31, 217, 46, 69, -53, -194, -307, -245, 217, 418, 73, -302, -171, 57, 73, 236, 317, 149, -129, -446, -117, 75, 169, 153, -87, -334, -240, -330, -167, 779, 365, -271, -373, -167, 190, 50, -4, 282, 246, -158, -477, -30, 170, 451, 98, -162, -490]
1704d90L13J15k26O28K5m12l85O4K93L91j95K07j96o04L31L03m2K23l74j83M6
1725a68l6K74P4m1K69p75K69k32O66Jk9k07k83J8R5L93J24N8l39l11K37J29n2
1748A34K75k25j38j06n88M19M21j3j78R5j71m9J59J30L5j08j07k16K89k6J17j64
1770a5M29k83n27K89J14pp4K16j60l58K95J96J20k9k03M5m17M49J75n6m1k43k68
1793c53J44J16K00J35k90K46n88L40J40l4k00L50kj12l24L06L72j96p8j23l19
1814b70L02j32K47K75l25k77l54K55M64j96J07N9j65j96J65L6L15%j7l28J04m33
1836c64J12L59p0J97m82J9K50J94j22O6k87l9L45k86K71K60r2n00o6j19L00Q0
1858B6j40L54l13M5l21L22J38k7j02J16k35j92J81N07K57p41j67o2J83K15J8K45
$$ y = [-490, -177, -62, -288, 340, 365, -47, -432, -368, -75, 316, 121, 328, 132, -472, -141, 162, 120, 343, -31, -214, -168, -204, 70, 144, 103, 372, -403, -134, -366, 300, 301, 272, 65, -218, -200, -105, 288, 412, 470, 131, -180, 57, 186, 134, 409, 184, 46, -60, -648, -229, 192, 179, 1, 96, -75, -124, 35, 165, 200, 92, -15, -231, 58, 32, 149, -15, 414, 131, -396, -107, 7, 0, -74, 142, -18, -376, -81, 115, 235, 206, 3, 48, -369, 80, 255, 199, 158, -85, -353, -209, -93, 107, 242, -48, 198, -390, -50, 90, 56, -144, 206, 204, 92, -232, 74, 446, 250, 172, 49, -270, 32, -100, 147, 422, 97, -180, -534, -279, 185, -11, 96, 155, -10, -206, -41, -5, 310, 310, 293, -35, 69, -364, -252, 107, 37, 234, -248, -229, 21, 215, 93, 159, -128, -167, 178, -108, 163, 423, 331, -169, -235, -354, -54, 26, -114, 240, -73, -28, -349, -27, 111, 84, -18, 98, -137, -329, -148, 359, 616, -125, -292, -354, -171, 44, 62, 307]
1880C07Ml20j90J77J25J23j70k61K50n0k53K47J64L5j29kj84M23j90J04l57J77
1902C0j4k74O9N74l90j6k80L26M6k89K04L51j93k4k26K4K38O0k03R2M7P3n42K46
1926g1J92O8O1o11M20J99n45K12PJ99j39m65M14K41j18J3k43K59N8l90K49J00
1948A10J35k44j18k42j95M37j55N25J04p07J25Q4K71r9p4J04N2M4l48M23L86n52
1970F6j99J26k51L22l40N00M7l92M3l33L43K57N2k17j54J57p4O9L12Rj0m81k3
1993a71J08oJ06L86k3l99k79M1K53J88J78k72m8q3J6j65L21ol12j23J10J25J74
2016A19p7P0m0Q9l72q9M52J00l19k61K27L80j34mj49J01k8j49j03J54L2L2o6J09
2040G4j14j51%R3J93L7K3k33m4l96P66q7k05j26p1J73N7J64j6L5p8J8j2k04K33
$$ y = [307, 311, -9, -199, -22, 103, 226, 56, -205, 45, -5, -258, -11, 153, 188, 59, 57, -127, 296, 106, 210, -147, 30, 16, -258, -189, 385, -5, -21, -301, 25, 71, -218, -14, 337, 144, 120, -106, -82, 156, 216, 13, 105, 152, 225, -317, -71, 121, 189, 250, -361, 59, 258, -287, -75, -68, 131, -8, -473, -59, 182, 64, 77, -166, 93, 151, -239, 10, 110, 245, 1, -117, -359, -554, -117, -272, 253, 357, -350, -225, -141, 130, 31, -43, 61, 113, 157, -191, 232, 618, 66, -133, -7, -258, 64, -276, 224, 271, -121, -78, -411, -68, 189, 241, 24, -130, 27, -47, 22, 334, 343, 333, -148, -171, -63, -69, 37, 423, 400, 1, -278, -237, 16, 204, 382, 110, 62, -21, -5, -170, 151, 145, -167, -290, -180, -55, 119, 42, 112, 72, 161, -211, -300, 152, 252, -67, -328, -101, 279, 145, 141, -8, 93, 65, -84, -187, -33, -1, 31, -35, 74, -40, -191, -191, -98, 95, 132, 155, -78, -122, -518, 248, 161, -44, -170, -241, -68, -11, 153, 137, 172, 94, 112, 100, -104, 129]
2065A29K17j36j13k42j18K60J57k11K63m27K11J49l49K21J1K9j32n5R0J52j28
2086b2k13J82j49m4L5l7L99J24l16k95K64J94k35J6J94l22L97m29J25M92n0m53
2108a43j5J04M6j84Q9L27J3q8k06K55r0k40J42K1L8n05J57M47o5k49RK51J21l38
2132a03Q9j35K23L9n35J41K62J40k01M3J82J72l91NK45J16l54K28j8j13j18k08
2154b91N76O2j31m17l04O22J74j13j15K74l28j87N4K46J11m18j6K44J51n79L65
2175b0L21P1m49j55L18j46J34j66LJ94k74j42L91K74j09k24J08K0j64k77J01L22
2197A31J59m20J73q8K21j9l24J82J84l52kK73J05j80r4NJ47j25k54M82m2j42k22
2220b02j34K49J73r5l35M61J7k39l44N00n1Nk11J03N82l18k06o6L72j95j58K6
$$ y = [129, 346, 210, 97, -145, -263, -3, 154, -57, 206, -221, -10, 139, -210, 11, 22, 51, -81, -136, -46, 106, -22, -235, -53, -202, -246, -211, -248, 151, 275, -41, -336, -72, 122, -113, -97, 97, -225, 172, -257, -132, 360, 310, -143, -158, -54, -8, -192, -103, 224, 237, 149, -57, 198, 108, -132, 10, 31, 69, -436, -279, 168, 103, -146, -137, 114, 235, -103, -14, -149, 74, 113, -422, -281, -19, 121, -80, -37, 145, 317, -74, -69, 176, 292, -62, 166, 148, 35, -83, -291, 285, 347, 216, -201, -505, 117, 291, 178, 63, 337, 9, -178, -124, 122, 233, -185, -201, 43, 194, -385, -20, 301, 372, -77, -232, 86, -60, 74, -92, -89, 105, -169, -311, 80, 354, 245, 21, 129, 149, -15, -292, -191, 131, 290, -130, 43, -45, 176, 157, -167, 15, 199, -153, -155, 118, 223, 43, -51, -46, 101, -24, -278, 204, 162, 20, -202, -336, -87, 86, -9, -344, 117, 134, -105, -449, 51, 0, 5, -206, -103, 479, 161, -45, -111, 261, 66, -92, -66]
2242f6PJ85k82l2J57k0j44J02M61k48l09M9j14M81m24J81k2J25r6j26K25L1J14
2265B35l19L58k77JR0j74j4K31m04K46j44J46k6k21N7K27R7j41m0K94k48Q7k3
2288C8J4P4l49J94oj47K21l24O08j13l18j58L84K12l28j38M9M33l47j3N9J17m55
2311b93J48Q9J29k54k0J79K31k79J08j48J73J61m33K08K45j43k96J88K04j91j30
2332a24K41q9K11l53r5K10N9p0l34K77L07k38j39P6K85j11q7J7M17k44l08R9Q6
2355I3j64R1j97P7J82K3l13L27ql3m5k18M22p0j33Klp1p5K34k26L47l67L5M61
2380C71m22J15R1k83J6J96j27Ro8j81L3J96J27k53O2p4M60l33j58K53k18O9k10
2403c29Q0N23n5l86J66J20j92K33k50O9Oo3J55j45N16q55M01J86l16j2j0Q3L4
$$ y = [-66, -59, 126, -156, -188, -31, -51, -195, -93, 368, 120, -189, -140, -254, 227, -197, -16, -38, 87, -9, -135, 90, 121, 235, -84, 274, -3, -2, 88, -86, -100, 131, -273, -27, -171, -25, -51, -272, -215, 12, 109, -32, -72, 222, -26, 61, 38, 52, 126, -223, -29, -35, -182, 39, -285, 323, 210, -108, -266, 118, 330, 2, -136, -87, 346, -1, -14, 45, 162, -293, -145, -56, 73, -181, -201, -22, 209, -70, 38, -110, 63, 224, -209, -1, 244, 101, -195, -7, 197, 6, -124, 117, 28, 239, -114, -209, 1, 60, -10, -344, -67, 240, 2, -137, -61, 224, 113, 26, 43, 460, 216, -92, 7, 93, -71, 20, -177, -100, 82, 105, -208, 119, 111, 78, 33, -185, 237, 167, 34, 36, 33, -38, -113, 121, -105, 242, -125, -90, 371, -51, 64, 155, -128, -112, 84, -43, -34, -102, -283, -250, -54, 73, -180, -118, -192, 268, -65, -223, 30, -188, -119, -329, -249, 274, 219, -167, -1, 119, -73, 160, -90, -21, -15, -78, 77, -68, 448, -407, -6, 180, -136, -148, -158, -75, -41]
2426d1K69l79L69l98L76j53oR8p9k96J21K77q7L6l38K74K04j66J51j01j49J5k06
2449b09o6L96Rj54j20rJ29k42P6L60r5P1k66J89k6j13J14j69M81k41j63j02K31
2472H1J2k67J97O0j99j09K94K39k10r4k07L22n9Jj59M33m93M9J92l51L68j31o0
2495i1K91j11j12jk3J75j22J19j69j4O0j02L15M4k53j80N7L15o2j41o3k9J02n0
2519d5l5K46L8k76R6J08k7k42N5M71j62j15lj99K28M5k42J07L2j56j87M01j09
2542B9Lk03J95J34j59j47N32k41j3j29j70K62J02l09R1M31m93K40k20N1O2j30
2564h2j11K65p9Q1k60J14M4K37J7j85n1m2L0P2l6j0j39N3J67oj18q8nj7K46k40
2590a43N3Qq3J63l9L62o14L95k03J34k11o9p8L94k85P1O9M0J52j61q9J33K16j22
$$ y = [-41, 228, -151, 218, -180, 196, 43, 37, 135, 56, -240, -119, 158, 71, 107, -231, 43, 247, 81, 232, 131, -18, -3, -209, -275, 121, 130, -24, -144, -153, -24, -266, -190, 170, 75, 146, -120, 69, 43, -70, 44, -125, 356, 115, -48, -150, 81, 93, -174, 23, 83, -116, -225, 69, 308, 98, 4, -203, 119, 60, 61, -98, 335, -158, -109, 83, -268, 100, -31, -91, 200, 89, -23, -24, -47, 128, 6, 125, -44, -58, 2, -100, 215, 259, 6, -174, -117, 198, 136, -5, -68, -97, 5, -45, -80, 166, 204, -72, 24, 132, 105, -137, -82, 389, 227, 112, 109, -90, 138, 183, -59, 48, 80, -76, -263, 138, 29, 32, -171, 24, 158, -1, -148, 384, 143, 130, 1, -169, 93, 195, -114, -23, 408, -85, 155, -65, -14, 48, -82, -193, 72, -7, 74, -186, -72, -28, 209, 226, 41, -10, -52, -22, 50, 14, 4, -135, -82, 85, 79, -39, -127, -132, -149, 97, -143, -90, -82, -165, -2, -41, 321, -293, 102, -101, 33, -178, -247, -325, 69, -216, -145, -76, -36, 116, -45, -134, -1, 215, 93]
2614I3k68K02j86L37M1m13L16k26j46K45J08K37l11r5J9L26j83m23M54J1j97k45
2636c04K66m5k48L56l3j2p4L40m00J97jj74K22K2j99m6J9Q1J60l14R2J76l38K46
2660a1j07Q9J40L1j31l08O75n2j04k25JP3k0j45J29l83L07R4o7K73m13j26M89
2683B09j38p3L3K06k02q2o9J41J76j67j91K67k14k47L46m4r2K96l70M7L04k50
2705a14j9J72r4J35n4K25l04J1N6k02J33J26k54%P3J34j27j22L82o5k4K5j94L37
2729B36l21j60L69j69L8l14J71L00o6k37M1K96m69K84pJ7n7M5K3j63K60m7k01
2752a31K53j73N7J11M4j05j2p8r7J81l78N67k94J12k85k2R7M10j72J00k14l87
2774d16L37J35M9OK53m26P9k05J97m5J36l17L60Jj13p7j78K47K8j16k67P06k72
$$ y = [93, -175, 27, -159, 178, 219, -194, 122, -104, -250, -5, 103, 340, 29, -66, -47, 279, 96, -327, 127, 138, -59, -304, -38, -83, -331, 25, -8, -20, -94, 246, -154, 43, 42, -132, 90, 112, -87, -133, -114, -33, 127, -187, -95, 81, -257, -11, -118, -29, 111, 142, 11, -297, 378, 326, 222, -3, -2, 71, 51, -94, 35, -348, -41, 53, -14, 259, -154, -280, 209, 71, -2, 31, 237, 35, -47, -116, 25, 201, 34, -157, 110, -104, -351, -5, -49, -141, 155, -215, -168, 136, -114, -133, 39, -55, 80, 26, 251, -53, -42, 14, -188, -55, 71, -183, -183, -110, 24, -103, -225, 157, 92, 68, 93, -101, 236, -85, -245, 124, -45, -7, -321, -150, 150, 84, -153, -112, 184, -285, -1, -8, 9, -48, -3, 20, -143, 117, 70, -131, 122, -51, 6, 117, 161, 56, 44, -34, -131, 50, -328, 239, -55, 57, -228, -250, -153, 257, 85, 185, -29, -416, -79, 56, 105, 111, 364, -62, 17, -188, 9, -36, 100, -217, 143, 144, 31, -46, -224, 23, 51, -65, -332, 374, 102]
2797A02p8J21J20k66J50k76K76p7j29m7K49M1j03j01J6J26k67R9q3Q9l10L01K70
2820B23j06o5j07L07ok43j06J8R0l30J96p3J81J43M4k52L48q3k57O3L3J51k07
2843c8J2K67j32j21R9N0L3j30j09L7k7J14p1J01J21j61j01N6K7j04L4j12K80o8
2867E7J83m57K11k45j89K68J69n8J30k67n8L02k14K84l20L15o5j89J43j78K48
2888G0nOL6J0j65J16J05j37K01m58K19J49j19L0R2j08O3j72K3o4O5J18m1J41J68
2913C43k86n2K50k69j82K66l02L45p7lOj25J3p6J06pL26l11L0M4q3J50j84K66
2937A88l27OJ6k17K27K03p3Rj71Q4J07M0k75L52p6n4j68qj5k5J95P5q7K0j38J15
2963Cmk02Q8J8J76N1m1n4R7k03m6L44m81N3K22J08j65k19L12j34K2J07j12o9M70
$$ y = [102, 24, 145, 265, -1, 149, -127, 149, 72, -57, -104, 145, 186, 83, -18, -2, 124, -143, -44, -127, -38, -348, -47, 223, 117, 52, -55, 252, 246, 3, -103, -85, 5, -325, -129, -202, -21, 122, 166, -86, 262, 179, -78, -15, 18, 169, -38, -26, 241, 109, -12, 87, 137, 170, 40, -69, -32, -59, 55, -16, 85, 206, 45, -56, 0, 27, -77, -43, -155, 125, 57, 240, -217, -6, -251, -440, -172, -3, -61, 69, -198, -256, 46, -168, 116, -204, 111, 46, -143, 0, -178, 70, 65, 71, 107, 117, -48, 68, 173, 36, 237, -221, -2, 147, 28, 58, 150, 42, 105, -67, -44, -108, -43, 75, 34, 175, 343, 57, 5, 255, -14, -196, 70, -232, 113, 36, 33, 39, -86, -73, -149, -43, -50, 276, -35, -5, 39, -44, 106, -78, 188, -139, -133, -117, -334, -107, 96, 23, 32, -139, -55, 52, 92, -183, 169, 93, 39, -129, -137, -152, -177, 18, 93, 6, 26, -112, 3, -1, -203, -115, -97, 79, 130, 89, 35, 132, -71, -117, 227, -254, -201, 21, 129, -36, -255, 57, -77, -55, 52, -60, -129, 341]
2988C41l79k45M30k19j06K95k51K43j43J47k12K22k12J19p2L11k20J67k43r2j0
3009a29J71j18%q0Q0kN1q7K20J68R4l33k08J00J83L1n1L3L8j48M1k19N6j8R6%
3035c1K21l23O4L8L9N3k5K7jj73l3J70j34K03Ok91L09j27J33j59j3J15l75M84
3059A77J13m48L53o1k42R0K02L7l03J6r2O5j31L14j79L55k24j70L40l69j15K53
3081a9L97m40K58j0j14j26o4K90m07J07J75j94K92j01R3k80q5K74J34k96M4K67
3103A95j30r1j40p7L40q2J23l19mL35Kn9K57k49l46J06m2J34J65k97L58m28j7
3126b66K89j4N65n46R8j98m7k87K08L31%j26O3k13K40n8J61j48j25r5j05L05J84
3149B16P0j21m17J15k36L23n2q3K41J84l32K37k43Q4K22l91K57k93J78J54j20
$$ y = [341, -38, -283, 147, -72, -178, 117, -134, 109, -34, 113, -99, 123, -89, 30, -42, 269, 49, 216, -27, -119, -129, 42, -76, -76, -156, -76, -78, -27, -114, 106, 274, 368, 35, -173, -73, 110, 141, 90, 123, 161, 13, 54, -165, -109, -127, -31, -31, 190, -133, -69, -31, 8, 61, 36, 63, 62, -111, -144, 26, -108, 95, 101, -190, 119, -8, 125, -34, -47, 68, -307, 177, 290, -158, 195, 134, -108, -18, 184, 221, -82, -66, -158, -93, -224, 90, -89, 266, 42, -128, 212, -157, -272, -19, 378, -62, 196, 186, 72, -54, -118, 172, -235, -128, 47, -147, 145, 44, 137, -143, -228, 46, 180, -116, -72, 195, 65, -26, -166, -243, 97, 15, 138, -181, -185, 150, 152, 93, 350, 101, -245, -139, -181, -47, 118, -179, 179, -249, -266, 23, 9, 574, 28, 126, -72, -119, -406, -198, 133, 133, 7, 70, -143, 97, 39, 200, 52, -73, -168, -273, 32, 216, 286, 165, -252, -137, -373, -50, -102, -185, 56, 240, -92, 145, -98, -14, 208, -183, 74, -219, -41, 113, -7]
3170gJ40o8lj90k41K50K57K6m7l22kL38m41K32J53L9mm4k54M9m5L53k98J00J9
3195a0J44k62R8K45j96J45m17K97K77l78J59j01Nj45p5J0M34j24l38L77l83J18
3217a20J43Jlk7lo3P5J3L79p31L81J78j77k35K52j15o1L25n30K40l5J22j95n6
3241b42L06n5k9K69l05L96k60j52L2k25J58J22M6k05J14j00J43j47L83j96N3k56
3263a50R0n5L96l03kr4QK39l35K61K74m71J30J5l20K95J38j43J31j73J74j22p7
3286i4j32P9j7K53L9j52J41k6k07L19K8k64n2o6L46m06L17m15K94m0J41N9j23
3309B2o4j03Q7K7QL7k67L69j3mk08J68k1j58L2k2M62l87l4K23l12J42J67RP8o04
3335c66M27M9p5k57J34K6m0K65o6q1n0L38n32J31j2J18k34M7L6k85O12Mj4m81
$$ y = [-7, 133, 65, 62, -128, -369, -119, 138, 164, 117, -205, -207, 131, -310, -78, 75, 114, 110, 66, -188, -139, -184, 169, -129, -29, -10, 134, -128, -30, 215, 19, 164, -253, 44, 321, -57, 102, 1, 6, -139, -214, -204, 230, 106, -232, 145, -238, -120, 23, 24, 21, -6, -9, -72, 3, 16, 395, -336, 45, 223, 46, -189, 63, -52, -113, 212, -318, -78, -113, 9, -186, -242, 64, 9, -20, 249, -56, 340, 80, -72, -40, -265, -107, 15, 61, -144, -30, -130, 13, -134, 249, 53, 106, -150, -60, -115, 281, -22, -24, -118, -110, 129, -206, 55, 329, -142, -12, 3, -317, -22, 116, -27, 104, -69, 105, -17, -94, -226, -147, -164, 89, 128, -24, 117, 91, -116, 203, 231, -33, -85, -151, 195, -211, 106, -309, -15, -55, 86, 145, 22, -42, -145, -58, -31, -23, 14, -253, 116, 103, 99, -109, 59, 38, -120, -88, -110, 352, -35, -69, 154, -158, -16, 151, 160, 238, -366, 61, 110, 35, -222, -88, -62, -102, 163, 97, 16, -34, 304, -228, -97, -109, 9, -225, -178, -142, -427, 185, 189, 175, -306]
3359c06L48J72j48j32J14M4o1M0j98K03N3k06K4J18k18R0J04j16K5JJ16l98K69
3382f2K28k05J60J9k86j18K42K34j13j48oJ66j21r6K8J86L2j84J72j37MM3M5k88
3406b05N50l45N6m5L63m97K18k65N91m94q5K63k96K64j38L3K0j50J3L76l79K15
3428F3n9l7O6J14r3L3p3j86j5R1j3J67M0l02K43OL4M4k30K67k59J13r5j37M23
3453B05J0j97k06J65J08L00p35K39J5l10J85O0J6K4K39j76L9K56j18j36J94Qk03
3476a8k13K03j46P6K42p4l32K55Q3J6O7p7Rj9k11Q6l08O12m58K57k53J95%j41
3500a49J92R6j04r8k15J67K82k23P2mk07J68j00L06n4j64k44M37m9j41p3p7M77
3523B95l35j97N2L18l16Q7K78k80r6J95m17K13K29o4o1J80o8M5pj83J6J14L9j07
$$ y = [-306, 42, 214, 66, -66, 48, 92, 31, 71, -127, 76, 129, -77, -53, 65, -153, -63, 41, -75, -50, -49, 67, -331, -62, 166, -39, 121, 140, -146, -264, -22, 212, 99, -49, -55, 111, -10, -106, -78, 108, 140, -44, 128, -9, -5, 38, 83, -205, 345, 0, 56, 11, 374, -123, 95, -170, 421, -73, -158, 105, -191, 73, -65, -32, -12, -162, -149, 227, -152, 63, 4, -33, 33, 147, 54, 87, 14, -172, -187, -96, -109, 58, 98, -204, 39, 45, 79, 123, -107, 160, -99, 14, -81, -218, 205, 215, 18, -188, -23, 85, 385, -350, -111, -96, -406, -221, -161, -145, -121, 118, -58, -19, 237, 119, -17, 177, 185, -18, -231, -28, -174, -98, 144, 70, -262, -7, 76, 92, 159, 82, 91, 72, -139, -53, -361, 251, -207, 50, -203, -8, -8, -149, 43, 139, 35, -63, -278, -111, 171, -52, 20, 16, -191, -23, -123, 183, 129, -35, -279, 158, 109, -32, -105, -182, 295, -40, -237, -185, 133, -183, -96, 182, -98, -194, 1, -416, -203, 26, -38, -99, 81, 13, 58, 51, -132, -116, -2, 37, -70]
3547g0L3O3l20O0M44m03L88o9k62K47k30J14l6J46l2K17l3j23J9l36M5K0K31p5
3571C8R6k4k07k75L17K62j27j80J81r4p3K46k21J51k0p8pJ89r8k04n4J24J28O8
3595A38l21%J97j31p6J57K00k54l0K37n6K08k49o3J69K21l97K44k38J9q6K98R9
3618B86l16J61k25k11L28N2l1k86J12K45j01p5J19l8J9k0ql9J35j11K15m7j31
3641C3J41m77K9M46M2j09K85n50k5M52p2l94L22k22J39n6k4K85m05J35K90n19
3663b54Q7L4%Q9K89m51K45q4L8J68j13p5j82K59J45l71J86M8J52j79j71L4K35
3686A29k66J28O0r2J04m4K6Q8k38o7M92l33j05nM60m35p6K14R7Q1Q5l53L2o8M2
3711d4o1J67n1J48j86q6J52k39J88p5M00j78l60J58J20M9k31l9K03Q8j34q3K09
$$ y = [-70, -37, 26, -294, -234, 210, -193, 195, 126, -136, 111, -119, -5, -41, 105, 73, 290, 257, 134, 153, -183, -138, -118, 113, 38, 134, 110, -97, -372, -55, 207, 80, -100, 81, -13, -86, 160, -61, 90, 70, -8, -15, 174, 76, -128, -182, -58, 70, 138, -183, -183, 14, -117, -193, -36, 164, -90, -120, 117, 61, 269, 20, -43, 126, 347, -50, 194, -44, -25, -111, 187, 286, -30, 131, -94, -305, 23, 75, 44, -242, -130, 115, 14, -61, 58, 20, 39, 19, 11, -28, 107, -4, 211, 164, 33, 174, -303, -274, 172, 214, 105, 390, -160, -185, 267, 195, -199, 123, -99, 40, -16, -40, 245, -160, -25, 265, -254, -167, -133, -133, -44, 245, -206, 39, -45, -7, 161, 48, -27, -209, 50, 195, -176, 10, 58, 210, 31, -140, -106, 129, -137, -9, 51, -41, 63, 19, 45, 133, -105, -172, 320, -13, -118, -123, 337, -98, -174, 40, 137, 218, 303, -50, -18, -86, -44, -105, 62, 11, 159, -27, -113, 39, -200, -12, -87, 313, 135, -225, -67, 53, 102, -129, -168, 35, 123, -11, -94, 115]
3734A15K54k22k97J60O3j41N9J46m68M91k39p1P7L9J41k02K98k36o5J98J75k43
3756C2Jj05k12J05L3m5K19o7p7L9J3L63l83m6J42j1K02m6k07r0L85j47q3m4n5
3781h4J69j94R7N2R9k07K94l5j40r1K29m34K49K10l70L21j95l84L81K16q4p0o3
3804c4K64j65K7k57L3K18J18n8j55J42P1k05k3O8p6jJ8l30M12mk92L04J67j27
$$ y = [115, 369, 147, -150, 10, 73, -68, -9, 137, -331, 160, -79, -150, -73, -34, 107, -95, 203, -33, -98, 100, 275, 32, 33, -72, -284, -179, -146, -191, 28, -39, -116, -77, -64, 299, -84, -130, 12, 1, 203, 157, -50, -140, 245, 98, 15, -29, -84, 85, -109, -12, 40, 139, -68, 226, 191, 51, -40, 189, -245, 4, 214, -156, 165, -30, -414, -33, 183, 99, 29, -34, 230, 65, 92, -165, -132, 86, 204, 146, -9, 133, 204, -1, -24, 44, -32, -33, -15, -345, 67, 63, -229, 75, 242, 115]
$$ [...]
8191h4
##END NTUPLES=NMR FID
##END=
