##TITLE=1H_DE-102_m_TFA
 200.13MHz, CDCl3,
 8 sc
 
 25.8.2025
##JCAMPDX= 6.0         $$ Bruker NMR JCAMP-DX V2.0
##DATA TYPE= NMR FID
##DATA CLASS= NTUPLES
##ORIGIN= UXNMR, Bruker Analytische Messtechnik GmbH
##OWNER= pz
$$ XWIN-NMR		Version 3.5
$$ Mon Aug 25 14:21:31 2025 Russian Standard Time (UT+4h)  she@DPX200
##.OBSERVE FREQUENCY= 200.1308
##.OBSERVE NUCLEUS= ^1H
##.DELAY= (6, 6)
##.ACQUISITION MODE= SIMULTANEOUS
##.ACQUISITION SCHEME= undefined
##.AVERAGES= 8
##.DIGITISER RES= 18
##SPECTROMETER/DATA SYSTEM= spect
##.PULSE SEQUENCE= zg30
##.SOLVENT NAME= CDCl3
##.SHIFT REFERENCE= (INTERNAL, CDCl3, 0, 14.3821)
##AUDIT TRAIL= $$ (NUMBER, WHEN, WHO, WHERE, WHAT)
$$ ##TITLE= Audit trail, XWIN-NMR		Version 3.5
$$ ##JCAMPDX= 5.01
$$ ##ORIGIN= Bruker BioSpin GmbH
$$ ##OWNER= she
$$ F:/spectra/data/she/nmr/H-C/1/audita.txt
$$ ##AUDIT TRAIL=  $$ (NUMBER, WHEN, WHO, WHERE, WHAT)
(   1,<2025-08-25 14:19:47.32 +0400>,<she>,<DPX200>,
      <created by zg, POWCHK disabled, PULCHK disabled
       configuration hash MD5:
       00 E9 B6 7A A2 85 ED C7 34 08 36 98 17 FE 4E 26
       data hash MD5: 16K
       37 CF 29 5E 13 85 BA E6 FA CE 89 58 F1 3E 14 65>)
$$ ##END=
$$ 
$$ hash MD5
$$ FA D8 36 5F 88 95 C7 07 B6 C7 6A 34 C6 3F D1 1C
##$RELAX= 
##$RELAX= 
##$RELAX= 
##$RELAX= 
##$RELAX= 
##$RELAX= 
$$ Bruker specific parameters
$$ --------------------------
##$DU= <F:/spectra>
##$EXPNO= 1
##$NAME= <H-C>
##$PROCNO= 1
##$TYPE= <nmr>
##$USER= <she>
##$AMP= (0..31)
100 100 100 100 100 100 100 100 100 100 100 100 100 100 100 100 100 100 
100 100 100 100 100 100 100 100 100 100 100 100 100 100 
##$AQSEQ= 0
##$AQ_mod= 1
##$AUNM= <au_zg>
##$AUTOPOS= <>
##$BF1= 200.13
##$BF2= 200.13
##$BF3= 200.13
##$BF4= 200.13
##$BF5= 200.13
##$BF6= 200.13
##$BF7= 200.13
##$BF8= 200.13
##$BYTORDA= 1
##$CFDGTYP= 0
##$CFRGTYP= 5
##$CHEMSTR= <none>
##$CNST= (0..31)
1 1 145 1 1 1 1 1 1 1 1 1 1 1 1 1 1 1 1 1 1 1 1 1 1 1 1 1 1 1 1 1 
##$CPDPRG= <>
##$CPDPRG1= <>
##$CPDPRG2= <>
##$CPDPRG3= <>
##$CPDPRG4= <mlev>
##$CPDPRG5= <mlev>
##$CPDPRG6= <mlev>
##$CPDPRG7= <mlev>
##$CPDPRG8= <mlev>
##$CPDPRGB= <>
##$CPDPRGT= <>
##$D= (0..31)
0 0.7 0 0 0 0 0 0 0 0 0 0.03 0 0 0 0 0 0 0 0 0 0 0 0 0 0 0 0 0 0 0 0 
##$DATE= 1756117186
##$DBL= (0..7)
120 120 120 120 120 120 120 120 
##$DBP= (0..7)
150 150 150 150 150 150 150 150 
##$DBP07= 0
##$DBPNAM0= <>
##$DBPNAM1= <>
##$DBPNAM2= <>
##$DBPNAM3= <>
##$DBPNAM4= <>
##$DBPNAM5= <>
##$DBPNAM6= <>
##$DBPNAM7= <>
##$DBPOAL= (0..7)
0.5 0.5 0.5 0.5 0.5 0.5 0.5 0.5 
##$DBPOFFS= (0..7)
0 0 0 0 0 0 0 0 
##$DE= 6
##$DECBNUC= <off>
##$DECIM= 32
##$DECNUC= <off>
##$DECSTAT= 4
##$DIGMOD= 1
##$DIGTYP= 9
##$DL= (0..7)
0 120 120 120 120 120 120 120 
##$DP= (0..7)
150 150 150 150 150 150 150 150 
##$DP07= 0
##$DPNAME0= <>
##$DPNAME1= <>
##$DPNAME2= <>
##$DPNAME3= <>
##$DPNAME4= <>
##$DPNAME5= <>
##$DPNAME6= <>
##$DPNAME7= <>
##$DPOAL= (0..7)
0.5 0.5 0.5 0.5 0.5 0.5 0.5 0.5 
##$DPOFFS= (0..7)
0 0 0 0 0 0 0 0 
##$DQDMODE= 0
##$DR= 18
##$DS= 0
##$DSLIST= <SSSSSSSSSSSSSSS>
$$ [...]
##$SUBNAM0= <"">
##$SUBNAM1= <"">
##$SUBNAM2= <"">
##$SUBNAM3= <"">
##$SUBNAM4= <"">
##$SUBNAM5= <"">
##$SUBNAM6= <"">
##$SUBNAM7= <"">
##$SUBNAM8= <"">
##$SUBNAM9= <"">
##$SW= 18.0517779522481
##$SWIBOX= (0..15)
0 0 2 0 0 0 0 0 0 0 0 0 0 0 0 0 
##$SW_h= 3612.71676300578
##$TD= 16384
##$TD0= 1
##$TE= 0
##$TE2= 300
##$TE3= 300
##$TEG= 300
##$TL= (0..7)
0 120 120 120 120 120 120 120 
##$TP= (0..7)
150 150 150 150 150 150 150 150 
##$TP07= 0
##$TPNAME0= <>
##$TPNAME1= <>
##$TPNAME2= <>
##$TPNAME3= <>
##$TPNAME4= <>
##$TPNAME5= <>
##$TPNAME6= <>
##$TPNAME7= <>
##$TPOAL= (0..7)
0.5 0.5 0.5 0.5 0.5 0.5 0.5 0.5 
##$TPOFFS= (0..7)
0 0 0 0 0 0 0 0 
##$TUNHIN= 0
##$TUNHOUT= 0
##$TUNXOUT= 0
##$USERA1= <user>
##$USERA2= <user>
##$USERA3= <user>
##$USERA4= <user>
##$USERA5= <user>
##$V9= 5
##$VALIST= <valist>
##$VCLIST= <CCCCCCCCCCCCCCC>
##$VD= 0
##$VDLIST= <DDDDDDDDDDDDDDD>
##$VPLIST= <PPPPPPPPPPPPPPP>
##$VTLIST= <TTTTTTTTTTTTTTT>
##$WBST= 1024
##$WBSW= 4
##$XGAIN= (0..3)
0 0 0 0 
##$XL= 0
##$YL= 0
##$YMAX_a= 173774
##$YMIN_a= -230505
##$ZGOPTNS= <>
##$ZL1= 120
##$ZL2= 120
##$ZL3= 120
##$ZL4= 120
##$ABSF1= 10
##$ABSF2= 0
##$ABSG= 5
##$ABSL= 3
##$ALPHA= 0
##$AQORDER= 0
##$ASSFAC= 0
##$ASSFACI= 0
##$ASSFACX= 0
##$ASSWID= 0
##$AUNMP= <proc_1d>
##$AZFE= 0.1
##$AZFW= 0.1
##$BCFW= 1
##$BC_mod= 2
##$BYTORDP= 1
##$COROFFS= 0
##$CY= -3
##$DATMOD= 1
##$DC= 2
##$DFILT= <>
##$DTYPP= 0
##$F1P= 0
##$F2P= 0
##$FCOR= 0.5
##$FTSIZE= 0
##$FT_mod= 4
##$GAMMA= 1
##$GB= 0.15
##$INTBC= 1
##$INTSCL= 1
##$ISEN= 128
##$LB= 0.25
##$LEV0= 0
##$LPBIN= 0
##$MAXI= 10000
##$MC2= 0
##$MEAN= 0
##$ME_mod= 0
##$MI= 1.114404
##$NCOEF= 0
##$NC_proc= 0
##$NLEV= 6
##$NOISF1= 3.799351
##$NOISF2= 2.8
##$NSP= 1
##$NTH_PI= 0
##$NZP= 0
##$OFFSET= 14.38212
##$PC= 1
##$PHC0= -1573.237
##$PHC1= 32.79228
##$PH_mod= 1
##$PKNL= yes
##$PPARMOD= 0
##$PSCAL= 0
##$PSIGN= 0
##$REVERSE= no
##$SF= 200.129724274929
##$SI= 16384
##$SIGF1= 3
##$SIGF2= 2
##$SINO= 400
##$SIOLD= 16384
##$SREGLST= <1H.CDCl3>
##$SSB= 0
##$STSI= 0
##$STSR= 0
##$SW_p= 3205.1282051282
##$SYMM= 0
##$S_DEV= 0
##$TDeff= 0
##$TDoff= 0
##$TI= <>
##$TILT= no
##$TM1= 0
##$TM2= 0
##$TOPLEV= 0
##$USERP1= <user>
##$USERP2= <user>
##$USERP3= <user>
##$USERP4= <user>
##$USERP5= <user>
##$WDW= 1
##$XDIM= 8192
##$YMAX_p= 0
##$YMIN_p= 0
$$ End of Bruker specific parameters
$$ ---------------------------------
##NTUPLES= NMR FID
##VAR_NAME=  TIME,          FID/REAL,        FID/IMAG
##SYMBOL=    X,             R,               I
##VAR_TYPE=  INDEPENDENT,   DEPENDENT,       DEPENDENT
##VAR_FORM=  AFFN,          ASDF,            ASDF
##VAR_DIM=   8192,          8192,            8192
##UNITS=     SECONDS,       ARBITRARY UNITS, ARBITRARY UNITS
##FACTOR=    0.0002768,     1,               1
##FIRST=     0,             0,               0
##LAST=      2.2672688,     0,               0
##MIN=       0,             -230505,         0
##MAX=       2.2672688,     173774,          0
$$ Real data points
##PAGE= N=1
##DATA TABLE= (X++(R..R)), XYDATA
0@%%%%%%%%%%%%%%Qj6J6j6J6k2L0l2M0m8N3o1P2q5R6j09J25j44J62j83K07k32
$$ 0 0 0 0 0 0 0 0 0 0 0 0 0 0 0 8 -8 8 -8 8 -14 16 -16 24 -24 29 -32 40 -45 51 -58 67 -77 85 -98 109 -123
36a23K62k93L28l65M05m52N00n52O10o73P43q21R04r95J098j210J333j470J624
$$ -123 139 -154 174 -191 214 -238 262 -290 320 -353 390 -431 473 -522 576 -634 699 -771 853
55H53j801K001k233K504k823L208l681M284n078O174p787J0387j5253K7278j10163
$$ 853 -948 1053 -1180 1324 -1499 1709 -1972 2312 -2766 3408 -4379 6008 -9245 18033 -92130
70i2130j38375L22544N9751k25746J6262J61277n2413m7739M6575n5951o1926
$$ -92130 -230505 92039 151790 -73956 -57694 103583 51170 3431 50006 -5945 -67871
81f7871J04353K1292j30099m974R2617m6117l9479J01101M7607q4574l9902N1462
$$ -67871 36482 57774 -72325 -77299 15318 -30799 -70278 30823 78430 -6144 -46046 5416
93E416M1078j4749j3113J0677j1336l9275q614J9185Q071n072j0335k1696J258
$$ 5416 46494 31745 18632 29309 17973 -21302 -29916 -10731 -2660 -7732 -18067 -39763 -38505
106c8505M5063J7101m3059J4040P8425k1340q7488K4420N9653m1571l9434L6885
$$ -38505 6558 23659 -19400 -5360 73065 51725 -35763 -11343 48310 6739 -32695 4190
118D190R915l8702o970J8111J508J7991K4949l0079l4154L3267K7014k6408j824
$$ 4190 14105 -24597 -31567 -13456 -11948 6043 30992 913 -33241 26 27040 632 -1192
131a192L1216j0004l7611M93K6136m597j9575J3710J0331k7679q598K6804Q768
$$ -1192 30024 20020 -17591 -17098 9038 4441 -15134 -1424 8907 -18772 -27370 -566 8202
144H202n064R177l077j6981J0445J7250k3612j2574M0814O767n6121q030M2667
$$ 8202 3138 12315 9238 -7743 2702 19952 -3660 -16234 24580 31347 -24774 -32804 9863
157I863m322k2144J7247O961j9625K082J4310l496N218J9659j0222k7063Q314
$$ 9863 5541 -16603 644 7605 -12020 -9938 4372 876 6094 25753 15531 -11532 -3218
170c218J3583j7917m706J9210n108k0123J497J2305O095J451L216N086l843p064
$$ -3218 10365 -7552 -12258 6952 1844 -18279 -16782 -4477 1618 3069 6285 11371 7528 464
184D64J093K141K008K252m748j0587m078N526L56o196R621J5942j5804j7378K1850
$$ 464 1557 3698 5706 7958 3210 -7377 -11455 -5929 -5573 -11769 -2148 13794 -2010 -19388 2462
199B462J6436j6088j182J4263p476j4503K641K997o524N776P740j5461r885J7649
$$ 2462 18898 2810 1628 15891 8415 -6088 -3447 -450 -6974 -1198 6542 -8919 -18804 -1155
213a155M658j2718J0218J4048j2538q928J1219M499p922Q32R156o329j3202K232
$$ -1155 3503 -9215 1003 15051 2513 -6415 4804 9303 1381 2213 11369 5040 -8162 -5930
227e930K628m151N506M258j0859k643J1755K287p422O360J5337o334j6211P278
$$ -5930 -3302 -7453 -1947 2311 -8548 -11191 564 2851 -4571 1789 17126 10792 -5419 1859
241A859J0370j2037n035J0216l996j2509P7N444r21K185O704j665n322Q290O157
$$ 1859 12229 192 -4843 5373 1377 -11132 -11055 -5611 -6532 -4347 2357 692 -4630 3660 9817
256I817r343K311J3174o461j5187K172O145n821n103N678K779p258j721P167J000
$$ 9817 474 2785 15959 9498 -5689 -3517 2628 -3193 -8296 -2618 161 -7097 -8818 -1651 -651
271f51J519O566l200m555N479J713r098n00J0853r27j5965j064J3295l358r782
$$ -651 868 7434 4234 -321 5158 6871 -2227 -2727 8126 7199 -8766 -9830 3465 107 -9675
286i675Q160O874o966k592L858J345L55K733k0m815J641L881o700l275J1167O44
$$ -9675 -1515 5359 -1607 -4199 -341 1004 1359 4092 4072 -743 898 4779 -1921 -5196 5971 6615
302F615j3642k60R467j278o837J916P734q86n433J461K133M86M282j551o722L379
$$ 6615 -7027 -7287 2180 902 -5935 -4019 3715 2829 -2604 -1143 990 1476 5758 4207 -2515 864
318H64L728p423m356Q209M550r338n032R944L653r051J422R207j634n202j84O16
$$ 864 4592 -2831 -7187 1022 5572 -3766 -8798 1146 4799 -4252 -2830 6377 4743 -459 -643 -27
334b7O39J386j531l772N34M903k697o093O402P601o513n469O684L312o097k108
$$ -27 612 1998 467 -3305 -2771 2132 -565 -6658 -256 7345 832 -4637 2047 5359 -738 -2846
350b846M954J313n537k186K403K45J929J223m217J261O727k735p415M344P973
$$ -2846 2108 3421 -2116 -4302 -1899 -1654 275 1498 -2719 -1458 5269 2534 -4881 -537 7436
365G436m282q317L295O030n518m133N872J442l757L00J112n28J653J366j666q62
$$ 7436 3154 -5163 -1868 4162 -1356 -5489 383 1825 -1932 -1632 -520 -1048 605 1971 305 -557
381e57L633K77o046O7P658j402p904K013N455l117m202K033L214j222j716O49
$$ -557 3076 3353 -2693 -2626 5032 3630 -4274 -2261 3194 77 -4125 -2092 1122 -100 -1816 -1167
397a167L24J043L073k098l013N367J911p351j372O403N46p682q63O023q58n397
$$ -1167 -843 200 3273 1175 -1838 3529 5440 -1911 -3283 3120 3666 -4016 -4879 1144 286 -5111
413e111J994M209q26N25J182j806R13L046j814k716J010K180l356m103L486K580
$$ -5111 -3117 1092 266 791 1973 167 1080 4126 2312 -404 606 2786 -570 -4673 -1187 1393
429A393m342r96M677N29l172O27K803J058j164l87l28m01J343m85l830J495M083
$$ 1393 -2949 -3945 732 1261 -1911 -1284 1519 2577 1413 1026 698 297 1640 1155 -2675 -1180 2903
446B903l443m323L474L523j996k856K788K463l386q87L021m5j112J582j000j644
$$ 2903 -540 -4863 -1389 2134 138 -2718 70 2533 -853 -1740 1281 1236 124 1706 706 -938
462i38J592J019k444n08K303K53m335l8M594j112k928K621J732k430pJ662K68
$$ -938 654 1673 -771 -1279 1024 1277 -3058 -3096 1498 386 -2542 79 1811 -619 -626 1036 1304
479A304o18O30j28j578l47J688j831j526L705p6m305P42L910l61k586J206K487
$$ 1304 686 1316 1188 -390 -737 951 -880 -2406 1299 1223 -3082 -2340 1570 1209 -1377 -171 2316
496B316j588k340J943L30j686K145M28l072N18K090j170r42J610Q74k339j415
$$ 2316 728 -1612 331 661 -1025 1120 1548 -1524 -1006 1084 -86 -1028 582 1456 -883 -2298
512b298K933J26k684J883K279k143j707J633P53OJ35L19q10q20P87o02j424J571
$$ -2298 635 761 -1923 -40 2239 96 -1611 22 775 781 916 1235 425 -395 392 -210 -1634 -63
530f3J804k938j473L011J14j591O06K346l98k511R08K156j896p73K292r61k009
$$ -63 1741 -1197 -2670 341 455 -1136 -530 1816 1418 -1093 -185 1971 75 -698 1594 633 -1376
547a376O67O62j189R09J831j571k064K092J022k243J89L596j143l173J587J400
$$ -1376 -709 -47 -1236 -327 1504 -67 -2131 -39 983 -1260 -1071 2525 1382 -1791 -204 1196
563A196q39m82Q89p2j058J77k01j615J692K090k166k132K647Q03k091Q19K084
$$ 1196 357 -125 764 692 -366 -189 -390 -2005 -313 1777 -389 -2521 126 929 -1162 -343 1741
580A741N1k076l33J703k37j437J296J47j520l39n28R1J306J173p07j411Q26K044
$$ 1741 1792 -284 -617 1086 849 -588 708 855 -665 -1004 -1532 -1441 -135 1038 331 -1080 -254 1790
598A790j395j691K337J428k632j436J387L94j85K58l12k13lK97j461N59K491m25
$$ 1790 395 -1296 1041 2469 -163 -1599 -212 182 -3 255 -57 -270 -273 24 -1437 -878 1613 1188
616A188k666M55K143j431o74J615J292j319j503M98Q71l63J16L31n53o30K35o64
$$ 1188 -1478 -1023 1120 -311 -985 630 1922 603 -900 -402 469 106 222 553 0 -630 -395 -1059
634a059q6J937L98j487o57J811M87j876J14K886j178k495M89O45j25K31q6r22
$$ -1059 -1145 792 1190 -297 -954 857 1344 -532 -418 2468 1290 -1205 -716 -71 -196 35 -51 -973
652i73P97O19j146r33K171J570k551q31J647K78j446Q06J170k71j006l67O1J21
$$ -973 -176 443 -703 -1636 535 2105 -446 -1277 370 648 -798 8 1178 907 -99 -466 -405 -284
670b84L64j34l4l18L99r42l01J430J119j148o48K95J339o89j358J943J010k027
$$ -284 80 -54 -88 -406 -7 -949 -1250 180 1299 151 -497 -202 1137 448 -910 1033 2043 16
688A6j096O78L5K68n7m80k23P55p9p26N69K231j3k863R35J293j442k42J004L43
$$ 16 -1080 -402 -367 -99 -156 -636 -859 -104 -183 -909 -340 1891 1878 -985 -50 1243 -199 -441 563 906
708I06r31p04j46J08L72Q12k25q96O69M26j009J045R37p05j053L60N58J32j100
$$ 906 -25 -729 -875 -767 -395 417 192 -704 -35 391 -618 427 1364 659 -394 -34 524 656 -444
727d44J56J462q64j414Q0K93L20Q64l25k19J30L37j079K08J208R97j704p03J279
$$ -444 -288 1174 310 -1104 -1024 -731 -411 453 128 -91 39 376 -703 -495 713 1710 6 -697 582
746E82k23j355Q16O57n46n18j26J43L4O12O40n07l36P76q95m32J398O07j245k63
$$ 582 359 -996 -180 477 -69 -587 -713 -570 -536 76 716 209 -127 649 -246 -678 720 1327 82 -181
766a81l71N17m44k7R19o8j018N9L66J2O06K76p70L28P7m47p00R33R32n31j049
$$ -181 -552 -35 -479 -506 413 345 -673 -614 -248 -236 370 646 -124 204 281 -166 -866 67 999 468 -581
787e81N27L15q60N45P18m27m43k77k67N56K72K59j43m02N33k39q31R03R29k01
$$ -581 -54 261 -599 -54 664 237 -206 -483 -750 -194 78 337 194 -208 325 86 -745 158 1087 886
807H86q59k11J99m61J55K66M67o72l21L12m13P25N64k62m35J72j70m24O46P79
$$ 886 27 -184 15 -446 -291 -25 442 -230 -551 -239 -652 73 637 375 -60 112 -58 -482 164 943
827I43r9r87j97Q03p28m24R99J49o35j87j92Q6L01J09L54j81k24N91o89J29P41
$$ 943 844 -143 -340 463 -265 -689 310 459 -176 -363 -555 -469 -168 -59 295 114 -110 481 -208 -79 662
848F62K13r45n7J38o68k0M73K47l29n49K71J26K33O22J31l59J45J58o92j7M49
$$ 662 875 -70 -127 11 -657 -677 -204 43 -286 -835 -564 -438 -205 417 548 189 334 492 -200 -217 232
869B32M34m47o03K76j91m44O22M85l25j31K87n2l22L86L15K2l95J98m18n80Q85
$$ 232 666 219 -384 -108 -299 -743 -121 364 39 -92 195 143 -179 207 522 544 149 347 -71 -651 234
890B34K59p62M1P6j48l54K55P02k10j13K15P1l82K85K34o2J68j22p21Q4K20L5
$$ 234 493 -269 -228 -152 -300 -654 -399 303 93 -20 195 266 -116 169 403 341 509 387 -334 -250 -30 5
912Ej18j43J67l85j64J51Q97k32l05K72k05L08l15K36K5J26j21k96m81K92O80
$$ 5 -113 -256 -89 -474 -638 -487 410 178 -127 145 -60 248 -67 169 194 320 199 -97 -578 -286 394
933C94m17m38O61q9j05k68M00L31J3p17K42O4m35M44P3j07K44k35o38L0R38j60
$$ 394 -23 -461 200 111 6 -262 138 469 482 -235 7 71 -364 80 153 46 290 55 -583 -553 385 225
955B25m96L37r0R9l75M50J48m72J61M57n50K58J46j67K53k05l63j74k44P51L20
$$ 225 -271 66 -24 75 -300 150 298 -174 -13 444 -106 152 298 131 384 179 -184 -358 -602 149 469
976D69q88K16M58k91k92K08M74k5j72k11J10k12M94l53J8L96o5o31n0M91K18l33
$$ 469 -419 -203 255 -36 -328 -120 354 329 157 -54 56 -156 338 -15 3 399 334 -297 -347 144 362 29
998B9r7n6M3o5l29L42J27qk6l3K12Ok28M30jl46j02k24K26K47l57n4M24r5k88
$$ 29 -68 -124 -81 -146 -475 -133 -6 -14 -40 -73 139 145 -83 347 346 0 -102 -326 -100 147 -210 -264 160 65 -223
1023b23nK08K95J65k03j56j3o2J22n0q3%R8n15o9L54K86l60K10L3j06m6N91j58
$$ -223 -228 -20 275 440 237 81 68 6 128 78 -5 -5 93 -422 -491 -137 149 -211 -1 32 -74 -120 471 313
1047C13j02p3J27l66o2K82k63K22Pm9m42J1M68q6K0J33k1n6j40N4K13L37k87l37
$$ 313 211 138 265 -101 -163 119 -144 78 85 36 -406 -395 73 -13 7 140 119 63 -77 -23 190 527 240 -97
1071i7j53M28l03%k97P19j78n63R4L30J99k28Q0O0q6J17L2L0%l31K32m94M44o05
$$ -97 -250 178 -125 -125 -422 297 119 -444 -350 -20 179 -49 31 91 5 122 154 184 184 -147 85 -409 35 -570
1095e70M97L0J44j47J49k03K99j4k68K20J72j04k42k80L72k2J05o6j70M7J97l31
$$ -570 -73 -43 101 -46 103 -100 199 185 -83 137 309 205 -37 -317 55 33 138 72 -98 -51 146 -185
1117a85K07o4M35m67k5K44j06J14KJ12k87L03m55K37k72q2L35r2j24K39p0l21
$$ -185 22 -42 393 -74 -99 145 39 153 155 267 -20 283 -172 65 -207 -289 46 -46 -170 69 -1 -322
1139c22L74K48k16p6j56J96K34k33J37k98r0J72o1j9O4L96k67l90K64j84L43j6
$$ -322 52 300 84 8 -148 48 282 49 186 -112 -202 -30 -91 -110 -46 350 83 -307 -43 -227 116 100
1161A00O3K02o01J73j66J61J18R4j29J65k63k8P7j18L28L28n80j10L65j80n5J46
$$ 100 163 365 -236 -63 -229 -68 50 144 15 180 -83 -111 -34 -152 176 504 -76 -186 179 -1 -56 90
1183I0k7j20N4K44j1j49m5K90o2m13O4J29l37N59j77j99o6J57J54k02J31R8%l93
$$ 90 63 -57 -3 241 230 81 36 326 264 -149 -85 44 -293 266 89 -110 -176 -19 135 -67 64 162 162 -231
1207b31K55l3Q8M7k1j34J35M6j57k35M56l26J53k11O3Kj00J44K03J34l78J27J85
$$ -231 24 -9 79 126 105 -29 106 152 -5 -240 216 -110 43 -168 -105 -103 -203 -59 144 278 -100 27 212
1230B12k51p2J38J64k26K59m91NK92q0l5K3P5j05L18n54O35p5M7j40p9j53j12
$$ 212 -39 -111 27 191 -35 224 -267 -262 30 -50 -85 -62 13 -92 226 -328 307 232 279 139 60 -93 -205
1253b05K56o8J65l26Kk26K52j17K17J41j11K42k61J34P6p5k2k95Q4J91j65r5L09
$$ -205 51 -17 148 -178 -176 -402 -150 -267 -50 91 -20 222 -39 95 171 96 74 -221 -137 54 -111 -206 103
1276A03J4q5J48k32r3k1J14J67p4Q4q1j41J7J60k48L3P5m1K16l96J52K03j84J16
$$ 103 117 32 180 -52 -145 -166 -52 115 41 125 44 -97 -80 80 -168 -135 -60 -101 115 -281 -129 74 -110 6
1300FK12k84jJ65L0q4Pk61J89J81j8Kj84J40K24o26L60k6K39k98j15J03J19M6
$$ 6 218 -66 -67 98 128 44 51 -210 -21 160 142 144 -40 100 324 -302 58 32 271 -27 -142 -39 80 126
1324A26k58K42m5j48J37m16K12L67l20J19j51M0r8Q5K96q0J42p8ol46J76N8k03
$$ 126 -132 110 65 -83 54 -362 -150 217 -103 16 -135 -95 -193 -108 188 108 250 172 166 -180 -4 54 -149
1347a49Q0O8j07J25J35k14J78k66P1k55J53J29j38K91m96J29K21j26J27K08j05
$$ -149 -69 -1 -108 17 152 -62 116 -150 -79 -334 -181 -52 -190 101 -395 -266 -45 -171 -44 164 59
1368E9P1j1l3k75J38k6L41n9k24K37n03K51j7M0k5K51k80L9j9K09k46J8P6J49
$$ 59 130 119 86 -189 -51 -77 264 205 -19 218 -285 -34 -51 -11 -36 215 -65 -26 -45 164 -82 -64 12 161
1392A61o4m45L61k2J93k67l5j21L76l41K33K8p4k91K11L9QR2R6k5j91O9r8k92
$$ 161 97 -348 13 -9 184 -83 -118 -239 137 -204 29 57 -17 -308 -97 -58 -50 42 138 113 -78 -9 -107 -399
1416c99M97k02J1J60K95l63n9J99k38N13k03n76O5K56O6j25L56r2n4k48k76N89
$$ -399 98 -104 -93 67 362 -1 -60 139 -99 414 211 -365 -300 -44 22 -103 253 161 107 -141 -417 172
1438A72j7j95m0K84k00q1K58l40L18R9j72j26m5r5j3K37m2P8K6ml22M73k97r6
$$ 172 155 -40 -80 204 4 -77 181 -159 159 258 86 -40 -85 -180 -193 44 2 80 106 102 -220 253 -44 -140
1462a40J7N0J15J62j05j48J60l28J83L0J9j33K22k31O8J20j92J9J62k15NK7J37
$$ -140 -123 -73 42 204 99 -49 111 -217 -34 -4 15 -118 104 -127 -59 61 -131 -112 50 -165 -160 -133 4
1485DKl8P5p2K19j6j81q6K46k94L15k11OJ60l7j50P1OJ07r4k9R2k24N2j89N84
$$ 4 6 -32 43 -29 190 174 -7 -93 153 -141 174 -37 -31 129 92 -58 13 19 126 32 3 95 -129 -77 -266 318
1511C18l43k76L36J3j42m5j7J6L24m52K42J30k78M73l53q9J48N9L0k49K71l1k06
$$ 318 -25 -301 35 48 -94 -139 -156 -140 184 -268 -26 104 -174 299 -54 -143 5 64 94 -155 116 85 -121
1534a21J91j50J22Q3j61N4n3J7J10j10K8k1k41J40J33R1q9j14J63P7j25JK49k85
$$ -121 70 -80 42 125 -36 18 -35 -18 92 -18 10 -11 -252 -112 21 112 23 -91 72 149 24 25 274 -11
1558a1j0p6P7J24k27J53J87m6k48J83j22r6K7K5l2K92j39r7j26m0L82k20j32K4
$$ -11 -21 -97 -20 104 -123 30 217 171 -77 106 -16 -112 -85 -60 -92 200 61 -36 -162 -202 180 -40 -172 -148
1582a48J03K37k05P6K6j56L25k13J07j59J01j30Q2L8M5O4k37k05K2L49l45K27
$$ -148 -45 192 -13 63 89 -67 258 45 152 -7 94 -36 46 84 129 193 -44 -249 -227 122 -223 4
1604Dl0J19k28k33M27j8M1nj2j0j90P2K5j77K80j89K2l2j00j79P25m02j26M00
$$ 4 -26 93 -135 -368 59 41 82 77 65 55 -135 -63 -38 -215 65 -124 -102 -134 -234 -413 312 -90 -216 184
1628A84k00K31k74j8NJ54j19R2j6j74R7l0J94j03J0l45M28k97M60k30l6k78M22
$$ 184 -16 215 -59 -77 -72 82 -37 55 39 -135 -38 -68 126 23 33 -312 116 -181 279 49 13 -265 157
1651A57k24L56l59L2J32n20M80k32K59j54j44Q3nK76k09R7j00J94j33P2p4L4J13
$$ 157 -67 289 -70 -38 94 -426 54 -178 81 -73 -217 -134 -139 137 -72 25 -75 119 -14 58 -16 18 131
1674A31m1P3J93m94o9J87l3m4J59m9J5j1K10l51L00j25j16M23k28l4j46K70L9
$$ 131 90 163 356 -138 -207 -20 -53 -97 62 13 28 17 227 -124 176 51 -65 358 130 96 -50 220 259
1697B59k61j40J76p2K18j87o2k67N32l26MqJ34m7J31J47k21L0p1J11K0lj85J91
$$ 259 -2 -142 34 -38 180 -7 -69 -336 196 -130 -126 -134 0 -47 84 231 10 40 -31 80 100 97 -88 103
1721A03j20J18j20J14j31L1k8l2J98j26Q2n4OQk6J15J53l21L0L59l30r4J10M12
$$ 103 -17 101 -19 95 -36 -5 -33 -65 133 7 89 35 41 49 23 138 291 -30 0 359 29 -65 45 457
1745D57l76m08M48J26m50M50j00j02p2m0J58l60L25j93J02k10M05j04J01k48K18
$$ 457 81 -327 121 247 -203 247 147 45 -27 -67 91 -269 56 -137 -35 -245 160 56 157 -91 127
1766A27q5k45K41j7n3r9K27j64L56l32nJ52O4j86k18L52J7k98M05j14p7R4m6k34
$$ 127 42 -203 38 21 -32 -131 96 -68 288 -44 -49 103 167 -19 -237 115 132 -166 239 125 48 142 96 -138
1790a38K45P5j0k83J02n0K61q1M5k30O3K95k83J15L7n7j65n5J49MR8j55p7p3J4
$$ -138 107 182 172 -111 -9 -59 202 121 166 -64 -1 294 11 126 163 106 -59 -114 35 39 137 -18 -95 -168 -154
1815a54L9P5k11K35J00l05K31n9M1k07Q0J38L9r2K07k16Q8k67L30p8l21N33k7
$$ -154 -115 -40 -251 -16 84 -221 10 -49 -8 -215 -135 3 42 -50 157 -59 29 -238 92 14 -307 226 199
1838A99j73j14J52L64o26M8R9Q8L4q1K96l21J55j34l21L95J27m92O28l27Q5J41
$$ 199 26 -88 64 428 -198 -150 -51 37 71 -10 286 -35 120 -14 -335 60 187 -305 323 -4 81 222
1860B22j45k28L05j19j4J0j29J52k53Q9R6L76l16q0r4J27MK0N9J63k05k76P4J48
$$ 222 77 -151 154 35 21 31 -98 54 -199 -110 -14 362 46 -34 -128 -1 3 23 82 245 40 -236 -162 -14
1884a4JR4j69J87j00N8j02j13K63j50JK9q0J67r4o7J92r6m9j06J52j04R8J82j83
$$ -14 -13 81 -88 99 -1 57 -45 -158 105 -45 -44 -15 -95 72 -22 -89 103 7 -42 -148 4 -100 -2 180 -3
1909cL23m79r9K48nl3j47J50O0pq3j7M43n75L13j28m9K3J24J06J04p9k46J02j80
$$ -3 320 -159 -258 -10 -15 -48 -195 -45 15 8 -75 -92 351 -224 89 -39 -88 -65 59 165 269 190 -56 46 -134
1934a34K50K0l75J52k73L98m6r3L05j65Lo2M6qJ45j03r7K8J04Qp9j34K08j84j48
$$ -134 116 136 -239 -87 -360 38 -8 -101 204 39 42 -20 26 18 163 60 -37 -9 95 103 24 -110 98 -86 -234
1959b34L91l44J72Jq8K41l78J52q3PK26J48k66L28k94k00K26j2K3p7K1j79N80
$$ -234 157 -187 -15 -14 -102 139 -239 -87 -170 -163 63 211 -55 273 -21 -221 5 -7 16 -61 -40 -219 361
1982C61m71J31j24K33J45l48J35p9J37k58L76m10J75K3j24K25l2k53K49J23P3
$$ 361 -110 21 -103 130 275 -73 62 -17 120 -138 238 -172 3 26 -98 127 95 -158 91 214 287
2003B87m04l5J95k4K9k70L02Qj19q0N09k83j95n5PK23n7k89K70j79J99O5j69k8
$$ 287 -117 -152 43 19 48 -222 80 88 -31 -111 398 115 -80 -135 -128 95 38 -251 19 -160 39 104 -65 -93
2027i3J24K2Qk2J70N1j16j40J04pJ67m02P6Q9rK2J73k75K14j62pP7j44m5K67k7
$$ -93 31 53 61 39 209 260 144 4 108 101 268 -134 -58 31 22 44 217 -58 156 -6 -13 64 -80 -125 142 115
2053A15l6o2PJ06Q7j94k41K4J59N7j27K20k11N1l45M41j86L15k30R6O8K76m55
$$ 115 79 17 24 130 217 23 -218 -194 -35 22 -105 115 -96 -45 -390 51 -135 180 -50 46 114 390 -65
2076f5O4r0J13P0j23j66L00j94K0J52R8r8J75l71rR8J19J04j51J77j67k2j40J97
$$ -65 -1 -91 22 92 -31 -197 103 -91 -71 81 179 81 256 -115 -124 -26 93 197 46 223 56 34 -106 91
2100I1j51j7M3K02k84M10n18L26j56J1L8K34r1k76l4J90oJ12o4j33K6J13p5k49
$$ 91 -60 -77 -34 168 -116 294 -224 102 -54 -43 -5 229 138 -138 -172 18 12 124 60 -73 -47 66 -9 -258
2124b58J76L29k05l4J43m32M08r7p8p9R0k4j13J63R1L2j45p9Q3j37J79J71J33
$$ -258 -82 247 42 8 151 -281 127 30 -48 -127 -37 -61 -174 -11 80 112 -33 -112 -29 -166 13 184 317
2147C17m28J55o3q6Q8p5J90l5r5j04L60m3j35k23RM56j18J56m47J13j98M5r5K80
$$ 317 -111 44 -19 -105 -17 -92 98 63 -32 -136 224 181 46 -177 -168 288 170 326 -121 -8 -206 -161 -256 24
2171B4k20rL72j28j3J87j82K1R0r6J00l8K9l2l18r9L71N0k02P5q0J64j52J6OO
$$ 24 -196 -205 167 39 26 213 31 52 142 46 146 108 137 105 -213 -312 59 109 -93 -18 -98 66 -86 -70 -64 -58
2197e8J69Q3j09j9n0q4p0O8j36J86K8j68J71K80l11J60J35j86k4J67m07J46J0
$$ -58 111 194 85 66 16 -68 -138 -70 -206 -20 8 -160 11 291 -20 140 275 89 65 232 -175 -29 -19
2220a9O6J11j48M4p8J51J32k27J14k17j89K62k02K19o6p9Q1O8P3k70J37K00j96
$$ -19 47 158 10 54 -24 127 259 32 146 -71 -260 2 -200 19 -47 -126 -45 23 96 -174 -37 163 -33
2243c3J51j22k9J45Ql49M96m7j15j60J12j55J50K18l43Kk4M9j07L43l50J74K60
$$ -33 118 -4 -33 112 120 -229 267 220 105 -55 57 -98 52 270 -73 -71 -95 -46 -153 190 -160 14 274
2266B74k68P6r1m7JJ52Q6k31k03J2L45k48RK05l27K15k36J78J46k99J75JJ35j10
$$ 274 6 82 -9 -56 -55 97 183 -48 -251 -239 106 -142 -133 72 -255 -40 -276 -98 48 -251 -76 -75 60 -50
2290e0J18j90K71k04Q7Q2j24K0o4N7q5Mj2k3K02j61J56m0J9k13J46k6J59m02J99
$$ -50 68 -122 149 -55 32 114 -10 10 -54 3 -82 -78 -90 -113 89 -72 84 44 63 -150 -4 -30 129 -273 -74
2315g4l1J46r9j24M90k20k21J51J7p8R3j70J08N4j87M1L85l97k82M96k17J96J16
$$ -74 -105 41 -58 -182 308 88 -133 18 35 -43 50 -120 -12 42 -145 -104 281 -116 -398 98 -119 77 193
2338A93n53K35r3M40j52k41Q4KL10m7l92K52N7k00J62j42J55K7o3k5Q0j48k3K35
$$ 193 -360 -125 -218 222 70 -171 -87 -85 225 178 -214 38 95 -105 57 -85 70 97 34 9 89 -59 -82 153
2362A53k02J53r8l21K56j08l2L73r3K44k24n5j22J47l35K25J48J57l88J28K13
$$ 153 -49 104 6 -315 -59 -167 -199 174 81 325 101 46 -76 71 -264 -39 109 266 -122 6 219
2383B19j22m8j76J33r6p7K68j03q6N2l1r2j84J83J20N9q0Q4K7k15K65j61j86J09
$$ 219 97 49 -127 6 -90 -167 101 -2 -88 -36 -67 -159 -343 -160 -40 19 -61 23 50 -165 100 -61 -247 -138
2407a38o4J3J54R3k88J09M3J05L5Q2j39j2J7Oj24N5O2k8P8l6j13K74l82J10m4
$$ -138 -202 -189 -35 58 -230 -121 -78 27 62 144 5 -7 10 16 -108 -53 9 -19 59 23 -90 184 -198 -88 -132
2432a32L07q4K25l31OL3K42m9m06L98l71L68j48P1Mj89j21K81k12OR9l7P9Q5l16
$$ -132 175 91 316 -15 -9 24 266 217 -189 209 -162 206 58 129 133 -56 -177 104 -108 -102 -3 -40 39 124 -192
2457a92J78L9j41J66J50R1j09j15N1j46q9r0J56J21kk18J73n3Q7j7Q0O0k75J82
$$ -192 -14 25 -116 50 200 291 182 67 118 -28 -117 -207 -51 70 68 -150 23 -30 57 40 120 180 -95 87
2481H7l58L85j64J04K41o68J70R9K37p9J42j55j78lL51k29J3Q8j55K02Q2q9k00
$$ 87 -271 114 -50 54 295 -373 -203 -104 133 54 196 41 -137 -140 211 -18 -5 83 -72 130 212 123 -77
2504g7K23j16noKL97l68k98J63J00p5L32l89L52l11L13O7k72m17K03L02l80L38
$$ -77 146 30 25 19 21 418 50 -248 -85 15 -60 272 -117 235 -76 237 304 32 -385 -182 120 -260 78
2527G8k54Q0L63m10K25o4J9M3p8J6o7J41J22o9J44m75N27j54j98P3p3m7J48j18
$$ 78 -176 -96 267 -143 82 18 37 80 2 18 -49 92 214 145 289 -186 341 187 -11 62 -11 -58 90 -28
2551b8j59O13m25q8J67k22J61Q8j00q8q3K42R3l43n6M4J9J66j88L04m3q4J61k58
$$ -28 -187 426 1 -87 80 -142 19 107 7 -81 -164 78 171 -172 -228 -184 -165 1 -187 117 74 -10 151 -107
2575a07J81l89K9M72j01q1k20K58R8j47Q6M9r0j44L42l26j57J43J68Q5j81p2j62
$$ -107 74 -315 -286 186 85 4 -216 42 140 -7 79 128 38 -106 236 -90 -247 -104 64 149 -32 -104 -266
2598b66N09j61J10k18j76J67M1l0p8O3k74L67Q4J0j17L8j12P9K9n6j99o6K95j04
$$ -266 243 82 192 -26 -202 -35 6 -24 -102 -39 -313 54 138 148 31 69 -43 36 65 9 -190 -256 39 -65
2622f5qK26J5oo5p8J60k09r8J31J18R2k26J94l36J64J57j53Q9m0j23jn9J84k27
$$ -65 -73 153 168 162 97 19 179 -30 -128 3 121 213 -13 181 -155 9 166 13 102 62 -61 -62 -121 63 -164
2647a64k7J72l4L5M2q7nL05l72M04l71L40n8j16M1j30Jj22J79k17J29Q4j9j20
$$ -164 -191 -19 -53 -18 24 -63 -68 237 -135 269 -102 238 180 64 105 -25 -24 -146 33 -184 -55 29 10 -110
2671a10K38l04L52l91K90J3r2o7mL04j26l9m1OR8m9Lj72K7L06l25K24j45L0o9
$$ -110 128 -176 176 -215 75 88 -4 -71 -75 229 103 64 23 29 127 78 81 -91 -64 242 -83 141 -4 26 -43
2696d3O8k20L53J28l58n5m3j27K80J25Q1k87J05O4l10J97j33M1J16P3j3j3j7K63
$$ -43 25 -195 158 286 -72 -127 -170 -297 -17 108 189 -98 7 71 -239 -42 -175 -134 -18 55 42 29 12 275
2720B75m38qK13O7K18m01l0L8m6J11p9o0J90R1k08Nj5K38R9k81JJ87j30j15J86
$$ 275 -163 -171 42 109 327 -74 -104 -66 -112 -1 -80 -140 50 141 -67 -62 -77 161 260 -21 -20 167 37 -78 108
2745A08l01L40k0l33NK48O4R9j66k51K86N3l8M7J9k77K84k62M9j68K32j10j43
$$ 108 -193 147 127 -206 -201 47 111 210 44 -207 79 132 94 141 160 -117 167 -95 -46 -214 18 -92 -235
2768b35L90m43M5J18J2Mo6J6L16n3j48j96K94O2k45J45l8k88L90m1K6K76k56R
$$ -235 155 -288 -243 -125 -113 -109 -175 -159 157 104 -44 -240 54 116 -129 16 -22 -310 80 39 65 341 85 94
2792I4j0j52L1J60k49J25l3j19J0K25K7j8L19m16k6L2P1q2j37J15k2O2L4j18J1
$$ 94 84 -68 -37 123 -126 -1 -34 -153 -143 82 109 91 410 -6 -32 0 71 -11 -148 -33 -55 7 41 -77 -66
2817f6j84L40p6O4o1j89K04J66j66l51L83k13P0K84j71J1M4l6l56K00O0N1J07
$$ -66 -250 90 14 78 17 -172 32 198 32 -319 64 -149 -79 205 34 45 89 53 -303 -103 -43 8 115
2840A15k63M9J96k27J46N3N4r4J47l1M1k24j47J64J17k70J95K28J3l82M45k63
$$ 115 -148 -99 97 -130 16 69 123 29 176 145 186 -38 -185 -21 96 -174 21 249 262 -120 325 62
2862F2n04N43L1j65R5q6r2J88p2Q6K05j58j91K20J8j61J81l21J65n0L7j3l13N51
$$ 62 -442 101 132 -33 62 -24 -116 72 0 86 291 133 -58 162 180 19 200 -121 44 -6 31 18 -295 256
2886B56J42j33m52r4J13J88J01m15J49J72L12k21j34K55l16o5J95n6Q0J10k73
$$ 256 398 265 -187 -281 -168 20 121 -294 -145 27 339 118 -16 239 -77 -142 53 -3 77 187 -86
2907h6RJ37Lj26J20m2K1J78k62J82j66o2k99L97j83N3j2K28K04l33Q7j06P8L0
$$ -86 -77 60 63 -63 57 15 36 214 -48 134 -32 -94 -393 4 -179 -126 -138 90 294 -39 48 -58 20 50
2931E0k21J07Q9l08K61L27l40J3j67K64N2k00R2k7J85j90j28J28m2J79J30o7m75
$$ 50 -171 -64 25 -283 -22 305 -35 -22 -189 75 127 -73 19 -8 177 -13 -141 -13 -55 124 254 187 -288
2954b88M15o0R7k38N7m2o0K90j21N3k75K68K5l1J05q6j47K71K2l58L9O6j9l1p9
$$ -288 127 67 164 -74 -17 -59 -119 171 50 103 -172 96 121 90 195 109 -38 233 255 -103 -64 2 -17 -48 -127
2979a27K0Q4k37N66l09k18K81l57J29L81k86O9j51J66J72l04n3L44p0j42m3J2
$$ -127 -107 -23 -260 306 -3 -221 60 -297 -168 213 -73 -4 -155 11 183 -121 -174 170 100 -42 -85 -73
3001g3K4K44l48J30j5J03k32j0K6J74J65l53J54j67N9k2L36k50p6m8K12k01j12
$$ -73 -49 195 -153 -23 -38 65 -167 -177 -151 23 188 -165 -11 -178 -119 -141 195 -55 -131 -179 33 -168 -280
3024b80L49Qj14Q6O2m49K92J01J50k68K80k90K44m60J65J34m5R7j84J40l8J61
$$ -280 69 77 -37 49 111 -338 -46 55 205 -63 217 -73 171 -289 -124 10 -35 62 -122 18 -20 141
3046A41n8j40J1J44r8J0K4rNq7j85J71J08n2k33J53K65j42J9R5k81N6j20J05o8
$$ 141 83 -57 -46 98 0 10 34 25 30 -57 -242 -71 37 -15 -248 -95 170 28 47 142 -139 -83 -203 -98 -166
3071a66J96j60J61O7m8M4P2k13p5K3J73k43J78J56j27P5k11L46k28J1ml06K98
$$ -166 30 -130 31 98 50 94 166 -47 -122 -99 74 -169 9 165 38 113 -98 248 20 31 27 -279 19
3094A9J41j12K46k97m9M9L2o3J12k94Q6K60j1o2p0l11P9MqP7j69L16l2J79L20
$$ 19 160 48 294 -3 -52 -3 29 -34 78 -216 -130 130 119 57 -13 -324 -245 -241 -249 -172 -341 -25 -57 122 442
3119D42m30k01K61j61J51J59l55n3R8K08k10J81J33M3l55J70o1O9o9k1j0K92k02
$$ 442 12 -189 72 -89 62 221 -134 -187 -89 119 -91 90 223 266 -89 81 20 89 20 -1 -11 281 79
3142G9l82L80M3j24J00N9k21k58L04R9q3qO5j72QJ78p7j4J30j8j80J75J02nj87
$$ 79 -303 77 120 -4 96 155 -66 -324 -20 79 -4 -12 53 -119 -111 67 -10 -24 106 88 -92 83 185 180 -7
3167gk36J03J44J34j81M52k37j1l50k8J00lK84k00k57L97j24j79L44j04k50L27
$$ -7 -243 -140 4 138 -43 409 172 161 -189 -217 -117 -120 164 -36 -293 104 -20 -199 145 41 -209 118
3189A18j74Q8j54J76q5j93K40n9L99l84M8J93k5j69R5K36l05J22k44K78j22j20
$$ 118 -56 32 -122 54 -31 -224 16 -43 356 -28 20 213 188 19 114 350 45 167 -77 201 79 -41
3211d1M7rq8rL03j14k22J63K59m84K17N7o1K23k54j21OJ54J02k25K06p9O7j66
$$ -41 6 -3 -91 -100 203 89 -133 30 289 -195 22 79 18 241 -13 -134 -128 26 128 -97 109 30 97 -69
3235f9j06L59k55Q6R6m4j1l88K88L1K12k53k06K91l4L0n7K69k16j18K2K00M2P4
$$ -69 -175 184 -71 15 111 67 56 -332 -44 -13 199 -54 -260 31 -3 27 -30 239 23 -95 -73 127 169 243
3259B43n31L11M3j36k38J17J22Nj28K09j20J59m4j80K57Q4k13j10L17n9k0J76
$$ 243 -288 23 66 -70 -308 -191 -69 -64 -192 17 -103 56 12 -168 89 173 -40 -150 167 108 88 264
3281B64k73q8k19O2J3K55j20K21j4j75K21n5K08k67J75j24j70Nj36K17P2K1N8
$$ 264 -9 -97 -316 -254 -241 14 -106 115 101 -74 147 92 300 33 208 84 -86 -81 -217 0 72 93 151
3304A51m23K82R9j17m2j41J01J69n9K22m02J88J12k55J40J5m6p7k22J44J13Q6
$$ 151 -272 10 109 -8 -50 -191 -90 79 20 242 -160 28 140 -115 25 40 -6 -83 -305 -161 -48 38
3326C8O5m15J19K81q7J57p2N1k38L58k68P6PM9l7j42J82k28J35J4j55J35Lj76
$$ 38 103 -312 -193 88 1 158 86 137 -101 257 -11 65 72 121 84 -58 124 -104 31 45 -110 25 28 -148
3350a48k5O7K21q0N8l12M08l58K6L27k97j71M61p0j84K53m9p2j98o0j57L79N8
$$ -148 -173 -106 115 35 93 -219 189 -169 -143 184 -113 -284 177 107 -77 176 127 55 -143 -203 -360 19 77
3373G7l51N3K24r7k8J51l46J65L23r5j39J48K6J9k32K79j46q6J09J32j00k78L21
$$ 77 -274 -221 3 -94 -122 29 -317 -152 171 76 -63 85 111 130 -102 177 31 -55 54 186 86 -192 129
3396A29K2k12K52k8j6m9j11J98j86K39q3j04m9J54k85J44p7O2JJ5K19k46l3J26
$$ 129 151 -61 191 163 147 98 -13 185 -1 238 155 51 2 156 -129 15 -62 0 1 16 235 -11 -44 82
3420H2j62pP9k1l9j41J80m0j60j69L77k01J51N8q5J63J80j40j28J12k11M8j23
$$ 82 -80 -87 -8 -29 -68 -209 -29 -69 -229 -398 -21 -222 -71 -13 -98 65 245 105 -23 89 -122 -74 -197
3443a97O7K53k4j68J34J01l23K73j00n2J30L4J22k72M9J34j56p2J33j65K06j08
$$ -197 -130 123 99 -69 65 166 -157 116 16 -36 94 128 250 -22 27 161 5 -67 66 -99 107 -1
3465ak03J69m1J98k55J51n4k09L42k72K81K9k32J98k82J60j83j8J72Q6R0l0P0
$$ -1 -204 -35 -76 122 -133 18 -36 -245 97 -175 106 135 -97 101 -181 -21 -204 -222 -50 36 126 96 166
3488A66k49Q7j07n0J24J69k46j32K97Q8l77J97j57L29l9j8q7j24Q6l1j34K31M0
$$ 166 -83 4 -103 -153 -29 140 -106 -238 59 147 -230 -33 -190 139 100 82 -5 -129 -43 -74 -208 23 63
3511F3k42J65O3J2q7J6P8j9l40J71J4J57j43P1Q4Lj11q6K00N8Qj91N9o9j75K69
$$ 63 -179 -14 49 61 -26 -10 68 49 -291 -120 -106 51 -92 -21 63 66 -45 -131 69 127 135 -56 3 -66 -241 28
3537B8K18j67m2J2r1K59o6p8J20j72k94J78K68j63j84O0J45M7j78P4j5J03J5l6
$$ 28 246 79 37 49 -42 217 151 73 193 21 -273 -95 173 10 -174 -114 31 78 -100 -26 -41 62 77 41
3561D1j0Nm9m6k2J48J68k5l44L49k52k10L61j38L9O5j51K7K42j61n4K8K49r7m20
$$ 41 31 36 -13 -59 -81 67 235 210 -134 215 -37 -247 114 -24 15 80 -71 -44 198 37 -17 11 260 163 -257
3586b57J81J14k03j30L80l13N8K76L3q1j25J55N4j02l3Oj02J57j14K50l69q4M98
$$ -257 -76 38 -165 -295 85 -228 -170 106 139 58 -67 88 142 40 7 13 -89 68 -46 204 -165 -249 249
3609B49j33o1j2K6L0Pj22j5j15J30O5K31l31J19Q0l45J99J9L5j31P1K56j61j58
$$ 249 116 55 43 69 99 106 -16 -31 -146 -16 49 280 -51 68 148 -197 2 21 56 -75 -4 252 91 -67
3633f7l3p6L79r4l63L97l04K69j34k24L76r7K53l77J95k45M0rN2j55M58m55K98
$$ -67 -100 -176 203 109 -254 143 -161 108 -26 -250 126 29 282 -95 100 -145 -105 -114 -62 -217 241 -214 84
3656H4o7J92m7k00M23k48k05J71J14k51L7P3k38L64k60J27l4K30k86R1P5k43o1
$$ 84 17 209 162 -38 385 137 -68 103 217 -34 3 76 -162 202 -58 69 35 265 -21 70 145 -98 -159
3679a59K39L4j81O7o7j06K2L92l16K07m4L26k90q6q0j5O9r9O0J43O1m8p9k72J35
$$ -159 80 114 -67 0 -67 -173 -151 241 -75 132 88 414 124 38 -42 -57 12 -87 -27 116 177 129 50 -222 -87
3704h7J92l1K48k87J17k18P6j27L17m83L10J88k13j5r8K14k5l0k2kJ21p1p6L14
$$ -87 105 74 322 35 152 -66 10 -117 200 -283 27 215 2 -13 -111 103 78 48 26 24 145 74 -2 312
3728C12l44J60j55l2K09l15L36j45p3P8j65K59n6j53K28j08n5N8j56J83r2LR1
$$ 312 -32 128 -27 -59 150 -165 171 26 -47 31 -134 125 69 -84 144 36 -19 39 -117 66 -26 -23 68
3751F8P1k0j19J27l89K80P2q1p3K23j10j87n5K45l93J74M5L17j82M5r0n6J5K53
$$ 68 139 119 0 127 -262 18 90 9 -64 159 49 -138 -193 52 -341 -167 -122 195 13 58 -32 -88 -73 180
3775A80j05Q4j96r0K27j16J34m8k17k0L10q8k10J99J51j11l4R5m4K71l14N6k21
$$ 180 75 159 -37 -127 100 -16 118 70 -147 -167 143 55 -155 44 195 84 50 145 101 372 58 114 -107
3798a07K7P5j64P2K4K86j21m1j99K02p6J00lj97K2L3K36j7l68M2o0R2P3J9N5k72
$$ -107 -80 -5 -169 -97 -73 213 92 51 -148 54 -22 78 75 -122 -100 -67 169 152 -216 -174 -234 -142 -69 -50 5 -267
3824b67K60j28j26M30m95N02k74K17j04Q1J25j27k13P4j8K8m7j19K34M2j21j97
$$ -267 -7 -135 -261 169 -326 176 -98 119 15 96 221 94 -119 -45 -63 -35 -82 -201 33 75 -46 -243
3846b43N7L12q3Q6k26R8l7JJ13p9J77j7l04K30J45k73J07l9j69O9J57k61O0J15
$$ -243 -186 126 43 129 -97 1 -36 -35 78 -1 176 159 -145 85 230 -43 64 25 -144 -75 82 -179 -119 -4
3870dr9L2L8N1Q1k28j0j08M65m7j68n0j33R7J26k04K96k38J14K16r9r1L8k09K79
$$ -4 -103 -71 -33 18 99 -129 -139 -247 218 171 3 -47 -180 -83 43 -161 135 -103 11 227 128 37 75 -134 145
3895A45k51L23J6j73j69K27l87J42L81l76j05K13l0O5J26n1K4k29K05q9n4Q7J09
$$ 145 -106 217 233 60 -109 118 -269 -127 254 -122 -227 -14 -44 21 147 96 120 -109 96 7 -47 40 149
3918A49o3k47L17k00R6j17J31n2M9j59j07L36k3R2j42p2m3p7M7K59l44K81n2l9
$$ 149 86 -161 156 -44 52 -65 66 14 63 -96 -203 133 110 202 60 -12 -55 -132 -85 174 -170 111 59 20
3942B0O1l52K40k29M21K4k96J42q0p4Q1j52K14m9q6J66l0j36J50j11K96j95R8
$$ 20 81 -271 -31 -260 161 185 -111 31 -49 -123 -42 -194 20 -29 -115 51 21 -115 35 -76 220 25 123
3965A23kj31K7N5K33l12r1M05k32J07K6k6l19M6k94O8K93l7J24q6o9m5j9J54n6
$$ 123 121 -10 17 72 305 -7 -98 307 75 182 208 182 -137 -91 -385 -317 -24 -61 63 -23 -92 -137 -156 -2 -58
3990e8J61k31N0P7Q6m6J33J41n09L88l57N1K62k89q2K21J79j93O9l6p2j32M77
$$ -58 103 -128 -78 -1 85 39 172 313 -196 192 -165 -114 148 -141 -223 -2 177 -16 53 17 -55 -187 290
4013B90l74N4K08j8k04mp9J37J95k21k4J45R1k36l1O0Q6m22L36q4O8K18K8J06
$$ 290 -84 -30 178 160 -44 -48 -127 10 205 -16 -40 105 196 -40 -71 -11 75 -347 -11 -95 -27 191 219 325
4037C25l02J70j57J76k04L8J2jo0l8q6j30K09R6k04K29o7J37j24j51Q9r5K48M
$$ 325 23 193 36 212 8 46 58 57 -3 -41 -127 -257 -48 48 -156 73 6 143 19 -132 -43 -138 110 114
4061A14l57R7P9L44j98K8k8O9j10R0J01k18j17M1R7LP8j08j3p5J72j88J09K1M1
$$ 114 -243 -146 -67 277 79 107 79 148 38 128 229 11 -106 -65 32 35 113 5 -8 -83 89 -99 10 31 72
4086G2k49J49J1p2J34n2j73M12k49R1j99m0K82o3O1p0M4j63K85j53k57N4L2J02
$$ 72 -177 -28 -17 -89 45 -7 -180 232 -17 74 -125 -165 117 54 115 45 89 -74 211 58 -199 -145 -113 -11
4110a1Q4J06j19L8k85Q5L43k06m7J31k21L46j34k03OJ72r6J34m4J2o1O0p9k1J29
$$ -11 73 179 60 98 -187 -102 241 35 -12 119 -102 244 110 -93 -87 85 -11 123 79 91 30 90 11 -10 119
4135A19k64K05J90k09j5k6K07rk49nJ69K12j47j36r6r0O7K45m00L81O2j32k93
$$ 119 -145 60 250 41 26 0 207 198 -51 -56 113 325 178 42 -54 -144 -77 168 -232 149 211 79 -214
4158b14l8J68P6r0j1J28q4j10L21k19K24k76J6LM38k56q7J26k7p5L8m9K03l17
$$ -214 -252 -84 -8 -98 -109 19 -65 -175 146 -73 151 -125 -109 -106 332 76 -11 115 88 13 51 2 205 -112
4182a12Q8R5q3J27k30oj03L56k27p6P7r3K84j24kqm1J96K64o56L30P3k06j71J16
$$ -112 -24 71 -12 115 -115 -121 -224 132 -95 -171 -94 -187 97 -27 -29 -37 -78 118 382 -274 56 129 -77 -248 -132
4207a32O3J16Rj1n9k63K48k5j30J23O7m3P6L0l29J86m0L16l95J79J88j34j32J02
$$ -132 -69 47 56 45 -14 -277 -29 -54 -184 -61 6 -37 39 69 -260 -74 -114 202 -193 -14 174 40 -92 10
4231A0L2q6J3M2lk23J75j58L02j33k9J45n6nk3j28r9K48j9j99K95L3k07J79l77
$$ 10 42 -44 -31 11 8 -215 -40 -198 104 -29 -58 87 31 26 3 -125 -224 24 5 -194 101 134 -73 106 -271
4256b71L87j67R6j46K07m73N05l22M59k27l92M06N3j71j74M2M6N7N9o9OKl2K04
$$ -271 116 -51 45 -101 106 -367 138 -184 275 48 -344 62 115 -56 -230 -188 -142 -85 -26 -95 -89 -87 -119 85
4280H5j15q3J72m2Q4m72P23l93K6j54O5n2O7M79m18p7K55r9l4L8j64J03J87m09
$$ 85 -30 -113 59 17 101 -371 352 -41 -15 -169 -104 -156 -89 390 -28 -105 150 51 17 55 -109 -6 181 -228
4304b28N1J03P3J6m5m6P7n5J36P6qj21M7j17j85p4L92r8J30k92J74jj09K35j12
$$ -228 -177 -74 -1 15 -30 -76 1 -54 82 158 150 29 76 -41 -226 -300 92 -6 124 -168 6 5 -104 131 19
4329A9m0J67j52K67m11J99K09m33O17k65Q0j65K47l05j72L42k90J01L2l7J76J2
$$ 19 -21 146 -6 261 -150 49 258 -175 442 177 257 92 339 34 -138 204 -86 15 47 10 186 198
4351A98k25O3K3J44p5M9Pj53J40j27j19J30J94k70J49j20K31j21J7q7N4k20K15
$$ 198 -27 36 59 203 128 177 184 31 171 44 -75 55 249 -21 128 8 239 118 135 48 102 -118 97
4374I7l24L51j01j55Q6J08j25L8n4J52R4l5L9Pk27K59j79n1K59n1j82k83J42l6
$$ 97 -227 124 23 -132 -46 62 -63 -25 -79 73 167 132 171 178 -49 210 31 -20 239 188 6 -277 -135 -171
4398a71K9J25k52J79j9j4K12m55M03Lj72P5P9m2lj56J52mJ10j64J51j39Q5L4j28
$$ -171 -142 -17 -269 -90 -109 -123 89 -366 37 40 -132 -57 22 -20 -23 -179 -27 -31 79 -85 66 -73 12 46 -82
4423h2K7nP7k1k2o7K58k07Q8j05P0j22J77r1k71L03m6J68J62k49O2K2J51j46j29
$$ -82 -55 -60 17 -4 -26 -93 165 -42 46 -59 11 -111 66 -25 -296 7 -39 129 291 42 104 126 277 131 2
4448Bj39J95rL3q2j23O1j16L90O3k02j16K73l45J77O3l0n1PN7J7j22p9J5M9K3
$$ 2 -137 58 49 82 0 -123 -62 -178 212 275 73 -43 230 -115 62 125 95 44 51 108 125 3 -76 -61 -12 11
4474A1J94k17p8J55k46K52k50L38j59O2l04K08q0p4L53l37K78j10K35l5m37M39
$$ 11 205 -12 -90 65 -181 71 -179 159 0 62 -242 -34 -114 -188 165 -172 106 -4 231 196 -241 198
4496A98k66J35j11J50k46O0Q0k4k3p4K18j78K73lj50j12j99J30q4L35k11J79L18
$$ 198 -68 67 -44 106 -140 -80 0 -24 -47 -121 97 -81 192 189 39 -73 -272 -142 -226 109 -102 77 395
4519C95k87M9j30k88K76k8k7J36QJ02j86j06R0J04n9k15j82L34P3J84k90J40r8
$$ 395 108 157 27 -261 15 -13 -40 96 104 206 20 -86 4 108 49 -166 -348 -14 59 243 -47 93 -5
4542ek44M03j08o1J09p4J8qM5o5P3j72k5MO4j1J52j85j75L42k78K15J19k55J98
$$ -5 -249 154 46 -15 94 20 38 30 75 10 83 -89 -114 -110 -46 -57 95 -90 -265 77 -201 14 133 -122 76
4567G6k07J39j28J13j53K07j97K90q9k1k30J1J92k2j33K31j06J20q4K45k28j49
$$ 76 -131 8 -120 -7 -160 47 -150 140 51 30 -200 -189 3 -19 -152 79 -27 93 9 254 26 -123
4589a23K1J94K53m99J04n6L10j85R7r9o7j26J45j32K89j05J22n8r5k31K60k11
$$ -123 -102 92 345 -154 -50 -106 204 19 116 17 -50 -176 -31 -163 126 21 143 85 -10 -241 19 -192
4611a92M27l4l34r7J29j57K70J1J45q9K6J0j46O6J6k73P6L3J46j39j91J84RL03
$$ -192 235 201 -133 -230 -101 -258 12 23 168 79 105 115 -31 35 51 -222 -146 -113 33 -106 -297 -113 -104 199
4635A99j17k64n6J51n7m7N9N1K3L74m43M52n37P8P8J29j4n3j53J92j68J69J92
$$ 199 82 -182 -238 -87 -144 -191 -132 -81 -58 316 -127 325 -212 -134 -56 73 59 6 -147 45 -123 46 238
4658B38k68M5j37K09p7l32N97q4m6k13K00q6k6J60l44J16j82O46k75r0K1K02j04
$$ 238 -30 15 -122 87 10 -322 275 191 145 -68 132 46 20 180 -164 -48 -230 416 141 51 72 274 170
4681A70q1J08l65L2J42q5J56j05n4J48j66j76M10j5rJ26j60J91m15K32K65l00
$$ 170 89 197 -168 -136 6 -79 77 -28 -82 66 -100 -276 134 119 110 236 76 267 -148 84 349 49
4703D9M06m19j27k3L41l25K4jJ15j6K2j29J93q7Q7j59k07L4K53R9k54P9L3j10
$$ 49 455 36 -91 -114 227 -98 -74 -75 40 24 46 -83 110 23 110 -49 -256 -222 31 130 -124 -45 -12 -122
4727a22R5NJ45j07k23O4L45k51R3p6j13J2N1J37n36N52M7k92M5L34j06j31J16
$$ -122 -27 -22 123 16 -207 -143 202 -49 44 -32 -145 -133 -82 55 -481 71 118 -174 -129 205 99 -32 84
4750H4j33M1L2P0m6j09j03K37Mm2k7j45L96k35K1K3j23o4J65K77j80p5q7jj81
$$ 84 -49 -8 24 94 48 -61 -164 73 77 35 8 -137 259 24 45 68 -55 -119 46 323 143 68 -19 -20 -201
4775b01M56k21K05k24K15l83J68m3J01J9l00M07j72J52j85j4J2J35j51o3L10k42
$$ -201 255 34 239 15 230 -153 15 -28 73 92 -208 199 27 179 -6 -20 -8 127 -24 -87 223 -19
4797a9k44J85J80q7k41N80l93m01K54J54R0K42l17n4j70J72K09k75J39j22m7J17
$$ -19 -263 -78 102 15 -226 354 -39 -440 -186 -32 58 300 -17 -71 -241 -69 140 -135 4 -118 -165 -48
4819d8k25M58l7j33J85j80j4p5J3J96K2k24j52K60Kk73K64o7J25J20j83j88J35
$$ -48 -273 185 148 15 200 20 6 -69 -56 140 162 -62 -214 46 48 -225 39 -28 97 217 34 -154 -19
4842a9k48L92j24j27Q5p5J50k3j1j99L17n5p4K31k88j91J79J46p9m2j37K02o3
$$ -19 -267 125 1 -126 -41 -116 34 11 0 -199 118 63 -11 220 -68 -259 -80 66 -13 -55 -192 10 -53
4865e3j57J91j2N4M5q1j66K52K2r2j15J40l7Ll94N05j09J2J32j60J03jM6l94L21
$$ -53 -210 -19 -31 23 68 -13 -179 73 95 3 -112 28 -9 -6 -400 105 -4 8 140 -20 83 82 128 -266 55
4890E5j98J97L6K04j5k54P6n4m8K01j07j75K7l2K51j26j28j2L1J64N4p1k11P2
$$ 55 -143 54 90 294 279 25 101 47 -1 200 93 -82 -55 -87 164 38 -90 -102 -71 93 147 76 -135 -63
4914f3J96j61J87k3K0l01p2J82K39l46L1J87J16j19k45J90K23l9j44l4j5Q7r6
$$ -63 133 -28 159 136 156 -145 -217 -35 204 -142 -111 76 192 73 -172 18 241 202 58 24 9 96 0
4937@o6r9J48q0L2J20q9kJ69j87K2K04j66K1j02J43j21Q8J93n39J32j5J69J37
$$ 0 -66 -165 -17 -97 -65 55 -34 -36 133 -54 -32 172 6 27 -75 68 -53 35 228 -311 -179 -194 -25 112
4961A12q1N2R8j11m7k54J35P8J88l46J36j61J01L83k69J89j22p6q4R7j74J45O
$$ 112 31 83 181 70 23 -231 -96 -18 170 -176 -40 -201 -100 283 14 203 81 5 -79 18 -156 -11 -5
4984eR8j12J89j84p3j97L83j39j86J37m0O0K34k00j08R6J75O8l9j81m2K47j44
$$ -5 93 -19 170 -14 -87 -284 99 -40 -226 -89 -129 -69 165 -35 -143 -47 128 196 157 -24 -66 181 37
5007C7m6M8k5j9m1J63m25K73K08m88O00o4j34nm8J23ll32J51l19J52P4L39K2l11
$$ 37 -9 39 14 -5 -46 117 -308 -35 173 -315 285 221 87 82 34 157 154 -178 -27 -346 -194 -120 219 241 -70
5032g0K97l17J38k6N4L4O8j2n7k0m34M59R1j69jj05j29L37k59J65M6k40M8J64
$$ -70 227 -90 48 22 76 110 178 166 109 89 -345 114 205 36 35 -70 -199 138 -121 44 90 -150 -102 62
5056F2k00L7J31j7K59k04j68l6K23J27N9r8l36K1N82m71Q6J73n06M63l5l88J41
$$ 62 -138 -101 30 13 272 68 -100 -136 87 214 273 175 -161 -140 442 -29 57 230 -276 187 152 -236 -95
5079i5O0R3Q6l74K39L7o2P2j56J28r0k6L01n48M30rJ10l64K42k6j88J91j74k3
$$ -95 -35 58 144 -230 9 46 -16 56 -100 28 -62 -88 213 -335 95 86 196 -168 74 48 -140 51 -123 -146
5103a46m7J43j25K93j09j32k29M26j36K09j23OP4J40m09J52Q8J19j64Q0l64K83
$$ -146 -193 -50 -175 118 9 -123 -352 74 -62 147 24 30 104 244 -165 -13 75 194 30 110 -254 29
5125B9K94l00k4K02M5k55M7j7k06P2m7Q5j6l7J26m9N8j65J83l6m1O9Jn9QN9J89
$$ 29 323 23 -1 201 246 -9 38 21 -185 -113 -160 -75 -91 -128 -2 -51 7 -158 25 -11 -52 17 18 -41 -33 26 215
5152B15j01kn2P0k30NJ01j0K96j9k76nk41J50n5R5J00l9p2R6k23mK71k2J17j54
$$ 215 114 112 60 130 -100 -95 6 -4 292 273 -3 -8 -249 -99 -154 -59 41 2 -70 26 -197 -201 70 48 165 11
5178A1O0k07m0j05L87p1Q2j86K2L3m8p5P2j28L78k15J24l55R9L10o8k61J21LJ39
$$ 11 71 -136 -176 -281 106 35 117 -69 -47 -14 -62 -137 -65 -193 185 -30 94 -261 -162 148 80 -181 -60 -57 82
5203H2l39K06K98j19J40m62K44j08J05j92L43L5k92j56L37m4q3j33Q2K0L3O4Q0
$$ 82 -257 -51 247 128 268 -194 50 -58 47 -145 198 233 -59 -215 122 78 -5 -138 -56 -36 -3 61 141
5226A41k28R3K19j68k15JJ98K1k33J73K55m94K94n6J35J02j80j18j55K42J9J41
$$ 141 -87 6 225 57 -158 -157 41 62 -171 2 257 -237 57 1 136 238 58 -60 -215 27 46 187
5248A87j13k97L36K12m67R3K05j65j97K14N7j20j59J48N7j04j09M37K9l96J85
$$ 187 74 -223 113 325 -142 -49 156 -9 -206 8 65 -55 -214 -66 -9 -113 -222 215 244 -152 33
5269C3j79q6L91m55L31p5o2j79J6L34m1J95j52k69L13j17K19k61L36j13j69M6
$$ 33 -146 -232 159 -296 35 -40 -102 -281 -265 69 28 223 71 -198 115 -2 217 -44 292 179 10 56
5291E6r5jj85M55k44j01K93j22k24Q4J24J91o1k4r5k49J62rj46J61p1L04l9l4
$$ 56 -39 -40 -225 230 -14 -115 178 56 -168 -84 40 231 170 146 51 -198 -36 -45 -191 -30 -101 203 164 130
5315A30j6l78L10k5J45l25J14l2kM0o1J88l2o0j42J29O4j0k88J96L48j41j87j08
$$ 130 114 -264 46 21 166 -159 -45 -77 -79 -39 -100 88 56 -4 -146 -17 47 37 -251 -55 293 152 -35 -143
5339a43J13N3Ln8K48k10j69J99l98L99j8J34qN8K3k33N7k86L85k65O4O4k37K18
$$ -143 -30 23 26 -32 216 6 -163 36 -362 37 19 153 145 203 226 -7 50 -236 149 -116 -52 12 -225 -7
5363gJ18o0p2J9J26j63J12k03j13K89m8J23j41K23m11L39j17l8o5L00k43n1J20
$$ -7 111 51 -21 -2 124 -39 73 -130 -243 46 -2 121 -20 203 -208 131 14 -24 -89 211 -32 -83 37
5386C7l0l8m2M4J5P8k49L02M6l63M13k93J17K36k27k98M14Ln24L13J84l7j58N2
$$ 37 7 -31 -73 -29 -14 64 -185 117 163 -200 213 -80 37 273 46 -252 162 165 -359 -46 138 101 -57 -5
5410eN8n1M8q7j80K43L6p0j65P7j44K69K45k68j42P4Q3q0K94k32N0P8p5r0N4m45
$$ -5 53 2 50 -37 -217 26 62 -8 -173 -96 -240 29 274 6 -136 -62 21 -59 235 3 53 131 56 -34 20 -425
5436d25L94o9l1L74l14j83O6K50k03K25L8q4l25L0J94N6P4k07l9J62O9m5j34L96
$$ -425 -31 -100 -131 243 -71 -254 -188 62 -141 84 122 38 -287 -257 -63 -7 67 -140 -179 -17 52 7 -127 269
5460B69m07K57n9j66M7K33Jlr8k36J02M5j8L9K46n3j35r7N6j08O8K9L9j8N2j80
$$ 269 -138 119 60 -106 -59 174 175 172 74 -162 -60 -15 -33 6 252 199 64 -33 23 -85 -17 12 51 33 85 -95
5486i5O6K35j83q5o9J04l3n7l3J16J50m55N63n01P0K30j19P2J14k83J77K26j19
$$ -95 -29 206 23 -62 -131 -27 -60 -117 -150 -34 116 -339 224 -277 -207 23 -96 -24 90 -193 -16 210 91
5509I1j09K02j48OJ74m53L51N6l19L29l83Q2J78J1Q8j77Lj95n2J85j9K11k27L05
$$ 91 -18 184 36 42 216 -237 114 170 -149 180 -203 -121 57 68 156 -21 -18 -213 -265 -80 -99 112 -115 190
5533A90k05j20J55J11k30Q6J18l85N39n84L32p8N5R9j02K3M5r8K57M6n51K33P6
$$ 190 -15 -135 20 131 -99 -13 105 -280 259 -325 7 -71 -16 83 -19 4 49 -49 208 254 -297 -64 12
5556A2Po9J8M5K01k02J77j70oj75L50R0j84j88j81L88rk70O2j24J20o3L19q3O5
$$ 12 19 -50 -32 13 214 12 189 19 13 -162 188 278 94 -94 -275 113 104 -166 -104 -228 -108 -171 148 65 130
5581A30q7j72j75J30r7L03Rj42r8K16k72j25L64J65k11J70J50m14j6J11K7j90
$$ 130 43 -129 -304 -174 -271 32 41 -101 -199 17 -255 -380 -16 149 -62 108 258 -156 -172 -61 -34 -224
5603b24O4R7k7K86l32o1L2k30M08P2k12J55j37j15J51j02J48L1r1j71J35L71m09
$$ -224 -160 -63 -90 196 -136 -197 -165 -395 13 85 -127 28 -109 -224 -73 -175 -27 4 -87 -258 -123 248 -161
5626a61K07k21L73m2M5l52J77q1J68o8K8J28k12m4k27L96R6j37m2j74K16K7K0
$$ -161 46 -175 198 156 201 -151 26 -55 113 45 73 201 -11 -55 -282 114 210 73 31 -143 73 100 120
5649A20krj96J66m90N04J51n69K71lK24j78P2j31K26p8l2m7M7M1j16m7kJ35n7
$$ 120 118 109 -87 79 -411 93 244 -325 -54 -57 167 -11 61 -70 156 78 46 -1 46 87 -29 -76 -78 57 0
5674@Q9J70j81j06R4J12N1k93J73k16l4K34J10k20k14L52j2m7J1R2l8j70J8j25
$$ 0 89 259 78 -28 66 178 229 -64 109 -107 -141 93 203 -17 -231 121 109 62 73 165 127 -43 -25 -150
5698a50M00j52j38q4K00k64K94MJ33j18l3j30J99r7j56L6n5K66k2k23J09J38k59
$$ -150 250 98 -40 -124 76 -188 106 110 243 125 92 -38 161 64 -92 -56 -111 155 133 -90 19 157 -102
5721a02J78n1o3J18j58j3K10K31l70k2J59j66M6p5mJ82l29K96J83m02K51J48l53
$$ -102 76 25 -38 80 -78 -91 119 350 -20 -42 117 -49 -3 -78 -82 100 -229 67 250 -152 99 247 -106
5744a06J33K29k38j73O9m9K0m1J17K20j95j87K74o1ok37K48j15K26j78o4J84j20
$$ -106 27 256 18 -155 -86 -135 -115 -156 -39 181 -14 -201 73 12 6 -231 17 -98 128 -50 -114 70 -50
5767e0K15j30j34J54m7q4J54j52N3j40J63P1O9j12j03J44m2J93q4k94L77k86o6
$$ -50 165 35 -99 55 8 -76 78 -74 -21 -161 2 73 142 30 -73 71 29 222 138 -156 221 -65 -131
5790a31N6o7L43l02O8J08k80K17j43Q7P0K42m08K02j55J1J50j32J09J55n56L55
$$ -131 -75 -142 201 -101 -33 75 -205 12 -131 -44 26 268 -140 62 -93 -82 68 -64 45 200 -356 -1
5812arM0q1M5j47J24K25j70k1K10q7m14L70k88J08P5J04L3o0k52M10l55J60O4
$$ -1 -10 30 -51 -6 -153 -29 196 26 5 215 128 -286 84 -204 -96 -21 83 116 56 -196 214 -141 19 83
5836H3p6q2P1L5J40m7j6K7k64R6J14j07n3j92K71j76J82J94k19J48k00J47k40
$$ 83 7 -75 -4 31 171 124 108 135 -129 -33 81 -26 -79 -271 0 -176 6 200 -19 129 -71 76 -164
5859a64K67j05j69L11k1k06K44Qj97K47l35L59p9n85L27K46M5q8k15%R9K68j23
$$ -164 103 -2 -171 140 119 -87 157 165 -32 215 -120 239 160 -425 -98 148 193 105 -110 -110 -11 257 134
5882A34p1k08R9J42k6n1j06J68M4r8O1P1k22K23l18MJ23M04l74j85J77oJ02j49
$$ 134 63 -145 -46 96 70 19 -87 81 125 27 88 159 -63 160 -158 -154 -31 373 -1 -186 -9 -15 87 -62
5906f2k48M8M49o6k89J09J14j5j04J43J9p2l7m7J6R8j68J34j06J79j58J95l31
$$ -62 -310 -262 187 121 -168 -59 55 40 -64 79 98 26 -11 -58 -42 56 -112 22 -84 95 -63 132 -199
5929a99M51k52k5j9j80P4J84l1j53K81j00l1L2P9j43P9j44J94j26j26j4J86k25
$$ -199 252 0 -25 -44 -224 -150 34 3 -150 131 31 0 32 111 -32 47 -97 97 -29 -155 -169 17 -208
5952b08J96K13j29O0r3K2N7j61J1R8N5p0j02k26p6K67K24p9L1k18L63j43j19r6
$$ -208 -12 201 72 132 39 61 118 -43 -32 66 121 51 -51 -277 -353 -86 138 59 90 -128 235 92 -27 -123
5976a23J74j1P6k60L5L6k3K54k73n4L32j13K25m01N9kk28J94o3K1J7O4l57O82
$$ -123 51 40 116 -144 -109 -73 -96 158 -115 -169 163 50 275 -126 -67 -69 -297 -103 -166 -145 -128 -64 -421 261
6000B61j45k71J58J51k19Rj65K80k03K16J69j66j28q0J87k24J35M2J49j49Nr7
$$ 261 116 -155 3 154 -65 -56 -221 59 -144 72 241 75 -53 -133 54 -170 -35 7 156 7 12 -85
6022h5M4J88N1m4j70J67m71K80O0n8L30m75m9K54J87k86J15J07j47J06l34P8Q7
$$ -85 -41 147 198 154 -16 151 -320 -40 20 -38 292 -183 -232 22 209 -77 38 145 -2 104 -230 -152 -65
6045f5K49j72Q4m4N5k53K98R4j86j31p7k5K8O4R4r0J38j22J04j37k98M61j00L1
$$ -65 184 12 96 52 107 -146 152 246 60 -71 -148 -173 -145 -81 13 -77 61 -61 43 -94 -392 69 -31 0
6069@N9O1M4p2J1k09L6J73j77k66M69j09K33l30k9J78P7J76l99k91K77Jm3L9J27
$$ 0 59 120 164 92 103 -106 -70 103 -74 -340 129 20 253 -77 -106 72 149 325 -74 -365 -88 -87 -130 -91 36
6094C6n3o4Q8j91J07K60q8N7N6j05j31p1j07J20o1k12N66m5k89K54k68J45j63
$$ 36 -17 -81 7 -184 -77 183 95 152 208 103 -28 -99 -206 -86 -147 -359 207 162 -127 127 -141 4 -159
6117a59J51K1P9j75K25q8J89k77K39k12k8K8j44K29l72M24P1k45P6p5MJ39m62
$$ -159 -8 13 92 -83 142 54 243 -34 205 -7 -35 -7 -151 78 -294 130 201 -44 32 -43 -39 100 -362
6140c62N90j15k40J12M2J26k29K43k05j08L36j69j07L01p9k24R0M1m0j28k2j33
$$ -362 228 113 -127 -15 27 153 -76 167 -38 -146 190 21 -86 215 136 -88 2 43 3 -125 -147 -280
6162b80K87M2Q6j45p8o6K50j57Oj17K32N6J35l79J45L6j90r7J77N6l39M29j17
$$ -280 7 49 135 -10 -88 -154 96 -61 -55 -172 60 116 251 -128 17 53 -137 -234 -57 -1 -340 89 -28
6185b8k43K77N1j50k70K79j71O72l09r8j17l09O66m14j48K82J99j88n9J6J12j31
$$ -28 -271 6 57 -93 -363 -84 -255 417 108 10 -107 -416 250 -164 -312 -30 169 -19 -78 -62 50 -81
6207h1l6J3J76n2J77j4k80J69q6l2P2l29K64o1K7oj4K60q9Q6l74M99J79p56K84
$$ -81 -117 -104 72 20 197 183 -97 72 -14 -46 26 -303 -39 -100 -73 -79 -93 167 78 164 -210 289 468 -288 -4
6232dk10J10J70j71L09J72m35K69l17J72L16m49J14Q9R6l28j01J36L27Pj43n1
$$ -4 -214 -104 66 -105 204 376 -59 210 -107 65 381 -68 46 135 231 -97 -198 -62 265 272 129 78
6254G8J70k22L07q1j71kk76L16o2p7k9J44k00j21J44J77n7K60m31K35q2LP9J40
$$ 78 248 26 333 252 81 79 -197 119 57 -20 -49 95 -105 -226 -82 95 38 298 -133 102 20 23 102 242
6278B42k82j69M73n35K39k7k3J63p5Q5o5l59L59J46j76j1K62j41J27L5k72k2j34
$$ 242 -40 -209 264 -271 -32 -59 -82 81 6 91 26 -333 26 172 -4 -15 247 106 233 268 -4 -26 -160
6301a60L05l98L20J77r3j1o2j28J7J04J8%j72n7K39o0J27r3k61R5J07j58L26j70
$$ -160 145 -253 67 244 151 140 78 -50 -33 71 89 89 -83 -140 99 39 166 73 -188 -93 14 -144 182 12
6325A2k59J5M43k16k17P9K33Q1j95K2Qj23J23j78K83PL2j07K4ro9N2m1Mm39P14
$$ 12 -247 -232 211 -5 -222 -143 90 171 -24 -2 6 -117 6 -172 111 118 150 43 67 58 -11 41 0 4 -435 279
6351B79m07P1N9K48j25k57J19n9OK98k40j2j32K99j59j96J06L10j64R4J7j64k0
$$ 279 -128 -57 2 250 125 -132 -13 -72 -66 232 -8 -20 -152 147 -12 -208 -102 208 44 138 155 -9 -29
6374b9N1q8K56p0j35J76Km15J91J58j60q9K38k88L79m1l45n6K94J01j79J13l09
$$ -29 22 -66 190 120 -15 161 163 -252 -61 97 -63 -152 86 -202 177 136 -209 -265 29 130 -49 64 -245
6397b45N64l36J47k68K01o1p6M6j36K57j62KJ56k37R8P4J35K00l99m8L67l49j07
$$ -245 319 -17 130 -138 63 2 -74 -28 -164 93 -69 -67 89 -148 -50 24 159 359 -40 -88 279 -70 -177
6420a77m4K24K59m17K29j44J22q9o7L75l97J43K57l14j25K71k58J48J24J9j29
$$ -177 -221 3 262 -155 74 -70 52 -37 -104 271 -126 17 274 -40 -165 106 -152 -4 120 139 10
6441A0K5K33j92J50n25J66J39Q6j77j58K01J33k20J24J10j67K4j41K34k61P0O6
$$ 10 35 268 76 226 -299 -133 6 92 -85 -243 -42 91 -129 -5 105 -62 -38 -179 55 -206 -136 -70
6463g0l7K58j2q2k87J25J19K06l03J32M7o0k78J83j38R0J33k75N14k82J28k56
$$ -70 -107 151 139 57 -230 -105 14 220 -83 49 96 36 -242 -59 -197 -107 26 -249 265 -17 111 -145
6485a45o3P4r6K82J19l00M88l33L3P5j78J92k35J01R0O6j66R0j07R1j18N5j67
$$ -145 -208 -134 -230 52 171 -129 359 26 59 134 -44 148 -87 14 104 170 4 94 -13 78 -40 15 -152
6508a52j72L53r9M27p54N52k14m4M3K72j52K2pp9L5j59k8Q1n1K09n6J23j49j44
$$ -152 -324 29 -70 357 -397 155 -59 -103 -60 212 60 82 75 -4 31 -128 -156 -75 -126 83 27 150 1 -143
6532a43q1L41o4k52L26p1l13n5L25L0j38J99k35L6%J3j63L18j56K63j00j17O8
$$ -143 -224 117 53 -199 127 56 -257 -312 13 43 -95 104 -131 -95 -95 -82 -245 73 -83 180 80 -37 31
6555C1j4N5k54K12p4j15J10J48k45J60J27r1K72m22N31l35k06k11K15K30m6J66
$$ 31 17 72 -182 30 -44 -159 -49 99 -146 14 141 50 322 -100 431 96 -110 -321 -106 124 78 244
6577B44k12n7J17L2k39R7n6J19k25L2P4K93l66P4J80n6m2j54Q9O0M06m61M9K62
$$ 244 32 -25 92 124 -115 -18 -74 45 -180 -148 -74 219 -147 -73 107 51 9 -145 -56 4 410 -51 -2 260
6601B60l65R2j04m6L01o1j34M7r3K28j13N5o8R2n9q3J32j76O7J22O6l00J96r5
$$ 260 -105 -13 -117 -163 138 77 -57 -10 -103 125 12 67 -1 91 32 -51 81 -95 -28 94 160 -140 56 -39
6625c9K75j69M3k11j08J23J38K39m76M7M50k82j35P5Q4j37m5R9j59N8L2J14k23
$$ -39 236 67 110 -101 -209 -86 52 291 -185 -138 312 30 -105 -30 54 -83 -128 -29 -188 -130 -98 16 -207
6648b07K16o6R3k15J24J6J06J20k28PN8Q6J2k1M6k85K51k55K70j10k11N19l03
$$ -207 9 -57 36 -179 -55 -39 67 187 -41 -34 24 110 122 101 147 -138 113 -142 128 18 -193 326 23
6671B3N1j57M9j56K04q1j3j65K09J53j73o3J16M1m9J64k54K67j39j05j14K35j11
$$ 23 74 -83 -34 -190 14 -67 -80 -245 -36 117 -56 -119 -3 38 -11 153 -101 166 27 -78 -192 43 -68
6694f8rK41J3o5j21J06k06n0M18l04N9K58k23r9R5J51l68J89J3j10K05j36j99
$$ -68 -77 164 177 112 -9 97 -109 -159 259 -45 14 272 49 -50 45 196 -172 17 30 -80 125 -11 -210
6717b10k0L14r8Ooj39K20j31J23j67K67l22J04J39j03J0N8l75K93L2R7J70j20
$$ -210 -230 84 -14 -8 -14 -153 67 -64 59 -108 159 -163 -59 80 -23 -13 45 -330 -37 -5 92 262 142
6740A42l19J06M5L4k29K93q0K84m10M2M00m42R3n4K3J22j66J82l05L23M8j02Q9
$$ 142 -177 -71 -26 8 -221 72 -8 276 -134 -92 308 -134 -41 -95 -72 50 -116 66 -239 84 132 30 119
6763A19Pk6j17Q8m34O62l22Q1k67N8J18r8l4K3P8o5j11L09J71l31P7K08k15j28
$$ 119 126 100 -17 71 -363 299 -23 58 -209 -151 -33 -131 -165 -142 -64 -129 -240 69 240 -91 -14 194 -21 -149
6787a49K2L88j16m1m89J76M77o13K58Q4J39k68L17k09l3J44q0K61k77k79P2L50
$$ -149 -127 261 145 104 -385 -209 268 -345 -87 -3 136 -132 185 -24 -57 87 7 268 -9 -288 -216 134
6809A34l48J92P7l96N85k40Q3l02J9K21j24K8M1j94L28l75J56M78n91J29J7N9
$$ 134 -214 -22 55 -341 244 4 87 -215 -196 25 -99 -71 -30 -224 104 -271 -115 363 -228 -99 -82 -23
6831b3N6J34k29l8o7L96k31J60l18J43p0N1R7J55j84j02JJ0R0n0j25J69k9K80
$$ -23 33 167 -62 -100 -167 229 -2 158 -160 -17 -87 -36 61 216 32 -70 -69 -59 31 -19 -144 25 -4 276
6855B76j23l99L46k43M48k94j00J87k6l8r9L9r4m1J66Mr9o6m8L17l05K13J76K5
$$ 276 153 -246 100 -143 305 11 -89 98 72 34 -65 -26 -120 -161 5 9 -90 -156 -204 113 -192 21 197 222
6879B22m39M30l05K68K3m66L68j42j52K50m9q4K03j78K44k38J04J75m29J78j94
$$ 222 -217 213 -92 176 199 -267 101 -41 -193 57 8 -76 127 -51 193 -45 59 234 -195 -17 -211
6900b11J07J69k08K53j42J09J66l2j29Q9j82p6qO2j59L33k01k40J44J42J20k12
$$ -211 -104 65 -143 110 -32 77 243 211 82 171 -11 -87 -95 -33 -192 141 -60 -300 -156 -14 106 -106
6922a06L23l08j11L97p0o0j11K06k47M9m3P4R2Q3k52K07j67L96p82M34k38K43
$$ -106 217 -91 -202 195 125 65 -46 160 -87 -38 -81 -7 85 168 -84 123 -44 352 -430 4 -234 9
6944Il9L6j22J40O8j60J39o9N6J10p0l02K53l8j4qq5l7L05l06L93m35J10K38k
$$ 9 -30 6 -116 24 92 -68 71 2 58 168 98 -204 49 11 -3 -11 -96 -133 172 -134 259 -176 -66 172 170
6969A70l29P9j3j1J43l4P1m0o6L1J19j02k57M35l07l3J09J13p2J08j61L04j69
$$ 170 -159 -80 -93 -104 39 5 76 36 -30 1 120 18 -239 196 -111 -144 -35 78 6 114 -47 257 88
6992H8k00J21J99j77K4k32J54N1K4M9j0k6p1m7O4r3M01k62O3k78K66J03k94L64
$$ 88 -112 9 208 31 55 -177 -23 28 52 101 91 65 -6 -53 11 -82 319 57 120 -158 108 211 -83 281
7016B81r7p4j33l0O5j01O4J95k92K74k42R5j6j29L93j89j81K5R3J9k3j78L27l11
$$ 281 184 110 -23 -53 12 -89 -25 170 -122 152 -90 5 -11 -140 253 64 -117 -92 1 20 -3 -181 146 -165
7040a65j10N48r6j72j47J30K30l18L7K84Nm83J19K15q4r8k21N12k43K53k85K18
$$ -165 -275 273 177 5 -142 -12 218 -100 -63 221 226 -257 -138 77 -7 -105 -326 186 -57 196 -89 129
7062A29q4q8j50J26N7N9J8k76L80j20J58J23m22N0j51K1r7M9k6K56J28r8K2J22
$$ 129 45 -43 -193 -67 -10 49 67 -209 171 51 209 332 -90 -40 -191 -170 -267 -218 -244 12 140 42 64 186
7086A86L0k23q7l2j04K38L3qn9k08J31Q1j46M00q2j82KJ46l58L32j08O1j00J2
$$ 186 216 -7 -94 -126 -230 8 41 33 -26 -234 -103 -22 -168 232 150 -32 -30 116 -242 90 -18 43 -57 -45
7110d5K13j30j10j06N0J87j17J51j64J58M7r6j60K5J27J80k3j78k19Q2K16lk46
$$ -45 168 38 -72 -178 -128 59 -58 93 -71 87 134 38 -122 -97 30 210 187 9 -210 -128 88 85 -161
7133a61J99ll76M38k6k07n0L47q2O6O5m74K17l9L1QO6J18k59J33l11L94qj52K10
$$ -161 38 35 -341 97 71 -136 -186 161 79 145 210 -264 -47 -86 -55 -47 19 137 -122 11 -300 94 86 -66 144
7158A44k99rL56r4k13K1k1K19j09q9K72k86J31o9P2R3j63K95k67o5R4o2L4q1L23
$$ 144 -155 -164 192 98 -115 -94 -115 104 -5 -94 178 -108 23 -46 26 119 -44 251 -16 -81 13 -49 -15 -96 227
7183B27k56Q8J4q1K2q8j6R9J03j09o8J09K14m44J52J20j12l8j92N22j58k42K86
$$ 227 -29 59 73 -8 14 -74 -90 9 112 3 -65 44 258 -186 -34 86 -26 -64 -256 266 108 -134 152
7206A52k08k61J88J72Mj6L3OJ0j5j46j6J25k24J69Q6j81kQ5k97N88k00O8j54N5
$$ 152 -56 -317 -129 43 47 31 64 70 80 65 -81 -97 28 -196 -27 59 -122 -124 -39 -336 252 52 120 -34 21
7231B1j07p1J82N3J66l24O3o7%j69K30J17O5j11J4J30N4k53K56l21K48q0K2j91
$$ 21 -86 -157 25 78 244 -80 -17 -84 -84 -253 -23 94 159 48 62 192 246 -7 249 -72 176 96 118 -73
7255g3j8L25n43L38p6Mj02L61m85K23O9j87k48N91j38QKR4k89K14jj26j2N8J37
$$ -73 -91 234 -309 29 -47 -43 -145 216 -269 -46 23 -164 -412 179 41 49 51 145 -144 70 69 -57 -69 -11 126
7280A26k6q9O6k65L62k44L4J88l40K75m9M8j91O2Lj21L18k71J32Q8N1j25k59K21
$$ 126 100 11 77 -188 174 -70 -36 152 -188 87 38 86 -105 -43 -40 -161 157 -114 18 106 157 32 -227 -6
7304fj71L37k73p8J8j5K54J13k41L95l46k9j8J16r1p2K25k64L13J11k82K24j70
$$ -6 -177 160 -113 -191 -173 -188 66 179 -62 333 -13 -42 -60 56 -35 -107 118 -146 167 278 -4 220 50
7327E0K4n7o1O3J15l23r3L83k12R8J31N3j36k91J29k03M48k36p2M27n18K18K27
$$ 50 74 17 -44 19 134 -189 -282 101 -111 -13 118 171 35 -256 -127 -330 118 -118 -190 237 -281 -63 164
7350A64j87j0j7R7j48J89k64L17j4j18K01k07M6K5r1k13L28mp5L36m05J19r7j6
$$ 164 -23 -33 -50 47 -101 88 -176 141 127 9 210 3 49 74 -17 -230 98 94 19 355 -50 69 -28 -44
7374d4o2J63l0o1K8OJ77j76rK90n90P1L13k15L0J41k94Q6J57j32jK14O8k54N2
$$ -44 -106 57 27 -34 -6 0 177 1 -8 282 -308 -237 76 -139 -109 32 -262 -176 -19 -151 -152 62 130 -124 -72
7399g2Q1j10J21J69j24Q8l64K51k4J81m01M22j41n6J13k98K65r2L33k02j85j9
$$ -72 9 -101 20 189 65 153 -211 40 16 197 -204 218 77 21 134 -164 101 9 342 140 -45 -64
7421f4JO2q2o7J53k08J93R6J10m45K40K5r6J61K0j34k6J38kj81j18K26N3P9j54
$$ -64 -63 -1 -83 -150 3 -205 -12 84 194 -251 -11 14 -82 79 99 -35 -61 77 75 -106 -224 2 55 134 -20
7446b0M3q7N8j83J24K0J03J26l57M4J15N4k49L92l37QN5J69j93K93l79R7K70j35
$$ -20 23 -64 -6 -189 -65 -45 58 184 -173 -129 -14 40 -209 183 -154 -146 -91 78 -115 178 -201 -104 166 31
7470C1k25K83N9j72r3K53j41L26k58p2J54j84q0K67O3m21JlL05N2j68k3P0O8j09
$$ 31 -194 89 148 -24 -117 136 -5 321 63 -9 145 -39 -119 148 211 -210 -209 -212 93 145 -23 -46 24 92 -17
7495a7j20MJ94k67L82K3l74Q4K06k62J26J71j25n4J86l89j7L41j82m3n0J95j57
$$ -17 -137 -133 61 -206 176 199 -175 -91 115 -147 -21 150 25 -29 157 -232 -249 92 -90 -133 -183 12 -145
7518a45L9K15k7k08M06m13L79n38J53P4MK26j21K40l19Q4j78O6J4j23L16j39l1
$$ -145 -106 109 82 -126 280 -133 246 -292 -139 -65 -61 165 44 284 -35 49 -129 -63 -49 -172 144 5 -26
7541b6J6k4o3K9J49k05j57L20k49J15J31j73PJ13J38j54J74K1k48J90n7l48J13
$$ -26 -10 -34 -97 -68 81 -124 -281 39 -210 -95 36 -137 -130 -17 121 -33 141 162 -86 104 47 -301 -188
7564a88J24Jn8R1j78J86n9l5M8J41j15qK52j76j44Q2NP2M7k66K83j32L28l88m0
$$ -188 -64 -63 -121 -30 -208 -22 -81 -116 -68 73 -42 -50 202 26 -118 -36 -31 41 88 -178 105 -27 301 -87 -127
7589a27O8J95k14L3J25n4J10%l00O7K80k96K62n31M11K19k17l14L18j43o7K45
$$ -127 -59 136 -78 -45 80 26 136 136 -164 -97 183 -113 149 -382 29 248 31 -283 35 -108 -175 70
7611G0j45o0L1K61n6k75Q4J96o9J6j20Q0J9j37K13k67J66M3k4l2J26l12L46k32
$$ 70 -75 -135 -104 157 101 -174 -90 106 37 53 -67 13 32 -105 108 -159 7 50 26 -6 120 -192 154 -78
7635g8J29J62n3l67K98j34J90K3k22j12K29j66p6L77kl82L40M2n1N2n1r9n1j56
$$ -78 51 213 160 -207 91 -43 147 170 -52 -164 65 -101 -177 200 198 -184 156 198 147 199 148 49 -2 -158
7659a58JJ46Nr6l2o7M02p9J50l65%mQ8J22r3k51J05K85m17J24J9J68J82L6m84
$$ -158 -157 -11 -6 -102 -134 -201 201 122 272 -93 -93 -97 -9 113 20 -231 -126 159 -258 -134 -115 53 235 271 -213
7684b13R2N1r1L10O1k72l7J19P4p6n0O8j33K20j25J81k14M2l8R2j87Q0L32l51
$$ -213 -121 -70 -161 149 210 -62 -99 20 94 18 -32 36 -97 123 -2 179 -35 7 -31 61 -126 -46 286 -65
7708f5q1K49k07L00j66q7P4r4J36k90K64J66j64L5l17J5K33q3J05p5j8K15j08
$$ -65 -146 103 -104 196 30 -57 17 -77 59 -231 33 199 35 70 -247 -232 1 -82 23 -52 -70 145 37
7731C7M4q9j13M8K71k43P7R6l10L35k39J69j48r6K27j54J59K1k67K91p8J15j45
$$ 37 81 -8 -121 -73 198 -45 32 128 -182 153 -86 83 -65 -161 66 -88 71 92 -175 116 38 153 8
7754HK6K96n00M1K21j34k2R6L7q5P6m5J18l1k73R6K34k4l55J74R3j80J34lj95
$$ 8 34 330 -170 -129 92 -42 -64 32 69 -16 60 15 133 102 -171 -75 159 135 -220 -46 47 -133 1 -2 -197
7779a97K12p4j2R1J22k41J42l07K21j0lL14l68K24o4QJ34j87LJ6P2p4o3N1j07
$$ -197 15 -59 -71 20 142 -99 43 -264 -43 -53 -56 258 -110 114 50 58 192 5 8 24 96 22 -41 10 -97
7804i7L56n43L53P3j16j07l1k8J26N9o6q2p9K83j94r6J74J47j86J07L19n95O7
$$ -97 259 -284 69 142 26 -81 -112 -140 -14 45 -21 -103 -182 101 -93 -189 -15 132 -54 53 372 -223 -156
7827a56K22l94N29j58K16k58k21R1MJ78j63J99j10kj6j07K02n4J15pj72o1j12
$$ -156 66 -328 201 43 259 1 -220 -129 -125 53 -110 89 -21 -23 -39 -146 56 2 117 110 -62 -123 -235
7850b35L58o4l7m7p0J77k91j23L49lo5j38J45M9k53L44pj13J15j68K44k26P3n3
$$ -235 123 59 22 -25 -95 82 -209 -332 17 14 -51 -189 -44 5 -248 96 89 -24 91 -77 167 -59 14 -39
7874c9J14q1j0N5k28L17k63PK24k1j76PM6j65L88k21o0K3P4k1j61M79j76j55L1
$$ -39 75 -6 -16 39 -189 128 -135 -128 96 75 -101 -94 -48 -213 175 -46 -106 -83 -9 -30 -191 288 112 -43 -12
7899a2m2l1M8l3n9K64p5k5O7qk43K75r1j35J16Q1k88K33mK39q1j76q1m4Q1N6j05
$$ -12 -54 -85 -37 -70 -129 135 60 35 102 94 -149 126 35 -100 16 97 -191 42 38 277 196 20 -61 -105 -24 32 -73
7926g3p1L53l4l9j83J99j26rl11L08L6OJ48l04K67j53p3n6K75k50J2K46l47K33
$$ -73 -144 209 175 136 -47 152 26 17 -294 14 50 56 204 -100 167 14 -59 -115 160 -90 -78 168 -179 54
7950E4k4J8R9j72O3R6l4j68L63k78j0K50k56Q4J41p3j22K25m64J35N4q5L25k03
$$ 54 30 48 147 -25 38 134 100 -68 295 17 7 257 1 85 226 153 31 256 -208 -73 -19 -104 221 18
7974A8J45k08J20K60n13K63j12K52m35K17k06M87k46J05m9j29J47j18O6j10j00
$$ 18 163 -45 75 335 -178 85 -27 225 -210 7 -199 288 42 147 98 -31 116 -2 64 -46 -146
7995a46J48N1o9k33K49K72l92n1K5K84l1j49n2J5K4J3m9L4J78j43j92L35j11j97
$$ -146 2 53 -16 -249 0 272 -120 -171 -146 138 107 -42 -94 -79 -55 -42 -91 -57 121 -22 -214 121 10 -187
8019a87o2J13J47P7j0N5o2K6M2p3l45J46K90j17k98L19J2k8M0j99K5P1M4P3k33
$$ -187 -249 -136 11 88 78 133 71 97 139 66 -279 -133 157 40 -258 61 73 45 85 -114 -89 -18 26 99 -134
8044a34O2J30j38j12K53j3j7K65m28K48j00k5J45l45J78J9J8j7j10K38J78j70
$$ -134 -72 58 -80 -192 61 48 31 296 -132 116 16 -9 136 -209 -31 -12 6 -11 -121 117 295 125
8066A25o5j34K24k6J34j71J0j96R3q4j49J55j03L00L9Qj49K19j80L9r2J28K20
$$ 125 60 -74 150 124 258 87 97 -99 -6 -90 -239 -84 -187 113 152 160 11 230 50 89 -3 125 345
8089C45k06l02M1P9K6j81K02%J5Q2k02J05k1j1l2K20l41M06k91N0R1O3o4MJ33
$$ 345 139 -163 -122 -43 -17 -198 4 4 19 101 -101 4 -17 -28 -60 160 -181 225 -66 -16 75 138 74 78 211
8114B11k95N4l9Q9K7Q4k66K61k88M13j49p7L2j33J20k39pj22O89l32k7L8RR9J6
$$ 211 -84 -30 -69 20 47 131 -135 126 -162 251 102 25 57 -76 44 -195 -202 -324 365 33 6 44 53 152 168
8139A68l64L46j53k4ML8j78J51n9J19j90J18K12l17L12j03K17k86j68K72J5j69
$$ 168 -196 150 -3 -27 -23 15 -163 -12 -71 48 -142 -24 188 -129 183 80 297 11 -157 115 130 -39
8161c9j68J55J50k41K73L8l90R3o8K71k4l19K1L86N4k43J40m39K19O3K0k2O9n9
$$ -39 -207 -52 98 -143 130 168 -222 -129 -197 74 50 -269 -248 138 192 -51 89 -350 -131 -68 -48 -70 -1 -60
8185f0j19J39o5J4K07m82
$$ -60 -179 -40 -105 -91 116 -366
8191c66
$$ Imaginary data points
##PAGE= N=2
##DATA TABLE= (X++(I..I)), XYDATA
0@%%%%%%%%%%%qJ6j6J6k4L2m0M8n6P0q3R8j16J35j57J81k08K41k79L22l68M17
$$ 0 0 0 0 0 0 0 0 0 0 0 0 -8 8 -8 8 -16 16 -24 24 -32 38 -45 53 -63 72 -85 96 -112 129 -150 172 -196 221
33B21m73N37o04O77p61Q53r51J059j178J308j449J603j773J959k161K382k625
$$ 221 -252 285 -319 358 -403 450 -501 558 -620 688 -761 842 -931 1028 -1133 1249 -1376
50a376K892l185L509l871M273m726N240n824O498p290Q233r372J0785j2597J5016
$$ -1376 1516 -1669 1840 -2031 2242 -2484 2756 -3068 3430 -3860 4373 -4999 5786 -6811 8205
65H205j8421K3611l2583N2383j77172R3659K24092k50794P276J38258m8789r1493
$$ 8205 -10216 13395 -19188 33195 -143977 -50318 173774 -77020 -69744 68514 19725 -71768
77g1768J21927K1387o1683L0581J5164j24265J8487J22418l9017j08915N8169
$$ -71768 50159 71546 9863 40444 55608 -68657 -50170 72248 33231 -75684 -17515
88a7515M9696o5876k9125O4086K2955k9494o214L9735R418l6407j7330K5208J6838
$$ -17515 32181 -33695 -62820 1266 24221 -5273 -11487 28248 37666 1259 -16071 9137 25975
101B5975k257j5682k8137j5413K7877J9561l0413j251N2296k6377q1591L9829
$$ 25975 23718 8036 -20101 -35514 -7637 11924 -18489 -19740 32556 6179 -75412 -35583
113c5583R2909k7493n3330L3776K4439l3244l921K3329q921j2039O906k4578k9420
$$ -35583 57326 29833 -23497 10279 34718 1474 -2447 20882 11961 -78 6828 -17750 -47170
126d7170L1423K9757k8721o594L9592K458l2901L822L1728Q58k0915O318P284
$$ -47170 -15747 14010 -14711 -21305 18287 20745 -12156 -8334 23394 24252 3337 9655 16939
139A6939l0720j5082K8069J0719j6268k126k189j2004J3309K5467j0506j3107
$$ 16939 -13781 -28863 -794 9925 -6343 -8469 -10658 -22662 -9353 16114 5608 -7499
151g499L1548R404m9364q101M9398k490l8720P201J2478k0074j817J8260q65j282
$$ -7499 24049 33453 -15911 -24012 25386 22896 -15824 -8623 3855 -16219 -18036 224 -641 -1923
165a923J5514m530k2886R626K1988j2683q489J8528n099k4559J231J4542K545
$$ -1923 13591 9061 -13825 -4199 17789 5106 -3383 15145 10046 -14513 -13282 1260 3805
178C805n224k730O97l391l712O480R049K838J197l230o724N46O952M42q123J440
$$ 3805 -1419 -4149 -3452 -6843 -10555 -4075 4974 7812 9009 5779 -945 -399 6553 6995 -1128 312
194C12Q489j5854j8543J9038J8617j7554o053J7565j367j2443P673J1132l121
$$ 312 8801 -7053 -25596 -6558 12059 -5495 -11548 6017 4650 -7793 -120 11012 7891
207G891J109N386j3989j3058J4429N427j7796J371J2271j2597r886J5338J0752
$$ 7891 9000 14386 397 -12661 1768 7195 -10601 -9230 3041 -9556 -19442 -4104 6648
220F648o105J382J0385k668j1387M411P200n259j360O75j1479n825J0115K016
$$ 6648 543 1925 12310 9642 -1745 2666 9866 4607 3247 3922 -7557 -13382 -3267 -1251
234a251q715L340J2960m532j3482Q913J6643p691o504J1114r13j4177K59P454
$$ -1251 -9966 -6626 6334 1802 -11680 -2767 13876 6185 -319 10795 9882 -4295 -4036 3418
248C418k346l486J713l140p303N587P483p009J68J3585l037j3115N661J1521k893
$$ 3418 1072 -2414 -701 -3841 -11144 -5557 1926 -5083 -4915 8670 5633 -7482 -1821 9700 6807
263F807o113M753J789q954m657O515m99l695K613k541n333N783N152n019J269
$$ 6807 694 5447 7236 -1718 -6375 140 -359 -4054 -1441 -3982 -9315 -3532 1620 -3399 -2130
278b130J1509J166j3773n07J4924k420j3397L959O455r552o087N509K201r39J636
$$ -2130 9379 10545 -3228 -3735 11189 8769 -4628 -669 5786 -3766 -9853 -4344 -2143 -3082 -1446
293a446J120k476K094N729k656l066R325J370j4157j648J0437j411r091P21P103
$$ -1446 -326 -2802 -708 5021 2365 -701 8624 9994 -4163 -5811 4626 3215 -5876 -5155 1948
308A948j621o383J957M903M21K194j82n867L098N173n891m312P275L510r173n431
$$ 1948 327 -6056 -4099 804 1225 3419 3237 -2630 468 5641 -250 -4562 2713 6223 -2950 -8381
324h381R587M060r143p60R804j661p049J255L209L89P17j318k754Q93L762j361
$$ -8381 1206 5266 -3877 -4637 5167 3506 -3543 -2288 921 1310 2027 709 -2045 -1152 2610 1249
340A249o163M485P186o707p037P605M050o276j910N735J782n465j394L684Q70
$$ 1249 -4914 -429 6757 50 -6987 618 4668 -1608 -3518 2217 3999 -1466 -2860 824 1694
355A694m75L44l687n94N935k883o698L933P926l467q007M247P731l779n473N686
$$ 1694 1219 1563 -2124 -2718 3217 334 -6364 -2431 5495 2028 -5979 -1732 5999 2220 -3253 2433
371B433K554n527j472K069j000k77P59j880r92L023J014l832R56P677j59p900
$$ 2433 4987 -540 -2012 57 -943 -1220 -461 -2341 -3333 -310 704 -3128 -2172 5505 5346 -2554
387b554J985O204l185n127J835K878k223l399P07J117J84K219r08k421M321K779
$$ -2554 -569 5635 2450 -2677 -842 2036 -187 -3586 -2879 -1762 -1578 641 -267 -2688 1633 4412
403D412n650j132P262N44p530q09N844o14o222J335M193j917j603R37p51K07L398
$$ 4412 -1238 -2370 4892 5436 -2094 -2903 2941 2327 -3895 -2560 1633 -284 -1887 -950 -1701 -1494 1904
420A904j064k354J942K754j940l264L402L442m699k652M302m56m145K32K586R0
$$ 1904 840 -1514 428 3182 1242 -2022 1380 4822 123 -2529 1773 1317 -2828 -2596 -10 80
436H0j596p92R64P27J465O20k102J165M171k586m691K753L801k874m268J788K510
$$ 80 -1516 -2308 -1344 -617 848 1468 -634 531 4702 2116 -2575 178 3979 1105 -3163 -1375 1135
453A135l046j790L502R95j727J225M58j416J853J209j838p40K111j74l774m69
$$ 1135 -1911 -3701 -199 796 -931 294 752 -664 1189 2398 560 -180 1931 1757 -2017 -2486
469b486M057n71l748J980K007k349q65K327K55o41N6L44p70oJ586q46j390K651
$$ -2486 1571 1000 -2748 -768 1239 -1110 -1975 352 607 -34 22 366 -404 -410 1176 330 -1060 1591
487A591P28m522M55L965p12l313J125J955j250k715J775J881j803J112J069k046
$$ 1591 2319 -2203 -1748 2217 1505 -1808 -683 1272 22 -2693 -918 963 -840 272 1341 -705
503g05j30K520p08j150J132N92k030j490K376O73l061J203K340j931j983K085
$$ -705 -835 1685 977 -173 959 1551 -479 -1969 407 1080 -1981 -778 1562 -369 -2352 -267
519b67J295o28j8Q1k60p96R61L16j194J066J568k642j689L067O02k019k15K012
$$ -267 1028 400 382 463 203 -593 368 684 -510 556 2124 -518 -2207 860 1462 -557 -772 1240
537A240j004k422O42K853j197j092K125k03j778Q08J208q30M30Q55j284k427J588
$$ 1240 236 -2186 -1544 1309 112 -980 1145 942 -836 -28 1180 350 780 1635 351 -2076 -488
554d88J409k271m74L086q21l026J556K831j044p77J081j60j074K3N98r64R57J377
$$ -488 921 -1350 -1824 1262 441 -2585 -1029 1802 758 -19 1062 902 -172 -149 449 -515 442 1819
572A819j855k716K132J675k137K3K199m97j659K0J980K77j432M75P02j241k91
$$ 1819 -36 -2752 -620 1055 -1082 -1059 1140 643 -1016 -996 984 1261 -171 304 1006 -235 -526
589e26L75j42J150J59j172j515P88J760j159j724K003J857k790j411K684J088
$$ -526 -151 -293 857 1016 -156 -1671 -883 877 -282 -2006 -3 1854 -936 -2347 337 1425
605A425p30l90M67o04j47J93r48L16J492j38k819L57K248p94r60J661M92r13j334
$$ 1425 695 305 772 168 21 214 -734 -418 1074 936 -1883 -1526 722 -72 -1032 629 1121 208 -1126
624a126P70J295j04l94K22l87j115J70M44j37J179j21j602j95J395N69j648Q7
$$ -1126 -356 939 835 441 663 276 -839 -669 -225 -362 817 696 -906 -1101 294 863 -785 -698
642f98K196p49k836J000J900k85N8P1p70l8P50r18p84J609J017k330j716K147
$$ -698 1498 749 -2087 -1087 813 528 586 657 -113 -151 599 -319 -1103 506 1523 -807 -2523 -376
660c76Q91j485P00J386n5j395jO93M72m49K73k69p02j31k7m10O92N96j067q84
$$ -376 515 -970 -270 1116 1061 -334 -335 358 830 381 654 385 -317 -448 -475 -885 -193 403 -664 -1548
680a548P03J167j6j003J322J160k132n59J335K38j84K27q07j49J11J53r85M94
$$ -1548 -845 322 306 -697 625 1785 -347 -906 429 667 483 710 -97 -246 -135 18 -967 -473
698d73J701m28k686O01J949p05o31J545J63j108k37O62J95J98k74m29p26K33L0
$$ -473 1228 800 -1886 -1285 664 -41 -672 873 1036 -72 -309 353 548 746 472 43 -683 -450 -420
717d20j052Q34J229l38j502N84P76L74o46O82R88o92j241j8O17P4K8j95p12j98
$$ -420 -1472 -638 591 253 -1249 -665 111 485 -161 521 1509 817 -424 -442 175 249 277 82 -630 -828
737h28N73m59j00J648L40j854m20J812K59j159P37K10o10o44M7P9N21K9J48n98
$$ -828 -255 -714 -814 834 1174 -680 -1100 712 971 -188 549 759 149 -495 -448 -369 152 181 329 -269
757b69l01N04j68n40J330L94j391m3O60J34j15j73P45L21j492k80M62J32K14R2
$$ -269 -570 -66 -234 -774 556 950 -441 -484 176 310 195 22 767 1088 -404 -684 -222 -90 124 216
777B16o33l79M24j42l8Q03Q42q72j135P78R39n56l00O96n5j002N7k36K27N69K71
$$ 216 -417 -796 -372 -514 -552 251 1093 221 -914 -136 803 247 -53 643 588 -414 -357 -593 -366 203 474
798D74n88n30N81k40m11O78J143q65o08r7N83j03J8M32J56o11o27N15l5J24M08
$$ 474 -114 -644 -63 -303 -714 -36 1107 242 -366 -463 120 17 35 467 623 12 -615 -100 -135 -11 397
819C97j51o82r4K55j65K12Q54M3q21q3Q22n87j67Q73Jq07j37J42j17K59J54j6
$$ 397 246 -436 -530 -275 -440 -228 626 669 -152 -235 587 0 -167 706 707 -100 -237 -95 -212 47 201 185
841A85o17j70O01J9k42Q13J34p88nK87k83M10kP8k19p01K34Q6j41Q04j75m30j94
$$ 185 -432 -602 -1 18 -224 589 723 -65 -70 217 -66 344 342 420 201 -500 -266 -180 -321 483 308 -122 -316
864c16K57k31L47M65L61l60m92k28L97l88L71L99q56n99N82j32R6L75M4j85J0
$$ -316 -59 -290 57 522 883 523 31 -197 200 -188 183 582 -274 -873 -291 -423 -327 48 92 -93 -83
885h3L0J53m8M80M41o53n78K82n8l12K26J32k19j55k01K13l1J99P49n20J32K3
$$ -83 -53 100 52 532 973 320 -258 24 -34 -346 -120 12 -207 -362 -563 -350 -381 -182 567 47 179 202
907B02k97k63N57J49j09m20m8Rn7M6P99l55o21o7L50j87L92j26J20J07m57J77
$$ 202 -95 -358 199 348 239 -181 -229 -220 -277 -231 568 213 -408 -475 -125 -312 80 -46 74 181 -276 -99
929i9m9K41M29k88n00K11kl27K17PL57j28l49L0K79j19L95o9j86K22J2m41Q2M49
$$ -99 -148 93 522 234 -266 -55 -57 -384 -167 -160 197 69 -280 -250 29 -90 305 236 50 272 284 -157 -75 374
953C74j37n25Mq4K03j80J20L05l08K60K04l32o4M54l9%k25j46l9j07L64M44q38
$$ 374 237 -288 -284 -368 -165 -345 -225 80 -228 32 236 -96 -160 294 255 255 30 -116 -155 -262 102 546 -292
976b92j3P15n05k90l1N80J24o06j44J35n2M86J15l22L21J25l92l17M62K07l06
$$ -292 -305 410 -95 -385 -416 164 288 -318 -462 -327 -379 107 222 -100 221 346 -46 -363 99 306 0
997@p1j65M3r4N04J67m52k03K12o8j16M80j48J24K52m53l1k52L57L42m80j46Q2
$$ 0 -71 -236 -193 -287 217 384 -68 -271 -59 -127 -243 237 89 213 465 12 -19 -271 86 428 -52 -198 -116
1020a16K42l62M8J63J78Nk10n0P8L51k7q0k07K1K03n39P2M99o9k96k05K99j59
$$ -116 126 -236 -188 -25 153 158 -52 -102 -24 327 300 220 13 34 237 -302 -230 269 200 -96 -301 -2 -161
1043a61Mn9M83k77K59m66K1K58P1j45K24j3R5k82l19L17J71l43k59O25l76j62
$$ -161 -157 -216 267 -10 249 -217 -196 62 133 -12 212 199 294 12 -307 10 181 -162 -421 204 -172 -334
1065c34J59L13J58kj80k53K06L84m09o8J54j2n21J54L46k12j79K69m6J19l26J71
$$ -334 -175 138 296 294 114 -139 67 451 42 -26 128 116 -405 -251 95 -117 -296 -27 -73 46 -280 -109
1087a09M57k22j40P6k17J27j88M65m61N14n50J56k66K39L50k02J02j29P4O0n2
$$ -109 348 126 -14 62 -155 -28 -216 249 -212 302 -248 -92 -358 -119 231 29 131 2 76 136 84
1108H4L05k41K35k85m36J62J44J62l11j09j3M50m07K79J70j41j5K36k41j93K28
$$ 84 389 148 383 98 -338 -176 -32 130 -181 -290 -303 147 -260 19 189 48 33 269 28 -165 63
1129F3K20l31j59J84J23l04p3K80k74M04K21m39m5Q8K99k22J3r3J71j00k5J09
$$ 63 283 -48 -207 -23 100 -204 -277 3 -271 133 354 -85 -130 -42 257 35 48 -45 126 26 1 110
1151A10j21J34K72k45j24Q3J1k03M3J72O7l20l16L28L23o2k88J74Q7l42J6L87
$$ 110 -11 123 395 150 26 109 120 -83 -40 132 199 -121 -437 -109 214 152 -136 38 125 -217 -201 186
1173A86k16L3P4j60J1L30m53O3lJ57n8k65L41N7L2j36J42j32l62K5N04j79k8r5
$$ 186 -30 3 77 -83 -72 258 -195 -132 -135 22 -36 -301 40 97 129 -7 135 3 -359 -334 170 -9 -37 -132
1197a32K11J38l06o6q7L44j03j3m5o5J26j85K67n9J60j92j23L24j4k88J32k23
$$ -132 79 217 -89 -155 -242 102 -1 -14 -59 -124 2 -183 84 25 185 -7 -130 194 180 -108 24 -199
1219a99k8J43M5l3J09k07K34j49n0M44Jk66K77J04m26r8j50M11K05k59m44M75
$$ -199 -227 -84 -39 -72 37 -170 64 -85 -135 309 310 44 321 425 -1 -99 -249 162 367 108 -336 139
1241A39k59j63K67q5J88j46Q1k3J18L1j07K33pl08k04K56j78K81p6p2k7pl0j21
$$ 139 -120 -283 -16 -101 87 -59 22 -1 117 148 41 274 267 -41 -245 11 -167 114 38 -34 -61 -68 -98 -219
1265b19J17L47k36J10j9L0K30k48j36J05j03j24k3l40J54M49m1k11L01k22j15
$$ -219 -102 245 9 119 100 130 360 112 -24 81 -22 -146 -169 -509 -355 94 53 -158 143 -79 -194
1286a94j55K36L34j90j61K19j17N3n5J01Jl49K35K3k24L73j26K12k88K85k28q7
$$ -194 -349 -113 221 31 -130 89 -28 25 -30 71 72 -277 -42 -19 -243 130 4 216 -72 213 -15 -102
1308a02L09j00L6k20k12J97j57L62r7N7k17m2L81m50K69K2o2p9J8J31k02N3M74
$$ -102 207 107 143 -77 -289 -92 -249 113 16 73 -144 -186 195 -255 14 36 -26 -105 -87 44 -158 -105 369
1331C69l34l7J28J54l67K07j53O1J75k60j01K01k03L26k61j50PJ36j81J41K82
$$ 369 35 -2 126 280 -87 120 -33 28 203 -57 -158 43 -160 166 -95 -245 -238 -102 -283 -142 140
1352A40Q3j79l2J49k41J48J64m9k13J20j70l96M00J85q6j15J40r7J1j59J02K72
$$ 140 223 44 12 161 -80 68 232 183 -30 90 -80 -476 -76 109 23 -92 48 -49 -38 -197 -95 177
1374A77m8k78K10r2R4m0k9o7J42k24J6R2j58J14M2J68J9k09j53K44K06k97j90
$$ 177 129 -149 61 -31 63 23 -6 -73 69 -155 -139 -47 -205 -91 -49 119 138 -71 -224 20 226 -71 -261
1397b61M33k90kl1Q2j31L9lK64j78J53O9n4p7N0k9R0j42J21L6k22J07j19J15k22
$$ -261 172 -118 -120 -151 -69 -200 -161 -164 100 -78 75 144 90 13 63 34 124 -18 103 139 -83 24 -95 20 -202
1422b02K34k72L05J00k13M4L19q6j92l2K1j34J36k52N1M33j29j49r7N7j18o0k7
$$ -202 32 -240 65 165 -48 -4 315 229 37 5 26 -108 28 -224 -173 260 131 -18 -115 -58 -176 -236 -263
1445b63K88j65K37q7J69r9l9P0j85k6J58J56r2N9L8l01j94R2NL26j11M2k6j84
$$ -263 25 -140 97 10 179 80 41 111 -74 -100 58 214 122 181 219 -82 -276 -184 -179 147 36 78 52 -132
1469a32j56L15j95M01o9q6j08J87k95j62N6K34k6K44m6n2k35J83l18J91o3J01
$$ -132 -288 27 -168 233 164 78 -30 157 -138 -300 -244 -10 -36 208 162 110 -125 58 -260 -69 -132 -31
1491c1J75k68O0PJ40k72K02k28M45M6m04J96r3j12J66P8j0r4J59j91p1K93m25
$$ -31 144 -124 -64 -57 83 -189 13 -215 230 276 -128 68 -25 -137 29 107 97 3 162 -29 -100 193 -232
1514b32M12k75K11K12l07k14K96L7j07K7k14J64O3k35J70K37q7m84M65k18M7K00
$$ -232 180 -95 116 328 21 -193 103 140 33 60 -154 10 73 -162 8 245 158 -326 139 -79 -32 168
1536A68j47o0K99j91q0K3J04L8n5k90n1K93j22K32l44L14J63k03l2j10J12J4k56
$$ 168 21 -39 260 69 -11 12 116 154 99 -191 -242 51 -71 161 -183 131 294 91 59 -51 61 75 -181
1559a81j6K42j41K9J26m2k1Q5r7P8j48l5L05M0j84J26k29K1l6M7j01K01n4k12
$$ -181 -197 45 -96 -67 59 17 -4 81 -16 62 -86 -121 184 224 40 166 -63 -42 -78 -31 -132 69 15 -197
1583a97n5J0L14k57K88k30K11k45M21l05j97K43j01J63l40J63K87l07L71k39J22
$$ -197 -252 -242 72 -185 103 -127 84 -161 260 -45 -242 1 -100 63 -277 -114 173 -134 237 -2 120
1604A20k63J96q9K67j28o1j73K95L6l08K22M4j17O8k25N2N7k08M08K8k73j5L9
$$ 120 -143 53 -36 231 103 42 -131 164 200 -108 114 158 41 109 -116 -64 -7 -215 193 221 -52 -67 -28
1627b8r2J2K40k4k61K40k76L20j08j55J3J32K43m29K98j70nj33L97j28j59K83
$$ -28 -120 -108 132 108 -153 87 -189 131 23 -132 -119 13 256 -173 125 -45 -50 -183 214 86 -73 210
1649B10q1j19J62l04q6L47j59l67M55K2r8k0o1k2O5j99K41j07l0L69k33j01J29
$$ 210 129 10 172 -132 -218 129 -30 -397 58 80 -18 -38 -99 -121 -56 -255 -14 -121 -151 218 -15 -116 13
1672A3lk62M03j87J51j50p7J23p2j53J65m5J7Q1J53L7l73k3Q3K44J25k01k09O8
$$ 13 10 -252 151 -36 115 -35 -112 11 -61 -214 -49 -94 -77 4 157 194 -179 -202 -119 125 250 49 -160 -92
1696i2K07j07q2J39J1L0k49q4K21J9L9j16K33k88o6j47L14J86j87O6L0kn8j35
$$ -92 115 8 -74 65 76 106 -143 -227 -6 13 52 -64 169 -119 -185 -332 -18 168 -19 47 77 75 17 -118
1720a18K43J7m28K61Pk28L51k68M68m44L53j47K34k38J8q1K47O2m59N16k98n0
$$ -118 125 142 -286 -25 -18 -246 105 -163 305 -139 214 67 301 63 81 0 247 309 -150 366 68 18
1742A8M4k16K08K0k3k71L42k44J29O7P8l9k31K29j47k39J85k01L17k23L9J57M68
$$ 18 62 -154 54 74 51 -220 122 -122 7 74 152 113 -118 111 -36 -275 -90 -291 26 -197 -158 -1 467
1765D67o29J10J31J01k27J41K7l62N35l45p9J61j75J58J4k1J85k76N4k8O5J96
$$ 467 -162 -52 79 180 -47 94 121 -241 294 -51 -130 31 -144 14 28 7 192 -84 -30 -58 7 203
1787B03P4j79j48l03L15K91k22K02k26k21L4K79P6j34K1Oj30q4P2K83l45j93N66
$$ 203 277 98 -50 -353 -38 253 31 233 7 -214 -180 99 175 41 62 68 -62 -146 -74 209 -136 -329 237
1810B37m4n21J48J27Q9j30L49l94j32M90l31j15M98m08K82k84R6q0J71p9r6L70
$$ 237 193 -328 -180 -53 36 -94 255 -139 -271 219 -112 -227 271 -137 145 -139 -43 -123 48 -31 -127 243
1832B43j66J26k74O17o18j41J77K7p7l1L18P4k49j88m6K69k48N63k31l5m6J62
$$ 243 77 203 -71 546 -72 -213 -36 -9 -86 -117 201 275 26 -162 -208 61 -187 376 145 110 64 226
1854B26R0k62o0l0J97k10j20K25j74K09j04j26K22k5j8j32j78J55M06q0j85R2
$$ 226 316 54 -6 -36 161 -49 -169 56 -118 91 -13 -139 83 58 40 -92 -270 -115 291 211 26 118
1876A18l2j32J68n3k42L69m42L70r0J17k05j20J67j61r6P2%L14O1R0l84K82J25
$$ 118 86 -46 122 69 -173 196 -246 124 34 151 -54 -174 -7 -168 -264 -192 -192 122 183 273 -111 171 296
1899B96n34K07j20K52j97J09m3J92p7l5j5l3K12j40l60L00l0J56j84M1K30j62
$$ 296 -238 -31 -151 101 -96 13 -30 162 85 50 35 2 214 74 -286 14 -16 140 -44 -3 227 65
1921F5J00J78k77k5N1L5l46K59n4L6n1N7m4j30J47J40l47J92Q2J03q0J13l38j31
$$ 65 165 343 66 41 92 127 -219 40 -14 22 -29 28 -16 -146 1 141 -206 -14 68 171 91 204 -134 -265
1945b65K56R8k86J74L2Q1l30M14q0j5J25j89j38L9J85q9j22J01jjj37K61m56K40
$$ -265 -9 89 -197 -23 9 90 -240 174 94 79 204 15 -123 -84 101 12 -110 -9 -10 -11 -148 113 -343 -103
1969a03J88j91O7j25N39n42J73Jk10L17j25K22j88R6k04K31J19k87J19j58j27
$$ -103 85 -106 -39 -164 375 -167 6 7 -203 114 -11 211 23 119 -85 146 265 -22 97 -61 -188
1990a88L49l03K05R5j00n3j10K08k10K27J15k55J97k11R6K1l95L26Q7N4k92Q8
$$ -188 161 -142 63 158 58 5 -105 103 -107 120 235 -20 177 -34 62 83 -312 14 101 155 -137 -49
2012d9MNJJ97k97J43n9K9pK06q8j63p4J91k68M06m7k67J13k6r8L02m76J89K13
$$ -49 -45 -40 -39 158 -139 4 -55 -26 -33 173 85 -78 -152 39 -229 177 130 -137 -24 -50 -148 154 -322 -133 80
2037H0j33K64j93Q9k45K10l05M86r0j61l4P7k52J1K06K29m4P8k50N6K0q0R2L1
$$ 80 -53 211 18 107 -138 72 -233 253 163 2 -32 45 -207 -196 10 239 195 273 23 79 99 19 111 142
2061A42l02M08j01N0j53r2j51o8K92J89l33K40j34N1k23J96j47J57p5K2K05J67
$$ 142 -160 248 147 197 44 -48 -199 -267 25 214 -119 121 -13 38 -185 11 -136 21 -54 -32 173 340
2083C40j49j64NQ6l46K24Q4l53K86p9l4j16L54k44J32K12j42p1K8O3k95k0%J96
$$ 340 191 27 32 118 -228 -4 80 -273 13 -66 -100 -216 138 -106 26 238 96 25 53 116 -179 -199 -199 -3
2107cj01J83k63k68N14J3m8P8jj39J01l3j69J35j96K30j53n0L09l10L7J36n5R9
$$ -3 -104 79 -184 -452 62 75 27 105 104 -35 66 33 -136 -1 -197 33 -120 -170 139 -171 -134 2 -53 46
2131D6m9k9K23l45J19J11l41M14p9j48L71k95k61L79J14k98P8J77j46l10K55J67
$$ 46 -3 -32 191 -154 -35 76 -265 149 70 -78 293 -2 -263 116 230 -68 10 187 41 -269 -14 153
2153A53m0j3o6k3k32J58J06m20L15J87K1j42L5k58J97J02j07M5k40K91j7Q7j90
$$ 153 113 100 34 11 -221 -63 43 -377 -62 125 146 4 39 -219 -22 80 -27 18 -222 69 52 139 -51
2176e1K59j52K53k76j67l2J78j29J03m7k61M33j96J35m6J02k93L49l53K96j38
$$ -51 208 56 309 33 -134 -166 12 -117 -14 -61 -322 111 -85 50 4 106 -187 162 -191 105 -33
2197c3l9J14j9k28K26J29l52L75r4O1l10J39o2J18n7L9J44n2Rq8l4j38K29r4K82
$$ -33 -72 42 23 -205 21 150 -202 173 79 140 -170 -31 -93 25 -32 7 151 99 108 20 -14 -152 77 -17 265
2222B65k62m0ON7q8P5p5l41K47J6J86k5Nm0Q0J28j49R7n13N96m8J00k71q3J78
$$ 265 3 -37 -31 26 -62 13 -62 -403 -156 -140 46 21 26 -14 66 194 45 142 -371 225 177 277 6 -77 101
2247A01l20L30K3k6p1l2K36m63M54n3j78k6j22K24K80k61N9l49K23l9n9Q3K8J14
$$ 101 -219 111 134 108 37 5 241 -222 232 179 1 -25 -147 77 357 96 155 -194 29 -10 -69 14 42 156
2271A56j64J38r7r1Lq6K9J12J1j68Q4K07L8j79J30Q7k55k1l1K70J62k31q5p3J66
$$ 156 -8 130 33 -58 -55 -141 -112 0 11 -157 -73 134 172 -7 123 210 -45 -66 -97 173 335 104 19 -54 112
2296A12P2j34J95l63j63J55M62l85J06N8k0k39L18l65L58l52K24q2L1J36M3k55
$$ 112 184 50 245 -118 -281 -126 336 -49 57 115 95 -144 174 -191 167 -185 39 -43 -12 124 167 -88
2318h8N6lj61K42J81J7N9j54j76J21j38j6j4O8K33m01J01J87l90L8R8L26j77k66
$$ -88 -32 -35 -196 46 227 244 303 149 -27 94 -44 -60 -74 -6 227 -174 -73 114 -276 -238 -140 186 9 -257
2342b57K56m1n9qm4j15L86j58M8J54j88n0Q6K29l6k15l19J72K99p1j48k4M7J17
$$ -257 -1 -42 -101 -109 -153 -268 118 -40 8 162 -26 -76 10 239 203 -12 -331 -159 140 69 -79 -103 -56 61
2366F1k44K62j16L7j15J51j55L9j25J20J06J64k99P8q1o3J87LJ4r0jJ08oL9n2
$$ 61 -183 79 -37 0 -115 36 -119 -80 -205 -85 21 185 -114 -36 -117 -180 7 10 24 -66 -67 41 35 74 22
2391B2N7r9p3K04k49K06j56J15N6k0ql31l6L74r9r0K41o6J68n01J01K58p5J80
$$ 22 79 -20 -93 111 -138 68 -88 27 83 63 55 -276 -312 62 -37 -127 114 48 216 -285 -184 74 -1 179
2415A79l21L59j22j18J92j39rM3J9k68J39JP7K12l00P5j05k4J69l64K39qJ39N7
$$ 179 -142 217 95 -23 169 30 21 64 83 -185 -46 -45 32 244 -56 19 -86 -110 59 -305 -66 -74 65 122
2439A22k43J26N4q3j53M10j83N0l2l06L24k25K9j06N2P6L4j85K90k51J94jj70
$$ 122 -121 5 59 -24 -177 233 50 100 68 -238 86 -139 -110 -216 -164 -88 -54 -239 51 -200 -6 -7 -177
2462a77L03k71J92l6k42J04R8P0j02j07M0J52J77k07j42L24j82R7j39n4L4J91
$$ -177 126 -145 47 11 -231 -127 -29 41 -61 -168 -128 24 201 -6 -148 176 -6 91 -48 -102 -68 123
2484A23j08K03m67L67o0J70k86K7K57j69K5j51J85j04Q2J23j01j04J4j14Q5Q1
$$ 123 15 218 -249 118 58 228 -58 -31 226 57 82 -69 116 12 94 217 116 12 26 -88 -3 78
2506G8J25j67n3J2k64n3L82K5P7j99J96l3J53n24K37l5K3j0j07Rk4L0J15J66L5
$$ 78 203 36 -17 -5 -269 -322 60 85 162 -37 159 126 279 -245 -8 -43 -20 -30 -137 -128 -152 -122 -7 159 194
2531A94l34Q7j75K15K6j77N4J88j83m1R3j45K26O3m1l5k12P9k25J67J76j82J41
$$ 194 -140 -53 -228 -13 13 -164 -110 78 -105 -146 -53 -198 28 91 50 15 -197 -118 -343 -176 0 -182 -41
2554d1J80k8l38K01k38M52k57R7j08M1p5K2K23l23J82k99N15j50J92l05N2j70
$$ -41 139 111 -227 -26 -264 188 -69 28 -80 -39 -114 -92 131 -192 -10 -309 206 56 248 -57 -5 -175
2576a75j55K83j26J77Q9l69J85O3J40j28J28j14L13k38p9J38j56m2n0O9J59j49
$$ -175 -330 -47 -173 4 93 -276 -91 -28 112 -16 112 -2 311 73 -6 132 -24 -66 -116 -47 112 -37
2598c7J68m05K90j3k97M73k58J45j97N8R7p6O0k31L43M3j77M2K31l82J58k10L22
$$ -37 131 -274 16 3 -294 179 -79 66 -131 -73 24 -52 8 -223 120 163 -14 28 259 -123 35 -175 147
2621A47j06k62N92m77J29m5J34k58Q7%q7M1J16K23k59J63k35K61l71K6K86j93
$$ 147 41 -221 371 -106 23 -22 112 -146 -59 -59 -146 -105 11 234 -25 138 -97 164 -207 -181 105 -88
2643h8J61j54p7J48J13K0o5k02K92m7k52K33j66j77K57J66p1j30R1J8N6k34j2
$$ -88 73 -81 -158 -10 103 123 58 -144 148 101 -151 82 -84 -261 -4 162 91 -39 52 70 126 -108 -120
2666a20O7J36n5R3R6k66L41N8k74NQk69K23j99K49q6N2O5N7j10j80Q9Q3Q4j51
$$ -120 -53 83 28 121 217 -49 292 350 76 81 89 -180 43 -156 93 7 59 124 181 71 -109 -20 63 147 -4
2691dj41J24J57k21q9k1J06J40m3K30J59n81L9K21L5k00k82N02J02j93j93K24
$$ -4 -145 -21 136 -85 -174 -195 -89 51 8 238 397 -184 -145 76 111 -89 -371 131 233 40 -153 71
2713G1j43n9L98j16ln1P3J32k87N8J23j53K3J10o8j35k34K65k68K72j56J18p2
$$ 71 -72 -131 267 151 148 97 170 302 15 73 196 43 66 176 108 -27 -261 4 -264 8 -148 -30 -102
2736a02J41M4N0l26Q8l0J28nL5O6j18ml14N12j72l77M66J16k9L3l66J52N5pk17
$$ -102 39 83 133 -193 -105 -135 -7 -12 23 89 -29 -33 -347 165 -7 -384 82 198 169 202 -164 -12 43 36 -181
2761a81K30J84l13K24J83j02m21J32K38k17j16K89Lj50k3pqO6q2J12K45l28j60
$$ -181 49 233 -80 144 327 225 -196 -64 174 -43 -159 130 133 -17 -40 -47 -55 11 -71 41 286 -42 -202
2784b02N5J94r8P4M3R2j47n8N5J00n6j03j60K35l9l67M69j98j2J01p6k9J60k31
$$ -202 -147 47 -51 23 66 158 11 -47 8 108 52 -51 -211 24 -15 -382 87 -111 -123 -22 -98 -127 33 -198
2808a98K56j55K01j04k39K76J77j75L29m67k9k6K31Ok6n2m0R4j77Q2L01j25N4
$$ -198 58 -97 104 0 -239 37 214 39 368 -99 -128 -154 77 83 57 5 -35 59 -118 -36 265 140 194
2831A94j34q2j32L45r1l07O8M4Q2J01p2j11J10k24K73r3J32j85K88m50K86j45
$$ 194 60 -22 -154 191 100 -207 -139 -95 -13 88 16 -95 15 -209 64 -29 103 -82 206 -244 42 -103
2853a03j72J23L66j02J4m37N89j88k90N85m98J98M7p5M6j38p4K00j02J09J1n9
$$ -103 -275 -152 214 112 126 -311 278 90 -200 385 -113 85 132 57 103 -35 -109 91 -11 98 109 50
2875E0M0Rj2J38k30m39O79l20J07J77k39j48J86r7m2L44j47j15j14J25r5P7J09
$$ 50 90 99 87 225 -5 -444 235 -85 22 199 -40 -188 -2 -99 -141 203 56 -59 -173 -48 -143 -66 43
2898D3j57M05k32n4J08j42M6M8l9k0j9M6j2r7J71J32k14J84j6k4l7n3j2l78K52
$$ 43 -114 291 59 5 113 -29 17 65 26 6 -13 33 21 -76 95 227 13 197 181 157 120 67 55 -323 -71
2923g1M8j1P8r0j43k6J71K85j26j78M19j61j37J4j46L2J08Jr5k6r4K65J17j28
$$ -71 -23 -34 44 -46 -189 -215 -44 241 115 -63 356 195 58 72 -74 -42 66 67 -28 -54 -148 117 234 106
2947A06k05K64J19k40oj45J30J67j31J8J21j82O1j46j30L9L70j92K40k92k09K61
$$ 106 -99 165 284 44 38 -107 23 190 59 77 198 16 77 -69 -199 -160 210 18 258 -34 -243 18
2969A8J52k3l6k94L15j12j65L23Qk99k05R1L68k74J88P7j8P9l55J27j82K6L8J63
$$ 18 170 147 111 -183 132 20 -145 178 186 -113 -318 -227 141 -133 55 132 114 193 -162 -35 -217 -191 -153 10
2993A0L5K2k74O4K70L6m72M94M6l24J43o5N7j6LK09j31m18k2N41l75J08M7l12
$$ 10 45 67 -207 -143 127 163 -309 185 231 -93 50 -15 42 26 29 238 107 -311 -333 208 -167 -59 -12 -324
3017c24L32k4k34J62K06l83K24R7k27K52j39K9Jo7M5p3N4k7O6p6j6R3j23K78l54
$$ -324 8 -16 -250 -88 118 -265 -41 56 -171 81 -58 -29 -28 -95 -50 -123 -69 -96 -30 -106 -122 -29 -152 126 -228
3042b28N60l71J87j39k18K85j6J18J0m44K4L59j73%p2k7Q4K20m41M41j96J78k33
$$ -228 332 -39 148 9 -209 76 60 178 188 -256 -232 127 -46 -46 -118 -145 -61 159 -282 159 -37 141 -92
3065i2k2K22J16j75k22K74m9M7O3j60q3k49M63J23k52k9K6K03l59L68l07p9l5
$$ -92 -114 108 224 49 -173 101 52 99 162 2 -81 -330 133 256 4 -25 1 204 -155 213 -94 -173 -208
3088b08K68k29qL02k33Q7K14L6k13l27K88J01j63j77R9J26m8K13k46J80j26L8
$$ -208 60 -169 -177 125 -108 -21 193 229 16 -311 -23 78 -85 -262 -163 -37 -85 128 -118 62 -64 -26
3110b6R0n3k16K11J06l1K4k60J53J43R1j54K4j82L04m41j4L45J7k34R3R1J6j11
$$ -26 64 11 -205 6 112 81 105 -155 -2 141 232 78 102 -80 224 -217 -231 114 131 -103 -10 81 97 -14
3134a4m2J37J9R5j71L7j98M00l46j3k2N47n51K10j54J3j45J44PP9j9j23l4q5L20
$$ -14 -56 81 100 195 24 61 -137 263 -83 -96 -118 429 -122 88 -66 -53 -198 -54 -47 32 13 -110 -144 -229 91
3159I1j09m8OK09l13K76p2k3k2j0J1kP8N1k0l18J97Mj72R0j61L83j08J25l05L65
$$ 91 -18 -66 -60 149 -164 112 40 17 -5 -15 -4 -6 72 123 103 -215 -18 -14 -186 -96 -257 126 18 143 -162 203
3185B03j69Mr1rm1K55l85K04jK52m36K46j6J22m16J88j2p9J48l28K47N8K01m11
$$ 203 34 38 -53 -62 -103 152 -233 -29 -30 222 -214 32 16 138 -278 -90 -102 -181 -33 -361 -114 -56 145 -266
3209b66M75m66J92M1m8O6J1k93M06k64J35J27Mk39m7j25L59M7k26R0MJ4J9K56
$$ -266 209 -257 -65 -24 -72 -6 5 -288 118 -146 -11 116 120 -119 -166 -291 68 115 -111 -21 -17 -3 16 272
3233B72k26j70J69J99l07J81j93J81K9J87j67J51q35N67l5l83O65j18k29j0j01
$$ 272 46 -124 45 244 -63 118 -75 106 135 322 155 306 -529 38 3 -380 285 167 -62 -72 -173
3254a73r4K85l1j4j08Q0o1P3j39J95J32j64R0k24P0J46j74O7j16J31o6L7K42j75
$$ -173 -267 18 -13 -27 -135 -55 -116 -43 -182 13 145 -19 71 -153 -83 63 -111 -44 -160 -29 -95 -58 184 9
3278IP3N5j47J13j68K03k3k65o4K75J27l04M87n42O8L75j49L1l03nK87o0j28k47
$$ 9 82 137 -10 103 -65 138 115 -150 -214 61 188 -116 371 -171 -103 272 123 154 -149 -154 133 73 -55 -302
3302c02K13n3k1nL61L4l93K84k01L3J95L4j51J55j59R6j07r1P4J86o0k33J51k49
$$ -302 -89 -142 -163 -168 193 227 -166 118 -83 -50 145 179 28 183 24 120 13 -78 -4 182 122 -111 40 -209
3326b09K79k23l7o3K59P0o8P7k46J91j34K83j26j02J05J20k1l96K07k3q7Q4j1
$$ -209 70 -153 -190 -253 6 76 8 85 -161 30 -104 179 53 -49 56 176 155 -241 -34 -57 -144 -60 -71
3349g1j39J79j1j30O0K40j98J62J89l25L12j97K8rn3j62K18j57n8p3K54Q0l99
$$ -71 -210 -31 -42 -172 -112 128 -70 92 281 -44 268 71 99 90 37 -125 93 -64 -122 -195 59 139 -260
3372b60L1J87j72K01j71J51j62J46Jq1J84j07J31r7q5M2j50L13j5J36p5j91J31
$$ -260 -229 -42 -214 -13 -184 -33 -195 -49 -48 -129 55 -52 79 -18 -103 -61 -211 102 87 223 148 -43 88
3395H8r9j53J66j53K59k97J25J9N5p7J8L38l13K1k30K81k00J83l43J61M4M0%m9
$$ 88 -11 -164 2 -151 108 -189 -64 -45 10 -67 -49 289 -24 -3 -233 48 -152 31 -312 -151 -107 -67 -67 -116
3419a16K00k30qL05p4j09K1j83M80m89L09k93J2oJ39j86K64j54J84j15j08K82
$$ -116 84 -146 -154 151 77 -32 -11 -194 286 -203 106 -187 -175 -181 -42 -228 36 -118 66 -49 -157 125
3441A25j66j69J77J71k92R0O1k6K67k59l4K67l47K61k05L8J83k03nJ80m6J27n62
$$ 125 -41 -210 -33 138 -154 -64 -3 -29 238 -21 -55 212 -135 126 -79 -41 142 -61 -66 114 68 195 -367
3464c67K76k53M11j5j00N1o3K15j77Q9j39P1l9K42j42o7r4K34j9j38J76j81P1
$$ -367 -91 -344 67 52 -48 3 -60 155 -22 67 -72 -1 -40 202 60 -7 -101 133 114 -24 152 -29 42
3487D2J4J32k34L6RM9j04j86M10p3j59LL85k42j37j96K41J0J3l3l72L36j22K28
$$ 42 56 188 -46 -10 -1 48 -56 -242 168 95 -64 -61 324 82 -55 -251 -10 0 13 -20 -392 -56 -178 50
3511E0j27J13Q0j79J68j36j22J40p2m2K72j26m7oj02K58j37k4o0K76l72J12J08
$$ 50 -77 36 116 -63 105 -31 -153 -13 -85 -127 145 19 -28 -34 -136 122 -15 -39 -99 177 -195 -83 25
3534B5j38J32j30j65N68rk91R9q5n13L27L55m08K36qM5J03l7j06O1J43j69j32
$$ 25 -113 19 -111 -276 292 283 -8 91 6 -507 -180 175 -233 3 -5 40 143 106 0 61 204 35 -97
3557i7J17o4k34L26j62O3K53j63j4qJ73j79k24J60J1J24q4j53L15j09J31m73j8
$$ -97 20 -44 -278 48 -114 -51 202 39 25 17 190 11 -213 -53 -42 82 -2 -155 160 51 182 -291 -309
3580c09L60k07K52r6r6j47J08P5k32L00j06J13Q1k45L52k26p8M01j69J47l27K18
$$ -309 51 -156 96 0 -96 -243 -135 -60 -292 8 -98 15 96 -149 203 -23 -101 300 131 278 -49 169
3602A69lk61Q4K2j8J23r3K8Pk79K63j72PJ10K99m31K22P1J26K0n1m6K0m24M3L
$$ 169 166 -95 -11 11 -7 116 23 51 58 -221 42 -130 -123 -13 286 -145 77 148 274 294 243 197 217 -207 -164 -161
3628a61J14J48J61l27L88m55P2P0J74q6j00q3k9r1L07m6J9j25L04j92j82j7K11
$$ -161 -47 101 262 -65 323 -132 -60 10 184 98 -2 -85 -114 -205 102 56 75 -50 254 62 -120 -137 74
3651G4k47J58K39j72K7j88K9Q1P3l9rj00P5p1K01j76K55k24L20l55J73j58k11
$$ 74 -173 -15 224 52 79 -109 -80 1 74 35 26 -74 1 -70 131 -45 210 -14 306 -49 124 -34 -245
3674b45N02k80J91m00J34N8k16K54M0k15P1J53O6Q9j10l02K45L2L3K93l92M84
$$ -245 257 -23 168 -232 -98 -40 -256 -2 38 -177 -106 47 113 202 92 -210 35 67 100 393 1 485
3696D85n89P2J07k62K90k88N3O2M06n91K57L4k49R7j0K18O1M7j67J64l42K23j
$$ 485 -104 -32 75 -187 103 -185 -132 -70 336 -255 2 36 -213 -116 -126 92 153 200 33 197 -145 78 77
3719G7j48j73j64L86k96L58k52K25r4J20L3k09N2K18r0o3j2O2J56l84L34J0j74
$$ 77 -71 -244 -408 -22 -318 40 -212 13 -81 39 72 -137 -85 133 43 -20 -32 30 186 -198 136 146 -28
3742b8q6J02J01j36q7J45J14j07k27lK93j16q7L15q2J14k94Q4J18oR3j77j56M9
$$ -28 -114 -12 89 -47 -134 11 125 18 -209 -212 81 -35 -122 193 111 225 -69 15 133 127 220 43 -113 -64
3766f4R3N8j19Q1j44J53k38K05L03m30M6p6J50J63l24K00j47J15l2n3J8M7Q4N
$$ -64 29 87 -32 49 -95 58 -180 25 328 -102 -56 -132 18 181 -143 57 -90 25 -7 -60 -42 5 89 94
3790I4J72k37k72M05l62J92j31J80Q0k43J60Rj64K03j2N7k12l66M6M48Rk42O1
$$ 94 266 29 -243 162 -200 -8 -139 41 121 -122 38 47 -117 86 74 131 -81 -447 -401 47 56 -186 -125
3813a25m8J90j13R3R7n9O7J39M1j44j60J87k08Pm9K74pj00k22m5K81K4lj07j91
$$ -125 -173 17 -96 -3 94 35 102 241 282 138 -22 165 -43 -36 -85 189 182 82 -140 -185 96 120 117 10 -181
3838a81m8L70o2k44K11J0r2p3j37L38L5l58K79j09Q2J00L0k90L28j2l92O4J88
$$ -181 -229 141 79 -165 46 56 -36 -109 -246 92 127 -231 48 -61 21 121 151 -139 189 177 -215 -151 37
3861C7l68M55j13K59m40k2K26j8J11k17RK10k23k06L84j99M8J93k31J19j14K52
$$ 37 -331 124 11 270 -170 -192 34 16 127 -90 -81 129 -94 -300 84 -115 -67 126 -105 14 -100 152
3883A52k00N5J02j59oj79K92r9k0J45j1j41J98O4k7k07m5j59K00K90k69o0j64
$$ 152 -48 7 109 -50 -56 -235 57 -42 -62 83 72 -69 129 193 166 -41 -86 -245 -45 245 -24 -84 -248
3906b48J60K89k92J88r8J46m4n6l02K53j52P7M5r4L60j70j21J51k89J37m4K09
$$ -248 -88 201 -91 97 -1 145 101 45 -257 -4 -156 -79 -34 -128 232 62 -59 92 -197 -60 -104 105
3928A05R5j18j32R1p1P4j52Q4P8q1J07j48Q6j92K10k28q7K69O5J17n2k34m9L17
$$ 105 200 82 -50 41 -30 44 -108 -24 54 -27 80 -68 18 -174 36 -192 -279 -10 55 172 120 -114 -163 154
3952A54q3J28j12j17N5k8J58p2K6jj76K99K2n19PK06m7J66J84l03k43L93K09p2
$$ 154 71 199 87 -30 25 -3 155 83 109 108 -68 231 253 -266 -259 -53 -100 66 250 -53 -296 97 306 234
3976B34o9j51P8j63M8M0k46L04K1k22PJ66N4M5j53j34J91Nj03L2J37R7k25J46
$$ 234 165 14 92 -71 -23 17 -229 75 96 -126 -119 47 101 146 -7 -141 50 55 -48 -16 121 218 -7 139
4000A39N3r0J84k41j44O8K1J05k26j4J65l4m1j77K93q7l8J74q2q7J06L3J1j43
$$ 139 192 102 286 45 -99 -31 -10 95 -131 -145 20 -14 -55 -232 61 -26 -64 110 28 -59 47 80 91 -52
4024e2n3O0L31l04Q9k11K37MK6Q2k22J9J61n46J88J05k42L80k2J65k43o9K08j10
$$ -52 -105 -45 286 -18 71 -140 97 101 127 209 -13 6 167 -379 -191 -86 -328 52 30 195 -48 -117 91 -19
4048a9j06J4l9p4J53J2q0k6j55L80k43K22l7K2j23J01L8l07L93j45n4oJ35l13
$$ -19 -125 -111 -150 -224 -71 -59 -139 -165 -320 60 -183 39 2 24 -99 2 40 -267 126 -19 -73 -79 56 -257
4072b57K57J88m9J5P3l66m8L87j68k90QM47k00K55k09j35K2J2J81J06k63n7L16
$$ -257 0 188 139 154 227 -139 -187 200 32 -258 -250 197 -3 252 43 -92 -70 -58 123 229 -34 -91 225
4095B25k27pj38J18J09j09j25J49J6J3j57K57k06J53j64M37m64K14j89j86J57
$$ 225 -2 -9 -147 -29 80 -29 -154 -5 11 24 -133 124 -82 71 -93 344 -120 94 -95 -281 -124
4116a24J39J97j11j40K15j12M6j40K19MM8m24mR4J48J41j02J2k4Q3m2l70OR1j42
$$ -124 15 212 101 -39 176 64 110 -30 189 193 241 -183 -187 -93 55 196 94 106 82 165 123 -247 -241 -150 -292
4141b92M31k13nK07j2M3l50L2J51k40L31l2j26K47l8k73L74k59l4J7K9L23j59
$$ -292 139 -74 -79 128 116 159 -191 -159 -8 -248 83 51 -75 172 134 -139 235 -24 -58 -41 -12 311 152
4164A52j75O9P7j41j09P0J46j09o3J36p2k74N1N93j5j47k76K35m1j03j43K97k74
$$ 152 -23 46 123 -18 -127 -57 89 -20 -83 53 -19 -293 -242 351 336 189 -87 148 107 4 -139 158 -116
4187a16RL17m01K08m7q2R8J9K18j69n1O0r1pK37l31K7J71M4j91J2M7N5K38l82
$$ -116 -107 210 -191 17 -30 -112 -14 5 223 54 3 63 -28 -35 202 -129 -102 69 113 -78 -66 -19 36 274 -108
4212a08J40L6j3J5m4k09Q2m9L3K67N9k70L36k87J12j51K21j32Mj44P1K7j03q0
$$ -108 32 68 55 70 26 -183 -101 -150 -117 150 209 -61 275 -12 100 -51 170 38 42 -102 -31 -4 -107 -187
$$ [...]
8191B79
##END NTUPLES=NMR FID
##END=
