##TITLE=1H_DE-102_ch_8_TFA
 200.13MHz,CDCl3,
 8 sc
 
 27.8.2025
##JCAMPDX= 6.0         $$ Bruker NMR JCAMP-DX V2.0
##DATA TYPE= NMR FID
##DATA CLASS= NTUPLES
##ORIGIN= UXNMR, Bruker Analytische Messtechnik GmbH
##OWNER= pz
$$ XWIN-NMR		Version 3.5
$$ Wed Aug 27 16:08:20 2025 Russian Standard Time (UT+4h)  she@DPX200
##.OBSERVE FREQUENCY= 200.1313
##.OBSERVE NUCLEUS= ^1H
##.DELAY= (6, 6)
##.ACQUISITION MODE= SIMULTANEOUS
##.ACQUISITION SCHEME= undefined
##.AVERAGES= 8
##.DIGITISER RES= 18
##SPECTROMETER/DATA SYSTEM= spect
##.PULSE SEQUENCE= zg30
##.SOLVENT NAME= CDCl3
##.SHIFT REFERENCE= (INTERNAL, CDCl3, 0, 14.3821)
##AUDIT TRAIL= $$ (NUMBER, WHEN, WHO, WHERE, WHAT)
$$ ##TITLE= Audit trail, XWIN-NMR		Version 3.5
$$ ##JCAMPDX= 5.01
$$ ##ORIGIN= Bruker BioSpin GmbH
$$ ##OWNER= she
$$ F:/spectra/data/she/nmr/H-C/1/audita.txt
$$ ##AUDIT TRAIL=  $$ (NUMBER, WHEN, WHO, WHERE, WHAT)
(   1,<2025-08-27 16:06:29.39 +0400>,<she>,<DPX200>,
      <created by zg, POWCHK disabled, PULCHK disabled
       configuration hash MD5:
       00 E9 B6 7A A2 85 ED C7 34 08 36 98 17 FE 4E 26
       data hash MD5: 16K
       D6 31 52 2D 92 AD 5C 5F EA 12 74 44 0D F1 54 FC>)
$$ ##END=
$$ 
$$ hash MD5
$$ 00 D7 40 F8 0C 42 2A EE 07 FF 29 A7 E0 63 75 80
##$RELAX= 
##$RELAX= 
##$RELAX= 
##$RELAX= 
##$RELAX= 
##$RELAX= 
$$ Bruker specific parameters
$$ --------------------------
##$DU= <F:/spectra>
##$EXPNO= 1
##$NAME= <H-C>
##$PROCNO= 1
##$TYPE= <nmr>
##$USER= <she>
##$AMP= (0..31)
100 100 100 100 100 100 100 100 100 100 100 100 100 100 100 100 100 100 
100 100 100 100 100 100 100 100 100 100 100 100 100 100 
##$AQSEQ= 0
##$AQ_mod= 1
##$AUNM= <au_zg>
##$AUTOPOS= <>
##$BF1= 200.13
##$BF2= 200.13
##$BF3= 200.13
##$BF4= 200.13
##$BF5= 200.13
##$BF6= 200.13
##$BF7= 200.13
##$BF8= 200.13
##$BYTORDA= 1
##$CFDGTYP= 0
##$CFRGTYP= 5
##$CHEMSTR= <none>
##$CNST= (0..31)
1 1 145 1 1 1 1 1 1 1 1 1 1 1 1 1 1 1 1 1 1 1 1 1 1 1 1 1 1 1 1 1 
##$CPDPRG= <>
##$CPDPRG1= <>
##$CPDPRG2= <>
##$CPDPRG3= <>
##$CPDPRG4= <mlev>
##$CPDPRG5= <mlev>
##$CPDPRG6= <mlev>
##$CPDPRG7= <mlev>
##$CPDPRG8= <mlev>
##$CPDPRGB= <>
##$CPDPRGT= <>
##$D= (0..31)
0 0.7 0 0 0 0 0 0 0 0 0 0.03 0 0 0 0 0 0 0 0 0 0 0 0 0 0 0 0 0 0 0 0 
##$DATE= 1756296388
##$DBL= (0..7)
120 120 120 120 120 120 120 120 
##$DBP= (0..7)
150 150 150 150 150 150 150 150 
##$DBP07= 0
##$DBPNAM0= <>
##$DBPNAM1= <>
##$DBPNAM2= <>
##$DBPNAM3= <>
##$DBPNAM4= <>
##$DBPNAM5= <>
##$DBPNAM6= <>
##$DBPNAM7= <>
##$DBPOAL= (0..7)
0.5 0.5 0.5 0.5 0.5 0.5 0.5 0.5 
##$DBPOFFS= (0..7)
0 0 0 0 0 0 0 0 
##$DE= 6
##$DECBNUC= <off>
##$DECIM= 32
##$DECNUC= <off>
##$DECSTAT= 4
##$DIGMOD= 1
##$DIGTYP= 9
##$DL= (0..7)
0 120 120 120 120 120 120 120 
##$DP= (0..7)
150 150 150 150 150 150 150 150 
##$DP07= 0
##$DPNAME0= <>
##$DPNAME1= <>
##$DPNAME2= <>
##$DPNAME3= <>
##$DPNAME4= <>
##$DPNAME5= <>
##$DPNAME6= <>
##$DPNAME7= <>
##$DPOAL= (0..7)
0.5 0.5 0.5 0.5 0.5 0.5 0.5 0.5 
##$DPOFFS= (0..7)
0 0 0 0 0 0 0 0 
##$DQDMODE= 0
##$DR= 18
##$DS= 0
##$DSLIST= <SSSSSSSSSSSSSSS>
$$ [...]
##$SUBNAM0= <"">
##$SUBNAM1= <"">
##$SUBNAM2= <"">
##$SUBNAM3= <"">
##$SUBNAM4= <"">
##$SUBNAM5= <"">
##$SUBNAM6= <"">
##$SUBNAM7= <"">
##$SUBNAM8= <"">
##$SUBNAM9= <"">
##$SW= 18.0517328524113
##$SWIBOX= (0..15)
0 0 2 0 0 0 0 0 0 0 0 0 0 0 0 0 
##$SW_h= 3612.71676300578
##$TD= 16384
##$TD0= 1
##$TE= 0
##$TE2= 300
##$TE3= 300
##$TEG= 300
##$TL= (0..7)
0 120 120 120 120 120 120 120 
##$TP= (0..7)
150 150 150 150 150 150 150 150 
##$TP07= 0
##$TPNAME0= <>
##$TPNAME1= <>
##$TPNAME2= <>
##$TPNAME3= <>
##$TPNAME4= <>
##$TPNAME5= <>
##$TPNAME6= <>
##$TPNAME7= <>
##$TPOAL= (0..7)
0.5 0.5 0.5 0.5 0.5 0.5 0.5 0.5 
##$TPOFFS= (0..7)
0 0 0 0 0 0 0 0 
##$TUNHIN= 0
##$TUNHOUT= 0
##$TUNXOUT= 0
##$USERA1= <user>
##$USERA2= <user>
##$USERA3= <user>
##$USERA4= <user>
##$USERA5= <user>
##$V9= 5
##$VALIST= <valist>
##$VCLIST= <CCCCCCCCCCCCCCC>
##$VD= 0
##$VDLIST= <DDDDDDDDDDDDDDD>
##$VPLIST= <PPPPPPPPPPPPPPP>
##$VTLIST= <TTTTTTTTTTTTTTT>
##$WBST= 1024
##$WBSW= 4
##$XGAIN= (0..3)
0 0 0 0 
##$XL= 0
##$YL= 0
##$YMAX_a= 116358
##$YMIN_a= -119374
##$ZGOPTNS= <>
##$ZL1= 120
##$ZL2= 120
##$ZL3= 120
##$ZL4= 120
##$ABSF1= 10
##$ABSF2= 0
##$ABSG= 5
##$ABSL= 3
##$ALPHA= 0
##$AQORDER= 0
##$ASSFAC= 0
##$ASSFACI= 0
##$ASSFACX= 0
##$ASSWID= 0
##$AUNMP= <proc_1d>
##$AZFE= 0.1
##$AZFW= 0.1
##$BCFW= 1
##$BC_mod= 2
##$BYTORDP= 1
##$COROFFS= 0
##$CY= -3
##$DATMOD= 1
##$DC= 2
##$DFILT= <>
##$DTYPP= 0
##$F1P= 0
##$F2P= 0
##$FCOR= 0.5
##$FTSIZE= 0
##$FT_mod= 4
##$GAMMA= 1
##$GB= 0.15
##$INTBC= 1
##$INTSCL= 1
##$ISEN= 128
##$LB= 0.25
##$LEV0= 0
##$LPBIN= 0
##$MAXI= 10000
##$MC2= 0
##$MEAN= 0
##$ME_mod= 0
##$MI= 1.114404
##$NCOEF= 0
##$NC_proc= 0
##$NLEV= 6
##$NOISF1= 3.799351
##$NOISF2= 2.8
##$NSP= 1
##$NTH_PI= 0
##$NZP= 0
##$OFFSET= 14.38212
##$PC= 1
##$PHC0= -1558.173
##$PHC1= 6.792278
##$PH_mod= 1
##$PKNL= yes
##$PPARMOD= 0
##$PSCAL= 0
##$PSIGN= 0
##$REVERSE= no
##$SF= 200.129724274929
##$SI= 16384
##$SIGF1= 3
##$SIGF2= 2
##$SINO= 400
##$SIOLD= 16384
##$SREGLST= <1H.CDCl3>
##$SSB= 0
##$STSI= 0
##$STSR= 0
##$SW_p= 3205.1282051282
##$SYMM= 0
##$S_DEV= 0
##$TDeff= 0
##$TDoff= 0
##$TI= <>
##$TILT= no
##$TM1= 0
##$TM2= 0
##$TOPLEV= 0
##$USERP1= <user>
##$USERP2= <user>
##$USERP3= <user>
##$USERP4= <user>
##$USERP5= <user>
##$WDW= 1
##$XDIM= 8192
##$YMAX_p= 0
##$YMIN_p= 0
$$ End of Bruker specific parameters
$$ ---------------------------------
##NTUPLES= NMR FID
##VAR_NAME=  TIME,          FID/REAL,        FID/IMAG
##SYMBOL=    X,             R,               I
##VAR_TYPE=  INDEPENDENT,   DEPENDENT,       DEPENDENT
##VAR_FORM=  AFFN,          ASDF,            ASDF
##VAR_DIM=   8192,          8192,            8192
##UNITS=     SECONDS,       ARBITRARY UNITS, ARBITRARY UNITS
##FACTOR=    0.0002768,     1,               1
##FIRST=     0,             0,               0
##LAST=      2.2672688,     0,               0
##MIN=       0,             -119374,         0
##MAX=       2.2672688,     116358,          0
$$ Real data points
##PAGE= N=1
##DATA TABLE= (X++(R..R)), XYDATA
0@%%%%%%%%%%%%%%%oJ4j6J6j6J6k4L2l2M0m8N4o2P2q5R5j06J20j38J58j77J97
37A04k21K48k77L08l40L78m20M62n11N65o23O87p57Q33r16J008j112J229j362
56g17J514j687J887k123K408k757L200l778M567n716P545j0893J8940p5049n0965
71a13624J94160n703j36090L1950J12940k2930l8907j1338l8765O937Q3038k5612
83C6056j08140P373O6151j5658k883L4056k4381l4400L8834L8292j3816j7575
95C909J1476J0592k990j0884j8868q085J8516P209j7743j4495n261N807J9389
108a428Q998k847n044j0717L850K3198K744j8726m15J8505k132k1264M99J2439
122G660m436l693K85j6447n451J8442O402o593K836J657m819L820J2642j971r691
$$ y = [0, 0, 0, 0, 0, 0, 0, 0, 0, 0, 0, 0, 0, 0, 0, 0, -6, 8, -8, 8, -8, 8, -16, 16, -16, 24, -24, 30, -32, 40, -45, 50, -56, 64, -74, 84, -93, 104, -117, 131, -146, 162, -178, 200, -220, 242, -269, 296, -327, 360, -397, 436, -480, 528, -584, 645, -717, 797, -890, 997, -1126, 1282, -1475, 1725, -2053, 2514, -3202, 4343, -6550, 12390, -62659, -113624, 80536, 74833, -61257, -29307, 83633, 60703, 21796, 10458, -28307, -21370, 61668, 36056, -72084, -64711, 1440, -14218, -17101, 16955, -7426, -41826, -2992, 35300, 21484, 3909, 15385, 25977, 22987, 12103, -6765, -14850, 3666, 10875, -6868, -21363, -26624, -20817, -1428, 7570, 4723, -321, -11038, -7188, 16010, 18754, 28, -387, 18118, 15986, -5278, -4779, 7660, 3224, -469, -184, -16631, -22082, -3640, 2762, -3831, -995, 662, -4157, -337, 12305, 10334, 643]
137F43Q491M876j6830n077J0296o37l082j042p611j689Q661J875l173N488P197
152H386o524n822Q580K787m854M001n45j0576M8M455k169J260K552o594l836O912
168a939K618m955L615Q698l860n459M529m08j990N735j603p738j275R35j676K736
184b037K281l617k250M753K252l764J921N324k87j040j291l659K538N032m411
199A745l643J756k042l080K622K092l357l46M382m64l027L970K456j205L196J95
215E250o209J705N257k851n141R81J155m305j309L310r50j389M262O08k570K788
231E92K396o20J595Q17l021k167K340J276l966k595K810r2k820M76P47J98J435
248e99k05q2L01Q15J373L35j50O30o43n76J006o44k199j89N36j66k133j463K078
$$ y = [643, 9134, 14010, -2820, -7897, 2399, 1762, -1320, -2362, -9973, -11662, -3001, -1126, -4299, 1189, 8386, 1862, -3960, 4620, 7407, 2553, 6554, 6009, -4567, -4519, -64, -2233, -973, 1579, -5015, -8851, -1939, 679, -4276, -661, 8037, 4177, -1282, 3247, 2839, 849, 6584, 4981, -2757, -4032, -3097, -4773, -2037, 244, -3373, -5623, -870, 1382, -2382, -461, 4863, 4576, 3536, 2245, -1414, 1124, 6156, 1745, -1898, -142, -2184, -5264, -2642, -550, -3907, -4253, 129, -335, -3362, 608, 3064, 1859, 5055, 5250, -959, 746, 6003, 3152, -1989, -1008, 147, -4158, -5467, -2157, -3107, -4496, -234, 374, -2196, 592, 2988, 2368, 3963, 4780, 1759, -408, 1932, 3208, -758, -3353, -543, -635, -3455, -2979, -2232, -2034, -599, -804, -886, -585, 230, 1603, 1938, 1788, 2418, 1775, 1199, 2205, 1561, -638, -827, -291, -457, -2590, -4053, -1975]
267a975J166j116O44R87O30J205M76k25J51O04p37j095k91m2j525p88K010j553
285a474j466J585J165n48L37K88N51O81J60n77n95N91J586j697p72L37k45q44
303i37J059j58j255%O04K05k16L6O77N78k97K41n92O15J203l08j157j93j65j82
323b42o44J53O07n88k43P85k67K7O76N86K14o31o32M13Q6J78P5j132j75Q37m67
344c84n01Q84K4K6o9J28R0j51O23L71o87p52M56j77J9M2n5q1K04l29k55o3O40
367CO30n54m98L61pL76N35j40m95j59N3j26M6l32L77k64n59N8k08O88Q68k93k47
390A13lJ98M06l71M09Km04j34k41l75J45K50n63R6j33k84J57R96j10J01j79J79
412B55o8K89O9J90o22N4j19o55n4K99K96j68p5k25j79L52N76M9m12L06k32J33
$$ y = [-1975, -809, -1925, -1281, -294, 336, 1541, 2017, 1792, 1943, 2547, 1810, 715, 424, 382, -1143, -1931, 79, -1474, -2940, -1355, -190, -738, -401, -113, 438, 1119, 1279, 702, 107, 698, 2284, 587, -185, 152, -93, -937, 122, -36, -1291, -1291, -687, -482, -698, -662, 15, 593, 296, 537, -55, 560, 1763, 1455, 298, 105, -60, -242, -886, -733, -126, -714, -957, -172, -439, -412, 264, 850, 1064, 433, -199, 214, 300, 478, 553, -579, -754, 83, -384, -885, -1, 23, 49, -20, 108, 198, 47, 670, 1041, 354, -398, 58, -119, -100, -58, -113, -194, 10, -319, -574, -637, 3, 633, 79, -419, -58, -65, 311, 846, 706, 211, 52, 105, -21, 25, -307, 70, -194, -753, -695, -903, -215, 653, 360, 113, 110, 308, 714, 343, 752, 754, 350, 216, -25, -400, -255, -5, -568, -472, -605, -889, -732, 264, 154, 255, 76, 255, 187, 476, 545, 735, 113, 167, 48, -607, -661, -362, -66, -234, -309, -534, -713, -361, 215, 264, -148, 158, -74, 59]
434E9j12M76O9Km73p1j57L19j10K8j87l02J05k06L41O0M70m25M06j03K47k52J15
457B99N76o64k18j16l40L58n2j77o7j78R9K70J06L73K63l19j15Mo3J52K41J35
479E67m31n46N1L5K01J23J93l00n9j92K14l7J79K08j89L9j67J80P5L48j97n20
501b25O1k59J72M31l06j35K11r1L4j6J86J37k2k60k6r2J38K43m5r1k6k76NM07
525A55n59N64q0J39j75j70L15J83j32j78k90n5K13J30j58M38j45n5m51J66r1N67
547C31l4j28j90q4J81K4K25Nl68j08M5L05n67Q08k75j74L9l38J95m1J11L96N0
570D08p38O13k26K22j69O7j97m2K6l40N8L66q3J76l69J86Q6m8L02k08KR3o9j91
594g5K17j13JK85m27k19K79j11K43J56k29j4Qj83L15n3p2J17k54J52o2n0N09k09
$$ y = [59, -53, 423, 492, 494, 21, -50, -207, 112, 2, 30, -157, -459, -354, -560, -219, -159, 311, -114, 292, 189, 436, 184, 299, 875, 211, -7, -123, -463, -105, -157, -334, -401, -579, -480, -210, -104, 269, 532, 213, 98, 102, 39, 191, 432, 567, 136, -410, -359, -324, -123, 0, 193, -107, -166, -358, -144, -181, -2, 206, 17, 56, -111, 69, 144, 492, 295, -225, -164, -423, -251, 180, -126, -261, -50, -141, -107, -123, 63, 200, 178, -82, -108, -200, -62, 181, 136, 45, 19, -257, -252, 155, -404, 160, 80, 219, 44, -126, 189, 372, 240, 62, -228, -283, -70, 60, -98, 340, 195, 140, -311, -145, -236, 331, 297, 169, -21, -105, 76, 100, 325, 330, -38, -146, -101, 204, -363, 445, 170, -4, 35, -303, -108, -149, -38, 358, 408, -330, 283, 57, 279, 110, 177, -20, -62, -36, -376, -318, 48, -35, 141, -228, -42, 44, -4, 298, 90, 92, 185, 116, -75, 142, 29, 30, 315, -112, -331, -52, -163, 80, 236, 7, -7, 1, -182, 133, 80, 8, 125, -129, 23, -39, -89, 420, 211]
618B11m04J26n8j55JK19K6k4k36N1K55J41j27j66L90j03J53j74M3J14l26j83L4
641a92r1K14p5K52k65q9oK46j15N0O3M12k50J07kk50J14j24J87k69Qk13Q9L68
665A69k23m1K67l69M20k80kJ51J63m77K19K03p9Q4L30l57j61N4J52k12P2kj04
688b3k14J22J91P9j03Q8j81L4lK20l15J45J89l40j6N3J42r1j60L61j55N9p2r9
712h9k9L10k13MO9N7j23m0M4J09k72J19K39k29k68L44J22m3j27P7J72o5j85J30
736A13l31J96J60j53O1K7j97kL12j99Q9J43l5k57j87J69K50j47j1o0M7p5K28j88
760d7o5N8o6J03L0j35J55N8j01p2K74k83L9j7j27n9N16m72L43k53j44mK20KJ00
785E3k29J99J35l45J67j7K50j03p0j63J40j37R5J53k62K16J2n81N14p0j10P6m9
$$ y = [211, -193, -67, -125, -280, -279, -60, -34, -58, -294, -243, 12, 153, 26, -140, 250, 147, 300, 126, 169, 283, -43, -226, -192, -283, -69, -144, 108, -157, -246, -252, -6, -121, -71, -8, 404, 154, 261, 259, 9, 123, -1, 186, -83, -75, -288, -199, 169, -54, -95, 172, -197, 223, -57, -59, 92, 255, -222, -3, 200, 121, 205, 535, 178, 17, 71, 223, 11, 83, 81, -23, -237, -115, 76, 155, 52, 140, -41, -7, -10, 210, -105, 40, 229, -111, -127, -74, 68, -23, -183, 178, 23, 82, 10, -89, -118, 192, -21, -17, 52, 109, -14, -54, -10, 99, -173, -54, 185, -44, -312, 32, 154, 111, -16, 61, 233, 168, -17, 113, -218, -22, 138, -15, 46, 73, -124, -126, 186, -13, 76, 219, 184, -73, -260, -91, 159, 12, 1, -59, -12, -87, 141, -47, -112, -54, -120, -17, 13, -122, 33, 91, -10, -82, 192, -91, -52, -69, -196, -255, 261, -211, 132, -121, -265, -269, -49, -47, 53, -176, 23, 158, -187, -20, -37, 213, 110, 40, -123, 17, -120, -25, 128, -134, 82, 94, -487, 27, -43, -153, -77, -126]
808a26J28K12l96M3J32J33k02q4L38j91O6N3j11n9m1J04m9K14j63K52l71J71j71
831a18q6N37k67M0k80O4L73j10k02K38j45J10l80K06j4J30j73O2K52l14pk62K34
854a12K73j20J54l06n6L02pJ15k12j89K54j65p5M33j80j71o9L28l50K41Jk34L27
877A82o2r6r8K3J53j32k46J81J44j73J44o7j31K47J0k81J8J16K20l85K46j6l1
900c4J39k57M04l86J73n7q5LM56m68K12Rj57J77k73J86N1q6J5lm3j60J56J11k29
925a46K35l47K4O0L28j32j24J63M3QK5k34K90P6m39M1j53J29Q8K89n5K0j50k90
949b51L27O4m3k56J11%k32L85R2l68L9R0j25L36l85L38j06j83J32j86K60L06j39
972B06j42O8k88j03M66k38j54R7J83o9j07k9j94M56p0n9J33q9R8m34L29j36J62
$$ y = [-126, 2, 214, -182, -139, -7, 126, -76, -160, 178, -13, 53, 106, -5, -64, -105, -1, -50, 164, 1, 253, -118, 53, -118, -204, 333, 66, 106, -174, -110, 263, 153, -49, 189, 44, 154, -226, -20, -34, 96, -77, -15, 237, -77, -84, -346, -112, 161, 41, 195, -111, -167, 135, 128, 243, 31, -158, 96, -69, -144, 289, 109, -62, -131, 197, -153, 88, 89, -145, 182, 120, 24, -74, -51, 102, -30, -276, -95, 49, -124, 20, -47, -178, 69, 79, -202, -184, -68, 152, -233, 13, -3, -34, 105, -152, 252, -134, 39, -18, -103, -100, 356, -112, 100, 109, -48, 129, -144, 42, 93, 7, 22, 19, -24, -184, -28, 83, -146, 89, -258, -234, -174, 154, 22, -102, 61, 104, 112, 137, -97, 193, 269, -170, -129, -282, -153, -65, 224, 169, 189, 39, -251, 76, 140, 97, -159, -48, -48, -280, 105, 197, -171, -132, -42, -167, 169, -216, 122, 16, -167, -35, -221, 39, 345, 206, 64, 132, -156, -259, 207, -31, -185, -88, 95, 26, -81, -110, -304, 152, 82, 23, 156, 67, 165, -269, 60, -76, 86]
995H6k42OK2J75J33k46o9J63M7l72M72k03J19o8j69K18n5J19m7j02j58J67r8o5
1019a67K57k61L32qj85O4j66L60P7m67J37M5l8Q3M5j49Q3k71J64l15N27j3Nj65
1043b6J6Qj99M5J31N6p3J85k0k76K92l12R2J98k25J84K43j86k38L88m25K31j38
1066d9p3K12O9l23N1J71j52QP3Q4j7q3J57k2Q8l39K17j04J10j87J31K00m0j40
1090D2k37K01j86K43Nk15J7J25j60q5K76m0o6L8PJ61J40j91j01J58j12m0k38K95
1114C7j50M58n23K08J05l62K18j10J68m47L90J00n6j2M1J06l79L03m5mq5J50j60
1137d9R5oj27j12K31j81J9K09J32j01J46k18j77P9j04Q1N2J04R7l17J63J60k38
1160f2Q8R1k9k32R5Q2k65K33k2p7Rj91M57j8j53k05K68K20k80J4l21K42J00Q0
$$ y = [86, -156, -150, -128, 47, 180, -66, -135, 28, 75, -297, 175, -28, 91, 23, -146, 72, 17, 136, 89, -13, -171, -4, -102, -167, 90, -171, 161, 153, -32, 32, -134, 226, 303, -164, -27, 18, -20, 63, 108, -41, 42, -229, -65, -380, 147, 134, 139, -26, -10, -2, -201, -156, -25, 31, -42, 143, 123, -153, 139, -173, -81, 117, -108, 76, 319, 133, -105, 283, -142, 89, -49, -122, 90, 159, -164, -113, 58, -94, -86, -13, 71, 54, -29, 128, 106, 194, -145, 72, -32, 78, -109, 22, 222, 182, 42, -195, 6, -180, 63, 68, -147, -130, -5, -165, -250, 26, -14, -80, -42, -35, 126, 266, 75, -26, 132, 20, -20, -258, 37, -113, 345, -178, 30, 135, -227, -9, -119, 49, -398, -8, 92, 36, 24, 65, 171, -208, 95, 50, 46, -39, 111, -49, 46, 40, -87, -199, 32, -149, -130, 79, 211, 110, 256, 38, -139, -60, -164, -83, -31, 73, 170, -147, 16, 176, -62, 26, 117, 88, -144, -49, 33, -232, 1, -21, -98, -89, -280, 177, 159, 6, -199, 69, 289, 9, 23, -298, -56, 44, 124]
1184A24m4M37n22L6J78q0j12k53l0L63l21J30K75j73K05k48Q2J98m17k37N07l12
1206b14l5K68L73p96L91P1O3P1j75J81K1j78j02l8J36p5P5j96K23j67J73m11L54
1229A3J95j92q9m2K79k33J69j97R4j30Q4J24j86O8n5N0N1j50L23l05j45J78r5
1252a91L32r5J4k09K81Nn2o0l23K12K34Mk24K11K14l96J38J9j59j47J04J04o0
1275d4M6P4j90l7j3R9O1r9k41N64j76j51j1L0j1J80n1j75q2K69P5j36j12J02j05
1300a34J94j89J62J19j29j21K03k49p9K69n0J78m4k4Ok00K16j55K05k56N12m40
1322fJ00j18J58k97L32j31j93j38k7K32J65m0O3o6j3N6J96m59P2R6j37M33q7j18
1346G3j78K51P1k44p8J01j9L93m34O3J17N6k20j0J34p0k37N23m04Q9j3K5J57j72
$$ y = [124, 80, 517, -5, 31, 209, 129, 17, -236, -266, 97, -224, -94, 181, 8, 213, -35, 47, 245, -172, -409, 98, -214, -249, 19, 392, -404, -13, 58, 121, 192, 17, 198, 219, 41, -61, -99, 37, -38, 37, -159, 64, -103, 70, -341, 13, 208, 16, -73, -115, 164, -69, 100, -97, -3, -133, -49, 75, -111, -43, -98, -48, 3, -147, 176, -129, -274, -96, -191, 141, 46, 60, -149, 132, 137, 85, 25, -298, -86, 148, 152, -72, 139, 353, -43, 95, 114, -45, -192, -88, 16, -44, 2, 76, -114, -151, -164, -65, -4, -103, -344, 220, 44, -107, -118, -88, -99, 81, 30, -145, -227, 42, 117, -19, -131, -29, -134, 60, -129, 33, 152, 23, -98, 105, -144, -223, 46, -4, 174, 130, 106, 112, -88, 128, -27, 178, -78, 434, -6, 94, -24, 134, -163, 169, 38, -155, -293, -320, -88, 77, 37, 100, 34, 21, 77, 273, -186, -114, -18, -155, 278, 191, 73, -105, 146, 217, -27, -105, -4, -23, 370, -64, -1, 116, 172, -48, -58, 76, 6, -231, 292, -112, -23, -36, -11, 146, -26]
1370b6p5nM5K49k60K49j61j28L2K55j67n6J86j85N8p4L28k09j24R2p0K25l5m3
1394A01m8j03j18J67n8j3K25j62Lk73L47j60J06j38J69k0J93q9j37j29K01j78
1416a14R6J23l7j42K85q2k17j2K03Q0j3j2o7j95j1J84J2k17j6K77Pj11l14L01
1440HK3K6J61k08K07j63k7k02J73j38J30n9N9K8k0m5P8K29k43J06l09J97Lp7K5
1465c8K17o9M9k41L9K71oj65k91K12k94K14M79k43mj35j35K54j58O7q2k5R4l6
1489b6P4M6k05j05J60K69p9R4j49l09K80j5j54J34N4J72j21K4j78O4l13K86J9
1512B2l14M67r1m1l9K13k39J20j36J84k75K08p5j69K23k91J53k46L56r5o7K23
1534I1p0j19kJ43R8J44p7n01L68k16%j5N9Pn0L76m42K10r5Q2J45j13o7R5rj7j19
$$ y = [-26, -101, -106, -61, 188, -72, 177, 16, -112, -80, 175, 8, -48, 138, -47, 11, -63, 265, 56, -68, 24, -46, 179, 144, 101, 53, -50, -168, -1, -59, -72, 153, -9, -6, -279, 68, -92, 14, -124, 45, 25, 218, 129, -8, -137, 64, -114, -18, 105, 68, -74, 211, 129, -88, -100, 103, 183, 170, 158, 91, -104, -115, 69, 81, -136, -152, 125, 132, 21, -293, 8, 31, 57, 218, 10, 217, 54, 27, -175, -2, -140, -10, -69, -10, 18, -2, -47, 31, 260, 17, 123, -186, 11, 14, -63, -38, 179, 110, 159, -82, -43, 228, 222, 57, -234, -22, -316, -102, 377, 134, 130, -5, -140, 114, -44, 23, -59, -84, 10, -26, 48, 94, -111, -216, -56, 213, 134, 228, 79, -230, 50, 35, -119, 15, 69, 241, 120, 144, -34, 30, -283, 3, 22, -292, 175, 84, 43, 4, 217, -22, 98, -38, 146, -129, 79, 4, -165, 58, -233, -80, -326, 30, -65, -132, 91, 21, -98, -100, 43, 141, 285, 208, -293, 75, -141, -141, -156, -97, -90, -140, 236, -206, 4, -91, -9, 136, 23, -44, 51, 42, 25, -94]
1561i4M5j39J18J16k4J69k29J36n6p2L36k43J3j87j2N0L8L79l88J47r7J96k14
1584a2j98J22J52j69OJ34R1p6q0m6j43M47m85K99kq1R3L3M0l34M14j54J1j0J39
1609A91k30j72M20k17J57%j30J35j94J4j19J32N6jk20J55o2J50M4k30Q3J49l5
1632G6Q1k0k21J3j3l0M53k32p7K06k64J86p8j39M5j50K00O4q2j65Q7J61k33K62
1656A30l20J80j04J68r6K4R2l5K4No2l7Q0l38J96K00K9k77J78J62l5r7j01K69
1680B35m13L12k19R2o1J68l36l1K78K5L7L5l76N7L49o4l6O6K7j89k04L06j08O2
1704A2J90l65K93Q8k31q1K3j61L88j12O2rp4J04k49l7K50q1J3J76k21M6l91M28
1728F1j94L89l18j3PJ88J28o6k59R0N7O0r7k34J7j33L18j45K09L3j3k12R9q1J39
$$ y = [-94, -49, -188, -70, 46, 22, 191, -38, 98, 42, -30, 306, 63, 76, -111, -123, -73, -35, 344, -44, 103, 6, 202, -12, -210, -88, 64, -105, -99, 35, 126, 50, -30, -76, -219, 228, -257, 42, 40, -41, 52, 85, 125, -209, 205, 51, 62, 52, 191, -39, -211, 209, -8, 149, 149, 19, 154, -40, -26, -145, -13, 43, 42, -178, -23, -85, 65, 109, -121, -38, 111, 76, 157, 137, -84, -71, -84, -114, 339, 107, 30, 236, -28, 158, 80, -59, -14, -164, 36, 100, 18, -147, -60, 101, -132, 130, -190, -10, -114, 54, -42, -18, 74, 39, 63, 68, 6, -31, 49, -289, -93, 107, 136, -141, 37, 199, 164, 67, -34, 235, -178, 134, -85, 7, -54, 114, -222, -253, 25, 50, 87, 122, -254, -197, 152, 88, 52, 118, 145, -44, -248, 58, -50, 12, 202, -163, 130, 218, -13, -94, -71, -232, 156, 44, 106, 97, 23, 127, -122, -159, 91, 10, 23, 199, -22, 24, -367, 61, -133, 256, -62, -75, -68, 120, 248, 182, -77, 13, 70, 130, 33, -201, -184, -317, 1, -144, 65, 98, 85, -127, -28, -109, 30]
1753C0l1p1R1m68L14K13k30J03k03J05k58N30J20l82L20j31l9j6k2J21k42J39
1775gJ19j47P3J28j16M5L2P7j13k82K44K1M7k97K12m9k89O06m58k45K88K63j62
1798a0J22q8Q5M6N5k75l00M78O7k72p2P3k6L40k29O1Q0l27l3M8N6L4J43k29M3
1823a30O6o5k5J56K1m8J7r1M05m28R1K80m02L53o75N12R6j8j59Q8L51m21j20J35
1847a1J67o8l69K84Q8j34Q7K22j52J04j2k71o9J48n9j74J2J9N6J85K26m11M5M2
1871d5J2L4NK05k88L08k87k1P5QM1k43J97J51m19K88K6q9k3OL5j04J2J11P7J56
1897B28m0j04k21J57l9K29o6k30J83K3k97J8J5R6J14k02j82M50q8j24j61J75K8
1920c8km4M0n7MJ31m8J68k40J28J8J64j98l7j41K87K3l65M92k48k00L13j47j35
$$ y = [30, -1, -72, 19, -449, -135, 78, -152, -49, -252, -147, -405, 125, 245, -137, 183, 52, 13, -3, -25, 96, -146, -7, 112, -35, 38, 166, 50, 95, 127, 204, 91, -191, 53, 74, 121, -176, 36, -13, -302, 304, -154, -399, -111, 152, -10, 112, 24, 109, 155, 210, -65, -365, 113, 180, -92, -164, -91, -117, 223, -6, 55, 135, -192, -225, -177, -121, -87, 56, -173, -130, -64, -129, -154, 2, 23, -25, -8, -99, 306, -122, -31, 249, -153, 200, -475, 37, 133, 115, -44, 44, 395, -26, -146, -11, 156, 88, -281, 3, 91, -43, 44, 266, 114, 218, 206, -65, -134, 14, -45, -219, -207, -188, -132, 53, 279, -132, -87, -45, -33, 1, 6, 211, -77, 231, -56, -77, -2, 6, 47, -196, 1, 152, -267, 21, 47, -42, -65, -59, -24, -128, -116, -5, 72, 228, 188, 84, -137, 20, -19, 210, 144, -86, 97, 120, -177, -159, -144, -48, 66, -136, -318, 132, 44, -80, -241, -66, -38, -40, -84, -44, -101, -97, 34, -14, 154, -86, 42, 60, 224, 26, -11, -152, 135, 158, -207, 285, 37, -163, 150, 3, -132]
1944a32J11R2p7pL1Q3l3q9K03j45m9j36K30j54J12q7K30k73j54J77J76M2j76K67
1968B42j20k1j66K7j00J49J8j16K04k47K41q7j9k15j2K48K7J08q4m9O3j23J21
1991H9j46Q8k33M16j37j91j12K08P0j04N5j82Q1p0M48j85l10K89m81M56p9Qr5
2014a17J58r3J3J13j37j4J43q1J22k65L28J97q3l12m2k24L50j54K03L3o9k01n1
2037a83K23q6K13p8r6K81j18j5j57L2J18l80J41J89O5k3Q1j65k26J08K81j16k47
2060a58K24k4j55m4j95M42O1l45J4L11J32k47K96n18Q5J19J49k15N8O3p5q6J51
2083D3J37k20j88J64j20r0N21l11K15j43m5L27k82j23M1R6j6k00J75K56k73O9
2105C3P6j74J37j79J15L4Ll15L88j64N1J6j69p0J72N5L8j56L55o2o6j77m9j37
$$ y = [-132, -21, 71, -6, -13, 18, 101, 68, -21, 182, 37, -12, -148, 82, -72, 40, -47, 183, -90, -244, -67, 109, 151, -25, 242, 122, 101, -65, -38, -138, 11, 29, -87, 117, -130, 111, 24, 5, -210, -222, 26, 53, 161, 77, 28, 91, -32, 89, -57, 31, -202, 214, 77, -114, -226, -18, 52, -52, 3, -179, -98, -168, 280, 95, -215, 74, -407, 49, -30, -22, -117, 41, -52, -39, 74, -63, -77, 66, -15, 107, -158, 170, 367, 284, -28, -70, -294, 56, -98, 105, 138, 69, -132, -183, 40, -46, 167, 89, -7, 274, 156, 141, -16, 16, 134, -246, -105, 84, 149, 126, 207, 42, -184, -76, 205, 89, -158, 66, 42, -113, -157, -352, 90, 151, -194, -180, 131, 263, 16, 312, -206, -121, -2, 147, -68, -10, 53, -22, -108, 43, 180, -40, -228, -64, -184, -274, 247, -64, 151, 8, -37, 290, 8, -115, -74, 22, 6, -194, -19, 237, -36, 33, 109, -65, 72, -107, 8, 42, 45, -270, 118, -46, 5, 21, -148, -218, -46, 9, 47, -109, 246, 184, 118, -59, -108, -245]
2129b45M12j63K47j85k30J93k45J84K14l83L29o0k14P9K23k15r5J96J80j91R4
2150A25j22J3M8n0r8m3L7N9o5j5P2q4P9L42n52O3K74k09J84j06M3k64M97k88J05
2175D5j76L8R2j43M67j92P2k72n5K83n22M31k90L54l2l8q8n9MrJ01J45k64J52
2199D4K45n56L04P9p1q4m2K85l67k49M53p8K5j20k3j55O16k93J13j55j11J48O0
2222F8pl54M87l00K38k03J75m74M70J02L5j88m06N07l48L35k98q6L37m3O2j53
2244d4J2l0k78K18L5K56j99k90K15j07L45k2o9nJ94m56N8l1L07k78J69K02j25
2267G7k5J7J06l43p0K38R9j66K7q2K65j16O2j39j6j12K55k2j89J46q2qK7j18K90
2292A21k34M3j07L08j86k0j26K99k13J23L6l21N69l59J61j41k61L24j15R0q9Q9
$$ y = [-245, 167, 4, 251, 66, -164, 29, -216, -32, 182, -201, 128, 68, -146, -67, 156, -59, -154, 42, 222, 31, 125, 3, 16, 64, 14, -84, -127, -90, -31, -96, -111, -39, -123, -44, 298, -254, -191, 83, -126, 58, -48, -5, -269, 228, -60, 45, -131, -93, -1, -144, 323, 131, 203, -69, -124, 159, -363, 68, -222, 132, 100, 62, -26, -85, -81, -90, 11, 156, -108, 44, 289, -267, 37, 116, 45, -39, -81, 204, -163, -412, 41, -37, -12, -132, -155, -310, 306, 13, 126, -29, -140, 8, 68, 61, -293, 194, -106, 132, -71, 104, -370, 100, 202, 237, 49, -357, 150, -198, 137, -161, -247, 90, 47, 109, -44, -32, -62, -340, -122, -87, 169, -30, -320, -105, -212, 133, 111, 42, 37, 231, -225, -167, -198, 109, -169, 0, 202, 77, 52, 69, 175, -168, -238, 0, 99, -67, -40, -122, 143, 27, 89, -50, -66, -178, 77, 55, -134, 12, -70, -78, -51, -169, 121, -113, -70, -177, 131, -55, -75, -201, 98, -115, 8, 44, -277, 292, -67, 94, -47, -308, 16, -99, -9, -98, -9]
2314im7K31k95J92j2p3j2K19p8k61L32j90l28N90l85L37m16L94k14j78K6q9K82
2337A6n0p8K9J89j13l2O3j74J51K05n6j10J14R0l48J86k09KK85k49J56j22L05
2360B50j45l3l84K01o2J42l36M79k81K57J0j97j42J83k0j29J9K06p9r8J32n1j44
2383b22K13J91k6k29Q1o5J87j24q6J37o9M4j65j3K47q1Kl09L83n5L89l31J51l71
2407a21L8R3mQ1PJ7j81M9r9J27n4j08R0k8O3K89k68K35l14P0n1K0n8N2R0j67l9
2434a71L7K34l4o4J95J59l27LJ66l40r5L72j6J4j47r9K22j5P4m17L26R9k41J02
2458C7n4N7No4J04m9k29J56k24L19J6n4j03J40o7J77j07k29j01K23J99l34J32
2481e0J10N1m30K30J13Q8R7q5Pl08j75L44j6Jm6J28j61R4Q3k72K81K5k67R1J20
$$ y = [-9, -56, 175, -120, 72, 60, -13, -25, 194, 116, -145, 187, -3, -331, 259, -126, 211, -205, 189, -25, -203, -177, -266, 16, -34, -112, -83, 106, -7, -39, 24, -150, 1, 206, 150, 40, 154, 244, -104, 82, -127, -125, 160, -89, 67, -55, 250, 105, 72, -312, -111, -173, -31, -367, 112, -169, 88, 98, -99, -241, -58, -78, -207, -188, 18, -61, -159, -27, -78, -222, -9, 182, 156, -73, 8, -57, 130, 6, -80, 57, -12, 32, -133, -146, 101, 20, 22, -287, 96, 41, 430, 99, 250, -121, -83, 10, 6, 87, 94, 111, -70, -21, -120, 7, -47, -155, -65, -93, -30, 259, -9, 226, -88, -18, -69, -49, -107, -55, 35, -132, -171, -134, 100, 66, 2, 197, 356, 29, 32, 198, -142, -237, 135, 119, 133, -14, -113, 109, 94, 168, -249, 77, 176, -65, 37, -17, 40, 45, -19, 85, 36, -193, -37, -261, 58, 74, 20, -83, 57, -10, 167, 60, -169, -270, -47, 152, -182, -50, 60, 111, -319, -89, 24, 112, 209, 124, 131, -177, -352, -8, -24, -23, -69, 59, -102, -8, 75, -197, 84, 109, -158, -67, 53]
2506E3j15L05l94M6L32l70J17J46K21l83J19q3j17J90k44j30J83K62j08k36K56
2527E0j48P8j02J63k82N37l51J05l7k28K27k71K78J75l68L36j37l87K76k34J75
2548a45J91L6j13p9L6J97k4j18k02L27k7j81K87l33J64J56q7j62J97j22n9L28
2570B67m25J36J02q1J5K23j68l47L51l6j05l6J16J6j7L7j9r4J72qj62P8M7Q2k36
2595i2j56K48j02k7K49l6l8j26J89k2l96L98o7k41K12mJ28k37r0J99J60j99PL9
2619dK09l39K78m28K30j0Nn5L48m36M03m9l12M2P5J8k73J56K71j37j2l7l3L92
2643C02r6r9r5K14l06K35m72L25J05l14K47N9J6k3L1j11l5o2P6Jq5p3J02J15P5
2668A32K42l24r3L08J03l73M0J96k16R7j53L41k28l1M9j28j57K31O2J7m8n5k40
$$ y = [53, -62, 243, -151, -105, 227, -143, -26, 120, 341, -42, 77, -6, -123, 67, -177, -307, -124, 138, 30, -206, 50, -98, -20, -122, 41, -241, 296, -55, 50, 13, -215, 12, -259, 19, 194, -174, 162, 25, -362, -86, -320, -145, 46, 82, -31, -110, -74, 123, 99, -19, -221, 106, 79, -102, 185, -148, 16, 172, 85, -77, 120, -2, -61, 267, -158, -22, 80, -1, 14, 237, 69, -278, 73, 37, -68, -104, 12, 28, 11, 48, 29, -65, 107, 99, -63, 15, 62, 144, -92, -248, 0, -102, -129, 120, 84, 46, -80, 109, 87, -309, 89, 22, -219, -7, -11, 117, -120, -210, -11, 149, -50, -43, -4, 205, -134, 144, -284, -54, -64, -59, -114, 234, -202, 201, 152, -160, -118, -43, -25, -298, -142, 129, -8, -20, -57, -90, 302, 206, 107, 12, 226, -80, 155, -317, 8, 113, -201, 46, 105, 121, 98, 129, 18, -17, -79, -3, -2, -87, -160, -58, 57, 132, 374, 50, -43, 265, 368, -5, 35, 231, 15, 112, -41, 300, 72, 41, 90, -38, -195, 36, 98, 115, 67, 12, -228]
2691b28R4J1K78J3j27J71k53j39J19Q1R3LJ19l30L33j83j09O2l30J24J30j49L04
2714H7r5j52K73J19l00J41K76l41J3J40k40p5J9J44n8K86l15K6p2j01J79M10k31
2737A33k69J71J78r2p8k0M2j6j7k25L82m8j72j19O8k2N2J79j58qj78L83j37l5
2761fO5k96P8K64l83J69L4j87N8L28j07J11m1M1l8l51J01J91O0j45j19P1JL47
2785B46l60K02k33L54k79LJ15j45l3P9q3K1J94m6q0j61K52K29k36q9p9%N2L68
2809B91j51l32K22l4jJ60j67R5j84l2K29j55K75l03P1L5p8P1k11K03K30j80j59
2832a05K2j13K89k21K90k39K5J64Nk09R5J71j3M1k44N4K1j98K91k86n7K26j23
2855a14Q2J43j74J38L5j18m3L62l0k03k59J29J63j04l55N14k39l9k3J02j36P5
$$ y = [-228, -134, -123, 155, 168, 41, 212, -41, -180, -61, 20, 113, 116, 235, -95, 238, 55, -54, 8, -322, -198, -68, -217, 87, -8, -160, 113, 232, -68, 73, 349, 8, 21, 161, -79, -154, -135, 9, -49, 237, -78, -52, -124, -225, -46, 364, 133, -136, 35, 213, 121, 43, 23, 65, 49, 32, -193, 189, 141, -31, -150, -82, -104, -52, 127, -31, -39, -217, 166, 29, -6, 59, -237, -159, 105, -278, -109, -75, -262, -204, 124, 17, 128, 87, 128, 90, -261, -160, 31, 91, -54, -173, -102, -101, 246, -114, 88, -145, 209, -70, -67, 48, -97, -130, -51, -134, -113, 81, 35, -45, -206, 46, 275, 39, -50, -129, -129, -77, 291, 140, -192, 30, -4, -5, 155, -12, 83, -101, -133, 96, -59, 216, -87, -16, 19, -59, 12, -199, 4, 234, 54, -105, -83, -196, 93, -128, 162, -77, -52, 112, 117, -92, 3, 174, 161, 202, -42, 12, 33, -165, 126, -160, -217, 9, -114, -32, 111, -63, 75, 110, -8, -51, 311, 281, 78, -181, -52, 111, 7, -348, 166, -73, -112, -135, -33, -169, -94]
2877i4Q8Q7j67K11J4k26J39n9m1R8L7l06M89j56j93K51j32j76J55J36j81j09L8
2900i7Q9J45l21L99Q0l62mK14K0k93K44J09k30j75K32j18J34J82p4k97K26r7K43
2923B49k07Lk01K94j85O5L0P2ll67L54k35P6J96J87l08j19J12K42l42J19M3l0
2946D5j84L82l4k27K36l17J89k89J36K41l05K99m26K77Q1q9L2L1n9J99q1k97K27
2969F7l03K64K2k42K98j77j87L50j28K60l85O7J99K0k91J79k92M32k06j01P2R4
2991A2R6Jq1j30K7n5R7K9k5J00J50J14l57J44K6j5k85J5K16p5r7K2O3Q2k00N7
3017f9L92k50nr4q1N4J85K0r1p5Ro7J13j8m5K30n33K79O9%J43j77j61L62k32l9
3043h1N1J87k22j5J87k72Q5Q3k72J99K04j2j27j21P5R1P1j52j27J0O4O3R0n5P0
$$ y = [-94, -6, 81, -86, 125, 139, -87, 52, -7, -48, 50, 87, -219, 270, 114, -79, 172, 40, -136, 19, 155, -26, -135, -97, -8, 137, -184, 215, 295, -67, -71, 143, 163, -130, 114, 223, -7, -182, 50, -68, 66, 248, 174, -123, 103, 6, 249, 42, 45, -156, 138, -47, 18, 48, 120, 117, -250, 104, -131, -55, 141, 328, 20, -99, 13, 255, -87, 32, 75, 45, -139, 243, 209, -18, 218, -99, 90, -199, -63, 178, -127, 172, -254, 23, 104, 15, 47, 78, 19, 218, 137, -160, 67, -236, 28, 50, -192, 106, -71, -258, 92, -36, 224, -161, -94, 105, 125, -166, 13, -279, 153, -53, -154, -82, 12, 108, 109, 28, -102, -75, -130, -33, -4, -29, 71, 221, 335, -22, 122, 148, 133, -152, -137, 79, 4, -93, -71, -8, 74, -126, -69, 323, 73, 68, -26, -107, -53, 132, 152, 61, -14, -5, -72, 41, 23, -22, 208, -325, -46, 23, 23, 166, -11, -172, 190, -42, -81, -30, 157, -65, -80, 107, -165, -80, 3, -269, -70, 134, 122, -5, -126, -51, 40, 111, -41, -168, -158, -94, -31, 59, 4, 74]
3068G4J5k52L15k47J10j4r7l4J40J57O0k46K40k64q1N4J69j12j24L5K4J41k47
3091a84M07m79N97l80K32kl24N1K10j37j02J31Ml4m3L3K8j03N6j27K13J26Nl66
3115a88N6P0O8p4J04j10J82j54L03n21K60R0j39J43j92Q7Q3K85m2m19K88o7j64
3138e1j2L0j47J08K62j66k89M7L53j58Pnm3O0J4K30j40j10k1j27K50O9J6P6l17
3163f4J62M5J10m47K88l87M61j02j20J17k22L78r2J19o1m3L8n45L96R7j53K71
3185B46k69m16M12J29k74J98j64J46j66J77L9J3l19K95J96n8k15k76L87k32L76
3206B25l48l7K89k61M48k22p0j14J27q8kK0N4j52o5R0oK58k93J68r7J86R0l03
3230a03M0m6K16j52K6K66l15K99k48Q4J25k78k29K39R2j94J11j92K80j93Q4L41
$$ y = [74, 89, -163, 152, -95, 15, 1, -96, -130, 10, 167, 227, -19, 221, -43, -124, -70, 99, -13, -137, -102, -78, 63, -184, 223, -256, 341, -39, 193, 191, -133, -82, 128, -9, -111, 20, 24, -10, -53, -20, 8, -95, -39, -166, 47, 173, 178, -188, -132, -62, 6, -68, 36, -74, 108, -46, 257, -264, -4, 86, -53, 90, -102, -15, 68, 353, 311, -108, 180, 113, -51, -63, -33, -180, -72, 190, 24, -265, -218, 135, -23, -16, -21, -64, -4, 10, 240, 100, -10, -31, -158, 92, 161, 177, 253, -64, 98, 143, 253, -194, 94, -293, 168, 66, -54, 63, -159, 219, 127, 246, 185, 142, 180, -365, 31, 128, -25, 246, -23, -439, -27, 102, -172, 26, -138, 8, -158, 19, 58, 71, -248, 47, 243, 185, -30, -306, 81, -151, 225, -123, -160, 129, -132, 316, 94, 24, -90, 37, -51, -53, -33, 21, -131, -196, -106, -112, 146, -147, 21, -76, 110, 200, -103, -63, -109, 107, -45, -19, 247, -68, 231, -17, 67, 192, -86, -315, -76, 16, -178, -67, -259, 21, -172, -88, 253]
3252B53k10j7m9o4M0m9O15m52K8o8J04r9j0j24o9L39J19l99J12k39K75J22l70
3275b12M66m53J0K09K22k80r1L00l26qM75n30K46j73J00K37j6J01m03K50R6j03
3297A17k08J36j4K17m36P5J85J04p6j87j3K04O8o5KK58l58j9J58L5m5n7j37L4
3321b2j74M23k93J37l2j08L01k41J90k59K75j33j41pQ5M7P9N0O5m11J00J81n5
3344E7R3j96J04k38P7J35L14j57j00k03K3Q5J3m8L64l78J42K91l14m0k58K70k22
3367a86L59j34O6k26J99l25K45j94J49j22K08j92M52k13P9O1l70K96m12R9L63
3388B02J61m53O3N4k1o2P2j06R0j42K17k15J15l6r6J16L78l67K3J1Q4r7j79M41
3412B53L8l65P3j53J43r9k4J78J48l37j37L07Q3j62j07J22L75j43m58K96Rl9j45
$$ y = [253, 43, 26, -23, -87, -47, -96, 519, 67, 95, 27, 131, 32, 22, -102, -171, 168, 287, -112, 0, -239, 36, 158, -212, 254, -199, -189, 20, 242, -38, -129, 171, -155, -163, 312, -218, 28, -145, -45, 192, 176, 277, -126, 124, 220, 117, -91, 45, 31, 248, -188, -113, 72, 176, 100, -87, -100, 104, 172, 107, 109, 367, 9, -10, 148, 183, 138, 81, -56, -22, -196, 227, -66, 71, 39, -69, 232, -9, 181, -78, 197, 64, -77, -84, 1, 48, 127, 177, 242, -169, -69, 112, 57, 150, -46, 58, -180, -103, 32, 346, 189, 89, -114, -91, -6, 7, -41, 323, -55, 87, 378, 64, 24, -234, 36, -186, 173, 39, 105, -121, 78, -247, -2, -196, -47, -169, 39, -153, 299, 86, 165, 226, -144, 152, -260, -161, 202, 363, -90, -27, 27, 6, -56, 16, -90, 0, -142, 75, -140, -25, -61, -157, -41, 337, -30, -7, 4, 88, -9, -188, 253, 291, -74, -1, -154, -11, -110, -134, 44, 192, -145, -282, 25, 108, -54, -161, -39, 336, 193, -265, 31, 40, 1, -144]
3435a44L09j06j41j24J83m5j12L37M0k46K86l36L39l63m6L00p6k22J56L82l9k69
3457F3%m60L25R5Q9k00J81j09L11l79J40k34L25j8j39j85k3L60m15J59J00J41
3479A27j96J07q2Q4l2K04k40k2M8M2k14K18j75K71l00K19j48R1J5n3m6L54l90
3502a18J35M0j55J91q2NR1k79J91O3j33N2o8J26Q2m3R7j28m7R9K1l38K62j90K34
3527A08m3k44k00N59j24q9K55q6j39r2Q0j23J13P5j7l59K47K44Mk70J83j14k05
3550b37L33K24m21O3pP7J08k29j44O6J11P1N6m4j18P1p4k67K49R9m6r1J61j2K10
3575B09Q0l36m2o3J10P3k56J11O4OP1m52L92Jl7R0J03k6n0j41O7J17j83R7L3r2
3601e4P9k12L43r9l30J47j21K75R0r8k75L33R9l0p7k09K78L2l10n0J61l1j49L88
$$ y = [-144, 165, 59, -82, -206, -23, -68, -180, 157, 197, -49, 237, -99, 240, -123, -169, 131, 55, -167, -11, 371, 332, 63, 63, -397, -72, 23, 112, -88, 93, -16, 295, -84, 56, -178, 147, 129, -10, -195, -218, 142, -273, -114, -14, 127, -69, 38, -44, 40, 8, 212, -28, -50, -2, 40, -174, 44, -131, 140, -160, 59, -89, 2, 17, -36, -82, 272, -118, 17, 57, -98, 93, 11, 16, 107, -172, 19, 82, -51, 1, -67, 59, 141, 98, 195, 67, 20, 119, 140, -198, 64, -126, 108, 65, -179, -379, 180, 56, -33, 222, 136, -3, -95, -15, -138, -25, 50, 33, -326, -79, 165, 169, -101, 82, -32, -237, 96, 320, -101, -38, -45, 32, 140, -89, -233, -167, -56, 15, 71, 27, -91, -20, -94, -361, -112, -13, -59, -150, 11, -1, 209, 289, -47, -89, -152, -42, 31, -225, -114, -50, -44, 27, -425, -33, -32, -69, 21, 124, 98, 48, -93, -26, 91, -92, 5, 38, -54, 25, -187, 156, 57, -273, -126, -247, 28, 118, 20, -255, 78, 177, 147, 70, -139, 139, 171, -139, -189, -28, -59, -208, 180]
3625A80j70k44J73J26Q2k48L14j07k19mj29J68p2M52k70J83l09M2J31l94R9J41
3647g5J0J01L52k63p9o7J50l41K77q9j93K39J6j74L03K0o1m07K62N4j21p4M32
3670B72l97K52j36j33J87q3r3K37l21M61m82K87j75J11m5n7L59J11m8j4l65J86
3692A14j11o9L1K30k11p9R0J81q6k13L06k45K7m8j14J84J02k83L14j49Q5l3J21
3715A44k6k92K62j2j7J0j47N8K89m08L1R6j02m0J50K10j06Nj90K29k87K25l92
3738c10K41K67k04R2l58N65k03R6l10j50K90J87l77L61l12K38n8j37J72j35O5
3759B0L07m7k89j57L32k01J22J30k62R1q7n9KL28l93j13M69j48p8k69J55J64o4
3782d7K21l99J95l08J01L0rL7M04j90Pr9J39K4p4J88l58K29j84J1K03J32l75J62
$$ y = [180, 10, -234, -61, 65, 147, -101, 213, 106, -113, -117, -246, -78, -150, 302, 32, 215, -94, -52, 79, -315, -216, -75, -65, 36, 388, 125, 46, -21, 129, -212, 65, -24, -217, 22, 38, -136, 167, 187, 126, -281, -19, 35, -86, -160, 272, -125, 127, -9, -142, 45, -38, -131, 106, -215, 246, -236, 51, -124, -13, -58, -115, 244, 355, 307, 293, -72, 114, 3, -66, -35, 195, -16, -95, -5, 176, 90, -123, 183, -62, -35, -83, -197, -13, 89, -194, 120, -29, 56, 23, 144, 118, -174, 88, 76, 59, 69, -78, -20, 269, -139, -108, -12, -114, -154, -4, 206, 100, 105, -85, 144, -143, 82, -310, -69, 198, -6, 86, -272, 293, 90, 186, -124, -274, 16, 203, -174, 187, -125, 113, 55, -82, 90, -45, 20, 327, 280, -9, -166, 166, -35, 87, 217, -45, 46, -41, -100, -98, 230, -163, -276, 193, 45, -33, -302, -147, 17, -47, 174, -225, -30, -338, -237, -207, -216, -179, 225, 35, 42, -57, 82, 106, 32, 220, -138, 91, -93, -82, 121, 253, -122, 40]
3806D0j28P4K0jr3Q2Q3j0k21J47J46k82P7J30k25L0O5N7K0K04l82r3K23L0K53
3831B46k16j60J53l5rl0R4p1R7j23KL3l15M18j49k08K22P2K29k33N1l34J29J02
3855c5J99n0o4O3N5l93R9q1J02K93k36J65l22K62M2lM1l33m3L54Ok64K78o5l46
3880b76O21k83l39L42j60O2k25K99N1K88k36j10J56l82J48J20M2r5J30k27%K20
3902A46m4r9M7k52J70j28J35j03k09L99j62R6j44m3K26k77L09j47k81L56k26K50
3924A9O0J9j84L7j1K78l27J99q8m2N5L63l33k01P3Mp3R9J98l4j62J76K23k30j64
3949d6K3j03K63P3j45O1j19j81O7L9n5J37k7J87l7M3J56l17K7R0l3k51L42N5n98
3974c49N97l64K88o0m41M00k16j48J59K32k7j18J28P2r1l5q8m8J64j65K65q5O
$$ y = [40, -88, -14, 6, 5, -88, -6, 77, 67, -154, -7, 139, -143, -66, 64, -161, -131, -66, -9, 11, 215, -167, -260, -37, -7, 246, 30, -130, 23, -12, -21, -51, 43, -28, 69, -54, -52, -19, -334, 84, -65, -273, -51, 21, 250, 17, 68, -266, -137, -35, 164, 114, 50, 113, 168, -225, -126, -207, -105, 188, -48, 117, -205, 57, 99, 96, 137, -196, -239, 115, 121, -143, 135, 70, -276, 345, 62, -277, 65, -95, -33, -258, 41, 92, 380, 144, 34, 190, -192, -44, 76, 118, 23, 153, -74, -74, 146, 102, 3, 50, -202, -32, -160, -25, -128, -337, 62, -100, -4, -148, -191, 35, -242, 67, -80, -361, -5, -231, 19, 79, 98, -86, -49, -60, 218, -109, 90, 2, -40, 15, 378, 45, -156, -83, -79, -152, -53, 145, 111, -51, 125, 348, 118, -46, -23, -126, 137, 210, 65, 126, 7, -174, -107, -68, -123, 14, -13, 174, 137, 180, 336, 19, 46, 136, 103, -148, 194, 249, -349, 248, -116, 172, 112, -329, 71, -145, -293, -134, 98, 71, -47, 81, 153, 62, 27, -61, -109, 55, -110, 155, 70, 76]
3997G6Q9j14J57j81j56J59O2q5j08k0J67l5J92l88r9L02j35J97m4o2L23m77M38
4020B58l90L5J42Rj38J40j30n5J17K39m04K08R3q2lk2k6K13m87O1N4l3L18p2j74
4045a29j86K93J59j75m1m7K19J9k56M1J95k12O0K58m11L41K1j84J8j7k16J25P2
4068e3jn2o1l0L20J1RK50n27K64j1L1j46J15n5J68j52j62N1Q5j86J4J13J19k22
4093a08J65j02K39j74J8K19l79K38l80K78K1L9R5l21K34K4J06r8p4P5k88K64m0
4116E1k2N5j61K21k33J78p7o1j6k39L60k44J01O4j81K04K20k18p1n0Q6J65r3k36
4140a97Q7Q7K37q8Q5r3n5J02n26M26k35M08n15K31m9J67o1k14L95j70k63J84J25
4163F8k41L92q3n4j3j42K97k24l2L52j27k30nJ39o6K01j68j66N6n9Q7rQ9k84J83
$$ y = [76, 165, 51, 208, 27, -129, 30, 92, 7, -101, -121, 46, 11, 203, -185, -284, 18, -117, 80, 36, -26, 297, -180, 258, -132, -97, 45, 54, -84, 56, -74, -129, -12, 227, -177, 31, 124, 42, 39, 17, -9, 204, -283, -222, -168, -201, 117, 45, -129, -315, -22, 137, -38, -79, -126, 93, 112, -144, -103, 92, -120, -60, 198, -213, 128, 149, -35, -17, -34, -250, -125, -53, -54, -106, -167, -197, 123, 134, 143, 393, -134, 130, 119, 150, 4, 119, 64, 232, 80, -82, -31, 54, -132, -118, -5, 114, -108, 57, -45, 194, 20, 38, 257, -122, 116, -264, 14, 35, 74, 169, -152, 82, 106, 212, 114, 40, 115, -173, 91, 51, 29, 84, -77, 144, -89, 89, 12, -49, -65, -304, 56, -188, -87, -23, -204, 0, 220, 2, -69, -119, -33, 132, 39, -197, -110, -23, 214, 126, 211, 118, 63, 165, -361, 65, -170, 238, -277, -46, -95, 72, 11, -203, 192, 22, -241, -57, 68, -173, 219, 136, 82, 69, -73, 224, 0, -32, 320, 193, -37, -42, 97, 31, 232, 64, -102, -46, -105, -18, -27, 62, -222, -39]
4188c9J37j10j57M4M0j22K03j44L2J7O6j59K73J19m8j52l2M0j94L80q5k15K11
4211A05p2j35J48j15M7R3L0RP1m1j4j51K18l55J55m1O7Mk68K88j01J85j59K31
4235A99q1n0q5J7LK18k20Jl06L13mJ67k56L06j72l21J34J32J33J55o13M56o5n
4259E6j53K66l51L01m02K54p5R9R9m%n4PN7j13Q7J18l26L33j97J76p0j76K2P2
4284B6n9p5j53N18l32J14L80p66K08K49j14N9k49P4L42m10K32J81k61P7l83K77
4306f5j18Q0m3q2L30J02l93L61l53K41R3m26J87L1j36K92R9k80J96J12l31K34
4328A31j99J25Q4k46K42j98N4R4K8j68K35j41J16Op2J22k8j64j15R6l27O56p6
4351B55j97j28j19J68Q4R1k98k44M32n6m9j1o8J78P0q3K19l29k63K93m0K55No9
$$ y = [-39, 98, -12, -169, -125, -85, -207, -4, -148, -116, -99, -33, -192, 81, 200, 152, 0, -32, 8, -186, 194, 109, -106, 105, 33, -102, 46, -69, -22, 71, 101, 110, 181, 140, 126, -25, 193, -162, -7, -48, 19, 23, -245, 43, -58, 127, -32, 199, 118, 68, -17, 0, 3, 221, 1, 2, -304, 9, 5, 172, -84, 222, 50, -271, -137, -5, 128, 283, -330, 126, 61, 56, -97, 169, -182, 119, -283, -29, -104, -5, 94, 90, 90, 36, 43, 100, -13, 74, 192, -134, 199, 2, 178, 108, -68, -46, 26, -33, -108, -261, 257, -75, 39, 419, -347, -139, 110, -4, 55, -194, -120, 222, -188, 44, 225, -36, 41, -342, -65, -183, -103, -146, -228, 102, 204, -189, 172, -181, 60, 153, -273, -86, -55, -191, 101, 200, -80, 116, 228, -103, 131, -68, 57, 141, -105, 137, -61, -7, 87, 115, -53, 182, 41, 157, 163, 91, 213, 185, 21, -94, 2, -325, 331, 255, 58, -70, -189, -21, 63, 154, -144, -388, 44, -12, -61, -72, -140, 38, 108, 25, 244, -85, -348, -55, -95, 160, 165, 96]
4375I6j17r6L4J39l1j87L58j72R0r0P8k14J81k19N4p9J28O9K2l5J8j2K10j66k29
4400a70R0k0J2K27r5%pj73P6RN8j02R7K1k1q8J68K12j57j04J35l24K72K32l20
4425B8O3j29J43k64J05qJ84m14J68L72n48L58Rk37K32j24M1K18k56J3N5K1J27
4448A57J01l02J93k48l3J51J6K06k27J14p1k34M16j40j56R4j8k06K76m3L7j38
4470e5J2P0j8J6j66K98j69K3k35N65m50L3K44r8j44J6L1K44l50J85p0K61m02J06
4494e3L57k04j39J59p0J02pj98J23j90m8K06j03k6pK69k44K3JM6m2l3q2K13J53
4519B06k85L02q6r3j63K33k72Qq3J32J83j17J99k37k53K41N8L90l13K0j5q8J86
4542A53j69l22M64k70K25l22J85M4K93k47q1J33J52j86j32J5K53j61J49l98K28
$$ y = [96, -21, -117, -83, 56, 25, -162, 196, 24, 114, 24, 102, -112, 69, -150, -96, -175, -47, 22, 44, 9, 27, 15, 225, 59, -170, -80, -100, -88, 139, 44, 44, 37, -136, -60, -51, 7, -95, 2, 23, 2, -86, 82, 294, 137, 33, 168, -156, 116, 348, 28, 91, -38, 105, -159, -54, -62, 122, -292, -124, 248, -300, 58, 67, -170, 62, -62, -21, 197, -59, -46, 9, 30, 157, 258, -44, 149, -99, -132, 19, 35, 241, 14, 128, 57, -177, 239, 99, -57, 37, 19, -187, 89, 46, 83, -55, -43, 27, 9, 25, -141, 157, -12, 11, -224, 341, -109, -76, 168, 70, -74, -58, -27, 217, -133, 52, -18, 243, -159, -53, 304, 100, -39, 120, 50, 152, 145, -53, 70, -120, -168, 38, -65, -91, -98, 171, -73, -50, -49, -3, -45, -78, -160, 53, 206, -79, 223, 137, 44, -119, 114, -158, -150, -233, -101, 82, -35, 164, -73, -326, -85, -27, 363, 50, 70, 55, -33, 153, -16, -338, 126, -144, 81, -241, -56, -12, 281, 34, -47, 86, 238, 52, -80, -65, 188, 27, 176, -222, 6]
4563FJ94q5r1N1j45o0M23l48J77l67O9L41l32L66j48k40j27M69j33K74m15J10
4585a1M7o5N2J63j32k05J54jRJ98k65k48N42k04Q0j92K39q2l1J5j08n9R9j07J85
4610G3j22j7J58K3j22j46J91n1j16j13L39L9r9M2J38m65K07m7J22n8J49l69M00
4633A56j49j27J22m3P5J37k62mQ8j3l4r4J6OJ62k56K41K5J74j26k54K0K00P5o4
4658G1j03j27J29K84j30p2M7k67K92k29J13J75j57p6l8K42k66J67j75J48j57K40
4680A11k64J64J47l79M06j89k26L16j95j56J64K57k67P5K10j00n1k85J05K45k14
4701a26K41l03L93m06O7J72r8k6J19j41J34Q0J50k80K34k29Q3j05J20k46K43m9
4723B7j90j37L00L21j94k29J85J49k2j12q2L44l39M8j94Nj45L77k51Q0K04r4M
$$ y = [6, 200, 115, 24, 75, -70, -130, 293, -55, 122, -245, -176, 165, -167, 199, 51, -189, -316, 153, 20, 294, -121, -11, 36, -29, 23, 186, 54, -151, 3, 2, 11, 209, -56, -304, 238, 34, 114, -78, 161, 79, 48, 63, -45, -104, -5, -112, 73, -49, -66, 92, 115, -7, -153, 38, -13, -129, -242, 97, 136, 37, 79, 217, -248, -41, -88, 34, -24, 125, -244, 156, 7, -120, 2, -41, 34, 171, -91, -95, -7, -20, -54, -148, -132, -126, 36, -220, 21, 46, 220, 94, -160, -140, 60, 135, 71, -32, -159, -30, 254, 124, 52, 99, -168, 124, -105, 8, 183, 26, -50, -88, 154, -112, 55, -120, 28, -129, 111, -153, 11, 158, -221, 185, -4, -230, 86, -109, -265, -101, 156, -111, -36, 174, 74, 23, -262, -157, 88, -126, 115, -188, 205, -201, -134, 38, -60, -86, 33, -108, 26, 106, 256, -24, 210, -19, 64, -41, 79, -167, 76, 27, -163, -300, 0, 321, 127, -102, 83, 232, 210, 98, 16, 360, 21, 69, -125, -120, -265, 112, -139, -59, 145, 51, 55]
4746E5j92L15m7k19J88k45J55k11Q3M94m36l2J83j22q0j24K14l6J22k78K6J20
4768f7k42L20L78n34K01k34K47k71M1L05l08j17J75p7J50J96l46L06q8j21j44
4789b30K02m1J51K01o6k08j90J43J4n4R9n6k7P8j55L15q0k52r9n4K55K19J56l37
4813a6K1p1K13l51J05J17k2o3M9P4j8m6J38l62N7K16R9j89M2j29Q4K36j31m4J47
4838A56k33j57K15k2j54J61Q1j48M5J25J11j86n9L83k59n2o2n3J14j24K95oJ9
4861A90l89K17k6m2J57j50%K98l69K59O6l40l5J1k7N1k43M52j16K8q3k37K92N6
4885B0J9j23j94J59K35m03O47l82K7J15k05J6L61L7m37M9M1J95n6J90q9m17L5
4908a60R3j90O7m4J23%N65n77N3K36l57K25N7jj30J14p3J61m0j04j11j2L20Ok15
$$ y = [55, -137, 178, 131, -88, 100, -145, 10, -201, -118, 376, -60, -92, 91, -31, -111, -235, -21, -57, 65, -213, -187, -67, -309, 11, 389, -145, 56, -178, 69, -202, -161, 144, -164, -281, -106, -183, -33, 163, -183, 123, 35, -86, -230, -28, -69, 82, 283, 217, 9, -181, -38, -24, -78, 21, -35, -62, 16, -139, 176, 96, -156, -255, -309, -54, 165, 321, -16, 5, -66, 147, -204, -99, 18, -4, -67, -18, 56, 38, -8, 130, -232, -175, 41, 140, -49, -7, -136, -52, 184, 53, 9, 156, -77, -234, -19, -41, -195, -34, 47, -101, -56, 69, 180, -6, -65, 318, 59, 7, -55, -108, 6, -118, 177, 171, 190, -199, 18, -8, -50, 107, -43, -43, 255, -114, 145, 211, -129, -164, -153, -180, -129, -372, 80, -36, -8, -91, -328, -36, 20, 39, -84, -278, -119, 116, -287, 360, -22, 5, 120, -85, -69, 292, 329, -108, -59, -18, 177, 121, 311, 222, -195, -160, -67, -257, -190, -234, -111, -111, 454, -123, -70, 166, -191, 34, 91, 90, -40, 74, 1, 162, 122, 18, -93, -105, 215, 221, 6]
4933FK7l4J39j91M76p1m69k6J93p6l09L82L1j4nJ00n8k39M13k71J10L1K8k26J1
4958d2R4r9J02O3k45N2M39m17Q3J2K5N2K0J4l17L01j19k1L7K51l82J02j83J42
4982c6k24L31m8J63l13J31O5O9k89L6J17J5k99K83L3j97J36m09M19K37j73k64
5004b17K36j39N0j7K95n6l2K43l38r8K21k39J90j16m40N14RL0M5m75N52op9M3
5028A76k34Q4J52j79K4J07J1pLK99m08k17L17j90J75j86n2j5O3k0K99k53n7J87
5052G9K4J5j99J44PRJ62k16j50J82n4K5p1L14l11j42O8K23%Rj92j1l4m1J1L46
5078A97j12q4Jo6K50o0l66J30Q1O3l55N87l46j12O85n24L03l29K42j24k29M7K8
5101i3J4J28p9j29L06K27n64L16j68j15j15K87J40k42O1o5P3J35l4J07k37P2j60
$$ y = [6, 33, -1, 138, -53, 423, 352, -117, -143, 50, -26, -335, 47, 78, 64, 59, 159, 101, -138, 275, 4, 114, 145, 173, -53, -42, 52, -47, 55, 118, -127, -75, 364, -53, 30, 42, 67, 119, 139, 153, -164, 137, 18, -3, 34, 285, -97, 5, -178, -36, -260, 71, 23, 186, -127, 4, 69, 138, -151, -115, 2, 17, -282, 1, 34, -163, -27, -436, -17, 220, 47, -217, 19, -120, -70, -87, 208, 152, 120, 363, 25, -73, 148, -91, 99, -17, -457, 57, 66, 96, 141, -334, 218, 212, 133, 176, -58, 26, 178, -1, 23, 130, 141, 134, 137, 436, 28, -189, 128, -62, 113, -73, -125, -140, -77, -97, 202, -51, -108, 79, 103, 118, -81, 63, 70, 79, 241, 25, -125, 57, 3, 28, -43, 271, -40, -182, -114, 109, 109, 118, -74, -85, -119, -160, -149, 197, 85, 1, 2, -64, 186, 126, -240, -110, -29, 34, -321, 266, -80, -192, 493, -31, 272, -57, 185, 61, -168, -121, -93, -79, 49, -30, -159, 147, 374, -190, 126, -42, -157, -272, 15, 155, -87, -26, -91, -18, 117, 83, 190, -47, 25, -135]
5124a35L73l49k26K94J03J0j05L28k23L5k28m0O1J6k99L13o8J31j95K43k5j64
5146a50L48j55m4j02N8J17J42o6m6k55M58n14J67k7J50r1K33n5j0j02n3j15K1
5169i1k97K43J62k02L20q4P3M21p66J56Q3l02K56K94j60j92m3J62j26l2K06j99
5191a18K5J62l97K53K67j61R6k33R6J18j93Jpj30l6L30R4r9nk51J12K3j78L38
5215A07k57K91k7l91M45k27M8j42K40L8k88K9n9L84r9R7l37K07j4J62m1l26K03
5238D3j67M17m52K90J7j30q2j3J14j03q3J63j64K48J9Q4n07L86lj81J55r0K28
5261A89l4Lj34J7J57k56L49k33R3p6j59P7J65l69R0O4K9J61k51J68k12K01j11
5284g2K27l43M14j27j26k87N68k33j18L16j85j68K69Q6k26O5J5K7R4m23L23n29
$$ y = [-135, 238, -111, -337, -43, 60, 70, -35, 293, 70, 105, -123, -163, -102, -86, -385, -72, -140, -9, -204, 39, 14, -150, 198, 43, -1, -103, -45, 72, 214, 148, 102, -153, 305, -209, -42, -69, 81, -10, 223, 168, 158, 56, 3, -112, -91, -388, -145, 17, -185, 135, 51, 124, 545, -221, -65, 18, -284, -28, 266, 106, -86, -129, 33, -93, -125, 81, -118, -93, 69, -328, -75, 192, 31, 127, -106, -10, 108, -85, -84, -91, -221, -257, 73, 167, 68, 63, -188, -76, -53, -231, 107, -150, 141, 114, -277, 168, -59, -11, -153, 87, 125, -163, -134, -193, 191, 92, 189, -148, 59, 45, 207, 166, -160, 43, -124, 293, -159, 131, 148, 18, -64, -77, 37, -66, -149, 14, -150, 98, 117, 201, -306, 80, 77, -104, 51, -39, 189, 155, 158, 24, 41, 198, -58, 291, 58, 151, 75, -84, -7, 158, -211, -121, -57, -28, 133, -118, 50, -162, 39, -72, 155, -188, 226, 99, -27, -314, 254, 21, -97, 219, 34, -134, 135, 221, -5, 60, 75, 102, 196, -227, 96, -433]
5306d33L74L05l57J72p3l0j26M03m40K9K21l64N15j59%K12l85K69j89J48J8p7
5328C3k23L62r6j4K12j39k08n1K84j43N6M4n62N49k08K94l23K58K47m12J64k39
5350a15J28p9K79j93q8PL5J14J62k31r4L82n96L05J24N0p0L8k80J33j57K43n1
5373D6l18L67m04N2M93Ql43j00K75q2J67O8j19k87OM13k45J46m37N54l99J95n2
5396DN6j07o8L77n29K41J02j95N2J56j36o5l8J03L32k97J33JM0o9k7J01N5j43
5420G9n37O09Q1m9p0k3k67O0pj5L03l0j19o1o4p4K31j03J4M31l62m89L39L81l10
5445e2J62J48k79pN3j67J89m4J51L9j95K56n39J56p6L93o4k94J07j5K93Rj02l38
5469b16K04j31J13K34n89K79O9P4o9k08K79j31J63J5Mj37K1K9m1k4m4O9j27K16
$$ y = [-433, -59, 246, -111, 61, -12, -42, -168, 235, -205, -176, 45, -319, 196, 37, 37, 249, -136, 133, -56, 92, 110, 33, -190, 172, 76, 62, 274, 135, -73, -124, 160, 17, 73, 117, -445, 104, -104, 190, -133, 125, 372, -40, 124, -115, 13, -66, 213, 20, -68, -61, -26, 88, 250, 19, -75, 307, -289, 16, 140, 190, 120, 158, -122, 11, -146, 97, 46, -272, 95, -309, -257, 236, 244, -99, -199, 76, -6, 161, 229, 110, -177, -171, 242, -3, 143, -294, 260, -139, 56, 4, 60, -47, -115, 262, -267, -26, 76, -119, -67, 89, -47, -112, -150, -47, 285, -12, 121, 122, 162, 93, 66, 167, 222, 79, -458, 151, 232, 183, 113, 90, -177, -117, -124, -139, 164, 134, 15, -46, -110, -184, 47, -56, -42, 389, 27, -462, -123, 258, -52, 110, 258, -21, -28, 25, -142, 47, 3, 154, 193, -2, 254, -285, -129, -205, 188, 124, -170, -63, -78, 215, 224, 122, -216, -12, -143, -30, 204, -385, -106, -37, 37, -32, -240, 39, -92, 71, 86, 90, -47, -26, 3, -38, -62, -106, -37, -164, 52]
5493E2k32L17k8M7j59k33M63l37J55l0l35L83o9j85K25l7L7J9j79j1K95j38l19
5516b99K34J14mj02j66J2L75j29p0J08j55M6j12L08J17l69J67j45m8k6J44O0l36
5539b76M11j55N5R8n0k79M35J15j48k06lj08o8K87j25k28J72J56j61O03n12O2
5561G5j14j15J08L16m48L6M06j01l05K2K46r9O7l03K70J9l9j48jK64k19m1J04
5584@j83q0LQ3J09J35O1R0j44l6k64K34K46q1k89J98k96L72k22oj27LJ80o5l4
5609a13j39J22j4J05J89k55L25m3k85J93Q1j01M1k25J28o0q0K07r0Q0m5rj54M91
5633C49l82N7j07K52n3k32P1J69n66M57j11%K28l86O44n39L59k77J20j22o7J85
5655D9m29L39N0K65m29J73q5PJ26m2m4J13r1J79k27kRJ00J66j32K6n6j01nJ89
$$ y = [52, -180, 137, 109, 156, -3, -236, 227, -110, 45, 15, -320, 63, -6, -191, 34, -3, 34, 53, -126, -137, 158, 20, -299, -65, 49, 45, -57, -223, -211, 164, 35, -35, 73, -82, -36, -148, 160, 277, -92, 75, -70, -118, -144, 0, 60, -276, 135, -20, 35, 133, 83, -196, 239, 354, 206, 0, -3, -111, -179, 108, -17, -245, -73, 83, -78, 525, 13, 75, -39, -154, -46, 270, -178, -142, 264, 163, -142, -120, 126, 27, 94, -209, 61, 80, 41, -107, -108, 156, -63, -104, 0, -183, -263, -260, -177, -68, 67, 128, 218, 74, 38, -226, 8, 254, 173, -116, 82, -214, 158, -64, -70, -197, -194, -14, -79, -113, -252, -130, -144, -39, 150, -105, 220, 177, -108, 85, 166, 65, 106, -119, 9, -51, -131, 76, -14, 66, 21, 12, -142, 349, -33, 24, -83, 169, 116, -116, -45, 124, -442, 15, -96, -96, 132, -254, 390, -149, 210, -67, 53, -69, -136, 49, -380, -41, 9, 274, -155, 18, -67, -60, 66, 24, -20, 93, 2, 181, -46, -48, -39, 61, 227, 95, 121, 65, -36, -41, 148]
5680A48k24K64j38j34L0N5l7K06m34NJ70J19k9j3m2J14j56K4k41K89P9N8No9J18
5705A67k4m8K32l65r0J87r0km4J79k78K26j33P3r5j51J74NJ16l71L10J1l8K87
5729B38P3k59qJ33l15K80k95K71r9J74l84K14o2l05K38L6l2O0K86k42J11j72R9
5752D0Q9N0k10K51l44q6K64O3j53J95n3j65J58p1K1k48J60j94J41J56k97L83k08
5775e8K51k2m9P8j82J39M3r4j07K6j31J42J15q2J7k3N1J31k02n4P5L0k5J59k43
5800a5P5M9l64M09o3l65K04J65k6j25Q1j05K9J07j82P7N7k01KL84k80K69l51J26
5824d3j32L53j0m39Q3K53k95K36P8l43K88o9m3l55P61l90o7R9k5o7J27o7j20K81
5848I4k72L41k91L21l27J61J20j27J7j00K41j93N1o4K1o5K42k58n4m6Q6J62K4
$$ y = [148, -76, 188, 50, -84, -54, 1, -36, 170, -264, -259, -89, 30, 1, -12, -54, 60, -96, -72, -313, -24, 55, 113, 118, 49, 167, 143, 95, 327, -38, -128, 59, -31, -33, -77, 102, -176, 50, -83, -10, -105, -256, -82, -77, 39, -332, -22, -11, -49, 238, 311, 52, 44, 177, -138, 142, -153, 118, 19, 193, -191, 23, -39, -344, -106, -70, -102, -42, 244, 2, 113, -59, 40, 129, 179, -31, 220, -124, -210, 54, 117, -36, 159, 106, -59, 99, 28, 49, -199, -39, -233, -92, 64, -233, 150, -58, 193, 171, 122, 200, 18, 157, 200, 106, -1, 25, -106, 36, 151, 69, 86, 63, 114, 245, 43, -11, 64, 94, 69, 228, -15, 60, 109, -255, 154, 91, -274, -70, 95, 69, -56, 25, -80, -51, 56, -126, -49, 8, -193, -191, 193, -87, 182, -169, -43, -175, 178, 168, -271, -188, 65, -230, 6, 84, -259, 29, -40, -83, -438, 323, -67, -134, -35, -60, -127, 0, -67, -187, 94, -178, 163, -128, 193, -134, 27, 147, 20, 37, -63, 178, -15, 36, -28, -7, -72, 170, -88, -142, -188, -102, 60, 84]
5871H4P4l3l06J68j85K36lk11J96L81m10p6J46l1J17r4j54K34l17L05M1k05j16
5894a59L5M29l33J41j23R3j67K83j50l0k08K77p2J73j52j58Q3P2L24l89j86K09
5916hk2o9M6K67k83j32J17o4J94j40m4L42k41j78K91J66k99J7K7j41K96q2j21
5939f1K01l13L86J30n93J42K70p1K05m3l26Q4J29p6L4N3l1n5m2P8l11J93J66j9
5963A30k20R8M1k15l9J5J3K15k43J88rO4j49j69K52mQ4J23o14J10L82j09m9M5
5987f0p5J1j20K95L17m09q1M1q1j8K85k16LJ35J80k80J09M8O6l44J44J24k8M4
6011I0P8N5k25k29N1L23n8J1n9j17J09J32j11k74L96j59J20k19K10K9J03p6k97
6034a17Q6j72J96k5J04k56J18P4N7j82O2l4K99j87K02j35L8j07K02l43L64j13
$$ y = [84, 158, 125, -181, -13, -198, 38, 35, -176, 20, 401, -9, -85, 61, 30, 147, 53, -101, 133, -184, 121, 162, -43, -159, -124, 305, -28, 113, -10, 83, -84, 199, 49, 19, -189, 88, 16, 189, 37, -121, -38, 34, 358, -31, -217, -8, -30, -99, -53, 214, -69, -201, -84, -148, 46, -94, -138, 204, -37, -215, 76, 242, -57, -40, -13, -154, 142, 60, -61, 140, -173, 213, 343, -250, -108, 162, 91, 296, 253, -73, 11, 140, 64, 98, 151, 120, 65, 23, 101, -210, -17, 149, 130, -90, 8, 49, -166, -205, -190, -177, 38, -205, -17, -26, 38, -111, -280, -28, -32, 52, 175, -439, -329, 53, -56, -105, -60, -135, -124, -244, 51, 368, -41, -122, -81, -162, -180, 105, -111, -108, 27, 207, -73, 36, 84, 150, -194, -50, 74, 46, 90, 168, 223, -2, -231, -180, 143, 85, 96, 37, -80, 29, 161, 50, -224, 172, 13, 133, -86, 124, 153, 256, 180, -117, -31, -203, -7, -32, 72, -184, -66, 8, 65, -117, -55, -89, 210, 23, 225, 90, 128, 21, 223, -120, 244, 131]
6056A31k30J08R3l5k23L78k54j46J15R3JK02m08m1J08J89R0l37K87M3n9O1k19
6079e3J88LM4k5j60q7K80m3j43o8K02j90Q0Q2Jk11J26K0r3P8J89qk95J76J34K8
6105B55n04K75j21R6M0j42j33M86j13j90J43j37Q9J9oJ9j61P0k38J98J83j6j10
6128BoJ03l42N51j17k71L67m77M78o00K72J19j99K67k27L07k34j04J17J75k17
6149c6j43J13m4K56k48n2J00R0Q0j46J61k19P2O8k8N0l9K90l95q0N7Q8J93j43
6173D5k56J5J66K58k13q5L38n58L62r0k92J42J55P2l52K76R1J35k05J02l5l43
6195b72M48l40J09rj54M80k88n2K99m73L26Q4r4o2K7j25k12J79J54k99K91J70
6217A87K3l5k50R2J26j42K20j01l8M0M2m49P5L1O4K66j74m0l7J84j6r1p7J73L8
$$ y = [131, -99, 9, 102, 67, -156, 222, -32, -178, -63, 30, 31, 233, -175, -216, -108, 81, 171, -166, 121, 164, 105, 166, -53, 135, 138, 182, 157, -3, -90, 190, 147, 4, -64, 138, -52, 28, 110, 111, -100, 26, 46, -47, 31, 220, 212, -83, 93, 227, 255, -249, 26, -95, 1, 41, -101, -234, 252, 139, -51, 92, -45, 44, 63, 57, 76, -85, -15, -253, -55, 128, 112, 2, -4, 99, -243, 308, 191, -80, 287, -190, 288, -312, -40, 79, -120, 147, -80, 227, -7, -111, 6, 181, -36, -179, -66, -110, 146, -102, -154, -54, 36, 116, -30, 131, -88, -16, 52, 24, 74, 35, 325, -70, -150, -93, -5, 188, 45, -211, -196, -30, 228, 15, -70, 268, -290, 72, -18, -310, -168, -13, 59, -293, -17, 74, 209, 4, 106, 71, -272, 176, -164, -55, -64, -218, 262, -26, -78, 221, -252, 74, 158, 64, 2, 29, -96, -308, -129, 25, -274, 17, 187, 210, 175, -75, 17, 143, 1, 221, 120, 82, 122, 164, -285, -210, -179, -115, 151, -23, -63, -100, 84, 68, -23, -100, 73, 111]
6242A11m0j91j62L60j51p2J25J01j15R1J1j9n1j8J30l01K36j51p1M35n09K05J17
6265G1L53n20K66k89J95J97r0m31K94P4o7J68k05O3l3K9k99J98j02J92j24J06
6287D6o8l97O89j26m33L76M1O0k52JJ36j80R3j01Q4q2J83j62O7n5j12J00O8k90
6311c14K89J98j56J0l8J52Q6p5k97J43J97l26L22j72R3l23K91l9k95R9OJ36K17
6334B04l28L42j96J31p3R0j4j90P9j81jJ07J91j47j41K84L4l68K20j08K9m7J04
6357B1j33k6K09k65K08j09K57j61P1l15K30O5QO6j26K49k35j0N4k58L24N3Q9l05
6381c9j00Q7J32j72p0J61k32M16l83m7L69PJ23r1j32j34J17J12j5j51o9J24J46
6404A59J06k29J59k76L6J17J23l56Q6j83L79k11P3j78K33j52K03j10j29K76l98
$$ y = [111, 71, -120, -282, 78, -73, -145, -20, 81, -34, 57, 68, 49, -2, -20, 110, -191, 45, -106, -177, 258, -251, -46, 71, 424, -96, 170, -119, 76, 273, 183, -248, 46, 120, 53, 221, 16, 79, 46, 75, -224, -26, -128, 64, -60, 46, -22, -419, 270, 144, -289, 87, 128, 188, -64, -63, 73, -107, -14, -115, -31, -113, 70, -92, -25, -80, -192, -92, -24, -314, -25, 173, 17, 27, -11, 141, 227, 152, -145, -2, 195, -131, 191, 19, 112, -211, 80, 41, -254, -155, -149, -13, 204, -124, 218, 22, 153, 80, 170, 156, -34, 45, -136, -137, -30, 161, 14, -127, 157, 191, -177, 43, -65, -36, -83, 21, -112, -138, 71, -194, 14, -95, 162, 1, 72, -243, -13, 52, 60, 126, 0, 249, 14, 4, 58, -200, 124, 177, 266, -39, -139, -52, 80, -92, -162, -1, -233, 183, -200, -247, 122, 129, 252, 161, 29, -105, 12, 124, 109, -42, -111, 13, 159, 265, 36, 195, -81, -45, 72, 195, -161, -75, -258, 121, -90, -17, -195, 38, -114, 89, -21, -150, 126, -272]
6425b72J60L12j79m9J52l16L17m6k43L09rp1j20r0J28Qp6k3J71k21J45k82J23
6448a72J21L9n5m1J75Q9k46L80n9k2k50O6Q5m02M54j87J43j45Q0o8R7j42Q8K1
6472D9k47%L39q8M1l73K34K18l59L96j87r7J85j83O1M7Mj94N6M6Q4J43l64L07
6496A18k07r7L03k00N5O5j53N1J6J0j95lK47J60j43k35K60J30j04j15J06k51L32
6519A50j64J44k41K9R9mJ4K25m17qL38j93K26j25j54J0N4O5k3j77J23J93l7j12
6543A5k5Q6n3k5M9j35O2j2lK57p6l63K88j4l4r5J67K0l31Q6K55m6j67K88k37K02
6569A59rq0j54O5j68q0K17J92R4m67O54l66k75m0J16L43j13j98oK6L74n36R5J00
6593e7k67O69k43m6j63j02K49k52kN14k44J7j83l9l9K73k01O1O0L2k50J26pq5
$$ y = [-272, -112, 200, 21, -28, 124, -192, 125, 79, -164, 145, 136, 65, -55, -145, -17, -9, -85, -108, 63, -158, -13, -295, -172, -51, -12, -67, -108, 67, 156, -90, 290, 231, 209, -41, 25, 110, -292, 162, -25, 118, -27, 53, -15, 82, -60, 28, 49, -198, -198, 141, 53, 94, -279, -45, 173, -186, 210, 23, -74, 111, -72, -11, 36, 40, -154, -98, -52, 32, 175, -189, 118, -89, -186, 117, -83, -28, 37, -116, -65, -49, -39, -234, -237, 10, 170, 27, -208, 52, 182, 78, -37, 69, -182, 150, -14, 130, -111, -82, 17, 13, 27, 252, -165, -173, 165, -28, 198, 73, -81, -71, -17, 48, 25, -152, -29, 164, 127, 15, -10, 76, 23, -2, 47, -88, -26, -38, -41, 216, 140, -223, 65, 51, 17, -78, 89, 109, -222, -136, 119, 73, -94, 194, -43, 159, 150, 70, -84, -19, -187, -267, -50, 142, 236, -231, 423, 57, -218, -258, -142, 201, 88, -110, -116, -90, 284, -252, -157, -57, -324, 345, 102, 56, -107, -209, 40, -212, -214, 300, 56, 73, -110, -149, -188, 85, -116, -55, 5, 37, -213, -87, -94, -179]
6617a79M15k03R0l16L77j20l5%J53j66j68k73L60K49k99J4O5L6rM0j94K80qq6
6641B3Ro9J60j35j53L3O5J40J47k89MjJ96J15l25pK34M0j18k43L81l54l9J22R0
6666B6J77k76k4o7L82k84n7Q2L60m74L4L13r8p7R6J88m39K44J29o9k74J97j84
6689i5J03J18j08j40J93K3l73J38k31K59J73j46p2O6l4L29n9L8j90L04m42p2L17
6712I9r7j78N03l29k34R8L21j36k7oj8n6r7J57j66J45L06l77Q4k21L73j48j66
6735a70R8j75L09k34K55q9l9L6O7j05J32q5M5n0P1j34J90J84m72L58j78l85L84
6758A3O2m1J98l12M3m3J2J02k39O5O6J34o9J3k23J09k73L89k9j94o5L45o8J95
6782A90n6j54J47j00l27J35O7J20K8j32K33k22K29j8j13K89k96o8m9M07k81M8
$$ y = [-179, 236, 33, 123, -193, 184, 64, 29, 29, 182, 16, -152, -425, -65, 184, -115, -101, -36, 0, -9, 31, -163, 117, 109, 23, 32, -37, 123, -12, -165, -132, -67, 73, 220, -69, -65, -66, 130, 245, -80, -87, 147, 187, 69, -174, 207, -147, -186, -64, 26, 203, -73, -97, -164, 218, -66, -123, -41, 319, -155, -121, 192, 94, 17, 113, 301, -138, 106, 235, 166, -108, 89, -95, 8, 126, 18, -122, 71, 94, -279, -141, -372, -113, 60, -86, -158, -92, -126, 203, 144, 182, -8, 296, -146, -218, 99, 2, -176, 327, -2, -236, -138, 183, 47, 20, 14, -4, -60, -157, 0, -166, -21, 285, -92, -8, -229, 144, -4, -170, -72, -247, 62, -172, 83, -6, -45, -9, 58, -47, 85, 0, 45, -5, 66, -68, 122, 306, -166, 192, 14, -371, 13, 75, 34, 232, -80, -37, -80, -68, 34, -205, -140, -74, 60, -9, 4, -219, -110, -383, 6, -23, -217, -282, 63, -5, 190, 134, -20, 127, 27, -300, -165, -98, 22, 50, -82, 151, -71, 158, 140, 27, 316, 20, -48, -97, 310, 29, 77]
6804G7o9K4m4k57J33p0L95p5l4k0r1l0K08r2K99l58j23J56N5j70J57k36J62P7
6828G4L4m29L05K71k93J65j53L00k24R6r7m1l7O4J04r0R9K6k69N7K75j54LL3p5
6853D4k81Q3L69l76P8L7m1J43j12J34R8j35k71M00j37o6K18l48M76l75J43K7l22
6876b14K39Pk4n5j77J30J43k09J05K43j13j70K30P9j24m39J4K62J63j95Q5P7R4
6899A51l52O3L71l43J05j05J21m7k51J73Q8J99Jj91o0O4l1J11j38M0nJ89j40P1
6923H4k44O0M84m16o6J21Q9k3k54KJ92K31k16k85K17r7m0l5L79l43L52k25J99
6946A66k21q8J08p2q3L07l11O2J75q0M0q7j3K77j76k21K75J01j31J04j35j79L36
6969A54k92K19r2l1j42P6J13J36J23l28m6K94r3n2j81N9Q9m58M02L8m5r3o4K29
$$ y = [77, 8, 32, -12, -269, -136, -206, 189, 114, 80, 60, -31, -61, 147, 55, 354, -4, -127, 29, 84, -86, 71, -165, -3, 74, 108, -321, -16, 255, -38, 127, -26, 274, 50, 146, 49, 8, -29, 35, 139, 49, 148, 174, -95, -38, 237, 83, 86, 119, 44, -237, -154, 215, -161, -83, -46, -87, 56, -56, 78, 176, 41, -230, 170, 33, -33, 185, -163, 313, -62, 81, 108, -214, 25, 32, 8, -47, -224, -94, 49, -160, -55, 188, 75, -95, 135, 214, 90, -349, -335, -73, 90, -105, -20, 57, 151, -201, -138, 233, -110, -5, -110, 11, -36, -287, -114, -26, 173, 174, -17, -77, -13, -44, 67, -71, -31, -36, 153, 13, 84, -160, -100, 384, -32, -98, 23, 112, 89, -165, -163, 29, 260, 44, -241, -24, -121, -161, -196, 183, -160, 192, -33, 166, -55, -143, -35, -107, -190, 117, -194, -132, 43, -37, 3, -84, -97, 180, 4, -217, 58, 159, 28, 132, -3, -182, 154, -138, 81, -11, -42, -184, -108, 5, 141, 264, -64, -110, 184, 91, 39, -142, -83, 6, -452, -50, -12, -57, -150, -214, 15]
6993A5K41m87O0L24j35J4K75j41k83J30J39n2J76j80j87K4P9M8q4J12j52M1k22
7016b45Q6J84j31PjKkR0L6k11L90J7j14r6J36j02l6J21l2k18j44K60M9N3j12P
7042fQ0l07JJ43J38K12j31j66j61K25j99K0K44k01K3J81o3k94J99P5K33l20J51
7065G7O1q0Kk30M7j43M57J34k33k40K54j1j31L0k5j16m8J53o9R4O4j07k91K74
7089g7o0L96l06j42Q4L28k30J3K6k6k53J98j0k7j3p5P1J18o3N2J18k79L15l02
7113a44K49K63m01L79k67k00PJ50J36k31J01L9l97M41k03M6K60k94R6R2J44l99
7135a33L09m92M62p0k21K9J84R5k67K15Q5j40k49J90j72L11n8j06R9j72K24J50
7157B73k92r4J58r5k14J92M41j40l90K93k82L2l7M7K23j37N3J62j14l71K50M6
$$ y = [15, 256, -231, -171, 153, 18, 32, 307, 166, -117, 13, 152, 100, 276, 96, -91, -67, 12, 60, -24, 88, -64, -23, -245, -159, 25, -106, -99, -100, -98, -100, -10, 26, -185, 205, 222, 108, 12, 148, 46, 10, 131, 99, -119, -263, -3, 46, 99, -13, -6, 74, -233, -232, -89, 49, 261, 130, -36, -197, 28, -171, -151, 93, -108, -85, 96, 33, -261, -62, 13, 246, -74, 77, 138, 58, 60, -170, -123, -266, 191, 325, 92, -148, 106, 95, -36, -6, -31, -147, -195, -42, -111, -17, 47, -60, -351, -77, -137, 259, -47, -189, -105, 223, -7, 6, 32, 6, -247, -49, -59, -86, -99, -174, -103, 15, -48, 4, 122, -157, 158, -144, 105, 368, -33, 346, 79, -121, -114, 36, 172, -59, 42, 81, -316, 125, -78, -32, 228, -66, 30, 122, 266, -133, 176, -316, 146, 76, -145, -116, 68, 163, -104, 111, 196, 56, -193, -3, -175, 136, 78, -28, 71, -101, 123, 273, -19, -113, 45, -50, -264, -72, 369, 229, -161, 132, -150, -118, -155, -108, 115, -22, 31, 193, 79, -292, -42, 4]
7179Dk25J99J7JL3l7K6L1N2j92K3L1k13K76j78k3P2J30m6r2LJ43L3k4j87M67j38
7206A86o0j48m6K5k11K87j90J23k56M9K39j04K97K4j88k3j43n2P2n6K30j73J82
7229F4j03J04j01k74K75q1O9K12j20q4l8j6qJ17J9m9K02l2k09j2L03j02l1m10
7253c05J40p4L28m0j27k68J62L92j81J76l08J32pj04P6L5J0n3R1M3j69m6Jj1J41
7278C4J0j93L68n06P4J58J07p2m4P8q0J32j01P5L9q1O7j56L0Q3l29K50Lj58L13
7303A01K1k42J87o7j2J69l00K52k63lK5K08p9j18K65l27K99Q6j30k60R1m7n3M05
7327B08j53j12J96P7k86J39l6o9J6J24r1k78K84r2J72J69j63k09n8L06r2Q5k42
7350a05L23j98Lk84M03j21K1k23K84PQ2k24k62L22o1R4j79K06k45J15P6J40j77
$$ y = [4, -221, -22, -5, -4, 29, -8, 18, 49, 101, -91, -68, -37, -250, 26, -152, -175, -103, 27, -19, -111, -108, 35, 68, 44, -143, 324, 186, 126, -22, -68, -43, -254, 33, -157, -34, -290, -241, -2, -106, 191, 215, 27, 4, -139, -191, -119, -175, 55, -118, 64, -39, 65, -36, -310, -35, -116, -47, 165, 45, -39, -77, -93, -101, 16, 35, -14, 188, 156, -53, -65, 238, 136, 105, -305, -165, -239, 89, 49, -78, -346, -184, 208, 27, 203, -105, 27, 20, -84, -8, 27, 37, -16, 75, 118, -51, -97, -96, -107, 34, 44, -149, 219, -287, -213, -55, 52, -20, -64, 14, -66, 66, -35, 40, 79, -2, 65, -91, -61, 22, -307, -57, -54, -212, 101, 122, -120, 67, 0, -12, 157, -143, 109, -154, -157, -132, 76, -3, -121, 144, -183, 116, 202, 72, -188, -97, -144, -197, 208, 55, -57, 139, 216, -70, 69, 33, -36, -20, 104, 13, -265, 19, -73, 99, 268, 105, -104, -162, 144, 52, 137, -105, 218, 20, 23, -261, 142, 21, 42, -181, 103, 110, 192, -32, -294, 28, -33, 61, -118, 88, -157, -42, 34, 174, -3]
7373ck20M19k53J63l50r5J89l4K77j93K06n8l63J87J35N3n3j23m1Q6k02K50J35
7396A12j12J2J19j28j14J61r4J66l8l6j04J22Kj49O5Q9l17J15N1j39K47j82L17
7419A65K38n14L9K80j73k6Jm17L28M65m89o6J13K50l28K65m07J59o1K04o4J01
7441F3j95j51L10L1rj40R0k00K9J50P6Q8k9l07J17J84j07j81J93K54l79O3O1K19
7465B30p9l16L53k68J61j15K5J13q7K42k17q2Q0j72J98j44J54q0q1P5j52K62l6
7488F4k94L54k05J51m9k08L29j81q2r4l3J47J82n6L49k18Nl59K43m9J38P7j07
7511A04j04J50k42K62k34J18m2j30p6K87k05K20O3j20k29K30J48j36K35m55J25
7532c1R2o6K1ol32M11p2j09L37l92L28j04Mq7pq7m0M25k59k9Q8l8M8J5q0q6k34
$$ y = [-3, -223, 196, -57, 106, -244, -339, -150, -184, 93, -100, 106, 48, -315, -128, 7, 60, 7, -116, -157, -71, -273, -23, 112, 0, 12, 131, 3, -111, 50, -44, 122, 84, 48, -56, 66, 68, -81, -16, 73, -244, -129, -78, -217, 30, -152, 165, 403, -111, -72, 208, 35, 9, 10, -407, -79, 386, -103, -169, -56, 194, -134, 131, -276, -117, -178, 26, -38, 63, -132, -283, 27, 58, 49, -91, -1, -201, -172, -22, 54, 142, 113, -194, -77, 107, 0, -181, 12, 266, -113, -50, 11, 230, 151, -165, 188, -80, 81, -34, -9, 104, 17, 259, 42, -40, 40, -132, 66, -78, 76, -4, -85, -10, -162, 100, 64, -230, 124, -81, 70, 21, -187, 142, -39, -121, -215, -248, -101, 81, 25, 374, 156, 161, -198, 45, -4, 134, 211, 104, 0, 150, -92, 170, -64, 54, 12, -118, -194, 93, -112, 108, 171, 51, -178, 52, 200, 64, 299, -156, -31, 61, -5, 16, 10, -322, 89, 17, -92, 245, -147, 181, 77, 81, -6, -13, -100, -140, 285, 26, -3, 85, 47, 95, 110, 30, -56, -290]
7559b90J72j8J55Q8l90K20M09j50l24L10k43j06L70o7J14l35J20j02K54k90K10
7580A07j91K06j78O5Q6K5j00R6m46M07K52k10j63M8q0J42Q1n4k30Q0J86l75L72
7603A26j05j13N68l86l0L3j71k10L67k48j98N28J01m50Q2L25j68j00q8K57k3J49
7625B46j88k09K28j50j5K75l48j2J18J93j07K1O8k27o6K69p0k29K95Pk77K07J77
7648B06k77K32j93k0J56j84P4k8q4j58L20m4Mj91J95K40j45k27R2N2j87K03J47
7671A83j09n2nK9l8j80K22R5j41J5m1K12m36J82r9O5L10r0p3j90M41l55R1j18
7695h2K2j8K12j6l3r3O0j22k28L32l06L15J48J17k45j17P1O7K6k01K69m47M40
7718A71L0k86K32k19jk61K79q7K06p9k6R8j17R5j15k23J8L21J98j39o7J14j67
$$ y = [-290, -118, -136, 19, 107, -283, -63, 346, 196, -128, 182, -61, -167, 203, 136, 250, -85, 35, -67, 187, -103, 107, -84, 122, -56, 9, 95, 120, 20, 116, -330, 77, 329, 119, -44, 4, -76, 66, 147, 93, -137, -57, 129, -246, 126, 21, -92, 476, 90, 60, 93, -78, -288, 79, -169, -367, 161, 262, -188, -106, 219, 51, -49, -137, 120, 97, 246, 58, -151, 77, -73, -88, 187, -161, -173, -55, 138, 31, 52, 120, -107, -173, 96, 26, -203, 92, 99, -178, 29, 206, -71, 161, -32, -52, 104, -80, -6, -34, -118, -276, 44, 0, 4, -187, 8, 248, 103, -124, -32, 20, -167, 36, 183, 74, 22, 17, 46, 8, -172, 50, 145, 4, 19, -22, 190, -246, -64, -163, -98, 212, 122, 49, -141, 300, -55, 36, -82, -60, -78, 134, 118, 85, -8, 52, -70, -298, 34, -272, 43, 191, 308, 63, -54, 17, 84, 110, -91, 178, -269, 171, 201, -85, 147, -72, -73, -334, -55, -142, 64, -15, -41, 57, -60, 35, -80, -303, -285, 36, 234, 95, 28, 142, -25]
7741b5m3K42j15n5Q3k29K07J3k90K48M5l44K38N7M7r6j9R1j22j05P7J7N1k2J10
7766F1P2j33j12l2l25M76k16n8K99J66j22j2j70L2K36n20M63lJ4l02M23k15o8
7789d6P2l7l73L29LK3P2L4Pj30J46J08j73q7N9O1k44Q8J9j51j2K54j00O1M6j78
7815a49K22q7K28k12lJ4M0j8j40n0K25j78J70J40j61J46K5j53m8J3k7n0L6R1l9
7840C5j68J07qJ41l62L34M1m9J50n2n0m88L89j42o4J25M3q6J02j60K24l29L31
7863F4j2K09j75j40K18l68J70N3K58l07j49K72j43R0R8j65J19k52K66j25l27K64
7885h2j6l8K6P4J99j42j4O7k59O26o18L36j47p6m6N6j95J50j65M10j60J96J29
7908C11j87k26L25k6j71j75O7M2m7J46J04j23k3J0j27J57R0k98L73l5j88m8k24
$$ y = [-25, -68, 174, 59, 4, 87, -142, 65, 78, -212, 36, 81, -263, -25, 32, 79, -17, -36, 55, -67, -172, -95, -78, -27, -49, 61, 133, 0, -112, -144, -469, 7, -209, -267, 32, 198, 76, 64, -106, -74, 162, -358, 105, 102, 116, -186, 237, 22, -46, 26, -11, -384, -55, -52, -29, 43, 77, 84, -46, 100, 208, 35, -52, 7, 68, -176, -88, -69, -220, -232, 22, -78, -17, 29, -149, 73, -14, 214, 2, -1, 13, 53, 35, -105, -155, 70, -108, 62, 202, 41, 187, 212, 59, 11, 24, -3, -53, -17, 74, 35, -133, -26, -34, 107, -255, 79, 120, 71, 221, 169, 119, -369, 20, -122, -186, -61, -18, -104, -2, -162, 62, -267, 64, 52, 261, 86, -54, 164, -204, -34, 19, 277, -30, -179, 93, -50, 40, 138, -27, 92, -160, 106, -19, -346, -82, -98, -136, -110, -36, 163, 21, 7, 74, -185, 441, -177, 159, 12, -64, -110, -54, -249, -99, -264, 146, -14, 182, 311, 124, -102, 223, 197, 26, -149, -82, -40, -87, 59, 163, 40, 17, 27, -100, 57, 147, -151, 222, 187, -1, -49, -273]
7931b73L57j24m7K8P4J32k31m5J41l0pP4J83j19k71L86k01k11M25j55k88P2%J07
7955b3m8MK00M3j40M0m3j59%K49L0j3j63J66l87OL55k7K4q6j16L37n29K67ml14
7981c31K03M19n02L61m4K25l21o6K30m28J73L17j28k45J73j54J82k24R5r7L28
8002A66m5j45l72L32j07K49r9J01k33R5O1K57l52k03K49M3o5R5j03K35j55M5r2
8025d3J69k00P7L3j03J5l7J09o2j25K66n8j41JL41j58J56j60j5Q1k88K36K53j64
8049A83m3o3l40K41j94J10J69j55J44k36K65P1k90q3K50j56Q5L1J50m17K75J80
8071A77m02J12J9J05Lk0j44M8Q6L16j21l72J09K89j83M6j15l37M37j19J02l2k16
8094b12K74Q1j65K64k12j4j00L9j28J84J79k41M7r6K85k70J19r2J13o1K89l43
$$ y = [-273, 84, -40, -87, -59, 15, 147, -84, -129, 12, -18, -25, 49, 232, 113, -158, 228, 27, -184, 241, 86, -202, -130, -130, -23, -71, -67, 133, 176, 36, 76, 33, -126, -126, 123, 153, 140, -23, 143, -244, -238, 117, 90, 114, 28, -88, 249, -280, -13, -17, -331, -128, 291, -211, 150, 106, 331, 10, -56, 174, -254, -81, 236, 108, -137, 36, -118, 64, -160, -65, -162, 166, 121, -24, -396, -64, -171, 78, -21, 80, -153, -58, 3, 260, -92, -295, -46, -3, -68, 27, -76, 159, 4, 49, -43, 126, -74, 3, 36, -67, -52, -89, 20, -42, -167, 99, 41, -100, -99, 242, 84, 240, 80, 65, 146, -142, 94, 347, 183, 140, 77, -263, -22, -216, -106, 63, -92, 52, -184, 81, 152, -138, -221, 29, -127, -42, -11, 139, -278, -3, 177, -225, -113, -94, 11, 14, -6, -150, -102, -16, 300, 179, -193, -84, 205, 22, 68, -47, -384, 53, -66, 36, 4, -212, 62, 143, -22, 242, 30, 16, -84, -45, -173, 11, 190, -51, -4, -100, 185, -85, 34, -58, 55, -6, 283, -60]
8116f0r9K03J8J51J17j06j09o7K52k36j12J63J96m39J59j98M97K1k68k01K3O0
8138c5P7j81O3k8n4J71m4L07k88qP1l1Ok31J99l75N13k07Q7L36n59J19l4L55l06
8163g7J18k06K16o9J54j24o4mK9m8J59l08K16p0k1P3l3J58j37J66m5o7j22J15
8187Il03M3K74O4
$$ y = [-60, -159, 44, 62, 213, 330, 224, 115, 48, 300, 64, -48, 115, 311, -128, 31, -167, 330, 351, 83, -118, -95, -35, 42, -139, -76, -104, -158, 13, -31, 276, -12, -20, 51, 20, 26, -205, -6, -381, 132, -75, 12, 348, -211, -92, -126, 229, -77, 41, -165, 51, -18, 136, 12, -52, -56, -27, -75, 84, -224, -8, -78, -99, -26, -59, 99, -38, 128, 83, 16, -106, 9, -294, -251, 23, 87]
8191H7
$$ Imaginary data points
##PAGE= N=2
##DATA TABLE= (X++(I..I)), XYDATA
0@%%%%%%%%%%%%Qj6J6j6K4l2L2m0N5o3P2q8J04j20J38j62J90k19K50k85L22l63
34a93M11m66N26n90O62p40Q21r11J014j125J245j374J515j672J845k032K238k466
52a292K717k996L308l660M057m512N037n650O380p267Q370r785J1678j4353J8450
67A0482k5596M1611j45871L4054K01678j16404k5024J2164j7101J6950R6740l4308
79D9375p1187K2844L8781m1391J3484J8972n8091j7685Q0445l763p5652j1201
91e5069M5234J6159L299n582j8939j2352K2227K2791Q89n369m892o209J0428O432
105A9047j2265p807J969n91m205j8685j0979J8649J6438o840j002J1503m19q022
119c209J3880J8630j2007j7431K652k631m844J0398k181j4896K103O399o824k052
$$ y = [0, 0, 0, 0, 0, 0, 0, 0, 0, 0, 0, 0, 0, 8, -8, 8, -8, 16, -16, 16, -24, 31, -32, 40, -48, 56, -64, 74, -88, 102, -117, 133, -152, 170, -193, 218, -248, 278, -312, 350, -390, 431, -480, 534, -591, 654, -720, 795, -877, 968, -1064, 1174, -1292, 1425, -1571, 1737, -1923, 2134, -2378, 2659, -2991, 3389, -3878, 4492, -5293, 6385, -7968, 10482, -15114, 26497, -119374, -85320, 116358, -46, -25070, -12906, -30007, -13057, 83683, 49375, -21812, 1032, 39813, -1578, 11906, 30878, -27213, -44898, 35547, 31784, -43868, -55069, -9835, 6324, 9623, 4041, -14898, -27250, -5023, 17768, 18657, 13288, 8396, 2187, 12615, 19047, 6782, -1025, 944, 353, -3852, -22537, -33516, -14867, 1571, -5269, -6271, 5232, 4813, -3209, 10671, 29301, 17294, -137, 2515, -116, -4960, 5438, 3257, -11639, -9536, -3137, -9961, -12013]
133a2013J0766L847m807O690N235j3945j578J8681J954j0881m118l738R8Q423
147D614o20r623O29N867m798o850P504O104m286L743L460q588Q90R566l18j864
163E430M99p286m847O056K537p263r88O534k901o194N833L750j732N154J957o843
179c04O8M305o11N41N45n212m392K694K087m578p15M928n47k186J536n32L401
196A028O352l400l620L207O7k852J437J523m040l186K213m29m574K711L482k817
212b898J327K406l803K229P046j733m576K013K660l437j945L013q71l858J624
227h03J24m218J271K845j505J54J585j017j80L441K983k272j732L223M85l173
243A211p80N46j110m90j160j626l84Q17Q84M53J33P90J180J60J861N42j298L9
$$ y = [-12013, -1247, 2600, -2207, 4483, 9718, -4227, -5805, 12876, 14830, 3949, -169, -3907, -3809, 4614, 3994, -5629, -5000, 867, -3931, -10781, -3277, 2827, -1459, 2284, 5744, -2844, -1954, 7612, 7294, 5430, 5929, -1357, -6204, -148, 2389, -4874, -5862, 672, -2229, -8423, -2590, 1160, -572, 4582, 6539, -304, -236, 4069, 3458, 3999, 4544, -668, -5060, -2366, -279, -4857, -5572, -644, -1191, -3377, -1841, -2373, 1028, 7380, 3980, 360, 3567, 3634, 782, 2219, 3742, -298, -3484, -1271, -1700, -6274, -3563, -81, -2898, -1571, 835, -2968, -739, 6307, 4574, -2, 2011, 4671, 1234, -711, 2302, 1431, -2427, -803, -679, -4897, -3626, -781, -2286, -2132, -547, -1564, -1744, 1697, 4680, 2408, 676, 3899, 4384, 1211, 431, 977, -133, -623, -1783, -3409, -3793, -2976, -2092, -1639, -1506, -716, 464, 624, 2485, 3027, 1729, 1768]
261A768R81n81k169j331J759L67k626k47O78k98O65J49n64Q42Q73J93j01N9J140
280A557m07L1J390j043j909N52J289j811j057k62J27J1O3r3j58J140J626l47o99
299@J231N31n60M38m51j110n95J36K19j022k0O02L47l33j88Q0n9J987j78j072
319a7M4O12L0k34k86M90n32p27M48O3n09L98K56o8o88q7M58R35k46k06lp4O38
342F95kj061N47K85o50n29k9K75j11L23N46m98p37R05M15L82j42o0m67L55l86
363E6k49l40N56R6o14q91P09K18M46K44q3l10J16N60L27j26k92Ql40m04J09q9
385b93p1P34q24j88k41L84L67J56K37M0Mn3K98P2j32J80j22n29j61k70J26O56
407C70l86m46k97J52N19k66K66N53m32L1K28J04j14M66o9n24k47Jk83Q3O44m91
$$ y = [1768, 2749, 2168, -1, -1332, 427, 794, -1832, -2079, -1401, -1699, -1034, -885, -1449, -607, 266, 459, 358, 417, 1557, 1150, 1181, 2571, 1528, -381, 171, 1460, -351, -1408, -1670, -1543, -1532, -1469, -1562, -1720, -580, 1046, 699, 0, 1231, 1762, 1202, 1640, 1189, 79, -516, -380, -161, -1183, -1203, -601, -254, -587, -775, -695, -754, 1233, 1055, -17, 27, 639, 669, 435, 149, 639, 107, -620, -172, -109, -618, -220, 36, -32, -720, -807, -349, 586, 340, 134, 131, 57, 695, 693, -368, 179, 464, -186, -715, -744, -469, -580, -257, 289, -209, -946, -41, 374, 756, 614, 554, 87, 442, 56, -193, -533, 23, 119, -495, -1386, -677, -459, -13, 231, 148, -162, -46, 514, 841, 715, 423, 431, 91, -313, -204, -293, -364, 370, -454, -642, -883, -499, -132, 24, 261, 301, 305, 252, 550, 622, 490, 670, 548, 19, -142, -412, -286, 370, -16, -462, -759, -607, -88, -354, -88, 465, 33, 64, 292, 396, 282, 748, 679, 155, -92, -91, -374, -291, 353, -138]
429a38o37m4N24kO3L03L55j58L3j87L10Q4L16j77o01k14j74rJ91L1j33R8j34J48
453a52K10k05L06L64l10k60K05%J47m0o7%l79J71J38k38JJ66o18J01L47P5j0M53
477D05o3k19k33K76M25k38o0J70o07N9O4k76K94J63k90j58J42j89N28m9J40j84
499A00l39J05L80J5N4j11K9k75p5j56K61r2O15k27n78J01J39K50j76l5R7J40k
522B20k45L93l71J62m8M5k73O1J41J58j85j97l46L49K78J85m28J86J92p18K42
543a99L61k25J2R8J70n52K52J71R1J1K81j45j51l69L36j43J98j87O5q3j85k29
565d22L26L94m72K37l74M77R2j91J30p8p0J28m8k66J32J03K94m87j55JQ2J91m7
588b3l5j91K43J62k33J99o5J4J51k96rK73J50n27M64j35k72j81K66J91m57K13
$$ y = [-138, -775, -819, -295, -297, -234, 69, 424, 266, 299, 112, 422, 506, 822, 645, 44, -170, -344, -353, -162, -131, -264, -166, -300, -152, 58, -147, 159, 523, 213, -47, 158, 158, 305, 265, 198, 198, -181, -10, 128, -110, -109, 57, -561, -460, -113, -38, -48, 405, 342, 123, -110, 166, 591, 353, 293, 463, -144, -85, -21, -297, -3, 160, -130, -288, -146, -335, 193, 144, 284, 100, -239, -134, 246, 261, 315, 204, 233, -42, -117, -273, -12, -104, 511, 284, -294, -193, -54, 196, 20, -15, 82, 222, 220, -25, 368, -3, 159, 111, 156, -117, -56, 85, 243, 58, -139, -485, -136, 142, 327, -101, 85, 277, -441, -199, 162, -63, -51, 47, 217, -335, -83, 88, 179, 190, 471, 326, 175, -194, 142, -1, 197, 10, 75, -8, -193, -422, -96, 298, -174, 63, -311, 166, 258, 67, 197, 119, 49, 177, 129, -137, -5, 98, 392, -95, -250, -249, -167, 24, -23, -58, -249, -6, 156, -77, 122, 57, 71, 222, -74, -83, 190, 340, -187, 277, 142, -130, -311, -45, 146, -311, -98]
610i8j26O1Q3Lm6K12K20k69L51l33J34J4K5j13k38k88L36n8j46Jp6k9K39R9p5
635a17K62r0J47j16n5J10j20O7%m8k05L9J90k06ko6J99N9k11j1J39Q7j34K17j55
660b0o9K46P1j13K8m9k89K68j47L6k60L18j63l7J47J8J67o7R7l62K66j60Q8K05
684B19l73k7K85k35m7K12n7J91k42k5Pl1L85j00k76O3l6J57J49l23j91K71K57
707B33l51J16n0o5R6M56k79j69p7J33Q9l04J98J53p4k16J33J7k0q0L55m83j1m1
731b41L30J04p3L3j23J95l53l7P8L51k12L0r9J1J50k88J04K52n37L85rJ15rj57
755@J67k90J18M0j85J43Lj17O6L10l03J93m75M23P0j17q6K48k76K09M4Q6k54p
779A0J14l15K32O9q5j10j18K5K06J01K75j10j99j6l3p1J23l7K23j99J65o9l16
$$ y = [-98, -224, -163, -80, -77, -123, 89, 309, 40, 391, 58, 192, 206, 231, 118, -120, -408, -72, -130, -276, -275, -351, -380, -141, -42, -117, 145, 55, 202, 86, 31, 141, 21, 88, 88, 40, -165, -126, 64, -142, -144, -210, -11, 48, -163, -174, -35, 52, -82, 135, -20, -89, 157, 228, 115, 143, 94, -195, 73, -74, -38, -298, 20, -143, -180, -33, -15, 152, 85, 182, -180, 86, -74, 14, 219, -154, -181, 104, -131, -178, 34, -23, 168, -74, -99, -92, -123, 262, 162, -114, -51, -87, 70, 219, -104, -295, -24, 233, -118, -2, -52, -117, -21, 435, 156, -13, -90, 43, 132, -172, 26, 179, 105, -111, 22, 39, 19, -61, 294, -189, -200, -241, 89, 193, 120, 153, 30, 225, -128, -165, -87, 264, 52, 82, -17, -6, 144, -144, -40, 212, -325, 60, 51, 166, 157, 0, 167, -123, -5, 35, -150, -7, -4, -121, -55, 255, -48, 145, -330, 93, 163, 46, -40, 208, -68, 141, 185, 271, 17, 10, 124, -191, 41, 110, 25, -85, -203, -178, 28, 129, 404, 294, 95, 79, 46, -25, 98, 61, 284, 85, 250, 181, -135]
802a35J17l8m8k0K55r3o7j51R4J72L7j86K20j3l9K6P0L9k82J3p3K3J0J61J1k59
828a56J7j52L29J01j64j19L7M72l81L24l35L35l08J73l07K42O9m06K21lm3J39
850H5j60K73j49R1j52m4o0J42N7moj30L09j10j34k14j92M40k27J26K17m42J62
873a22J09L7k85K67J38j85n2K17j16j97J46L3k3l5J1J6k6j5J42O0P3k36K49j15
897I1k51R0q4K57O0k35J74m0j88L21j28J7j46J06N3m3P9m9k70K06p3J20j05l04
921c42L52K94Om17R1j67P2J33Jj65J64j35K14j77K51k83J36k88k0N89n57N50m8
944B54l25K68l96K04j27L05l23K65k6j41J25P3O6j16K3k85K51M4k13Q2K50m46
966a88J98j29J38l2j51j3Q7K42K0l47K85k06L2l4j72K36J78l36R3j6N4N2j03O
$$ y = [-135, -18, -56, -104, -124, 131, 38, -29, -180, -86, 86, 123, -63, 157, 144, 105, 131, 201, 240, -42, -29, -102, -79, -69, 92, 103, -156, -139, -291, 38, 139, -25, -144, -107, 365, -16, 308, -27, 308, 0, 173, -134, 108, 177, -229, -8, -11, -54, 85, -75, 198, 49, 140, -12, -56, -116, 26, 83, 79, 73, -57, 252, 142, 8, -206, -398, 42, -185, -59, 158, -284, -122, -13, 24, -261, 6, 144, -41, -93, 124, 8, -189, -43, -10, -33, -68, -57, -41, -67, -82, 60, 120, 193, -43, 206, 91, -160, -70, -154, 103, 163, -72, 102, 62, -126, 195, 67, 84, -62, 44, 97, 54, 133, 84, -186, 20, -53, 67, -38, -342, 10, 304, 310, -107, -16, -183, -111, 22, 23, -142, 22, -113, 101, -76, 175, -108, 28, -260, -280, 309, -248, 302, 254, -71, 197, -199, 5, -122, 183, -140, 125, 99, -42, 83, 156, 222, 106, 129, -156, 95, 139, -74, 8, 258, -188, 10, -119, 19, -13, -164, -177, -90, 152, 172, -175, 110, -96, -64, -98, -270, -34, 144, -192, -99, -115, -61, -9, -112, -106]
990a06J51R5k74M21l19j54lJ48k2J62l1r9j07j34K64J19l57J54k12J16K57j3J30
1013A86l02J05M5rk06K13m7j56L58r0j32J69l5l02J61O5R4j18j30L56M0l29J50
1036H6j34K41q2l10J54k03N08k76R3m6j28K43k50J62k95L43k20J13q9K49j31j51
1058a23K8J13J68j3n8Q9k50K41j94j8n7mj4l2J94p2l01J94K69k95mJ90J43j57
1082C7o0R5J11o1j78n0L18k7j78j18J42k70L81m2j09j50K03j69J14l0j70L03J17
1105B09m7j22r5j01K53nj9Q3M9j91l56N27lk77L98l32J75m12K27J1k3K96j71j26
1129e2L75j79J57l47r0K97k75L55n50N29l77K13R2p2Ql37L32J42m08L69j65p1
1151e4Lj04j33K99o9j36J93j68K46j08p2M91l70j88J16p3j02M01l0k44L49p6j42
$$ y = [-106, 45, 140, -134, 287, -32, -186, -189, -41, -63, 99, 68, -31, -138, -272, -8, 111, -246, -92, -304, -188, 69, 56, 186, -116, -11, 34, 25, -181, 32, -15, -171, 187, 97, -35, 134, 99, -203, -42, 23, 117, -1, -131, 225, 265, -64, 86, -48, 193, 111, -199, -45, -248, 260, -16, 77, 31, -97, 146, -104, 58, -237, 106, -114, -1, -90, 159, 28, -123, -95, 18, 186, 173, 115, 204, -46, 195, 1, -17, -74, -78, -92, -124, 70, -2, -303, -109, 160, -135, -139, 51, 194, 37, -23, 72, 183, 122, -56, -106, 212, 185, 7, -111, 31, -239, 142, 100, -9, -159, 44, -125, -11, -41, -211, 92, 209, 162, 40, -55, -156, 97, 92, 73, 156, 205, 14, -342, 185, 182, -95, 303, -29, 146, -266, -39, -28, -51, 245, 74, -52, 323, 144, 301, -46, -136, 161, -114, 241, -309, 220, -157, 56, 148, 76, 84, -253, 79, 221, -187, 182, 17, -54, -51, -155, -288, 11, -58, -194, -1, -169, 77, -31, -103, 388, 18, -170, -54, -127, -229, 172, 142, -102, 247, 171, 29]
1174B9J59l01J26mk34N05k39K40j83R0L4m52L3J54j0l6j09M56k71j42K46K3o1
1197E3J90l80J07J41n8M3j21rJ2l2J70j17N3j04n3L10j22j8J79j85O2k61N12m22
1221e0K91j70k1j9Q1j28n7J41k25m2J78J22j09J97k15K86l97L87j06K6k47j9M7
1244d9k8R1n6o9J2J87o1J39j88ok2L15k15L16m63J4J1PJ37Q1R4j95l9o9M8O1l
1271E0j37L27k65J26k2K4j81j66M20j80r8K19j49L2j08J72J28k96J58j36j50P5
1293a57O6P9N2j99J02M4o2R8J24j94J51R0q9J11J3k30j48K50r7q7j52J86Mql1
1318h4J30l28l2J78J66K61k74k85K21J23j4k27Q7k85L85j50J06m6O7m1l2k45M20
1341A01Q4l44j4o8K49J51q9p3q4M32k83J22r1Q3k15M9Lj92L61j35k27K94k28K36
$$ y = [29, 188, -113, 13, 9, -225, 280, 41, 281, 98, 188, 222, -230, -197, -43, -53, -89, -198, 258, -13, -155, 91, 114, 53, 243, -137, -30, 111, 53, 96, -25, -34, -22, -54, 116, -1, 52, -52, -105, 205, 83, 65, 244, 59, 121, -140, 372, -50, 241, 71, 50, 31, 112, -16, -73, 68, -157, -199, -21, 101, -8, 189, -26, 260, -137, 250, 144, 170, -77, -96, -49, -77, 14, -42, -111, -99, 88, 27, 166, -22, -28, -50, 265, 50, 366, -97, -83, -72, -65, 72, 153, 247, 52, 13, -56, -8, 53, 50, -87, 240, -25, 101, 79, 103, -78, -244, 176, -4, -102, 117, -32, 0, -108, 64, 192, -104, 54, -82, -232, -157, -91, -12, 40, -159, -57, -13, -75, 23, 147, -47, 104, 194, 105, 216, 229, -1, -149, 101, 4, -83, -235, -49, -45, -53, -84, 46, -282, -314, -136, 30, 291, 17, -268, -47, 76, 62, -165, -78, -363, 22, -128, -22, -68, -1, -42, -74, -319, 101, 185, -159, -173, -241, 8, 159, 70, -3, -87, 345, 62, 184, 93, 176, -39, 10, 13, -179, 182, 47, -180, 114, -114, 122]
1365A22Mn0L4l57K17N1O8n9J15j97J3N3j43P8O7M9j00K13J5l63M72k10r3R5J46
1390B40m46J89j11L3Q9P7k54N0J79k6m4m7R6J90k14J7l1p6p4J04K73j95k87K92
1414B4Q1j0j33P3K0J26J33k86J19l34L28j60K08m08J07mR2n9K23J4j25p9L0J02
1438H2j1j32K15k48K27q2j32J04jj25K18l1j76j08K75k73k3m9K61j25P1O2j64
1461a65n2L61j27j20k38J15K80M5O7j17m5j53K14l11L60k12J31l22K19M3K07o47
1483d67M26j61M19k88K53l18J59n4m4J09J0j45J36N0q5o7p1K31l94K70K66j93
1505D2J52k88L5n5J75kp4j7K23j57j75K81p8J96m06j38K68O1j84J88r0K26Ml9
1529A48L7l65L76o5oo1n9k11Q0r2J67j44l1K43J74k96M3K12P3j32k57J83j03J42
$$ y = [122, 126, 76, 110, -247, -30, 21, 89, 30, 145, -52, -39, 14, -129, -51, 16, 65, -35, 178, 193, -170, 302, 92, -1, 94, 240, -206, -17, -128, -95, -6, 71, -183, -133, 46, 20, -24, -71, 25, 215, 1, 18, -13, -89, -163, -59, 214, 19, -268, 24, 105, 95, -38, 35, 55, 181, 314, 28, 147, -187, 141, -19, 189, -219, -112, -116, -24, -83, 140, 154, 29, -50, -20, 82, 71, -61, 154, -94, 133, 51, -81, 23, 22, -103, 115, 84, -92, -200, 75, -198, -221, -270, -9, -134, -63, -1, -165, -217, 144, 17, -103, -341, -226, 54, 99, 166, 49, 4, -149, 65, -246, 114, -98, 33, -289, -70, -27, 180, -467, -41, -202, 217, -71, 182, -136, 23, -31, -75, 34, 44, -101, 35, 85, 0, -67, -138, 93, -301, -31, 235, 42, 194, -94, -59, -114, 61, 59, -15, -32, 191, 34, -141, 140, 62, 258, -148, -286, -18, 43, -141, 47, -43, 183, 187, 148, 185, -180, 196, 131, 125, 64, 5, -206, -126, -218, -51, -195, -226, 17, 191, -105, -62, 150, 223, 91, -166, 17, -86, 56]
1553E6m10O25j33o1m29L65l00K12q3j82N03R7j67K9P1k72P7J2o9K05o0j6l5K5
1577F0j92K26j70J02j98J08J5p5J35J79j99QK27k71LR1P7q8n5P8j01j96O17k17
1601A64k43L66j69K78o31K79o4o8J9j40J06K28o2j24J87l5q0n3qJ67o6M7q0j56
1625a38Q1J40q2q6L0K25j40J45j39m2P4k48j12J53K91j80j48M08q4k55j81L38
1647E0nj0j49P6r5J25m5P4k08J89J65j03r6K1P0k51L29k36pPn7j8L30m99K48J89
1673I4L59l64l44L69j25JP0j54K60k59j34J83J16j75L4J38Pj51K42k12J4j73M75
1696B71l52J61j31K1J80l61J27J73k77N0K11K2K4K00j79l03L45J01k71j99K49
1717F2m9o4l8N3J98lN4k02k4k13K19p0m9K44q2K9j58Q0k9m09N55k77NK13j60K87
$$ y = [56, -354, 271, 138, 77, -352, 13, -287, -75, -158, -340, 163, 260, 93, 122, 193, -79, -2, 10, -59, 146, 86, 70, 35, 60, -132, 94, -76, 26, -172, -64, -49, -124, 11, 190, -9, -1, 226, -45, -42, 49, 126, 38, -17, 61, -40, -236, 381, 164, -79, 287, 118, 396, -235, 44, -20, -88, -69, -209, -103, 125, 63, -61, 126, 91, 11, -42, -50, 117, 51, 98, 18, -138, -57, 83, 1, -85, -55, 170, 30, 175, 36, -6, 68, -180, -292, -139, 152, -28, -176, 232, 148, -107, -288, 50, 45, 35, -114, -38, -133, -8, -53, 21, -187, 2, 167, 64, -32, -11, 59, -192, 137, -99, -106, -99, -156, -174, 156, -343, -95, 94, 453, 89, -255, 114, -11, -10, 60, -94, 166, -93, -227, -44, 72, -103, -69, 69, 76, -75, 167, -45, -31, -204, 271, -81, 80, -51, -30, 150, -211, -84, 89, -188, -138, 73, 95, 119, 319, 140, -163, 182, 283, 12, -187, 62, 13, -51, -89, -36, 162, 159, 213, 11, -13, -226, -7, -77, -126, 118, 36, 65, -93, -13, -42, -451, 104, -173, -168, 45, -115, 172]
1743A72k77o4J00K53l67L50j08j46K73j2j45O2J21m5N0l16j04r1k61M44K32k76
1765a55K08j06K77r5j26J21r2Q8k42j67J26Q0J23j24P9%P2K23l20m0k20K71K96
1788B77k93J27j10j38K3l3K87k70K73N7j73j22K6l1K78J13m12J46j48J99j16J59
1810A19k29R4R0J94n5k08k8n7J75Mp3K9K66n32K26m6J00L0q4Q7mn1j10o4o4J65
1836b6K13q6j66J85J32k28k11J44p8q3K27o5k1l10M45q1j65L44k68N1J70k60J48
1859A1Q5k56J39p4M40k90j14n5L40l12J64j42K32o8k26L52m02K30r3k3j16L31
1881A53l03M53k20k69%L19N3j5m8j75j43J27PJ67J1j22l80L42jn8K42l6j04m3
1905d3n9M4J10J05j01q9j17J16L42o04L04r2J4J55J11k33O8l07L35l24L51o3k28
$$ y = [172, -105, -169, -69, 184, -183, 167, 59, -87, 186, 174, 29, 91, 212, 167, 217, -99, -203, -294, -555, -111, 121, -155, 53, -53, 224, 129, 3, 124, 32, 120, -122, -289, -163, -83, 40, -84, -5, -5, 67, 290, -30, -70, -290, -19, 277, -16, 111, 1, -137, -114, -147, 140, -130, 143, 200, 27, -95, -69, -100, 178, 291, -121, 25, -123, 76, -40, 119, -110, -16, 74, 268, 213, 5, -23, -80, 95, 99, 26, 55, 321, -211, 15, -31, 69, 99, 15, 102, 98, 47, -63, -127, -191, -26, 187, 101, -65, 120, 252, 24, -187, -43, -121, -204, 23, -42, -63, -373, 72, -9, -174, 170, -98, -47, 123, -137, 11, 96, -160, -21, -95, 345, 55, -59, -114, 226, -86, 78, -64, 168, 100, -126, 226, -176, 54, -39, -62, -178, 153, -150, 303, 83, -186, -186, 133, 186, 171, 123, -52, -195, -68, -61, 106, 117, -5, -385, -43, -44, -102, 140, 104, 0, -43, -102, -58, 52, 157, 56, -33, -150, -34, 308, -296, 8, -84, -70, 85, 196, -37, 31, -276, 59, -265, 86, 23, -205]
1928b05J32K7P6J14l46L01k00j19K83Q4k1k6j97m1J81k0p7m6J44J44l9l21O5J85
1952G8l5%k08M53m64K19Kr7L8M9R9m9j11L39j27O1k15k58L27j63N6k17n8N58o1
1977B16m64L51Nk88N1R5j53J87J56j09K48K2j84j08K32l93K10J66l72L26l28M2
1999i2r9J79j29J01r8J19j28K09j63K61J14k48j66j35K49P4Jj33o8Q3N2R4l00
2022b23o0J94K24k70K57j28J35k94N07r5l71R9j70J71L0l4K8ml8L8Qj3r9R2K75
2047B59j39pqj86K57k1l20J74j74j69M50j63o9J50K15k38k00K66J73j30j99J01
2069B2l8Q0o1J64p3o3o8J52J85j1k50K5J63k63J24j65p3L04j32j62R9j85O6J30
2093c0M5J78k93K25k11J75k51J5J54J39k75K46N2L3k82L8R3K78l03R9j53k32M42
$$ y = [-205, -73, -46, 30, 144, -202, 99, -101, -220, 63, 147, 126, 100, -97, -138, 43, 23, -54, -100, 44, 188, 149, -172, -107, 78, 43, 43, -165, 288, -176, 43, 45, -52, -14, 35, 134, 85, -26, 313, 186, 247, 32, -226, 101, -62, -6, -223, -281, 277, 216, -248, 103, 108, -180, -129, -34, -187, 0, 156, 47, 295, 317, 133, 25, 257, -136, 74, 240, -132, 194, -134, -92, -191, -12, -141, -40, -138, -19, -147, 62, -101, 160, 274, 26, -140, -275, -26, 48, 49, -84, -152, -69, -17, 77, -223, -283, -89, 135, -135, 122, -6, 129, -165, 342, 247, -124, -25, -195, -24, 6, -28, 0, -4, -42, -4, 4, -9, -108, -16, 259, 120, 113, 105, -81, 176, 155, -165, 9, -165, -334, 116, -47, -116, 34, 249, 11, -189, 77, 250, 120, -79, 22, -16, 64, 3, 167, 94, 31, -37, 115, 300, 289, 39, 64, 227, -36, 88, -77, -150, 154, 22, -140, -41, -226, -160, -30, 15, 193, -100, 125, -86, 89, -162, -147, 7, 146, -129, 117, 169, 202, -80, -42, 51, 329, 26, 125, -28, -260, 182]
2116A82l21j47K48N4j34Q1j02J84j60K28O1k39J11J7j7m3l0J6J62j57n0P2K2j76
2140a38Q9q5o5k01K70J16j2k8R4r9Q5p2K50k79J95k2J76l9k58j88J43n5j0J06
2164b7jJ4J02J03m91K04K30n8k1k24J49J7J03K02m76R0l4k34N26k11L5k5k8l2
2188h7O0L25j99j42j23M11k30l00J80k2J11K98l84R7k76L69j57l71L62K10j26
2209Fr6K5J29k61l9K99M1p8j4j46J93j09R9K49n09J39Q0N1K2k60J39L8K8J45l84
2234b13J2L94m00p4L23j16jQ2J11j44O6J3o1K10k36j74J6K26Jj37J42pQ7j95N9
2259a6P0J25j59K00k35JO0J84j92j3j06R9k51K14K54j50L04n23l6K99o2p1J11
2282A07PR3m1j60o2J16k91L01J04m0j80J96j91K17j48Qj10K77k08J57k98k77L34
$$ y = [182, -139, -286, -38, 16, -118, -37, -139, 45, -115, 113, 174, -65, 46, 63, 46, 3, -27, -11, 151, -6, -56, 16, 38, -138, -49, -134, -199, -400, -130, -14, -26, -54, 40, -59, 26, -46, 204, -75, 120, 98, 274, 235, -23, -211, -68, -123, -133, -27, -28, -14, 88, 191, -300, -96, 134, 76, 55, -169, -20, -3, 100, 302, -174, -84, -118, -352, 174, -37, -2, -27, -55, -87, -27, 298, 99, -43, -166, 245, 15, -285, -105, -127, -16, 282, -102, -5, -281, 88, -69, -440, -78, 132, 6, -90, -65, 64, -197, -236, 63, 104, 26, 12, -134, 59, -50, 49, 298, -211, -72, 8, 59, 81, -179, -40, -2, 26, 171, -213, -201, 193, -207, -281, 42, -74, -75, 7, 118, -26, 40, 53, -8, 202, -34, -208, -192, 34, 35, -102, 40, 33, 120, -75, -16, 54, 179, 20, 220, -15, -14, 46, 230, 38, 25, -81, 18, -233, -19, 235, 85, 389, -134, -170, 129, 67, -4, 107, 114, 207, 166, 6, -56, 60, -231, 70, 174, 134, -46, 150, -41, 176, 28, 36, -74, 203, -5, 152, -146, -423, -89]
2305h9L52n6n43M40kK32j09j41k59Q8p0K85q6j35J10R7k25J66L8J4J55l00k50
2328b88K82j09K97n20P20l45P5o4j03Q9l1j89J87P1l0J04k20j15L39k84M69l70
2350c5R4n6l39N42k70J34j15j22J62J23k62K36q5J49J15j25k66K99k02J05J32
2371B14l6j1r9k42j0Q3K54J15j46j81J38J5k57J89R6l1QP8j32o7Q0O3j4p6O9K40
2397C40k59m43M76Q3j80j04P0m5J43k22%J63m5R9r0N4l6k36L7J43p2J74R0o8N
2422G7j1k23J80J32l57J44M7K9l7p0K47o5l70r5L93PK0RJ35l19J04q2L74n63J65
2447a29J70Qr0m2j40M65j05j03j36K21k02j35J20j43j8K61J79l86J63J17l09K28
2469fj08J46n1K39P6n93J90J93j74P6j36N8L03qr8Q5l78K55J52j56q8j30r1n2
$$ y = [-89, 263, 207, -336, 104, 102, 334, 225, 84, -175, -87, -157, 128, 42, -93, 17, 114, -111, 55, 93, 107, 262, -38, -288, -6, -115, 182, -338, 382, 37, 112, 48, -55, 34, 3, -186, 1, 72, 42, 146, -74, -189, 150, -134, 335, -35, 59, 3, -336, 206, -64, 70, -45, -167, -5, 118, -144, 92, 7, 156, 271, 146, -120, 179, -23, 82, 214, 178, 167, 68, -174, -184, -101, 153, 268, 122, -59, 79, 94, -163, 26, 122, 91, 99, 177, 45, -22, 58, 121, 107, 31, 100, 340, 81, -362, 114, 197, 17, -87, -17, -62, 81, -141, -141, 22, -23, 76, -14, 40, 4, -232, -195, -52, -124, 50, 140, 72, 77, 66, -157, 23, 155, -202, -58, -11, 18, -19, -89, 158, 93, -277, -372, 21, 28, 48, 57, 192, -127, -23, -105, 269, -294, -129, 41, 49, -41, -83, -223, 242, 137, 34, -102, 119, -83, -218, -98, -241, -259, 2, 181, -205, -42, 75, -234, -6, -114, 32, -19, 220, 296, -297, -107, 86, -88, -12, -148, -90, 213, 205, 107, 192, -186, 69, 221, 65, -23, -153, -244, -296]
2493b96L90j49KJ6J6p2r2K56k42J99m5j93N0K28M1l45L40L9m7n8O8p7K3j09J43
2518H6o9q6N9o9M9J85l52N4K28k0j33J10J57j22r2K61m9l35O8j8M4k91L9M24J4
2543A42j0l77K17K01l01K3L25q3k52m9R3K14j67p0J86L4j12p5K5j45P9J03K0K16
2567B37l28J83l05J73K81j71k88j39L94k85K90j12K7L76k80L4O7j80K7o5l7j57
2589b58L72m95K05L8M5q9J81n3J16K70m66P7K95k08M3j40J35l2J67k08M1J19j99
2612d4J12k72L90k15J95k09j05q4j24L35Q1Lq7k68M08K2k78J02m7K5L91o54J93
2635a30L78m91J7J53j53L28j14J81q4j68L5j4Q0J85l88R0l4J18q5PR9o6P0j29
2659a15L2J89r9r2K83j77J93k51Q8O6m1k3k15K51j7r1M7j67P2L1J49k14J18o4
$$ y = [-296, 94, -55, -53, -37, -21, -93, -185, 71, -171, 28, -17, -210, -160, 68, 109, -236, 104, 143, 96, 38, 106, 29, 52, -57, 86, 17, -69, -10, -79, -30, 155, -197, -143, 85, 65, -68, 42, 199, 77, -15, 246, 197, -138, -70, -88, -44, -335, -296, 128, 142, 132, -245, -28, 173, -128, -105, 220, 137, -115, -164, -71, 143, -24, -94, 92, 126, 14, -61, -36, -181, -102, 1, 21, 237, -91, 92, -213, -40, 241, 70, -218, -357, 37, -248, 42, -70, -43, 333, 53, 87, 154, -26, 1, -64, -101, -258, 114, -381, -176, -138, -93, -182, -1, -54, 62, 332, -134, -57, 238, 30, 73, -67, 68, 36, 203, -5, 36, 155, -44, 68, -204, 186, -29, 166, -43, -148, -232, -356, -21, 60, 63, -24, -292, 116, 138, -140, -38, -85, -60, 331, -323, -130, 248, -243, -226, -73, -226, 102, -12, 169, 85, -83, -48, -62, 18, 203, -185, -95, -129, -11, -96, -89, 10, -56, 14, -115, -83, 106, 7, -85, 198, 21, 214, -37, 51, 117, 76, 53, -162, 89, 72, -19, 28, -139, -67, -36, 113, -101, 17, -47]
2683d7r3J10j06J66j12K93j14Nj19J44j83J22J96k34k14N7Q0N7J81k36Jj24k56
2706d26L41J66q7l29N95k11J7J88m84J60L35k76Q1r3M4j37J66l10K32O6j62J13
2728a1j31R2j58L20o9j21J82m6j45j45J44O2jJ44o8P5j65j34K11J15Qj57Jk52
2752b49N58m91J98R6m01K70j07K18rr4J8j86K05K1q8L02j16n2m1j31L15p0nj85
2776b4N9l5n5K29k95L09l2j60j0j59J46m5j30K06O8k50K62m1j40J11J71j39l65
2799c19J58Q8K20l3Q5n11L61l9p9K99j53m0n2K1J58j28o1K92k57j64L40o5k09
2822h8J05k34J10K56l7j04O3j39M2J7Q5k98K43J54k54L19o88L22K7J11K0l7K77
2845B72l13J51o4k2q4J22j24Q7J63K9r6j19J25l37J8M33m18P8L61j73J7q8M4J26
$$ y = [-47, -140, -30, -136, 30, -82, 211, 97, 102, -17, 127, -56, 66, 262, 28, -186, -129, -49, 8, 189, -47, -46, -170, -426, -85, 81, -6, -335, 260, 49, 66, 254, -230, -70, 265, -11, 70, -23, 21, -116, 50, -260, -28, 38, -124, -11, -142, -50, -208, 112, 43, -78, 104, 58, -87, -232, -88, -26, -27, 117, 49, 124, -41, -175, 36, 151, 159, 2, 3, -249, 309, -182, 16, 112, -289, -19, -126, 92, 83, -11, 7, -179, 26, 47, -41, 261, 145, 93, 52, -79, 236, 166, 161, -24, 35, 0, -55, 174, -121, 188, 156, -4, -14, -173, -27, -72, -202, 4, 72, -178, 84, 43, -97, 14, 185, 46, -319, -161, -73, 147, 114, 199, -312, 49, 10, -69, 230, 77, 37, -15, 6, 164, 36, -25, 267, 10, -154, 186, 121, -88, 17, -217, -107, 149, 112, 8, 71, -68, -26, -9, 76, -222, 21, 175, -79, 240, -448, -126, -99, 12, 32, -5, 272, -41, 110, 46, 24, -60, 62, -62, 25, 188, 217, 121, 2, 127, -210, -192, 241, -177, -99, 262, 89, 106, 18, 62, 188]
2869A88k28JjL4J12j61j29P9J20R4j78L49k10k53L35k39K7K92j85j62N8J11M1
2892I5J03k15j1J54j54l4r8L87l94j92L12M8j02L53pl15J4pJ23j26n2L31m81J81
2916h7r8M09j88N9n3q1L16k48k92M86j94L67n00K85pj46k6n5j19M5J61n1O7rp1
2941c0QJ27j00l9j14K8K41k00J47l41K21J72k81P6L4K22j21k13L56M5k81J06j35
2964g2k49M01j24J33k59L22l17o6R5K41QK1m04K98K2p2K68l31j37L47j9k16j8
2987a28J60RK42l90J35J9l6J93k17k27O6K14mk28J62P0J23Ml83J46K29l9j39K33
3011B14J43k52j59K16l17jK68j9k66J91q8j95K74K23J38m58J07K59n06L61o4k63
3033a94R1j4JK74l52K55J14j65j66L19J59n56L71J1l43K65j18J51K0k38j63L74
$$ y = [188, -40, -39, -40, -6, 106, -55, -184, -105, 15, 109, -69, 280, 70, -183, 152, -87, -60, 232, 47, -115, -57, 54, 95, 198, -17, -28, 126, -28, -62, -160, 227, -167, -359, -47, 1, -101, 252, 245, -70, -56, -63, 60, -66, -118, 213, -268, -87, -185, 224, 36, 95, 42, -39, 277, 29, -263, 223, 29, 396, -104, 181, 174, 28, 2, -53, -172, -127, 34, -17, 50, 41, -30, -22, 105, 5, -34, -148, -120, 121, -79, 68, -273, -52, 120, -161, -85, -51, 171, 50, -163, 193, 238, -43, 63, -72, -321, 80, -44, 89, -170, 152, -165, -231, -136, 105, 113, 134, -270, 28, 50, -22, 246, -85, -222, 125, 106, -110, -128, 32, 41, 283, -107, 28, 47, 11, 204, -13, -240, -174, 40, 36, -192, -30, 40, 163, 167, -216, -70, 159, 120, -19, 214, 357, 105, -54, 162, -155, -156, 112, 93, -173, 18, -70, -265, 9, 232, 370, -88, 19, 278, -228, 133, 69, -194, -103, -117, -116, 158, -194, 61, 175, 10, -156, 163, 322, -234, 137, 148, -195, 70, -48, 103, 123, -115, -278, 96]
3055I6p6m5no8O4p7L5P9k45L02j25J26oj61K17j03j24k63M57n12L54J72j95J21
3079A8K7j19K24q5l6K01j62L1k22K90n5K0k3q0Q2j44K97l49K27L9j8j41l46K84
3103d0n6L55k70k81L29O8q7o7K11m98L66k60K6L60j55J00l78K11K23k40J88O2
3125A67p5P6k49J19m66L08K73l16L68l6l2k13j67J01K17Q0j07o1m3k49N70n63
3147b98J75J72p9P2q4J23j36p1N26k64k35L4J15k0l8j50J47o8J72j00RM5K24k49
3171B2K90k59J3n8l93N41j48K4O5mn3K00k42j31m1K14J48m9l18L13R0k19n0lN6
3196Hj16M8M8J31J20l20R1p5k6J11J51K9j51m0k18J96j6N2j2j6RK30k46J53M9
3221A90j26p2j04K08k96J82o2n1K41q9J61J1M8k49n0P1J62k7n5P2j17j65R5p0
$$ y = [96, 20, -25, -30, -98, -34, -111, -76, 3, -242, 60, -65, 61, 55, -106, 111, 8, -116, -379, 78, -434, -80, 92, -103, 18, 45, -74, 150, 65, 29, 230, 68, 99, -123, 167, 112, 132, 109, 29, 111, -33, 264, -85, 142, 181, 163, 22, -324, -40, -96, 259, -11, -292, 37, 105, 18, -49, 162, -336, 30, -230, -204, 156, 1, 101, -277, -66, 157, -83, 105, 167, 92, 168, -81, 38, -428, -120, 153, -163, 205, 169, 137, -76, -243, -142, 75, 155, 48, -13, -56, -305, 265, -298, -123, 49, -30, 42, -42, 81, -55, -126, 400, 136, -99, -65, 50, 30, -8, -158, -11, -79, 93, -7, 2, 47, 271, 22, 312, 53, 66, 8, -385, 156, 8, 32, 97, 93, 40, 240, -2, -133, -174, 40, 188, 139, -179, 134, 224, 5, -45, -48, 8, -108, -60, -12, 119, 239, -81, 10, -65, -91, 20, 171, 200, 49, 9, -209, -13, -29, 23, 11, -5, 4, 234, -12, 141, 190, 64, -8, -112, 96, -200, -18, -80, -131, 110, 21, 182, 193, 241, -8, -58, 13, 175, 148, 93, 165, 48, -117, -22, -92]
3245i2L44k37J56o9m9M7j74J48j14J1j76K37n2J50K92n36J51k18L6P10n88j79
3267b02L11j86K17l26L03j20k52J38Q2k20L12j70J19J86k79Q5J65j0k80n1N4K43
3289A19k69P6r5M1K29l81J35K37j7P3o5Rj44Q9J9k12K34q5J35j7ok43j02K25k32
3314b47K24K12k34K26l00%J43%k00K25j41N5K42q0j98M10l57j58K62k12J43j99
3336a84K38k69L14j22j87Q1K16j1k91R8RP3J94n7K00j05k98K52n17L04J01k18
3358a79K18J38j42m1j8R2o8K19l29R4N8k1j47J65j63m4K95Lk57J14K14j44j69
3381a12K97k57N1K20k54j41J15J27k0r8K40o0j1n4l7P7N9j53k63L47k68L13k62
3404a44L16o2q3Kj15J30J38k6l6k4j72P6Q7l18K92j96J25K49m50M88m00J09J70
$$ y = [-92, 252, 15, 171, 102, 53, 100, -74, 74, -40, -29, -205, 32, -20, 130, 422, -114, 37, -181, -145, 565, -23, -202, 109, -77, 140, -186, 117, -3, -255, -117, -35, -255, 57, -113, 6, 192, -87, -2, 163, 153, -127, -178, -124, 119, -150, -74, -169, -128, 101, -280, -145, 92, 75, 148, 83, 92, -52, 37, 56, -156, 78, -7, 128, 111, 105, -138, -240, -15, -247, -23, 189, -45, 181, -119, -119, 24, 24, -176, 49, -92, -37, 205, 125, -73, 337, -20, -178, 84, -128, 15, -184, 54, -215, 99, -23, -210, -129, 87, 76, -215, -117, -108, -35, 159, 102, 302, 197, -101, 151, -366, -62, 39, -179, 39, 177, 35, -6, -24, 68, 0, 219, -110, -16, 42, 21, -126, 39, -124, -168, 127, 130, -127, -13, 201, 57, -112, 185, -72, -21, 199, -55, -196, -81, 46, 26, -72, 168, 108, 97, 43, 6, 83, 142, -11, -274, 73, -195, 118, -144, 172, 110, 27, 29, -86, 44, 182, 156, 120, 96, -76, 0, 87, -231, 61, -135, -10, 239, -211, 277, -123, -14, 156]
3427A56j75p9L34j32J9K0j11R0rK6j04j51mR5p0J32P0k28K71Mo5j35K27j59Ok09
3453a81L22L63o96J32O2J25l14L20j74J77j4p3j65j20J77O5j02j03R1j7K24j56
3475e7p2j6J53N4l9m8J66o3j46J67n6j85L19j26K18j35k29j4P0L4j28k61M55P1
3499A32q7J54k18r2L02o4j19P0L5k36k3J87J91l87R0K94j51q2R3j67j5K31j33
3522ENJ53j59K60o14L12N6J5J37j3r4J6J7k32K17l62N26m7k10j29K65l32J39j71
3546b40J02L29O5m97M02l65L73l7k65K26q6o8L02l70M7K66k8l60N49j12k92j76
3568b35o0K62lJ91L8j86O2J57k91p5K58q4J21R8m48o4K20K30J6l85M01j38j36
3591e1J34K4m9r5rj5J67J04j32N7k77L3J31Q8l41K08p1j86K79o6j15K63k32J40
$$ y = [156, -19, -98, 236, 104, 123, 143, 32, 122, 113, 139, 35, -116, -120, -25, -95, 37, 107, -121, 150, 154, 89, -46, 181, 22, 28, -181, 141, 504, -192, -60, 2, 127, -187, 133, -41, 136, 122, 49, -116, -236, -59, 6, -96, -199, -108, -125, 99, -57, -129, -145, 8, 62, 23, -25, 141, 78, -68, 99, 43, -142, 177, 51, 269, 134, -95, -109, -39, -5, -133, -394, 61, 132, 45, 199, -19, -111, 191, 127, 8, 78, 113, -123, -146, 41, 232, -155, -65, 229, 78, -4, 89, -78, -93, 138, 5, 10, 163, 4, 264, -350, -38, 18, 33, 170, 157, 63, 79, 96, -136, 81, -281, 245, 198, -12, -141, 124, -208, -69, -240, -138, 191, 256, -241, 161, -204, 169, 132, -133, 93, 7, -61, 241, -129, -82, 184, 156, -204, 345, 233, -59, -235, -295, -33, -36, 155, 193, 7, 69, 226, -65, -140, 118, 34, 155, 253, -195, -259, -39, 191, 207, -178, 223, 85, -51, 83, 107, 58, -37, -46, -61, 106, 210, 78, 135, -142, -109, 22, 110, -231, -23, -94, -280, -1, -67, -182, 81, -151, -11]
3615a1n5K53q8Q0L3n10J99j1pN1j88N23l57J93j34Q8j51K50j44k38K75j65J68
3638E4q1J9K5l41L03l3P4j19q1M80j63P1j31j54j0L3N3Q2m4P0j13j40k2J42p8
3663a04j33N92l57J18N4j00oj77l5L21l02RJ73l8K32n4j50j89K43p0k63L78Nj56
3687il8L8J5J79p2K8q8j36M7L6O3l75K17J02J00o2j6j06j60J85O2k77K09Q6J05
3712A33j16L5j62K00j04J64jl13M24o05L76p6o0K58Q0l69j14R0P1J98n6j25K23
3735A51O8j98k04K77j79K17M9l0j88n2J53k9J30l97K08J30l08k6L87j70k1J03
3757G1j11k0j2k8K6J6L3J50r3k41kJ87j03M7J33o2J37p3O3j71K00P3j25q3o9J73
3783A16j68R0J03o1j39M30k93m8O3m0m9n4K8k7R9J05l6k69p6L41lo5J16R8l58
$$ y = [-11, -66, 187, 99, 179, 212, -298, -99, -110, -117, -66, -254, 269, -88, 105, -29, 59, -92, 158, 14, -224, 51, -114, 54, -27, -8, 17, -324, -21, -54, 20, -99, -180, 300, 137, 208, 77, -77, -87, -54, -1, 81, 37, 107, -6, -146, -168, -26, -104, -237, 355, -2, 116, 170, 70, 64, -113, -148, 173, -129, -120, 53, 15, 247, 193, 43, -146, 97, 27, -236, 142, 147, -9, -47, -9, 6, 185, 113, 141, 53, -83, -36, 0, 63, -312, -95, 7, 107, 45, 29, -77, -237, -52, 10, -267, -58, 28, 133, 17, 52, -110, 90, -14, 150, 149, -164, 260, -345, 31, -45, -105, 153, 233, -136, -250, -160, -89, 109, 53, -72, 151, 219, 21, -183, 94, -85, 132, 181, 151, -37, -89, 64, 35, 165, -232, -24, 106, -202, -228, 159, -11, -32, 71, -40, -60, -72, -100, -74, -58, -25, 125, 32, -209, -211, -24, -127, -80, 53, -9, 128, 55, 118, -53, 147, 220, 95, 12, -57, 116, -52, 38, 141, 80, -59, 371, 78, 30, 93, 53, 4, -50, -22, -49, 50, 155, 119, -150, -226, 115, 112, 47, 163, 261, -97]
3808i7J71J6Kj11M6K71l31K37l38R7p2K75m8m57K20J70kq0L8K17k00k11K21j81
3832a47j93L77j14J82j80k1K58j57J74r1k07J18J52l07K9K94k31J20J06o2j90
3853i0r5P8k2M59l60K62k07m2k51K45j87J30Q0L3j6k22L06J81j81j15M1J06j92
3876e9K69j54j66K92l85K06o2J40J3N8J01m06K53j03m80O32k64L14l91J67M6J13
3898A34l93L39j08J97l35J76l6K81j96pl1R1l31K53J96k13q3j4j42L41j72L9J6
3921BJ18k33oL4j13M77k64M1O5j28nJ4J93Jj05M9M7j37J37k83R8J19p2q8K7OJ7
3948A1K5r8n3pJ60LR2j97L34l56J57o5j5L5J51k22k5R8R5Oo2j22K1K22r9j32L6
3975go7J50K4k12p5L00Jk27J8j23M7R3J62q4K5P1J0j22P1q1k7Q0m9J76J5j00Q1
$$ y = [-97, 74, 90, 92, -19, 27, 298, -33, 204, -134, -37, -109, 166, 118, -339, -119, 51, 49, -31, 7, 224, 24, -187, 34, -147, -340, 37, -77, 105, -75, -96, 162, 5, 179, 88, -119, -1, 151, -156, -127, 167, -64, 56, 162, 100, -90, -185, -107, -129, 330, -30, 232, 25, -17, -268, -23, -210, -80, 0, 33, 17, -205, 101, 282, 101, -14, 27, 133, -59, 210, 56, -110, 182, -203, 3, -59, 81, 94, 152, 253, -153, 100, -3, -483, 149, -115, 199, -192, -25, 21, 134, -259, 80, -28, 169, -166, 10, -26, 255, 59, 52, 21, 112, -219, 34, 230, 17, -66, -80, -222, 119, -53, -14, 2, 120, -113, -119, -85, -198, 279, 15, 56, 121, -7, -12, 2, 195, 196, 91, 140, 187, 50, 187, -96, 2, 121, 49, -39, -12, -6, 11, 36, -62, -115, -122, 38, 41, 133, -64, 270, -86, 71, 6, -9, 26, 177, -45, -70, 28, 123, 129, 67, -55, -34, 188, 89, -43, -7, -74, 76, 100, -112, -187, 113, 114, -113, -95, -218, -171, -78, 84, 0, 25, 96, 106, -16, 55, -26, -53, 27, -22, 154, 169, 69, 150]
4002A50p2q6J9K29l96K51Nq5j03R6n4J54N8q4R8n5k52K15k03R0M8m1J7O8j5r2
4028d0Q2o9M9qO6J57r3O1q9l73K97R3j82J38j92n2K35k76J32P5j57N08p03N09
4052A68k35J35j81K24j20N3J18j68k37O2L41k46J49K45l33N0J5mJ4kn8j52N70
4075D08l98j49K82j9l7j79J60j2J26j30m3J87j24l8K09%l70J04j29J28J74j33
4097A7j3J10r2j2k28M34l60J48j99L58j61lq2L62n11L21j53O5m2K5j8j63l0J82
4121d5K02p7j36J00l01N03r6O1l59j17J20L14j80J94j20q6L7J95m22J69O3k37
4143b18J82lk7J36l7Kj34K68p5j20O7n7j98J18J71q3j18o0J72Q7R4j69r4J35j60
4168a21J61kN6j55n7L45l63L0P5J50o5J42J6m53K61K48r9j41L8n1k00M15k44k48
$$ y = [150, 78, -8, 11, 240, -156, 95, 100, 15, -88, 8, -46, 108, 166, 82, 180, 125, -127, 88, -115, -25, 23, -18, -1, 67, 52, -40, 42, -27, 22, 14, 80, 237, 144, 205, 116, -257, 40, 133, -49, 89, -103, -155, 80, -196, -64, 11, -146, 362, -341, 168, -67, 68, -113, 111, -9, 44, 162, -6, -243, -181, 160, -86, 63, 308, -25, 25, 40, 36, 50, 48, -10, -162, 408, 10, -139, 143, 124, 87, -92, 68, 56, 182, 52, 9, 196, 72, 34, 243, 243, -127, -23, -152, -24, 150, 17, 4, 114, 22, 10, -218, 216, -144, 4, -195, 163, 2, -1, -83, 279, -232, 89, -64, 1, -41, -16, -34, -197, -227, -45, 157, 80, -56, 44, -257, 246, 150, 211, -148, -265, -145, 169, -11, 183, 63, -23, 14, 209, -213, -44, 19, -218, -36, -39, -66, 70, 33, 35, -99, 169, 94, -26, 41, -16, -214, -96, 75, -8, -126, -186, -14, 73, 167, -2, -96, 39, -121, 40, 38, 94, -61, -118, 227, -136, -106, -31, 119, 54, 196, 212, -241, 20, 268, 169, 28, 66, 15, -185, 230, -14, -262]
4192b62L73j80J19L0Q6q0j6p4M8k32O3K76k64K32m51J98n8J33j34Q8J83m9j01
4215g2j84K13pJ82n7j63kJ27k9j16J85l02K06R7K1j03j10K52L3j88j44O1J37J0
4239D7J66k11n5J8J48k43L4J39J25K08m81J86j83J22j01K46j77mL5j98K46Qk25
4262a50J34j2K3q1M7m2J15L3j21K48l7l81L63J0j48L3j50p4J57J78r0N1k4k10
4286a28K15j50K2M70n68M3K52j18L20j10j98j04p7j33L09m6m5K11m04J40q7L65
4308A79q3k38K8K15mj65M11k31j86J91k09J07R5j07j14K30j03N1Mj48J36J74l99
4331a66J16L3k6l3J39L1j3M0m5R4l70L59K9k11J99m62M20l10K05j39J61j1l7R9
4355A02k02L5k0J71l60J49K7K15q5R2J62l52O4k56L21j6k46J63J07M6n4q4j38
$$ y = [-262, 111, -69, 50, 80, 166, 86, 70, -4, 44, -188, -125, 151, -113, 119, -332, -134, -192, -59, -193, -105, 78, 29, -72, -256, -43, -50, 132, 75, -88, -90, 37, 8, -108, 77, -225, -19, 78, 99, -4, -114, 138, 171, -17, -161, -100, 37, 47, 213, 2, -53, -35, 113, -130, -96, 43, 168, 376, -105, 81, -102, 20, -81, 165, -12, -16, 19, -179, 67, 75, -150, -16, -28, -5, -86, -39, -81, 34, 67, -54, 194, 157, -224, 139, 149, 1, 34, -116, -190, -33, 145, 55, 106, 82, -128, 87, -63, -41, 429, -139, -96, 156, 38, 358, 248, 50, -54, -131, -264, 45, -1, -46, 165, -239, -99, -186, 179, 96, -142, -114, 101, 97, -68, 343, 112, -74, 117, -92, 15, 110, 3, -111, 119, 16, 67, 71, -77, 59, 233, -166, -50, -17, -43, -76, 63, 94, 81, 121, 76, 170, -200, 159, 188, -23, 176, -286, 134, -176, 29, -110, 51, 40, 3, 102, -100, -65, -85, 86, -274, -125, -98, 117, 32, 124, 286, -66, -2, -258, 63, 47, -199, -36, 71, 117, 63, -21, -159]
4378a59J67j74K35Q2j18O1o6j70L41j8m9J08l39K87p9N2j2k19j86K24K7P0l43
4401b78O2K96J5j83L1k8J62k53K56j27J21k30n6M03j90o1R2j9k5K18j93M1j90
4424a36J37j47L20k75L81l77K23j03j45K31K0J10m24L09l72O5M02n9n42M08L0
4445E6j45j80K91j42K51l5Kk93K59J22j15j02Q3o9J64o15L78J45k20J46k38K00
4467e7P8m3Ln6M8K7o2K91q4m5k14K71o7l8j31q4K46O7m0r7O1l40M31j44j39J81
4493F3M7l5k0l62L12K5K18l88J84l8l7qk33R0J97J59j62j26J56q6K06k41K21l17
4517a75J44J99L8j76m0o4R8j18O5L9J24J61m48K19J45k45m0q9K16k4l9O0J18O5
4541B33j57j11kK01m66K60k37M50j52j62L59j09p8j45L11j75j86J82k9J90j48
$$ y = [-159, 8, -166, 69, 151, 33, 94, 28, -142, 199, 181, 132, 240, -99, 188, 109, 161, 149, -70, -256, -32, -5, 65, -278, -216, 80, 95, -88, -57, -85, 77, -176, 80, -47, 74, -156, -212, 191, 1, -60, 32, 13, -12, 206, 13, 54, -136, 1, -146, 174, -101, 280, -97, 126, 23, -122, 109, 129, 239, -185, 124, -248, -183, 219, 160, -382, 26, 56, -89, -269, 22, -120, 131, 96, 98, -195, 64, 186, 71, -31, 52, -17, 147, -468, -90, 55, -165, -19, -257, -57, 21, -22, -19, -75, -27, 0, -62, 229, 145, 100, -114, 157, 90, 52, -79, -163, 83, 150, 110, 13, 74, -266, 165, 21, -118, 63, 110, 75, 55, -307, 5, 30, 248, -140, 44, 6, -31, -39, -272, -182, 15, 174, 12, -114, 42, -44, 162, -79, 142, -175, -31, 168, 206, 30, -10, -74, 24, -94, -29, 10, 134, 295, -153, 66, 211, -34, -74, -163, 53, 29, -10, 50, 168, 233, 76, -35, -37, 164, -302, -42, -279, 171, 19, -143, 216, 107, 29, -116, 195, 20, -166, 16, -13, 177, 29]
4562B9j10k6K65k68L5K3L94l15K51m29j93K01pJ46k52K28o6pj6l2J60P1k32K43
4586I3o7k59K14n4K11k50p1K07k65R7J82J89j84J22M2l46J92Q4k00j61K27J62
$$ y = [29, -81, -107, 158, -110, -75, -52, 342, 27, 278, -151, -344, -143, -150, -4, -256, -28, -94, -101, -117, -149, 11, 82, -150, 93, 26, -233, -19, -73, 138, -112, -183, 24, -241, -144, 38, 227, 43, 165, 207, -139, 53, 137, -63, -224, 3, 165]
$$ [...]
8191B63
##END NTUPLES=NMR FID
##END=
