##TITLE=1H_DE-102_ch_6_TFA
 200.13MHz, CDCl3,
 8 sc
 
 28.8.2025
##JCAMPDX= 6.0         $$ Bruker NMR JCAMP-DX V2.0
##DATA TYPE= NMR FID
##DATA CLASS= NTUPLES
##ORIGIN= UXNMR, Bruker Analytische Messtechnik GmbH
##OWNER= pz
$$ XWIN-NMR		Version 3.5
$$ Thu Aug 28 14:36:22 2025 Russian Standard Time (UT+4h)  she@DPX200
##.OBSERVE FREQUENCY= 200.1313
##.OBSERVE NUCLEUS= ^1H
##.DELAY= (6, 6)
##.ACQUISITION MODE= SIMULTANEOUS
##.ACQUISITION SCHEME= undefined
##.AVERAGES= 8
##.DIGITISER RES= 18
##SPECTROMETER/DATA SYSTEM= spect
##.PULSE SEQUENCE= zg30
##.SOLVENT NAME= D2O
##.SHIFT REFERENCE= (INTERNAL, D2O, 0, 14.3821)
##AUDIT TRAIL= $$ (NUMBER, WHEN, WHO, WHERE, WHAT)
$$ ##TITLE= Audit trail, XWIN-NMR		Version 3.5
$$ ##JCAMPDX= 5.01
$$ ##ORIGIN= Bruker BioSpin GmbH
$$ ##OWNER= she
$$ F:/spectra/data/she/nmr/H-C/1/audita.txt
$$ ##AUDIT TRAIL=  $$ (NUMBER, WHEN, WHO, WHERE, WHAT)
(   1,<2025-08-28 14:34:49.12 +0400>,<she>,<DPX200>,
      <created by zg, POWCHK disabled, PULCHK disabled
       configuration hash MD5:
       00 E9 B6 7A A2 85 ED C7 34 08 36 98 17 FE 4E 26
       data hash MD5: 16K
       83 4B F1 96 3A 28 3E 93 9B D5 34 04 A7 26 02 71>)
$$ ##END=
$$ 
$$ hash MD5
$$ E5 4B 3C F9 2D 6E B0 7A FF 5D 16 9B 1E 4E 0F 94
##$RELAX= 
##$RELAX= 
##$RELAX= 
##$RELAX= 
##$RELAX= 
##$RELAX= 
$$ Bruker specific parameters
$$ --------------------------
##$DU= <F:/spectra>
##$EXPNO= 1
##$NAME= <H-C>
##$PROCNO= 1
##$TYPE= <nmr>
##$USER= <she>
##$AMP= (0..31)
100 100 100 100 100 100 100 100 100 100 100 100 100 100 100 100 100 100 
100 100 100 100 100 100 100 100 100 100 100 100 100 100 
##$AQSEQ= 0
##$AQ_mod= 1
##$AUNM= <au_zg>
##$AUTOPOS= <>
##$BF1= 200.13
##$BF2= 200.13
##$BF3= 200.13
##$BF4= 200.13
##$BF5= 200.13
##$BF6= 200.13
##$BF7= 200.13
##$BF8= 200.13
##$BYTORDA= 1
##$CFDGTYP= 0
##$CFRGTYP= 5
##$CHEMSTR= <none>
##$CNST= (0..31)
1 1 145 1 1 1 1 1 1 1 1 1 1 1 1 1 1 1 1 1 1 1 1 1 1 1 1 1 1 1 1 1 
##$CPDPRG= <>
##$CPDPRG1= <>
##$CPDPRG2= <>
##$CPDPRG3= <>
##$CPDPRG4= <mlev>
##$CPDPRG5= <mlev>
##$CPDPRG6= <mlev>
##$CPDPRG7= <mlev>
##$CPDPRG8= <mlev>
##$CPDPRGB= <>
##$CPDPRGT= <>
##$D= (0..31)
0 0.7 0 0 0 0 0 0 0 0 0 0.03 0 0 0 0 0 0 0 0 0 0 0 0 0 0 0 0 0 0 0 0 
##$DATE= 1756377288
##$DBL= (0..7)
120 120 120 120 120 120 120 120 
##$DBP= (0..7)
150 150 150 150 150 150 150 150 
##$DBP07= 0
##$DBPNAM0= <>
##$DBPNAM1= <>
##$DBPNAM2= <>
##$DBPNAM3= <>
##$DBPNAM4= <>
##$DBPNAM5= <>
##$DBPNAM6= <>
##$DBPNAM7= <>
##$DBPOAL= (0..7)
0.5 0.5 0.5 0.5 0.5 0.5 0.5 0.5 
##$DBPOFFS= (0..7)
0 0 0 0 0 0 0 0 
##$DE= 6
##$DECBNUC= <off>
##$DECIM= 32
##$DECNUC= <off>
##$DECSTAT= 4
##$DIGMOD= 1
##$DIGTYP= 9
##$DL= (0..7)
0 120 120 120 120 120 120 120 
##$DP= (0..7)
150 150 150 150 150 150 150 150 
##$DP07= 0
##$DPNAME0= <>
##$DPNAME1= <>
##$DPNAME2= <>
##$DPNAME3= <>
##$DPNAME4= <>
##$DPNAME5= <>
##$DPNAME6= <>
##$DPNAME7= <>
##$DPOAL= (0..7)
0.5 0.5 0.5 0.5 0.5 0.5 0.5 0.5 
##$DPOFFS= (0..7)
0 0 0 0 0 0 0 0 
##$DQDMODE= 0
##$DR= 18
##$DS= 0
##$DSLIST= <SSSSSSSSSSSSSSS>
$$ [...]
##$SUBNAM0= <"">
##$SUBNAM1= <"">
##$SUBNAM2= <"">
##$SUBNAM3= <"">
##$SUBNAM4= <"">
##$SUBNAM5= <"">
##$SUBNAM6= <"">
##$SUBNAM7= <"">
##$SUBNAM8= <"">
##$SUBNAM9= <"">
##$SW= 18.0517328524113
##$SWIBOX= (0..15)
0 0 2 0 0 0 0 0 0 0 0 0 0 0 0 0 
##$SW_h= 3612.71676300578
##$TD= 16384
##$TD0= 1
##$TE= 0
##$TE2= 300
##$TE3= 300
##$TEG= 300
##$TL= (0..7)
0 120 120 120 120 120 120 120 
##$TP= (0..7)
150 150 150 150 150 150 150 150 
##$TP07= 0
##$TPNAME0= <>
##$TPNAME1= <>
##$TPNAME2= <>
##$TPNAME3= <>
##$TPNAME4= <>
##$TPNAME5= <>
##$TPNAME6= <>
##$TPNAME7= <>
##$TPOAL= (0..7)
0.5 0.5 0.5 0.5 0.5 0.5 0.5 0.5 
##$TPOFFS= (0..7)
0 0 0 0 0 0 0 0 
##$TUNHIN= 0
##$TUNHOUT= 0
##$TUNXOUT= 0
##$USERA1= <user>
##$USERA2= <user>
##$USERA3= <user>
##$USERA4= <user>
##$USERA5= <user>
##$V9= 5
##$VALIST= <valist>
##$VCLIST= <CCCCCCCCCCCCCCC>
##$VD= 0
##$VDLIST= <DDDDDDDDDDDDDDD>
##$VPLIST= <PPPPPPPPPPPPPPP>
##$VTLIST= <TTTTTTTTTTTTTTT>
##$WBST= 1024
##$WBSW= 4
##$XGAIN= (0..3)
0 0 0 0 
##$XL= 0
##$YL= 0
##$YMAX_a= 14643
##$YMIN_a= -21300
##$ZGOPTNS= <>
##$ZL1= 120
##$ZL2= 120
##$ZL3= 120
##$ZL4= 120
##$ABSF1= 10
##$ABSF2= 0
##$ABSG= 5
##$ABSL= 3
##$ALPHA= 0
##$AQORDER= 0
##$ASSFAC= 0
##$ASSFACI= 0
##$ASSFACX= 0
##$ASSWID= 0
##$AUNMP= <proc_1d>
##$AZFE= 0.1
##$AZFW= 0.1
##$BCFW= 1
##$BC_mod= 2
##$BYTORDP= 1
##$COROFFS= 0
##$CY= -3
##$DATMOD= 1
##$DC= 2
##$DFILT= <>
##$DTYPP= 0
##$F1P= 0
##$F2P= 0
##$FCOR= 0.5
##$FTSIZE= 0
##$FT_mod= 4
##$GAMMA= 1
##$GB= 0.15
##$INTBC= 1
##$INTSCL= 1
##$ISEN= 128
##$LB= 0.25
##$LEV0= 0
##$LPBIN= 0
##$MAXI= 10000
##$MC2= 0
##$MEAN= 0
##$ME_mod= 0
##$MI= 1.114404
##$NCOEF= 0
##$NC_proc= 0
##$NLEV= 6
##$NOISF1= 3.799351
##$NOISF2= 2.8
##$NSP= 1
##$NTH_PI= 0
##$NZP= 0
##$OFFSET= 14.38212
##$PC= 1
##$PHC0= -1472.307
##$PHC1= 14.39228
##$PH_mod= 1
##$PKNL= yes
##$PPARMOD= 0
##$PSCAL= 0
##$PSIGN= 0
##$REVERSE= no
##$SF= 200.129724274929
##$SI= 16384
##$SIGF1= 3
##$SIGF2= 2
##$SINO= 400
##$SIOLD= 16384
##$SREGLST= <1H.CDCl3>
##$SSB= 0
##$STSI= 0
##$STSR= 0
##$SW_p= 3205.1282051282
##$SYMM= 0
##$S_DEV= 0
##$TDeff= 0
##$TDoff= 0
##$TI= <>
##$TILT= no
##$TM1= 0
##$TM2= 0
##$TOPLEV= 0
##$USERP1= <user>
##$USERP2= <user>
##$USERP3= <user>
##$USERP4= <user>
##$USERP5= <user>
##$WDW= 1
##$XDIM= 8192
##$YMAX_p= 0
##$YMIN_p= 0
$$ End of Bruker specific parameters
$$ ---------------------------------
##NTUPLES= NMR FID
##VAR_NAME=  TIME,          FID/REAL,        FID/IMAG
##SYMBOL=    X,             R,               I
##VAR_TYPE=  INDEPENDENT,   DEPENDENT,       DEPENDENT
##VAR_FORM=  AFFN,          ASDF,            ASDF
##VAR_DIM=   8192,          8192,            8192
##UNITS=     SECONDS,       ARBITRARY UNITS, ARBITRARY UNITS
##FACTOR=    0.0002768,     1,               1
##FIRST=     0,             0,               0
##LAST=      2.2672688,     0,               0
##MIN=       0,             -21300,          0
##MAX=       2.2672688,     14643,           0
$$ Real data points
##PAGE= N=1
##DATA TABLE= (X++(R..R)), XYDATA
0 0 0 0 0 0 0 0 0 0 0 0 0 0 0 0 0 0 0 0 0 0 0 8 -8 8 -8 8 -8 8 -14 16 -16 16 -24 24 -24 32 -32 40 -40 48 -51 56 -64
43 -64 72 -80 88 -96 104 -116 128 -142 154 -170 190 -208 231 -255 286 -318 359 -407 465 -539 638
64 638 -767 961 -1265 1828 -3219 14643 9662 -21300 -5652 12058 9143 -7900 -7996 2625 7810
79 7810 -3035 -10785 -3940 8460 4887 -5741 -6399 48 667 739 2573 3162 1370 835 978 110 -2068
96 -2068 129 4179 2638 -4174 -6310 -326 5079 986 -4902 -2474 2836 697 -5162 -3572 5546
111 5546 7881 -688 -5484 364 5032 1311 -3180 -1099 2618 490 -3890 -3290 1616 4107 787
126 787 -3177 -1831 902 82 -1228 345 1908 773 -1268 -1019 728 1291 899 373 -418 -1036 -1065 -163
144 -163 1187 1022 -360 -789 -341 -416 -824 -142 1304 1001 -974 -1422 113 1143 797 -58 -201 150 -284
163 -284 -907 -257 1167 1506 65 -1287 -698 340 264 -154 -102 125 -188 -984 -677 576 1072 468 -426
182 -426 -651 -183 143 234 631 618 46 -449 -520 -33 388 333 84 -362 -738 -533 -128 291 648 224 -416 -427
204 -427 -69 209 337 539 655 -7 -677 -325 295 458 200 -294 -408 -372 -478 -287 305 590 183 -554 -573
225 -573 152 437 318 276 256 74 -261 -370 167 702 335 -341 -604 -283 -52 -195 5 434 160 -485 -490 104
247 104 524 365 99 99 61 -233 -211 143 490 289 -389 -601 -145 23 -80 4 237 114 -372 -490 95 504
269 504 334 23 -94 39 -6 -202 84 537 277 -320 -501 -114 223 -19 -113 166 63 -343 -380 70 466
290 466 323 -104 -79 66 0 -99 50 351 194 -309 -436 -21 186 33 -95 -6 41 -222 -350 34 351 201
312 201 -97 -211 26 73 -60 56 317 162 -200 -306 -16 214 73 -92 -7 -18 -167 -218 -12 278 188 -99
334 -99 -170 2 42 5 67 146 150 -162 -262 -14 165 115 -66 -95 -21 -57 -155 -15 162 129 -73 -197 -29 99 39
359 39 16 106 95 -56 -141 -29 147 106 -23 -78 -45 -53 -17 -39 91 66 -31 -111 -61 69 92 14 29 50 -28 -62 17 99
387 99 83 -16 -64 -26 -33 -44 5 56 27 -30 -92 -12 64 39 19 25 16 0 -14 33 88 58 -24 -64 -37 15 -11 -35 29 34 -79 -61
419 -61 -12 57 50 -5 -46 -19 -36 -20 18 57 74 -15 -58 -14 17 -3 1 3 42 -55 -62 -33 54 52 -1 -27 -18 1 0 17 66 44 1 -53
453 -53 -36 40 32 -24 -15 -2 -27 -44 -24 54 24 0 -37 -46 -29 -11 34 -2 39 -5 -57 -59 27 56 20 7 -2 -19 -26 -14 2 28 27 -31
487 -31 -40 4 8 22 33 32 28 -13 -40 13 60 16 -39 -12 -18 -15 -15 -27 -9 8 -20 -43 -1 12 14 -9 -3 -4 -5 -31 4 47 27 6 -17 -9 -2
524 -2 -14 5 -5 17 -18 -23 5 22 -6 1 3 17 2 2 1 35 27 -9 0 -4 -3 -23 -41 -14 15 -7 -56 -15 -13 0 1 -23 -20 -7 19 -26 -11
561 -11 -2 12 -1 8 -21 -13 20 -7 -5 11 -17 -1 36 -5 11 8 -1 -14 11 -1 27 1 -22 -5 -2 18 -21 24 -8 -24 -36 -44 -5 -4 8
596 8 -4 0 -9 -17 -25 -14 12 4 2 -20 15 9 24 8 35 7 -3 22 -9 -12 6 -28 24 16 -12 -6 -9 32 3 -10 24 8 -2 -4 12 -19 -30
633 -30 -18 -7 2 -17 22 -5 -30 -19 -6 -10 25 4 7 -28 -38 14 7 4 -1 -15 -16 -14 -2 -16 2 16 19 29 5 16 -1 24 4 7 14 14 15
670 15 10 -8 9 8 -30 -30 -7 -20 -13 22 -16 -3 1 2 23 -5 -22 16 -20 -10 4 32 -18 4 8 10 -18 -2 -10 -16 -5 -6 -34 -7 9 29
706 29 -3 -10 -12 3 6 -23 23 -20 11 29 19 3 19 -12 -15 5 -14 5 -31 4 10 -15 -22 -67 -21 4 5 -6 4 -30 -12 9 -12 22
740 22 -5 -2 -10 -4 0 36 28 13 -17 -8 -8 17 16 -6 -28 -10 -10 9 -1 15 -11 -1 -24 14 -24 6 -16 1 6 -34 -9 -2 -30 0 -2 -14 -12
777 -12 -14 -10 -10 11 6 -10 -6 17 40 3 13 3 1 -6 20 -3 5 46 6 0 24 -24 18 -1 -3 -16 -2 -30 -24 3 -4 6 -5 -14 -22 -21 2 2 -12
816 -12 23 26 -11 12 -1 6 12 -12 20 -13 6 -3 9 -9 12 -1 -9 24 28 4 0 -11 12 -6 -2 -5 -8 -16 -3 -12 -24 -34 -17 -5 14 -6 0
853 0 23 -25 11 -12 4 -9 5 -1 21 -5 -29 7 -29 24 -14 13 2 1 14 5 8 16 -10 4 43 15 29 -9 -11 11 -15 -37 -23 -5
887 -5 -50 -6 19 21 31 -15 -4 16 -11 -25 -27 32 12 -13 -22 8 -26 -8 6 -11 9 -3 5 -6 22 -1 2 -4 13 3 4 0 1 7 14 -11 -31
924 -31 6 -19 -5 -35 15 25 3 10 -6 -18 -4 -7 4 -3 -23 3 -14 15 -22 7 4 3 22 7 14 3 4 -8 -1 3 -7 14 -23 7 16 -30
960 -30 -30 -8 0 7 33 -16 8 -11 -16 -25 12 -20 -28 3 -3 -29 -28 -14 8 0 11 -12 0 -15 -2 -31 39 0 16 9 1 4 10 44 -12 4 -5 10
998 10 -18 10 -5 0 7 11 6 -11 7 7 9 4 -33 7 -8 -40 -13 -10 -9 -27 -28 -21 -7 1 -14 -11 3 8 -25 16 9 1 -5 6 -12 18 -25 -18 -8 -8
1038 -8 5 -14 10 -15 -11 -15 2 -9 8 23 -5 -14 -2 0 19 7 -10 4 -29 -25 -21 28 23 -11 -14 -19 14 -6 6 -9 29 -1 -11 -14 -10 24
1074 24 -13 -11 -6 22 -3 -2 -9 0 10 12 -3 10 -9 0 14 7 -9 6 -16 -5 -8 -11 -33 -3 -33 -1 -20 -20 -13 -2 8 -2 11 -10 6 -7
1110 -7 -8 14 -14 18 1 4 16 -2 2 21 31 26 3 8 7 21 47 -5 7 1 4 -31 10 -10 -7 -16 -24 -10 -29 10 3 5 -26 -12 1 20 -17
1147 -17 11 7 21 -42 10 11 -9 1 -34 -3 -20 18 -19 -10 14 -10 -17 13 35 -1 43 25 9 8 -6 27 12 14 -12 8 15 6 1 11 -2
1182 -2 -4 -27 -24 8 -11 22 3 -31 -5 -12 -8 -7 11 -27 -17 -3 1 -15 -13 23 13 -5 3 5 2 -27 -4 9 -2 -11 23 55 10 -11 -2 2 19
1219 19 -18 2 3 -25 -13 5 -4 -6 -2 23 -19 -16 -8 -1 -13 -15 -13 -8 16 9 16 10 -1 -23 11 9 8 5 2 -6 18 -2 10 -8 13 4 11 -11 11 -26
1259 -26 -15 2 5 30 5 -5 -20 -4 -14 -13 -22 -15 -16 9 -33 -7 -7 -16 -40 -1 13 -20 14 -16 20 6 11 -7 32 42 18 17 14 15 -5 8
1295 8 3 -3 -1 10 15 14 -5 -9 -1 6 -20 -45 -4 -9 -19 7 5 -42 14 -3 0 2 -33 -19 0 3 -20 -12 -29 21 22 8 -29 25 8 12 35 -8 9
1334 9 -2 -14 14 1 -22 -18 -14 13 0 0 -20 -14 13 -18 12 0 27 2 -10 -7 4 -20 -21 -11 -16 4 11 -32 19 20 -13 -12 29 9 18 -4
1370 -4 -12 6 17 10 -9 11 14 27 10 -16 3 2 6 2 -8 -26 8 12 -33 -28 0 -4 30 11 -8 -37 -13 -6 -17 -13 -20 -31 -18 7 7 21 -17
1407 -17 -25 5 4 -16 -6 27 35 17 6 28 -5 -10 1 9 -10 16 -8 -2 21 -23 -3 -12 -7 2 -16 5 -33 0 -9 -9 -31 -12 -14 -12 -24 1 -9
1444 -9 -20 18 -12 -14 14 7 2 4 -3 -5 -6 28 38 15 -29 -25 48 -17 4 22 6 -32 -5 -25 3 -1 -30 -22 -22 -2 -23 5 15 1 -31 -12
1480 -12 -5 13 -12 -8 -7 -25 1 9 22 9 24 16 4 15 3 -8 -8 -16 -3 3 1 -19 -4 -3 15 27 -28 25 26 -27 -4 -8 -13 -9 -15 -28 1 -3
1518 -3 19 -11 -12 -35 5 9 -17 0 -22 7 4 3 5 9 21 -17 11 -3 -21 -9 -7 8 -9 9 -18 -7 32 -8 -7 -7 -2 -1 6 7 22 5 -7
1555 -7 -4 0 8 -1 -32 -27 -1 -4 -5 -10 -6 17 -4 13 -17 -20 -52 -2 8 -25 6 -21 -1 13 4 -5 12 15 -7 -4 -14 16 14 21 13 9 4 34 -12 -1
1595 -1 21 -24 14 -20 14 1 8 -21 -24 -8 16 35 3 -9 3 -11 -9 1 17 1 10 9 -37 -33 -19 20 17 31 7 -2 23 13 -25 -18 4
1630 4 -5 4 -3 6 -5 -22 -1 -1 4 -19 3 25 -18 17 21 -4 -11 -21 -8 5 7 5 -20 -17 20 13 -32 20 -37 -5 13 -17 -21 -5 17 2 23
1667 23 6 15 21 -1 29 -7 30 20 23 26 2 27 -19 -2 31 -7 15 5 47 -13 -14 -14 -11 -9 -10 -11 -13 -15 -12 -22 3 15 -10 -15 17 8 -8 16
1705 16 17 24 -3 -1 7 3 -5 34 3 19 6 19 12 -7 -9 -16 5 4 11 -17 -24 -10 -20 -5 2 1 -1 -2 2 13 -5 -7 1 -6 -21 7 -6 12 15 14 7 24
1747 24 -9 19 10 21 29 35 2 -1 7 9 22 6 -12 36 -9 5 6 2 -2 27 20 8 -11 8 -1 2 23 -10 10 8 -16 -10 8 -12 22 1 -18
1784 -18 10 15 19 15 -3 -13 -7 41 0 34 9 -9 -12 26 -9 -7 -5 0 5 -7 -2 -6 26 13 11 -11 -24 -6 6 -17 12 -28 -29 10 16 29 0
1821 0 9 5 -29 -16 9 -2 -4 -15 0 -25 7 0 15 -9 -7 29 27 13 0 -8 24 -8 -13 10 -18 3 -2 -22 -13 10 14 -36 -7 7 19 4
1857 4 0 -5 1 -5 20 4 3 -7 20 32 7 14 -21 27 -1 4 22 -8 -3 -3 16 14 22 18 -7 4 6 -4 14 1 -3 12 45 9 27 -2 -22 20
1895 20 -4 -1 -13 18 -10 4 2 2 -32 4 -17 -11 -7 21 -5 -25 20 6 8 20 -23 9 13 -3 11 4 10 -8 24 1 14 -9 5 3 20
1930 20 6 0 22 24 -6 -7 19 7 -17 -2 7 0 -9 -28 -24 -18 -20 -6 -16 30 -1 -16 -10 2 5 -4 18 9 18 -16 25 20 6 2 21 -7 12 15 -2
1969 -2 13 11 -9 27 2 -11 15 7 -21 -12 -1 14 19 -5 -5 -28 -6 2 5 -5 -7 4 4 -9 -17 -9 12 -21 9 11 16 8 -6 -32 -4 -15 -6 -12 16
2008 16 0 6 4 1 -4 -13 -1 -1 -18 -6 -22 3 -9 -6 19 2 -11 8 -2 10 12 12 18 -10 17 -19 -19 -12 2 -11 -3 -17 -13 28 15 -32 2
2045 2 4 -8 -8 -13 2 -3 -11 -25 -5 -16 14 19 22 13 -8 -16 -7 6 -4 -3 9 -7 -37 4 -1 -18 -13 -22 -12 8 -5 11 -23 -7 5 -25 8 -5
2083 -5 20 -23 17 -17 -32 2 -5 -17 28 30 8 10 -30 13 18 8 3 0 -5 7 1 -14 -1 30 -19 0 -10 -12 -14 -16 -2 -4 -31 3 -7 1 -30
2120 -30 -32 -21 16 17 6 -9 7 9 -18 -7 -19 9 -7 38 -22 -18 -22 -3 21 -4 -4 -17 -31 -13 -21 -30 -10 2 5 18 -8 5 -14 -10 -11 -15
2156 -15 1 -43 16 -1 6 -15 -5 -10 -7 25 24 6 -4 -6 1 -7 13 12 -15 19 12 6 24 23 18 4 -3 4 -12 10 -4 -16 -15 20 -24 12 3 12 2
2195 2 -13 2 -33 3 18 -15 -18 -20 -13 16 -38 5 22 29 -2 28 37 9 13 -7 -11 -9 -2 -7 17 5 -5 22 13 16 14 7 -13 -25 0 -9 -17 2 8
2234 8 22 -2 -15 -4 12 -12 -7 11 -24 3 -2 -21 -3 -27 -13 8 7 -4 -19 5 15 -6 29 1 6 24 22 -3 1 -35 20 26 -6 18
2268 18 -12 -9 -4 6 1 -12 -11 1 -15 -31 -25 -24 9 6 24 -18 -35 -5 -2 -2 -9 4 9 6 -5 -10 -14 -7 21 11 -11 3 -4 25 -15 4 2 0 16
2307 16 -9 28 -22 2 24 -3 -1 30 -11 -13 -16 -23 -33 -4 -1 -16 3 -14 -28 -22 -13 -16 -6 0 14 4 -25 19 5 11 15 31 -23 15 -3 -25
2343 -25 17 -5 0 -11 -6 -26 -34 7 25 -8 -13 -12 14 -32 -11 5 -16 -20 -13 -5 -17 -3 -14 -37 -10 -4 5 10 -10 -1 22 3 -10 -30 -6 4
2379 4 -27 3 -2 19 -1 8 36 -8 0 -4 -3 8 2 -2 1 16 -2 -14 -41 -3 9 20 -13 -9 19 -9 -21 -8 -6 -20 -1 -3 13 -22 9 14 6
2416 6 0 2 -16 -15 8 21 3 5 14 -33 41 -12 12 0 1 15 30 -13 -7 -4 1 -1 -8 -7 -45 14 17 -10 -5 14 36 3 -33 15 -25 -21 -30 2 -4
2455 -4 -15 -1 -28 15 -2 -14 11 11 -11 -8 22 -19 -2 33 20 0 12 29 28 8 8 -19 3 -25 11 13 -16 11 -4 -10 -16 -1 0 -15 8
2490 8 -12 -5 -1 -11 -8 -19 -2 7 -9 0 6 2 8 -21 2 -8 6 15 16 16 14 9 -26 4 11 20 -2 19 6 17 3 -17 -6 -6 -1 -10 6 -12 11 -9
2530 -9 -2 6 24 1 -17 -3 27 -3 -15 29 7 -22 36 -22 5 20 0 28 16 -20 21 11 14 -13 -6 25 6 34 33 -7 8 16 -9 23
2564 23 -19 4 5 -10 9 7 -16 -15 7 -6 -24 -25 -36 -9 15 -9 -7 -5 7 10 -4 7 -10 13 -2 20 -18 -19 35 32 0 -14 -17 3 12 33
2600 33 -19 16 -4 8 -4 -10 1 2 30 -4 -2 -16 -7 -12 -8 7 3 -3 28 16 14 -22 -10 -17 -4 -8 -22 0 -35 27 -3 14 17 -5 -12 -1 5
2637 5 16 3 8 -2 8 3 -12 -7 -7 17 0 11 -17 11 -10 -6 21 6 -35 12 18 -4 5 -3 -1 15 -16 -22 -6 -17 2 -22 8 22 27 14
2673 14 16 10 21 -15 7 1 29 18 -7 32 -5 -4 -2 15 -13 -3 -3 40 5 8 8 -7 -5 -33 6 4 -10 2 -22 -8 -6 -6 -9 5 -3 7 -17
2710 -17 -20 -3 -4 22 19 10 32 -12 2 -9 -22 19 11 4 12 18 2 2 6 11 15 -11 -3 22 6 -14 -4 -10 2 -16 -9 -13 -2 -15 -29 -16 -13 16 3
2749 3 -14 -21 -6 -5 8 -34 9 18 0 6 -21 16 7 8 8 2 -23 11 -2 -2 13 -1 -7 6 1 12 4 29 -5 7 -15 -16 -9 8 -6 18 14 -16
2787 -16 37 -16 5 -32 -5 -1 -13 -10 -16 -5 13 12 11 -1 12 -6 -10 16 17 33 9 7 -6 7 20 8 20 0 10 -9 -5 2 -11 8 -17
2822 -17 25 -24 -4 10 1 3 2 27 -18 -13 -7 8 -8 -8 -24 -39 -18 11 1 -24 -9 21 -3 21 4 11 -12 15 -18 1 6 0 -6 13 22 33
2858 33 -1 3 -23 22 16 11 2 -14 -29 -11 6 -1 -7 8 13 9 -8 -8 14 -8 1 -11 -31 -24 -3 5 0 13 -19 3 -1 10 -13 -36 25 14 -2
2895 -2 7 28 27 -5 -9 4 11 9 -4 16 17 20 -12 -17 12 -22 -2 -31 8 -35 5 -8 -20 -15 -1 21 -18 29 18 45 16 -19 2 -12 24
2930 24 24 -17 24 14 -19 -12 -4 1 3 35 -3 4 21 21 17 14 -10 13 -18 10 16 -19 -11 -9 -9 -14 12 0 -6 -11 -20 -17 -28 -15 5 -2 13 26 -13 -50
2970 -50 18 -6 29 44 -27 22 3 14 5 14 11 10 -4 1 11 -23 -5 -9 -6 -3 -12 22 -3 -35 -2 -6 -1 -16 6 -10 8 -21 -15 -15 -20 -5 10
3007 10 15 11 10 7 -11 15 18 4 10 39 34 0 2 26 -5 1 -8 39 -14 -12 8 -3 -8 10 -9 -23 -14 -17 2 -9 -21 9 -18 -25 -39 -7 -14 4
3045 4 -2 -4 1 -2 -6 11 12 2 7 -9 -27 -1 -3 -17 5 4 15 -6 23 -1 9 45 0 3 -12 -1 -29 2 -15 10 10 -13 0 2 -10 -24 -24
3082 -24 -10 13 3 9 -11 4 13 12 14 5 -17 18 12 20 33 -10 -12 19 -8 -7 30 10 8 2 2 -5 0 5 5 33 -14 10 -8 -3 -8 16 -27 33 4
3121 4 10 -1 -19 19 0 -12 -5 12 12 -15 -4 -2 13 -3 2 -1 12 1 6 -12 14 20 3 26 -1 -7 6 -14 -10 8 -5 2 -14 -3 -10 1 37
3158 37 5 20 -3 2 6 -11 39 -13 20 -4 -32 -13 33 -6 -6 10 12 11 -19 -10 10 19 9 17 2 -6 18 24 3 -11 -16 -1 13 6 3 5 22
3195 22 10 35 11 15 1 -16 2 -18 -23 -24 6 16 8 4 -10 -4 -10 -13 -2 -13 18 -31 -24 -18 1 5 16 8 11 -22 -1 -4 3 21 28 -2 14 44
3233 44 14 16 3 -21 3 -1 -13 18 3 -13 -11 -13 -23 -12 17 -18 3 -25 13 -22 20 3 5 -9 17 11 13 -1 -1 3 13 2 17 41 50
3268 50 -2 -14 16 -7 11 5 -1 -3 -8 -11 -4 31 7 -16 -2 21 12 0 7 -19 -12 -8 17 7 -3 -8 -10 -14 -7 -11 5 -15 -27 -6 -18 -9 28 -9
3306 -9 -27 13 1 2 -3 -5 25 -13 20 10 -16 25 1 17 -14 0 -11 -20 15 13 16 -10 9 -14 3 -19 -15 11 -10 -2 -14 -17 -1 -2 13 -3
3342 -3 -39 4 15 -23 7 -9 4 15 29 8 10 10 28 19 16 -8 19 37 7 -22 -2 17 -7 0 -8 -23 -6 -20 -26 7 24 5 -17 -5
3376 -5 -17 -15 -21 -9 16 -2 15 4 22 -15 13 11 -5 -19 6 20 -5 -9 -15 -21 6 10 6 -2 5 12 -39 -2 11 18 23 11 21 5 -37 0 10
3413 10 -5 -28 -8 -3 -15 -23 -13 -19 -1 7 17 15 27 -33 -22 15 -7 -1 15 -5 7 -5 -13 19 5 19 3 10 24 3 -9 3 17 18 18
3448 18 19 13 0 -8 3 8 -14 22 7 6 -29 13 12 -21 -16 -19 23 -6 35 -8 -3 15 10 13 -9 -23 -9 -33 32 26 5 7 1 24 7 13 -4 6
3486 6 1 2 3 15 1 -18 4 6 -1 18 -13 -20 -4 -7 -4 -5 -38 26 -8 -25 14 5 -21 -13 19 -21 -3 -7 15 -4 5 4 2 7 -8 15 -11 -3 19
3525 19 -28 -6 17 10 -3 9 8 12 -12 -1 -11 -20 -29 5 -6 15 -24 -4 -17 -11 -22 -7 -26 -19 -6 3 22 5 4 20 -10 -17 -3 35 17
3560 17 -4 20 37 7 -26 1 -21 11 7 -26 -6 16 9 -1 9 48 7 29 4 -3 -5 -14 19 17 -36 1 -13 -19 4 -31 -4 3 7 -13 14
3595 14 -12 17 33 5 -18 -10 0 10 -40 5 7 40 -4 13 8 8 -13 -5 39 -6 -6 -9 -6 -25 8 1 -22 -20 -13 -6 -12 -22 7 13 -12 1 20
3632 20 -15 17 -24 1 -9 19 28 -21 -17 3 7 1 17 3 -1 9 24 0 -4 4 21 2 17 -17 -7 25 7 -4 -8 -10 4 26 19 7 9 -45
3668 -45 -18 -22 -5 9 -4 31 3 14 23 -4 27 27 -13 20 -7 -2 5 -1 -4 5 19 5 7 -5 22 11 31 -2 1 30 -6 -6 11 -18 1 17
3704 17 -12 -19 33 -8 -34 20 10 21 -17 -21 -2 -7 6 -38 -9 -18 -13 2 1 -17 11 6 17 -4 16 -8 12 5 -1 -2 38 3 11 14 20 21 15 29
3742 29 2 -8 6 34 -12 1 12 -6 8 10 10 5 -18 -6 15 1 -6 28 -2 5 5 -14 18 -14 -11 2 12 -14 -1 10 23 21 -9 13
3776 13 -14 9 18 10 29 15 18 -21 14 -9 -13 15 -11 -9 -12 -16 2 0 2 -6 -11 -5 -4 -31 13 2 5 -20 -29 -20 -21 -8 -18 7 4 2 16 4 8 41
3816 41 -11 26 12 23 16 13 13 -6 3 -3 13 7 6 10 -6 4 14 -8 -2 0 3 12 24 -3 22 -18 -13 -19 0 -10 9 3 9 21 -18 15 -9 9
3854 9 25 8 13 -7 5 3 12 16 -8 -3 26 -14 29 2 -11 20 6 21 -3 21 -7 -9 -24 -15 -4 4 -32 3 -13 -8 3 5 -5 12 -22 -20
3890 -20 23 -3 18 -10 -10 -14 28 -6 18 20 2 6 35 26 14 -5 4 4 -5 -27 -24 5 -4 4 -13 1 -1 -23 -8 4 -7 4 -16 -3 -11 -12 13
3927 13 3 -25 3 -16 1 -21 -11 -7 10 5 -9 -2 -10 3 -21 1 -23 -17 9 -8 30 18 14 -1 -13 -7 -11 15 -18 -14 6 12 -13 -3 1 29
3963 29 6 3 -4 -31 -2 18 -30 -5 -7 18 25 2 0 17 1 -17 0 13 4 7 12 0 42 3 3 33 18 4 5 27 -5 -10 10 19 39 26
3999 26 -12 -10 5 17 -12 -13 -7 -17 -32 -17 -20 15 1 -15 -36 11 12 2 -32 4 0 -8 3 -13 -1 -1 23 5 -5 3 1 10 -19 -7 1 20
4035 20 -1 25 6 -22 -2 -4 15 -15 -7 1 -13 -15 -26 -5 7 -22 -10 4 3 -7 17 19 -17 2 -2 19 -7 21 34 -29 -37 -10 -11 -7 2 16
4071 16 -8 34 -3 50 15 3 8 10 -13 -13 5 8 0 -16 -1 -2 24 11 -1 -23 -1 7 4 2 -1 -7 2 -15 -2 10 -17 15 0 1 21 17 0
4108 0 -3 15 33 27 -30 -10 6 16 6 11 9 8 6 34 -3 17 21 -4 -11 -2 16 12 -12 -8 0 -2 -1 -10 17 -24 -11 -3 10 10 -6 17 4 -23 -8
4147 -8 -21 5 -17 17 -30 -11 18 9 4 26 19 16 34 -24 22 -5 12 -15 22 -6 -11 -11 -14 14 4 16 -11 -4 -17 12 18 -8 -6 2 -9 -28
4183 -28 20 -9 -34 -11 19 -10 -32 10 -16 -17 15 11 -3 6 -15 15 13 19 44 23 -2 -9 0 15 -6 -7 -3 -13 -17 -21 -28 -14 7 8 2 -4 5 -4 -40
4222 -40 -12 -14 -20 -8 -5 -14 -27 12 -10 -13 -4 -10 -3 -21 -12 -9 8 12 -8 -7 -13 -25 -15 8 21 15 12 11 18 4 33 -13 -3 3 24 -2 19 3 -18
4261 -18 9 -8 -16 -15 -26 18 4 -15 -17 -4 44 -10 34 4 3 19 27 -25 23 -2 2 21 27 -1 -11 11 12 -8 9 -7 8 -13 10 -2
4295 -2 -6 -9 0 -1 0 -10 3 -19 -15 1 9 -22 -16 11 -7 -1 -10 -16 39 -19 7 12 2 0 -3 3 13 5 -5 6 4 0 23 -7 11 21 30 -6 4 -26
4335 -26 -11 -4 -9 -1 -15 -5 -3 -11 -6 -3 2 12 14 -23 -5 4 -25 26 9 -1 26 20 -17 -1 23 7 8 23 1 -2 -8 20 3 -12 31 37 17 11
4373 11 13 6 10 22 16 9 -5 -22 18 6 21 -2 -22 -27 11 -2 -16 -13 -17 -5 -15 -7 10 1 7 -10 -12 -16 13 7 10 8 7 3 21 3 18 7 -25
4412 -25 12 28 -6 -3 13 14 22 -22 -19 -15 -20 -3 6 3 6 -1 4 -16 15 -2 -18 -23 -1 -4 -14 8 22 20 -12 5 18 3 6 3 28 13 18 18 -1
4451 -1 22 45 -7 24 3 14 -5 -12 -14 -12 2 4 -5 0 -7 3 2 31 -18 -2 13 -34 7 -29 -4 14 38 -9 -2 -17 2 25 -7 6 -19
4486 -19 6 11 4 11 1 -10 5 -23 7 5 23 -7 -14 4 22 -3 -13 -31 18 9 25 21 -3 -34 20 4 -6 -13 1 3 3 -6 1 -17 3 24
4522 24 31 16 20 12 8 15 -11 8 4 -1 -2 12 0 -21 13 9 5 8 -13 -3 1 0 -13 1 10 3 2 -5 -36 -46 -24 26 6 -11 -4 -3 -9 -12 -36 15 12
4563 12 12 -20 -21 -16 1 -12 8 25 5 -9 21 23 29 35 2 19 23 8 -2 18 -3 -13 26 -1 -10 -20 -8 -19 -8 13 16 12 -21 -5 -23
4598 -23 -7 -18 -16 10 -5 -1 -6 -26 19 -7 18 18 -4 -9 18 12 4 -9 -4 -11 11 21 29 1 3 -12 -1 21 -7 -1 9 20 -4 14 -10 19
4634 19 28 -17 9 -4 -2 -15 -1 10 -6 15 -3 -41 6 7 5 -4 -14 5 -6 4 13 -7 2 -2 -6 3 -5 12 23 10 20 22 35 -29 -12 -2
4670 -2 5 -14 -8 7 -16 -11 -8 -2 -30 -23 -8 0 9 -11 0 -5 2 3 -4 23 -16 9 -21 14 2 -4 16 1 16 29 5 -16 4 18 -4 38 -4
4707 -4 29 20 4 21 -12 30 -5 6 -19 -16 -21 -6 -5 3 -20 -19 -27 -26 1 -19 -26 -11 14 21 -11 -27 -8 -35 -8 7 29 -6 -17 -3 7 -6
4743 -6 54 15 21 -6 19 -6 8 1 -19 8 -12 15 -7 -7 8 4 17 15 2 -3 -42 -1 14 1 -5 4 -5 4 -13 12 25 21 -28 11 14 4 18
4780 18 -27 -23 22 -7 17 -9 18 1 3 9 -14 1 -20 27 -15 -12 9 43 39 -4 -14 -31 -1 22 -25 -24 17 -12 -16 -4 0 16 -13 -9 13
4815 13 -11 15 -20 10 -23 -17 -14 -23 15 6 3 11 32 -4 -8 -13 26 -19 -10 12 22 11 -28 0 -8 -28 -20 3 -3 -2 -8 -12 10 -6 -20 3 4 -27
4853 -27 -29 15 -8 -20 -8 2 -29 17 10 -3 9 12 2 -3 -13 -6 -8 4 23 -16 16 -2 2 5 10 -14 3 -43 -4 2 -10 3 -22 -2 1 -12
4889 -12 -14 -21 -9 -22 -3 5 -15 -18 -31 -11 4 13 4 -30 -1 0 -3 4 -10 0 15 -2 -4 20 -10 -2 -2 10 0 29 -12 -6 5 17 4 -25 1
4926 1 -27 11 -22 -8 -1 -15 -3 3 9 -11 -24 -47 12 -7 -15 31 -10 -22 -9 -24 -31 7 -10 7 6 -16 20 2 4 -6 -2 39 -1 23 10
4961 10 -21 0 -3 0 -20 -24 17 -4 -15 10 -20 -9 -3 -16 17 5 -1 9 -16 8 27 7 10 6 2 -20 32 6 -4 -12 -24 18 23 -6 -13 6
4997 6 14 7 13 -2 16 8 -5 3 19 -27 -11 9 33 -4 0 9 -28 28 -8 7 -1 -27 -14 -5 -5 -7 12 -13 1 2 -9 12 3 -30 3 -49 -25
5034 -25 7 7 3 -13 14 7 15 8 12 -19 17 1 -1 -4 4 31 -8 -23 9 6 -24 -7 1 -6 2 -3 0 9 -33 -17 1 0 -1 -3 2 21 36 -3 5 9 -6
5075 -6 -1 -2 25 32 0 29 -4 -11 -3 -12 11 24 -8 -8 24 0 15 -1 -7 -13 1 -14 -52 -1 -16 7 -22 -10 -10 -15 -16 -12 -10 -10 11 -13 27 4
5113 4 -22 4 20 27 -2 -6 14 -20 19 20 9 -29 13 18 20 -12 39 7 -8 2 7 -5 -29 -20 -15 -4 -16 4 6 -25 0 0 5 -16 -33 -9
5149 -9 16 -14 -9 -19 -7 -11 -25 -17 -1 -10 29 -14 -4 24 11 7 26 -4 5 5 5 17 4 -5 -12 -9 -2 -8 -7 -40 -2 -12 6 0 11 11 -24 20 -22
5188 -22 11 -26 -17 -18 -24 13 -1 -1 -26 6 25 9 9 -8 3 18 -21 -11 -11 11 2 18 7 -14 -9 -3 6 -11 5 8 20 7 -12 -8 2 -1 -35
5225 -35 -8 4 13 21 -24 -6 29 -11 -9 13 -2 -14 -31 10 -15 -9 15 -14 9 2 -9 -3 -19 -17 13 -15 3 -7 -1 -18 4 0 -1 5 20 -13
5261 -13 14 -8 -6 12 -4 -6 -4 -4 -20 5 -7 -26 21 4 -23 0 -18 16 -26 -2 39 11 -5 5 24 4 2 -6 8 4 25 -1 -6 12
5295 12 6 -2 -5 28 -10 4 3 -15 -12 2 6 18 9 6 -7 -21 -9 -18 0 5 8 -6 -2 -21 -2 12 7 3 -1 0 -4 38 -4 14 -7 -15 5 -13 14
5334 14 -4 1 14 12 -3 -1 11 -5 24 2 20 -4 -18 -30 17 -18 -18 -7 8 0 8 -10 -20 5 7 -11 -14 -2 -29 10 3 -1 4 -5 -9 5 0
5371 0 2 -9 -7 22 11 2 20 24 -3 7 -17 -16 8 -3 1 -4 -19 8 2 -12 0 0 19 2 -1 -34 2 2 -5 -9 -38 -9 -12 -22 -2 -19 17 -1
5409 -1 -5 12 8 -3 -7 7 8 22 9 -28 -16 10 -12 15 -10 -5 0 29 2 17 26 0 -16 17 13 -11 9 -4 12 -28 19 -34 14 -16 20
5444 20 -14 -9 -11 -14 10 -17 18 13 14 -11 -21 14 9 -23 27 -6 -7 3 -1 -16 14 -11 11 4 -12 -20 -4 2 32 1 -12 8 3 -28 9 10 -13
5481 -13 -1 13 -9 5 -17 3 -3 2 7 14 -4 6 1 -42 6 -3 -14 -19 -5 3 20 11 -15 31 12 -12 10 0 -2 13 26 -15 -11 10 0 -8
5517 -8 8 12 -7 4 17 4 14 -3 0 -7 2 13 5 -3 17 -26 -1 0 -13 -3 -3 0 -12 12 -34 11 -3 -1 24 -20 28 5 10 26 3 -6 -18
5554 -18 3 -5 23 -7 -16 -18 1 -16 -23 -9 -2 14 24 -17 1 -10 -14 -20 13 10 -5 -13 -1 23 -2 2 8 3 11 5 9 24 -28 19 7 13 34 2
5592 2 15 10 9 22 4 -9 3 0 -3 4 10 -17 -10 -13 -7 -13 -17 -28 -12 -14 -13 -2 -19 2 28 -10 -25 -22 23 15 6 0 -8 -4 5 -18 7 14 24 -1 -10 9
5634 9 20 17 31 -4 12 15 -27 -12 15 -17 -11 -7 -22 -15 24 0 5 1 19 15 16 21 6 -7 -13 18 -18 18 0 13 10 34 -13 -16 -16 12 13 10 2
5673 2 -7 16 21 -7 16 -5 20 9 12 1 -14 5 3 -10 -2 -6 -7 22 -25 -1 -19 -3 4 6 -19 -10 -5 12 -19 0 -4 -2 22 6 -2 27 15 -1
5711 -1 4 -18 19 -17 20 5 5 -14 -14 21 31 15 30 8 8 15 -13 -5 -16 -13 13 -18 -4 11 0 23 35 33 -1 -25 -8 22 -1 20 0
5746 0 18 1 14 15 28 23 10 -12 18 22 6 17 7 27 -7 0 8 -15 24 7 18 -3 5 -21 28 11 -11 0 -24 22 -1 3 -6 -1 -2 -38
5782 -38 -20 9 -18 -22 -19 -3 16 8 -14 14 7 9 19 6 3 -39 36 -22 -5 6 4 2 -40 -9 4 -30 -11 -4 -21 2 0 -5 3 3 0 21 1
5819 1 16 7 -17 -3 5 4 -12 11 1 -2 8 -8 0 18 4 10 11 13 17 12 24 -20 -11 5 16 18 4 -11 4 7 -3 1 -2 16 -13 -14 1 -12 -20
5858 -20 2 8 1 -14 5 -19 -8 -5 -4 -20 1 7 -24 -7 -20 9 14 -7 -13 7 23 8 2 -30 1 28 23 2 15 2 8 4 21 -7 -18 14
5894 14 -7 -32 -13 -1 -21 -12 -38 5 -9 9 -13 8 -24 14 -2 -18 -26 2 -6 -28 -5 11 -8 4 1 -11 21 10 3 -2 27 32 19 14
5928 14 -12 -15 7 7 22 21 12 -9 10 17 -4 10 7 -29 5 -13 -14 -21 6 4 -16 -36 -18 12 2 -4 -7 4 -8 9 -8 4 3 7 4 -15 1
5965 1 13 -7 27 32 36 -17 2 2 4 -22 -13 -20 2 -7 -1 -14 1 -6 5 12 -17 23 4 -11 1 -18 4 -13 -21 4 -27 -19 -8 18 -16 -20 23
6002 23 -5 -7 2 -1 10 -13 0 7 22 -5 4 -3 -17 -4 -27 -7 10 -1 -8 -8 -20 6 -4 -25 -7 13 -8 -22 -10 24 -6 -33 -3 -8 -16
6037 -16 -1 -13 -27 2 -7 -3 -7 29 -12 14 -14 2 5 -3 9 10 -14 15 20 11 -3 -5 10 -23 9 7 21 26 -20 -9 -6 0 -18 2 -40 -11 -6
6074 -6 -20 -6 -5 13 2 -27 -17 -6 -27 -1 -5 -12 37 -9 6 -6 -12 7 -8 2 16 -8 -15 -20 -24 -11 -11 32 -10 0 21 -11 -11 -2 9 14
6110 14 -3 -12 -15 -16 -25 -14 -22 -41 5 5 -5 -3 -14 -20 -8 -12 -8 1 -11 13 -15 33 6 -6 -4 6 -1 -13 -4 0 -19 -2 27 2 18 26 8 -1 -27
6149 -27 -5 -11 0 -22 -21 -15 -17 14 -5 12 -8 15 -1 37 -20 -17 -18 -3 6 15 16 21 -29 9 -20 13 35 -2 14 -3 16 -17 11 3 33 8
6185 8 0 -15 8 -18 -10 3 -12 20 -13 -16 9 -28 12 -35 9 -29 -27 7 -12 9 -19 -6 -10 17 -5 7 -10 5 -6 21 -8 -9 11 6
6219 6 2 -4 2 7 8 -8 8 -2 -25 -8 -23 -14 -17 -14 -15 -14 13 6 3 -3 -3 -3 5 -26 -4 -25 -18 -1 14 4 -7 13 -2 8 12 -19 8 18 -2 22
6259 22 8 17 -15 11 -13 -34 -14 -15 -11 1 26 14 -14 1 -12 -5 -12 -8 6 -11 -2 19 -16 -9 -14 28 -15 -24 -13 12 -13 -3 -12 17 -10 -6
6295 -6 13 1 6 -29 6 23 7 30 15 -23 -12 -1 1 -15 6 -1 -17 -22 -41 12 -8 -31 -2 -17 10 -38 -1 -26 -11 -8 -2 -16 -10 -17 7
6330 7 -20 -21 6 -9 -22 12 2 7 3 -2 -22 -8 1 18 -16 -11 17 9 27 26 25 -3 1 7 -7 -1 -16 -61 15 -2 1 -29 -16 -13 -1 -6 -10 -9 2
6369 2 -32 -15 -7 7 -13 -11 -3 -8 -11 11 -5 8 -24 -3 21 -8 8 7 -7 -7 -14 -9 -9 2 18 20 15 6 -6 12 11 -12 -2 -5 -9 3 2 0 11 -32
6409 -32 29 -3 -24 -9 -14 8 18 17 0 -6 0 1 3 20 21 1 2 -13 -33 10 2 30 -6 4 46 -27 -20 21 15 -3 38 10 -10 -16 -47 7
6445 7 -19 -11 11 -13 13 -11 8 -5 4 -18 -41 -10 -3 -6 -17 -6 -9 17 -8 16 4 -13 24 9 15 -25 16 -6 16 -6 16 0 -10 -2
6479 -2 -10 27 -11 12 -14 36 -7 -23 -13 -3 6 -22 -9 -27 -23 -14 -40 -16 2 -24 -24 -9 -11 -11 7 -13 -20 12 -8 8 5 26 -2 -3 17 4
6515 4 -6 -11 20 5 5 15 24 -21 -8 -7 0 17 0 -27 -17 -24 -15 -19 -22 -9 -10 -13 -13 9 -9 10 5 2 -8 -10 -17 3 -18 11 9 -25 14 15 -15 -11
6555 -11 11 -6 36 26 8 -1 -17 27 13 11 4 -11 10 -18 -6 -10 -2 -5 -16 -32 -13 -5 -37 -38 17 -17 -30 -8 8 3 -1 -31 -9 29 3
6590 3 20 17 -10 14 -11 -9 6 2 -6 7 14 -3 15 -9 21 -26 2 7 1 6 -22 18 -22 3 15 21 7 21 -11 -19 -21 -25 3 -28 1 9 -12
6627 -12 -13 -1 -1 12 5 -1 -4 -16 20 11 -5 24 -3 -10 -18 -7 5 -1 0 27 4 -25 -34 -30 -12 -15 9 5 -14 11 -5 -3 6 0 -19 1 -22 4 -9
6666 -9 -13 -2 -6 -6 -8 -27 9 5 1 -1 19 -8 -10 4 9 8 11 3 -6 -14 0 13 -1 21 0 3 -19 -24 -3 3 6 1 -18 6 -10 -14 2 -11 -16 21 -18
6707 -18 -10 -3 3 -6 -1 14 15 -33 23 -7 4 -5 7 -15 9 28 11 35 12 21 -4 -7 -1 29 -13 22 0 -6 -9 5 2 -10 -32 5 0 12 -3
6744 -3 -15 -20 -17 32 6 19 -10 18 -3 -3 -3 -27 -7 -5 -6 -2 31 0 -8 29 -6 -7 28 -12 -25 1 -9 23 25 6 -16 -10 -10 -25 20 -14 11
6781 11 16 -19 14 -5 -18 -10 -12 5 -22 -11 -1 23 -28 18 15 -13 -2 12 8 18 -15 1 39 -4 24 16 32 16 29 12 10 7 17 -8
6815 -8 -10 -22 16 -5 6 0 17 0 -21 -3 -14 -3 -9 19 20 2 -39 10 -13 14 3 -16 -17 -2 -11 -13 1 14 6 -1 9 26 9 -1 -8 -11
6851 -11 -16 6 -2 23 23 -4 15 20 5 11 15 14 10 11 -15 -3 -1 -14 -1 12 4 -7 -22 6 -14 1 0 -7 -3 23 6 39 -5 9 4 3 2 35 60
6890 60 14 28 -2 18 36 13 15 17 14 5 24 -23 -19 31 -26 27 -9 -10 -8 32 -15 5 0 -17 -15 -10 12 10 -30 -17 -4 19 -19 9 -14 -8
6926 -8 -15 -23 11 27 -7 -8 8 25 12 -20 15 0 -3 13 20 -6 19 -4 11 19 19 -14 6 4 15 -3 10 -12 20 2 1 8 21 -9 -22 5
6962 5 1 23 -16 -1 -4 5 -14 11 5 11 8 6 -13 8 29 12 10 18 4 -12 26 21 4 -4 -33 -5 -4 14 6 0 0 -9 9 24 -6 0 4 -10 -15 -5
7002 -5 15 -7 6 4 -9 -17 10 22 8 -2 4 17 -18 -11 -19 -20 25 -40 4 13 38 13 -8 -7 14 -4 -8 21 7 -1 -2 -2 12 6 9 -26 24 20
7040 20 -31 30 -15 -7 -11 -20 -10 7 6 21 6 -35 12 7 -6 -3 35 -3 -12 21 -1 37 15 10 2 24 37 15 7 18 -3 37 15 -14 8
7075 8 -14 -6 24 11 -8 1 -4 -25 -18 -47 14 3 2 -16 12 21 -7 -29 18 -7 -23 12 -12 30 5 -6 12 0 13 5 3 -3 -14 -10 -11 -9 -6
7112 -6 -1 22 3 -19 -23 -23 15 -13 -17 -19 -4 -24 -7 -11 -19 -32 -14 -12 -14 5 8 -2 -22 5 -2 36 7 27 33 1 -3 -11 26 -6 -9 14 9 16 17 -3
7152 -3 5 23 -3 11 1 -14 -17 4 -13 -8 -20 -15 5 -3 12 -8 9 11 -10 -20 -26 -6 13 -8 -4 -15 -6 0 -18 -8 5 6 -20 17 1 19
7188 19 13 1 -7 1 19 16 -11 12 4 0 31 -9 -6 11 -37 4 -10 2 -17 -14 1 -18 30 -10 7 9 11 -3 30 10 -5 14 5 16 -10 -19
7224 -19 3 -20 -9 -11 12 4 13 -7 10 7 18 44 2 19 6 11 11 -3 29 -14 15 -27 -6 1 -35 -28 -1 6 -8 -1 -14 -15 6 -2 -11 15 17
7261 17 7 5 12 23 17 -4 32 3 -20 -11 -4 -29 -7 15 15 3 16 17 22 -9 11 -25 -3 -8 2 27 -17 -26 -5 15 -8 -28 -24 0 -16 -2
7297 -2 -4 12 -45 -22 -25 0 -8 -2 -5 -6 -4 3 0 18 8 22 13 10 8 -32 -2 -26 -6 1 7 5 25 9 -2 2 2 -16 -2 -4 -1 4 -14 11 -4 1 -55
7338 -55 8 8 1 -36 -14 15 3 14 -20 -5 8 8 -18 2 32 33 2 14 11 21 33 -17 20 11 7 3 -26 -3 -16 0 4 15 30 -27 6
7373 6 -8 -9 -33 0 -10 -2 -13 -2 3 -1 18 -11 -5 0 8 -19 14 -6 18 -2 14 19 -26 7 8 -6 7 5 -4 0 17 -4 -2 7 -5 28 -10 9
7411 9 3 -5 18 7 9 -8 7 12 -5 17 -17 -43 -15 -7 -11 -2 -4 -23 8 30 -12 11 -3 5 14 7 16 5 -11 7 -9 7 24 12 28 13 -11
7448 -11 12 10 -5 -11 2 10 22 19 14 -17 -7 4 -1 -19 11 -12 -6 -1 8 -15 19 -12 -9 -10 -11 24 -3 -6 2 7 6 -9 6 7 -3 3 9 -8 -8 -15 -19
7489 -19 -3 -18 3 -17 1 20 -12 2 3 -5 -5 4 15 -4 9 0 -7 -8 -8 -7 9 -11 -10 15 0 -12 15 12 23 4 23 12 -23 8 8 5 15
7526 15 15 18 15 9 4 -26 16 6 18 -7 6 16 -10 -23 2 3 -38 -8 -24 3 -8 -20 -10 8 0 4 6 -11 -18 31 1 -9 0 -17 -12 8
7562 8 20 -6 -25 -2 -5 -8 2 3 -18 41 4 17 33 10 -29 3 -16 -14 -9 -3 12 -12 2 2 -16 9 -13 -15 7 -9 10 10 -5 -11 25 -1
7598 -1 16 10 -7 13 -23 16 5 7 23 -3 6 23 4 -25 -16 11 6 -24 -14 -17 -13 0 -18 12 1 16 -9 14 24 -11 10 23 -13 -32
7632 -32 -3 9 1 7 -15 4 -2 -23 -16 3 -4 -7 11 -17 1 -7 5 -12 -5 11 21 3 -1 1 22 11 -44 -2 4 28 -6 16 14 -5 37 -14
7668 -14 -13 5 18 -26 1 9 8 -37 2 5 -8 13 -1 -5 -11 20 -19 -11 -3 -27 -9 15 17 -38 -29 8 -23 13 2 -2 15 -2 3 16 10 -23 9
7705 9 -6 -44 25 -42 3 7 -3 1 7 -33 -19 5 13 7 -54 -6 -37 -6 1 2 -20 -10 -10 26 16 8 8 -12 13 15 16 -14 -19 5 -8 -8 23 16
7743 16 5 -7 -14 14 -5 2 -7 12 -7 -10 12 -6 -7 -24 -37 -6 1 4 -14 -22 -12 -9 -9 -40 9 21 20 -9 10 12 26 0 15 -2 -5 10 13
7780 13 13 12 38 2 3 9 3 -14 11 -2 -4 -3 -26 2 -34 0 2 -20 -3 -3 0 11 15 0 12 -15 9 -30 -16 3 -12 -31 13 39 -17 -4
7816 -4 -3 3 3 -13 1 1 -5 9 14 -18 18 -5 2 -9 -15 10 21 23 -28 9 2 11 -17 -2 -8 -13 -16 18 -11 -16 -3 29 -3 -13 -12 -3 10 -8 -2 -15
7856 -15 -13 -3 -1 -14 -5 -8 4 -4 22 -3 -5 18 18 6 4 -3 -17 -14 11 6 -19 7 14 -17 -4 -47 -16 36 1 8 -18 -3 11 -2 -30 23 12
7893 12 6 -33 17 24 -6 17 8 -9 0 -4 13 -25 7 -8 -24 -16 24 -22 -8 -10 12 4 7 13 -2 -33 -34 -7 -41 -38 12 -21 2 -17 -7 3
7929 3 -15 -26 11 -5 -3 -16 2 3 7 20 12 -2 21 40 -7 9 13 9 -4 9 4 30 1 24 -5 11 11 9 16 7 7 -5 12 -14 -3 1 10 -31
7967 -31 -5 -9 -24 -5 14 14 13 -24 -17 -27 -16 0 4 3 14 7 5 12 33 -5 -1 19 11 34 12 2 -8 13 18 1 -12 -30 5 -2 13 -7 1
8004 1 -15 -3 -14 7 -21 -31 6 -44 -1 -15 14 14 8 1 -25 22 5 5 2 -9 38 39 20 -6 12 10 27 -5 12 11 3 -5 -32 5 -10 -5
8040 -5 16 -19 -13 -7 -10 -20 2 4 -23 -2 21 -4 -9 -6 9 15 -14 -1 5 -33 -11 -20 -9 -21 18 2 -17 -10 0 -15 1 28 7 4 29 11
8076 11 4 -1 4 4 11 20 -14 7 10 -11 -2 -23 -8 -17 26 -6 10 -25 4 -2 1 12 -19 -1 3 -8 -33 -2 -10 1 14 5 13 17 -3 -10 3 1 -8 29
8116 29 45 -21 10 -11 -6 5 11 -5 -13 13 7 -36 6 -5 23 -18 14 2 0 -40 -21 -3 -28 10 -19 -18 42 -24 10 -5 -11 -17 -15 1 -28
8151 -28 32 18 4 24 -38 21 7 32 18 23 -12 -26 12 -15 3 -10 -4 -13 4 -14 -9 -17 16 4 -14 11 -4 -11 -25 -34 -4 25 -22 -3
8185 -3 32 -8 2 11 -8 27
8191B7
$$ Imaginary data points
##PAGE= N=2
##DATA TABLE= (X++(I..I)), XYDATA
0 0 0 0 0 0 0 0 0 0 0 0 0 0 0 0 0 0 0 0 0 0 0 0 0 0 0 0 1 -8 8 -8 8 -8 8 -8 8 -13 16 -16 16 -17 24 -24 25 -31 32 -34
46 -34 40 -41 48 -53 57 -65 71 -77 85 -96 105 -118 132 -149 169 -194 226 -268 328 -414 554 -829
68 -829 1539 -7675 -13008 7200 7227 -5884 -4166 11469 11070 -3675 -9527 2263 11358 4329 -9194
83 -9194 -8679 3460 4580 -7947 -7934 6434 9519 -3833 -10857 -1484 8339 3693 -4346 -1206 6075
98 6075 3637 -4023 -3525 4743 6249 -1774 -6318 -2243 1604 -244 -2490 524 3360 -430 -4184 -1417
114 -1417 2145 1588 103 501 802 -519 -893 1185 2657 1538 -834 -2122 -1115 -248 -1165 -502 1815
131 1815 1276 -1755 -2450 286 2202 625 -1021 -95 572 -379 -1133 132 2269 1871 -942 -1947 -279
148 -279 890 242 -428 371 691 -703 -1410 -239 962 891 -126 -926 -600 -120 77 461 874 728 -256
167 -256 -1008 -455 507 571 334 148 -150 -475 -566 47 805 498 -385 -807 -667 -214 70 282 624 338 -465
188 -465 -630 1 678 737 218 -63 -134 -335 -245 154 472 450 -289 -1023 -709 84 345 168 95 144 -132 -611
210 -611 -99 671 760 283 -266 -416 -4 133 101 336 269 -255 -786 -681 51 410 124 -42 -76 -166 -159 -3 458
233 458 765 265 -350 -378 35 298 131 61 273 -153 -728 -497 178 451 87 -283 -141 -35 -177 -23 392
254 392 559 242 -405 -392 214 386 82 -25 64 -71 -469 -505 144 451 88 -344 -257 -10 101 3 191 532
276 532 209 -359 -345 171 440 121 -157 23 -6 -365 -311 138 351 77 -361 -281 27 41 9 135 266 124
298 124 -333 -291 222 365 89 -85 -4 -15 -232 -226 90 334 16 -327 -291 7 152 8 71 266 93 -226 -214
321 -214 175 344 104 -95 -38 -6 -102 -110 98 227 58 -242 -259 11 108 11 -7 62 52 -167 -202 118 278 117
345 117 -83 -81 -1 -17 -72 50 139 46 -195 -201 -26 127 65 -13 38 9 -103 -150 66 218 104 -53 -76 1 -1 41 28
372 28 80 23 -109 -135 -44 49 33 -41 -60 -2 -67 -54 44 116 67 -27 -53 4 44 45 23 41 29 -68 -88 0 72 63 -11 -40 -46 -9
404 -9 -10 37 94 66 -13 -41 22 54 33 -1 13 15 -48 -88 29 51 -15 -54 -55 -37 -36 -21 -14 13 37 -35 -49 21 50 27 16 -6 15
437 15 -40 -31 33 74 -7 -21 -57 -4 28 17 11 43 13 -9 -5 -15 50 56 28 19 6 -4 -12 5 29 39 -40 -66 -38 10 -13 -8 20 13 -10
472 -10 -49 -26 67 44 15 14 -33 20 8 11 28 18 -28 -28 -38 34 58 10 2 1 -1 -34 -7 59 53 20 -37 -3 16 7 -14 13 38 6 -45
507 -45 -55 2 -6 11 -26 -30 -7 -31 -23 11 36 11 -4 -10 40 30 5 37 33 7 -17 -6 -5 33 17 -27 11 19 -17 -12 25 27 3 21 -9
542 -9 -10 2 6 -10 51 -14 -21 -14 -24 -2 -22 -20 -16 -17 2 -20 19 -7 15 1 4 -28 9 21 15 11 22 6 5 18 55 38 21 -15 1 6 22
579 22 22 22 4 4 -21 8 8 5 22 15 11 1 -20 34 18 -26 -18 2 -19 -18 -13 -8 8 10 37 -8 -4 1 12 17 29 -1 7 15 31 30 -9 20 -3 18
619 18 35 23 4 15 -16 -14 14 -8 22 15 -7 19 -7 -13 -4 14 -13 -11 -27 -3 -19 17 11 7 -3 10 -4 15 0 -29 18 -2 -19 6
653 6 12 34 34 30 8 -30 -18 10 26 -4 8 13 29 -10 4 30 -3 3 3 -13 -5 -3 21 -11 -9 14 -11 -21 6 -21 -28 18 7 -15 16 -16
689 -16 7 -10 14 21 17 -2 14 6 14 40 30 0 -11 4 18 6 13 32 11 -19 -10 30 -14 1 16 -25 -27 -3 -19 -6 -27 -12 -12 6 12
724 12 9 -21 -25 -12 -56 3 20 12 -12 38 23 -3 12 22 17 14 28 24 19 -7 10 27 4 20 -11 11 -4 25 9 8 3 -9 -9 -15 -6 14 3
761 3 -16 8 -26 -7 -23 1 16 1 3 -24 -13 21 -16 14 -4 -14 3 -10 26 12 10 4 4 -12 23 20 24 -8 13 1 -1 14 4 -1 -20
796 -20 -5 0 -19 5 -5 0 -18 -1 -24 -10 -25 -30 -3 -1 6 -3 -1 -10 -15 0 -9 -7 -11 -3 21 4 14 12 37 9 5 -1 30 13 13 -15 1 3 0 1 14
837 14 18 23 -31 15 17 -7 -14 -28 -12 1 8 -25 0 1 -3 -5 -7 -17 7 -7 -5 38 4 8 1 22 36 10 1 22 6 7 13 5 24 -2 11 24 -11
876 -11 23 20 11 -7 -32 5 -11 -5 -9 -19 -3 -25 13 -20 -29 0 -2 -36 -17 2 11 6 -2 -6 -11 -1 12 34 17 -9 -9 -3 -2 20 29 5 9 19 12
915 12 17 -4 8 -3 -20 14 -4 44 -20 8 19 -11 -23 -34 2 -6 5 -21 -31 -16 3 3 -9 5 3 4 -1 2 10 -15 6 1 1 -11 31 47
951 47 36 35 23 22 -9 6 31 10 12 -16 -18 -5 -13 4 -3 -13 -15 -18 -17 -6 -16 12 20 -2 -4 1 -12 -11 -12 -12 12 -13 -15 -18 -23 -17 -4 -2 -6 -3 -6 9
993 9 36 13 23 -3 9 2 14 18 -11 36 9 -7 0 7 -12 -4 -24 4 1 27 -24 5 -16 -17 -28 -40 -26 -16 7 -4 -9 -40 5 -7 11
1028 11 30 13 -23 7 8 -4 41 8 8 6 6 39 20 40 -26 0 19 2 -16 20 14 -3 -16 3 -14 10 1 -5 5 4 -8 -5 3 -11 -3 16
1064 16 -9 3 -5 13 -29 8 22 3 0 15 42 34 9 9 11 22 10 17 9 32 14 20 -34 3 7 -15 -1 15 -23 -5 -11 -7 -15 -8 -14 -3 8
1101 8 24 0 -48 8 20 -9 -10 -8 6 -8 -2 0 13 5 -4 16 36 25 23 10 2 30 1 -6 8 16 14 8 -9 -2 -1 -12 -1 19 12 -6 -29 7
1139 7 0 35 -3 5 -3 6 15 14 -1 8 -5 8 -8 15 25 23 40 -2 0 8 8 -9 -21 1 -2 11 -2 -5 22 -7 -4 0 29 -15 -29 -13 -5 25 11
1178 11 6 3 -7 -9 -5 -2 -18 -6 7 -27 -26 -29 5 4 0 22 -3 10 0 9 -18 31 10 22 -8 -3 34 11 12 4 -1 -18 53 -3 5 44 16 -15
1216 -15 10 -18 -1 4 4 1 -5 16 49 -2 -13 9 -21 2 -3 -22 5 0 21 -17 -32 5 21 6 16 10 5 1 -10 10 12 21 8 3 18 17 34
1253 34 14 10 32 -9 6 3 -14 19 8 15 0 -16 -5 9 35 19 2 -4 6 1 -3 -5 -39 16 -4 -5 -9 -3 23 8 18 7 19 -3 8
1288 8 25 17 -10 -11 3 13 42 -13 9 15 10 -2 -9 1 -38 -17 11 -5 -7 -11 -18 14 -26 27 0 13 -8 -17 -11 -6 -22 -9 -12 0 23 10 40
1325 40 -4 -11 -4 38 14 44 3 8 11 -14 19 5 21 27 -8 6 -1 -4 -16 11 -10 -33 -7 19 -18 -2 13 -17 -14 -17 7 -23 12 1 -24
1360 -24 -15 -9 -15 27 26 -4 0 28 0 14 28 42 35 -5 6 -8 10 24 13 -4 -2 0 13 8 11 0 -10 -53 -17 8 -29 -1 -3 -4 -2 -37 -26
1397 -26 -32 -3 2 -37 1 -20 -21 -1 2 22 -3 14 4 26 23 18 7 19 0 10 17 6 -12 19 11 9 9 -11 10 14 6 -12 -11 24 -7 -11 -15 -2
1435 -2 -3 -30 -3 1 -11 -1 9 7 13 -11 4 -3 6 28 12 25 2 43 24 2 21 10 4 21 -20 0 6 -5 -3 -16 12 -13 12 9 3 13
1471 13 -12 -17 6 -18 18 -10 -27 -19 -36 12 16 -9 15 14 -2 9 -8 8 3 13 1 4 1 9 2 14 3 24 20 39 21 16 12 -3 -10 9 -11
1508 -11 29 -15 -10 15 4 31 -28 0 -12 2 -38 -29 -3 13 -12 11 -8 0 -14 -19 29 14 -11 30 25 -15 9 -5 1 28 40 -6 34
1541 34 29 2 38 10 14 22 14 -19 -18 -26 7 2 -3 2 4 14 19 -44 14 -7 1 -19 -13 13 16 -1 1 -3 1 16 -19 13 6 -10 13 3 3 2 32 21
1581 21 9 4 29 -5 1 -1 4 10 -5 -15 -16 3 18 26 2 -10 -14 -35 -24 -4 1 2 2 22 8 11 -19 -19 9 11 -18 2 0 13 16 11 23 0 23
1620 23 0 27 31 -1 41 -8 11 10 19 26 -3 17 -1 2 19 23 -3 -11 33 -21 18 -14 16 22 -12 2 10 10 5 0 -5 -22 -29 -8 -4 -25 -15 38
1658 38 3 -39 17 21 5 13 32 -12 3 18 3 23 11 14 10 21 53 -18 -6 12 -8 25 -6 -38 18 9 -11 11 20 19 -14 -3 2 3 -26
1693 -26 17 -10 1 21 -2 -15 10 26 7 9 25 20 -30 17 0 -1 17 13 -8 10 28 -7 20 12 22 -3 16 -1 -4 5 25 13 -31 -30
1727 -30 -14 -14 7 -7 4 10 -5 -55 -31 8 -17 -12 -7 -31 9 -27 12 13 -3 7 17 16 10 -14 -4 5 14 16 3 -11 27 20 1 -5 9 -19
1763 -19 13 -21 -10 -22 -5 7 -39 -17 -2 13 -10 0 -15 -16 -8 0 -4 -25 -4 -38 -2 -15 -1 -13 -10 17 -7 19 33 9 26 26 -19
1796 -19 13 16 -7 20 -20 11 -6 9 -11 15 -6 -3 11 -10 16 -23 23 -7 31 -2 -2 6 10 -8 -14 1 13 -27 12 -8 -17 21 7 -3
1830 -3 13 14 -4 6 8 18 2 16 23 13 -25 -4 1 10 -12 -4 16 2 9 26 -28 3 6 -18 5 -8 -22 -12 -10 11 -21 -24 -17 -15 -3 -12 -49
1867 -49 12 1 12 3 19 2 13 23 25 25 8 26 39 5 58 0 -12 5 -12 -3 20 -2 25 14 -22 2 9 14 -19 -14 -8 1 -19 -6 2
1902 2 -5 -10 11 -22 -3 6 -4 -8 -3 25 11 -5 13 16 -3 29 -22 15 33 33 33 34 28 6 9 26 6 19 -2 8 -12 4 6 6 14 -8 -11 -8 -5
1941 -5 -13 -7 -26 -4 -42 -24 8 25 -6 16 6 6 20 10 19 11 -8 10 36 -13 5 42 -3 26 14 18 9 24 22 -24 -14 10 -7 -3 5 13
1977 13 26 -12 10 -20 -2 9 -24 -21 10 -18 4 -2 -10 -27 8 13 3 4 1 -20 -25 -22 -24 1 -2 18 -2 18 4 0 10 -8 10 0 -5 0 16
2014 16 5 1 -31 -17 0 9 -4 -12 -19 -16 -18 -3 -16 -46 -22 -33 -21 -31 2 2 -12 -34 -25 -8 0 12 -15 -9 25 19 19 3 27 39 -20 12
2050 12 -9 -4 -9 -14 7 -10 16 1 30 -14 9 -10 -3 -2 -21 -6 -4 -24 20 -20 -3 -12 -12 -2 7 8 -25 -1 -14 12 0 1 -14 3 18 3
2086 3 -21 -7 9 10 34 9 -22 19 37 -2 21 -21 7 -19 15 26 -12 3 -12 -10 -21 -26 -15 -23 -4 -10 1 -8 -32 9 0 -11 -24 9
2120 9 8 10 -5 9 -14 -26 0 28 -4 12 5 4 -10 13 -27 19 -12 7 -9 13 2 -36 27 13 17 -5 18 -8 0 -13 1 -28 -28 -5
2154 -5 12 -14 -16 -2 -18 -18 -14 34 6 -14 6 -5 12 26 6 23 14 13 47 1 7 4 23 8 21 0 15 11 18 7 -19 -13 -4 11 -18 -24 -18
2191 -18 -7 -5 -57 10 -20 10 -17 -16 -17 -9 0 -26 -1 26 -5 -26 -32 -18 27 -9 6 2 4 -23 21 -2 10 20 2 12 -19 -19 -18 2 -2 6
2227 6 1 -14 21 -9 -2 -2 -11 -18 29 -10 -6 -11 2 -18 -17 -48 -25 -11 6 -3 8 20 2 -6 0 -15 -14 4 -1 15 0 26 -5 12 5 -21 12 21
2265 21 17 7 -5 13 -46 14 -15 -17 -44 -16 -11 16 12 -27 -21 4 -20 -18 -13 -16 2 3 -3 11 -17 -5 9 3 -3 1 30 7 -21 -15 7 -18 25
2302 25 25 20 -2 2 -7 37 14 -4 21 2 -8 -8 4 -21 1 9 -16 8 1 -30 -4 9 -33 4 5 -19 31 -26 -2 28 11 6 19 9 28
2337 28 15 18 3 5 -6 20 17 -12 -1 -13 27 1 20 3 16 -31 4 -4 -30 -6 -21 -4 14 -41 -15 -15 -1 0 -25 -21 -25 -24 -20 7 -8
2372 -8 -26 -3 7 -1 35 -27 0 0 29 -2 27 27 20 11 -15 8 4 -16 -13 18 -21 7 0 -2 17 22 15 -18 12 -1 -2 -3 6 -14 -30 -31 13 -14
2410 -14 9 5 -8 -41 35 -7 -25 4 -29 -7 12 3 8 24 26 -7 -5 5 7 18 -9 10 13 -22 14 -25 25 -12 -8 -8 -28 17 -9 -6 1 -14
2446 -14 -19 17 10 -2 11 -10 -25 -34 9 -8 28 0 -7 -17 8 -22 21 13 -8 15 -5 9 8 -3 -2 17 -19 7 4 -7 2 10 -5 -12 12 -3
2482 -3 15 8 -10 -12 1 -12 5 -22 -26 -11 -16 -14 0 -27 -9 -14 13 27 3 -9 6 4 -6 2 1 11 -15 19 23 -3 11 20 32 13 -4 18
2518 18 4 -4 -16 7 -1 3 -13 -7 -16 4 -32 0 -34 -12 -6 23 -24 -9 -2 -19 -6 -10 -12 -1 -18 4 3 16 -9 -16 5 3 3 32 -19 12 -7
2555 -7 19 5 6 5 13 23 5 -23 4 11 -18 -10 -41 -8 -11 6 -12 -25 -26 -17 -29 -32 -41 -3 -6 -20 -26 -2 -10 10 7 3 -17 -6 -16 28 24 9 -12
2594 -12 -1 -29 4 13 -14 22 20 -1 -2 -5 -18 -1 6 14 -10 -1 -16 -10 2 -14 -1 -38 10 -16 -25 5 -20 -10 -1 6 22 -24 -1 -13 15 3
2630 3 -18 1 15 6 -4 11 7 3 35 12 5 23 -6 -10 1 0 10 -6 -19 2 1 4 -37 3 -17 -2 -12 -21 -43 17 -6 -26 -5 -19 -23 14
2666 14 -3 -8 -11 -3 -11 -17 34 -2 9 14 10 -2 12 -8 10 12 42 -26 -3 9 18 40 13 -21 1 20 -21 -22 -3 -19 -15 -17 1 -25 -18 4 -10
2703 -10 -4 -11 -22 40 -15 -2 19 -8 4 3 29 18 -7 18 2 6 25 -6 -18 12 -5 -18 3 -9 14 -8 5 -7 -7 -6 -23 -7 -31
2736 -31 -16 -8 1 12 -4 -9 -1 -16 -4 7 -3 -14 -11 19 -9 -10 -3 -15 -11 7 5 -7 -10 -12 26 -26 -3 28 6 19 -17 12 -34 38 27 -1
2772 -1 0 32 -16 5 6 -25 -33 -1 -18 -28 2 -39 -6 5 5 -22 -16 10 -12 16 -16 -17 6 26 -6 1 -8 15 -14 11 2 38 21 12 -19 13
2808 13 13 24 6 -3 -4 13 7 2 -4 -25 -14 -19 24 -13 -22 -18 -6 -29 1 -19 -3 -4 -9 -19 -6 5 -36 1 -19 -16 -6 -15 -6 11 2 -12 -5 6
2846 6 2 -5 2 3 1 14 16 -4 -18 22 13 -11 -9 18 -3 -14 -21 -15 -10 1 -15 22 3 -3 23 -11 18 -13 -29 -13 -1 11 -11 11 17 -7 -20
2883 -20 -9 3 21 27 -27 10 16 -10 13 32 36 30 -3 -5 -1 9 5 -29 9 41 -28 -20 -9 -16 -35 9 3 14 22 3 -2 -7 11 -19 15 4 10
2920 10 14 -4 -6 -24 -12 9 5 17 20 22 15 17 -3 19 28 -2 17 -2 -7 20 22 -21 -4 1 13 17 -17 -2 10 -22 -15 -21 11 -22 -11 -1 -1 -2
2958 -2 0 -26 12 -10 -24 23 -15 -5 -12 -20 -13 -10 -3 7 22 -24 4 25 5 1 3 14 10 31 -22 -14 -4 -13 -5 3 -6 -8 -3 5 -16 -11 1 5 -17 -35
2998 -35 3 -4 -25 -24 -6 -21 23 3 -9 9 11 -1 14 -7 -8 7 9 27 18 15 24 6 10 1 5 1 13 11 14 1 -2 -4 0 4 15 -21 -10 -14 -32 -3
3038 -3 -14 -4 -3 0 13 -7 8 -8 -15 -14 18 -18 5 16 -10 17 -5 9 -9 11 29 21 10 -42 3 -14 7 1 -17 10 -22 12 6 17
3072 17 -14 16 13 9 -37 -12 -15 -13 -4 -12 16 -18 -18 -1 -33 -1 0 22 -7 18 11 8 2 17 3 -27 8 3 11 23 17 21 -6 1 1 8 -14 -16 23 14
3112 14 15 -15 24 -22 -2 7 -26 -10 -19 17 -17 4 2 -31 -16 -23 3 -17 -17 8 6 0 -3 8 -56 22 19 -7 -8 -5 25 9 14 20 10 14 13 7 2
3151 2 -21 -16 -11 22 4 -14 -13 -8 -19 -4 -25 -24 10 -26 -5 -11 -6 -26 19 -29 -5 -7 3 -1 -3 12 19 -10 18 -5 -1 24 0 -7 -20 43 7
3188 7 -5 40 23 -35 1 -2 0 -3 15 -9 12 17 -29 -26 -14 -18 18 -6 -5 -26 -11 -26 -32 16 -15 1 32 -1 10 20 -1 0 7 9 16 -11 5
3225 5 24 44 -6 -7 13 31 9 4 -2 -6 9 -27 27 -14 -15 -21 3 9 -27 14 -7 -19 9 -3 -7 12 25 -8 -17 -9 5 -18 19 0 -4 7
3261 7 7 15 10 51 15 31 13 46 -18 6 5 28 13 22 37 -12 6 -1 22 0 -11 -12 9 -1 5 -19 -9 -7 -7 18 -9 -4 -20 -22 -17 -26 -4 -12
3299 -12 -10 26 -5 31 19 11 -5 9 12 26 6 16 4 19 -7 -1 -6 20 24 -8 23 -10 13 -2 -25 -7 30 17 -12 8 -18 -34 17
3332 17 -24 2 -6 -21 12 13 3 9 -7 -3 -30 -5 -1 17 15 1 17 -4 2 7 8 5 21 12 22 -6 12 7 11 -11 10 18 4 -12 -9 -5 8 6 -28
3371 -28 10 -11 -2 -36 -21 9 -4 2 -10 -1 -8 11 -9 -21 26 -11 7 5 7 26 -22 -21 13 17 3 -11 18 -1 4 -4 16 12 18 -1 15 7 1
3408 1 -32 -31 -2 -12 17 -8 -7 1 29 -9 -1 -2 -9 0 -22 6 13 5 13 14 -15 -13 14 12 -5 12 8 12 8 8 2 21 -17 7 12 -3 17 27 10 2 8
3449 8 19 19 -12 -34 -33 9 -13 -14 14 -25 -5 -3 -26 -26 0 2 -1 3 6 -17 -3 -43 4 -21 6 14 18 22 4 -13 -13 16 -9 -2 14 10 -4 18
3487 18 -21 6 -17 -3 -20 22 -26 6 5 -16 -19 -17 0 -10 -8 -10 10 25 6 -32 8 -9 2 3 -1 -1 -4 -24 -15 18 -7 6 -16 7 7 24
3523 24 31 23 0 -13 17 10 7 2 0 13 -8 1 25 13 -18 4 -14 -21 -4 -15 -3 -24 4 18 6 -2 -15 3 -7 19 1 6 -10 15 14 -17
3559 -17 1 -5 38 23 -22 -3 24 7 7 24 -14 -27 11 -6 -8 4 -3 2 12 -21 -7 8 -1 -5 17 15 18 -10 11 12 -21 -12 -8 -6 13 3 -25
3596 -25 -11 32 3 14 -18 4 12 -4 -6 15 27 -3 32 34 26 -4 11 22 4 -18 10 22 -5 -16 10 -3 -11 2 -24 6 -5 -44 1
3629 1 3 10 2 -2 -32 -20 -5 -4 3 16 18 11 10 23 2 7 6 7 4 31 21 12 16 25 38 17 25 -7 18 9 -8 -11 14 35 -4 7 3 -14 4 -14 5
3670 5 3 -40 -24 -37 -28 17 1 -7 5 21 -32 2 22 27 -5 -1 -5 21 45 15 7 31 18 45 11 6 -4 -8 20 1 -15 10 -28 18 -13
3705 -13 9 4 -38 1 -10 -2 -18 -6 -8 -16 5 -12 5 -2 1 33 3 7 -22 24 7 12 44 -15 23 33 14 32 20 11 8 28 24 12 45 3
3741 3 -17 11 7 18 -11 -3 6 -26 2 -17 -26 -17 0 -28 -25 -29 -37 -22 -7 0 2 -22 4 -1 8 4 18 20 27 -10 14 43 16 -8 -1 29 -16 17 13
3780 13 3 21 4 -4 1 -4 0 5 -17 -39 11 -1 -3 -44 9 0 10 -13 8 -26 -27 3 -20 -15 1 13 -4 -15 -5 4 21 30 3 27 18 -7
3816 -7 6 -17 33 7 -1 0 -8 17 17 32 19 11 -13 20 -23 -2 6 -13 16 8 -7 -34 -14 -9 -7 -19 -17 -7 -8 -7 -14 22 19 5 42 7 -7 12
3854 12 25 13 28 -4 7 10 34 21 8 3 -3 -28 -7 6 9 -21 3 7 -15 -14 -4 -5 -21 -11 -31 -39 -16 -33 -36 -13 -16 5 -20 -14 -28 -28
3890 -28 -10 14 12 14 -17 0 22 21 15 27 -8 22 0 -5 -11 -6 -24 -11 11 27 15 -4 4 -13 -2 -20 21 -9 -43 -10 -32 17 -22 -19 -11
3925 -11 -3 -17 33 10 -15 9 -1 13 28 -9 -8 -11 23 14 7 24 10 3 49 35 14 8 8 13 35 54 -3 28 0 9 9 -15 12 10 -18 4
3961 4 14 5 -14 -4 -21 -12 -20 4 3 -4 -18 -3 7 -10 -19 -20 -13 20 -26 -2 7 17 29 31 8 18 -1 27 11 31 22 -3 5 36 22 -1 -27
3998 -27 20 4 6 -10 17 -7 -5 7 -5 -37 -2 -7 12 -1 -8 -6 19 4 0 2 -12 -8 -8 43 23 33 -21 25 23 39 36 29 -10 27 10 6 11
4035 11 32 -7 4 18 15 19 15 7 -11 -14 -14 11 0 -1 -38 3 -19 -20 4 -31 -4 -30 -5 1 20 -2 25 8 17 21 23 5 5 8 18 37 7
4072 7 15 29 28 -7 4 6 3 19 -1 -1 13 7 -17 -24 9 -13 24 25 -19 -20 -20 -11 -20 -11 16 0 -8 -6 -10 19 -23 9 20 12 17 22 7 14 25 9 17
4113 17 18 14 21 15 17 2 0 23 18 -13 -8 0 8 7 -18 -12 -12 -20 -13 14 -36 -5 -21 -9 -17 25 5 6 -2 -10 -13 -17 -3 -8 -13 -11 4 20 10 -16 -25 7 20
4156 20 18 9 27 -1 3 13 21 34 2 -4 13 16 28 1 -2 -6 -6 -2 -1 -5 -5 -6 9 1 -1 2 -16 -1 1 23 8 7 12 22 1 37 -30 9 19 -3
4196 -3 28 17 9 19 13 24 11 -22 -7 -16 2 -7 -7 3 -3 -9 6 -15 1 -5 -14 19 11 -6 -8 4 21 11 -15 8 10 -11 -6 -11 -7 19 7 48
4234 48 20 25 -7 -1 3 9 27 12 13 0 11 18 33 2 26 10 15 7 5 -27 -6 -16 19 9 3 16 -32 -25 -16 -16 -34 -7 -5 23 13 9 12 26
4272 26 -6 18 32 -13 3 -15 25 10 -2 30 4 14 13 10 18 6 14 -12 7 6 25 6 -34 -11 -20 -6 -2 -7 -10 -37 -30 -21 -10 -14 -24 2
4308 2 10 -27 -6 -8 7 12 8 -1 -2 23 25 36 -9 18 5 4 -11 28 -16 -14 -9 -8 -14 24 -1 -20 17 -7 -27 -7 6 -39 -23 -4 -2 1 0 20
4346 20 -18 9 -14 8 -5 7 -19 -30 5 10 27 -2 -14 3 23 6 14 10 39 37 -6 23 9 9 -12 14 25 -1 0 2 2 17 18 16 -18
4381 -18 -11 -4 -8 -1 -3 4 -10 12 -37 -1 6 0 -3 14 -8 -19 -5 9 -20 3 5 -1 28 1 35 0 -18 3 17 -8 12 8 -11 22 1 2 25
4418 25 2 14 2 -15 11 -5 3 -18 -17 -14 20 -22 -18 -15 -21 7 -6 1 -11 -11 4 0 -34 6 -15 16 11 -19 -8 -3 5 38 10 5 8 16 -22 25
4456 25 7 -12 26 -1 -36 -1 -9 16 0 -27 1 -27 0 -12 -29 19 -11 12 9 -15 -18 -13 -1 5 4 13 -26 -9 23 0 1 -8 22 35 21
4491 21 3 19 -6 20 25 -10 9 28 2 14 -9 1 -8 -3 16 6 8 -11 -25 -9 -16 -28 -40 -23 -15 -13 -3 19 26 -12 -1 -1 20 2 -25
4526 -25 -5 23 -3 3 19 -2 29 17 -14 31 10 23 8 7 -16 10 9 -8 -1 3 11 0 16 -19 13 4 3 -24 9 -24 5 -2 -1 -6 16 0
4562 0 1 16 -6 15 -17 3 7 4 19 3 -8 0 -4 4 15 23 15 32 11 8 11 3 -10 -2 -4 -13 -23 0 41 -2 -43 -15 14 -9 -16 14 -7 -9 -29
4601 -29 -18 -13 -6 25 -3 -14 18 8 -3 17 10 7 15 -10 -2 23 2 -8 18 28 13 14 14 20 18 -13 -4 -20 -27 -24 19 -14 -17 -13 24 -9 5 -15
4639 -15 -4 -7 -24 -15 -14 -12 -10 -7 5 -4 23 -5 -11 16 -11 3 34 -17 8 28 22 5 18 24 17 30 -17 24 23 26 31 -9 0 -5 8 0 -8 -42 -2
4678 -2 -10 3 -32 4 13 -10 -22 -12 -4 2 -2 5 8 -7 35 0 19 -2 23 -12 19 15 1 11 29 -5 -19 16 3 -1 11 21 11 3 -14 20
4714 20 21 -33 -22 11 2 7 1 -23 -13 -29 -24 35 9 -7 -13 2 -4 -1 22 16 16 15 15 13 16 26 14 9 30 30 -15 28 34 5 10 -12 15 -20 29
4753 29 -16 28 18 8 -7 15 15 -14 11 -15 0 6 -18 -13 -4 -6 -15 -32 11 -20 -1 -9 7 28 14 29 -3 -5 -6 -4 8 8 -4 9 15 24 -9
4790 -9 6 -11 -2 7 10 -1 3 -31 18 15 -26 5 6 -11 -18 -16 12 -21 13 17 -32 -6 -25 5 -6 -7 -18 -1 -12 -28 7 -6 8 -4 -23 22
4826 22 15 38 -1 8 17 -5 -16 11 12 2 25 -6 11 11 -25 -18 30 -2 -4 6 3 -23 -21 -19 -17 3 -18 7 5 -44 -29 18 -30 3 -11 -3 12
4863 12 -4 -14 5 17 -10 1 20 -2 3 26 -8 -4 2 8 -6 -11 5 -13 19 16 11 1 -11 -31 7 -8 -18 -5 -9 -17 16 -17 -32 31 -1
4898 -1 -1 -23 7 2 2 12 9 -11 -3 16 -5 3 -3 17 21 -4 5 -4 25 6 35 -2 10 -15 -26 17 14 -13 -20 15 8 22 -4 -14 -21 2 -6 -1 -2
4937 -2 -9 -1 -3 -22 -21 1 -12 -12 -1 6 7 9 2 9 25 8 26 -1 -5 11 -1 -11 0 14 4 12 -9 7 -1 4 7 2 -2 -16 -7 12 -17 -7 -9 -12 7
4978 7 15 6 -14 -32 -31 -3 7 7 -1 25 9 13 -16 -14 -18 41 9 13 62 22 23 10 6 -3 5 39 26 -17 3 15 5 13 -12 11 5 7 -3 -37 1
5017 1 -9 -29 -26 6 -11 -7 3 -16 19 5 8 -11 -7 0 1 -11 6 -17 -4 -1 19 9 18 22 21 -6 0 15 -12 9 16 -4 -12 26 0 -12 -20 -1
5055 -1 6 -6 -19 -36 6 6 -12 8 5 -3 -5 41 16 -13 -28 48 -18 38 -14 4 -3 -7 21 10 6 10 -27 33 22 -1 11 11 -10 -16 -13 46 12
5092 12 -8 -15 8 12 17 -1 0 -18 -13 -8 9 -35 -24 7 -15 -8 -8 -5 -19 8 14 31 25 32 23 -14 15 -1 15 31 -17 8 -4 38 -9 -2 10
5129 10 11 0 4 15 20 9 7 -11 -38 7 2 -19 -8 -3 -4 -23 -11 -12 22 -16 -18 -21 17 10 -32 13 4 1 -8 -4 16 -17 -6 21 32 8 4 -5 31
5168 31 -7 -11 24 36 36 -10 -18 -6 -24 -23 -20 -24 2 6 11 -18 21 -5 16 -15 0 -18 9 -5 -18 21 -5 9 11 23 -15 -2 18 -22 10
5203 10 11 11 30 27 21 8 -12 14 23 3 16 20 12 -12 40 -13 -10 0 -2 -18 -9 21 11 -8 8 -20 21 -11 -14 18 -18 -23 6 -8 -30 12
5239 12 1 -42 12 30 11 31 -7 27 16 -2 18 24 18 24 17 12 13 8 -6 35 16 -17 17 -25 -9 -4 1 -8 5 -16 -11 20 -22 3 16 -14
5275 -14 -9 -8 5 -32 -20 17 5 -11 -7 27 30 -7 19 14 34 0 19 7 10 27 24 -7 27 32 19 13 -17 0 -16 -36 9 9 8 -1 -1 -7 17
5312 17 0 -20 12 2 -8 -5 -7 20 -11 21 -6 3 38 -14 0 8 13 0 17 -6 -1 36 -26 5 -8 -3 -13 15 14 -18 -23 -14 -21 -3 24 -12
5348 -12 -19 3 8 10 10 -2 -34 4 1 -38 16 6 -27 26 0 15 6 26 8 -24 9 34 -3 27 2 17 7 12 7 -5 20 13 7 3 13 3
5384 3 4 -6 12 2 -2 -3 37 -15 -16 -28 -4 -12 -6 -19 -20 -27 1 -17 -4 2 -6 -18 10 -6 8 -6 23 12 -26 15 17 8 30 12 10 8 12 20 4
5423 4 1 7 3 1 17 -9 11 17 -19 -9 -26 5 -15 19 14 -14 28 23 -25 15 2 -27 -25 -14 -10 -20 5 21 0 -9 -5 1 20 33 8 32 33
5460 33 -13 18 6 17 15 11 5 8 4 2 -7 -20 -20 5 -18 -16 -16 6 3 3 20 0 9 -13 -11 -23 9 -22 1 20 -9 -11 18 8 -6 19 -16 32
5498 32 16 8 11 34 53 29 -16 8 -6 21 13 37 10 -1 -12 20 11 17 -9 16 23 -8 -11 -19 4 -20 20 14 14 8 -7 -14 27 3 -16 18
5534 18 -7 23 3 5 -9 -18 -15 9 5 14 -5 33 31 31 3 31 0 3 -16 5 11 5 14 2 2 -30 17 -18 -20 -17 15 4 1 7 -29 10 -13 -21 5
5573 5 -1 0 -35 2 5 -10 12 17 8 2 -6 -11 37 15 -3 35 -21 12 7 -5 -16 4 7 25 -2 -1 -27 7 12 25 -16 2 -6 5 5 -17 -19 -21 -5
5612 -5 -8 9 -23 -2 -11 11 -9 7 -7 6 -26 9 7 -8 2 -14 9 0 23 9 39 1 20 34 6 -16 2 9 -21 -5 25 -10 8
5645 8 -13 -17 -3 21 6 -22 8 -25 -9 0 7 -5 -6 -30 -3 6 4 8 -4 12 22 0 33 16 -2 5 43 15 22 2 -6 45 12 27 10 1
5681 1 -8 -16 1 17 6 -4 -20 8 -26 -25 -4 -31 -12 0 -5 11 27 15 15 -5 32 24 0 -3 10 16 -7 -7 -8 34 34 25 40 14 4 15 23
5718 23 20 -19 12 11 37 3 -2 -2 -4 14 3 10 2 -14 -4 -4 12 2 17 -3 -20 -5 -20 10 -3 21 3 14 18 14 23 13 19 27 -13 -10 12
5755 12 7 13 21 -2 4 7 21 27 -18 22 31 0 -3 1 12 23 24 -5 0 6 -12 21 -1 -7 -24 -22 12 22 8 9 -1 10 24 7 -6 -11 16 22 16
5794 16 8 41 18 21 10 32 16 -4 8 12 4 18 37 32 -17 0 -5 14 11 39 -8 -5 12 5 -10 3 12 15 -11 27 31 0 7 12 4 11 21 11
5832 11 9 39 19 2 18 15 -9 17 1 10 -7 39 16 12 39 16 25 0 -2 19 9 -10 -10 5 1 2 -33 -18 -4 3 -10 -28 5 -8 -5 6
5868 6 -8 7 30 -14 34 -9 2 7 2 -2 19 2 29 15 0 4 12 15 10 -13 0 22 28 1 6 -1 0 15 -32 17 -14 -2 -7 -1 -17 -9 10 -25
5906 -25 -4 -10 -6 7 -14 -1 -2 1 2 1 -3 10 -14 -2 4 17 1 20 4 -1 -13 3 1 12 0 -13 35 -11 22 2 -1 -46 -15 -25 -36 -1
5942 -1 -2 -2 -15 -11 11 -7 -4 -17 -19 8 -3 5 -17 -14 18 25 9 -24 -13 -17 46 4 13 29 29 -8 -14 -1 -42 13 17 13 3 -14 14 -4 -28 17
5980 17 -10 -33 -32 -27 -5 -29 -37 -6 -2 -3 -19 -9 -12 -17 19 28 0 -14 7 7 25 32 28 -11 24 -15 22 13 31 27 -5 -3 0 22 -3 -4 -3 20 7
6019 7 -1 -16 10 -3 -7 -6 -4 -14 -24 -23 -19 -18 -5 -7 -1 13 12 17 -12 19 5 5 16 -11 24 33 12 3 5 17 9 28 -1 12 -2 -9 11 12 -3 13
6059 13 -10 -9 -8 18 15 -17 -11 10 19 -14 -4 -6 -24 -14 4 -20 -21 -50 -10 -11 -10 2 -5 -7 -9 12 14 13 2 22 10 -32 25 8 8 -9 13 6
6097 6 -14 9 -9 16 -3 -20 -3 4 -24 21 -8 -6 8 11 -8 4 4 -10 -28 -19 -11 -23 -9 15 1 -9 -4 -22 8 20 23 7 19 0 36
6132 36 1 15 22 24 17 -3 5 39 23 8 2 14 12 -11 -21 13 -17 -7 -16 -8 -17 -8 2 -29 -5 -24 -6 -7 -8 -27 0 -21 -22 37 19 -17 6
6169 6 -20 -12 -20 6 5 -23 11 8 29 36 11 13 -5 37 1 12 8 -6 3 7 -15 -11 4 -14 -36 -35 15 -4 13 -33 4 -10 -5 8 16 5 -1 -16
6207 -16 -2 -4 -13 -11 -19 19 -14 28 -7 21 1 -12 8 -13 3 1 25 8 -13 16 15 0 -13 -9 17 -1 15 -4 -9 -25 -13 -9 -1 -20 -7
6242 -7 -20 -21 -17 -4 -7 0 4 -8 0 6 7 21 0 17 3 53 20 -14 12 -2 -12 -11 17 33 -1 16 0 27 9 -11 18 4 -8 -3 -25 -8
6278 -8 -11 3 -20 -12 -1 -36 -31 -1 6 -18 5 24 16 4 16 13 11 5 0 14 38 -12 6 -6 -3 -33 14 -25 -21 23 32 10 26 6 8 -37 -18
6315 -18 23 -17 15 -8 2 -8 4 -8 -2 -23 -21 12 0 -27 -14 -5 -6 -24 -6 -21 -14 -11 -16 6 18 19 -7 21 -5 11 29 0 5 5 -17
6350 -17 0 -25 -6 -6 -2 -22 -2 -9 -8 9 -5 -22 -21 -13 -22 4 -5 19 5 -13 12 3 -8 0 20 3 14 -7 18 -33 16 25 19 14 -3 20 -1
6387 -1 4 -3 4 2 -14 4 -21 15 21 -13 32 6 8 -2 -3 15 17 7 32 18 -8 12 -10 -36 7 1 8 -38 11 -3 -7 -11 -4 -17 -27 0 -3 0
6425 0 11 27 11 8 0 24 -19 25 -19 22 -7 7 0 -15 -1 5 14 10 -18 5 -5 -20 -4 -19 -6 12 -19 -27 -29 8 6 -2 0 -7 6 1 -5 -4
6463 -4 16 1 -9 8 5 19 29 3 14 11 12 -19 4 17 3 -4 8 16 2 3 2 6 -16 -5 -2 10 -10 19 -16 -1 2 -25 -22 7 -16 -16 3
6500 3 12 -13 20 31 32 25 -9 10 5 30 24 15 1 11 9 28 27 37 25 4 -8 25 0 -4 12 3 0 -4 -24 -8 6 -5 -10 -2 5 -7 16 2
6538 2 -4 -11 2 17 2 -19 -17 24 0 5 15 16 14 10 4 9 11 -26 10 -11 -3 30 5 -5 1 3 2 3 3 -11 15 7 -8 -10 -5 -10 8 12 -14 -27 6
6579 6 3 -20 -22 -11 25 -11 16 9 -7 18 -10 -5 5 -10 -1 16 13 31 1 18 13 -4 7 19 -3 -17 31 3 -3 -16 -20 -10 1 -6 -11 12
6615 12 26 -11 -16 -8 -27 14 13 -3 -17 -3 -11 6 1 -26 -20 -3 8 -3 11 10 1 -8 6 18 3 10 24 25 16 28 26 23 17 -18 -7 3 -11 -20
6653 -20 -12 -26 3 -15 12 -3 -7 1 -9 -1 -20 6 -13 -22 11 -9 10 1 15 -19 8 19 -12 -4 -6 4 -28 4 -8 11 6 -9 8 23 17
6688 17 4 -19 10 -25 0 0 7 9 -8 -3 -15 8 -1 -31 -25 -13 -13 4 8 -8 -1 -21 3 1 13 -8 -11 -1 0 13 14 -19 -31 -10 18 26 13
6725 13 8 5 -9 34 13 0 -8 4 -26 25 -4 -6 -6 20 -30 6 -3 -18 11 6 7 -49 -22 13 4 9 2 -17 -27 18 -6 -12 18 20 5 3 10 7
6763 7 13 2 42 8 -5 12 -14 1 23 24 -25 13 -7 19 -26 -16 -16 -9 -2 -1 -10 -11 14 14 20 3 -18 3 -5 -21 -13 -19 -20 -19 -6 -8 3 14 24
6802 24 -1 34 0 5 7 8 22 33 26 2 8 7 31 -8 -8 0 -16 -22 -27 1 2 9 -10 21 -16 -3 -19 9 -18 -26 22 -25 8 2 4 -11 7 1
6840 1 -5 8 -1 -1 4 -4 -10 15 -44 -2 -11 4 25 -5 2 -3 -3 -11 16 5 5 10 2 -16 -18 16 1 -2 -1 -2 -17 20 -33 -10 15 15 -8 -18 -5 -13 -24
6881 -24 -11 -17 13 -35 -19 -29 -17 0 6 15 -12 -9 -8 5 14 -2 20 13 14 14 -15 -17 -1 -19 22 10 -1 -5 -9 -5 9 8 -28 -7 -4 -12 -20 -10 -3
6920 -3 -13 -24 15 22 -35 9 -13 -14 -15 10 21 15 9 -17 -11 3 24 16 16 24 1 2 14 14 0 -19 -22 -11 8 4 -9 -30 2 -12 -9 -32 4 -26
6958 -26 -18 -25 -40 -8 -6 13 14 -1 1 -18 20 7 4 -3 -24 2 -2 -9 -7 -25 17 11 26 17 -7 -34 21 -20 -32 20 -4 3 -18 2 5 -14 13
6995 13 -19 -2 -16 -1 -14 -10 -30 0 -27 -3 4 7 -27 -18 9 -31 11 2 -4 15 5 20 -8 18 23 -2 22 14 -8 7 5 -7 -3 6 -7 -13
7031 -13 9 -5 1 11 15 -18 -26 -28 -12 -36 1 -14 0 -20 1 5 5 -6 13 29 9 16 8 -6 29 47 12 0 26 9 -9 49 14 2
7065 2 7 -1 -13 -34 -20 13 12 11 -13 7 5 6 4 -5 -6 5 -5 7 -25 -14 -35 3 -16 -10 17 11 -4 -6 -5 -7 19 15 35 7 28 24 3 5 28
7104 28 27 9 37 13 6 7 3 -2 -3 3 -17 27 4 2 16 -14 -7 4 -21 4 5 5 -4 -3 -3 -2 -26 2 -2 -11 -1 -8 -10 4 20 2 30 18 3 5
7144 5 9 18 14 -4 20 19 -11 -20 15 24 10 -4 14 -21 8 -1 -19 0 -4 6 0 -18 0 9 6 -5 13 -19 -5 -11 25 0 -13 10 -28 0 12
7181 12 -3 17 11 5 29 15 24 35 7 1 -4 0 22 4 0 -6 17 12 3 -4 20 11 10 -6 17 -24 -18 -27 3 -5 4 -23 3 17 31 7 1 22 3
7220 3 -11 1 -1 14 9 8 8 8 36 -26 1 42 15 29 -14 -7 16 33 -18 -3 24 23 4 -4 16 -2 -3 -8 0 6 -24 11 -2 -28 -10 -24 15
7257 15 -16 -9 12 18 4 17 6 37 -3 10 19 9 24 4 2 -3 27 20 19 34 -8 1 15 9 23 13 12 -2 -27 -21 16 -3 1 -32 -22 2
7293 2 -30 -29 -8 20 -15 -16 13 23 -1 -33 -4 -18 -5 12 0 21 -2 22 15 29 -13 2 6 15 9 12 8 16 -7 -13 27 -5 1 -10 -38 -8
7329 -8 18 -16 -13 2 -28 15 -12 -20 3 11 15 -16 -12 -23 -13 5 -4 -36 -5 -24 -12 -12 9 -14 16 -4 24 6 15 -11 10 16 -18 -5 7
7364 7 1 -13 2 6 -1 5 1 2 -14 -7 -29 -26 -13 13 -34 -2 -3 -1 -3 -4 -7 2 -3 11 -5 -11 -5 7 10 -5 16 8 -7 8 13 5 6 16 28 -16 4 -1
7406 -1 -22 12 -4 25 14 14 21 -9 17 -4 3 -41 -4 25 1 14 -15 -16 -10 1 2 8 15 -2 -5 19 -7 30 -5 -11 5 8 11 37 27 16 -10
7443 -10 3 8 8 4 -7 14 12 11 -37 -14 20 10 -12 11 -15 2 -21 -15 -19 -18 3 -4 -1 4 -19 5 2 -3 17 -33 6 -1 -12 -1 -32 16 2
7480 2 9 18 12 17 7 0 27 -10 4 -8 18 -31 -13 15 -25 29 1 -6 -9 -14 -2 -15 -5 -3 -20 -22 -10 -6 19 -3 4 -14 -1 -28 -7 -2 9
7517 9 -22 -10 24 11 13 11 10 20 31 29 27 -16 30 11 2 -1 -1 15 20 -4 9 -5 12 9 9 -11 2 3 -13 -6 -17 -28 -10 -15 11 10 9 -2 19
7556 19 -28 13 -10 -1 29 17 7 33 27 -10 12 15 23 2 -17 22 -10 -16 17 15 17 19 16 26 35 -14 12 -18 -10 22 0 -8 -7 -5 -18 6 -6
7593 -6 6 -10 -12 9 10 31 31 10 -22 14 3 -6 10 0 -10 -3 30 17 35 -5 -4 47 -16 -28 15 8 -3 12 -7 -13 2 -8 21 -42 10
7628 10 -16 20 -2 2 7 -6 14 -18 -12 15 6 24 16 3 -15 -26 1 6 25 17 11 24 14 11 31 34 7 25 -6 22 7 -2 -27 -24 17 -2
7664 -2 6 2 6 34 -14 -10 16 -8 0 -20 -17 -1 -20 -15 -2 -20 -22 9 8 3 -20 -7 -20 24 8 -3 25 12 1 -14 41 13 -2 -1 3 -4 39
7701 39 27 -27 1 -16 11 -9 15 -21 -20 -4 -1 5 9 -5 -5 -20 -11 4 2 -17 -2 -16 -1 -6 -10 3 -11 0 18 24 -12 18 10 -1 4 -4 30
7738 30 -5 -4 15 6 20 -4 -6 -2 -16 10 -24 -26 9 17 17 1 -8 -15 6 -9 2 -1 12 8 16 -3 -6 -12 16 18 28 27 19 38 -5 19 -8 11 3
7777 3 13 16 -2 15 22 2 12 17 14 13 0 -8 25 48 6 10 20 -19 -8 5 -28 4 36 -2 7 -1 -15 -4 6 9 -11 7 9 22 6 -14
7813 -14 -8 -10 2 42 19 9 19 47 -12 24 15 -8 5 -18 27 18 -21 4 11 -7 -1 11 -11 6 -11 -9 46 -9 -12 -8 -6 5 -19 -1 -5 15
7849 15 -7 15 35 -15 -18 15 -1 22 21 23 -14 13 35 13 10 11 16 14 -18 -14 11 12 5 -21 -11 3 1 -20 35 12 -4 28 24 7 -4 1 -12
7886 -12 -21 -17 4 -38 11 24 -7 -23 12 11 -8 22 -1 27 29 20 12 9 21 -4 0 26 -18 26 -3 4 34 7 -2 8 24 15 -9 -16 -4 -12 -20
7923 -20 3 -12 9 -17 -17 1 2 15 -18 14 -7 -29 10 -15 -8 -10 -25 -9 10 40 -8 -19 34 -15 23 28 19 -6 21 -13 18 22 -31 9
7957 9 10 1 2 -11 15 10 19 -22 -28 -7 -18 12 -6 17 -4 -15 6 5 17 -1 -23 -17 9 8 -11 8 11 14 -15 16 12 8 23 27 3 -24 -1 24
7995 24 14 15 -7 -11 13 7 -19 -8 -6 8 -1 -5 5 8 7 11 16 -12 18 -14 -10 -6 -10 -5 -1 7 -2 -11 13 6 4 -8 3 10 18 36 12 26 2 28 8
8036 8 21 2 18 -17 1 14 18 11 -13 -14 -25 -9 -5 -16 -33 -21 16 -39 -28 -10 5 -4 -25 14 -2 5 23 2 5 14 -1 13 18 5 -3 15
8072 15 46 -8 10 28 8 8 1 21 6 7 8 -8 0 -22 -9 17 -7 3 7 -23 -12 -23 -23 4 0 -5 -37 -25 6 24 -22 39 4 29 21
8107 21 1 21 14 2 -26 26 -4 25 7 11 9 22 15 14 12 -1 1 -8 -17 13 36 -21 -14 -26 19 17 7 -44 4 -25 3 -8 1 18 -7 21
8143 21 -6 40 2 -8 -6 2 3 31 -2 26 -23 -8 23 43 23 0 11 -7 -4 1 22 3 14 8 9 18 30 -4 -4 -6 -6 1 6 -23 5 -4 11
8180 11 -15 -42 -32 -6 -38 -11 15 -17 11 1 -3
8191c
##END NTUPLES=NMR FID
##END=
