##TITLE=1H_DE-102_2
 200.13MHz, DMSO-d6,
 8 sc
 
 13.8.2025
##JCAMPDX= 6.0         $$ Bruker NMR JCAMP-DX V2.0
##DATA TYPE= NMR FID
##DATA CLASS= NTUPLES
##ORIGIN= UXNMR, Bruker Analytische Messtechnik GmbH
##OWNER= pz
$$ XWIN-NMR		Version 3.5
$$ Wed Aug 13 14:26:22 2025 Russian Standard Time (UT+4h)  she@DPX200
##.OBSERVE FREQUENCY= 200.1313
##.OBSERVE NUCLEUS= ^1H
##.DELAY= (6, 6)
##.ACQUISITION MODE= SIMULTANEOUS
##.ACQUISITION SCHEME= undefined
##.AVERAGES= 8
##.DIGITISER RES= 18
##SPECTROMETER/DATA SYSTEM= spect
##.PULSE SEQUENCE= zg30
##.SOLVENT NAME= CDCl3
##.SHIFT REFERENCE= (INTERNAL, CDCl3, 0, 14.3821)
##AUDIT TRAIL= $$ (NUMBER, WHEN, WHO, WHERE, WHAT)
$$ ##TITLE= Audit trail, XWIN-NMR		Version 3.5
$$ ##JCAMPDX= 5.01
$$ ##ORIGIN= Bruker BioSpin GmbH
$$ ##OWNER= she
$$ F:/spectra/data/she/nmr/H-C/1/audita.txt
$$ ##AUDIT TRAIL=  $$ (NUMBER, WHEN, WHO, WHERE, WHAT)
(   1,<2025-08-13 14:25:13.15 +0400>,<she>,<DPX200>,
      <created by zg, POWCHK disabled, PULCHK disabled
       configuration hash MD5:
       00 E9 B6 7A A2 85 ED C7 34 08 36 98 17 FE 4E 26
       data hash MD5: 16K
       6F BC D5 00 72 45 2E 14 76 61 A7 65 B3 47 D0 07>)
$$ ##END=
$$ 
$$ hash MD5
$$ AD A1 38 F5 44 61 2E 0D EF 6A 85 6E D3 F3 99 4E
##$RELAX= 
##$RELAX= 
##$RELAX= 
##$RELAX= 
##$RELAX= 
##$RELAX= 
$$ Bruker specific parameters
$$ --------------------------
##$DU= <F:/spectra>
##$EXPNO= 1
##$NAME= <H-C>
##$PROCNO= 1
##$TYPE= <nmr>
##$USER= <she>
##$AMP= (0..31)
100 100 100 100 100 100 100 100 100 100 100 100 100 100 100 100 100 100 
100 100 100 100 100 100 100 100 100 100 100 100 100 100 
##$AQSEQ= 0
##$AQ_mod= 1
##$AUNM= <au_zg>
##$AUTOPOS= <>
##$BF1= 200.13
##$BF2= 200.13
##$BF3= 200.13
##$BF4= 200.13
##$BF5= 200.13
##$BF6= 200.13
##$BF7= 200.13
##$BF8= 200.13
##$BYTORDA= 1
##$CFDGTYP= 0
##$CFRGTYP= 5
##$CHEMSTR= <none>
##$CNST= (0..31)
1 1 145 1 1 1 1 1 1 1 1 1 1 1 1 1 1 1 1 1 1 1 1 1 1 1 1 1 1 1 1 1 
##$CPDPRG= <>
##$CPDPRG1= <>
##$CPDPRG2= <>
##$CPDPRG3= <>
##$CPDPRG4= <mlev>
##$CPDPRG5= <mlev>
##$CPDPRG6= <mlev>
##$CPDPRG7= <mlev>
##$CPDPRG8= <mlev>
##$CPDPRGB= <>
##$CPDPRGT= <>
##$D= (0..31)
0 0.7 0 0 0 0 0 0 0 0 0 0.03 0 0 0 0 0 0 0 0 0 0 0 0 0 0 0 0 0 0 0 0 
##$DATE= 1755080712
##$DBL= (0..7)
120 120 120 120 120 120 120 120 
##$DBP= (0..7)
150 150 150 150 150 150 150 150 
##$DBP07= 0
##$DBPNAM0= <>
##$DBPNAM1= <>
##$DBPNAM2= <>
##$DBPNAM3= <>
##$DBPNAM4= <>
##$DBPNAM5= <>
##$DBPNAM6= <>
##$DBPNAM7= <>
##$DBPOAL= (0..7)
0.5 0.5 0.5 0.5 0.5 0.5 0.5 0.5 
##$DBPOFFS= (0..7)
0 0 0 0 0 0 0 0 
##$DE= 6
##$DECBNUC= <off>
##$DECIM= 32
##$DECNUC= <off>
##$DECSTAT= 4
##$DIGMOD= 1
##$DIGTYP= 9
##$DL= (0..7)
0 120 120 120 120 120 120 120 
##$DP= (0..7)
150 150 150 150 150 150 150 150 
##$DP07= 0
##$DPNAME0= <>
##$DPNAME1= <>
##$DPNAME2= <>
##$DPNAME3= <>
##$DPNAME4= <>
##$DPNAME5= <>
##$DPNAME6= <>
##$DPNAME7= <>
##$DPOAL= (0..7)
0.5 0.5 0.5 0.5 0.5 0.5 0.5 0.5 
##$DPOFFS= (0..7)
0 0 0 0 0 0 0 0 
##$DQDMODE= 0
##$DR= 18
##$DS= 0
##$DSLIST= <SSSSSSSSSSSSSSS>
$$ [...]
##$SUBNAM0= <"">
##$SUBNAM1= <"">
##$SUBNAM2= <"">
##$SUBNAM3= <"">
##$SUBNAM4= <"">
##$SUBNAM5= <"">
##$SUBNAM6= <"">
##$SUBNAM7= <"">
##$SUBNAM8= <"">
##$SUBNAM9= <"">
##$SW= 18.0517328524113
##$SWIBOX= (0..15)
0 0 2 0 0 0 0 0 0 0 0 0 0 0 0 0 
##$SW_h= 3612.71676300578
##$TD= 16384
##$TD0= 1
##$TE= 0
##$TE2= 300
##$TE3= 300
##$TEG= 300
##$TL= (0..7)
0 120 120 120 120 120 120 120 
##$TP= (0..7)
150 150 150 150 150 150 150 150 
##$TP07= 0
##$TPNAME0= <>
##$TPNAME1= <>
##$TPNAME2= <>
##$TPNAME3= <>
##$TPNAME4= <>
##$TPNAME5= <>
##$TPNAME6= <>
##$TPNAME7= <>
##$TPOAL= (0..7)
0.5 0.5 0.5 0.5 0.5 0.5 0.5 0.5 
##$TPOFFS= (0..7)
0 0 0 0 0 0 0 0 
##$TUNHIN= 0
##$TUNHOUT= 0
##$TUNXOUT= 0
##$USERA1= <user>
##$USERA2= <user>
##$USERA3= <user>
##$USERA4= <user>
##$USERA5= <user>
##$V9= 5
##$VALIST= <valist>
##$VCLIST= <CCCCCCCCCCCCCCC>
##$VD= 0
##$VDLIST= <DDDDDDDDDDDDDDD>
##$VPLIST= <PPPPPPPPPPPPPPP>
##$VTLIST= <TTTTTTTTTTTTTTT>
##$WBST= 1024
##$WBSW= 4
##$XGAIN= (0..3)
0 0 0 0 
##$XL= 0
##$YL= 0
##$YMAX_a= 290576
##$YMIN_a= -174341
##$ZGOPTNS= <>
##$ZL1= 120
##$ZL2= 120
##$ZL3= 120
##$ZL4= 120
##$ABSF1= 10
##$ABSF2= 0
##$ABSG= 5
##$ABSL= 3
##$ALPHA= 0
##$AQORDER= 0
##$ASSFAC= 0
##$ASSFACI= 0
##$ASSFACX= 0
##$ASSWID= 0
##$AUNMP= <proc_1d>
##$AZFE= 0.1
##$AZFW= 0.1
##$BCFW= 1
##$BC_mod= 2
##$BYTORDP= 1
##$COROFFS= 0
##$CY= -3
##$DATMOD= 1
##$DC= 2
##$DFILT= <>
##$DTYPP= 0
##$F1P= 0
##$F2P= 0
##$FCOR= 0.5
##$FTSIZE= 0
##$FT_mod= 4
##$GAMMA= 1
##$GB= 0.15
##$INTBC= 1
##$INTSCL= 1
##$ISEN= 128
##$LB= 0.25
##$LEV0= 0
##$LPBIN= 0
##$MAXI= 10000
##$MC2= 0
##$MEAN= 0
##$ME_mod= 0
##$MI= 1.114404
##$NCOEF= 0
##$NC_proc= 0
##$NLEV= 6
##$NOISF1= 3.799351
##$NOISF2= 2.8
##$NSP= 1
##$NTH_PI= 0
##$NZP= 0
##$OFFSET= 14.38212
##$PC= 1
##$PHC0= -1562.106
##$PHC1= 9.19228
##$PH_mod= 1
##$PKNL= yes
##$PPARMOD= 0
##$PSCAL= 0
##$PSIGN= 0
##$REVERSE= no
##$SF= 200.129724274929
##$SI= 16384
##$SIGF1= 3
##$SIGF2= 2
##$SINO= 400
##$SIOLD= 16384
##$SREGLST= <1H.CDCl3>
##$SSB= 0
##$STSI= 0
##$STSR= 0
##$SW_p= 3205.1282051282
##$SYMM= 0
##$S_DEV= 0
##$TDeff= 0
##$TDoff= 0
##$TI= <>
##$TILT= no
##$TM1= 0
##$TM2= 0
##$TOPLEV= 0
##$USERP1= <user>
##$USERP2= <user>
##$USERP3= <user>
##$USERP4= <user>
##$USERP5= <user>
##$WDW= 1
##$XDIM= 8192
##$YMAX_p= 0
##$YMIN_p= 0
$$ End of Bruker specific parameters
$$ ---------------------------------
##NTUPLES= NMR FID
##VAR_NAME=  TIME,          FID/REAL,        FID/IMAG
##SYMBOL=    X,             R,               I
##VAR_TYPE=  INDEPENDENT,   DEPENDENT,       DEPENDENT
##VAR_FORM=  AFFN,          ASDF,            ASDF
##VAR_DIM=   8192,          8192,            8192
##UNITS=     SECONDS,       ARBITRARY UNITS, ARBITRARY UNITS
##FACTOR=    0.0002768,     1,               1
##FIRST=     0,             0,               0
##LAST=      2.2672688,     0,               0
##MIN=       0,             -174341,         0
##MAX=       2.2672688,     290576,          0
$$ Real data points
##PAGE= N=1
##DATA TABLE= (X++(R..R)), XYDATA
0 0 0 0 0 0 0 0 0 0 0 0 0 0 0 -8 8 -8 8 -8 16 -16 16 -24 27 -32 40 -45 53 -61 70 -80 93 -105 119 -135 153
35 153 -173 194 -218 244 -272 303 -336 375 -415 459 -509 559 -618 682 -750 826 -910 1004
53 1004 -1107 1222 -1351 1498 -1665 1858 -2085 2354 -2680 3087 -3606 4301 -5279 6780 -9389
68 -9389 15334 -62489 12383 -11211 -38136 142013 -21406 -87885 120055 67262 -102625 13936
80 13936 76308 6169 -25926 -34488 -15101 11159 -31692 -11582 5066 -63149 -26140 69335
92 69335 13245 -23637 32215 21975 -12810 -6003 -9811 27778 61623 -5501 -54112 6683 49618
105 49618 3351 -56864 -40099 16610 -196 -48919 -15516 39005 28630 -12269 -30749 2721
117 2721 49342 29852 -10186 -2415 7563 5608 10209 -3674 -11775 2014 -11835 -30501 -13654
130 -13654 1388 7186 11135 -15343 -30380 6777 32482 11815 -10424 -4157 24151 30406 -5369
143 -5369 -18025 18604 26570 -22298 -50251 -12466 30781 10443 -31805 -20491 11376 8240 -8486
156 -8486 -6621 9777 19307 2923 -11846 10349 27459 9091 -3559 -4167 -13670 -7703 12179
169 12179 3643 -22408 -18789 6084 8299 -14715 -16969 11656 22176 -5438 -22842 5100 37640
182 37640 21328 -17969 -12617 20535 13636 -18076 -16428 4683 4788 -11395 -17755 -2549 12466
195 12466 4054 -12105 -9410 1681 6396 9869 8062 -409 1391 12336 8887 -7330 -8950 6388
209 6388 9318 -8815 -19306 -4493 12882 2897 -20973 -17826 10254 15438 -6530 -9343 13378
222 13378 21413 3030 -12370 -2531 14484 7288 -14352 -11709 8247 10011 -5203 -9936 -2748
235 -2748 771 -2734 -6501 -6194 -1475 5449 8082 4178 -284 2658 9692 7784 -5379 -10198 5208
250 5208 12757 -6457 -19100 119 15094 -1732 -20185 -8283 12492 8096 -11031 -8389 13166
263 13166 14817 -6189 -11572 6298 14668 1109 -7598 -313 5258 24 -2999 -1530 -4026 -7673
277 -7673 -3678 966 -2535 -2940 6043 10727 -1187 -10684 1551 15754 4868 -12593 -6216 11853
291 11853 9895 -7073 -8591 7153 7087 -12121 -17139 1239 11926 1002 -9701 -3706 7156
304 7156 6437 -300 -833 2829 2282 -1236 -1217 2809 5045 2152 -1983 -6356 -7317 -1217 5746 2099 -7833
321 -7833 -6674 3986 7122 -1187 -4028 3591 6961 -2443 -8637 2777 15018 6749 -11068 -10590
335 -10590 4231 7140 -4529 -8252 1955 4690 -4895 -7452 3285 8650 904 -7292 -4320 3082
349 3082 5377 5115 4367 564 -4124 -2332 2701 1141 -4779 -3937 1489 -1315 -6925 289 11956 5540
365 5540 -10889 -10736 4872 9675 -1222 -5192 4207 7115 -2392 -6392 3808 9625 -704 -10993
379 -10993 -5972 3555 3507 -641 -654 -707 -4265 -3361 3450 5205 895 -491 1582 -219 -2876 1378 6980
396 6980 2124 -7668 -7414 3394 8507 1084 -5460 -1585 1295 -4586 -7182 1888 8249 1716 -5468
411 -5468 -2438 5710 7300 1688 -3256 -3229 -1989 -2151 -457 3761 3581 -1006 -3624 -1704 -221 1246
427 1246 1641 -232 -4392 -4256 1155 6109 4287 -1306 -2439 1559 1619 -2331 18 5531 2714 -6979
443 -6979 -7952 997 6322 763 -5579 -2280 3001 1051 -1565 2828 5557 -1598 -6705 -1965 3646
458 3646 3117 888 835 188 -1805 -1027 2167 2434 -3007 -6212 -1691 2642 -461 -1515 4620 4790 -3985
475 -3985 -6076 2422 6829 1186 -4154 -1521 2929 1563 -2146 -218 3403 -1045 -6564 -3481 3245
490 3245 3032 -449 -314 388 -1262 -1147 1354 2445 -105 -1930 387 2739 995 -690 1435 1121
506 1121 -3851 -5539 468 4322 1693 -2240 -2042 769 990 -986 -1571 2030 2489 -1283 -1299 2756 4125
523 4125 -86 -3083 -2617 -934 263 153 187 1720 1051 -1804 -2104 243 76 -1058 109 1039 -840
540 -840 303 3631 3326 -553 -3061 -819 1414 -53 -2659 -492 3154 363 -4314 -1030 4198 1273
556 1273 -4011 -2367 2438 2030 -1367 -763 2678 2320 -2098 -2180 1769 1851 -854 -506 1375 -447 -2499
573 -2499 -435 1367 -427 -2680 -712 2707 1535 -1620 563 3824 505 -4139 -1870 3015 1689
588 1689 -2240 -1352 2396 2114 -1663 -2026 813 1265 -2302 -3684 -59 2756 818 -32 1444 936 -695
605 -695 -385 463 579 -338 -550 91 537 -118 -422 564 -41 -2690 -2324 1073 2381 153 -672 432 511
624 511 -447 -1195 298 2404 969 -1882 -1304 2107 2087 -1322 -2514 -590 -294 -1422 -253 2040 2048 -510
642 -510 -1926 -256 1266 -35 -503 576 1097 -677 -390 2475 2384 -1117 -2776 -1170 -111 -1141 -182
659 -182 2105 1523 -1644 -1779 1194 2484 -138 -1560 -247 986 -152 -548 2013 2267 -973 -3231
675 -3231 -590 1453 303 -980 581 431 -1287 -869 1147 1604 -239 -1673 -938 1096 1265 887 1241
692 1241 1050 -1448 -2322 393 2137 160 -1053 -470 -45 -641 -68 973 80 -830 -1888 -450 1690
709 1690 2605 1237 -116 -399 -934 -1224 -108 1240 139 -1268 -947 112 1236 949 178 -892 -1305
726 -1305 -1507 -218 1407 1955 358 -789 -286 986 461 361 310 -87 -1210 -1425 604 1667 314
743 314 -1385 -1518 -490 258 256 1163 1183 -474 -1435 -214 1754 937 -516 -277 -72 -596 -72 1008 1846
762 1846 -673 -2656 -1720 256 586 3 399 1002 -138 -864 939 1916 600 -1666 -1077 531 625 322
780 322 1221 1188 -731 -2273 -754 860 302 -956 -388 -25 -304 171 1218 1458 -192 -1546 -564 1014
798 1014 1055 617 140 -354 -1062 -1060 -247 1191 248 -939 -954 155 575 517 388 40 -616 -913 139 1228
818 1228 1687 950 -258 -670 -159 -153 -140 -466 -95 -676 -1024 -14 1142 1109 -118 -838 -433 -383 331 692
838 692 1124 636 -834 -634 345 1210 -207 -1428 -540 -130 -457 -251 1188 737 -854 -1199 -3 663
856 663 196 -20 720 620 -630 -209 844 1092 -955 -1308 -250 111 -395 -213 696 346 -1235 -1191 611
875 611 1064 236 -176 435 660 -78 121 217 181 -865 -1002 -207 577 567 -65 191 33 -899 -822 -80 184
896 184 25 -509 409 958 478 515 329 82 -592 -903 -518 148 294 3 -221 -264 -185 -273 -37 254 128 -226
918 -226 -156 214 568 484 -28 -3 240 -115 -112 225 848 36 -1007 -911 -256 -200 -566 146 385 127 -346 459
940 459 940 279 -401 -328 182 -72 -469 224 942 156 -939 -380 280 -270 -699 -273 115 -113 -361 677
960 677 1290 485 -848 -315 267 -185 -350 318 805 -106 -950 71 281 -333 -608 -218 -217 -101 -4 664 983
981 983 334 -441 -249 259 548 10 446 252 -507 -231 83 424 -201 -569 -517 -297 -122 474 287 407 -306
1002 -306 -632 -107 534 541 234 282 -21 -13 317 350 10 -564 -976 -978 -339 715 909 560 -212 -244 126 382 227
1025 227 366 178 -318 -230 721 782 71 -196 -643 -741 -602 183 734 283 -620 -914 27 459 184 163 283
1046 283 185 -450 -149 1164 858 -473 -879 -343 -392 -210 178 632 201 -884 -950 256 631 -2 -453 -92
1066 -92 288 -12 692 1630 842 -587 -985 -370 353 200 149 154 -108 -662 -155 720 541 -363 -1007 -336 148
1087 148 519 776 206 -36 -462 -615 -108 330 138 -508 -404 -279 13 129 326 296 -515 -539 -462 727 1140
1108 1140 653 -164 -444 -442 -257 35 433 61 -412 -661 216 725 478 -266 -579 -425 -594 -257 688 1025
1128 1025 98 -594 -136 468 365 14 -125 225 -564 -490 731 926 133 -993 -804 -81 -150 98 318 695
1148 695 -295 -655 253 956 368 -628 -434 -172 -93 -39 580 822 -275 -832 -343 573 218 -74 0 322 1
1169 1 -106 312 765 83 -482 -366 361 569 113 354 263 -422 -603 -413 -3 89 -221 -153 57 145 159 206 168
1192 168 36 -580 -342 -141 527 469 251 -209 -272 -562 -187 314 138 -244 -362 67 616 326 126 245 166
1213 166 -271 -122 304 676 102 -311 -154 79 -47 -133 -150 146 -199 -504 -253 538 233 -333 -690 -119 -132
1234 -132 -125 309 406 237 -351 -102 196 175 -619 -254 151 178 -243 181 657 367 -563 -614 -400 170 -349 -83
1256 -83 635 455 -7 31 620 40 -234 -142 -74 8 -167 48 367 257 -5 -45 -95 131 -105 98 282 76
1278 76 -352 -244 430 334 -186 -363 -86 -205 238 427 238 160 -202 -375 -40 100 128 -184 31 209 75
1299 75 -253 123 146 -420 -484 -384 190 479 194 0 121 -105 -258 -204 22 249 -61 -10 174 469 79 54
1321 54 -65 -517 -623 -398 181 676 105 -228 115 109 22 -164 140 -18 -274 -454 343 634 270 -448 -65
1342 -65 -34 -225 -107 433 395 15 -329 -280 337 -107 277 219 -16 68 -85 414 774 -19 -435 -256 -45 39
1364 39 149 294 233 -67 -234 162 541 226 -213 -503 -248 -237 175 402 395 38 -383 -199 -108 -81 74 -15 93
1387 93 -257 44 229 383 166 -386 -334 -343 250 315 397 -127 -14 -398 -386 109 361 204 -311 -178 -75 48
1409 48 -2 172 -81 -254 -394 342 729 499 -223 -320 -151 -54 -204 384 394 -78 -491 -340 797 527 -266
1430 -266 41 -95 -339 -66 176 708 438 -347 -221 346 -90 -72 100 -119 -480 -453 180 577 419 -238 -485
1451 -485 -107 -97 -104 188 297 -37 -395 -12 391 243 -243 -193 -302 -111 -462 379 457 88 -357 -169 -145 336
1473 336 397 -39 14 -72 -365 50 386 362 -527 -281 -595 15 176 236 15 -30 -495 -420 -195 62 113 4 -15
1496 -15 45 315 348 282 -21 -508 -403 -246 90 517 -98 -3 107 -127 -198 -253 324 -7 -553 -541 287 361 183
1519 183 126 -55 -173 -390 -197 279 161 -40 -260 58 48 -248 -72 37 -2 -355 -159 612 368 92 -102
1540 -102 72 33 -297 55 459 408 -216 -437 184 208 -146 -342 -329 289 -453 -9 427 415 -93 -255 -126 -34
1562 -34 -128 -190 -20 -42 -257 91 304 327 -262 -430 -283 14 -109 153 320 286 -280 -18 88 377 6 -295
1584 -295 -25 290 164 246 -114 284 -125 -164 -148 182 319 326 153 -231 280 58 251 87 180 67 -189 -123
1606 -123 265 75 177 -55 -27 -548 -418 337 450 -59 -93 157 78 -407 -292 -49 408 -149 -204 -17 375
1627 375 87 -403 141 -50 -312 32 -109 88 31 -162 -107 162 8 -164 -11 24 -147 -307 303 332 -194
1648 -194 -223 -55 -3 -422 -562 329 220 -51 -358 -215 370 187 -331 5 -11 178 -76 237 436 254 -88
1669 -88 -205 42 130 -112 34 197 -16 17 183 81 -99 -106 22 -175 -175 -18 330 489 365 38 -188 82
1691 82 78 -191 -366 -48 0 -24 139 173 213 -236 -436 -557 311 287 2 -145 100 -17 -216 6 298 242 128
1714 128 -335 154 299 22 206 -321 -376 -267 310 529 -69 -118 330 307 -136 79 157 325 -185 -392 -145
1735 -145 419 658 -21 -217 -247 101 -466 -343 254 503 -374 -26 488 409 131 71 -248 -450 -271 -34 474
1756 474 130 19 -94 -253 -41 -179 222 513 71 -244 -85 104 468 -205 -178 -26 73 -336 55 165 334
1777 334 14 -434 -528 -68 250 -201 -281 33 84 24 24 -232 -106 -388 -476 -290 -119 300 437 -37 -422 -304
1799 -304 -62 6 -80 -211 -92 -71 15 -39 178 154 215 -361 -359 170 517 -88 -72 232 32 -143 -141 265 134 -88
1823 -88 -508 126 -64 206 -153 -236 -553 -353 88 300 -31 -188 122 18 155 -223 -195 254 -3 -500 -439
1844 -439 593 311 -106 -226 157 74 -34 144 93 253 220 -102 29 234 425 -83 -236 -469 -121 -70 121
1865 121 -126 -127 -183 -23 -198 -106 -86 4 -142 -218 -74 370 331 165 -108 -111 178 278 -170 -47 177 16 -231
1888 -231 -503 80 289 -77 -197 -184 255 150 -76 -327 191 -230 -337 -256 -25 308 204 13 -97 -18 1
1909 1 255 -65 -297 -354 404 357 187 51 -32 33 -388 -646 68 181 62 -352 -297 481 180 -297 37 313
1931 313 173 -263 -224 31 -1 -72 -128 -120 119 172 -3 -328 -237 101 220 280 -5 173 79 162 -375 -509 11 445
1955 445 127 -399 46 39 -94 -171 44 193 -116 -144 -252 -8 281 -74 -146 -193 55 645 -60 -32 8 253 -268
1978 -268 111 132 16 -8 53 40 284 -65 160 97 -48 93 22 -9 -513 -202 316 295 -94 -268 -38 298 86
2001 86 -315 -246 -66 276 -133 -6 31 134 -205 -389 24 234 248 25 -182 -115 167 68 -20 -25 -117 191 54
2024 54 -89 -268 295 317 -52 -496 -103 278 76 -402 -238 311 172 -282 -280 272 24 -98 -32 -141 277 111
2046 111 -253 -51 98 -183 -18 -131 -101 -10 265 -120 -114 31 96 21 -157 -204 72 224 496 -251 172 132 -50
2069 -50 -144 -311 -202 322 -24 -378 -148 152 196 -80 -86 134 11 76 -17 87 -1 -278 -187 -20 163 -8 -70
2092 -70 76 -182 -8 66 -57 73 -300 -327 40 -15 0 43 126 -196 -328 -280 157 99 1 -303 69 303 69
2115 69 -288 98 156 -273 -412 -266 64 88 -155 -374 1 -92 64 19 46 -15 -199 -85 -89 34 197 -151 -203
2138 -203 -59 -28 360 329 -31 -164 325 322 -111 -253 -255 19 -73 -185 -53 285 58 187 -144 168 -2 85 -177
2161 -177 -172 94 -97 150 -194 256 82 -156 -17 -263 -70 136 50 -112 -68 51 -92 176 -50 -45 -84 151
2183 151 -251 17 107 -59 22 -478 -79 266 54 -176 39 283 -82 -127 4 157 -16 -434 -261 115 280
2204 280 -216 40 103 143 -208 -325 113 -130 -71 160 -43 113 -138 66 210 -231 -399 270 404 -98 164
2225 164 148 210 -69 -65 -372 274 44 29 -39 64 423 73 -312 -75 -6 -92 125 113 279 7 2 -84 -219 114
2249 114 -99 84 -84 112 -30 47 51 -225 -78 198 -65 -132 -59 228 151 26 54 296 -89 78 -138 82
2271 82 312 -40 -62 141 235 54 114 -296 -38 141 165 235 70 -152 59 342 170 37 -19 -158 56 -43 101
2294 101 106 116 84 -240 -97 51 50 -127 -78 288 128 24 46 29 -15 -46 -94 254 111 115 0 200 179 -203 -109
2319 -109 -177 183 -175 107 -57 75 -225 -189 -59 95 -88 234 82 241 11 -305 -127 312 -144 -32 -95
2340 -95 117 -61 -266 81 143 432 -169 -260 275 -168 -178 -120 71 -66 -190 39 -46 -33 -64 -202 143 64 -200
2363 -200 108 224 -4 -218 -1 47 36 -138 284 -57 -140 -181 -35 15 -118 129 -278 357 -64 -179 191 4
2385 4 21 171 -38 51 120 113 96 -265 22 -262 67 -41 106 183 -188 -256 35 53 -206 346 -59 -217 225 -14
2409 -14 -105 -152 108 31 -231 -181 -198 133 202 -33 -20 38 -141 -33 37 -260 -61 -236 -414 -39 27 194 -115 -58
2433 -58 64 209 -73 -5 324 -94 -152 -23 75 53 -41 -185 30 -95 -62 129 -5 -212 45 53 128 -33 -140
2456 -140 -61 -74 -134 -109 -122 182 -178 -149 -57 -19 98 -338 -49 64 -475 -60 155 -136 -28 62 -161 -428 -132
2479 -132 88 -15 309 179 -56 -46 -172 26 223 -41 35 21 -306 -32 158 71 151 -216 117 163 121 -215
2501 -215 -8 58 -64 38 -53 86 136 -257 -98 153 22 -227 -80 207 163 -194 -81 69 -293 -104 -121 -82
2523 -82 -20 -53 -307 318 92 -254 -146 -59 139 -153 -9 -142 202 -94 49 195 64 -174 -179 207 28 111
2545 111 36 -215 -222 133 -57 -33 -169 292 -145 -68 67 84 -26 8 196 -82 120 -22 36 -50 -325 374 231
2568 231 52 -235 221 223 -136 -170 164 283 -48 75 126 -112 -68 -156 -240 13 29 -174 -251 -132 62 -23 -141
2591 -141 271 82 -7 -120 -171 55 -91 90 167 51 -16 -77 271 48 -365 -258 199 331 -147 -129 -121 200 -26
2614 -26 -226 130 27 -30 43 20 -185 -117 -131 -86 284 140 -132 19 -78 -192 -22 -84 92 -211 -37 71 205
2637 205 118 -66 334 -49 130 -29 -265 62 -31 -115 -234 -74 -124 -208 -46 227 -28 7 47 -182 -284 -266 -14
2660 -14 -236 -26 -52 -60 93 -43 -208 35 -160 -17 -20 -74 80 100 46 35 316 85 -184 25 37 27 69 160 126
2685 126 -132 -185 -24 36 148 -30 -17 244 -173 78 184 -24 137 -72 11 -67 24 -67 -151 -28 -134 191 -223
2708 -223 -154 -1 34 -191 -53 -43 -92 -208 -86 -117 -184 31 27 227 56 -186 -6 15 -164 -216 50 -21 -121 -144
2732 -144 126 101 -125 -93 -70 202 -117 75 108 80 -55 -148 -48 72 148 -158 158 229 37 -27 -206 -36 140
2755 140 -432 302 -117 -56 -15 -133 162 64 79 98 -258 66 -93 -128 193 -47 211 -118 11 -38 -80 -232 137
2778 137 43 -24 46 -23 195 -160 -194 -120 -37 134 -53 233 249 253 -112 -33 137 1 -128 -38 71 -93 -78 242
2802 242 15 -85 9 52 210 58 -413 61 241 -110 -79 -166 268 121 -2 -79 -18 19 -10 65 -63 39 -201
2825 -201 -6 -129 126 -206 -209 -51 131 -279 -60 -90 -186 -60 -129 10 157 38 -148 39 -259 -22 -51 -160
2847 -160 -172 -88 48 -42 -112 117 -41 -69 25 -73 -136 155 -159 20 -50 -322 41 149 -45 90 223 45 -124
2870 -124 206 266 -119 336 48 -101 -199 -70 -145 160 6 -143 -207 360 67 32 -33 -215 -21 -85 84 199
2892 199 27 100 -22 28 94 -182 97 -112 112 51 -146 226 146 66 94 244 61 -192 51 87 -171 -137 -361
2915 -361 95 183 80 -48 -11 -116 5 47 15 27 -134 87 43 -65 111 23 -105 165 44 -188 197 -291
2937 -291 114 -138 63 -133 -47 -197 6 32 34 -101 -27 100 32 163 20 -250 -249 -72 -39 -94 99 -85 -271
2960 -271 26 -193 142 -109 23 122 40 -176 -25 -87 89 104 84 -160 29 -100 -108 -29 14 97 -56 -49 62 170
2984 170 -24 175 -226 71 -46 -35 22 79 178 136 -241 298 -62 -37 61 198 227 206 -169 -4 59 -147 -228 -126
3008 -126 267 -96 -9 -446 478 50 -34 73 -32 131 137 -28 -2 8 147 -218 17 141 144 -80 -35 -213 108
3031 108 39 -1 46 -146 58 244 222 -35 -17 13 96 -122 -43 -110 0 379 -317 121 55 -188 -90 14 106 -16
3055 -16 -107 93 235 13 -185 -96 225 106 152 140 -42 9 0 -231 9 84 158 19 25 76 -215 -9 179 -106
3079 -106 -70 -311 25 -109 41 -50 169 -78 47 -76 -31 -169 -40 -44 -115 138 -9 -255 -31 115 290 -47
3101 -47 -49 -303 90 -123 144 115 -72 -22 -67 -171 136 -13 -233 -289 -189 -84 22 6 -140 70 84 152 -26
3124 -26 44 -38 285 132 21 -164 260 79 -198 40 136 211 289 82 173 63 -99 89 64 -148 14 -232 70
3147 70 16 142 362 -87 278 4 -131 321 -119 69 -54 84 71 108 44 -61 173 -155 43 -123 -52 -67
3169 -67 11 -44 99 320 -246 8 35 139 -8 9 124 236 -204 288 -47 15 -2 133 101 30 -12 20 -332 81
3193 81 171 222 -159 -10 70 -148 24 208 97 -75 182 -29 -66 -65 113 87 127 -163 180 0 -70 -178 29
3216 29 -122 12 -113 57 51 -252 69 -41 -194 -50 -189 7 -1 -271 20 183 -150 16 -144 39 125 168
3238 168 101 -107 241 -75 -81 -118 -313 -44 -61 -131 -113 32 159 168 -3 -111 -92 95 7 -91 -86 88 -212 95 30
3263 30 -41 -132 128 -8 218 106 249 -36 117 113 66 -60 -36 219 -176 -78 5 24 192 -86 142 87 -312 -38
3287 -38 -98 -141 -5 -218 6 53 -60 -14 145 -63 102 162 -302 -309 156 -49 -43 76 -160 155 359 -170 51
3310 51 118 -108 20 -52 31 26 290 231 -111 -165 -43 137 134 11 86 -57 -74 46 108 -117 114 -44 123 -83
3334 -83 -2 57 100 -130 31 134 110 -11 99 -160 29 -158 -17 50 -129 186 79 -131 98 17 -172 191
3356 191 -113 48 108 67 112 -71 168 -15 8 -43 -105 -1 33 -35 217 6 -219 -43 -94 -104 -33 -61 83 -162
3380 -162 136 275 293 228 159 279 -107 -269 -25 201 -67 -115 -126 107 -79 23 -83 230 178 -22 -60 -84 -39
3403 -39 -81 -29 -29 -143 3 6 -19 -101 4 -15 -254 97 -20 92 -173 -104 70 21 23 33 -175 141 88 110 15 -41
3429 -41 41 -73 -103 -48 -4 -181 31 -180 320 -57 -208 -89 -128 133 31 25 160 155 -71 -129 -185 7 145 -198
3453 -198 -95 -25 177 -91 -56 -105 -64 1 117 6 -55 -279 -107 -28 87 215 83 -79 141 -53 -360 -63
3475 -63 55 -35 150 47 51 141 124 136 -167 -76 40 -236 102 -113 -288 -103 -196 -69 -66 -56 -317 -44 -130 75
3499 75 88 35 16 -125 226 -145 -217 158 -16 -108 188 -119 216 -22 -39 -142 -28 -120 -135 72 269 132 32
3522 32 -88 272 40 81 52 -111 40 -96 98 -61 61 48 -192 -140 -165 32 233 26 252 172 162 37 223
3545 223 207 145 373 -159 13 -176 76 269 -220 -4 29 305 153 148 -286 277 -112 103 79 -126 -146 41
3567 41 27 26 175 390 -167 137 -104 -179 -79 22 217 117 278 -85 208 -186 313 -224 -8 -112 75 233
3589 233 -318 -279 -133 -21 -190 -19 -58 -111 83 -191 218 164 -44 9 214 -274 -77 67 -77 174 122 -134
3611 -134 218 116 -234 -92 286 80 -21 -81 112 4 -43 -29 198 45 -148 -90 -137 117 43 -7 43 -134 -76
3634 -76 -3 170 -119 -68 -44 2 158 -185 -151 228 -174 -94 -85 -186 -265 109 -34 -55 51 -22 184 -212 -258 -285 -17
3659 -17 -370 231 12 259 -90 78 67 -13 99 -69 8 48 15 -146 -104 -92 -249 25 187 155 8 271 -199
3682 -199 64 4 11 -39 209 254 39 107 26 32 -151 -47 -308 -133 9 -64 -13 -131 35 82 -184 175 -125 6
3706 6 160 161 -80 -11 169 -30 -116 20 -166 117 18 -16 63 -21 41 -31 -100 -97 25 295 43 177 -158 -155 -116 -62
3732 -62 -127 -199 -38 144 48 342 -176 214 -87 98 242 147 -53 -11 200 11 71 27 -77 48 -1 6 -109 231
3756 231 -110 70 110 -117 -99 247 74 -18 66 -204 -141 -142 -45 89 50 -12 -87 229 56 11 38 -113 202 -11
3780 -11 228 249 -51 128 126 60 -116 53 -13 -33 -129 -125 -159 -2 -23 -81 2 234 118 -78 -268 30 180 69 159
3805 159 -45 263 5 167 -83 8 239 -117 -200 -52 -14 -5 205 -133 -110 15 71 87 -130 223 137 14 -37
3828 -37 -4 -67 -232 -123 48 -66 -133 -185 108 -76 229 -41 -112 185 24 -120 45 392 97 21 -88 -42 -77
3851 -77 -24 24 152 126 98 -32 -86 -38 -220 -81 -16 -69 148 -91 -172 22 -97 -108 -24 126 -104 22 -208 62
3875 62 159 -167 -84 -37 160 -141 -32 153 277 106 -65 -47 -228 23 29 2 -82 42 -11 274 -32 -117 -236 99
3899 99 -100 50 -56 -89 -97 33 210 20 135 -96 64 -115 214 -9 51 176 35 -147 143 243 -114 -36
3921 -36 -27 163 -166 23 86 -148 -345 138 86 49 72 90 -132 -89 182 140 7 -287 305 106 -90 26 169
3944 169 178 -162 30 -61 187 -103 22 -44 43 -406 -9 91 110 -144 272 -103 -36 163 -104 272 242 -36 262
3967 262 -254 40 179 -189 -34 124 12 -163 204 111 234 -69 -70 73 -42 -339 127 138 -144 -57 40 -249
3989 -249 -138 -19 29 7 -186 -327 -35 -229 48 -5 -50 -76 -203 77 141 -224 -22 -20 60 -185 149 42 193
4012 193 -87 106 -147 51 -182 134 205 -245 -184 -102 -95 -100 -38 -8 -189 -54 -10 -63 235 74 -121 78 -225 70
4036 70 -129 -77 7 -82 189 -24 2 -18 -75 -106 232 -80 -69 -144 -13 -135 164 128 161 22 -143 177 100 84 -217
4061 -217 85 61 -7 -138 -116 -329 7 37 -162 49 49 -168 54 -22 -75 9 -188 213 -36 417 151 156 -243 262
4085 262 4 -160 -248 129 137 -33 152 -132 -5 -127 52 -39 -184 -98 135 -114 370 26 239 -17 -419 -114
4107 -114 22 -17 -53 -126 -170 -216 -105 -164 169 49 25 269 -112 -62 159 -44 188 168 53 192 -84 1 207
4130 207 126 -8 -76 -76 -36 64 69 -198 -341 221 -109 82 112 130 222 -353 -214 -201 80 78 -107 138 -48 -112 64
4155 64 -142 193 116 -127 31 -199 -210 136 -24 17 -211 -124 -55 80 36 85 -76 -377 -160 -41 -201 -34 -213
4178 -213 140 16 -1 -29 -8 194 39 6 108 158 -133 -45 -29 263 -60 60 -139 -254 65 90 82 -168 -36
4201 -36 -111 -34 38 22 78 23 101 276 128 88 -43 80 174 -25 -129 51 29 69 65 112 -140 -165 -139 -146 -23 90
4227 90 197 -99 152 -96 46 -122 -29 -126 26 81 79 -54 291 181 -186 27 -117 -279 -152 403 -109 -109 -227
4250 -227 153 -60 -177 -84 105 141 91 135 25 288 37 -110 75 39 -74 148 -18 -178 57 7 24 -94
4272 -94 124 46 131 -11 -95 -49 -35 -159 -17 -238 98 33 -356 -210 3 -13 90 50 -243 46 -60 212 -74
4295 -74 108 -343 110 -45 26 -36 -52 39 119 -385 508 181 -8 -199 132 154 39 -148 -168 -152 -128 224 128 49
4319 49 19 -123 3 425 -226 -60 -68 -20 132 -9 85 136 -263 33 104 -128 -187 27 220 -42 -19 -217 -120 113
4343 113 -80 71 -130 -173 -228 -74 197 124 -160 -205 -138 198 -10 -141 79 -321 18 -268 23 -42 -24 -145
4365 -145 -81 104 -212 111 -317 -213 -193 -195 -98 27 -221 -30 80 -243 -128 -108 -144 -244 35 -19 -10 179 35
4388 35 -94 4 -176 195 -95 -114 161 -80 -42 160 -97 -22 -45 44 217 -44 -17 235 5 -102 145 165 105
4411 105 -131 -46 36 85 -197 15 -55 -111 4 -70 75 -56 -21 126 -37 -110 188 24 -54 -73 -108 -188 -22 -233
4435 -233 -83 -230 26 335 116 -138 -102 -98 -136 246 49 -163 -20 48 -82 74 -94 -75 67 -65 -114 17
4457 17 3 96 159 79 -130 71 10 62 -83 38 -20 -220 218 185 90 -127 295 -157 -169 -8 -61 4 -137 -69 183
4482 183 -187 -65 31 117 -200 -91 -185 -193 -139 101 -127 -130 -69 -22 29 -505 -57 -280 27 -105 35 -127 2 -59
4506 -59 -19 -391 63 -63 84 43 -38 395 -267 -125 -71 -48 -11 -7 82 86 4 73 4 115 -109 179 59 131 -219
4531 -219 41 147 -3 8 15 108 -77 190 2 44 -230 -89 132 185 107 6 164 -32 124 109 -117 -143 58
4554 58 -189 10 140 -84 -18 90 108 -58 -10 -91 -37 -93 20 86 -62 79 1 83 -284 50 190 -272 253
4577 253 188 -26 -199 -121 10 157 68 125 69 123 74 -53 32 -130 -270 -66 -203 13 133 -10 70 -198 214
4600 214 345 153 -10 -15 -103 -72 78 -7 96 25 -273 -199 -132 -116 -10 129 -239 103 82 43 43 73 1 -106 -205
4625 -205 364 -147 138 238 171 235 236 -15 -191 99 166 125 -39 196 220 18 0 52 -100 60 -146 195 -237
4648 -237 58 109 7 4 316 -138 -113 179 -116 -203 -47 35 -33 -141 -14 -64 68 11 25 57 -192 40 -92 42
4672 42 109 -38 -235 21 -94 46 27 31 344 -133 -15 80 -279 16 12 417 44 74 -197 16 -140 -138 128 67
4696 67 -171 -44 -28 6 53 49 129 -158 172 81 22 -181 -122 -11 177 92 -147 -74 238 -79 -27 -15 -39 -54 121
4721 121 -39 119 131 -172 -139 164 -311 42 188 -22 99 197 169 -10 129 3 80 -91 230 140 -181 116
4743 116 -205 137 191 3 207 -32 483 21 55 -12 18 -248 170 -50 102 -138 -128 253 27 126 -40 -84
4765 -84 121 -33 0 71 155 -282 52 183 -273 -53 -72 231 384 82 -9 160 -23 -175 32 -7 213 186 93
4788 93 -4 39 -166 -183 81 -157 -21 39 67 -8 23 -35 -20 15 62 -49 116 -163 29 95 -300 18 -45 175 -7
4813 -7 110 -65 -95 -95 -104 -247 -20 -267 -58 -176 -115 25 -255 -6 257 -147 103 26 -155 -12 -64 -61 -239 -349
4837 -349 13 -20 -206 -170 -206 191 86 28 -258 97 -92 69 -192 -35 -67 -6 189 204 51 -105 -155 198 154
4860 154 58 -51 -11 -47 -114 30 -136 103 -220 160 -41 50 -95 -47 37 -83 67 118 9 136 130 -289 -59
4883 -59 36 -261 174 10 -39 16 54 -223 -24 33 172 235 -49 -74 77 -28 -105 -50 -33 -140 229 1 -89 117
4907 117 98 48 -63 123 90 -70 112 215 12 -160 23 100 94 -21 -240 -28 -3 144 69 31 -87 461 -50
4930 -50 81 -77 118 202 -97 -23 153 45 87 -184 165 91 60 -28 65 -57 -141 -82 -35 21 -132 198 -188 -156
4954 -156 155 102 70 -27 -57 20 -160 -27 138 200 -114 120 22 -320 -58 -79 47 -80 64 50 -42 136 -127
4977 -127 -11 -22 24 -164 -22 -55 9 140 -184 -73 -165 -115 -103 -78 8 -58 -91 -44 -107 -236 -24 -119 188 -106 147
5002 147 83 -41 -115 191 307 -84 -133 -124 197 -152 -20 232 -42 186 42 280 -130 -24 -42 84 212 -139
5024 -139 -93 -139 44 307 57 -154 372 29 -92 -147 -171 70 128 140 11 49 18 -127 -168 -233 50 72 -111 186
5048 186 -46 -213 233 100 40 -269 110 105 -61 -254 -120 94 219 76 6 205 57 122 59 123 98 -226 -61
5071 -61 -6 253 -41 -21 -43 -225 159 -127 -252 -47 151 94 122 -46 83 77 -23 288 49 -70 -139 -111 53
5094 53 241 26 -69 104 40 -213 -125 -156 -98 -211 -174 -97 -16 -58 -26 -100 -194 -56 196 -80 24 -41 21 -153 -37
5119 -37 135 56 -64 -45 318 21 92 -218 28 -67 -58 -218 -69 -19 -53 59 4 -125 -42 130 -20 38 48 17 51
5144 51 -44 -111 -41 55 37 -188 44 -258 -380 -167 -58 60 152 -71 -133 -246 1 3 -64 -148 -137 -60 -41 -254 317
5169 317 0 87 12 68 192 -191 -4 87 89 -9 -228 -30 -315 63 85 254 116 224 -327 -52 130 121 -84
5192 -84 -55 56 91 304 -137 167 54 -158 -164 100 234 -224 -263 55 -1 -9 2 -344 34 -28 -51 157 250 288 -15
5217 -15 79 215 -81 22 -272 -95 -105 -68 -99 79 147 56 100 135 -254 -76 -9 -85 1 273 -75 89 -23 120
5241 120 14 -18 75 180 200 360 -141 21 -240 1 -55 32 95 -76 -34 -89 -35 51 137 -233 -34 136 14 -27
5265 -27 -108 236 -12 -84 -46 220 170 -5 -33 -75 -32 28 17 -148 29 -298 -271 67 2 -27 -159 201 -122 294
5289 294 -129 -181 -2 239 69 -131 -25 -159 182 -92 -138 -30 357 99 -41 58 53 -312 59 226 -89 -206
5311 -206 -115 24 -72 -119 318 67 94 88 -32 100 -199 123 104 -167 125 96 107 14 -21 -136 133 -116 -216 112
5335 112 138 -159 -112 65 -28 10 265 78 -332 -180 -148 -118 -123 -116 -51 316 117 1 -47 -71 40 153 56 -88 -103
5360 -103 -282 119 123 -189 -133 136 49 222 -68 -108 -15 -161 -338 -98 11 -248 -153 118 159 -103 -135 -44 58
5383 58 82 89 -40 68 -304 -185 -202 -32 -11 92 -27 -57 201 -50 13 -10 -160 -225 -241 215 117 -238 -10 167
5407 167 -224 -185 128 18 73 -60 -164 -125 97 82 -184 109 182 -65 103 85 121 140 -97 90 124 -237 -157
5430 -157 1 159 -50 -210 -149 58 106 72 239 65 -140 -82 -145 -193 -147 -49 -9 -30 -32 -28 88 16 64 106 119 108
5456 108 -178 -309 120 -83 -192 -111 22 -39 2 -198 -132 195 -96 -72 -156 36 -19 29 -187 29 -180 -61 -21
5479 -21 -369 0 75 41 -35 -237 -67 24 -127 -61 132 -134 -195 -68 -112 -20 2 15 -20 37 -284 -51 -83 21 48
5504 48 57 44 98 -21 -14 -163 -60 130 -110 -116 18 127 81 184 5 101 9 -113 -19 -169 368 -93 -104 -157 -164 -94
5530 -94 57 5 141 54 -66 56 -216 42 -123 -29 -47 4 77 95 124 275 106 -45 89 159 47 42 101 12 30
5555 30 -36 -12 -45 209 288 41 -149 83 51 -116 333 84 190 -34 -44 -150 155 -150 100 122 77 79 -80 -78
5579 -78 148 161 -36 221 208 -201 47 -142 164 -161 26 134 35 70 -288 -144 -52 -228 -4 -103 -257 167
5601 167 83 96 -15 -77 -151 129 29 -66 149 5 99 -84 68 -60 62 -54 39 102 -99 127 -60 -261 -71
5624 -71 42 13 -207 3 230 75 -9 -12 46 -5 9 68 236 -116 103 -142 46 -22 -178 57 -3 -119 151 -134
5648 -134 93 -227 -119 -142 125 70 -262 -66 -42 -7 258 94 -199 87 -154 -111 100 -184 -116 29 -52 53
5670 53 -181 -34 3 -126 242 -58 152 107 -42 -356 36 -130 87 230 -370 42 -39 -173 6 291 -103
5691 -103 65 291 -49 268 145 -146 -134 -91 -69 -138 98 -149 39 -151 -125 162 -51 130 -16 -41 -122 160
5713 160 -5 -241 -70 -127 -156 -29 154 -6 -72 89 65 55 89 -64 51 4 150 82 -86 18 -14 45 -37 -6
5737 -6 5 219 -90 99 100 -167 -301 -358 42 222 314 153 25 73 102 -79 0 1 -131 72 81 -61 -84 290 -58
5762 -58 -79 18 24 158 -151 215 -134 -82 179 -35 204 -33 -31 -64 183 -16 34 -84 96 277 38 -289 -113
5785 -113 -18 -148 149 167 80 -107 73 -171 14 -43 -179 15 167 -12 -99 -165 -84 102 12 -2 34 -86 -20 244
5809 244 -63 -438 277 -38 117 290 50 -70 103 170 -116 29 -240 -118 -65 56 -73 248 85 137 -5
5830 -5 -160 -1 9 -154 -124 -21 125 -25 167 -242 191 115 -127 -38 7 18 216 40 181 84 24 102 118 88
5854 88 143 -126 -169 89 61 -148 -329 40 -167 -183 174 283 -152 42 -116 -83 -91 -375 -144 -75 -68 159 -112 -98
5878 -98 -195 140 -80 81 26 116 207 199 -74 26 248 146 -32 71 111 -12 153 26 -328 -16 -59 -52 -116 152
5902 152 27 -170 -31 79 5 -182 -95 -183 -101 -75 -99 114 114 -109 15 16 -64 -132 82 -74 216 -54 -82 -78 15
5927 15 -79 -185 110 -56 84 275 47 -32 -107 186 -91 1 -4 55 -91 4 73 -150 107 -119 -123 -65 58 9 179
5952 179 42 25 42 11 11 59 -94 73 -157 -48 -41 138 33 -37 189 173 59 158 47 187 49 -69 187 165
5976 165 17 178 -65 -151 114 -127 -74 -8 -255 -111 -140 -136 199 -137 -11 -18 141 -30 52 -93 -169 -166 -171 148 50
6001 50 -22 -3 143 -88 318 29 -121 160 166 184 -117 157 188 34 140 -132 73 59 -60 -76 122 236 369
6024 369 151 -267 -158 256 -50 341 22 177 -7 -165 182 -114 106 -116 -179 -53 29 -296 47 136 263
6045 263 -78 63 -104 -117 -73 -98 -286 -45 106 169 -38 143 324 -41 96 -41 30 63 157 67 -96 95 215
6068 215 26 59 99 37 45 -114 191 -227 -100 -210 -132 36 -49 45 -1 186 -105 213 58 28 173 -132 227
6091 227 -174 -156 97 176 -66 22 98 49 -52 -140 113 -44 -9 -17 219 -93 321 -86 135 -86 -147 90 -43
6114 -43 -110 -225 -219 -167 117 94 -203 44 113 187 301 -78 282 220 30 122 -55 -101 76 -171 62 101 291 61
6138 61 240 -395 45 -124 73 226 131 -121 -293 -206 -122 69 5 -195 100 -281 2 10 -132 67 94 1 152
6161 152 26 -40 -29 56 39 33 -3 -27 -108 -251 -30 9 25 127 -7 -86 -42 -155 151 153 -138 -22 234 107 -4
6186 -4 52 73 -65 -31 -86 43 -23 70 102 49 -59 -63 -121 27 36 -20 -31 -48 164 347 -3 2 -182 -114 35 -83 89
6213 89 118 4 197 54 -51 90 -89 -12 187 202 -65 198 54 22 204 51 -41 65 292 171 119 156 77
6236 77 0 22 -104 -4 -130 -195 72 -285 -170 -60 64 -299 54 -121 -72 34 234 -50 -211 47 94 56
6258 56 134 -268 -67 33 0 -265 73 -87 65 188 42 -63 -249 25 -69 -31 299 266 96 60 -103 205
6280 205 -113 158 -37 140 -51 99 -90 99 109 9 -134 -23 133 -125 110 -193 6 -6 129 -358 161
6301 161 -92 21 -269 55 52 29 -18 -6 44 5 -146 -134 16 112 -99 -58 55 -53 105 -59 22 -1 19 8 -12
6326 -12 156 341 39 118 59 -13 88 138 -52 -49 -46 -182 77 -71 48 264 -178 -55 -39 18 -221 222 90 14
6350 14 103 -51 -44 229 -161 -185 -76 26 100 -68 -75 -164 -27 -74 -46 -151 37 75 201 124 -59 -20 291 -197 213
6375 213 -79 2 -124 -173 140 163 259 -48 28 62 -167 22 -245 -97 -152 -145 271 264 -83 -248 119 -28 317 209
6399 209 29 7 -48 221 32 -224 -14 65 -468 -248 -72 -81 -132 -92 31 -24 200 -304 -118 -304 153 44 -66
6422 -66 -20 -150 258 -239 -148 217 103 45 375 372 -130 103 -79 118 -130 20 162 83 -96 173 174 133 151 108
6446 108 -92 290 29 -45 52 -44 -110 -38 245 86 -38 -232 41 -54 125 -23 -82 4 57 28 -57 -281 -119 73
6470 73 78 142 116 -136 64 40 48 -224 99 -342 -14 71 53 63 -22 122 -2 -104 -15 30 -350 51 65 246 -85
6495 -85 232 -76 16 -15 43 76 156 82 -90 91 37 -102 -52 101 -2 69 128 -332 -116 -250 151 -107 5 162
6519 162 -115 68 -109 -32 -87 -17 128 -114 -226 0 -122 -54 -257 -40 315 237 -86 -47 -154 -234 39 222
6541 222 -308 31 87 28 -11 54 -299 51 367 11 -38 -51 -203 -68 22 -32 157 139 -59 -97 116 104 -22 172
6565 172 98 -218 190 172 -5 -162 -185 -118 -117 178 -13 -55 16 -196 -33 -20 -140 74 94 -16 278 -201 -197 18
6589 18 -141 -116 22 170 -19 85 149 49 -14 105 -45 27 268 -123 36 -89 -25 -86 -175 141 -77 -28 214
6612 214 2 -310 306 101 -266 81 -180 -164 17 39 10 -50 -17 129 120 -81 85 293 281 86 187 -87 -12
6635 -12 -247 117 -175 155 190 -129 225 -108 -80 32 -58 160 -108 146 -33 -104 -43 -22 -27 -198 125 -35 -182
6658 -182 25 77 -93 265 -49 -9 -158 -6 97 218 -37 110 211 -38 -206 -326 -56 98 -115 -28 171
6679 171 369 -143 -21 -12 -17 4 -141 234 233 -88 22 -198 -62 103 -42 59 -192 -159 -155 -64 -45 165 122 -232
6703 -232 120 -71 -107 2 -304 -176 -33 46 26 -431 141 -304 84 111 -168 30 165 -3 -63 188 -47 292
6725 292 49 154 228 278 111 -84 -43 51 158 -46 -198 60 28 43 -347 -28 319 278 35 25 -181 276 -53
6748 -53 14 -113 -104 -50 -44 -200 -48 -12 -118 118 -134 -100 89 163 -184 -264 62 44 77 -54 -153 78 254 19 -70
6773 -70 65 -87 -73 -112 224 257 267 -74 19 -60 17 -66 -201 -225 -225 285 49 4 164 50 32 -199 -43 -223 162
6798 162 57 -263 1 -142 -85 -85 12 -38 128 62 -67 -70 96 -47 261 138 218 23 179 232 -79 -23 266 -204
6822 -204 161 192 198 22 107 221 39 -19 -137 325 -85 58 219 -278 -31 -26 140 -140 84 177 41 177 262
6845 262 -21 -40 -44 -192 -237 -58 143 -131 -42 -103 270 -6 -52 34 144 128 454 -139 -171 -123 412 -57 -105 240
6869 240 161 97 -85 -103 3 -175 145 116 11 -171 -70 191 155 -138 73 119 -43 190 36 74 42 -102 -2
6892 -2 28 91 -60 -9 26 5 21 126 -9 23 -180 -4 218 20 247 -88 149 -140 -174 -30 144 148 -200 -21
6916 -21 -75 162 -163 107 197 37 -74 -158 110 -157 -154 223 -49 -101 -49 22 -125 85 -130 185 -210 -99 -203
6939 -203 -52 -34 51 -52 -53 120 93 -173 -170 -41 -215 -77 -73 -65 283 -24 -208 -160 97 -113 42 -115 99 -114
6963 -114 8 -91 73 176 -75 115 -243 -115 52 -31 145 118 -30 -164 -238 175 9 -131 -83 26 -125 -7
6985 -7 -363 -48 -42 324 46 -210 -22 181 133 52 1 23 -67 -55 -127 -85 191 48 130 235 45 -43 -24 71 -21 75
7011 75 46 47 218 19 -231 87 310 -165 -122 -91 -106 129 -110 -202 70 -23 80 10 26 158 36 236 122 -223
7035 -223 123 29 113 120 104 75 51 186 27 -221 -110 118 -146 -290 -164 -20 -59 -38 96 -137 -145 20 -142 -199
7059 -199 -203 98 -86 -68 33 -141 -82 127 297 32 -1 -265 176 -11 160 -232 -99 -119 -33 155 -154 48
7081 48 -137 -81 -28 2 93 30 -87 -9 -109 60 259 129 -20 67 -12 -65 -16 -313 53 -142 -114 148 86 -135
7105 -135 172 82 169 34 -33 -63 -23 27 -229 71 -138 -100 -30 12 -16 45 -99 58 19 152 8 -30 17 33 118
7130 118 -250 -205 -23 -2 160 262 -148 124 142 98 -26 -16 83 191 122 8 -24 -93 168 225 -12 -160 -119 164
7154 164 100 278 180 103 129 112 -142 71 -205 -390 124 42 -265 -161 -50 287 -134 85 -48 -130 38 -25 -159
7177 -159 -48 -290 -146 -89 -12 126 -195 328 7 165 -5 -12 31 -43 99 -35 -56 42 -61 262 -77 -61 83
7200 83 0 117 -125 57 -117 27 -242 -10 52 -71 108 45 160 -190 23 -305 -69 -280 -199 43 -390 -238
7222 -238 81 -10 -84 24 -42 24 211 16 55 -25 126 -115 45 -140 -112 -213 156 -34 361 -127 -240 87
7244 87 1 -102 -8 17 66 -68 -90 23 -41 -213 -4 222 -28 99 166 10 51 -103 -155 -158 -21 -65 206 -193
7268 -193 -102 -12 -87 -5 68 155 -111 -142 -82 67 111 -169 85 97 -269 -198 -146 -78 -23 -159 33 -38 -320 -128 -143
7293 -143 -221 9 106 150 167 -8 -71 1 93 46 -281 93 -117 -309 44 230 -357 -39 -33 6 32 -9 -179 225
7317 225 199 -191 164 212 153 -177 -132 -130 -41 -29 98 47 -261 25 4 -57 -153 -185 134 24 -19 57 -69 -126 325
7342 325 38 -56 306 -98 66 42 48 333 117 -34 53 108 -130 -69 121 -113 206 -82 -26 -225 152 96 -41
7365 -41 68 98 -110 22 -82 24 -228 -122 -27 103 -44 -181 46 -185 -312 -133 185 10 112 -99 -72
7386 -72 214 188 209 -48 131 11 289 146 -103 67 -26 -85 -33 110 -53 195 113 89 155 175 133 81 -37 35
7410 35 -342 -139 40 -204 72 176 -42 60 -12 -48 84 -80 -301 277 66 263 174 40 -42 -125 -51 -3 -283
7433 -283 6 -133 -40 144 37 -58 -68 114 -94 64 -51 -117 34 -172 -77 -25 -171 172 23 -137 -292 59
7455 59 58 -207 -105 99 48 -40 3 -15 37 -130 -97 125 176 127 -28 -468 -47 196 -34 -44 -93 -182 242 -16 -123
7480 -123 114 -219 -257 33 -86 -172 -326 41 73 66 112 -5 118 -263 59 42 245 523 -28 98 -5 256
7502 256 -22 -236 -21 62 -163 -141 256 63 187 50 171 -169 151 62 -203 73 38 311 8 5 -103 -129
7524 -129 -103 -329 159 -213 188 -75 -53 -148 -120 146 130 -136 127 -50 -92 113 14 241 47 345 -5 -6 -145
7547 -145 -283 91 -89 -266 -86 84 -96 115 -193 175 132 -109 31 23 180 44 -143 102 -22 71 -77
7568 -77 31 -40 26 -101 164 -33 85 -84 -5 -114 -92 114 35 -317 -24 167 189 112 14 38 -4 -15 55 -160
7592 -160 -70 -193 130 -175 4 -92 -5 102 68 -104 18 -231 88 201 -37 59 203 -25 -214 -91 -86 36
7614 36 -58 -182 -92 -257 -126 86 -39 114 53 -38 143 42 111 65 105 -119 -23 -161 88 -13 -30 282 -193
7637 -193 263 60 -156 23 151 41 166 -38 -36 4 93 -28 -134 -49 5 -33 -197 -13 -253 52 -17 -138 221
7660 221 -122 -102 -121 -55 81 73 181 65 287 -22 -8 77 78 -153 141 111 228 280 -124 -149 -225 -44 -25 123 51
7685 51 -146 -225 -138 76 150 -52 -68 164 -126 -141 -7 4 -25 -77 -174 -122 -135 -110 -76 -159 -76 47 186 29 -37 29
7711 29 -6 -48 -200 42 -147 266 -84 148 -217 -172 -286 17 14 -55 44 -43 -90 -67 290 -353 -80 100 -241 140
7735 140 -127 120 80 158 93 -93 171 49 -308 -78 -90 15 -180 -205 -191 173 44 224 -142 -82 169 -42
7757 -42 74 -151 62 -174 -98 -105 107 -150 -60 -16 89 135 82 21 -5 -12 40 24 -88 -80 -63 146 -268 -93 -9 88
7783 88 20 -89 -113 14 -95 -255 -193 -105 -48 -204 70 -199 -92 31 210 -34 -100 -12 10 -2 67 -108 -105 -148 -38
7808 -38 25 29 -95 52 47 49 -54 -48 54 15 -144 -105 -101 31 164 -13 -37 140 250 -175 -44 26 -18 -84 177 -103
7834 -103 -185 -155 -21 174 -67 -20 -97 176 -90 -152 -74 161 31 22 84 -126 90 24 -152 15 332 -69 34
7857 34 310 73 89 -88 -110 38 -3 84 191 24 186 172 -82 -157 122 -23 35 103 -177 123 10 -161 166
7880 166 -91 79 24 104 140 101 -30 -37 -2 -192 -131 18 85 -99 -66 -37 -26 -58 109 48 -36 -43 13 -91 -52 -250
7906 -250 95 -77 -54 -181 -85 -274 -151 346 281 25 -256 182 284 -127 -135 2 -24 -84 -251 -144 -271 -49
7928 -49 -222 -359 41 57 167 -43 85 -295 -115 -157 129 -9 -222 23 133 -45 128 23 -23 -155 -113 -10
7950 -10 3 153 -285 1 -92 -139 88 -223 19 -75 -172 1 30 110 102 118 -4 125 -9 29 155 210 -189 -221 73
7975 73 -135 38 -197 76 -73 -10 123 151 -129 85 -28 15 -18 5 -125 -253 -139 -11 -247 112 -109 18
7997 18 97 -5 -123 0 -189 11 -79 66 -324 48 72 -21 -109 3 -33 23 44 61 -263 -98 37 42 27 -16 -8
8022 -8 -11 142 7 -4 -45 -48 -163 -69 25 44 -70 100 -23 261 7 -46 5 185 -199 47 -62 127 71 0 116
8047 116 -88 -112 198 75 -109 -30 -90 -76 -79 82 72 -339 17 -135 209 83 56 12 119 109 14 -75 111 64
8071 64 48 -48 -152 -31 84 187 -60 174 -32 -7 26 78 -138 -459 -10 -75 164 145 -65 -49 341 127 -61
8094 -61 -143 -109 68 -85 16 193 -133 -24 30 36 82 67 -141 25 284 49 -5 -159 -69 -219 -113 35 50 32
8118 32 67 -60 -7 -159 45 -89 -17 -139 -84 136 -116 -242 104 -34 154 92 -4 -73 -193 -127 -179 -74 21 152
8142 152 -429 124 -165 -158 -165 5 -107 7 89 -72 330 122 68 -9 -128 220 92 356 -114 -33 -335 -156 172
8165 172 50 -29 -73 17 10 116 531 73 -1 36 51 200 -118 -47 21 -52 121 -63 47 33 1 65 -27 261 -49
8190 -49 30
8191C0
$$ Imaginary data points
##PAGE= N=2
##DATA TABLE= (X++(I..I)), XYDATA
0 0 0 0 0 0 0 0 0 0 0 0 8 -8 8 -8 16 -16 24 -24 32 -40 48 -56 64 -75 88 -104 120 -138 160 -184 209 -239
32 -239 271 -308 348 -391 438 -491 548 -612 682 -755 838 -928 1027 -1135 1253 -1381 1521
49 1521 -1675 1845 -2033 2242 -2473 2734 -3026 3359 -3744 4188 -4714 5347 -6121 7102 -8377
64 -8377 10118 -12649 16657 -23993 41690 -174341 -51517 290576 -157349 -131143 157267
75 157267 -2481 -103044 92898 -4972 -42394 82899 5138 -79700 54516 64211 -5843
86 -5843 -3871 -2634 -25681 -9094 769 4388 -30198 -44833 4813 10297 -44750 -10324 53272
99 53272 36817 -17129 -33893 18618 77383 22189 -45338 -5271 31494 -2115 -26403 -20134
111 -20134 9968 18457 -38092 -54651 17260 38627 -7083 -24309 -16723 1529 25866 16765 2161
124 2161 19122 23663 3383 -6442 -3914 3760 5770 -7646 -24992 -29709 -5187 28312 5652
137 5652 -38054 -16268 21927 7517 -9579 2433 18432 27395 3852 -27416 6066 50604
149 50604 10922 -43897 -22813 18450 8388 -20817 -16200 5357 1996 -15931 -16172 -451 14140
162 14140 13449 -34 -1909 9071 14070 17161 11623 -13895 -19304 8681 12622 -14083 -14980 7917
176 7917 9096 -17332 -30899 -2985 28077 6493 -28161 -7825 31426 22445 -10298 -9090 14583
189 14583 15023 -6825 -12710 3984 14283 1797 -15093 -15416 -4011 -91 -4126 -5263 -6457 -3427
203 -3427 9639 12315 -326 -323 13300 11295 -6227 -11717 3715 17422 4043 -19056 -11790 13739
217 13739 10067 -17094 -20570 2557 11853 -5716 -15516 1080 19292 11061 -8253 -5957 12847
230 12847 13942 -3607 -7798 4282 6030 -2503 -6176 -6307 -5043 -758 -1175 -5032 -4869 1307 7384
245 7384 6012 -4365 -6714 8266 13321 -4674 -12902 7258 21460 2936 -16683 -5688 12178
258 12178 2808 -18318 -14814 7011 9165 -9144 -11141 9070 16223 -1265 -10095 850 7589
271 7589 2818 -133 2643 2476 -747 298 1807 -3153 -6604 -709 2742 -6996 -11797 2102 14477
286 14477 2416 -14139 -5624 13078 10397 -6538 -5274 11785 10868 -7411 -11117 5385 11638
299 11638 -4058 -15547 -5874 6827 4286 -3153 -3412 692 549 -3177 -1903 3288 5822 2844 307
314 307 -499 129 4666 6841 -714 -10564 -8294 2980 5497 -2803 -5458 1906 4575 -5025 -9129 2017
330 2017 12263 3305 -10606 -5408 11889 12925 -1934 -7538 1232 3477 -5762 -7523 3304 7995
344 7995 -1925 -9108 -3526 3976 3613 101 -1634 -2412 -2500 1775 6738 5052 -2009 -1973 2159 -159 -5311
361 -5311 415 9811 2483 -12307 -9726 6695 8736 -5140 -9781 971 6296 -1217 -3366 6598
375 6598 10873 -1073 -10621 -3131 6866 4469 -2142 -2059 502 -1072 -1400 3007 2558 -3826 -5879 -1975
391 -1975 -761 -1508 3717 8396 2659 -6143 -4336 5466 8134 -1155 -7312 -1426 3805 -761 -3718
406 -3718 2804 5887 -2813 -9502 -3750 5399 5204 -886 -4170 -1461 1398 1088 684 3509 2837 -1212
422 -1212 -2601 831 2784 1896 37 -3116 -6158 -4900 1538 5375 2630 -2895 -2636 2439 3207 -1421
438 -1421 -1268 2414 751 -5929 -3503 6509 9408 1031 -6261 -3361 2263 -539 -4581 -392 3540
453 3540 -1887 -5676 21 5648 2798 -1185 -1306 -886 -973 1478 4743 3930 -2023 -5122 -1121 2872
469 2872 -560 -3383 1629 2823 -3889 -4646 3477 6146 -1801 -6791 -1775 3967 2567 -913 1451
484 1451 5073 657 -5497 -2727 3570 1787 -2796 -2374 -101 -664 -251 1759 1411 -2240 -3613 -644
500 -644 2610 2022 316 1721 1968 -1786 -2988 1808 3723 -810 -4302 -1817 1951 1935 -552 -923 1113
517 1113 587 -2685 -3455 2041 3548 193 -1815 -83 2348 2397 817 -525 -455 -689 -2153 -907 2328
534 2328 1576 -1314 -933 -374 -1709 -1378 1896 2216 -881 -1382 1189 2705 322 -2484 -870 2282 -149
551 -149 -3516 289 5280 1859 -4624 -3289 1498 528 -3046 -1954 2457 2808 -932 -609 3048 2117
567 2117 -2263 -2251 857 70 -1521 853 3243 675 -2154 -1078 1104 -620 -3210 -1036 2902 663
583 663 -3160 -221 4536 2023 -3037 -2261 2181 1916 -756 -608 2001 1801 -2082 -3509 -253 1721
599 1721 -870 -1743 475 1469 -158 -189 473 -70 -987 -810 23 825 1083 1030 1618 643 -2039 -2360 140
618 140 1317 -1124 -1965 270 1117 437 -381 627 1264 -306 -2628 -1011 2470 2740 -561 -1278 1079
635 1079 1120 -703 -896 526 394 -2041 -2171 409 2140 898 -822 -69 208 -862 -926 2222 2386 -540
653 -540 -1748 706 1468 -429 -1077 1060 459 -2372 -1759 1979 3150 -580 -2659 -868 325 -501 -562
670 -562 1776 2395 -304 -1872 745 3026 422 -1972 -685 8 -1473 -433 2173 1898 -994 -2323
686 -2323 -804 455 573 -306 287 873 -85 -685 1806 2516 -91 -2153 -1278 -29 -235 631 1189 544
704 544 -1065 -1597 -369 1323 1412 -276 -1260 -141 102 663 1168 1215 -370 -1784 -1017 789 1558 878
722 878 -47 -1199 -1079 -587 -326 543 442 -781 -1242 268 1879 1495 340 -407 -744 -1467 -1013 1214
740 1214 2141 625 -1029 -729 200 583 -134 -564 -400 -1661 -1620 545 2353 1358 -526 -626 45 -6 -141
759 -141 998 1312 -488 -1405 -356 1299 944 -587 -879 -675 -1186 -910 748 1850 80 -1610 -1178
776 -1178 828 641 -70 783 694 -705 -1236 553 1853 142 -1884 -1459 -524 -162 194 1238 1185 -836
794 -836 -1772 -678 898 778 -154 -484 -16 241 482 1372 1366 -29 -1798 -1684 -383 485 265 200 -235 -494
814 -494 -485 458 833 773 -456 -993 -53 566 1394 671 271 -406 -541 -546 -164 842 683 -826 -975 -266 314
835 314 -90 -10 107 -389 -996 -90 1723 1794 428 -789 -8 -20 -528 -16 809 347 -1082 -961 463 703
855 703 -402 -858 -11 -101 -427 363 1504 1224 -429 -923 -4 883 -356 -350 203 182 -430 -477 813 873 -632
876 -632 -1538 -589 -203 -350 251 1107 667 43 -529 576 1065 -121 -326 -129 104 -402 -334 213 163 -465
896 -465 -1001 -153 102 113 255 439 391 4 -88 243 514 383 -5 119 28 381 404 -137 -464 -530 -953 -1228
918 -1228 -104 236 111 77 403 506 121 178 -10 184 67 -492 95 1020 579 -242 -90 -334 -685 -1318
938 -1318 -116 518 201 -329 -219 590 322 63 263 469 32 -535 93 1218 324 -655 -444 -96 -812
957 -812 -777 -24 561 449 -521 -99 297 288 -287 155 574 -184 -366 615 1590 472 -595 -543 -562 -505 -488 98
979 98 154 -111 -335 -240 372 366 -258 -57 -185 -494 -132 1066 1076 367 -278 34 -422 -130 184 -116 -358 -360 -509
1002 -509 199 615 165 -521 -387 -82 -150 668 857 389 -266 -437 -312 46 325 205 -621 -613 -361 5 293
1023 293 -76 115 -920 -778 -260 800 1384 300 -94 11 -47 -114 318 371 -80 -874 -626 600 992 302
1043 302 -192 -412 -608 -1020 -149 1029 757 -315 -346 198 762 253 -112 148 -181 -924 -527 586 945
1062 945 -55 -573 -246 67 -326 233 684 173 -946 -310 665 944 339 -247 -379 -272 -328 382 993 689
1082 689 -607 -988 -319 197 209 408 -41 8 -215 87 614 786 35 -768 -709 191 285 588 709 131 -462
1103 -462 -639 -351 43 71 -381 -844 -22 400 612 322 562 -81 -671 -833 124 917 409 -315 -561 -141
1123 -141 44 223 196 229 -382 -1132 48 761 865 -81 -59 -143 -295 -379 510 893 -131 -750 -197 342 107
1144 107 -183 -227 -298 -597 -659 355 1073 204 -698 -812 106 9 -354 567 621 -182 -763 340 501 322 -678
1165 -678 -611 -414 -498 -83 237 632 330 -435 -406 70 206 -9 28 -199 -374 -232 411 546 217 -352 -520
1186 -520 -400 33 684 193 175 -258 -240 -284 20 497 -157 -229 113 267 357 320 226 -102 -338 -717 -286 83
1208 83 319 113 207 168 -70 -238 31 146 -178 -517 -310 557 406 245 48 293 -229 -491 84 376 117
1229 117 -147 86 300 269 -39 -2 -110 -252 -443 -76 693 883 -189 -107 127 119 -646 -143 254 274 -412 -238
1251 -238 293 213 -400 -381 174 -200 -359 -291 558 169 -134 -468 -9 -291 -341 105 442 24 -321 -90 242
1272 242 381 -194 -416 -199 -258 -168 -21 328 438 -13 -363 241 44 -255 -238 -156 -26 -97 399 200 639 147
1294 147 -393 -439 -217 38 41 419 310 28 -291 -172 245 96 -68 -23 21 143 -34 -136 379 287 -336 -323
1316 -323 198 496 154 115 161 -142 -568 -355 46 528 -446 -595 -27 383 113 -61 -104 -145 -315 -502 162
1337 162 561 264 -223 43 271 -265 -98 107 30 -268 -586 224 448 221 -89 -164 -193 -414 -444 207 183 -110
1359 -110 -195 -19 152 238 -134 -98 -86 -528 -597 297 674 45 -134 -283 -294 -364 63 168 351 -224 -366 64
1381 64 266 135 -98 -4 -240 -56 74 360 635 155 -433 -528 -7 263 -102 -9 -66 -69 52 372 196 207 -173
1404 -173 -827 -603 319 254 122 317 -131 -46 -106 -177 209 -38 -407 -336 349 372 188 237 188 -458 -560 -235 352
1427 352 315 -276 -154 -97 -124 35 50 304 -298 -458 -168 641 627 44 28 57 -258 -237 235 344 54 -216 -76
1450 -76 90 187 -114 -30 -35 -394 -216 147 577 500 -18 -108 -278 -487 -198 249 309 -20 -182 -155 256 399 -162
1473 -162 -449 -278 -87 -75 23 525 275 -100 -364 -161 179 154 -14 -299 -336 -505 173 286 405 -119 -396
1494 -396 -142 -206 319 59 141 65 -364 -311 -112 442 327 -418 -366 69 142 250 173 256 85 -726 -215 430 347
1517 347 209 2 521 319 -18 -36 123 108 -416 -366 143 681 246 174 -37 -142 -339 -267 408 407 -526 -231
1539 -231 386 353 201 45 13 -56 -561 -99 59 290 95 -382 -153 -80 -108 -224 33 275 -410 -165 200 421
1561 421 299 -104 -240 -212 -58 17 362 329 -241 -28 -104 -220 -254 -114 -13 99 -242 -165 326 235 90 -227
1583 -227 -337 -91 90 107 58 537 -17 -181 -192 196 -50 -167 -230 -19 -29 -35 5 54 74 104 -312 -152 -1 175
1607 175 141 303 117 -182 -117 403 132 -145 -447 -160 144 -85 -86 160 261 -136 -540 -68 361 237 -319
1628 -319 228 76 182 108 29 86 -124 -274 -217 149 211 285 87 -26 -294 -385 176 295 -54 -43 39 397 -17
1651 -17 -253 -69 307 -118 -521 -171 438 375 -520 -235 55 -43 -211 -219 260 74 -273 -417 -14 119 214 92
1673 92 -307 -156 -46 405 524 7 -186 -60 -230 -240 -141 -233 246 -31 -183 -303 407 257 -115 -180 -98 58
1695 58 -249 83 191 388 -353 -213 -56 502 4 -395 -290 100 320 19 63 164 48 -36 -52 -71 341 65
1717 65 153 91 -63 -344 287 85 -126 -390 -352 150 121 89 463 378 109 -509 -238 272 451 -417 -288 356
1739 356 194 -437 -78 97 197 -371 -333 112 395 364 233 -37 -330 -408 26 491 -42 -144 123 143 63 -70
1761 -70 271 99 -83 -435 -249 264 437 -114 -112 67 32 16 -165 36 327 153 -175 8 449 263 -232 -410
1783 -410 -329 49 71 -85 177 44 -65 -109 -68 40 174 -17 -127 -142 -95 396 437 -284 -456 -204 173 127 -8
1806 -8 47 143 -281 -440 -183 153 477 -155 -408 -310 252 546 17 128 283 -195 -340 12 175 366 29 72
1828 72 -109 103 423 97 -178 -373 -197 121 220 -143 191 233 116 -221 -294 266 369 -561 -346 253 291 111
1850 111 -10 10 140 -142 -227 139 226 370 198 -309 151 129 -75 38 10 -33 -124 -29 76 -1 31 276 -426
1873 -426 -422 -189 431 212 136 -105 58 327 273 -190 -366 144 16 -280 50 229 334 -45 -460 -169 210
1894 210 -147 42 -209 147 185 19 98 170 49 53 -87 -130 114 126 101 -224 -157 -289 -100 271 -208 -166 187
1917 187 116 -78 -351 153 459 -53 -630 -142 418 358 -314 -57 356 -138 -404 -147 42 108 -90 -293 -47
1938 -47 248 -125 193 -138 3 190 -67 77 -107 2 -82 132 -108 -299 82 352 -9 -161 -91 144 250
1959 250 -177 -6 353 95 -307 -423 -3 338 94 -6 192 -74 77 -132 -107 22 24 0 -10 263 215 -114
1981 -114 -159 -75 235 135 253 -51 152 149 257 -8 -204 -198 40 292 -107 -138 126 112 187 -319 -584 262 18
2004 18 -207 -275 340 137 -40 -109 190 102 51 -101 -139 57 45 188 53 -61 8 -121 -3 22 -242 398 245
2027 245 -25 -449 40 409 53 -232 -212 288 308 -193 -131 138 235 -220 -419 -99 59 81 -335 182 142 301
2049 301 -37 -62 42 218 -197 116 72 -22 115 -21 -300 -242 53 132 188 -115 97 102 160 -212 -209 323 -80 -70
2073 -70 -150 146 358 -113 -298 -262 254 55 -28 -86 -10 168 238 -138 -64 192 13 -23 -216 161 105 310 261 258
2097 258 122 -39 270 48 -184 -193 2 36 -172 14 293 174 -210 -204 -137 177 119 91 349 253 235 -328 -2
2120 -2 305 -235 -216 -238 -37 288 52 116 78 -79 88 -126 138 -27 197 34 186 -219 15 445 173 -192
2142 -192 -275 -24 53 122 176 367 64 -26 -393 113 440 154 -54 -203 146 181 138 113 -148 -137 -120 -35 64 121
2166 121 72 84 38 -9 120 182 -246 -248 -283 -118 137 247 0 -89 211 -125 -63 -76 15 262 9 -110 183 7
2190 7 -34 -181 6 97 -124 -178 221 275 -2 -129 -272 -124 163 39 149 60 -140 -84 63 40 119 -231 -234 -134
2214 -134 -6 -58 17 186 10 -10 0 171 147 -21 168 -6 85 -137 -81 147 385 -385 -227 51 -19 107 88
2237 88 152 -6 -79 -13 -17 -14 -46 261 316 109 -67 252 136 -6 -391 -151 29 -158 -72 -140 44 -108 -115 -134 231
2262 231 -85 -14 -323 98 213 274 14 -62 -113 -241 -174 -32 63 93 222 -44 -140 -31 125 168 123 -34 68
2285 68 95 -62 -24 -81 -212 163 3 -74 129 96 18 28 -43 -76 -157 -309 204 171 67 -381 45 289 200 -198
2309 -198 -203 23 235 -2 -108 114 -182 -198 -189 291 -39 -95 72 -98 26 -44 74 47 169 -172 -110 -11 176
2332 176 -10 -126 280 248 76 192 35 153 86 -282 -75 -6 -56 -74 -32 -165 -154 -82 -115 -12 51 -20 283 119
2356 119 35 69 217 0 -446 -63 95 172 -66 -230 103 37 -132 180 -105 67 -54 -182 -54 -190 -168 -186
2378 -186 -92 -243 -57 -70 -199 101 -74 -137 -38 -186 159 250 242 101 360 -128 -333 -15 -82 -44 156 -114 22
2401 22 -202 64 -44 144 274 -458 -86 173 -135 20 96 66 116 -122 57 24 -161 -112 -192 74 61 -300 -206
2424 -206 67 136 -182 45 106 -7 39 -217 -57 -111 100 296 50 -51 -199 -66 17 -324 -127 29 85 -87
2446 -87 -178 127 147 -367 -64 -108 79 83 -12 -191 89 139 -53 143 219 -97 -87 -237 87 -113 3 31 259 -28
2470 -28 -141 -161 104 276 -158 -12 112 44 -129 -15 -85 30 -261 -47 366 217 77 -15 101 34 -442 -153
2492 -153 -154 -1 6 144 149 316 242 -14 -196 -269 65 -222 186 136 323 224 -58 72 -8 53 72 -140 170 -120
2516 -120 212 416 141 -247 -166 -55 140 -128 119 161 -105 6 -262 56 295 -160 -110 79 91 42 -43 -134
2538 -134 -91 68 -41 -41 277 -176 -96 23 -211 29 -61 -101 259 -33 111 -62 -110 -47 -119 197 303 80 -235
2561 -235 -180 180 263 -148 127 83 71 -179 -130 203 87 -148 -168 -152 64 -181 46 -120 42 9 -189 173 127
2584 127 49 169 33 -229 -50 68 92 -104 130 -224 -141 25 -310 -74 147 11 74 -68 298 -13 2 -9
2606 -9 -76 -158 114 -180 55 117 -36 202 -237 175 -376 -93 47 22 199 189 372 222 -225 -16 -122 -83 75
2629 75 -147 -96 -15 -163 -149 57 42 -25 305 112 -29 25 -301 189 230 87 37 50 139 -127 -169 -49 153 -108
2653 -108 -222 68 330 143 -374 -189 122 107 -273 53 -158 -15 -146 -145 105 82 -91 -383 145 -128 -130 -38
2675 -38 -182 73 134 41 -178 302 -114 70 449 99 102 152 12 342 -15 -176 70 -22 -14 21 108 109 62 -225 135
2700 135 106 -244 163 79 -48 14 -22 56 -128 80 -95 -173 57 74 -26 -53 9 -102 40 -86 79 -10 -200
2723 -200 101 26 -93 -350 110 51 196 -97 -70 118 68 -65 253 9 188 -186 28 72 53 224 76 97
2745 97 60 -72 404 178 -19 119 128 33 56 270 204 -9 65 86 -112 150 170 93 172 30 87 184 -32 45 31
2770 31 -251 160 -162 153 -17 -175 102 214 21 -124 30 -117 -190 -40 -60 -143 -93 170 213 7 68 -145
2792 -145 -69 180 -96 -13 17 -140 -39 -171 115 -4 208 69 60 205 180 38 93 -33 39 -265 -37 93 -128
2815 -128 -64 27 -61 -82 -94 -243 344 -297 -157 -243 190 162 15 -13 -106 25 -168 42 51 48 151 28 -55 -150 -121
2840 -121 8 67 -63 265 -24 -68 33 -220 39 234 -139 -169 31 169 8 237 8 -385 114 131 88 11
2862 11 112 -60 23 -37 -177 59 -104 128 -52 103 -15 -98 21 25 224 312 186 258 -35 41 240 -23 77
2885 77 -183 -70 -229 -322 -154 86 105 -21 -202 1 77 74 -338 -191 141 -343 111 95 36 174 107 -160 -13
2908 -13 -103 163 78 232 -6 -154 258 232 -163 261 135 -43 90 -140 42 -150 114 -101 -269 39 69 83
2930 83 -150 -24 35 -230 -198 294 -102 -118 -57 -6 -498 -177 178 45 -231 121 179 139 -23 -248 -88 -81 -36 57
2954 57 -113 -191 81 -110 -169 -40 39 42 -22 88 273 36 -7 34 -160 63 -64 -81 -71 125 -32 -78 86 -4
2978 -4 -279 -166 -49 -268 -143 231 -191 147 -33 60 25 -134 -38 -155 18 -75 41 -190 -53 -100 81 115 406
3001 406 83 125 -165 -48 143 125 509 -133 -109 -266 -139 105 34 78 -57 -15 -129 -170 -45 19 191 22 102
3024 102 94 -5 -259 7 25 -30 122 336 32 21 149 35 49 58 104 73 -151 -188 -68 -22 195 -92 390 31
3048 31 -103 131 -38 10 -163 231 -213 -18 132 32 16 150 -237 184 62 -223 170 -178 -174 123 235 177
3070 177 7 -256 -8 83 -323 -44 116 56 -198 -117 -289 -279 -62 -303 -86 -219 118 -216 279 -239 123
3091 123 -204 -258 -110 -17 43 -204 137 -270 48 33 -65 -62 57 216 279 -30 118 -44 14 -107 -154 48 6 -10
3115 -10 128 -6 -137 -259 187 41 362 -7 -143 60 -116 -19 -72 -140 -50 146 -46 63 216 -150 64 -39
3137 -39 -8 -182 -3 -2 69 13 86 -107 130 -69 -58 36 355 -112 353 -5 -197 -99 179 -150 -217 -56 -177 -58
3161 -58 -127 -165 154 -141 -5 155 91 -119 114 -64 15 1 -23 -63 -176 1 -83 -122 -102 103 -57 -138 -29 -32 216
3186 216 96 -84 -63 -82 11 -22 -40 238 -18 -66 17 37 84 -401 -22 -157 -117 -48 -57 -32 -24 -157 98 -136 45
3211 45 -333 -56 -10 140 -213 145 23 120 207 36 -131 74 38 -4 -67 31 214 -243 153 -163 -97 -132 122
3234 122 -144 -9 -141 -7 179 26 13 -135 -11 -5 101 -79 -121 -152 -15 129 21 300 192 98 -1 347
3256 347 -181 26 111 55 90 -59 -125 79 -143 55 -198 6 -90 251 -111 199 35 136 -238 -82 -140 102
3278 102 70 -5 65 111 -59 -159 69 -205 176 -168 224 110 19 1 -155 267 -175 -66 112 -20 -84 -275
3300 -275 -353 69 33 153 -229 -45 155 17 -165 -115 -191 127 -161 -136 -27 -26 25 34 214 60 109 242 235 68
3324 68 -128 -44 191 113 191 -138 -70 103 170 -11 8 -200 -318 213 108 193 -162 -99 120 -73 -139 -183 115 -69
3348 -69 118 -71 15 -71 -60 -64 -36 21 133 614 -171 45 4 -68 270 -209 -238 184 -22 -86 -34 3 72 -14 -2 -64
3374 -64 -36 -150 97 186 33 34 -311 110 109 -60 -165 94 86 4 96 164 -3 224 278 3 -157 56 27 -115 -57
3399 -57 35 -200 -38 -201 19 224 88 -44 162 194 138 -123 -6 53 39 107 -173 -58 -2 105 -122 -127 145
3422 145 34 20 -76 -15 -256 -10 -167 207 -203 173 195 143 -116 -91 12 15 28 56 -3 -38 254 -79 -21 -175
3446 -175 158 -391 -58 142 195 29 152 330 23 -77 -50 -104 228 -38 -183 27 206 150 -144 -43 8 25
3468 25 -116 24 78 113 150 -131 -121 -158 -118 205 -102 -159 -126 7 109 33 -227 80 -144 54 -124 -124 22 47
3492 47 -69 -21 -50 -234 -13 65 138 -19 135 4 -14 -12 38 -58 80 -14 97 -66 -165 -12 2 90 -57 75 124
3517 124 236 -6 -87 -3 202 91 31 -19 -192 -33 -181 95 177 104 172 -304 308 36 47 -248 -161 171 173 -8
3541 -8 -112 4 -147 41 -12 -474 -182 204 156 -14 -247 11 -39 213 -259 -179 22 77 47 11 17 51 -121 179
3565 179 -286 18 -209 119 -98 187 235 129 -157 36 -77 104 -266 154 233 154 48 24 -119 133 183 -62
3587 -62 -257 -180 194 -25 -80 112 12 84 185 -240 -105 -95 151 35 -174 8 -7 -17 171 145 265 221 167
3610 167 -122 -7 124 -82 110 -107 -55 112 41 70 154 -248 -117 79 19 -167 -247 137 171 -88 -112 182 -229
3633 -229 204 86 92 31 73 -203 -186 84 182 -122 44 47 -133 110 -48 -3 -25 -136 -377 258 -332 -62 5 205
3657 205 -30 35 378 158 161 49 -71 -172 36 -60 46 38 141 128 -218 333 292 -28 271 -250 55 64 -79
3680 -79 281 -193 47 57 35 79 126 190 76 -240 6 108 -64 48 -74 15 -197 -103 -54 -140 -6 -326 199
3703 199 -62 -97 65 114 261 77 231 -6 -67 -63 96 -116 -128 -134 128 95 111 172 -121 32 -64 197 -46 86
3727 86 38 -59 -17 85 -82 123 -84 -184 15 -83 -75 -133 63 -79 -174 1 104 150 136 -100 -4 154 -3 79
3751 79 72 -32 229 -128 -123 65 335 -176 23 -136 177 -52 36 -230 34 230 110 -242 96 75 107 23 153
3774 153 69 -49 35 140 -40 -155 33 -87 64 44 71 40 151 -180 117 32 83 78 -15 -119 -215 159 -84 -175
3798 -175 176 123 96 -47 259 -84 -4 191 -50 74 -117 -17 40 83 -125 -173 -43 -32 3 196 -111 67 210
3821 210 133 76 99 -123 -71 -259 429 -47 -36 -345 -15 272 -64 -68 -60 131 130 -113 -123 -94 206 -98 103 -297
3845 -297 -134 142 174 153 -225 -1 35 231 -88 427 66 10 30 43 -41 -105 27 -61 39 -61 258 79 -56
3868 -56 119 -106 8 -165 8 -11 -148 -39 -175 -17 -69 276 36 -99 -64 5 150 63 29 -242 -156 -101 258
3891 258 -177 143 -97 212 84 115 101 -309 -230 30 -29 -161 -1 49 84 65 -198 210 -3 -56 -40 123 141
3914 141 -119 -78 -40 14 137 -26 -6 49 174 -53 -74 182 122 -84 -78 -313 138 -108 -182 -57 207 -205 72
3937 72 199 -91 -190 335 -65 40 300 56 -92 -65 -19 32 178 124 92 -171 208 -171 80 119 -9 -142 -187
3960 -187 71 24 95 160 56 149 -292 79 -171 -85 -171 -17 197 -112 180 -205 -47 3 143 54 66 85 -15
3983 -15 -174 366 0 121 50 6 -85 -289 -84 -224 -13 211 184 215 -23 213 -78 -19 144 185 47 138 -163
4006 -163 -84 -157 80 -68 -137 -139 48 105 -74 -190 137 -231 2 55 199 175 4 -88 58 -7 111 -180 0
4029 0 -18 -111 -264 155 137 -117 -23 -36 197 -200 143 91 127 -32 243 344 -67 -124 265 45 -11 -134 -62 -230
4053 -230 -127 -88 -300 0 -175 -57 155 -26 237 209 10 -128 30 -96 -202 12 -59 -40 191 -134 168
4074 168 -107 26 63 275 -42 -70 97 15 -99 6 89 79 78 131 -48 79 101 -183 -1 -90 -125 -36 -229 8
4098 8 105 -123 -8 170 -178 59 -290 2 225 -123 -98 -198 -77 113 -182 353 137 30 -254 -88 19
4119 19 -17 -108 -100 -101 61 109 -82 84 94 -135 134 157 -22 64 -6 409 163 111 6 -59 -15 206 201 74 -41 -292
4145 -292 -110 169 -25 64 -227 -139 111 -45 142 -51 -47 -183 132 39 -60 -171 -180 -215 95 30 -28 -96 -32 -117 -159
4170 -159 -19 -93 -171 0 -97 61 58 -127 151 57 -28 135 52 -20 246 -152 107 -186 44 202 -76 225 241
4193 241 -39 41 -146 -59 -42 107 47 -157 31 38 -171 -50 -158 -233 45 -36 234 17 74 -61 -162 -215 -149 54
4217 54 233 116 -209 102 -126 -250 200 -33 -95 -19 62 -47 79 -5 -33 4 -50 -123 2 50 126 22 -33 -26 227
4242 227 -94 -192 -284 193 12 83 -203 -110 143 -112 130 -124 -166 -192 -101 48 -46 -222 -110 -150 194 -98 -140
4265 -140 164 83 -184 11 181 36 86 -10 138 121 -90 -108 38 -248 -379 -51 -223 30 -321 92 -138 64
4287 64 44 106 125 170 -175 140 104 -180 17 91 39 80 75 -185 -137 -184 -327 -134 3 76 -74 -407 127 -116 -68
4312 -68 -24 4 -149 -4 51 -156 133 47 -86 68 278 113 32 -126 -94 44 -129 -249 -145 136 94 -108 -116
4335 -116 -87 -85 189 -62 185 -26 4 -48 -79 141 7 91 118 1 -2 240 -360 -59 -139 148 -79 134 -327 -99
4359 -99 116 -21 16 -11 58 -68 189 95 -11 33 -1 26 56 -186 150 -5 219 -41 -23 -207 -65 186 53
4382 53 -131 -104 -92 -126 249 37 210 75 -63 86 -33 -153 77 -16 -226 231 -85 -210 129 -26 -116 -61
4404 -61 70 244 -11 -137 226 -150 97 357 -140 -167 17 93 45 -80 -110 -392 -81 189 -84 -266 -239 -179
4426 -179 -127 -113 38 235 -98 295 -69 -6 -177 -92 -253 54 -81 217 250 -100 -101 -19 49 -46 -14 -167 131 214
4450 214 -184 127 137 34 110 91 346 -122 -271 26 -80 -69 93 -169 -26 104 -116 -62 -5 30 11 114 -179
4473 -179 137 375 102 -30 -74 -162 105 270 96 -133 -300 201 224 -195 4 22 98 48 216 103 75 -190
4495 -190 138 -20 263 -51 -34 -228 -187 11 -127 -222 -206 -179 -107 -96 -30 -198 196 138 -38 -71 -49 -68 -74 -208 -88
4520 -88 -39 144 -256 12 -150 -90 -72 -93 117 -204 -2 32 127 153 -145 9 -11 -64 242 50 24 41 79 10 -77
4545 -77 -79 98 -152 181 98 20 -75 175 -94 18 40 6 12 -64 97 112 49 -51 -316 49 -89 -90 280 219 -161
4570 -161 -26 209 26 -481 90 92 -118 -21 -170 -205 46 264 65 69 34 -40 -203 -47 38 361 103 -216 -46
4593 -46 -100 209 7 177 -153 195 49 4 -70 166 -36 98 -14 -57 21 -61 -209 -51 49 17 -162 -25 -26
4616 -26 -68 256 -133 80 149 163 47 167 -118 -103 -64 -1 9 61 -43 -57 -101 176 -1 54 -109 60 -81 54
4640 54 -289 41 -41 113 71 63 88 114 144 -331 42 3 15 -165 -25 59 9 -25 176 15 33 92 1 195 -123
4665 -123 -163 -32 33 -16 -5 6 81 129 -363 77 -64 -25 -141 137 253 141 130 -123 -14 -245 133 -87 -53
4688 -53 -46 211 -29 47 74 -105 -46 377 -93 193 125 140 105 74 31 -96 -62 182 124 178 -218 -43 100 -3 84
4713 84 327 -85 -206 122 -46 -36 -235 -92 58 -50 48 -228 -251 -90 -80 114 -97 -39 -169 -68 -350 -200
4735 -200 -29 -123 99 -69 -38 -34 -96 -79 222 -193 -32 -158 1 -187 -106 60 -37 -37 -8 233 -114 -45 -60 70
4759 70 95 27 15 14 -47 376 -3 117 182 41 -219 -10 32 -166 136 -249 -21 31 -65 98 35 -263 9 -105
4783 -105 -160 -61 -24 81 -49 198 21 -147 87 -80 -207 37 -55 380 -14 -37 -161 49 173 -41 -128 -27
4805 -27 -159 -118 -240 -241 -91 226 81 78 -31 -5 -114 -193 -112 -75 272 -129 0 -170 -1 79 9 -37 24 216 -111
4830 -111 180 270 21 -83 -48 -84 -239 -52 -99 -39 236 159 -50 9 0 -101 7 22 91 93 177 153 65 21 245 -4
4856 -4 -39 196 -57 -8 -270 83 -19 -79 -9 -125 -61 183 -128 -76 74 -39 -126 -8 57 26 -23 129 136 293 67
4881 67 52 36 -312 54 -136 17 -7 -139 154 61 -49 59 118 37 218 100 405 42 -16 42 15 69 147 10
4905 10 -12 49 -15 117 -190 -78 177 -184 33 -163 -27 116 -28 75 -217 -65 98 -366 -35 48 -122 -14
4927 -14 -58 104 -49 74 -301 158 84 -134 75 -288 92 -74 -42 -372 -21 -54 -154 131 -26 20 110 218
4949 218 69 48 -419 126 267 -17 -160 -58 -45 -21 -1 -308 -53 -246 -369 64 216 139 -46 -14 -182 86
4971 86 148 -329 -117 101 -299 -81 47 -146 23 -28 25 -340 147 321 294 -361 105 251 -50 -3 -115 -51
4993 -51 -59 91 -138 55 -51 185 39 19 -101 -26 100 -9 115 -58 144 39 78 238 -206 36 20 -150
5015 -150 -41 80 -203 14 8 -2 -42 -153 153 -52 158 -45 -10 46 143 23 79 45 -104 168 7 -176 53
5038 53 -229 52 42 147 -50 37 367 9 -11 -395 67 34 -174 -113 25 -63 44 -132 -70 -92 -3 80 -180 52
5062 52 80 244 82 137 224 -24 -114 -63 -40 204 -47 -50 96 -213 115 -36 183 37 95 -157 75 30 -74 -37
5086 -37 -207 223 166 -105 42 153 -140 51 -36 77 232 -19 54 -189 -122 -46 81 36 -147 -168 48 -46 -151
5109 -151 214 52 -200 127 117 74 115 -8 6 82 134 -77 31 239 -250 -170 -44 -59 -242 -192 14 4 -166
5132 -166 -68 -45 -76 -108 159 20 230 299 79 -165 174 43 69 360 11 17 198 -148 -99 -17 -83 -103 154 116
5156 116 278 122 43 10 -18 -59 72 -27 -31 -12 17 -8 -119 113 10 105 -62 99 -256 45 104 -161 47 -153
5180 -153 92 98 -155 26 -318 34 43 43 -126 -68 -27 -65 -120 -70 102 78 -8 186 70 65 84 -11 59 -66 -185 220
5206 220 41 -198 -40 -25 -63 -145 79 -179 -15 6 -334 132 -32 254 60 226 162 -34 -168 -144 171 -18
5228 -18 -49 332 -199 173 361 136 14 102 229 -99 -68 -8 -189 -148 67 55 -146 20 -10 88 91 182 -50 -1
5252 -1 -288 -279 -245 -91 47 -205 154 206 -187 -82 14 -8 -95 5 -32 54 -46 46 -52 -246 158 26 227 -8
5276 -8 53 42 67 155 -99 28 44 -167 -222 -107 133 -128 -102 158 81 -178 -131 12 -59 -68 -100 51 164 4 15
5301 15 -51 18 42 -135 130 18 -88 -216 14 33 74 -140 -65 180 -66 18 -90 222 92 249 -63 13 -47
5324 -47 -290 -114 -45 342 6 -183 -88 -2 50 14 65 69 -1 230 212 -46 134 -42 4 64 -24 -40 -226 40 -168
5349 -168 -145 -111 222 -173 12 39 161 -134 57 239 -65 -53 -269 -186 10 199 -96 292 38 -22 15 148
5371 148 31 107 -257 21 -251 101 279 -86 69 175 -125 -66 -94 126 -81 241 -115 100 -46 212 -29
5392 -29 -95 -112 -28 207 89 167 132 -149 -345 185 -118 -180 25 -38 153 270 -91 -217 179 -100 41 -149 -176
5415 -176 41 45 202 -20 -281 -115 -44 114 -113 -87 33 -106 -165 306 122 -98 103 -142 -150 -73 278 84 58
5438 58 76 136 -71 -42 131 74 88 68 -40 -36 34 140 -57 -20 13 -44 37 53 31 57 250 197 264 -44 15 296 35
5465 35 9 72 116 127 -281 106 -166 268 -87 272 -36 -91 -96 -87 306 37 40 -318 -186 -80 -270 -75 219 -61
5489 -61 59 116 4 -36 -286 -127 130 -88 -224 -130 2 -127 -90 236 -146 -233 143 -31 -12 225 -10 167
5511 167 -68 102 -193 -125 31 68 -253 -39 -169 236 -247 57 86 -41 -249 130 78 -289 124 -43 114
5532 114 10 407 -173 35 -110 119 31 159 -84 -101 -74 -49 99 147 -11 18 -37 105 -62 -62 53 50 -43 -63
5556 -63 99 -89 447 14 -215 -177 107 37 -76 -259 160 -123 -272 -221 26 -161 -273 -107 -57 70 38 -181
5578 -181 -45 146 53 -188 -4 165 -64 70 367 -78 -235 -296 -45 -103 109 -133 -159 -34 -66 -78 -342 248
5600 248 -152 170 -249 208 -49 56 -5 -150 167 -70 -38 -22 -104 3 -4 -48 9 320 210 133 248 -23 98
5623 98 -92 -127 -134 -54 -57 42 47 263 86 -134 -117 22 5 -99 -5 178 -84 -1 -92 106 28 24 -60 98 -57 109
5649 109 106 -199 21 -11 -91 -86 151 63 -82 -56 -188 -127 66 -90 -265 217 60 -260 67 -61 178 130 -38
5672 -38 -66 -64 -32 94 298 -51 -229 -130 -91 -104 -89 -52 194 -224 130 362 44 23 14 -35 1 -72 -1 -160 67 -142
5698 -142 267 -337 -14 -111 -60 -117 -141 163 -80 -12 -16 212 83 -90 325 -115 68 -44 -47 64 -70 123 -24
5721 -24 -21 68 133 -25 -51 202 363 -85 -111 -51 -54 -217 -34 39 -67 -22 54 -283 -12 17 -60 177 -176 172 -193
5746 -193 -125 -244 -192 -83 19 -92 -80 221 27 52 -28 6 8 -182 -242 72 -76 -201 88 114 98 -228 113 -58
5770 -58 -27 -98 -107 -23 5 92 66 -98 -91 20 -113 -173 6 -31 211 323 3 30 -50 -33 -39 69 -217 -85 -83 -241 -199
5797 -199 232 -76 118 66 -92 63 63 82 -71 -16 -130 234 273 145 -142 -67 -62 42 168 -175 51 -109 -19
5820 -19 75 -28 263 -50 -109 -73 73 -14 -27 -61 217 127 -43 16 16 42 -183 258 -91 123 20 148 -158 46
5844 46 -235 127 196 82 -24 -103 -222 37 107 162 -203 -104 190 91 74 -221 407 -194 105 -20 -132 242 118
5867 118 -4 74 157 -163 -98 -335 12 182 12 -172 195 105 -87 -398 -27 107 137 -137 -10 84 -137 7
5889 7 -298 79 -149 22 -142 -7 122 -40 77 143 99 -37 -170 -216 -127 176 81 309 38 149 -72 -18 79
5912 79 61 42 27 -195 -121 88 198 133 42 -129 -274 -28 -33 -219 345 89 160 156 -116 12 -137 -113 -31 -196 45
5937 45 -5 -49 -56 50 -81 156 -31 167 23 102 -123 -75 455 229 -280 5 -337 -40 -316 19 114 -185 -81
5960 -81 -2 -164 -191 140 29 208 -144 -20 -3 83 194 -92 -49 7 223 -99 29 -20 220 64 -55 169 -106
5983 -106 -65 156 129 75 47 -205 142 -111 44 -52 -32 -34 -85 -17 -243 -244 -85 -359 -69 23 -4 -53 -146 -59 -158 -169
6009 -169 47 -5 -63 -11 -32 88 -8 207 11 88 -52 -64 -32 -236 79 -109 10 43 169 -34 180 -169 174
6032 174 63 -3 152 -167 -99 -240 84 -78 20 214 -138 -140 -104 -144 -24 -35 -139 153 -30 -257 150 -239 -33
6055 -33 -96 169 46 68 -197 -112 -94 76 48 118 294 69 76 148 -49 -27 298 30 94 -10 138 239 54 66
6079 66 -22 286 207 44 179 -66 71 457 -113 -91 270 -243 -164 -121 -53 270 -51 332 -94 156 251 -57 158
6102 158 -14 127 119 -91 196 34 -145 16 -185 -107 28 -46 366 -115 148 -96 -5 -134 -147 213 -46 -83
6124 -83 144 85 -156 104 -12 -26 -194 251 -56 -23 -82 6 -13 27 -144 -129 -162 24 -144 118 -188 87 40 176
6148 176 120 -123 -143 -186 -289 121 -28 44 -179 27 60 -130 -260 283 -9 -12 8 63 102 -82 24 16 -55 249
6172 249 15 44 -282 213 66 -2 84 102 217 -43 92 -48 -32 -41 -2 -27 31 -56 60 -311 204 202 209 -56 144
6197 144 -25 99 -18 -83 79 195 -198 69 87 54 -280 -231 31 19 126 -12 196 84 67 129 -104 256
6219 256 -82 -264 323 -55 -390 -224 -205 -2 9 -39 -102 -46 84 -241 -241 -110 129 -7 -46 75 132 -17 90
6242 90 -111 92 -48 -125 457 -185 -103 -1 -212 116 -46 -56 89 -198 162 -31 84 -127 44 98 224 -204
6264 -204 -143 103 -130 -122 37 41 -6 23 -22 115 -122 123 147 58 97 -83 217 -120 81 53 -152 -108 8 183
6288 183 36 -77 -5 -36 -191 -333 36 135 58 -212 -20 216 -28 122 32 45 -76 77 -85 -1 46 47 63 203
6312 203 23 167 -245 1 225 -196 183 -28 52 -45 -38 280 15 -124 87 198 17 -65 54 89 108 193 -69
6335 -69 36 -212 47 -69 -222 235 55 213 51 235 41 47 43 56 -29 -295 -52 -96 -86 -3 -57 -160 -145 194
6359 194 79 -128 -214 -306 -50 -1 -114 204 -24 25 -294 -97 -165 15 -144 87 -73 -182 -93 169 -17 -253
6381 -253 43 17 10 219 -86 -21 -51 -184 291 -102 -169 -124 -79 236 213 -207 -39 -30 -7 45 -105 -18 88 -261 -58
6406 -58 60 42 -224 -7 -170 -3 -65 229 72 36 28 -162 146 -40 -91 95 147 87 25 190 200 -89 -29 0
6430 0 -183 -24 12 10 80 109 36 6 -46 -252 158 -321 -100 286 216 50 249 184 170 -61 -138 145 38 68 234
6455 234 -253 -236 -157 -149 -134 -84 -157 294 36 -97 -23 30 90 -6 -90 144 -157 -111 -50 75 -69 59 68 -162 -293
6480 -293 40 178 87 -35 26 227 159 -23 -29 -32 55 187 -55 -52 5 47 174 -119 -300 55 182 7 49 227
6504 227 -207 11 103 -137 -156 115 261 60 157 -172 -93 -205 55 -165 -168 104 -28 -40 -82 -89 -120 -12 1 -109
6528 -109 -188 -221 33 75 -113 -48 111 -38 -14 151 -15 33 246 94 -141 -97 -21 -23 33 -91 191 258 -203 -214
6552 -214 -139 -92 -105 352 108 21 67 -347 -53 -115 -92 184 96 359 113 64 -123 -185 -115 -124 5 -83 32 -11 -50
6577 -50 177 -34 143 -158 31 -221 101 -43 -19 283 -52 134 95 13 153 2 -293 -98 131 -55 -106 158
6599 158 -116 138 97 204 -213 68 -213 20 -139 -103 207 156 -15 51 260 114 -214 -223 -317 53 36 -13 205
6622 205 278 93 -57 49 -40 -172 -68 4 7 -46 -157 -155 90 360 -58 119 75 166 -16 -138 154 -69 29 -52
6646 -52 113 -87 -196 -96 19 136 32 -48 61 341 -76 225 114 50 -45 77 44 -12 -190 -224 -56 -198
6668 -198 -93 -141 17 20 -5 83 102 -195 -187 -34 -30 381 166 273 359 96 69 -100 -29 32 82 -32 33 -116 -36 -79
6694 -79 130 -64 179 -97 8 -29 52 169 127 25 -244 -199 -175 145 -161 -144 -93 -183 -256 160 24 -228 33
6717 33 -13 87 -45 104 216 351 134 -20 74 50 -208 73 -55 175 -22 -29 28 -114 -147 -149 202 97 -155
6740 -155 98 163 -121 45 -307 -293 60 -76 -155 -103 1 23 -55 15 -273 -26 -278 139 -94 -116 192 135 -56
6763 -56 -69 18 -321 -18 67 -368 -70 -144 -18 -39 -254 107 279 -122 199 178 53 41 44 18 -198 37 190 -10
6787 -10 -65 -313 102 -80 12 -196 -280 -187 -22 79 -16 -111 97 -37 44 -173 -87 48 24 21 205 -27 -317 160
6811 160 31 347 -33 23 -18 -15 -80 -179 124 258 -43 35 30 -23 228 6 -68 -30 91 19 70 92 -60 -15 -338
6836 -338 -143 -265 203 82 -122 77 -257 -30 -17 -109 -110 218 -167 64 12 21 -136 221 29 65 -7 155 10
6859 10 100 205 29 119 -79 -68 -18 -132 185 -11 -5 136 -26 -14 -140 134 3 -28 -116 -24 126 89 159 38
6883 38 93 73 44 93 142 -74 -126 6 161 -94 46 -18 -253 33 -43 -40 136 -236 -138 208 -119 228 -41 -1
6907 -1 141 40 -178 1 -125 -229 -18 96 -21 163 -104 -336 35 -179 -161 18 90 53 -125 84 104 -104
6929 -104 -58 -5 -162 -37 42 4 -181 -73 -27 59 -2 39 -59 -120 -42 -305 236 47 36 -69 67 242 -29 -35 -172
6954 -172 -2 142 0 -147 36 102 -78 -14 162 101 186 -281 126 -24 -34 109 -76 16 -42 323 218 147 -184
6977 -184 -115 -8 158 162 178 -52 -298 -106 45 116 330 -314 -220 206 -7 6 145 79 84 -17 63 170 -75 -6
7001 -6 47 234 -49 -46 -185 -45 259 -30 11 34 190 -209 248 58 -297 53 186 0 65 95 169 16 -104
7024 -104 307 101 167 137 70 -87 15 -209 137 210 -40 -75 67 -104 -170 -53 65 44 -167 274 4 71 110
7047 110 -31 -136 -51 -237 -51 138 -236 181 -40 29 44 41 -134 -61 -226 22 -87 39 -165 -158 25 -161 265
7070 265 128 170 72 -89 37 172 78 13 34 -178 -234 -71 -72 -155 92 -257 42 105 -19 176 -81 215 -47
7093 -47 65 -7 -56 308 -126 65 11 -7 -89 159 -128 224 -169 90 -209 -31 0 -98 -30 -108 198 -299 -76
7116 -76 210 2 -60 11 68 151 78 -97 -118 229 -41 277 87 155 -100 4 -78 184 -4 -26 -45 -37 221 15
7140 15 -72 131 -247 -51 -140 -128 -162 -37 137 221 32 -83 43 -74 73 154 -20 126 -49 -57 92 11 262
7163 262 -220 -165 -83 230 -153 -157 196 50 -128 -57 101 46 33 -113 -105 -8 132 97 -292 -37 -31 55 -12 -203 95
7188 95 83 187 86 -36 54 13 -68 -115 -68 35 52 52 -185 -265 -15 -173 28 -186 264 152 -120 35 41 -86
7212 -86 87 -177 5 -108 107 23 -51 -155 169 235 -177 -310 -89 113 165 35 196 266 -54 -86 127 -319
7234 -319 11 238 -51 -3 -132 -122 -33 -16 153 -283 137 88 -215 -97 -132 170 -181 68 -72 210 -92 -207
7256 -207 -544 275 78 -69 -511 -57 -80 -245 60 -6 -5 -97 187 53 141 309 217 -136 230 179 -19 77 145
7279 145 147 201 -81 -199 -144 71 38 4 8 38 79 -121 42 -11 149 149 21 149 -175 0 88 -155 147 -116 -182
7304 -182 -109 -30 67 -48 -90 128 -18 53 119 72 -62 -83 -250 194 200 156 -45 -39 -61 -237 -57 101 19 -159 -65
7329 -65 -124 180 343 -36 -9 151 -103 -74 -69 -69 84 162 -280 106 128 140 209 259 6 -196 -142 28 -149 -63 113
7354 113 105 -84 -67 54 -177 -70 8 -51 117 -113 -2 -91 -21 -55 215 -80 128 -44 -43 -153 -235 -307 36 163
7378 163 -274 -25 -62 -23 184 -89 -61 -15 -23 135 -14 -91 -41 -33 -47 234 44 -28 292 153 7 -134 117 -58
7402 -58 23 241 29 -90 -45 -103 57 192 -79 28 103 65 -212 -145 -191 -109 -64 -146 -196 -117 -132 -103 185 157 -118
7427 -118 181 35 -210 -182 -108 160 -49 133 37 371 -15 161 -276 -11 -59 60 -174 -190 114 161 -184 -192 121
7450 121 19 -255 38 5 -194 -33 -102 -174 -189 52 59 -45 -40 -26 39 -62 122 92 52 -9 175 95 168 -17 118
7475 118 -200 112 -32 15 -109 -34 159 246 151 0 -21 214 -11 -129 29 -207 74 163 300 -163 -16 63
7497 63 -66 87 6 -148 -63 -258 16 114 276 -169 293 -178 253 -110 107 93 -317 -32 171 168 6 190
7519 190 67 -23 -17 87 9 -135 118 -63 -10 68 3 171 207 -252 -164 -52 -31 -91 32 45 110 0 201 -125
7543 -125 -228 -160 -109 360 93 228 -1 -111 54 -78 -158 -299 274 -23 -8 -211 -56 179 267 27 -67 49
7565 49 354 -32 -64 352 -86 433 -105 102 49 -289 28 79 79 -45 19 103 131 -416 -259 4 250 208 -21
7588 -21 -121 -195 -57 -188 -117 120 -22 81 29 -100 259 76 234 25 -21 121 115 90 16 -104 -128 38 -115
7611 -115 79 90 -11 22 242 144 21 120 -101 -4 101 -105 -132 4 -97 -16 130 -5 7 -19 -131 87 -42
7634 -42 344 -16 -84 160 -121 -273 -10 -134 9 29 -194 -172 228 -181 145 122 -54 26 20 103 -67 136 60
7657 60 60 -304 61 18 85 -11 -223 205 87 214 -221 -39 97 -118 214 168 -237 -13 -35 -186 -96 -141 166
7680 166 136 -92 -64 145 140 -11 -189 -199 98 -49 173 -49 46 74 214 -148 -279 100 -41 199 -148 -13
7702 -13 234 -171 -22 -259 -108 57 10 -114 103 -1 106 -43 -141 270 -33 -21 -203 46 -125 17 -179
7723 -179 98 42 169 -183 -31 90 -176 -160 -35 -58 130 87 -125 -241 -218 166 111 -93 -71 -29 142 103 63
7746 63 169 159 72 25 276 -96 -33 -161 170 -18 210 -82 -43 74 -43 -123 -134 23 -46 -132 -75 -173 -93 59
7770 59 61 -132 -34 88 12 76 -147 19 -207 -145 268 -119 128 -130 -128 -112 62 -150 437 -325 172 120 1 -76
7794 -76 -168 -24 -86 -13 20 5 -275 65 280 -15 -76 -157 48 121 -23 340 27 106 -24 -121 62 -176 261 -100
7818 -100 13 -143 79 1 37 72 -245 150 -70 -59 18 -92 170 114 -197 128 6 -24 -49 -263 18 -155 -292
7841 -292 -137 -7 72 -66 23 2 4 182 23 144 -251 -47 -140 -117 40 -89 28 77 -251 61 -166 128 274
7864 274 146 -14 -216 -72 -179 88 -111 -164 124 -51 -169 -173 53 29 -14 158 79 73 247 245 -65 -120 -245 101
7888 101 -4 -74 -193 -21 180 47 -131 -147 9 -160 214 -94 -65 -102 -22 -11 -71 88 112 -237 -223 60 -205
7911 -205 258 76 228 -191 40 -127 -112 30 1 69 89 -116 -42 -39 88 -120 130 161 -74 147 47 -63 61
7934 61 139 41 -94 -95 -111 149 -151 104 200 53 44 -159 128 90 -167 -64 190 44 32 -86 -164 66 86 -89
7958 -89 229 93 -48 122 7 228 190 215 -83 303 -75 -118 6 -113 212 -8 133 -77 112 102 -141 -301
7980 -301 215 -208 -192 -11 -121 -43 70 -141 -149 -97 -144 77 -6 9 -8 52 10 18 58 210 108 44 -54 75 228
8005 228 48 183 10 -230 -222 -211 60 -412 -68 87 -351 45 227 163 -94 43 -21 -302 -13 337 -94 -127
8027 -127 -225 -201 -41 140 178 -198 194 -165 172 88 244 -77 -45 69 21 -76 -37 7 -123 37 -73 -77 -20 -114
8051 -114 22 -56 -148 92 -1 304 123 -241 -109 -201 -133 -147 -85 152 313 140 302 26 -101 -193 217 -93 -269
8074 -269 21 -108 -109 43 33 -174 -73 -115 -98 18 32 75 55 -43 108 -32 3 -69 -244 166 34 117 46 -77
8098 -77 71 -75 -45 165 -126 8 -208 -132 2 -196 -214 391 9 -114 137 -2 119 176 84 -1 -112 147
8120 147 -211 165 175 323 236 -36 -34 -100 -182 -135 78 -212 11 -156 -234 -13 -212 -54 0 121 336 -7 159
8143 159 -30 79 -63 -39 -181 59 -5 191 -135 -145 16 -100 113 -133 -91 -115 189 -88 23 -160 -100 105
8165 105 96 -189 -36 -158 -98 0 -59 202 -291 -36 -56 -86 110 -111 70 34 -134 155 -286 142 352 266 -9
8188 -9 88 -157 -23
8191b3
##END NTUPLES=NMR FID
##END=
