##TITLE=1H_DE-102K_EA_TFA
 200.13MHz, CDCl3,
 8 sc
 
 22.8.2025
##JCAMPDX= 6.0         $$ Bruker NMR JCAMP-DX V2.0
##DATA TYPE= NMR FID
##DATA CLASS= NTUPLES
##ORIGIN= UXNMR, Bruker Analytische Messtechnik GmbH
##OWNER= pz
$$ XWIN-NMR		Version 3.5
$$ Fri Aug 22 15:29:53 2025 Russian Standard Time (UT+4h)  she@DPX200
##.OBSERVE FREQUENCY= 200.1308
##.OBSERVE NUCLEUS= ^1H
##.DELAY= (6, 6)
##.ACQUISITION MODE= SIMULTANEOUS
##.ACQUISITION SCHEME= undefined
##.AVERAGES= 8
##.DIGITISER RES= 18
##SPECTROMETER/DATA SYSTEM= spect
##.PULSE SEQUENCE= zg30
##.SOLVENT NAME= CDCl3
##.SHIFT REFERENCE= (INTERNAL, CDCl3, 0, 14.3821)
##AUDIT TRAIL= $$ (NUMBER, WHEN, WHO, WHERE, WHAT)
$$ ##TITLE= Audit trail, XWIN-NMR		Version 3.5
$$ ##JCAMPDX= 5.01
$$ ##ORIGIN= Bruker BioSpin GmbH
$$ ##OWNER= she
$$ F:/spectra/data/she/nmr/H-C/1/audita.txt
$$ ##AUDIT TRAIL=  $$ (NUMBER, WHEN, WHO, WHERE, WHAT)
(   1,<2025-08-22 15:28:10.60 +0400>,<she>,<DPX200>,
      <created by zg, POWCHK disabled, PULCHK disabled
       configuration hash MD5:
       00 E9 B6 7A A2 85 ED C7 34 08 36 98 17 FE 4E 26
       data hash MD5: 16K
       9E 19 B6 0B 3B 4E 63 83 FB 68 A6 F9 10 BF E6 52>)
$$ ##END=
$$ 
$$ hash MD5
$$ 91 B7 B2 E5 E5 39 F9 1B 86 CC 4D 4A 54 01 95 B5
##$RELAX= 
##$RELAX= 
##$RELAX= 
##$RELAX= 
##$RELAX= 
##$RELAX= 
$$ Bruker specific parameters
$$ --------------------------
##$DU= <F:/spectra>
##$EXPNO= 1
##$NAME= <H-C>
##$PROCNO= 1
##$TYPE= <nmr>
##$USER= <she>
##$AMP= (0..31)
100 100 100 100 100 100 100 100 100 100 100 100 100 100 100 100 100 100 
100 100 100 100 100 100 100 100 100 100 100 100 100 100 
##$AQSEQ= 0
##$AQ_mod= 1
##$AUNM= <au_zg>
##$AUTOPOS= <>
##$BF1= 200.13
##$BF2= 200.13
##$BF3= 200.13
##$BF4= 200.13
##$BF5= 200.13
##$BF6= 200.13
##$BF7= 200.13
##$BF8= 200.13
##$BYTORDA= 1
##$CFDGTYP= 0
##$CFRGTYP= 5
##$CHEMSTR= <none>
##$CNST= (0..31)
1 1 145 1 1 1 1 1 1 1 1 1 1 1 1 1 1 1 1 1 1 1 1 1 1 1 1 1 1 1 1 1 
##$CPDPRG= <>
##$CPDPRG1= <>
##$CPDPRG2= <>
##$CPDPRG3= <>
##$CPDPRG4= <mlev>
##$CPDPRG5= <mlev>
##$CPDPRG6= <mlev>
##$CPDPRG7= <mlev>
##$CPDPRG8= <mlev>
##$CPDPRGB= <>
##$CPDPRGT= <>
##$D= (0..31)
0 0.7 0 0 0 0 0 0 0 0 0 0.03 0 0 0 0 0 0 0 0 0 0 0 0 0 0 0 0 0 0 0 0 
##$DATE= 1755862090
##$DBL= (0..7)
120 120 120 120 120 120 120 120 
##$DBP= (0..7)
150 150 150 150 150 150 150 150 
##$DBP07= 0
##$DBPNAM0= <>
##$DBPNAM1= <>
##$DBPNAM2= <>
##$DBPNAM3= <>
##$DBPNAM4= <>
##$DBPNAM5= <>
##$DBPNAM6= <>
##$DBPNAM7= <>
##$DBPOAL= (0..7)
0.5 0.5 0.5 0.5 0.5 0.5 0.5 0.5 
##$DBPOFFS= (0..7)
0 0 0 0 0 0 0 0 
##$DE= 6
##$DECBNUC= <off>
##$DECIM= 32
##$DECNUC= <off>
##$DECSTAT= 4
##$DIGMOD= 1
##$DIGTYP= 9
##$DL= (0..7)
0 120 120 120 120 120 120 120 
##$DP= (0..7)
150 150 150 150 150 150 150 150 
##$DP07= 0
##$DPNAME0= <>
##$DPNAME1= <>
##$DPNAME2= <>
##$DPNAME3= <>
##$DPNAME4= <>
##$DPNAME5= <>
##$DPNAME6= <>
##$DPNAME7= <>
##$DPOAL= (0..7)
0.5 0.5 0.5 0.5 0.5 0.5 0.5 0.5 
##$DPOFFS= (0..7)
0 0 0 0 0 0 0 0 
##$DQDMODE= 0
##$DR= 18
##$DS= 0
##$DSLIST= <SSSSSSSSSSSSSSS>
$$ [...]
##$SUBNAM0= <"">
##$SUBNAM1= <"">
##$SUBNAM2= <"">
##$SUBNAM3= <"">
##$SUBNAM4= <"">
##$SUBNAM5= <"">
##$SUBNAM6= <"">
##$SUBNAM7= <"">
##$SUBNAM8= <"">
##$SUBNAM9= <"">
##$SW= 18.0517779522481
##$SWIBOX= (0..15)
0 0 2 0 0 0 0 0 0 0 0 0 0 0 0 0 
##$SW_h= 3612.71676300578
##$TD= 16384
##$TD0= 1
##$TE= 0
##$TE2= 300
##$TE3= 300
##$TEG= 300
##$TL= (0..7)
0 120 120 120 120 120 120 120 
##$TP= (0..7)
150 150 150 150 150 150 150 150 
##$TP07= 0
##$TPNAME0= <>
##$TPNAME1= <>
##$TPNAME2= <>
##$TPNAME3= <>
##$TPNAME4= <>
##$TPNAME5= <>
##$TPNAME6= <>
##$TPNAME7= <>
##$TPOAL= (0..7)
0.5 0.5 0.5 0.5 0.5 0.5 0.5 0.5 
##$TPOFFS= (0..7)
0 0 0 0 0 0 0 0 
##$TUNHIN= 0
##$TUNHOUT= 0
##$TUNXOUT= 0
##$USERA1= <user>
##$USERA2= <user>
##$USERA3= <user>
##$USERA4= <user>
##$USERA5= <user>
##$V9= 5
##$VALIST= <valist>
##$VCLIST= <CCCCCCCCCCCCCCC>
##$VD= 0
##$VDLIST= <DDDDDDDDDDDDDDD>
##$VPLIST= <PPPPPPPPPPPPPPP>
##$VTLIST= <TTTTTTTTTTTTTTT>
##$WBST= 1024
##$WBSW= 4
##$XGAIN= (0..3)
0 0 0 0 
##$XL= 0
##$YL= 0
##$YMAX_a= 104328
##$YMIN_a= -123026
##$ZGOPTNS= <>
##$ZL1= 120
##$ZL2= 120
##$ZL3= 120
##$ZL4= 120
##$ABSF1= 10
##$ABSF2= 0
##$ABSG= 5
##$ABSL= 3
##$ALPHA= 0
##$AQORDER= 0
##$ASSFAC= 0
##$ASSFACI= 0
##$ASSFACX= 0
##$ASSWID= 0
##$AUNMP= <proc_1d>
##$AZFE= 0.1
##$AZFW= 0.1
##$BCFW= 1
##$BC_mod= 2
##$BYTORDP= 1
##$COROFFS= 0
##$CY= -3
##$DATMOD= 1
##$DC= 2
##$DFILT= <>
##$DTYPP= 0
##$F1P= 0
##$F2P= 0
##$FCOR= 0.5
##$FTSIZE= 0
##$FT_mod= 4
##$GAMMA= 1
##$GB= 0.15
##$INTBC= 1
##$INTSCL= 1
##$ISEN= 128
##$LB= 0.25
##$LEV0= 0
##$LPBIN= 0
##$MAXI= 10000
##$MC2= 0
##$MEAN= 0
##$ME_mod= 0
##$MI= 1.114404
##$NCOEF= 0
##$NC_proc= 0
##$NLEV= 6
##$NOISF1= 3.799351
##$NOISF2= 2.8
##$NSP= 1
##$NTH_PI= 0
##$NZP= 0
##$OFFSET= 14.38212
##$PC= 1
##$PHC0= -1557.856
##$PHC1= 11.79229
##$PH_mod= 1
##$PKNL= yes
##$PPARMOD= 0
##$PSCAL= 0
##$PSIGN= 0
##$REVERSE= no
##$SF= 200.129724274929
##$SI= 16384
##$SIGF1= 3
##$SIGF2= 2
##$SINO= 400
##$SIOLD= 16384
##$SREGLST= <1H.CDCl3>
##$SSB= 0
##$STSI= 0
##$STSR= 0
##$SW_p= 3205.1282051282
##$SYMM= 0
##$S_DEV= 0
##$TDeff= 0
##$TDoff= 0
##$TI= <>
##$TILT= no
##$TM1= 0
##$TM2= 0
##$TOPLEV= 0
##$USERP1= <user>
##$USERP2= <user>
##$USERP3= <user>
##$USERP4= <user>
##$USERP5= <user>
##$WDW= 1
##$XDIM= 8192
##$YMAX_p= 0
##$YMIN_p= 0
$$ End of Bruker specific parameters
$$ ---------------------------------
##NTUPLES= NMR FID
##VAR_NAME=  TIME,          FID/REAL,        FID/IMAG
##SYMBOL=    X,             R,               I
##VAR_TYPE=  INDEPENDENT,   DEPENDENT,       DEPENDENT
##VAR_FORM=  AFFN,          ASDF,            ASDF
##VAR_DIM=   8192,          8192,            8192
##UNITS=     SECONDS,       ARBITRARY UNITS, ARBITRARY UNITS
##FACTOR=    0.0002768,     1,               1
##FIRST=     0,             0,               0
##LAST=      2.2672688,     0,               0
##MIN=       0,             -123026,         0
##MAX=       2.2672688,     104328,          0
$$ Real data points
##PAGE= N=1
##DATA TABLE= (X++(R..R)), XYDATA
0 0 0 0 0 0 0 0 0 0 0 0 0 0 0 0 8 -8 8 -8 8 -16 16 -16 24 -24 32 -39 40 -48 56 -64 74 -85 96 -109 122 -138
36 -138 157 -173 194 -217 241 -268 296 -328 363 -400 445 -486 538 -591 652 -718 791 -875 966
55 966 -1071 1190 -1327 1487 -1675 1903 -2185 2542 -3012 3662 -4618 6176 -9119 16646 -77865
70 -77865 -116201 90443 58447 -34783 -30555 15445 3387 -1176 2326 4226 -4616 -193 -115 1094
84 1094 -787 1379 -953 394 -258 578 -952 427 -146 271 -254 396 -370 101 -295 20 -91 120
102 120 -36 83 -40 -45 -106 213 -241 25 -277 -74 -326 -68 -73 153 -130 24 -20 -206 -35 153 22 156
124 156 -13 27 134 245 147 32 -123 -49 -102 -271 -51 105 -40 -27 -60 -71 -38 113 -131 -165 -124 -40 -390 -134
148 -134 237 37 117 -86 113 191 -145 -55 127 130 92 -176 281 -6 -392 202 -204 135 284 157 144 -10 -184
171 -184 -82 43 -87 118 -110 -24 -89 201 128 27 58 60 367 -111 -208 202 -121 51 -208 -170 -215 -167 129 -37
195 -37 -24 -7 -77 -113 155 -100 66 -18 84 -30 22 -61 203 66 -158 -36 -107 -156 59 157 -189 -94 24 172
219 172 25 -28 -195 -352 -104 -5 302 -88 -14 -170 165 -144 118 -8 35 152 -127 95 -25 109 -360 123
241 123 86 -10 114 119 5 -79 161 331 157 -38 -123 -106 -24 -199 -115 -186 -62 107 112 263 91 165 -6 157 -39
266 -39 54 18 71 -111 -98 -181 14 355 129 27 318 60 -28 -34 20 176 18 -232 -308 -191 208 245 -7 156
290 156 -126 39 49 92 134 172 -142 284 -189 -14 -122 -61 41 11 105 -360 1 246 207 291 -81 61 -164
313 -164 -131 -54 -164 59 60 -294 -266 -57 -38 16 227 117 15 -146 149 377 -77 -128 -6 -82 -62 180 129 -30
337 -30 -121 117 36 82 -19 208 85 17 42 251 137 15 33 149 110 -66 -62 143 98 -80 -10 59 84 -102 -101 -25
363 -25 17 -199 -91 194 -163 26 184 151 -316 191 -141 39 128 127 -11 193 10 120 -2 200 56 122 183
386 183 150 -278 188 4 63 -30 -99 65 -42 -289 -102 -29 -135 140 162 69 -306 94 -296 67 -13 -141 -206
409 -206 -18 -266 -24 -134 -27 181 32 -143 113 80 -274 140 28 407 -95 3 70 -99 40 -16 -164 -252
431 -252 206 -134 180 47 -249 39 239 138 -18 7 0 149 259 95 134 -36 -114 -169 161 -150 -88 212 108
454 108 185 12 -194 102 -66 -34 -163 153 -183 -172 -70 69 -287 138 109 68 -160 -231 -7 -5 -12 4 7 314 215
479 215 140 114 8 -64 139 -147 -240 55 -96 -212 17 -10 123 33 118 56 -260 -18 74 -258 -146 26 -102
502 -102 102 47 -208 -86 -132 -237 14 -22 73 -142 17 44 34 -244 123 29 -19 -233 -110 -114 -166 -64 -93 152
526 152 -135 97 1 -19 193 -121 341 99 -25 -224 -70 -35 79 -59 -86 16 -245 -369 -3 -42 233 99
548 99 -127 120 194 66 -81 72 -206 -213 -114 122 -39 352 217 -79 -4 -155 -56 -125 -14 55 58 62 -37 -114 52
573 52 8 -75 -185 49 -73 65 -139 56 139 -66 265 39 193 48 209 127 -71 -3 -140 202 -140 107
595 107 -99 -55 80 12 185 -141 170 100 -155 20 118 -13 211 39 -119 -81 88 64 -18 277 -23 -21 45 41
619 41 167 -7 107 280 -122 57 45 -7 -162 189 9 0 -113 -107 97 -76 175 139 -27 -280 53 -68 -301
642 -301 110 -193 -19 1 10 -109 77 81 85 204 44 40 34 -93 -116 -112 -42 136 210 -111 198 104 238 122 -70 274
668 274 -33 367 -254 -26 140 -183 349 64 -91 58 -140 95 -242 178 32 39 -111 -65 148 -96 51
689 51 87 -250 -93 -78 -61 -20 -141 84 138 -48 177 -46 47 249 -254 -105 53 56 67 80 -144 -25 56 -76
713 -76 81 -184 -101 30 -115 -233 -364 -68 195 414 -73 61 417 -37 -224 152 -124 -253 -20 47 162
734 162 -90 283 -67 94 215 -138 46 146 103 -251 -76 -191 9 30 -108 -42 -250 85 36 -152 -155 59
756 59 -444 243 -125 -59 71 10 -232 -138 45 5 49 -90 100 37 90 -38 -190 79 215 86 13 -137 138
779 138 -31 114 -92 73 120 -20 -7 129 -217 26 98 -186 0 -176 156 50 -45 146 75 235 39 0
801 0 -394 65 -23 60 -217 -100 -67 -34 163 86 3 -171 75 2 -44 57 -36 -64 32 131 157 303 -18 -287 -156
826 -156 329 -65 34 123 -55 -100 149 62 118 27 -69 -115 59 -52 -58 202 122 145 -23 31 -32 191 -41 -10 162
851 162 -95 -171 -3 87 110 41 100 194 319 -211 292 63 109 357 147 3 -187 53 1 134 300 161 104
874 104 -245 -96 107 4 -186 46 8 -71 24 174 -160 25 73 -184 -281 -152 -24 -151 -48 -163 -44 14
896 14 294 -10 29 -155 -48 -102 -110 -153 28 -36 198 102 100 -30 103 58 24 -26 167 -2 -114 268 -141 106 -91
921 -91 5 -183 -167 -116 0 154 50 -16 97 68 -273 60 74 -162 -209 -123 9 222 86 19 69 -20 -136 -8
945 -8 -74 -150 208 -193 -41 -17 -47 -109 -136 -140 19 57 -34 -61 31 228 212 105 -32 -83 326 -9 35 -7 266 -32
971 -32 108 -133 41 62 32 158 -24 153 -46 38 -58 -35 146 -136 -280 101 129 83 63 -28 59 -122 -34 -257
995 -257 -24 39 -29 147 -248 33 343 92 -23 -1 -248 95 241 93 -9 -3 -25 -116 52 -106 99 -24 7
1018 7 169 -181 74 -81 363 27 -235 -87 9 115 63 8 -72 72 -330 33 100 -193 186 220 79 -78 36
1041 36 -140 -218 -162 362 37 75 -14 -101 104 79 -117 101 63 50 -61 -189 254 -47 318 -117 108 -121 52
1064 52 -62 -44 86 -174 89 -61 -81 -267 -326 -81 -38 373 -204 166 -61 -175 -67 -173 51 -44 28 13 -59
1087 -59 58 229 208 0 -113 -28 -43 56 -132 58 -42 -308 -197 -76 -107 89 -133 -85 -137 -210 339 23 32 -2
1111 -2 45 109 8 -58 47 102 -212 -70 -66 -186 112 248 -236 -92 -15 223 -10 -235 120 -175 -174 15 8 128
1135 128 -8 -17 -98 -237 3 140 -12 -213 90 -89 32 -65 -204 227 -38 -96 -130 28 -187 42 76 3 7
1158 7 -129 250 -105 -157 -27 -92 197 176 -91 -30 99 100 60 -142 -25 108 -141 70 102 -153 272 11 21 49
1182 49 120 6 -97 -58 113 122 -120 -421 2 -63 160 73 138 49 326 82 -119 18 225 38 119 -6 31 17
1206 17 -250 180 -70 -192 -66 -103 26 125 135 87 39 146 40 -69 -70 149 173 226 -183 16 131 -133 -78 112
1230 112 138 226 40 112 -78 -216 77 34 -34 192 136 -54 -448 -154 149 103 140 17 26 233 -231 143 -78
1253 -78 -89 -78 -9 -168 -15 84 214 80 33 -104 -152 16 -271 71 -38 54 -120 -142 -44 -118 -113 -42 109 36 -137
1278 -137 -20 8 113 96 -73 -127 -281 -31 130 -16 -138 12 19 -162 34 231 -84 -367 91 102 -37 158
1300 158 -376 -216 -47 -317 280 51 -95 26 -177 36 355 -41 4 -256 35 -279 -15 -43 51 18 180
1321 180 -43 79 94 99 -21 166 -151 -5 178 -153 -22 -61 218 -13 4 91 35 -11 237 -23 12 -19 136
1344 136 81 11 -128 -35 93 -68 44 -224 -83 37 -146 35 -122 244 190 18 -196 -241 25 -60 -288 32
1366 32 177 57 -169 56 16 -79 -58 -163 58 90 65 174 148 261 3 149 -244 -136 -249 -52 42 10 -14
1389 -14 124 332 -12 -13 -55 -35 135 -13 220 238 -153 -65 -45 -148 287 -279 -59 -62 -301 -103 81 -100 -103 -52
1413 -52 180 -24 -173 221 108 -30 -87 -98 -30 -80 90 -44 -12 81 -77 57 -49 51 -54 -97 -45 179 -19
1436 -19 81 -142 213 -50 -166 -115 141 26 -76 -91 -67 -71 254 178 -218 -40 -94 422 91 71 192 -71 -103
1459 -103 48 58 32 107 309 85 -271 -53 67 -87 -55 -58 11 -48 -83 -52 168 -138 146 -105 27 107 -18 -7
1483 -7 149 4 -229 128 -145 88 30 -176 90 148 -25 83 -159 -70 337 -162 2 -38 182 253 9 -30 12
1506 12 -70 33 8 -213 74 99 29 -51 -110 -133 -30 -240 10 -135 -119 296 -5 -22 121 93 110 281 -136 279
1530 279 73 7 -45 192 -96 92 -205 61 154 2 179 -99 -14 11 131 -134 -8 92 -170 -73 -50 25 5
1553 5 -106 -145 208 -185 80 -140 -137 -171 -116 140 76 170 58 20 -258 -162 -211 -48 45 -128 -68 14 -63 113 24 -49
1579 -49 -200 -230 108 101 22 171 240 182 -20 -37 251 -191 299 -77 -315 102 -11 -18 108 -60 -25 -54 340 153
1603 153 179 -18 345 -242 225 -195 225 168 -41 -85 97 39 107 -405 -338 -75 149 -21 -67 -116 -103 226 97
1626 97 -224 141 -387 -33 -60 124 103 -60 20 -103 -17 -338 -127 -43 -56 -140 -6 -92 52 30 77 269 -2 -179
1650 -179 75 3 148 -102 -205 -120 11 24 -272 158 193 55 -196 27 196 2 205 3 53 214 -172 -14
1672 -14 -152 85 272 -72 219 -7 -87 -56 -14 -198 29 -51 -59 259 97 32 69 -360 -138 -14 -262 -77 249
1695 249 -64 -127 -12 -21 60 249 -149 -58 105 -256 -134 209 -12 -193 -56 -20 224 -225 -135 -103 62 -81 -44
1718 -44 -103 -40 285 42 24 -98 54 24 -201 -23 284 85 174 140 143 73 2 17 -129 142 19 213 71 -5
1742 -5 149 -170 108 85 -55 -89 164 -121 -2 -117 -140 117 -141 -331 385 140 -109 -144 -215 -26 -38 19 127
1765 127 -76 -137 33 5 -215 -129 -150 -11 86 296 34 -23 -93 -3 -2 -167 -71 -61 223 11 306 17 -41 -205
1789 -205 -157 -259 -163 -41 12 -46 83 -96 -26 257 -125 165 -81 264 15 -35 168 -28 -67 -11 140 -13 27
1812 27 199 246 -81 73 -32 17 -107 216 -18 -139 65 61 147 53 -323 84 57 -67 40 -130 126 171 81
1835 81 -86 292 24 175 125 23 90 -113 -209 39 167 -53 11 -10 166 -14 -12 237 178 76 -115 43 -88
1858 -88 12 -72 -147 -166 328 43 -97 -60 -79 -86 6 35 71 -66 -155 -200 55 -27 -36 -80 4 17 235 35 108 230 69
1885 69 113 -132 -239 -271 49 83 28 39 33 -28 72 -343 -36 28 130 130 384 -51 -182 -350 182 -65 -22 -166
1909 -166 -95 45 -231 147 141 -280 -94 140 -59 72 -130 295 -16 -50 20 10 -33 108 156 -148 -249 -246 50
1932 50 -48 -19 -73 -109 -66 -172 -240 164 -152 149 -258 58 145 68 240 48 71 50 -172 217 -8 119 -162 156
1956 156 -129 -14 -28 -156 -82 6 189 76 -263 -199 -64 40 71 42 -92 39 -88 267 -87 4 -57 223 28
1979 28 -101 34 4 -31 121 -182 -142 74 -118 -72 247 155 -182 159 138 290 33 0 36 -46 -150 -201 -131 42
2003 42 -45 -33 -54 -211 39 172 233 -7 -133 173 -72 83 150 178 -164 25 -16 117 104 -141 -184 -103 -177 71
2027 71 48 155 -40 237 85 188 257 -376 57 150 123 -147 38 -167 -54 87 -197 -20 -109 23 -27 339
2049 339 -140 250 -50 -340 -30 96 -32 127 -49 -102 233 119 73 -122 32 -174 66 -257 -48 -138 -58
2070 -58 -18 -216 -19 35 -83 43 -187 -52 -105 38 -8 -143 -296 130 45 -169 -111 -3 141 -326 19 -186
2092 -186 -90 -19 -91 -188 -281 -18 -184 -44 140 171 169 -48 188 -19 76 33 -223 -3 118 236 -34 -129 116 6
2116 6 46 18 -57 -111 -136 -185 -223 -14 59 -299 -3 34 -69 41 162 -26 39 -4 -26 172 -228 -115 -13 149 8
2141 8 -136 147 18 -43 224 47 102 138 -231 38 -11 68 -78 144 -53 313 -246 -15 -112 267 -254 -97 -43
2164 -43 30 127 -94 -68 119 -6 -106 25 -41 120 -334 124 -208 66 -137 64 66 -101 -200 108 -139 83 -167
2187 -167 122 150 -59 162 190 46 255 -72 -346 121 -65 143 147 175 -48 -154 -141 54 -124 -27 -29 263 106
2210 106 -150 293 195 162 61 155 -9 77 -107 -37 63 68 25 94 -164 -96 -225 150 -89 -44 121 -60 -237 -169
2234 -169 55 307 130 111 113 -23 4 116 -96 -68 -5 -11 -85 117 46 42 129 -74 -158 39 106 50 42 136 -5 -57 -150
2261 -150 48 -15 -11 124 4 -241 87 -110 -45 -190 -150 -40 57 -2 256 17 -160 335 236 190 -94 -75 -108 177
2285 177 5 -51 157 -96 -38 -49 34 237 -19 12 166 168 311 -101 -230 100 -377 153 -56 91 -287 -20
2307 -20 179 -125 -68 5 -185 -96 61 -381 167 -51 -59 -79 12 136 354 93 -177 -47 -86 46 -67 -17 7 -84
2331 -84 -127 202 -83 -146 -87 62 -12 -40 -6 -173 -139 -261 -42 -196 -95 46 -14 -94 -37 -66 57 118 78 -112 124
2356 124 -155 -123 -118 -44 -24 283 -172 102 13 -217 -91 178 -28 -110 -60 -180 -67 -239 -46 98 232 136 -144
2379 -144 -152 201 -38 172 -114 -150 53 6 169 79 34 35 41 -140 118 -112 -13 -47 99 -69 44 29 69 -90 -246
2404 -246 -84 -8 -24 -111 82 180 -28 -113 -85 -130 56 64 13 207 355 86 38 193 106 -168 18 96 27 -88 -116
2429 -116 9 127 -376 -43 -126 -122 133 -130 -207 27 -112 35 -68 119 45 -88 7 -113 38 152 152 -351 -97
2452 -97 -172 -196 -79 -308 28 -31 60 -270 -66 116 -165 -168 -147 94 -47 288 -51 -113 57 54 -74 -111 43 -151
2476 -151 165 -264 -118 -174 112 -183 -89 -56 -133 -37 27 30 60 -75 144 55 35 -81 19 -177 -147 166 -207 -12
2500 -12 -38 -129 -40 4 -19 -141 -78 -21 -266 -59 280 38 -18 -139 -210 -255 117 23 210 -64 -244 264 95 -179
2524 -179 100 122 100 52 -130 -17 -52 -33 -13 -61 68 -77 -290 -9 94 49 -117 57 -207 -161 147 -115 -177
2547 -177 -197 -29 103 42 -74 -49 -142 -169 50 58 -96 33 -81 54 85 114 -259 110 8 119 -54 -17 194
2570 194 77 -126 29 -167 -3 171 104 -131 422 63 85 137 295 201 -87 -6 -105 23 -243 46 34 18 111
2593 111 134 -190 83 88 -76 59 -36 2 -235 1 -39 280 133 -39 175 11 -150 -46 -200 98 109 -303
2615 -303 76 -126 49 -33 -96 -27 7 -115 -102 -13 -152 -41 -185 82 189 75 41 -138 -88 -53 5 -86 130 184
2639 184 -7 -112 25 -49 67 -116 230 74 -27 -92 141 -89 -246 -61 -111 140 -172 140 -16 45 -187
2660 -187 57 149 -50 167 97 -102 -14 159 -73 186 -178 -141 10 -50 105 -18 145 89 151 -107 44 -68
2682 -68 6 23 111 -86 -230 96 53 -93 -30 -59 -66 -43 3 -80 302 27 -138 -168 -15 -117 163 10 155 191 161
2707 161 312 -191 90 -181 -85 63 -117 162 -10 -336 -67 11 180 -215 68 -50 71 -96 169 209 16
2728 16 -6 36 -113 23 -23 -4 96 -161 173 45 171 243 -156 86 -46 167 79 76 -102 120 244 76 -207
2751 -207 175 14 -151 -28 -255 -110 35 252 70 153 -14 289 -174 188 78 269 245 -170 -341 -16 -289
2772 -289 -286 188 -258 -136 -8 72 40 -169 -71 -10 -115 328 -91 73 -85 151 -163 35 -77 65 6 199
2794 199 -205 -53 65 -8 24 199 -14 167 16 -44 141 -343 125 22 4 -80 -66 52 293 196 -196 -25
2816 -25 -54 -54 53 6 -253 106 -81 41 52 -134 83 -133 -104 66 105 79 -57 42 -76 212 15 -63 36 -2
2840 -2 119 208 107 187 27 17 -8 -8 48 14 -218 -167 -75 -73 12 157 119 287 -95 -238 -3 -15 263 -32 136 -20
2866 -20 -223 30 142 93 61 96 -25 -131 82 -109 -57 36 -97 113 -138 -291 42 93 90 -75 -191 117 55
2889 55 -106 -171 -284 121 279 112 139 -63 -277 156 58 -109 107 224 17 -233 117 -180 -7 164 -34
2910 -34 12 167 36 -68 -107 132 -138 307 63 -105 -144 14 96 -136 -56 177 -153 -73 14 -52 78 98 136 30
2934 30 89 -40 185 -103 50 -3 -23 -173 195 150 231 80 43 90 -191 109 -128 -178 -54 -134 52 -89 -255
2957 -255 76 149 87 84 -78 25 6 168 153 -7 54 144 -31 225 -129 92 17 95 -181 -372 -82 133 -168
2980 -168 58 -2 -45 -137 80 -190 -230 156 -264 -71 78 -103 25 34 -187 109 -87 -57 -52 109 32 60 52 -150
3004 -150 253 19 -274 -70 38 152 18 -39 -24 -64 -310 136 139 20 10 16 -102 -187 115 374 33 -81 49
3027 49 -84 -111 59 -68 -128 -204 154 -169 -130 56 175 -48 -55 -136 -127 -114 -139 156 -75 328 -111 -228 -101 65
3051 65 94 160 -64 112 56 3 206 114 -142 204 185 11 -119 63 -271 -132 304 153 71 -37 220 -96 -41
3074 -41 -10 66 89 -161 171 -27 256 -31 40 -99 -111 8 274 -44 5 74 -71 106 -84 38 153 49 25
3097 25 -46 144 -7 -232 -43 201 77 -98 334 131 -62 61 174 -190 69 323 -160 106 -156 -64 3
3118 3 78 102 -80 -102 -180 374 -51 -98 -126 175 124 -209 63 -25 37 -38 87 170 55 240 -84 -177 -92 3 101 -36
3144 -36 -53 199 16 155 27 -30 195 -79 313 48 -95 194 -194 130 25 68 145 -38 365 -262 170 95
3166 95 103 -88 162 192 -75 -238 52 77 -75 -205 -4 -183 -219 -249 -291 -185 30 -216 226 -200 130 70 -19
3189 -19 -83 -53 20 -109 127 72 -31 45 222 -48 258 -197 22 -1 181 346 266 4 -102 21 59 299 62
3212 62 77 35 55 18 376 -60 164 -27 -87 -160 -43 19 27 -124 66 124 347 71 -321 55 182 317 37 222
3236 222 55 -101 -43 105 77 -47 227 -111 101 172 -103 160 -122 83 -33 21 -103 -211 -142 -169 106 -88
3258 -88 0 14 -257 -53 -75 189 -14 -74 65 155 286 -120 -69 60 60 -352 2 -11 157 212 136 -42 45 -229
3282 -229 -91 6 -79 -19 95 -28 -208 -211 -142 -157 7 137 30 23 41 168 -54 15 -84 279 174 16 9 96 -27
3307 -27 154 -23 122 234 102 8 -268 68 114 -264 28 -58 130 89 -230 212 27 -2 23 138 -1 -95 34
3330 34 52 58 91 4 70 -409 -153 -218 94 -147 32 11 -248 -344 1 191 -198 -12 15 240 14 -7 -305 -85
3354 -85 137 66 40 58 23 136 110 147 99 -40 -198 138 161 -96 105 -215 -151 35 -15 172 7 133 55 -111
3378 -111 -125 -239 66 -79 -5 -230 -275 -218 83 44 -161 -9 -5 84 69 -42 -17 -45 16 -11 -34 63 133 -29 -197
3403 -197 -41 109 127 213 15 19 168 -45 71 173 26 -81 41 132 -69 47 114 -11 30 -34 24 -261 29
3426 29 37 52 128 -66 -102 210 -129 100 -86 151 29 -53 -118 177 258 81 -160 -83 -82 155 -30 147 -186 -181 -44
3451 -44 48 104 -38 85 -28 217 -45 -187 116 221 -160 -164 196 -445 115 102 -13 -227 -5 -96 -161 -271 -2
3474 -2 7 -36 42 -78 157 165 179 -141 -287 113 93 281 83 91 -36 -92 87 -307 -170 4 81 -87 143 65 103
3499 103 54 -138 -109 82 -160 4 16 57 28 -82 64 29 227 2 154 -65 163 -18 -38 -204 -126 -30 59
3522 59 -82 124 75 54 122 -117 20 -224 14 5 86 6 116 105 -45 92 223 12 -19 141 -50 -5 200 19
3546 19 313 123 22 82 -75 -120 106 -87 154 -89 -54 9 2 -17 14 -110 110 106 44 -109 163 39 57 117 94
3571 94 89 10 9 -176 -110 -170 197 -13 -32 139 110 -14 -6 -333 -5 136 189 24 133 -68 79 226 113 47 52
3596 52 -89 -95 140 143 67 95 143 -221 59 -90 -53 -229 -130 44 465 -155 139 -34 207 132 234 -9 -181 -105
3620 -105 -210 141 -148 136 70 168 -157 -181 18 -129 -123 -70 130 -16 -239 343 -112 -406 29 39 91 188 283
3643 283 -28 -152 94 -218 -316 -228 -102 17 49 0 132 -121 -157 -77 180 20 49 -150 -97 -95 -162 -116 39 15
3667 15 -220 -12 -7 115 -79 -135 251 72 148 -142 23 -174 27 8 -54 -28 -103 -353 -270 72 106 140 -243 139
3691 139 196 -74 85 -224 22 78 -7 86 175 142 -21 -18 -69 -105 -251 136 228 -218 63 84 -6 29 26 111 -71 -372
3717 -372 -98 -237 -121 -26 -94 97 -26 207 120 -116 -119 -33 -109 39 58 211 -184 -154 32 69 -20 -89 -134 -15
3741 -15 -59 -152 -257 -120 98 -36 -23 -172 174 -61 -56 -64 47 -114 117 100 20 -4 -41 126 63 -87 131 -95
3765 -95 288 167 -162 -71 -54 57 46 175 -122 45 -108 -275 63 -89 -194 230 89 144 34 37 165 -124
3787 -124 67 -133 -32 27 14 -63 -65 126 392 24 -376 -102 16 -51 16 71 152 -214 -149 -58 -191 98 -48 -231
3811 -231 101 -150 -127 -83 -158 59 -274 57 118 42 257 63 226 255 -50 105 147 -15 -116 7 2 -346 74
3834 74 24 -40 -51 -67 160 119 -261 -58 4 82 36 -66 -31 -17 72 113 85 -115 6 -1 30 -157 51 25 -128 -23
3860 -23 8 -37 -66 -22 228 109 123 35 -167 -128 -232 -117 73 266 204 113 36 -115 384 -43 -65 -53 8 164 484
3885 484 -20 119 -286 -161 154 83 163 210 221 -186 -94 -422 37 3 -113 246 30 160 -190 -141 -161 -125 108
3908 108 43 27 -21 119 340 -46 -109 10 -132 -112 -62 45 7 -14 -218 6 160 170 -62 215 -254 246 74
3931 74 -15 -146 261 293 154 180 -83 175 -79 98 -356 57 109 -131 -88 -107 25 -4 -289 -78 -188 -113 -38
3954 -38 -18 64 -123 69 56 122 139 -125 -59 -112 -97 179 163 -105 -9 -7 7 193 -218 50 44 -26 10 49 46 -1 212
3981 212 95 -22 -97 -128 -91 90 43 166 171 -37 279 90 -129 -19 213 14 66 -36 36 -49 -228 -53 -119
4004 -119 17 -340 20 -183 59 15 69 78 -13 20 -57 140 71 -190 -149 -20 -26 -211 73 -221 29 83 -63 -7
4028 -7 46 -58 -1 239 -73 -22 123 188 67 134 -21 126 -129 105 -55 -78 63 22 220 19 406 -107 23
4051 23 330 38 30 -198 82 46 67 -38 81 157 107 -32 -18 59 107 -348 69 176 93 -127 -214 14 16 -152 -5
4076 -5 105 67 -139 -140 -75 86 -65 -104 -306 -190 237 240 85 -25 211 94 36 -165 65 -26 127 -13 -21 340
4100 340 -119 209 -83 53 23 -164 73 -73 -121 291 -208 35 150 187 -150 154 93 -86 306 16 -134
4121 -134 197 19 215 312 -56 181 -181 -285 -41 -52 -179 74 187 42 -223 -25 -195 -276 152 -212 184
4142 184 -9 -30 -210 -2 -187 256 -2 30 353 -7 178 19 353 -138 -39 -234 150 -174 -96 117 -199
4163 -199 -298 -304 176 -61 204 105 74 -192 -74 -146 -223 -349 25 121 33 17 -150 57 179 19 -153 11 0 151
4187 151 -105 -50 42 11 57 146 9 -61 50 -111 131 -38 323 -48 -26 -42 -90 381 277 63 106 65 -82 12
4211 12 -15 -34 -126 -80 284 -186 92 253 166 -23 168 129 -319 -82 36 66 -28 -5 -64 111 -178 -185 132 11
4235 11 11 195 92 118 81 28 -78 123 -93 34 -63 -7 90 135 -87 83 81 268 -163 -119 156 -188 -130 204 88
4260 88 279 53 56 6 91 23 114 31 26 161 -78 -44 31 202 -105 35 -46 -176 2 -198 -3 -117 238 -352
4284 -352 -143 -24 -15 266 94 75 -169 -60 -92 -244 215 157 62 -130 -53 109 235 33 70 69 106 -128 282 -147
4308 -147 72 183 130 -127 64 190 65 151 -101 269 209 156 -191 -14 -82 6 -47 76 -197 -30 0 -257 -159
4331 -159 122 -14 227 -223 138 139 -11 -25 -106 73 -57 32 211 -42 -81 -53 60 39 133 -62 -66 201 3 -20
4355 -20 -73 43 78 30 -206 138 27 229 -67 148 -259 -291 -8 -141 -102 -67 -97 71 105 -274 60 -35 -164
4378 -164 109 143 63 -26 438 -71 -184 -159 117 -39 93 159 162 178 -130 -281 -21 6 71 -75 -86 -14 269 -32
4402 -32 -165 46 -173 85 -18 -158 221 85 -215 108 -223 -24 -45 168 -18 19 49 -229 -76 100 -96
4423 -96 -218 54 177 62 130 -267 -15 13 18 -242 -35 -149 54 325 193 127 -279 -156 -2 -204 -205 23 -96
4446 -96 32 353 -227 -38 -81 119 -87 -9 -37 -138 141 159 -178 -29 -237 16 -38 10 40 -24 -127 -49 -20 -21
4470 -21 135 -72 84 -174 -139 -189 71 -201 44 77 -78 103 109 91 122 -29 45 85 50 196 -2 -8 -59 194 181
4495 181 90 27 -140 170 10 110 92 -199 110 -4 -232 57 141 92 134 -57 -92 -112 77 -166 158 -146 -385
4518 -385 -63 -61 270 -53 -101 125 210 144 -233 43 64 69 -380 -305 -81 11 155 2 88 -146 -198 54 156 42
4542 42 -70 -193 62 141 93 -73 115 24 171 -79 9 84 192 -83 25 133 -147 109 55 -288 85 38 139
4565 139 98 61 49 -63 117 -242 103 -48 179 -175 -170 -51 -83 95 2 61 -22 -110 -161 -178 103 -52 107 112 99
4590 99 -18 23 92 -178 89 -50 -128 -49 190 62 88 68 -41 22 52 -81 -100 -122 -95 122 143 -62 262 -200
4614 -200 183 131 126 -179 291 -120 96 -105 232 182 72 -203 179 -129 150 -9 -231 -58 -292 112 -47
4635 -47 -153 186 107 29 98 -47 231 -8 38 -203 57 267 -249 77 165 -29 91 78 55 -96 -17 168 13
4658 13 299 83 -122 -246 88 177 -31 -34 -175 -52 172 -91 24 -145 159 109 -90 294 63 301 75 -3
4680 -3 -236 -91 -18 175 -84 -38 183 98 -54 -74 93 -26 -23 40 94 22 132 74 -39 -27 221 -115 324 -26
4704 -26 165 16 74 7 -300 204 84 17 -242 -120 -380 -17 -44 -66 -66 -213 175 187 -4 -44 115 226 127 17
4728 17 -20 22 30 -302 -153 -4 91 -47 -53 170 -124 -73 118 -191 115 -73 -253 -36 -53 -35 -28 25 220 -61 114
4753 114 97 114 -6 62 -95 21 -130 283 -96 -8 163 96 7 -105 151 -273 -251 121 -152 208 -5 152
4775 152 262 356 -23 -97 -42 -34 -216 -77 0 153 -10 -18 -23 -35 7 49 -226 -72 -45 178 88 239 -82 -71 -144 -125
4801 -125 -33 73 -169 -129 87 -9 30 -123 -76 318 32 70 -351 -229 16 -183 -32 200 -93 13 222 -111
4823 -111 -63 -22 -102 -28 -120 370 -29 -105 46 -22 98 61 -17 51 117 -187 -132 216 65 -130 -148 -203 -101 325 143
4848 143 -165 105 -79 114 205 106 -51 18 183 -102 279 -192 -55 -92 177 -13 92 -61 198 87 82 -78
4870 -78 -100 24 -34 -73 56 254 34 -258 203 -14 -205 22 -237 43 -30 -157 -31 123 -138 66 -19 -62
4892 -62 234 -156 113 -104 192 218 93 -98 25 97 120 -15 117 116 14 -47 47 -10 113 -125 293 167 42
4915 42 -187 177 241 -5 224 -182 250 -46 56 133 270 157 -225 6 235 92 -125 -50 28 -28 75 125
4937 125 -113 -216 -27 127 52 -68 -44 237 21 -110 82 -65 -77 -71 29 144 4 -32 55 42 73 -4 15 -83
4961 -83 264 -16 -125 132 143 -65 -54 274 -66 -34 -292 -96 -18 -2 109 -156 0 70 -9 -52 285 129 111
4984 111 98 -255 -168 -23 -256 26 -97 -289 -131 79 16 -21 43 74 134 17 -4 16 -113 40 75 85 -39 98
5008 98 134 158 -26 226 -270 -17 -58 209 135 -151 235 135 123 -65 -142 -55 1 -6 -6 -165 -136 66 -18 -49 86
5033 86 -155 295 214 -237 276 -79 1 104 287 -116 -18 157 176 -106 -213 165 41 -122 112 121 -94 -32 11
5056 11 -80 -125 116 -28 98 -84 171 -237 -72 235 -145 85 -109 -61 -27 -18 216 201 -78 119 56 -54 -259
5079 -259 87 -19 72 -285 32 -89 -8 -32 -38 113 -5 -89 61 -222 83 27 -37 -69 -112 7 95 5 -100 29
5103 29 -64 38 131 186 -304 93 -340 -90 -191 -74 -40 -58 -86 -118 -8 67 184 24 107 119 52 58 217 54 91
5128 91 278 -46 -30 119 28 -88 12 184 55 -127 223 127 72 -154 -38 -74 10 78 2 -42 24 -57 149 94
5152 94 -174 173 19 337 -146 232 -113 -113 4 -57 123 200 60 -57 5 132 33 -155 -38 -111 202 86 -122
5175 -122 215 -152 98 -134 286 -101 211 99 59 -121 28 358 181 -144 93 -77 86 -202 -25 79
5195 79 -183 117 30 -299 224 -238 -20 114 -69 53 209 48 120 -231 3 -65 -118 175 123 80 -128 90
5217 90 -121 43 48 -10 39 -7 65 103 51 162 52 -234 163 146 185 144 19 94 -87 119 57 107 -91 -41 -83 86
5243 86 164 269 -87 -88 35 94 112 -250 227 -56 -159 140 37 77 -73 373 214 -51 34 139 -234 90 19
5266 19 113 178 -36 197 -32 122 218 52 -110 169 72 -50 -83 -119 -15 161 107 55 -207 -137 14 -105 -96 -242
5290 -242 -178 -60 73 40 -48 -80 -160 168 -282 -108 -174 -308 -131 28 -216 236 -197 -238 -15 -83 6 -37 7 -104
5314 -104 -2 -129 -38 81 192 119 165 -321 -41 338 -213 -150 -43 -99 161 -129 -33 -121 -147 133 -100 99 10
5337 10 244 -60 -9 -53 -193 2 25 64 -86 11 -69 -156 35 -54 -173 -225 116 22 -307 137 88 -127 112 -310
5361 -310 53 220 3 196 130 -181 -63 67 53 39 -178 168 -125 38 -120 51 -405 251 -157 132 -171
5382 -171 -107 -404 -186 -276 -87 -66 62 140 52 -3 -233 -28 21 151 -128 -78 85 -38 -155 -83 -270 -34 -19
5405 -19 -58 243 132 -119 58 38 -113 -14 -160 -85 67 68 -60 -324 135 -23 39 -453 -16 -46 -194 -193 5 4
5429 4 45 184 -115 108 -111 117 177 -6 118 -82 -56 261 164 -156 -19 28 -48 26 66 -42 -140 57 -23 69
5453 69 -122 -43 -98 -333 30 -162 26 149 -27 202 -52 43 93 213 -65 -202 -65 99 68 65 105 206 -30
5476 -30 -347 6 -16 -26 91 -69 -96 -106 -18 -173 -105 62 -222 -178 152 61 -48 -32 129 -66 164 -269 65
5499 65 -53 -308 -84 7 23 94 -29 36 222 40 77 134 -154 -37 -14 18 141 373 181 -50 310 -20 -89
5522 -89 58 -104 -76 -11 -64 -5 -44 -125 120 252 36 0 161 -169 54 81 82 85 102 232 -248 -64 -170 138 -53
5547 -53 -87 283 124 61 196 37 -133 104 108 -477 13 91 61 107 -46 -183 19 -194 -26 -61 287 47 170
5570 170 -70 -121 90 139 223 -96 102 48 49 -94 -16 -158 34 -9 205 -138 -166 -85 -132 221 -131 -345 -277 -226
5594 -226 -133 -206 132 -78 -227 113 25 -63 33 -79 9 124 60 -113 -201 175 143 -231 -177 4 -44 75 -31 42
5618 42 64 -184 43 -41 -86 -342 -59 55 -13 118 126 -46 -12 160 184 -125 -83 -48 -23 16 -156 -187 -9 -175 301
5643 301 184 -285 -115 -243 51 39 -134 93 63 -245 -77 17 47 51 -6 141 150 -154 380 234 27 -107 -195
5666 -195 136 -136 -38 -122 180 -20 73 -23 70 -125 62 210 -8 72 -218 -43 -104 28 -38 -128 -75 -95 118 135
5690 135 105 32 -115 -10 -214 128 128 116 2 -12 65 76 -227 -99 -172 232 -138 -119 -115 46 63 57 -99 73 -82
5715 -82 -147 -108 -64 139 -218 101 -162 -44 -10 93 40 -134 78 -92 52 -65 -73 -117 -114 148 -34 83 71 -30
5739 -30 122 -144 -28 167 35 11 69 127 -172 38 163 176 -31 36 -112 -26 -51 10 65 -200 279 -31 -57 101
5763 101 -23 -37 41 84 223 -119 -44 146 114 17 275 180 -116 45 -138 -4 144 -116 -43 -145 -274 82 -225
5786 -225 68 91 -12 30 71 172 316 71 -104 190 237 -299 146 336 -117 43 208 -7 274 -15 88
5807 88 -161 -41 122 -96 -7 29 -7 181 83 6 -8 -177 -355 172 15 141 99 -53 202 200 190 22 -51 -75
5831 -75 42 -113 150 -177 -122 -11 -97 -3 24 -18 35 21 -57 -184 148 110 -144 75 103 65 -119 285 55 -21
5855 -21 170 -196 158 5 95 19 -70 11 126 88 44 19 -22 188 -215 -72 152 118 34 -6 -189 191 -285 45
5879 45 -237 -218 -133 -97 64 -18 -77 160 77 72 42 20 -164 -29 21 -36 80 48 187 1 -159 32 32 19 -98 159
5905 159 -51 -83 185 17 156 154 251 174 29 -65 -137 -55 43 80 -82 -248 7 -61 68 329 -184 38 -363 162
5929 162 -111 125 -215 22 -42 -64 -5 -169 13 89 23 31 -167 -55 -416 42 300 -191 11 63 -157 3 10
5952 10 144 -236 -47 133 180 -194 -66 43 -153 -130 53 77 -422 -60 -42 -38 127 49 -206 -98 217 111 -284
5975 -284 -21 -46 91 129 126 252 -106 -127 -1 -179 64 111 40 170 16 319 74 64 163 45 -135 53 -9
5998 -9 273 6 137 -206 89 33 -72 -90 107 145 -236 130 -59 -22 -66 69 -184 -321 -89 -333 -72 11 -131
6021 -131 -157 -51 -139 -73 127 59 89 117 91 -296 -60 -17 57 59 -25 58 292 -197 261 55 247 -16 -62 82 29
6046 29 143 -375 65 101 65 84 -105 -269 55 -257 -240 116 15 120 127 181 47 -25 -135 92 212 -106 56
6069 56 251 356 33 148 -76 -10 -7 5 -89 64 27 -227 294 -78 24 -74 -130 -22 -28 103 -146 -105 172 -110
6093 -110 -43 193 -29 -195 77 13 203 83 68 -43 44 277 174 34 -42 166 -170 -66 -131 78 17 -17 -66
6116 -66 -228 -127 -72 -166 72 54 -83 81 59 135 204 -183 -125 39 1 53 -128 -22 44 17 -116 153 26 52
6140 52 57 161 69 -32 87 -32 -146 -440 98 191 155 -103 97 105 -264 165 24 96 -230 -165 190 -277 -283 191
6164 191 -44 -205 223 -243 -69 54 27 -230 17 201 56 -87 -165 108 -162 53 174 12 6 -228 -57
6185 -57 20 -4 -404 -6 -171 64 -35 -8 222 206 -36 -145 -79 111 -296 108 92 -289 83 -79 114 -52 -62
6208 -62 23 132 219 293 -9 -145 -113 -136 147 24 107 211 -46 -201 -47 -71 -82 27 16 -22 180 -18 123 53
6232 53 70 -54 52 -25 -147 -44 30 -23 -160 -348 -59 -148 -225 82 -314 150 109 230 28 -35 140 38 -165
6255 -165 77 9 -45 -111 -228 4 -151 -176 61 70 160 165 122 189 113 -130 106 -21 -260 -72 41 -134 -113 8
6279 8 -7 -96 0 -5 382 -83 87 -380 -252 7 -144 141 42 99 175 -111 59 214 -5 31 194 16 -52 257
6303 257 -240 5 -215 47 73 180 114 -151 126 -192 65 -4 50 75 -289 -67 -79 58 110 73 17 -100 108
6326 108 -24 1 -133 160 11 -116 -256 232 1 -112 -16 -27 -2 9 -27 -238 -187 -61 -69 63 -48 -95 -76 -38
6350 -38 64 26 -105 38 -17 -52 -62 -151 68 85 -126 -59 -43 238 251 159 24 -180 58 70 -116 -109 61 -219 -278
6375 -278 101 51 -115 138 -248 220 -152 -116 27 -8 191 -7 -99 110 -288 52 36 -98 -37 94 -188 165
6397 165 74 -141 91 23 17 -187 211 -35 -79 154 -44 -52 19 131 68 42 23 -280 99 142 311 -267 -84 64
6421 64 235 95 -160 225 -18 -12 345 -407 -1 108 -127 -15 -15 23 -277 176 69 187 -74 -8 -2 125 -117
6444 -117 247 -90 -26 -53 -135 -310 106 -148 -218 161 -89 -214 -131 83 -49 -148 60 -187 -25 149 273 180
6466 180 82 36 223 65 -30 59 -104 -86 131 205 -50 -46 53 153 180 158 232 103 -29 -5 -44 26 93 -162 -79 190
6492 190 250 -142 27 -115 -60 49 -85 113 83 -102 -123 82 -42 112 162 145 -290 -183 -108 151 -46 184
6514 184 -13 -47 153 -19 -70 112 -208 5 -91 -354 -239 -29 22 121 -113 158 -114 -41 85 200 89 -11
6536 -11 -72 97 31 -138 -255 -231 150 105 -241 -63 122 -35 -96 184 289 203 167 242 -93 245 -22 -70 -6 346
6560 346 67 -153 -7 -256 123 83 3 -88 93 103 37 216 124 209 -79 -154 -132 87 -52 240 98 -254 -260 183
6584 183 143 4 36 56 28 8 99 109 67 37 -169 46 -19 177 -144 183 3 -172 113 279 -114 142 48 -137
6608 -137 -22 245 31 126 39 211 -73 -21 -110 -217 212 -134 181 50 -170 -37 -143 -47 139 67 82 86 -141
6631 -141 -197 20 67 -261 -29 39 -356 26 -67 62 341 -73 -115 -27 -62 -79 -141 78 81 52 352 -77 51 -11
6655 -11 181 46 -101 -193 -167 9 -175 0 -224 -14 -59 -161 42 -221 123 17 35 -143 -119 -187 32 64 -303
6678 -303 139 1 -60 -37 66 -155 151 110 -14 343 186 60 24 -22 -52 -6 -120 -111 -38 -212 -91 262 62
6701 62 -33 74 13 -124 173 213 24 238 103 59 16 -110 64 -18 -474 189 -66 -185 220 6 -56 96 293
6724 293 -14 -176 -6 357 77 180 33 -151 -309 -233 13 120 36 124 44 -174 -63 -40 213 -12 -82 -42
6746 -42 -13 -88 -101 -117 19 173 -155 60 -84 -41 -40 109 0 -120 73 -37 -21 -241 -29 -13 56 11 161 -137
6770 -137 111 177 17 -203 -26 151 -108 -59 -222 63 25 -108 -31 -203 16 -120 13 90 108 106 25 -84 0
6793 0 -21 -270 19 -78 -220 4 -222 -208 104 -81 240 -50 178 -32 -64 43 226 21 -36 205 29 -61 -21
6816 -21 -35 54 19 -196 106 103 66 67 -217 -20 -96 -143 89 262 108 -5 262 122 -88 -6 -213 -60 -126 -61 -301
6841 -301 315 186 -11 -108 22 -140 148 -215 177 313 -1 37 -350 58 -130 -165 -446 204 158 118 292 161
6863 161 105 -78 -21 61 -131 -266 -15 107 -209 52 -61 110 31 172 -84 62 171 -174 178 -102 21
6884 21 -144 160 -117 -170 112 41 244 -69 139 79 127 -71 -47 -192 -41 140 -167 362 76 25 -127 -182 77
6907 77 133 -189 103 129 189 41 -286 -72 121 187 306 217 87 143 123 149 65 133 178 29 -87 25 260 134
6931 134 149 -45 72 241 148 132 -72 99 151 181 88 -100 -15 193 185 226 148 20 204 10 -51 114 113 253 -68
6956 -68 9 -124 156 106 84 -224 -40 1 -143 -34 -88 -17 -37 -160 62 24 -27 -59 -291 76 -80 56 -91 -70
6980 -70 -194 -32 -67 -107 -96 78 -72 217 4 -150 -102 57 -258 111 -209 -24 198 -246 -234 -228 152 33 -293
7003 -293 43 135 -280 40 -61 -22 90 -9 -86 -12 -6 260 -65 -332 163 0 13 251 -171 -82 -94 -68 -76 22 -17
7028 -17 210 60 36 -71 3 168 -249 -96 203 -80 -45 24 95 27 -138 -140 -123 15 -48 -71 -194 -280 -8 -6 64
7053 64 -80 -337 7 121 -219 -273 90 -17 78 -154 23 -85 7 235 -198 -273 190 35 12 171 -9 54
7075 54 130 -259 95 -259 -267 60 -107 112 146 102 13 -31 -110 2 -29 58 -12 -114 -29 18 49 -57 147 87 -97
7100 -97 10 94 -240 68 12 -99 -155 -72 90 -23 -1 151 164 23 -10 -130 60 105 182 178 254 -17 -77 -119 36
7125 36 -2 143 -146 322 -97 -161 -5 94 -94 -90 159 13 -24 276 -10 242 16 5 254 38 -169 -61 -86
7148 -86 -160 43 -124 72 91 -91 356 -7 -155 39 -60 -122 -136 -102 -37 20 -54 -107 -29 -137 -6 -297 -55 132
7172 132 -13 -139 133 -219 27 -71 133 -95 -20 81 -91 48 -110 -57 -83 -216 -137 -55 32 18 -6 72 -133
7195 -133 98 -72 -70 82 111 -34 270 -191 -199 188 -153 176 86 -56 -358 142 -40 87 48 -77 -120 85 28
7218 28 31 357 -147 45 257 -109 -42 63 -57 -75 85 122 23 -50 203 -164 87 -3 -94 97 151 73 -193 -121
7242 -121 -21 194 95 86 245 -44 -172 168 -167 -296 -88 241 322 -37 -13 137 -147 267 -23 242 6 -256
7264 -256 243 69 -93 62 303 108 140 -199 76 -8 94 -3 -297 71 -63 11 67 -78 116 -339 -100 -330
7286 -330 -209 -177 -83 -142 13 3 1 -179 66 124 179 281 231 -17 81 -49 -26 -109 -18 91 -152 -12 90 120 -239
7311 -239 -77 -105 -103 -45 6 -50 -174 -166 143 94 59 83 195 103 110 -159 48 100 -25 253 -175 -86 -25 112 -124 -255
7337 -255 -71 74 -20 -182 -150 109 148 -252 94 98 -104 91 79 94 -165 -98 38 -62 -101 -81 -22 164 54 -5
7361 -5 80 177 25 107 153 -2 -33 -314 -150 19 -319 56 159 19 -212 136 -56 94 155 139 49 137 339 244
7385 244 163 80 140 -172 287 -151 -87 -93 -47 88 3 -176 -101 95 -76 109 200 229 -253 29 207 126 149 -229
7409 -229 34 -250 -11 -87 116 32 56 117 245 38 57 -43 -114 -218 -107 131 -209 162 -181 142 -5 173
7431 173 52 31 159 65 235 -43 27 285 80 93 -152 -242 303 147 48 -45 11 -168 -170 74 179 -24 -43 112
7455 112 -248 -164 106 28 128 -37 121 130 73 -114 237 -29 -66 50 -153 -40 201 -47 -179 112 -121 -11
7477 -11 43 218 133 160 -90 -57 137 -222 169 68 14 -10 204 320 27 -184 -63 -91 -100 9 -113 -163 239 141
7501 141 -315 172 10 -128 105 72 13 -140 61 99 95 -254 -273 77 -169 -90 -49 -201 5 -71 199 -50 -151
7524 -151 9 20 -68 31 -329 -131 51 24 24 -328 57 15 70 50 92 -50 0 -174 134 -16 19 92 75 78 277
7549 277 -92 -39 126 -118 64 -33 43 -19 229 133 -147 23 -145 -12 -8 76 -130 -271 98 -153 9 -86 79
7572 79 -29 146 -26 -58 139 336 -280 -73 -159 -133 16 -60 148 -121 -107 273 -9 40 -285 -38 32 -131 76
7595 76 -130 -224 -234 9 192 -56 232 153 26 -131 -94 66 228 -10 21 -62 60 150 -52 59 63 -25 -166 176
7619 176 -169 267 -127 122 149 -5 22 -63 59 -2 -216 -100 81 -49 -37 20 -201 -33 -23 -21 -4 215 -58
7642 -58 133 286 -48 -65 244 -8 93 460 147 -85 44 -60 -92 241 -92 32 346 161 -28 135 13
7663 13 27 393 21 -21 66 -4 -183 73 117 248 -153 183 -157 -188 -22 -15 -36 -110 -142 -99 125 -18 -204 23
7687 23 -19 -147 -26 38 -92 -63 -177 -126 -44 1 -114 69 -128 100 -299 -46 -303 -167 143 118 44 80 175 235
7711 235 54 -86 -26 117 -112 -65 -40 -18 20 216 -185 -136 58 148 -113 56 -161 68 -81 46 -9 -139 -119
7734 -119 -206 8 -15 13 -141 114 -42 47 58 201 -122 134 256 -103 -45 -15 -106 -38 183 80 63 -165 -439
7757 -439 137 -10 -193 30 -224 54 -16 -82 -208 -46 -3 81 2 -139 -51 -44 -153 -90 197 -215 -125 60 50 148
7781 148 130 -65 -64 59 74 -160 296 137 -195 153 -5 -39 44 -1 -54 -77 63 -282 -133 -11 217 -12 -110
7804 -110 85 110 335 77 -111 -251 60 142 -115 140 -116 -142 -308 -39 24 36 -278 76 250 137 221 -66
7826 -66 -153 -365 24 0 -326 76 168 -38 19 -39 38 155 43 -10 139 -81 -157 123 -58 -111 209 -55 -7 137
7850 137 -24 -42 109 215 -129 99 -191 500 402 28 147 -1 -114 213 -72 -26 13 97 301 30 -23 90
7872 90 184 296 -55 -125 -63 -26 72 3 68 -8 -125 -38 -11 111 100 238 95 48 -27 -32 -66 -36 117 -116 36 29 191
7899 191 182 -33 -72 92 -92 -7 -188 18 -291 -418 -53 33 24 -227 83 -175 4 35 -81 -54 -15 -62 -254 228
7923 228 -258 -86 -315 1 -33 52 152 -192 63 215 183 -128 -219 -206 88 -95 -58 -324 -87 -28 45 -189 -19
7946 -19 81 -124 -34 264 84 102 170 124 235 45 81 93 305 -134 90 130 -32 -43 -223 -133 27 -117 -153 -39
7970 -39 123 -143 -39 256 -225 23 150 -31 56 -80 176 288 26 -290 -88 -93 266 30 228 -3 137
7991 137 -5 141 397 330 -145 -119 -21 110 141 197 252 -146 -3 -142 199 61 23 -223 134 -130 -237 17
8013 17 98 -44 76 -90 -56 33 336 -98 -294 -89 -130 -111 -85 174 -225 362 156 -257 252 197 54 -326 21
8036 21 19 -27 27 206 -101 93 -11 -205 -69 35 -8 27 67 0 128 -75 366 -102 40 -117 -188 -37 -64 -83
8060 -83 51 -112 -83 339 -164 177 -13 61 60 -37 -27 105 -232 -6 236 30 129 -90 -225 245 89 -143 -10
8083 -10 -172 45 -134 53 -127 -143 -158 344 -58 76 -114 -48 105 -185 -18 -373 -75 115 -77 -97 -12 185
8105 185 -164 -246 92 135 89 139 -96 -153 -50 224 141 106 -232 -99 29 -186 -50 74 -139 64 122 -199 -122
8128 -122 101 148 -109 -48 -48 230 80 -116 54 12 25 -85 -134 198 -43 205 -189 -310 -66 153 -126 -190 50
8151 50 140 -2 43 280 -247 62 134 103 -58 -253 -151 -202 81 105 -108 96 213 -5 -1 79 -165 122 32 -182
8175 -182 -11 238 75 -60 81 45 -9 -216 -31 268 204 -167 209 -108 -63 133
8191A33
$$ Imaginary data points
##PAGE= N=2
##DATA TABLE= (X++(I..I)), XYDATA
0 0 0 0 0 0 0 0 0 0 0 0 0 -8 8 -8 8 -8 16 -16 24 -24 32 -40 45 -53 64 -72 82 -96 112 -128 144 -168 191 -216
34 -216 244 -274 308 -346 388 -430 481 -533 593 -657 727 -802 886 -977 1076 -1186 1307
51 1307 -1439 1587 -1752 1934 -2141 2375 -2641 2953 -3318 3755 -4289 4959 -5824 6995 -8677
66 -8677 11325 -16119 27687 -123026 -42505 104328 -26680 -3952 14681 6252 -21734 5234
78 5234 3603 3676 -3958 4172 -2847 1546 -1970 1727 -1603 2005 -1233 893 -1346 1017 -1141 1065
94 1065 -714 537 -488 659 -472 644 -436 629 45 388 -136 251 -205 373 -367 29 -72 198
112 198 -174 -128 -203 117 -52 269 -129 -89 -83 64 -269 153 -34 128 170 -133 33 -73 79 51 30 -254 82
135 82 -42 58 -5 -228 -16 197 31 -142 -112 -144 -71 -129 92 -78 -182 -241 104 -214 -86 -87 -173 109 121 200
159 200 177 -146 32 -157 -227 -83 159 157 152 13 105 -104 -383 29 -177 222 -173 59 68 -3 -140 177 169 -216
183 -216 -14 -123 -56 -22 -263 -245 175 -61 -125 -101 143 -25 119 -68 -28 34 -297 -104 127 107 -112 155 -279
206 -279 -121 50 -86 -84 88 109 -262 -86 -54 -49 -107 136 103 -131 -54 -180 -44 75 27 -88 -80 204 -76 123
230 123 130 35 -11 -67 -24 -76 187 -249 -50 264 75 317 -14 98 -101 -28 -95 -52 -155 -69 -46 44 101 -426 155
255 155 277 -72 126 -72 136 20 29 -69 152 -69 -338 14 76 -98 2 228 -215 -19 49 -141 -175 -120 251
278 251 -269 62 -196 -146 -88 -311 171 -1 -265 -237 84 128 95 -37 281 3 -217 -238 -122 123 65 -1 -189
301 -189 -55 -102 -95 280 156 369 6 -240 -40 18 -65 207 148 100 58 -4 303 -20 52 9 38 -61 75 91 214
326 214 -70 139 52 -195 138 237 -117 21 -115 107 116 -130 16 -121 33 -113 156 -74 -5 33 9 -297 -182
349 -182 71 -170 71 32 97 167 70 -36 0 -209 -170 77 -48 133 34 -26 15 -83 -74 -124 -34 37 90 -163 13 32
375 32 -177 -50 107 101 142 189 -167 34 -107 -84 58 -15 -14 -11 -125 27 -48 -152 118 3 41 48 -39 77 -30 151
401 151 148 -48 -17 121 -204 -215 -136 -161 276 -40 118 32 42 -52 -55 1 -151 -64 -20 -118 97 -19 522 212 12
426 12 26 126 -207 -76 201 -64 410 -243 114 76 22 226 39 -182 10 99 -183 24 57 -126 84 -48
448 -48 -28 177 76 -185 -309 107 73 -12 -150 -150 18 -52 -69 44 -110 -199 -75 -82 -353 -149 -220 -179 133 184 94
473 94 -143 -169 -46 60 -217 -64 -12 -12 -152 254 66 57 -139 -69 83 265 149 -312 223 -95 89 153 122 -110
497 -110 351 61 -84 108 -65 70 -129 -286 -47 108 -183 34 -67 -82 136 -4 81 184 -165 288 -212
518 -212 -208 -180 54 -90 -15 37 -179 -34 -7 39 -184 -127 86 -197 161 123 164 147 89 34 -98 106 -40 22 29 57
544 57 92 24 -62 53 -283 161 98 249 -53 82 29 71 95 37 -28 -113 -169 225 -136 251 -125 169 -287 -101
568 -101 -172 -165 166 10 48 -38 145 -156 173 -217 -99 -170 -124 28 -64 -71 190 0 128 -10 188 21 145 3
592 3 -71 20 -117 113 186 -370 32 -125 78 -9 123 -189 74 -363 26 82 -249 -69 -57 -93 -214 25 231
615 231 -147 -269 105 -148 -111 232 -229 155 212 -105 230 223 -39 141 -37 25 98 137 122 37 197 -230 141
638 141 -78 79 -204 -279 -171 -70 125 135 237 8 -170 -9 24 -67 -62 188 -127 129 -143 -5 158 109 167
661 167 -93 15 63 -60 -249 10 -247 -111 140 -65 -119 -69 12 27 37 14 -59 -12 0 -252 -165 -102 -365 -90
685 -90 -59 -99 212 4 114 -114 145 203 188 98 -32 -139 -49 -221 -64 112 365 -173 -180 123 -102 -327 -18
708 -18 10 36 141 165 101 182 11 -268 -19 107 2 -166 228 394 -50 -24 -15 366 1 -231 60 -228 -19
731 -19 -21 98 -49 -85 -94 -10 43 -68 15 -23 377 2 -92 -37 58 -119 -116 -26 -137 5 122 -2 -252 -40 -79 251
757 251 80 -3 -69 261 97 192 213 63 10 -11 73 -115 -7 262 -37 -104 137 -162 131 127 106 -110 -105 -293 -8
782 -8 -28 30 147 131 -52 24 -106 103 -22 187 -229 77 249 89 185 -20 -138 -165 -74 -7 67 -9 74 -144 223
807 223 61 -142 -103 141 142 59 9 256 -61 70 58 -189 2 -60 180 -342 131 7 169 -106 205 -110 132
830 132 16 -281 71 -51 -18 -107 -11 -101 407 -156 -160 133 -81 -194 -154 185 237 -124 -17 78 65 244 -94 -90
854 -90 80 -194 -109 17 358 139 18 59 9 -177 -3 -111 -147 -146 88 70 -71 258 -26 174 28 -81 111
877 111 -128 -49 -219 255 97 94 -175 -235 264 -299 234 322 33 -182 -256 35 -268 39 -112 -108 37 -11 -135
900 -135 -262 -111 36 -189 -13 13 31 -137 139 85 6 -110 40 -194 -56 -10 -152 103 -63 -110 88 104 -60
923 -60 205 -350 70 -55 18 -142 90 -76 59 -201 96 -10 -42 -166 -47 -114 -62 -61 1 -115 10 -64 60
946 60 147 -64 -108 111 71 -105 85 85 -37 -57 53 -67 -139 -51 251 42 -137 48 70 -36 -75 -7 -23 -270 68
971 68 254 -145 -130 10 -30 119 -65 -58 142 -43 52 -26 -229 -297 -90 153 -104 -16 287 74 -136 -10 -116
994 -116 -171 -124 -139 27 -7 234 58 -12 -163 178 10 -66 184 5 88 -49 28 10 206 -268 -12 118 20 -125
1018 -125 -214 10 -29 122 -111 -73 1 35 173 -120 -4 43 42 7 131 -56 -2 63 -99 -80 -204 -94 39 -126
1042 -126 34 86 136 34 -7 127 136 235 -446 42 -244 134 -115 99 38 173 300 -75 -22 8 128 6 105
1065 105 124 185 129 -116 256 66 289 59 0 -35 -239 93 -118 152 -188 -197 59 -35 44 -33 18 374 188 49
1089 49 -238 140 5 45 38 -144 192 249 53 -4 33 -91 -63 238 325 208 -94 9 -13 -180 -174 196 18 4
1113 4 -220 72 42 -228 127 106 313 306 -90 191 -97 -95 -55 100 68 96 -8 -12 166 46 -27 101 -67 111 179
1138 179 -112 211 236 -29 -152 339 176 -64 218 -135 41 12 -63 -74 -16 42 89 124 49 96 -60 66 1 42
1162 42 -41 109 18 -19 121 -191 238 -71 -63 -120 77 -58 69 -95 13 -3 1 102 238 7 -16 -106 -34 8 -82
1187 -82 126 -68 -9 17 130 202 -25 89 -127 270 -143 201 279 168 85 90 48 146 22 -194 198 -55 163
1210 163 -34 -211 -158 248 -80 -16 -7 73 -76 0 73 314 -196 28 205 109 209 66 137 112 122 43 -276 -6
1234 -6 -33 -100 -68 -150 130 -2 248 -5 49 12 -256 -216 -201 191 22 110 -2 -64 -86 -24 264 1 69 -31 126
1259 126 147 -208 -200 82 192 -109 177 48 182 182 -232 17 -82 28 -105 -71 -25 -255 121 -242 59 58 -278
1282 -278 24 143 -212 -151 115 -144 67 -57 -78 76 -48 5 13 -228 -26 -48 -16 58 -273 38 144 -143 -86
1305 -86 -103 -167 217 -364 -3 -77 66 136 55 -163 -58 -50 25 121 -147 59 -73 8 11 -75 -139 98 44 193 6
1330 6 54 22 -98 245 -87 97 101 -430 89 87 23 44 -106 -32 -152 156 33 21 -353 -204 -187 -134 -92 -86 -155 -61
1356 -61 -57 -237 -70 -62 206 18 14 -241 -68 119 45 -49 -192 -48 -45 -15 64 -222 185 -118 11 127 83 58 -65
1381 -65 -102 82 202 -125 13 241 9 145 13 -114 -76 -120 -83 -220 36 66 -105 -246 14 70 -45 1 61
1404 61 -134 44 -71 -84 145 70 -63 173 72 -58 130 93 246 -208 71 -242 -133 5 -121 -85 77 -88
1426 -88 30 -165 -209 28 125 93 -186 -57 -10 -83 -31 -34 -7 45 -101 70 233 -259 178 4 -96 -85 130 9
1450 9 -97 -43 -101 -93 76 -62 -252 -186 65 -32 42 18 62 -182 37 -154 103 -45 18 4 -142 64 -124 -232
1474 -232 -129 -7 -30 -112 9 331 115 46 37 -182 283 -69 345 -113 200 18 46 77 -61 -187 52 -121
1496 -121 98 -25 91 -152 -101 146 -13 23 -150 -67 -18 -187 -206 -219 158 -49 -59 -150 -50 169 -5 -61 107
1519 107 -126 162 85 -88 -123 -156 13 50 33 125 -162 -106 -2 31 -110 107 19 -52 143 16 -214 -241 -121 146
1543 146 173 -33 -5 -57 208 -136 145 -159 -63 -192 -30 -347 17 130 -151 -69 62 241 -31 54 -76 145
1565 145 -115 85 -15 -16 34 119 112 -286 -120 208 -178 39 211 -54 -98 34 105 20 -109 36 -118 18 -79
1588 -79 -107 17 -49 66 29 -33 15 -74 152 -283 -159 176 53 -385 219 -176 -215 58 367 37 -250 50 33
1611 33 -22 -107 -43 82 265 33 127 -216 93 -303 -37 53 -75 184 335 104 -12 254 -29 -136 40 -142
1633 -142 -65 -30 94 216 143 124 101 155 -32 -175 -76 -154 47 158 -387 -116 -216 57 20 70 310 12 -178
1656 -178 -123 -215 -136 132 7 91 169 190 -171 162 148 -180 -26 9 146 -141 -81 160 204 -124 -69 -40 188 82
1680 82 -43 38 435 120 -102 -177 5 51 -4 110 91 -9 -22 39 86 178 124 -45 -105 -86 -132 76 -13 84 -73
1705 -73 -49 56 31 -70 -33 -204 173 55 28 -158 79 -139 -244 184 -58 101 255 -214 42 -293 -119 26
1727 26 305 190 -83 134 174 102 142 16 -98 129 106 114 -44 159 -220 -106 -68 14 122 -166 14 -41 -61 -36
1751 -36 180 142 90 -88 -35 251 134 18 -117 -119 39 308 -212 127 -38 -388 124 -232 206 222 219 80 33
1774 33 -221 76 -14 -108 -64 -83 112 89 -123 33 -80 -25 -33 69 -148 37 -109 -252 146 -25 -75 -227 -22
1797 -22 -369 -197 14 -11 50 112 209 48 -44 -45 59 424 -146 -131 190 130 -85 201 -38 12 76 -18 -67 169 -34
1822 -34 35 60 -224 -127 122 -139 87 -96 268 56 -83 -166 -43 56 73 -18 169 224 -38 89 49 -61 -36 86
1846 86 56 -312 -307 -39 -65 16 -323 -71 0 22 -150 -1 108 -62 -7 27 57 -22 94 121 73 186 10 131 -26
1871 -26 -73 148 -107 -89 141 -6 31 -122 104 -45 -52 -73 116 88 -70 -31 303 -191 -21 182 69 -180 -227
1894 -227 -32 132 -73 176 -243 78 64 196 -171 204 -326 -51 197 62 53 46 91 -94 -256 -248 -43 -52 -399
1917 -399 -2 -300 -137 168 107 69 55 99 -148 90 180 -189 -296 -29 -139 -125 -17 66 122 -164 -304 -25 -201
1940 -201 62 48 -59 -46 -54 51 118 114 78 100 -46 86 -98 138 290 153 256 -55 -26 -24 -30 -54 133 318 -46
1965 -46 3 106 19 27 27 127 16 -331 -4 294 38 -86 -201 149 189 -120 36 -1 -32 -73 -35 -71 198 -24
1989 -24 64 -95 -131 -36 2 179 -79 -16 -116 -180 -198 76 137 14 129 -78 -154 47 -203 -207 -69 62 144 -28
2013 -28 -40 -22 43 159 59 -97 -166 -34 19 5 -23 186 92 97 -126 -70 66 -191 154 43 99 79 -10 309 -47
2038 -47 -85 21 172 154 180 -175 34 37 -94 103 -138 -13 194 19 -22 -121 -52 82 35 9 -24 -94 -148 -122 -36
2063 -36 -141 -180 -169 -56 -1 53 -33 86 30 61 295 0 -267 -149 249 -58 47 -256 137 -78 60 -72 -66
2086 -66 -183 84 57 -75 240 -42 -90 19 13 22 534 51 21 -62 146 252 -32 -96 62 -51 119 -34 49 -33
2110 -33 -27 38 -123 -95 -25 -111 45 63 132 115 7 212 104 -39 -106 -159 -230 -182 304 117 -152 42 -2 131 -24
2135 -24 -146 257 -113 42 -226 121 -12 107 -128 266 194 -102 -243 45 183 81 20 -46 117 -8 26 79
2157 79 -25 -84 -133 -55 41 -151 -62 228 -28 -34 -143 101 -59 135 81 74 -115 -39 -42 182 -50 -12 -210 -55 -147
2182 -147 124 -30 -129 199 -146 233 21 35 -29 19 -114 248 338 -54 -1 -27 36 -14 67 235 192 -197 -18 -123
2206 -123 129 337 -4 -356 -216 -9 -44 210 -123 9 31 79 181 138 -5 32 -19 -165 -181 62 -65 18 -38
2229 -38 -62 -177 43 82 -23 422 1 152 -241 -23 169 344 140 -104 97 -17 227 251 -281 80 80 -123
2251 -123 260 -139 149 -309 -318 -248 131 21 -323 -78 105 235 136 70 -90 34 -144 119 53 -133 171 16
2273 16 -171 -191 -67 -184 55 -267 -48 93 -244 -23 14 151 -114 -111 69 9 261 -22 -19 -62 166 -99 -75
2296 -75 63 -166 91 -245 -174 -19 -16 66 -96 127 -54 -19 2 -62 52 31 24 -152 -113 14 307 -41 -44 33 83
2321 83 -52 139 184 -100 214 55 -4 33 -158 323 -234 -122 308 -28 149 102 234 -260 -19 -86 52 -44
2343 -44 -135 -157 57 -179 237 81 89 -80 15 213 213 34 124 45 176 -176 230 47 -98 108 53 -59 -115 -26
2367 -26 65 61 28 98 -105 -45 -133 -9 -414 61 102 45 133 14 -95 -31 -115 -245 -215 -84 57 22 -261 36 267
2392 267 -257 -57 -23 -114 120 243 -118 -62 52 -24 -119 20 -155 -5 -54 -185 95 94 -119 152 -79 112 1
2415 1 30 86 106 70 328 -44 -3 176 49 -109 -228 33 3 126 -258 -95 138 97 21 -122 151 -84 -23 -32
2439 -32 -344 -19 11 1 -27 -14 22 -40 162 -226 -154 6 -152 -65 -181 149 16 -206 150 69 187 -65 -27 133
2463 133 10 156 171 -131 -142 46 114 -230 224 -85 318 283 163 182 -253 -53 -108 105 -130 116 128 130 142
2486 142 74 6 103 27 114 -190 60 -35 -55 188 -116 -23 -27 -88 150 33 -92 -212 -2 -260 -124 308 24 116
2510 116 -59 -50 230 17 17 123 -60 122 -81 -20 139 -94 32 -47 -58 42 -134 42 52 113 102 -78 11 -12
2534 -12 -20 -243 152 -9 -101 178 259 103 -289 95 70 136 175 -38 -93 -104 -54 146 -54 218 158 54 210 19
2558 19 242 -97 -46 -240 143 -244 -132 -4 191 35 -241 70 171 -51 -105 -168 13 19 4 186 41 286
2580 286 -19 228 103 68 -5 -77 -80 310 27 19 37 -245 -172 -109 25 130 67 132 26 -40 -67 -87 -230 -223 264 -151
2606 -151 19 -102 -153 11 108 -58 -15 -35 13 88 -97 -25 21 -5 -82 -70 193 -155 214 -114 118 10 15 410
2630 410 -196 93 -183 -139 -85 -111 -157 -142 111 129 -34 35 164 -191 -227 -80 84 99 129 102 21 159 12 -182
2654 -182 193 -197 7 230 54 -18 -134 -187 -114 -2 88 -86 73 125 0 51 97 54 -48 -113 -25 -19 -56 22 -79
2679 -79 97 106 61 117 -146 -7 17 -13 -104 -54 57 -115 469 -107 26 -211 1 80 15 -131 -308 47 -37 25
2703 25 -18 -175 32 5 -198 -241 -69 -232 -98 -8 81 -2 -321 76 -74 64 -140 46 172 -82 55 174
2725 174 50 -132 -299 35 -98 -48 -194 28 144 -26 34 -52 70 35 -23 66 185 71 38 72 -178 -86 -42
2748 -42 -8 -85 103 -18 -125 -27 -6 -149 190 137 -90 178 29 -131 -233 48 269 -84 -179 207 -73 20 -159
2771 -159 -35 -153 -48 -58 9 -10 74 -260 -40 -182 -88 126 -175 12 71 -175 -136 70 158 330 -197 119 87
2794 87 -68 78 316 -155 -135 -93 170 -22 345 206 -142 -210 103 -25 -258 -26 26 22 117 -62 -147 -180 -146 -208
2818 -208 -367 247 -60 -206 -48 128 -24 297 100 39 57 183 -3 -83 -121 6 -6 36 6 18 4 34 -37 43
2842 43 -256 -210 59 -227 -22 -14 -114 -191 -74 59 170 -122 92 -118 -132 -141 51 137 10 148 -117 -53 -287
2865 -287 -19 142 199 4 89 -11 64 55 253 -36 -24 26 -300 -188 29 -11 83 -246 -28 25 110 228 53 -156
2889 -156 -110 -93 -295 1 45 58 -140 -31 40 216 226 -108 -100 179 -70 -147 38 129 -53 42 -108 -44 124 44
2913 44 -187 -146 -93 -137 -169 44 166 -39 -27 9 -52 26 222 241 41 -13 -247 -212 119 -26 -107 43 -125 35
2937 35 -146 -169 62 -122 46 -94 217 -142 445 84 -78 -88 -156 -123 132 38 59 -76 238 -20 -54 93 -55
2960 -55 -54 -33 -98 104 175 172 -137 161 216 255 -101 30 -78 164 76 -16 314 25 2 -75 -111 -38 116 -164 176
2985 176 8 -153 164 285 -193 145 34 -13 67 -61 123 235 -146 -34 48 95 -53 -84 102 -21 -25 -10 161
3008 161 33 230 128 185 -46 -228 -85 45 187 110 -168 181 82 140 -68 -97 103 -133 -36 -133 209 55
3030 55 -70 148 -101 -32 -60 32 -213 -321 48 -156 -158 302 6 -10 -109 -65 -259 -104 -61 -108 5 128 -25 65
3054 65 -15 -110 -52 -154 139 -89 -150 -154 293 -37 -60 297 -34 100 -168 -79 -179 -145 130 152 -93 -68 -109 63
3078 63 25 -63 -180 72 -101 38 -95 167 -45 -29 -132 22 89 -162 -24 -35 -162 -274 68 53 190 222 -43
3101 -43 162 70 -13 -323 -112 43 165 14 -83 283 -88 -138 182 -198 -123 169 41 245 176 -83 -14 92 -40
3124 -40 4 0 125 19 -168 -181 33 186 -118 80 -16 14 81 297 -139 5 -59 -146 -55 244 -27 -237 -124 17
3148 17 102 -27 101 88 -135 159 2 40 97 -120 97 36 -26 83 193 16 300 227 59 23 -50 -3 -162 -71
3172 -71 76 -8 60 -213 -73 -106 -7 131 -96 56 5 79 -289 -204 87 -45 207 26 -59 -58 -26 95 322 102
3196 102 -62 -153 -18 234 -217 -116 33 -28 160 92 95 523 -2 -39 114 52 -3 35 -146 281 -174 34 -149
3219 -149 -25 6 170 -164 236 55 -116 -337 -67 -1 -95 -46 -164 -90 87 -4 -13 38 -366 -46 163 111 171 131
3243 131 88 125 -295 92 -137 -54 -149 -36 119 128 -212 40 3 283 -121 -69 147 274 -90 -90 -119 60 -117 64
3267 64 12 97 -148 63 -156 35 97 -8 171 -86 93 8 441 319 -111 222 7 31 -59 -115 -6 112 -57
3290 -57 104 -141 -149 -101 -25 264 -31 -136 -329 -103 -56 70 -43 36 -76 -31 -176 156 57 261 139 68 4 280
3314 280 -35 311 172 -40 -59 -60 -22 -89 52 -14 -82 19 -28 -20 168 218 99 219 -99 105 -34 -20 32 169
3338 169 173 18 -106 167 -43 -26 190 61 292 19 152 -52 113 -113 409 140 -53 -160 196 -111 -286
3359 -286 -105 81 38 84 -202 -32 19 -47 -164 -124 -208 -50 44 116 -62 12 92 -38 15 -51 49 71 -63 -74 343
3384 343 86 210 -188 -38 49 -77 -53 162 -89 243 -18 -154 278 140 70 46 15 -62 11 61 1 227 -5
3407 -5 -71 2 -137 -37 -118 121 74 -70 -165 18 127 37 -162 5 100 205 -23 -94 64 201 261 -43 41 -50
3431 -50 -133 -38 322 126 -94 -39 123 -54 -208 -117 -66 -3 161 149 105 53 87 -178 26 92 -275 -32 -20 16 -51
3456 -51 195 -22 -165 110 190 -16 -197 41 -11 -240 -153 30 33 -250 -21 -130 121 -4 78 -227 -129 209 171
3479 171 -187 89 -101 -397 -302 18 232 205 -149 4 241 -195 216 -9 21 -258 23 -50 189 -25 121
3500 121 161 174 -184 236 -35 32 118 171 180 3 27 -1 -35 54 97 -114 -119 -86 5 -124 159 9 -68 -106 38 -81
3526 -81 -5 39 150 -45 116 -98 -130 -57 -287 204 139 258 -5 157 -86 -149 -109 102 -4 159 25 -57 -8
3549 -8 237 404 -74 32 -74 25 -50 -195 -100 -93 69 -129 240 -40 -139 11 168 48 -172 -28 -56 56 3
3572 3 -116 26 -274 -6 147 -372 20 91 -117 -36 -163 -15 -37 53 225 205 19 120 -24 -345 -76 66
3594 66 63 56 237 -62 61 36 -26 -100 250 118 -69 -65 386 109 -161 169 -204 -107 -70 -107 -223 -194 305 130 -123
3619 -123 -78 -210 -54 210 11 -156 47 -3 -59 1 57 7 -134 120 37 -62 99 189 -104 -212 -131 7 -127
3642 -127 59 52 -68 -74 160 95 235 157 37 -33 -233 -70 145 183 38 111 119 -259 -219 -14 219 94 13 -197
3666 -197 37 26 9 -62 21 142 -282 -78 -59 182 92 116 41 137 134 -343 -109 -222 -315 -22 -71 178 32 4 149
3691 149 34 -160 -18 -254 165 -106 145 -141 189 -25 -62 172 -48 203 -220 202 -33 -207 -77 -211
3711 -211 -41 -39 124 -295 105 82 6 -61 -84 2 169 -146 28 8 134 73 99 135 78 1 119 -122 -132 -249 1
3736 1 53 -14 77 60 163 22 -20 -156 224 134 87 -7 -252 -7 -39 39 -11 134 -122 74 3 11 -61 132 -4 42
3762 42 -97 -26 92 6 122 103 -10 -58 -249 -65 107 166 2 -44 13 -152 136 4 169 -151 -151 -217 266 -73
3786 -73 -29 166 -167 68 208 -27 203 116 96 111 168 47 77 82 174 -32 169 89 -221 -215 59 -31 -5 72 118 -43
3812 -43 -226 -36 -8 -83 -20 -31 126 12 69 -52 -20 -206 -116 172 -61 8 -68 -72 -287 -99 20 5 141 68 134
3837 134 -30 127 -264 -11 106 169 205 -75 -32 -34 162 10 7 -8 137 121 41 -152 -140 78 52 11 -90 74
3861 74 12 161 -208 -135 144 -166 -76 52 153 229 371 -36 326 -85 177 176 2 -128 -13 218 -251 47
3883 47 -164 193 -67 -88 67 110 -26 -42 -6 -49 -87 63 38 188 -26 -16 -64 109 66 115 269 -191 238 -100
3907 -100 83 321 -28 401 71 249 -73 145 90 -153 -369 63 222 -26 -30 22 63 -38 -153 311 64 -93
3929 -93 -69 196 -49 -219 -77 -37 -23 50 113 -91 68 -61 188 -40 -297 -31 172 -57 115 -166 -85 12 191
3952 191 19 -269 2 125 -47 -175 133 67 130 24 134 214 -178 335 133 -43 -245 -171 74 200 135 100
3974 100 134 -107 174 -82 124 86 41 -201 33 -86 -31 -96 -75 49 -136 -103 85 -15 -28 -130 -178 56 -45
3997 -45 -52 -104 58 255 309 128 97 10 21 187 78 123 -59 43 -96 -154 -1 176 132 -177 105 -63 124 98
4021 98 264 66 124 335 124 109 196 -102 202 -102 -9 -156 150 -259 5 -60 -39 -95 -153 -78 -115 213 40 15
4045 15 -247 -99 138 254 150 141 227 92 61 182 129 -73 50 -175 1 53 -284 172 -201 91 1 -23 -226
4068 -226 -71 67 -34 26 91 16 -154 100 -396 -52 -62 -21 -24 -173 -121 -83 -101 170 -96 -64 88 -20 94 95
4092 95 112 108 -89 121 -101 -15 -70 -60 -29 128 -164 -5 56 -8 -67 239 184 50 -139 -16 82 124 -212 -177 -90
4117 -90 122 23 -310 -282 -43 -12 62 78 -142 -148 -67 276 -95 114 -43 -56 128 -33 231 299 21 -108 26 129
4141 129 -72 -73 42 148 28 -181 159 115 2 164 58 143 144 226 141 -91 75 -20 1 220 -20 70 46 -215
4165 -215 24 3 16 -141 34 26 123 80 -100 233 94 84 -86 -148 -43 -162 22 -78 72 44 11 4 -60 -263
4189 -263 -12 -110 -66 127 -76 -5 -39 -105 -85 4 -57 148 -10 145 -188 -255 140 -50 8 226 -154 -49 -48 282
4213 282 -129 -241 168 164 -71 -68 59 47 107 -137 -20 197 -305 -120 23 49 156 -3 -18 88 120 51 5 157
4237 157 384 30 33 -271 -8 197 -75 104 81 138 135 -227 213 -347 10 82 3 48 -199 116 85 -1 127 157
4261 157 -73 170 212 -7 -55 146 89 242 133 82 -301 219 -1 -237 -122 23 -174 65 182 75 29 -95
4283 -95 110 440 99 58 70 -133 -184 127 -3 -51 329 230 65 -61 177 -99 -207 -81 -349 -169 96 -109
4305 -109 -90 114 0 -122 -123 -211 -72 -256 76 -123 -119 -131 -33 91 -69 -251 -129 85 -86 -199 -171 -17 100
4328 100 0 22 74 -7 -94 -9 118 18 39 190 -93 144 178 -56 -144 43 -222 -130 -74 -179 59 -86 -267
4351 -267 18 -72 1 -2 -166 149 379 -154 -83 -156 -48 276 75 4 66 91 -203 178 71 70 85 -62 -59 -100 6
4376 6 -35 68 128 -84 201 93 185 -110 -57 52 159 75 194 243 60 159 -44 55 53 237 134 -76 286 25
4400 25 113 205 244 122 -40 -313 99 227 -36 291 105 271 34 57 -73 -38 -29 -144 -97 94 41 -57 103 -87
4424 -87 10 5 47 -30 -64 206 -63 -78 -93 16 170 227 -184 244 166 -19 26 225 -154 -96 48 -165 -138 131 161
4449 161 44 -63 -41 7 97 71 -267 96 -36 76 226 -143 -47 -82 -20 -159 99 87 -19 118 -205 133 -90
4472 -90 81 98 78 -202 56 -43 -179 98 -37 -87 -53 -279 142 226 -306 66 -73 242 -89 -202 -121 -43 33
4495 33 -113 125 -142 -305 56 139 -48 117 141 112 -81 -60 -284 8 -96 -20 -104 205 -145 -37 162 -97
4517 -97 12 277 158 -165 61 31 -106 0 33 -115 302 -86 97 -74 -335 97 102 -154 279 55 26 -92
4539 -92 -108 33 -63 -60 110 -58 69 -95 171 15 175 -45 -215 -41 -122 105 -405 -1 -31 396 -3 219
4561 219 -140 253 -149 103 78 -44 -68 209 -19 170 -66 -49 -44 -120 12 -46 -88 -90 72 80 55 -311 0 29 -273
4586 -273 182 190 76 -18 116 -52 40 -108 -105 -158 39 -181 -171 190 3 -114 26 169 166 -33 54 188 -57 44
4610 44 -255 -144 97 207 120 -194 -59 110 -82 26 -44 313 118 -147 -58 142 -71 -261 108 -182 298
4631 298 264 22 106 6 -123 -14 -72 -208 -52 -203 -230 5 -43 105 -75 -89 29 187 -35 -122 -52 11 97
4654 97 -314 -27 -75 -202 35 -303 104 -69 -68 48 32 -222 -135 33 -126 2 -135 -275 10 191 -119 50
4676 50 235 13 -224 -22 -70 101 -5 86 212 -272 -116 -6 134 -38 -50 277 51 65 -28 70 52 194 -55
4699 -55 -12 -81 15 -44 19 119 -151 -196 -199 -185 146 -239 -94 -79 180 -67 127 -74 -322 -23 92 42 135 -204
4723 -204 148 -68 -215 -67 -139 37 53 -144 -54 -207 36 394 -85 3 -87 5 -36 -6 -60 46 -185 -4 48
4746 48 -161 -204 69 88 135 -93 -268 190 246 56 -154 -78 -71 -194 107 205 4 108 142 -138 132 -4 -26 38
4770 38 68 22 58 -124 -237 33 386 233 -159 50 -115 -47 -118 -20 96 298 0 60 -41 136 -215 114 179
4793 179 -32 -215 202 -112 129 -8 -10 135 -164 -120 25 154 -215 37 38 -273 -171 -153 33 -53 274 97
4815 97 -178 -59 11 -10 23 -44 140 -214 89 -185 -102 -282 139 -18 218 -26 -63 -34 59 -447 -22 252 -185
4838 -185 123 -255 -6 181 260 -20 -81 -84 -51 -121 176 424 77 94 -292 -57 -147 -2 152 104 143 20 67 -83
4862 -83 182 -456 219 -27 -65 148 102 114 -95 -151 168 248 -226 87 282 55 -113 -1 -21 2 -86 -74 42
4885 42 -12 86 -69 -318 -14 26 -24 -48 203 167 -136 228 -19 364 107 184 -29 77 100 28 -119 -99 -68 37
4909 37 -118 14 -88 32 -123 203 223 4 21 -14 64 330 370 75 47 33 -20 -20 -94 -8 -10 8 -83 84 -82 125
4935 125 -125 -84 331 207 40 -6 -56 201 -93 111 71 -30 -16 158 31 -32 48 15 100 -128 -44 -91 -45 -137
4959 -137 -32 147 88 -159 -96 -113 -4 73 133 35 -21 11 -47 166 20 149 107 158 39 -35 128 -128 71 -111
4983 -111 7 -63 -52 -47 -7 -69 74 -16 -112 -57 5 -157 -87 136 -137 99 249 -25 136 -274 -144 -19 85 -54
5007 -54 92 -129 144 6 151 -11 -391 -30 -93 -84 -22 -23 -141 -82 118 11 65 -43 127 -31 28 -333 127
5030 127 -152 82 -97 -123 -81 -145 -16 160 -19 40 -114 156 114 -16 105 -171 -84 -92 -132 -189 -89 230 153 -86
5054 -86 1 288 39 270 -40 -213 -44 -47 102 151 -3 -60 -20 60 -78 173 -10 -12 82 5 151 59 235 171 44
5079 44 174 -52 -36 204 20 -122 72 147 94 215 149 148 29 -128 -60 143 354 -32 -164 161 -122 -113 324
5102 324 72 -145 -169 -116 270 -93 111 35 -46 -22 264 -68 252 31 139 -20 -191 271 58 -10 28 -7 -70
5125 -70 109 -264 -223 -42 108 96 249 534 13 -63 165 6 58 -66 50 -82 80 205 43 161 -2 -11
5147 -11 90 -34 167 57 184 -59 -302 -104 -58 37 257 -89 0 44 -58 -178 207 -364 188 205 -183 -56
5169 -56 115 -24 109 57 -163 -70 -15 66 162 -149 -19 -150 -193 231 250 -66 -83 7 60 -215 4 16 6 197
5193 197 -68 88 -188 -6 223 237 -109 125 193 -96 64 143 233 353 -11 170 -25 -132 -2 60 176 -22
5215 -22 105 51 -179 -96 -189 25 294 80 -390 -50 147 154 33 217 86 -87 -122 -27 -39 8 -5 -21 67 -18 -301
5240 -301 67 259 131 29 341 -128 85 387 242 -57 -116 -113 -31 -72 -19 -1 -28 15 -238 -133 52 -89 276
5263 276 -48 -44 300 83 -198 -52 -3 -199 70 179 9 25 -139 134 25 122 -89 -71 -156 -133 -201 -24 140
5286 140 -263 -193 17 -158 122 -157 85 -11 121 -203 -68 -21 39 51 -201 245 -25 -86 -174 -178 83 209 300
5309 300 -44 -99 149 31 7 263 338 202 92 181 -43 -179 104 3 -13 94 -10 -50 184 -32 -54 -99 -67
5332 -67 213 165 46 -126 125 199 -60 89 176 -58 117 -56 81 -8 -71 127 -130 41 176 -17 102 11
5354 11 107 -275 8 -89 -155 -9 104 -19 -140 269 58 -145 3 -32 32 -251 -93 -11 -11 -100 -76 -101 -74 -10 -39
5379 -39 193 197 158 -9 -10 -66 132 -53 70 158 -118 93 -150 18 65 -281 70 -76 -61 1 175 -108 192 220
5403 220 41 -198 205 -114 135 -107 -203 250 203 -84 164 -54 272 -272 53 49 57 -97 2 161 -85 137
5425 137 -208 -123 -154 -46 196 -68 -144 258 118 -31 214 244 -171 237 110 17 44 176 145 101 -88 -213 -13
5448 -13 -180 -148 -98 101 -136 -182 9 68 -132 -98 111 189 91 -8 122 -233 -61 -180 48 -6 27 -72 -50 -150
5472 -150 370 176 375 46 -90 -108 141 27 189 -145 -133 -299 -83 111 -272 -87 41 -199 142 18 -102
5493 -102 310 -101 -334 37 -154 132 110 -38 -181 -144 83 133 27 179 48 276 -33 175 96 -24 -47 169
5515 169 284 129 39 76 48 -23 242 3 -50 -3 54 -81 -195 117 39 -13 16 -155 -61 -194 251 -138 56 139
5539 139 -115 185 4 314 279 23 -220 41 -387 37 55 -86 -61 -160 -183 -174 18 127 43 -28 288 -52 215
5562 215 -278 -12 244 -129 27 48 127 -224 -238 -77 -299 100 -42 114 71 75 99 30 181 17 -166 84 -212
5585 -212 207 255 -285 81 8 -180 174 117 -10 -82 166 -46 210 -89 155 -192 -140 30 -251 -146 74 -34
5607 -34 -78 2 78 134 3 -116 -73 -216 -94 -94 50 8 62 -271 77 162 50 -7 -28 47 58 92 -280 71 223
5632 223 -41 240 27 209 -17 66 -162 -8 134 -347 177 -31 158 -93 10 133 -177 -77 78 -172
5652 -172 -41 -134 -172 -240 -233 -237 9 -44 -13 49 222 -3 150 -52 128 -136 -211 88 132 99 -171 -237 -48 -90 -59
5677 -59 16 52 93 -77 -212 78 -252 175 5 57 218 -101 136 -117 71 145 -77 221 -89 4 11 -144 -93
5700 -93 240 73 68 86 -130 -29 57 -133 -5 -116 -227 -164 -242 46 109 97 -84 -234 -109 225 -148 -140 -26 -152
5724 -152 -225 -20 30 198 -214 54 214 -44 232 -116 -98 -339 -97 165 -4 -56 118 204 90 -146 146 -36
5746 -36 -32 -32 -62 333 105 226 31 116 -161 272 -7 -139 183 137 94 -92 151 205 -61 18 -220 100 -315 -80
5770 -80 71 82 -119 -168 -41 214 162 -171 -14 4 -79 69 151 33 17 14 -4 310 -55 81 -40 39 -50 85
5794 85 -99 -105 -109 -54 -12 206 155 -269 -76 23 53 -91 53 132 -52 10 -118 69 -181 -132 2 -128 23 129
5818 129 -53 56 -27 -57 3 -232 -152 -181 47 13 67 4 174 -174 -18 73 107 -138 19 116 -76 -146 81 -1
5842 -1 3 221 -255 -102 -234 136 125 168 -44 -44 -21 -157 -89 -188 -70 52 -162 162 -113 82 -172 43 72 187
5866 187 -43 -63 -67 -209 136 -5 -95 76 52 167 -125 39 -107 -179 -273 261 52 66 71 -179 -209 287 15 214
5890 214 28 248 -80 43 -38 66 70 -192 64 -79 -192 -75 -203 30 191 -21 51 49 146 -5 123 264
5912 264 -213 23 121 -122 210 -75 59 55 198 74 -12 -61 -193 93 4 -101 -140 107 -250 279 -390 -73
5934 -73 34 -67 73 -4 52 230 -87 -11 43 9 21 111 164 216 15 -96 -86 206 69 -36 40 -6 65 -5 -34
5959 -34 -65 -84 67 -142 -37 201 6 -99 0 -29 -66 231 132 -38 132 57 -61 -6 90 -99 -45 -200 -85 -109
5983 -109 -4 -76 -273 69 16 118 16 277 130 -130 136 -51 118 -114 -26 166 -53 -5 -140 113 -115
6004 -115 -47 13 84 -107 -83 57 -115 -22 308 -95 -141 194 15 130 -243 -105 200 225 344 -85 -9 95 254
6027 254 88 -144 215 73 -70 115 -18 19 -204 -144 58 -147 7 -122 -35 410 -197 176 -89 -193 -180
6048 -180 -61 79 22 34 60 -250 -47 147 -218 92 53 49 -81 65 -347 87 -109 163 -266 -97 -20 192
6070 192 -94 98 -2 31 2 47 183 67 117 -13 -18 -236 29 -39 174 -85 71 107 132 7 60 154 -10 173
6094 173 10 44 24 -125 105 204 -86 164 -63 69 -170 -186 45 153 -468 -108 98 204 15 -105 -61 -37
6116 -37 112 -130 3 -4 -136 2 -128 -52 62 50 115 47 -124 56 211 -92 -160 4 41 -139 20 168 -151
6139 -151 38 30 -45 -53 109 -96 155 -38 -83 53 -64 117 129 57 -202 214 -74 96 177 142 128 -62 -149 -90
6163 -90 -114 231 -49 51 -195 -120 -63 288 181 -63 -267 -82 61 117 -41 -233 -47 -248 -4 -199 84 245
6185 245 -26 -166 148 -333 -186 162 23 200 131 204 68 -36 124 233 29 165 -387 155 -113 -88 -88 -64
6207 -64 -208 109 161 -21 6 155 167 -12 -46 245 6 -107 -52 -204 65 174 -19 163 97 -118 84 30 -67
6230 -67 241 -16 -22 70 -16 14 194 -69 -96 -15 -184 -212 190 134 -99 -59 -180 -113 -92 24 -26 27 -52 -120 39 -84
6256 -84 -122 -214 24 -38 -78 -265 -89 -169 260 -267 -82 -41 -155 -191 1 -82 72 51 132 -14 -101 6 174 105
6280 105 -31 192 139 125 -182 -252 -57 192 110 -36 -226 -221 -89 51 16 -85 -39 359 29 131 -174 60 6
6303 6 -19 225 30 -175 160 91 154 138 132 309 61 -28 -146 -69 -214 147 -24 54 54 338 -71 2 23 47 -293
6328 -293 -177 25 -65 31 -56 172 87 207 190 83 -132 -140 31 37 -112 -225 42 -85 30 103 -9 26 174 -55
6352 -55 -99 86 16 335 144 -312 107 -6 -370 -6 70 -133 -168 42 -27 20 63 -26 195 257 180 -194 117 128
6376 128 109 173 147 -41 -126 -103 220 -106 -262 89 -156 4 -71 -91 -41 -1 13 3 135 110 -76 -274 132 -125
6400 -125 12 115 4 4 53 117 55 132 134 -47 -52 369 82 4 -83 -97 116 145 -30 70 44 -28 -136 -185 -229 37
6426 37 -137 28 -75 -8 -292 244 184 -31 -12 115 116 -90 131 177 -92 -62 158 123 -162 -26 70 199 49
6449 49 -270 -126 95 23 97 -220 28 24 65 -81 132 -45 90 121 12 275 -39 -130 -53 -25 69 47 192 -171
6473 -171 -25 71 -49 233 -9 224 -310 70 80 42 -26 -168 212 9 93 7 -112 -24 269 312 0 -25 182
6496 182 78 99 47 146 -304 -62 -100 49 -10 -170 10 5 84 116 13 -107 60 3 216 -10 -64 -154 60 -76
6520 -76 -196 -65 -130 118 145 97 132 -283 -127 27 -223 69 153 109 104 -94 52 -129 -107 422 219 -165 318
6543 318 -61 -313 -151 -228 193 244 58 -94 27 294 -91 241 197 157 -113 -245 -33 185 131 100 -97 156
6565 156 -94 60 -49 237 -213 52 -50 -79 56 -253 11 -164 -141 255 51 6 114 122 75 7 141 -152
6587 -152 -110 -71 69 -235 26 -192 -36 -29 -28 222 -182 -105 -86 284 13 27 -143 -69 -86 137 -97 196 216 73
6611 73 -6 -285 73 -56 -91 102 -127 29 -17 152 87 32 129 144 -76 -24 -137 -71 -226 -131 117 -172 -137 -144 -25
6636 -25 139 -85 103 36 92 77 99 155 71 -86 -178 53 5 -178 250 -73 -251 52 2 -314 -47 -160 147
6659 147 -17 299 -75 175 160 11 -52 70 -170 -4 40 103 267 36 -3 65 -51 60 -127 117 66 266
6681 266 -91 -38 -24 -6 121 -375 339 -42 203 161 48 59 -26 -88 -40 -38 -43 -217 24 35 341 -103 -179 27 84
6706 84 25 300 -154 93 -36 1 -160 52 -200 62 -60 -18 -162 187 -33 14 -79 -81 80 -177 -247 176 -127
6729 -127 84 -138 -135 266 -8 30 -14 15 53 67 350 121 194 -128 -11 78 -18 134 -35 -19 -61 121 105 -51
6753 -51 321 -105 -2 259 -161 181 -112 176 -33 77 -40 176 83 -49 45 131 140 -4 -119 -34 -37 46 -156
6776 -156 240 31 -114 94 -187 296 -87 27 -102 16 -138 -141 195 171 5 -226 132 50 49 -177 51 9
6798 9 54 -176 -427 148 144 153 -90 36 13 162 -85 -150 26 106 -4 149 -142 -87 -88 179 29 -112 138 223 159
6823 159 -29 8 -95 -86 72 -122 -96 1 221 -236 -152 37 -219 -84 181 -227 -16 143 -12 -93 115 20 -154
6846 -154 -383 -132 89 28 -89 -133 -197 -111 108 16 124 -127 22 -83 -118 -25 -50 -19 -12 32 -127 -123 118 -83 -5
6871 -5 107 -105 142 -50 93 86 139 -193 -373 -238 -136 -48 -247 72 44 -46 60 -182 -156 139 -112 -9 271
6894 271 -151 -170 137 55 238 -186 -73 -169 125 3 11 57 -309 129 -21 78 -231 -2 -67 -13 -186 -76 195
6917 195 42 18 217 162 -192 23 -144 -221 34 -215 -26 -109 241 202 -23 45 -234 -157 41 72 0 -145 228
6940 228 -78 -82 93 -114 -32 -3 -111 334 -124 144 156 -174 -169 132 127 32 191 -317 -150 5 -77 19 165 -35
6964 -35 69 -92 -171 -41 -164 58 -70 209 252 241 3 -18 391 213 44 234 107 143 32 76 70 -107 252
6987 252 49 -71 18 -224 -9 -84 219 86 -83 -189 -89 -49 -18 312 -419 -49 -193 -121 19 -159 221 114
7009 114 25 133 -64 58 -127 -82 -34 93 2 -209 123 188 -217 9 175 -157 26 -84 47 -85 274 169
7031 169 315 99 -22 -45 -83 -71 115 134 -72 -178 89 -30 20 -12 -122 38 -88 74 -211 -27 154 -66
7053 -66 -15 16 -43 145 -118 70 -113 99 -126 -78 254 169 53 93 -90 -11 -268 167 -100 -319 214 -133 22
7076 22 97 -179 -22 -9 60 193 -140 -378 89 -263 -144 -21 64 -31 -11 -15 -168 90 161 298 -6 157 13
7099 13 145 -132 -78 -57 52 12 -36 -136 141 -113 -122 43 -7 -61 -36 -25 -119 24 144 -281 29 -271 186 283
7123 283 19 2 -154 -241 220 -234 120 35 -137 274 -69 44 -134 96 10 15 62 -214 56 -47 -13 -74 -108
7146 -108 210 112 107 67 228 82 284 -132 272 131 144 -58 -17 -240 132 63 12 -171 -323 -106 -61 -27 187
7169 187 -19 -276 144 66 183 128 120 167 -35 79 -51 -49 72 124 6 118 83 49 -275 -328 49 -177 138 95
7193 95 -70 66 318 125 -108 12 -192 -156 -125 67 -10 138 74 -14 30 135 -5 90 -253 3 -54 -11 110
7216 110 59 -290 -27 -83 50 -23 386 -115 274 -84 -180 -133 114 286 -244 107 -99 186 -12 -85 24 94
7238 94 -42 33 169 -13 -99 -129 14 -42 158 -32 -232 -52 -94 -82 84 -14 -113 -133 118 -103 -123 112 -58 -46
7262 -46 36 -300 9 -28 262 162 -8 62 -85 68 -66 -86 149 -179 -121 111 82 311 136 -27 17 103 -1
7285 -1 132 -3 37 273 -20 -119 33 74 236 -51 -69 47 84 -89 3 57 -225 22 56 269 50 81 342 99
7309 99 -135 -89 -78 -67 13 206 -112 84 104 158 33 27 87 -118 42 -326 -10 -161 39 -208 -192 160 6 29
7333 29 2 235 -290 36 1 -80 -138 -184 -108 -96 -68 21 -294 -8 -74 -62 85 -179 295 297 201 -6 -89 -99 64 -121
7359 -121 114 -131 12 -17 -194 78 -124 -11 -28 -111 -8 52 50 133 178 124 251 -28 2 40 -108 -219 163 -116
7383 -116 29 -34 -203 126 -122 -318 -225 -112 -183 -147 222 158 -80 -31 -267 224 39 -71 28 -221 -138 -34 -66
7406 -66 61 230 54 51 -165 -134 15 -93 -221 -275 -150 210 134 -39 -2 -205 -135 -71 107 -186 69 3 -239
7429 -239 -39 60 169 82 94 13 -98 259 36 -30 -166 -150 67 152 30 89 -122 44 210 18 50 -41 16 -176
7453 -176 99 -59 64 157 -356 -77 -82 -453 51 222 141 -383 53 23 -216 170 -259 -65 92 13 -98 -167
7475 -167 29 57 -35 -295 50 -51 -105 146 102 -33 -32 -50 -116 62 -13 -4 -62 -254 83 -1 -187 169 -339 83
7499 83 352 -55 247 -8 113 223 12 -181 198 77 -253 338 -113 -72 -231 -95 -196 11 -142 94 -71
7520 -71 -70 146 80 20 -107 251 65 -82 57 67 -131 35 127 185 289 249 164 114 39 -36 -26 -124 -156 1 -169
7545 -169 123 164 114 -9 155 -167 185 3 117 -22 -248 40 -16 107 126 -139 111 5 97 -251 -41 134
7567 134 58 41 -43 -56 -125 13 14 60 -57 -36 -314 122 -109 -41 -249 -120 -2 -248 138 40 -64 -87 -39 -10 58
7592 58 145 37 -66 170 -161 147 -136 -173 183 -4 226 -64 81 88 -23 57 206 -2 0 -14 128 12 109
7615 109 -181 174 -235 -98 -154 88 267 -27 198 196 -78 -21 242 32 -121 -139 -136 -194 222 -258 -77 12 79
7638 79 -36 62 158 -45 98 38 202 155 115 32 134 -78 -439 2 190 45 -76 -104 89 195 98 14 41 6
7662 6 -92 99 -104 -64 123 73 24 97 33 189 19 -182 -123 160 -169 36 -121 131 48 -218 -255 -105 -42 126
7686 126 22 -63 8 -203 30 -23 165 -25 -4 98 -82 13 -237 41 124 106 130 86 -114 -22 -11 82 234 -15
7710 -15 -145 -67 -41 102 163 -67 48 -158 123 -136 -25 -164 122 217 -272 -154 -105 -192 323 -14 -56 88 69
7733 69 154 -310 -260 -245 -173 -45 14 116 40 -99 71 -1 -95 8 39 -156 -48 95 -22 69 -88 321 -159 94
7757 94 162 253 -102 -16 -82 -18 257 96 -110 -104 39 -91 -14 366 131 -148 198 -145 -73 -194 188 -77 6 -82
7781 -82 -24 -122 27 330 60 58 -248 271 -42 197 29 -232 -81 195 167 -185 77 -17 39 -90 -176 21 162
7804 162 -5 44 -84 -138 37 427 -323 136 296 -91 -55 217 109 -66 84 -64 124 -121 96 187 -203
7825 -203 90 118 128 113 -118 19 181 -65 86 -59 83 -137 -32 -174 60 56 -97 -54 -232 -7 -191 -40
7847 -40 41 93 130 39 29 -205 217 -64 190 167 193 -135 -277 -79 122 -235 -161 -156 -103 104 220 206 77 -152
7871 -152 50 58 151 26 -182 -80 -92 25 88 -167 -78 -81 279 79 28 -179 8 -189 67 -25 -20 30 31 127 38 4
7897 4 -168 20 134 320 -112 12 -37 -110 -90 201 -149 -243 -56 -41 142 101 164 -228 -163 164 -53 -6 -88 -36
7921 -36 200 64 404 157 126 -54 -120 -123 229 -230 -117 174 -18 140 215 291 -109 -176 20 244 94 195 -139
7944 -139 217 105 -91 114 121 -41 -7 144 75 -220 48 -141 274 -18 6 -38 183 119 -49 -1 103 135 -109
7967 -109 -173 42 -9 -213 -5 51 60 -11 -146 -397 214 -129 69 151 -1 23 98 14 -112 153 183 19 -276 -138
7991 -138 27 35 13 -140 429 -268 -43 -182 204 398 -35 -79 -353 -162 121 -112 -92 -147 -146 106 25 104 -95
8014 -95 467 1 162 16 -37 -216 -202 -104 -58 -3 226 199 136 178 -123 43 -26 100 -12 142 128 77 -245 -133
8038 -133 -55 -5 111 -116 22 -148 99 -151 -98 -91 213 -63 211 -139 393 7 69 -52 25 51 -64 -18 -67
8061 -67 243 -107 106 127 86 -86 124 124 -12 -67 50 278 79 -45 -49 -149 49 -155 -116 85 -159 93 10
8084 10 137 -125 139 -223 -338 -110 -181 -23 37 -25 -163 -153 77 34 9 87 82 242 -28 -76 125 12 -162 -44
8108 -44 215 -5 -215 -9 46 -81 196 -11 111 74 256 -49 136 -38 285 -137 142 -108 -38 -29 -220 -233
8130 -233 103 -94 135 88 -269 46 -123 186 98 -141 -36 -245 -313 -195 35 55 13 184 85 156 -260 -13
8152 -13 -137 54 -110 95 -203 -106 78 189 -52 -79 117 92 175 -146 13 -64 -138 -104 126 -134 -6 -60 94
8175 94 93 -97 116 -38 225 394 -153 129 -27 -357 166 144 -49 116 -26 42
8191D2
##END NTUPLES=NMR FID
##END=
