##TITLE=1H_DE-102-ch_7_TFA
 200.13MHz,CDCl3,
 8 sc
 
 27.8.2025
##JCAMPDX= 6.0         $$ Bruker NMR JCAMP-DX V2.0
##DATA TYPE= NMR FID
##DATA CLASS= NTUPLES
##ORIGIN= UXNMR, Bruker Analytische Messtechnik GmbH
##OWNER= pz
$$ XWIN-NMR		Version 3.5
$$ Wed Aug 27 14:21:15 2025 Russian Standard Time (UT+4h)  she@DPX200
##.OBSERVE FREQUENCY= 200.1313
##.OBSERVE NUCLEUS= ^1H
##.DELAY= (6, 6)
##.ACQUISITION MODE= SIMULTANEOUS
##.ACQUISITION SCHEME= undefined
##.AVERAGES= 8
##.DIGITISER RES= 18
##SPECTROMETER/DATA SYSTEM= spect
##.PULSE SEQUENCE= zg30
##.SOLVENT NAME= CDCl3
##.SHIFT REFERENCE= (INTERNAL, CDCl3, 0, 14.3821)
##AUDIT TRAIL= $$ (NUMBER, WHEN, WHO, WHERE, WHAT)
$$ ##TITLE= Audit trail, XWIN-NMR		Version 3.5
$$ ##JCAMPDX= 5.01
$$ ##ORIGIN= Bruker BioSpin GmbH
$$ ##OWNER= she
$$ F:/spectra/data/she/nmr/H-C/1/audita.txt
$$ ##AUDIT TRAIL=  $$ (NUMBER, WHEN, WHO, WHERE, WHAT)
(   1,<2025-08-27 14:19:41.60 +0400>,<she>,<DPX200>,
      <created by zg, POWCHK disabled, PULCHK disabled
       configuration hash MD5:
       00 E9 B6 7A A2 85 ED C7 34 08 36 98 17 FE 4E 26
       data hash MD5: 16K
       E8 6E 1B 50 AD F3 D3 5F 0F 4F 1D 47 C3 7C C6 A7>)
$$ ##END=
$$ 
$$ hash MD5
$$ 82 60 39 AF 2E 95 03 CF D8 97 A2 52 7A 12 C4 FE
##$RELAX= 
##$RELAX= 
##$RELAX= 
##$RELAX= 
##$RELAX= 
##$RELAX= 
$$ Bruker specific parameters
$$ --------------------------
##$DU= <F:/spectra>
##$EXPNO= 1
##$NAME= <H-C>
##$PROCNO= 1
##$TYPE= <nmr>
##$USER= <she>
##$AMP= (0..31)
100 100 100 100 100 100 100 100 100 100 100 100 100 100 100 100 100 100 
100 100 100 100 100 100 100 100 100 100 100 100 100 100 
##$AQSEQ= 0
##$AQ_mod= 1
##$AUNM= <au_zg>
##$AUTOPOS= <>
##$BF1= 200.13
##$BF2= 200.13
##$BF3= 200.13
##$BF4= 200.13
##$BF5= 200.13
##$BF6= 200.13
##$BF7= 200.13
##$BF8= 200.13
##$BYTORDA= 1
##$CFDGTYP= 0
##$CFRGTYP= 5
##$CHEMSTR= <none>
##$CNST= (0..31)
1 1 145 1 1 1 1 1 1 1 1 1 1 1 1 1 1 1 1 1 1 1 1 1 1 1 1 1 1 1 1 1 
##$CPDPRG= <>
##$CPDPRG1= <>
##$CPDPRG2= <>
##$CPDPRG3= <>
##$CPDPRG4= <mlev>
##$CPDPRG5= <mlev>
##$CPDPRG6= <mlev>
##$CPDPRG7= <mlev>
##$CPDPRG8= <mlev>
##$CPDPRGB= <>
##$CPDPRGT= <>
##$D= (0..31)
0 0.7 0 0 0 0 0 0 0 0 0 0.03 0 0 0 0 0 0 0 0 0 0 0 0 0 0 0 0 0 0 0 0 
##$DATE= 1756289981
##$DBL= (0..7)
120 120 120 120 120 120 120 120 
##$DBP= (0..7)
150 150 150 150 150 150 150 150 
##$DBP07= 0
##$DBPNAM0= <>
##$DBPNAM1= <>
##$DBPNAM2= <>
##$DBPNAM3= <>
##$DBPNAM4= <>
##$DBPNAM5= <>
##$DBPNAM6= <>
##$DBPNAM7= <>
##$DBPOAL= (0..7)
0.5 0.5 0.5 0.5 0.5 0.5 0.5 0.5 
##$DBPOFFS= (0..7)
0 0 0 0 0 0 0 0 
##$DE= 6
##$DECBNUC= <off>
##$DECIM= 32
##$DECNUC= <off>
##$DECSTAT= 4
##$DIGMOD= 1
##$DIGTYP= 9
##$DL= (0..7)
0 120 120 120 120 120 120 120 
##$DP= (0..7)
150 150 150 150 150 150 150 150 
##$DP07= 0
##$DPNAME0= <>
##$DPNAME1= <>
##$DPNAME2= <>
##$DPNAME3= <>
##$DPNAME4= <>
##$DPNAME5= <>
##$DPNAME6= <>
##$DPNAME7= <>
##$DPOAL= (0..7)
0.5 0.5 0.5 0.5 0.5 0.5 0.5 0.5 
##$DPOFFS= (0..7)
0 0 0 0 0 0 0 0 
##$DQDMODE= 0
##$DR= 18
##$DS= 0
##$DSLIST= <SSSSSSSSSSSSSSS>
$$ [...]
##$SUBNAM0= <"">
##$SUBNAM1= <"">
##$SUBNAM2= <"">
##$SUBNAM3= <"">
##$SUBNAM4= <"">
##$SUBNAM5= <"">
##$SUBNAM6= <"">
##$SUBNAM7= <"">
##$SUBNAM8= <"">
##$SUBNAM9= <"">
##$SW= 18.0517328524113
##$SWIBOX= (0..15)
0 0 2 0 0 0 0 0 0 0 0 0 0 0 0 0 
##$SW_h= 3612.71676300578
##$TD= 16384
##$TD0= 1
##$TE= 0
##$TE2= 300
##$TE3= 300
##$TEG= 300
##$TL= (0..7)
0 120 120 120 120 120 120 120 
##$TP= (0..7)
150 150 150 150 150 150 150 150 
##$TP07= 0
##$TPNAME0= <>
##$TPNAME1= <>
##$TPNAME2= <>
##$TPNAME3= <>
##$TPNAME4= <>
##$TPNAME5= <>
##$TPNAME6= <>
##$TPNAME7= <>
##$TPOAL= (0..7)
0.5 0.5 0.5 0.5 0.5 0.5 0.5 0.5 
##$TPOFFS= (0..7)
0 0 0 0 0 0 0 0 
##$TUNHIN= 0
##$TUNHOUT= 0
##$TUNXOUT= 0
##$USERA1= <user>
##$USERA2= <user>
##$USERA3= <user>
##$USERA4= <user>
##$USERA5= <user>
##$V9= 5
##$VALIST= <valist>
##$VCLIST= <CCCCCCCCCCCCCCC>
##$VD= 0
##$VDLIST= <DDDDDDDDDDDDDDD>
##$VPLIST= <PPPPPPPPPPPPPPP>
##$VTLIST= <TTTTTTTTTTTTTTT>
##$WBST= 1024
##$WBSW= 4
##$XGAIN= (0..3)
0 0 0 0 
##$XL= 0
##$YL= 0
##$YMAX_a= 30158
##$YMIN_a= -34429
##$ZGOPTNS= <>
##$ZL1= 120
##$ZL2= 120
##$ZL3= 120
##$ZL4= 120
##$ABSF1= 10
##$ABSF2= 0
##$ABSG= 5
##$ABSL= 3
##$ALPHA= 0
##$AQORDER= 0
##$ASSFAC= 0
##$ASSFACI= 0
##$ASSFACX= 0
##$ASSWID= 0
##$AUNMP= <proc_1d>
##$AZFE= 0.1
##$AZFW= 0.1
##$BCFW= 1
##$BC_mod= 2
##$BYTORDP= 1
##$COROFFS= 0
##$CY= -3
##$DATMOD= 1
##$DC= 2
##$DFILT= <>
##$DTYPP= 0
##$F1P= 0
##$F2P= 0
##$FCOR= 0.5
##$FTSIZE= 0
##$FT_mod= 4
##$GAMMA= 1
##$GB= 0.15
##$INTBC= 1
##$INTSCL= 1
##$ISEN= 128
##$LB= 0.25
##$LEV0= 0
##$LPBIN= 0
##$MAXI= 10000
##$MC2= 0
##$MEAN= 0
##$ME_mod= 0
##$MI= 1.114404
##$NCOEF= 0
##$NC_proc= 0
##$NLEV= 6
##$NOISF1= 3.799351
##$NOISF2= 2.8
##$NSP= 1
##$NTH_PI= 0
##$NZP= 0
##$OFFSET= 14.38212
##$PC= 1
##$PHC0= -1719.315
##$PHC1= 9.792278
##$PH_mod= 1
##$PKNL= yes
##$PPARMOD= 0
##$PSCAL= 0
##$PSIGN= 0
##$REVERSE= no
##$SF= 200.129724274929
##$SI= 16384
##$SIGF1= 3
##$SIGF2= 2
##$SINO= 400
##$SIOLD= 16384
##$SREGLST= <1H.CDCl3>
##$SSB= 0
##$STSI= 0
##$STSR= 0
##$SW_p= 3205.1282051282
##$SYMM= 0
##$S_DEV= 0
##$TDeff= 0
##$TDoff= 0
##$TI= <>
##$TILT= no
##$TM1= 0
##$TM2= 0
##$TOPLEV= 0
##$USERP1= <user>
##$USERP2= <user>
##$USERP3= <user>
##$USERP4= <user>
##$USERP5= <user>
##$WDW= 1
##$XDIM= 8192
##$YMAX_p= 0
##$YMIN_p= 0
$$ End of Bruker specific parameters
$$ ---------------------------------
##NTUPLES= NMR FID
##VAR_NAME=  TIME,          FID/REAL,        FID/IMAG
##SYMBOL=    X,             R,               I
##VAR_TYPE=  INDEPENDENT,   DEPENDENT,       DEPENDENT
##VAR_FORM=  AFFN,          ASDF,            ASDF
##VAR_DIM=   8192,          8192,            8192
##UNITS=     SECONDS,       ARBITRARY UNITS, ARBITRARY UNITS
##FACTOR=    0.0002768,     1,               1
##FIRST=     0,             0,               0
##LAST=      2.2672688,     0,               0
##MIN=       0,             -34429,          0
##MAX=       2.2672688,     30158,           0
$$ Real data points
##PAGE= N=1
##DATA TABLE= (X++(R..R)), XYDATA
0@%%%%%%%%%%%%%%%%%%%%%%%%%%%%%%%%%%%%%%%%%%KmOqRj0J0j0J2j4J4j5J7j9
56a0K1k3K5k7K8k8K9l1K8j9mO9k92K315Q656j6458k578J9373j2058k1730J3813
77h901J9531p385q598K656J60N303J0806q866j2478J3244R750j6143r906R663
91a164O785l306n872m602j68N051L796j942j088L545J568k69N27m73J346L014
107F748k738n884k425J103L752J021n072k150M985K384m289j643N880K752m265
122A59j656J526N0K606K469l238l183J103L30j267J84N75j231l56J681r86k153
139c387L111L394j585j758k45N95J919O06j734m94N62j034k051M95J498q74m97
156a479J311j007r58K294J541q2L00j018j562J213J428j429j306J038o1k093N9
$$ y = [0, 0, 0, 0, 0, 0, 0, 0, 0, 0, 0, 0, 0, 0, 0, 0, 0, 0, 0, 0, 0, 0, 0, 0, 0, 0, 0, 0, 0, 0, 0, 0, 0, 0, 0, 0, 0, 0, 0, 0, 0, 0, 0, 2, -2, 4, -4, 5, -5, 5, -5, 7, -7, 7, -8, 9, -10, 11, -12, 13, -14, 14, -14, 15, -16, 12, -7, -11, 58, -234, 2081, 10737, -5721, -8299, 11074, -984, -22714, -8901, 10630, 3245, -5353, -2697, -2537, 2766, 13572, 4706, -7772, 5472, 15222, -921, -10827, -1164, 5621, 2315, -3557, -8159, -8327, -3276, 520, -1422, -2510, 1035, 2603, 2334, 2861, 2388, 3734, 6748, 4010, -1874, -4299, -3196, 556, 1577, -3495, -5645, -660, 1724, -2565, -4208, 1672, 4424, 159, -1497, 29, 79, 2685, 5154, 1916, -1267, -164, 166, -1101, -917, -342, -1573, -1929, -248, -1234, -3387, -276, 3118, 1533, -225, -470, 125, 2044, 2650, 916, 422, 984, -50, -2101, -1606, -108, -982, -1479, -168, -1175, -2133, 161, 1702, 1620, 1920, 902, -660, 553, 1981, 552, -754, 284, 223, -1870, -1811]
173a811J158o72P90J789j430j160J456Q05L07O69o32j610J73J278o82j531N26
190e77P29p96m35m84MJ998N91j444J51O95l75M96J207m36j192L96N80j460o79
209a031J146m40o05P91j006j235J781J491r89n30J072L79m94N53P37p47j50P00
227A423j347j202O48j3m37L89l91p93L47J444O30q58K79J215k92n38K15p7M4J84
247H70o39p13l31R3O51k82l81J23k51L15N92m3j20M57M18j5o65j21R85J88n44
268E87l19n92j66L80k03l72N5n0p2J83K51K80J22O25M91q96l67P02J60k60l25
289B14m95j65Q8p4o6l2L47K37l98J0L58J9L76M13n84m55R0K88K83k20k73m3L0
312e2p9j54k00N75K65n29k56J20J13K92K81O3k54l87J61M41k12j80J01m7k07l10
$$ y = [-1811, -653, -1325, -535, 1254, -176, -1336, 120, 925, 1232, 1901, 1269, -341, -168, 1110, 428, -1103, -577, 152, -644, -1079, -1563, -1559, 439, 1030, -414, -263, 432, 57, 553, 1760, 1324, 132, 528, 1108, -352, -1031, 115, -325, -930, -139, -1145, -2380, -599, 892, -97, -627, 445, 824, 330, 883, 1620, 873, 723, 1423, 76, -1126, -478, -491, -928, -539, -930, -1723, -1376, 68, 698, -160, 119, 1334, 1042, 504, 719, 642, 686, 870, 231, -482, -813, -720, -69, -351, -732, -609, -860, -545, 47, 4, -116, 341, 759, 744, 79, -42, 943, 1131, 587, 268, -324, -490, -110, -313, -685, -630, -680, -752, -569, -318, -38, 84, 709, 1200, 304, -63, 639, 799, 539, 214, -281, -446, -358, -432, -498, -530, -183, 54, -344, -334, 24, 43, 419, 832, 248, -207, -117, 171, 454, 234, -39, -82, -52, -131, -285, -485, 90, 355, -174, -430, -310, -197, 95, 376, 439, 185, -202, -41, 400, 188, 8, 109, 62, -145, -455]
334d55j01L68M11Nk89k76J97M28k0K4J0l27j32M2L7j7l3J81M4l83j82L02L75K24
358D33j27m23M0K48k4l5N6oj80k88oJ14m9L03J40k61k64J3K88M57k9j83j54l8
382B5J43K9k59J88J27l32k30m1O0K08J47k7k29j83J62L05J62M1p6j39J29l1k10
405c1J78K43j45m76j97M7J21Q9J72j44k16J95J85Q4K57o0o2o4pq7j16K12J30k29
429G9m72n3K46R6R4m9k3K3j14J54Q7R9J36l0j95r2M5O6J88n5k28k82K9J96k0j94
455b69K10L0j80k9J33J61J16J58q7j67j45K48k0m1R1k19l40J46J80j28J1J20N0
478B9m8k01J59J58J48J9j96k63K70k4j3R9j6j71p2O9PQL7J45j18j91KJ37J25O0
504A59j05q7mnJ25L5l3Q8j04k23K9J10m6R6j8K3k19n5K58J46j26J6n8j62J63m6
$$ y = [-455, -556, -188, 223, 228, -61, -337, -140, 288, 268, 292, 302, -25, -157, -115, -78, -95, -128, 53, 97, -286, -468, -166, 209, 433, 306, -117, -77, 171, 147, 112, 168, 162, -18, -306, -312, -198, -247, 56, 196, -65, -329, -316, -28, 429, 400, 217, 63, 25, 168, 197, -62, 126, 253, -79, -309, -350, -290, -82, 65, 38, -191, -374, -212, 93, 255, 296, 220, 81, 210, 179, -31, 147, 390, 245, -231, -428, -381, -260, -171, 1, -143, -359, -164, 21, 105, 362, 302, 240, 176, 169, 82, -34, 178, 308, 79, -393, -446, -200, -104, -10, -59, -82, -59, -173, -19, 68, 167, 303, 273, 78, -14, 31, 97, 285, 230, 2, -280, -251, -55, -75, -269, -59, -29, -209, -238, -105, 56, 172, 330, 243, 76, -69, 179, 159, 118, 209, -10, -350, -204, -24, -152, -141, -21, 29, -19, -220, -61, 97, 245, 264, 68, -195, 75, 51, 38, 137, 121, -50, -122, -53, -46, -38, -1, 144, 26, -165, -163, -26, 99, 159, 54, -33, -37, -42, 83, 118, 85, 173, 69, -154, -125, -15, -61, 35, 17, 40, -179, -234, 24, 170, 44, 60, 2, -160, 3, -43]
530d3NJ88n2j30r5NJ61J6N4K7j10j47P8O6o0M8Rp8P9j93O4P7J69j5j78nN9N0J09
559A58J3j74J9P2j54PJ01k7l2j2j1j65N6J88J23j35j82J60n7J68Nn3L7k6r9K4
585Dl4O6l2m5L7j14r5J57K0O8k6ll3J02m8KN1N0m0q0k8RJ5Jl9p6oK1%R9L2q9j7
618g1Q0lk6J02M1j5j02jl6L8O5K4j44L4n4m8M2M5J3K6k4k1L1k0J06J00j45Nj7
647B5n7J10Mq6K8p4k2k9J6L2O4K3l2j4m7P3P4K6o1m9o6N8J7M6jk7m4n9q6Q6N1
678b1L0pp1j9N0J0L0R3n9m0O8k7q9M5P4j0o9Po0L1N4L5n2l2M2r6J17oM3p3L8m9
710a3j2J8L1M7r4J3n1lQ7j3Qk2J0n4J5J9O1K1o8j0lm9J13M5l7L7r1J2j5K0M5K
742F9o9l5k5QN5qK9K1o8JJ0J9L5k4j9l8N5k9Q2k5l8O2j28QML9P4k4m5n2L8j4L1
$$ y = [-43, -38, 150, 98, -32, -127, -122, 39, 55, 109, 136, 26, -121, -43, 23, -37, 11, 20, -58, 21, -172, -108, -31, 138, 123, -55, -60, -1, 49, 158, 171, -3, 16, 88, -66, -59, 42, 15, -17, -29, -40, -205, -149, 39, 162, 27, -155, 5, -52, 116, 121, 68, 105, 79, -20, 4, -30, 36, 4, -41, -4, -118, -213, -56, -36, 32, 6, 3, -30, 72, 24, 26, 77, 127, 87, 7, -21, -12, 3, 4, -35, -111, -117, -96, -96, 3, 35, -54, -71, 9, 6, -20, 82, 123, 108, 6, 5, -31, 7, 72, 96, -48, -14, -68, -116, -74, -29, -16, 10, -14, -35, -4, -24, 82, 182, 37, 42, 25, -32, 78, 82, -4, 24, -50, -72, -101, -85, -53, 11, 34, 2, -12, -59, 14, 88, 114, 53, 4, -62, -4, 13, 59, 58, 31, -13, -72, -158, -72, -21, 9, 2, -69, -88, -38, -28, 2, 95, 36, -4, 64, 37, -52, -7, 67, 57, -12, -5, -65, -34, 20, 55, 3, -29, 13, -83, 34, 28, 71, -2, 36, -13, -25, -7, 24, 71, -23, -10, -61, -64, 23, 10, 18, -4, 6, -48, -33, -14, 47, 68, 0, -10, -13, -62, 51, 96, 59, 96, 5, 17, 2, 22, 67, 69, 0, -35, -60, -52, 3, -5, 24, 45, -23, -22, -12, 7, 42, 18, -1, -39, 16, -13, 69, 44, 6, 68, -60, -52, -48, -9, 65, 41, -4, -56, -18, -32, -1]
775aM9ml5%k4K8L9K3k3l2l7m4ON7K4o1jj4l7M9Q7kn7J5K5p7M7L5l2m0P3l7k5l0
809e6L7P0q3lk5kJ2J6L7j9M9o5J1%M8MOKrl5kK2m3j5K5%k5J8pK3N9m8m2O1M0l5
845B6M3M4r4m7L3j0K2L0j08N5j0k5L1O0m3J5q2J9R0n6K2K8kn6N4j5J7L0q9pJP
877a7jN5o9P1l1k9l6N0j5PrJ10l4p9L8m4L8K9m1l5j6J6L0Q7m5Jj7m0%N0l2M9L
910D4j5j7m0O3k9J3M0m9l7P2n0Oj2J6l9k2M8J4j5J1j3J1m5J8jO9L4n8J1q3j5O2
942hK1n6K3l4J6jO7m8L7k6j7M6r4J3N0P7k3J0m3Kj1J8N8k4p3l7M9j8K6k6QKj7
975c3J3j2N6J5k4k9M5%o2J03q6l8Q9p9L0M4J6j7o6K0K7l4L3J1n1M3k6kL2mLo5
1007d8K5Q2m5L1n4J6k8K5J6%k4Ol0R0q3K8k0J2J8L8l9nm3N1j0j9Pq3J04mjm3K3
$$ y = [-1, 48, 44, 9, 9, -15, 13, 52, 75, 52, 20, -17, -61, -55, 2, 26, -35, -36, -50, -87, -38, 49, 47, -10, 5, 30, -47, 0, 35, 3, -37, 36, -1, -26, -56, -19, 51, -32, -35, -60, -62, -50, -34, 3, -16, 33, -32, -21, -21, 27, 31, 37, 39, 30, -5, -7, 15, -28, -43, -18, -18, -43, -25, -32, -9, 50, 2, -40, 21, 61, 26, 69, 113, 19, -28, 5, -5, 17, 47, -61, -6, -16, -41, -10, 50, 7, 22, -60, -41, 49, -7, 15, 43, 41, -15, 39, 24, 41, 71, -18, -25, -24, -17, -18, 37, -32, 39, 8, -21, -57, -7, -22, -15, -24, 86, 52, -27, 11, -33, 5, 34, -7, -42, -58, -42, -12, 75, 30, 31, 14, -26, -26, 24, -8, 41, 44, 29, 12, -28, 35, 6, 19, 59, 10, -27, 45, -5, 1, -11, 5, -34, -56, -8, 6, -9, 2, -11, 0, -45, -27, -28, 41, 75, 17, 28, -55, -70, -8, 13, -43, -20, -54, -38, -39, 28, -20, 17, -9, -26, 20, -74, -61, -11, 66, 43, 53, 10, 12, 1, 19, 77, 53, -20, -57, -8, -26, 0, -26, -18, -16, -33, -20, -32, 24, 39, 15, -14, 31, 31, -31, 72, -14, -52, 37, -42, -12, 32, 48, 31, -35, -15, 12, -22, 11, 22, -29, 14, -12, -14, 18, 14, 17, -48, -23, 59, 14, 45, -9, 7, -21, 4, 20, 20, -4, 2, -28, 62, -21, 7, -13, -1, 17, 55, 16, 11, -32, 19, 9, -10, -3, -86, 18, 14, 13, -30, -7]
1040gR9j27L2M6m0K2k8j7N0j2j1J7p3P5k3k5N6q6LO7j8o5J13m6n0L5N5l0J8K5
1070E5r0M4J5l2m1O8q4J02q2n8J84j03P1m0j2nj6K3LJ9j1j8m2J03n4qnK1j4K5
1100A8k4Ok9ll1L8L3K0l3l2qj2M4j%Ok2O5j5P4p5mo7K7kJ1j3O8q8O5k1L7k1M6
1134E7l8m1LrQ1m7J9n5L9pNj6QJjo6N8n2O4LpK1p3O1m5N5rn7J7L7q%L3l4j5L9
1170B1j04R3pM6p8Q6o0%Mm9N6L6j8K8p0j4L4L7o8l0R1k7p0J10j37R4J0l7LM9k9
1201@NJ5j2l6K3M0%l0l9L9k3KJ1k1k9j7O8QqK0r3O3J5Qj1j2N5r0M2M2p9M7k9P2
1235D6l3k5J2%m4L4R4o7J8m1J4l1K1k3P1rJ1qn0l1M4K9n1J4J8l4J5K9l4l7L2M0
1267B4m2K4J7n4K6JjJ5k6J9KJ9k4mk5J8j2PL6mp4O7m1J6K9l7J4J2J5k6j6k3JN1
$$ y = [-7, 92, -35, -3, 43, 3, 25, -3, -20, 30, 18, 7, 24, -49, 26, 3, -22, 34, -52, -49, 18, 0, -65, 48, 2, -48, -13, 42, 12, 30, 55, -35, 9, 24, -8, -49, 19, -65, 37, -45, -103, 81, -22, 49, 9, -3, -8, -24, -1, 2, 21, 10, -8, -50, 53, -1, -9, -14, 7, -7, 18, -6, 0, -29, -32, -63, -25, 8, 28, -5, -37, -45, -57, -13, -14, -14, -8, -30, 35, 20, 94, 19, 15, -52, -25, -27, -16, -29, 39, -49, 16, -5, 32, 11, 57, 19, -22, -19, -28, 53, 6, 25, -30, 9, 2, 7, -9, -1, 0, -1, -67, -9, -61, 3, 6, -1, 20, -53, 8, -37, 18, 9, -48, -31, 6, -2, -2, 31, -3, -18, 21, -83, 10, 3, 49, -29, 57, -3, -3, 1, -48, 8, 44, 26, 54, -16, -30, 4, 41, -27, -57, 34, 7, -63, 47, -90, 4, 14, -23, -20, 29, 0, 5, 20, 8, -28, -5, 35, 35, 5, -34, 5, -18, -16, -5, -26, -55, -72, -4, 4, -4, 16, -77, -14, 1, 9, -2, -14, 41, -49, -7, 35, -44, 3, -26, 46, 13, -12, 0, 0, -44, -10, 84, 17, 35, -6, 8, -23, -2, -25, 46, 37, 48, 40, -10, -41, 3, 32, -19, -5, 13, -21, -6, 23, -11, -48, -16, 24, -18, 6, 23, -31, -5, -4, -5, 10, -16, 3, 5, 24, 0, -4, -29, -11, -23, -16, 20, 16, -58, 9, -32, -16, 13, -24, -10, 2, 17, -9, -25, -48, -47, 4]
1301DnJJ3q4Q5J6Po4jk8P5m6O6r5J1R7k3k8Ml7J0j1%O1l1j2Nln1L7J1JK4L0k4
1336A5j3J4J9p1O3l8K9j3l2L7m6O7J2rn4K5p2Q9ko3Q1L0n0o8M4qJ9L6j9p2PQ4
1368D1n1l7O7o8J2K9M3J8o5Oj9J5Lj1K1k6R8n8m3NL1kkj7l1O0K5J5o8M6M0jq3
1401gk3K4J2nl9R0l9m6M6n5M4J2Jl1K7%m3jpNL3M2m5j8K5J7N8o6j3qk7L6J9k9
1435a1j9P2l1J9o4M4K7qm5l9Q6k5N8o9K8j0J0m3L5J4o2M8M7o0J0j9K8k3J2k2M
1466hJ5L7j3NJ1Lm8PqL5m2mlj9L3J6mn7L5j1o3R1k2l9N1qM6j7M2j20L7K8M1o7
1500b0l6Q1k9k6PL8Or0M0Q8j9j8n2QN2Mm3K5l2N2m6OM2o4J4j9J1RL6k2K5l1j8
1533b1K0K1J0N7q9M6m8j5J2N8k5rk3l4nN5J6l3K6j1k6kJ9n9K0L4RNJ1k4l6N8J4
$$ y = [4, -1, 0, 13, -71, 14, 30, 37, -27, -28, -56, 19, -27, 39, -56, -45, 52, 29, 1, 5, -32, -22, -33, -33, 28, -3, -15, -10, -13, -64, -27, -16, -15, 9, 39, 15, 2, 16, 35, -36, 27, -11, 18, 5, -27, 10, -36, 31, 43, 34, -20, 5, -67, 22, 20, -43, 38, 68, 18, -50, -6, -14, 5, 41, 22, -50, -43, 41, -10, -47, 20, -48, -36, -7, 36, 54, -11, -5, -24, -9, -6, -17, 4, -22, 76, 18, -25, -20, 11, 9, 7, -10, -41, 19, 44, 59, -9, 37, 77, 76, -7, -30, -6, 6, 1, -38, 52, 13, -33, 13, -42, 2, 14, 15, -16, 11, 11, -32, -33, -40, -35, -2, 40, -5, -23, 2, 19, 77, 11, -2, -10, -37, -1, 18, -11, -30, 42, 11, 30, -34, 10, 37, 29, -16, -55, 31, 6, 64, -5, 23, 13, 23, -20, 15, 29, -33, 15, 62, 2, 12, -7, 21, -2, 10, -12, -8, 7, 44, 31, 36, 47, 50, 2, 9, 1, 36, -6, -10, -13, -32, 1, 17, 13, -44, -9, -20, -83, 8, -14, -53, -2, -10, 36, 19, 61, -59, -22, 6, 47, -20, -56, 25, -4, -30, -23, 15, 21, -69, -29, 59, 40, 22, -30, -22, 30, 34, -9, 16, -16, 36, -10, -4, 38, -26, -12, -31, -20, -11, 25, 3, 28, -3, -21, -1, 20, 30, 87, -2, 44, -4, -19, -7, 51, 26, 17, -6, -40, -45, 10, 26, -7, 19, 8, -18, -20, -1, -60, -40, -6, 3, 8, 19, -5, -41, 17, 31]
1566C1o0L5j3qJ0j8MN9l2o0K7L2J7m2J5Ok3J7L5j7k5K0L9l4l1N1k2J4m1L2l5L2
1598A5pN2l6p0Q1n2K1n1O6j6l5oM1K6j9p8M2L9L1k9n8L1lK5l2%L1Qj4m4R0o0n3
1631f4J28n6N7n2lJ2j1l5M3l0Km8N7M1k2k4K0J1K2j01M4J4K2J5l3k7O3r1j3R1
1661C2r1L6J7L2m6J1K7Km1M7J5Pj6r5NM3m6N8LmmJ6OL0o2kO8k5mk7j8M6n5K1N6
1696D2l9J3PK4opm8j4L2J0Nj1lk0l4O2m2M4m4j0Q3m4Jj1L4l2J7K9j3j3K0j0k9
1729gJ6j7n9K4J8M2OL1l9j3l7K4K2k2L3k3p1J5M2M5%o5L3Nj4ON2nk9o7J0N3l5
1762b6j6O0R3j18RL0l3k2N7l1l4M2K0o3J4L8l2QRkj9Rj9j8k0M5L9k7K5k6k5J2
1794b1RPj1J8l6j8M5M4J5j9Pn1K7nj5Pj0J8j7rQ9k9k6j2j4m5L4OK2j3m4J0O8m0
$$ y = [31, -29, 6, -7, -15, -5, -23, -19, 40, 8, -52, -25, 7, 24, -18, -3, 3, -20, -3, 32, 15, -10, 10, 49, 15, -16, 35, 13, 27, -14, 18, -17, 15, 8, 60, 24, -46, 35, -17, 4, -47, 19, 3, -32, -38, 3, 29, 10, -68, -26, 13, 44, 15, -43, -12, -15, 10, -22, -22, 9, 17, 3, -41, 49, -11, -64, 64, 8, 65, 13, 10, 22, 11, -24, 19, -11, -9, -57, 0, 41, 19, -5, 15, 26, 48, -53, -9, 5, 27, 42, 9, -18, 45, -46, -59, 32, -59, -23, -6, 26, -20, -9, 18, 20, -21, 26, 41, 48, 32, -63, -58, -15, -61, -3, 0, -4, -8, 8, 14, 44, -18, -20, 48, 23, 19, -8, -26, 20, -35, -14, 42, 3, 16, 23, 47, 41, 34, -14, -28, 4, 14, 19, 8, 5, -15, -49, 13, -29, 15, -29, -39, 44, 0, 1, -10, 24, -8, 9, 38, 25, 12, 32, 22, -7, 9, -8, -67, -43, -25, 17, 23, 54, 15, 2, -35, -11, 11, -11, 22, -1, -72, -57, -15, 30, 30, -35, -2, 3, -11, -5, 47, 42, 13, -54, -44, 9, -26, -42, 18, 111, -7, 2, 32, -1, -23, 34, 3, -31, 11, 31, -32, -18, 20, -12, -4, 5, 3, -16, -7, -26, -44, -64, -19, 20, -7, 18, -8, -33, -21, -12, -5, -16, 2, -34, -52, -7, 37, 52, 33, 40, -11, 16, 11, -4, 3, -7, 11, -6, -15, 74, 45, 19, 7, -7, -52, -18, -12, 10, -3, -47, -37, 31, -9]
1828iQN2n1L3pqK1ropj1ll3K3k6k2J8PK6J4k1Ok1K7J2mOn8oO1j7l9oM9QJ3m6P
1866a9J4o3N9J2l4O8m3l6L9kl5L1m7O7O1l8o5J4K0pN4m7k3O7j9m7N4l4m9k3J4
1897e7M9L0j1o0M2j4qm5P4N3k7n0L8j4K7k1Mk3MNklOj4%K6O2n7o4L9Q5l6j1k3
1931Dl2K1j0l2P2l0Lj1Q2r5N6m2j9%M6m6N1n7J9qmP4o6M2n0J7n8P3l8qJ5J0j2
1964c3K3L4Lm3J8%k1k4J4O1j3k7j2O6o5J6RqJ0K0j8RO3q0K5k6l3P6l6j6K6l9k2
1997d3L4l3L7J2M3n2j1L1o3Q2pk7LmJ5okk5M8n2j7O3p2JN1M4k3J3k9O0m1K4p9
2030b5K4K5j6J8l6J5K4j02N7N6q1kN5j9R6n0p4N1n9K8OL8pJJj7oo8O2K4k0M0k5
2063A4J1r3R2n3j4K7K5rL8l0q0O7mM0n8J6O8l7k4j3j0N9n9J5K4l8M3Pn5N6qL9
$$ y = [-9, -1, 51, 0, 33, 26, 18, 39, 30, 24, 17, 6, 3, -30, -7, -33, -55, -37, -30, -4, 10, -11, -5, -26, 1, 13, 9, 15, -43, -49, 12, -5, -44, -50, -1, 7, 20, -26, -19, -5, -68, -9, 3, -31, 37, -6, -42, -3, -5, -40, -9, -56, 11, 72, 34, -31, -17, 3, -4, 50, 3, -20, 47, 28, -19, 35, 1, -48, -71, -57, -8, 22, 11, -49, -7, -21, -29, -74, 0, 53, 26, -24, 14, 0, 27, 6, 10, -13, -9, -4, -6, -9, -3, -17, -17, 9, 71, 14, -50, -11, 74, 38, 27, 4, -28, -7, -17, -49, 23, -7, -4, -15, 67, -28, 28, -14, -33, -33, 13, -33, 18, -39, -20, -28, -32, 42, -24, 18, -32, -15, -73, 0, -38, -46, -31, -21, -33, -10, 24, 27, -16, 2, 2, -19, -43, -29, 32, 19, -8, -20, 46, -19, -3, 6, -2, 8, 28, 10, 19, 82, 2, 27, 1, -32, 44, 8, -8, 18, -21, -43, -9, -42, -5, 7, 50, -2, -13, 18, -45, 37, 30, 3, 6, 2, 17, 11, 9, -16, 32, -20, -37, 26, -46, -45, 6, 50, 27, 40, 11, 71, 30, 54, -25, -1, 24, 8, 26, -10, 5, 29, -73, -16, 40, -41, -43, 12, -7, 89, 39, -35, 16, -43, -15, -9, 29, 22, 23, 24, 7, 1, -67, -5, 19, -1, 39, 14, 25, -68, 24, -29, -43, -16, 9, 0, 38, 8, -72, -5, -9, 31, -27, -11, 57, 20, -4, -17, -27, 32, -27, -12, 12, -26, 17, 24, -31, 25, 17, 56]
2095E6q5JM3k1LJ2k8M2l9k2KJ0J3N1j22J04m0l6J03q3K3M4o0L9k6j1M1rLM0m4
2126DMK1k9k6J8k6j1N9L9j22R3l7L1K4oq0J05j18K7N8j9M0m0mPL3Rq5K1j8L7l3
2158b4O5J5j13L8J3L2p6K9N9m6J9n7J8pJ0N4m2lL0n8j6O5M5n2k1Rm7O7o4J26n8
2189A0k9j6O2m0k1L7M5q1JL0Q1p1m5J03l1j8J1nk1o2O4N%m6K8k9P4J5r1M1j1N0
2221D0l7mm3Q0j4k3m6N7oK9j5l3kMO1p9k5M4No3O1J1m0plM7K1Pn9L2K7j9Oq1P7
2256A0qK2n4K6L4j3N4j00J00q0m7Q0j2l0N7l7J0p7K5J03m0k7kK3l6L1J7p4K2L1
2286HK2j9j7K7mo6L2RJ3j0j5L3j9j0P1p0L4n8lO6l0k8R7l7l2lM2l1J3qj7M0J1
2319D1O4p6n6O0k3o0J00n4J9J6m2N5k3KJ1%n2j5N3j5J2j2lj7L0nJ2J4k1jj0k8
$$ y = [56, -29, -28, 15, -6, -3, 9, -19, 23, -16, -38, -36, -26, -13, 38, -84, 20, -20, -56, 47, -36, -13, 31, -29, 10, -16, -27, 14, 5, 8, 48, 4, 8, 29, 0, -26, -8, -34, -45, 14, 53, -69, 24, -13, 18, 42, 36, -44, 61, -57, -30, 28, 9, 49, 9, 5, 12, 45, 54, -31, -10, -28, 9, -24, 41, 56, -57, -19, -6, 26, -50, -21, 38, -8, 11, -46, -28, -35, -25, 29, -13, -16, 14, -44, -60, 5, 50, -2, -23, -14, -61, 6, -58, 68, 10, -19, -35, 27, -13, -34, 3, 48, -33, -32, -2, 79, 8, -37, 66, 35, 17, 28, 23, 2, -60, 4, 9, 9, -37, -9, -38, 36, 51, -40, 1, -10, 40, 3, -1, -44, 36, 22, -1, -47, 10, 4, 33, 18, -15, -17, -13, 48, -31, -56, -12, -7, -70, -9, 2, -38, -45, -48, -1, 20, 27, -32, 0, 27, 8, 14, -67, 10, 2, 24, -30, -4, 30, 17, 71, -29, 71, -9, -56, 24, 12, -18, 39, 2, 12, -65, -40, 63, 23, -4, -6, 17, -19, 12, 29, -45, -23, 8, 30, 11, -6, 21, 17, -49, -17, -8, 5, -5, -20, 13, -6, -16, 55, -15, 19, -39, -42, 24, -6, -34, 63, 26, -6, -9, 33, 2, 15, 7, -10, 30, 41, 105, 29, -27, 33, 10, -50, 50, -4, 15, 31, -11, 44, 21, 23, 34, 34, -18, -33, 20, 5, 17, 5, 2, -15, 15, 10, 22, 36, 15, 14, 4, -24]
2351b4PKL3L1Ml6J1n1j8N3Pm5O3rl9j3M8k5J4%Jj3l1L5J5oRk2Pm0K0lK3o6K5Q8
2387E5l4n9J4M8J7n7M8J1o2K2rK3J9Lo3O8j4q1Q9rm1O3m3J1k8Rl7J03k7j5l2m
2419a2K8M5m8l3P6q6R3k2n7J2oj3M7k6L3k4K0l2K0oQkj8m2L8J4k5OOL5o6O3l8
2452a2j7O5l9j6K7mKQo7L3L3l5M3nN5o6qL3l1L2n0L5j5jk7K1NK9J0j5J4n8L0O
2486A5k3J6j9J9Ll0N2q7P5l9j7L6m4RM4L0k7m2L9j1j8n3N0J7L2pk6J2K1K9p6M8
2518B8m8J9k3N7j5JL4r2J7L5RRl3L4m6K7ORlJ5l9NQ4q9K3j01P9%Pj5nl7J8M0J7
2553B7lmn2J37j29Q6p4j0M3j1O3p4N8n0Rj8L6j9KJ2n5K1K0QN7j65O8JK1j5L7n3
2585b6O6o4N8o6L8k3R8kj09L4l3K0ojM4j4k4K3Qrj1J5orK1mMl3l3O6rj2K8l8M
$$ y = [-24, -17, -15, 18, 49, 53, 17, 28, -23, -41, 12, 19, -26, 37, 28, -11, -24, 24, -1, 13, 13, 14, 1, -30, 5, 20, 14, 23, 1, 8, -32, -12, -15, 8, -58, -33, 55, 21, -38, -24, 24, 41, -16, 32, 43, -19, 3, -6, 17, 36, 39, -24, 44, 30, -51, 38, 29, -12, 51, 8, 19, -9, 0, -37, 66, 39, 24, -8, -12, 16, 61, 13, -20, 56, -30, 63, 41, -16, -4, -10, -23, 24, -2, 31, 7, 27, -5, 15, 9, 17, 15, -3, -45, -7, 7, -18, -12, -6, 29, -37, 26, -12, -29, 36, -3, -19, 8, 4, 6, 14, -53, -20, 13, -22, 21, 16, 71, 5, -3, 30, -1, 31, -19, 16, 1, 0, -27, -6, -1, 28, 38, 23, 37, -21, 9, 15, -8, 8, -11, 8, 11, -19, 33, -54, 21, -18, -35, 1, -43, -34, 10, 40, 13, -29, 10, -1, -19, -72, -22, -5, 27, 20, -6, 6, 27, 56, -20, 28, -20, -1, -24, 33, 18, 19, 53, -39, -22, 13, 22, 31, -2, 32, -14, 13, 19, 28, 25, 40, 1, 6, 90, 1, 24, -77, 2, 2, 9, -6, -11, -48, -30, 10, 27, 24, 20, -32, 105, -24, 62, -12, -22, 21, 10, 73, -1, 57, 7, 16, -2, 34, 15, 17, 29, -26, -5, 15, 23, 80, -85, -17, -16, 5, -10, 27, -26, 40, -24, 34, -32, 6, -17, 81, 79, -30, 4, -29, -9, -15, -16, 28, 14, -10, 13, 21, 12, 1, 16, 10, 1, 22, 18, 22, -11, -44, 22, 13, 1, 29, -9, -5]
2620eL0k9l1K5mK9J7j9Jm1L4k2jM7l8M9k9m6K2K9l9j1K8M8q0L8N5r5P2k7M9k5
2652C1J7k4l1L4L1l5l6m0L5N9o1k2LJ4L7k5j5jl6N9l5N0p8M2K5K2K6m8j0L5k5
2683bK1p2R0N0j11J5J0j5j4J8LL6j5J2j5m6K8J6oPo2K6J9nL0o4J1LK9l0M0k5O9
2716E1q3J8L7qJ8n7K9m5J01q8N1K1L2j10j2P7j3Lm3J1M0k2oojl8M9KL2k1j5K4
2748B8j3m1m5P4o1N6M6n1Kk6N0m9P3pp0L0k0K3k1j7P2J9k5%n5P2k9k6jN4q6M8
2780DoM2n1o3Q9k1M7mk8j9K9kk3K7n2M4Qj5l5J9L6p0O5m0K7k4N0m7J3j9KK5m4
2813c6R0o0k2pK7rJ6K4K9j15R1Rm8L2j7Ql9L7j9M0n7R3r3N5ol7M3ko2N5J1m5l4
2846d8P2Ll1K8n4M6qJ2r3M4J7K2J7j3m8L8Pk9J1Ql8O4j8kl7L0K5m2J6oj3j2K2
$$ y = [-5, 25, -4, -35, -10, -14, 15, 32, 13, 14, -27, 7, -15, -16, 31, -7, 42, 13, -33, -11, 18, -21, -32, -4, 44, -36, 2, 57, -38, 34, 7, 56, 31, 48, 24, -7, 27, 58, 23, -13, -53, -18, 41, -20, -42, -39, -25, 12, -13, -28, -29, -65, -6, -41, 9, -69, -27, -2, 20, 46, -2, -12, 23, -2, 19, -53, 37, 87, -24, -9, 1, -14, -28, -10, -7, 29, 14, 26, 11, -35, -7, 9, 3, 10, -52, -26, -7, -12, 18, -46, -35, -32, -3, -33, 7, -18, 51, -32, -14, 23, 15, 33, -24, 5, -40, 61, -27, 24, 45, 77, -33, -45, 32, 19, 22, -21, -10, 30, 8, 2, -4, -5, -43, 6, 8, 40, 19, 4, 28, 15, -26, -71, 3, -58, -2, 44, -7, -5, -31, 19, -30, 43, 36, -34, -4, -24, -1, -22, -39, 33, 52, 27, 27, -28, 44, 15, -11, -12, 42, -44, 4, -2, 40, -11, -74, 15, -6, 41, 37, 9, -10, 19, 17, -6, 21, -31, 13, 21, 6, -29, -10, 26, -44, 21, -19, 8, -16, 34, -13, 0, -19, -17, 8, -36, 54, -6, -28, -35, -8, -17, -1, 23, 52, -63, 28, 37, -11, 21, 4, 12, -27, 10, -9, 31, -26, 67, -26, 29, 23, -14, 29, 27, -35, 20, 31, -14, -48, 24, 27, -4, 24, -30, 16, 8, 20, -73, -29, -12, 10, 27, 14, -34, 4, 11, -18, -7, 1, -37, 27, 9, 7, -30, 0, 25, -17, -1, -7, -20, -32, -10]
2879a0J8l4L5ol3L7KJ1l2K7KK8j5j06M8M4k8K2%qpmL6k4Mj6lOl5P2n4J0L0J1K
2914C0l5J6k8J5N0l5k3M0n1L9k0LLrj0J9QL7n3oO8p0K3O8p5L6J2l4L1l2JKk4l4
2948c8O3N3r5L7q7Q2j4K0J9%p7K4p%O1Jk4n1J9j4O8n2KJ3j1l7O6l0l5P4l7j0L7
2981B0m4mjK0L8j4MJL4q8J1L8l8RK9K7k7l4J8L1l5L8n3M0m9l5R8j4nN0o7L4m4
3014a2M1n4M8Ll9k7Q7mk0L5n9M7K1o7n0M0L6m4j5J1QK6j2k8P5k5K9n5l9K0QO5
3046E0o5pK8mK2m5N4l7l3P1j2K4Jm2j6%M2m8K5kj7M2o6N1j7J9k5kL4M8r5L6n8
3079d4P1J5J0l6Jl4P2j00N1QL3rm7L9n2K0Qj8K1J1k1K6n3L4l7L0J3n3K4M5%J1
3111C9q3L7j9K7K5k4k9Ql7M9j3RM5jn8J3lO7k1n3l3P1m8N8N0n7k2rK5%JJ2m6q
$$ y = [-10, 8, -26, 9, 3, -30, 7, 9, 20, -12, 15, 17, 45, 30, -76, -28, 16, -12, 10, 10, 2, -5, -9, 27, 3, 7, -9, -12, -6, -41, 31, -23, -13, 17, 28, 30, -5, 11, -17, -2, 48, 13, -10, 30, -21, 18, -2, 1, 4, -5, -15, 4, 12, 49, -4, -10, 58, -12, 11, 79, 4, 40, 52, 18, 49, 17, 18, 20, -4, -38, 25, 78, -17, 20, -67, 15, 1, 21, 40, 40, -37, -13, -20, -20, 41, 42, 18, -33, -14, -28, 40, -12, -10, 3, -8, -45, 21, -9, -44, 30, -7, -17, 20, -24, -28, -29, -9, 29, 15, 19, 20, 54, -34, -23, 15, -23, -14, 15, 42, 15, -19, -1, 30, -5, 33, -20, 20, -29, -64, 34, 20, 15, 65, -2, 32, -12, 29, -25, 23, 26, -13, -40, 47, 43, 23, 58, -1, 46, 67, 0, -50, -10, 26, -18, -33, -22, -14, 12, 0, -28, 47, 22, 51, -4, -43, -23, -15, 50, -15, -22, 6, 2, 24, -21, 33, -4, -37, 34, 22, 46, 47, 5, -11, -11, 31, -17, 8, 6, -11, 31, -35, 16, -1, 18, -7, -9, 25, 73, -22, 14, -44, 27, 42, 52, 16, 17, -17, 55, -45, 6, 14, 47, 38, -9, 30, -22, -2, 6, -12, 9, 20, -1, 25, -28, 6, -31, -1, 12, -41, -17, 28, 28, 39, -44, -7, -26, 1, 26, 2, -27, -19, -56, -7, -20, -11, 34, 33, -25, -12, -15, 52, 31, -22, -55, 16, -32, 26, 76, 19, -3, -12, 13, 13, 14, 26, -20, -28]
3145b8M8m5j4M3J2n4O5%k1mqN1l3M8k7K8o5j7j5M4rJ3r6J00j1J3J4k4km1P2o8
3177c1OJ8L3n0N8n3N0j7Jl8R6q3j7Q0o3l1J3M6rm0M8l0M8L6qo6j6KK9jQn0N4j6
3211GqLK1J9p2J0J7l3M6o4M5J8M6m5%L5m7RK2jK2j3j2oK7q1PQ4k9K1m4j4L5J2
3245C7l6K3k8j2J8JK7l0kK8j1J9l9lkl4O5N7m2PN1n7l9J9m8O3Oo4j4J4KP9l2K2
3279D5l6K0n4k%MM0j2J5Mm0j2Rrk5N0J0lJ1n4K2N9p8K5k4O0J3pnK4r6J6J1OJ1
3314bRJ1j2j7L1N2o7rM4p8K8N2j5o6O2j6mk2pL3j7o9L4L9l5N3rRl8M8k2j3NL0
3348B2ol4KL0j0K6k1m1K5K1K8o9O3j6J1m4NN6n1l7L6L9p6K6L4n2k7lM9O7o4J7
3380Fk2J2J4l4J2KoK0J7Mo8N7L6Oo3j9K3N0n0K0N4j7p3K6j4N1j4j9n0K7M4k3k5
$$ y = [-28, 20, -25, -39, 4, 16, -38, 27, 27, 6, 2, -6, 45, 12, 60, 33, 61, -4, -21, -36, 8, -1, 12, -84, 16, 5, 18, 32, 8, 6, -35, 37, -31, -25, -7, 26, -24, 34, -19, 31, 14, 15, -23, 73, -10, -27, 53, -10, -41, -28, 18, 9, -31, 17, -13, 35, 71, 63, -3, -19, -17, 12, 11, 19, -31, 23, 7, -1, 2, 23, 42, -30, -20, -3, -36, 10, -54, -9, 9, 55, 10, 10, 45, -2, 7, 29, 28, 50, 37, 25, 19, 46, -35, -28, 56, 27, 48, 4, -10, 25, 37, 1, 24, -4, -16, 2, 3, 30, 0, -2, 26, 15, 34, -5, -8, -10, -44, 21, 78, 36, 43, 94, 37, -2, 17, -31, 32, 38, -26, -40, -26, -24, 55, 23, 45, 9, 29, -25, -27, -27, -23, 17, 5, 20, 24, -16, -28, -19, -28, -53, -3, 7, 4, 15, -39, -17, 42, -36, -11, -35, 25, 38, 31, 26, 50, -46, -30, -19, -13, -2, 7, 18, 6, -11, 20, 72, 5, -4, 40, -38, -10, 42, 27, -39, 23, 7, 3, -19, -26, 7, -10, -79, -45, -6, -41, 12, 3, 12, -26, 22, 0, -13, -8, 22, 16, -18, -16, 14, 4, 30, 9, -32, -7, 14, 42, -27, 36, 20, 31, -13, -8, 48, -3, -40, -4, 35, -41, -15, 19, -33, -60, -63, -14, 53, -11, 6, -16, -4, 10, -24, -12, -10, -16, 4, 21, 25, -43, 14, 50, 56, -7, -26, -3, 47, -3, 17, 71, 54, -19, 7, -7, 44, 30, 11, -39, -12, 32, 9, -16]
3413a6M6o6M6rJ8plnj6K9Kj8J4l8L5l1P8r4M6m9M7q5P3J7J4J7l4K5n0L7j4N3r5
3446c3L4L1l6j4J1Lqk4O6m7k1O5j2ll6J0M9q5l9N4k5O5k4J7L6pp2K9m6Q8o3M1
3478DM2k4l4l4L6N0m9M1ok8M1l6m7P9k8N0j6m2KJ1PjO1q8L1Nl6l2P0k9J9l2M9
3511C6mj2Jn9O5l9L3l7O6l6m2L7m0P6k6K7q6Q0m9j4L4l4N0o0L2o8L7R1j27P3J2
3542A7J7n3K4NpJ1K4k9j6K9o1pQ2l7j6N3r2O3K7n3M0Nm5P9o6K4L2j5j4j8l6K0
3574a3PK2m3N4j27J34r0M6PKO1p3pJ1ql0M0L0j5m6M4k5k1K7OJ2J5m6j2P0m4O2
3606E0m5k0L1Ok9L3j9j2K7k6lK1m4O6j8l3LL7n1M7pm6j1M4lpmK1j7mpRM9k8j0
3641@n1K1N0nO5n2m7ll4Q4p3Q0o4OK7L0k4Kj7n3N4J9k5l9J01l0k4n9L4k9J9K8
$$ y = [-16, 30, -36, 10, 1, 19, 12, 9, 4, -12, 17, 19, 1, 15, -23, 12, -19, 59, -35, 11, -38, 9, -76, -3, 14, 28, 45, 11, 36, -14, 23, 9, 62, -33, 1, 32, -4, -18, -7, -4, -12, -36, 30, -17, -38, 27, 15, 12, -24, -14, 35, -50, -89, -35, -60, 5, -19, -2, 34, 27, -45, -16, -62, 26, -37, 4, 46, 22, -12, -46, -10, 40, -9, 32, 26, -2, 39, 3, -44, 35, 7, 57, 41, -1, 1, 12, 19, 18, 79, -9, 22, 27, -9, -41, 29, 0, 19, -13, 36, 32, 20, 21, -38, 27, -12, 21, -16, 50, 14, -28, 9, -31, 45, 19, 46, -40, 40, -9, -23, 11, -23, 27, -33, -1, -69, -32, 59, -68, 5, 17, 34, -19, 5, 10, 3, 14, 38, 9, -7, 22, -39, -46, 36, -1, -17, 36, -56, 7, 34, -19, 21, 26, -19, 60, -6, 18, 50, 35, 21, 3, -33, -13, -6, 16, -27, 27, -100, 34, -56, -10, -3, -1, 60, -13, -20, -9, -17, -47, -7, 23, 8, -38, 6, -19, -40, -13, -7, 5, 20, -26, -38, 32, -12, 50, 5, -15, 16, 22, -7, 26, 7, -5, 22, -4, -7, 14, -30, 36, 18, -15, -12, 25, -26, 21, 14, -32, -43, 1, -2, -9, -13, 8, -9, -13, -20, -11, 38, 10, 0, -51, -30, 20, 15, 80, 28, -19, -22, -56, 28, -45, 35, -29, -23, 4, 34, 10, 12, -5, -58, -4, 15, -10, -49, 52, 22, -2, -61, -27, -56, -37, -9]
3673iK5J2n1P2k1m5KL8Kn8L2K3Km2M9l7pj8Lj6J8J4L6l8J00n0Nj8l2L1m0L2J1
3706B5j9J0mp4N8j3QK5k3j1J3n2L1O2k8j8L2k2Ok0LO0p8M5J6p7O2l8J9L0p5K4
3738b3J4L8n3M6J8m0L1k5n4K2K9k5K5j2K7q0M5J3K0k8Nk5j7P7k2j9k4L7J3j4r
3769a0%K4j6Oo3N4L9k2K0j7K9m2L8o8L2J4n3L5J6j6j7oML0k2N1p8K0P6n2rl3J3
3802b3N7j0N7p4m5M1j8L9n8J4O9k1o3M5l5Q3p4k2K9M2m4Q1p1l9L4K2L%l9K4N0
3833E4m5K3j5k4j2L1k8K5J2k7l5KR9n0lJ6j9j7L7l0jJ3Pl3K8k8L5q2N5M0k8oj1
3866a7RL4o5J9K9m7P2Ml8pOKk8oM5l6K8k3nJK8k3omK1nJ8rl4qO0%l2L7k5j6j4
3903c5K1M1pJJ8l4j2O9j16J1N6j9jL3Ln2K4k0M9n0N3k9mk6Qn3L2M6o2M7PL6m0
$$ y = [-9, 16, 28, -23, 49, 28, -17, -15, 23, 25, -33, -1, 22, 24, -18, 31, -6, -13, -31, -28, -44, -26, -12, 24, -14, 86, 36, 41, 23, -9, 22, -18, 14, 25, 6, 16, 12, -62, -4, -17, -9, 16, -7, -18, -5, -57, -26, 36, 8, -10, 22, 0, 6, -14, -11, 49, -29, 16, 32, -45, 17, -21, -2, 28, -47, -23, -9, 29, -24, 22, 40, 0, 31, 6, -48, -26, 3, -22, 3, -9, 18, -62, -17, -4, 16, -12, -7, -32, -49, 28, 6, -13, -37, 0, 13, -1, -10, -10, 14, -2, 4, -59, -5, 34, 12, 32, 15, 44, 2, 40, -28, 4, 18, -35, 0, 16, 0, -17, -23, -19, 11, -11, 40, -38, -18, 58, 6, -3, -36, -23, 34, 24, 81, 7, -38, 3, -15, 24, -34, -20, 49, 28, -35, 10, -25, 58, -16, -38, -9, 33, -11, 70, -1, -40, -6, 16, 19, 19, -20, 4, 54, 9, 32, 17, -7, -19, 12, -16, 9, 21, -6, -41, -39, 60, 10, 7, 23, 4, -13, 24, -6, -7, 6, 13, -20, 8, -20, 15, -67, -12, 28, 0, -6, -17, -8, 26, -39, -20, 9, -38, 34, 38, 0, -7, -1, 1, -27, -33, 12, -24, 4, -19, -24, -23, 5, -18, -24, -28, -7, -12, 6, -3, -37, -45, 15, 15, -17, 20, -5, -21, -35, -14, 27, 20, 21, 39, 5, -7, 62, -54, -43, 13, -6, -7, 26, 29, -23, 1, -19, 30, -20, 33, 4, 0, -26, -18, -71, -39, 7, -55, -8, -1, 35, -5]
3936eL3J4j07O7Nj3J6j5kK0L9j7m8k2L2n2O3j7LJ9m7L2K7m4kK4K8k7PL4p2k2P3
3969B4l1qM8m0J9Qq5M4J2NK8j3M0n4P0o2J6rNj9l4N3k4pm2O0m2K4rJ0O0p2O6l9
4003BK1n6J4O1p7QL2m9L8L4l5rJ9O7j33O5j3M1kJ1Mj3mm3N8o1L7k4j6N3l2j5k5
4036d2kK8K2n6M0opLj3M2j3j3oj6K9nM5k7J4l8L7k9K3NOJ9o7L4j4j3J6j8M2P0
4070I0p9J2l3L6k2j0M3q4N8l4J8j6K4LJ8J1n0j2J1L9p7%M8j9K9j5OlJ1R6o5n8
4102b4ojk1L3Rj4OPJ8Mj3j6M3mKl1J0m4N9qLk5nL9M7n5l7J2M5q6J1J4MM2j1J1
4138A8l8K7j1mj6mLk1O7Kj5n2N8L0Jm9L0J9l0j3M6j1l5L4n5L6Oj7k0J3m2j1K3
4171c1M9J2p6L5L8j8%L1j6m8J8nolM2m5M3kj5L9k7j2J7l3Q9q3K8K1j03N2J1%m1
$$ y = [-5, 28, 42, -65, 2, 7, -6, 10, -5, -7, 13, 52, 35, -13, -35, -3, -55, 8, -9, -6, 13, -34, -2, 25, -19, -21, 3, 31, 4, 11, 45, -27, -49, 24, -7, -15, 33, -7, 12, 20, -65, -21, -9, -4, 24, 11, 51, -3, 67, 5, 21, 12, 17, -2, -36, 17, -7, -14, -56, 4, -38, -14, -23, -13, 47, -25, 41, 2, 23, -33, -19, 42, -35, -27, 5, -44, -6, 28, -7, -16, 3, 70, -63, 2, -11, 30, 28, 39, 43, 30, 26, -17, 41, -20, 17, -7, -23, 30, -2, -17, -42, -44, -16, 6, -50, -10, -16, -23, -20, -33, 9, -4, -17, -23, -39, -10, -15, 30, 3, 17, -21, 16, -13, 10, 15, 21, 40, -27, 7, -7, -20, -4, -22, 20, 90, 11, 23, -10, 26, 4, -6, 37, -47, 11, -23, -5, -21, 3, 6, 24, 35, -15, -27, -16, 23, -54, -54, -6, -25, 4, -11, -5, -8, 3, 99, 34, -24, -30, -31, -52, -19, -10, -24, -18, -11, 7, 11, -2, -18, 25, 21, 23, -8, 2, -42, 17, 9, 12, -13, -18, 21, 68, 13, -24, -12, 33, -53, -42, -28, -24, 18, 7, 18, -20, 7, -4, -8, -24, -28, -25, -46, 21, 23, 8, -44, 14, 44, 45, -4, 26, 45, 15, 2, 48, 37, 2, 36, -19, 17, 23, 6, -14, -1, -43, -54, -31, 18, 30, -46, -11, 27, 9, 9, 40, 24, -24, -6, -11, -17, -20, 22, -23, 20, 18, 3, 42, 15, 3, 20, -13, 76, -7, 21, 42, -61, -9, 2, 2, -39]
4204c9pM5l9KMN1m6J6pL8j7j2NL7l2K1m9M5m6M2j8n9nN8l0j2N8l5J09j00L1k0
4236a1n8J01N1j53P9l6L4N0m9j8MJ1L2l7M3n1NM6j16Q7j8N4p7L5pNj1mL9m3N0
4267C7l2l5N2l6nL7k7J2oj7J7Nm1K4LNj8R7j07l1L8N3k4m7K5n7M8k8N3N3l3q1
4299f6N5Rl4kN8l6n8R6j8Nm3L0m7Q2k3K5p6N6j2LN3j3j8j1JK1l3nK2k9J1m5M5
4332CK1J9k4k3j0k0K5k9N0jk0lO7j8n7N3J7p6K5kJ1K7ok9M3l1ML4m4Mqj2K2K1
4366C3j7l0k4Q9l9m1K8J1j7NK2l4j2M2n2K8k6M9M7n1k2j7L8j4M4n7M0Ok1L5p5
4397c2M6m4Q2n6j6J6K5lj9k9L6l1nK1m2M2K3j8j1K5j6jnmM4j1m7K2K7q6O6J6j1
4430Dj4L0k1%k9RK2J8j0Mj5L5o7loP6l8O6K1p5Mm8pK7KJ3L2L3p8jJ3j0jk9J5L6
$$ y = [-39, -46, -1, -40, -38, -34, 17, -29, -13, -20, 18, 1, -11, -6, 31, -1, 20, -29, 16, -30, 12, -6, -65, -70, -12, -42, -54, 4, -31, 78, -22, 9, -11, -69, 32, 83, -70, 9, -27, 7, 57, 8, -10, -6, 5, 37, 0, 43, -8, -3, 43, -73, 14, -4, 50, -27, 8, 1, 6, -5, -9, 30, -13, 37, 5, -30, 22, -14, -19, 18, -9, 3, -3, -20, -3, 2, -39, -15, -12, -7, -25, 72, -35, -66, -28, 25, 1, -46, -21, -78, -30, -58, -5, 48, 15, -66, -11, -2, -36, -38, 20, -16, -74, 22, 4, 9, -34, -4, -51, 31, 8, 33, -43, 13, 1, 4, 57, 44, 26, 15, 16, 37, 4, -1, 21, -8, 3, -42, 3, 24, 43, 19, -4, -14, -34, -9, -38, 12, 11, -9, -12, 55, 37, -20, 33, 50, -26, -1, -3, 8, 35, 29, 0, 43, 12, 16, 50, 6, 10, 2, -10, 12, 33, 16, -14, -38, 51, 12, -29, -1, 10, -7, -2, 20, -14, -26, 16, -36, -8, -34, 15, 62, 11, -11, -28, 10, -4, 40, -17, 23, 29, 8, 43, -32, 14, -30, 52, -4, -20, -4, 21, 18, -1, -30, 6, -25, -30, -9, -51, -9, 14, -4, -15, 10, -6, -7, -12, -16, 28, 17, -30, -8, 19, -67, -1, 15, 4, -10, 20, -1, -1, -30, -21, 1, 19, 9, 13, -2, 33, -34, -37, -43, 33, -5, 61, 82, 7, 11, -37, -44, -17, -15, -2, 30, 63, -15, -16, -3, -13, -14, -43, -28, 8]
4466Hj5mL5r2O5%j0M0k4PJ0k3KoN0j4m4LlL4j0K3j7Ml2P0m2pL9j15J11n5j2M3
4500A9l1M1k6M2j3n0J9j0pK6%J0Op8M0j3nj6N6%j8O1o5K8J1l2K2l0K3p4R9j3j9
4533Cn8P6L2m8J2Nrj2l4N8k6j6k7J8L1k9K7k3OLJ7oRJ1k4J4M2m7QjJ3l3M1l3M3
4568D3p3l1Q6M1k3o4K7l7K6M5l7O1k8J3r4J1M0l8L3nj9JpM2pJ3j1l6M2l9L1J8
4600B4l7j3K1L1j7k0j3L3k1mO2j6k2N6j4p0K8n8P5l4K5pj7MM3n7j7J6N6m1J7k9
4632a6K9l0M6m8k4OlN4j02J04l1J2k2K3j4P5o5J7L6o6M4%j4qLJ3q1L0P2p5L5%
4664@K5n7pM4J2k4J9j3jQOpo4O2QN1r6N5Qm4L4j6j1Jj6Pk7K2k8P0MlJ7n8K9L7
4700D7ql4M7o6N3l5ONm3L2K3l4L0n1Pk4L6K4j0Qjm0L9j9%N5n9K8M2q6O0j9l4M
$$ y = [8, -7, -11, 24, -68, -3, -3, -13, 27, 3, 10, 20, -3, -1, -7, 43, 29, -15, -12, -15, 19, 9, 32, 15, 19, -13, 57, 15, 8, 47, -68, 43, -12, -24, 19, -12, 29, 3, 45, 32, -18, 1, -9, -16, 10, 10, 20, 26, -52, -12, -25, -30, -46, 10, 10, -8, 53, -12, 16, 27, -5, 17, -13, 10, -64, 35, 22, 3, -55, 21, 53, 5, 17, 22, 13, 1, -33, 25, -1, -17, -44, -26, 5, -24, 3, -20, -14, -11, 6, 0, 9, 20, -4, 10, 52, 5, 13, 12, 25, -8, 33, 0, 43, -30, -61, 25, 66, 43, -21, 6, -31, -5, 40, 3, 64, 36, 49, -45, -34, 6, -32, 1, -4, -23, -22, -29, 13, 6, 19, 8, -28, 14, -25, 6, 24, -13, -26, -5, 26, 9, -11, -24, 9, -12, -16, 46, 30, 8, 64, 50, -20, 8, -50, 25, -9, 16, 9, -8, -4, 39, -18, -35, -19, 37, -4, 13, -16, 13, -17, 29, -19, -43, -37, -40, 14, -88, 16, -15, -3, -25, -2, -16, 59, -6, 11, 47, -19, 25, 25, 11, 3, 6, 19, -62, -32, 40, -35, 0, 0, 25, -32, -39, 5, 17, -7, 12, -1, -2, 6, 12, 5, -59, 3, 11, 62, -34, 21, 29, -15, 19, 3, -8, -7, -23, -16, -43, -21, -49, 21, 25, 22, 39, -19, 10, 47, 39, 5, 52, -14, 39, 4, 10, 15, -28, 4, 27, -7, 23, -28, -21, -45, -9, 15, 5, 13, 12, -28, 11, -8, -8, 47, -12, 16, 58, -28, 32, 13, -21, -17]
4734a7L2J0k1k7J06o9j3J5L8q7L3L2Nj2m6N4OKl2m6N3o1O1o7K4n2O0L6k0N5o8
4765a6mK9L7l8l6K5Lk4Q2m5K2m4L7l2J3%L3o0O7n9Nm4M8PK2Rj9j4NNk4K1m5K0
4799a4k7J1PK8o7L4M7k7N6l9j3j5L9J0k4n1L2K4L4k1k4J4K2l6o2M8J1L2m9K8k5
4830a7K1k0PK1q1R6j7rmM2n6J1k8M4J4M1q0QN6oop5O8k5j4j1L6p4L5J4k5M7l6
4863b3K2j6P4j6m9Q1l7l8kj6L8J1m9kk5N4K9Kk6J5J2j1l8M0l2j4J8l0N8J7r8M2
4895iJ1J0jj0J7j17P6K8l5O3J9k2n5L2K9n7Pk0KR0q2O6q1J8RJ1jn1OJ17k2l1k
4928A5qK5k9L1o1O1o4N5j2M3n4%K4k0K2Pm3L0J3o0M0rjK4n4K7j3Q0m5m4K6o2O3
4961Gk5L3om4N3o7J07q3Kj1N6o0PL9j1Oj9l5J7R6j03R4K3l3n8k6Q8k2lJ7lql7
$$ y = [-17, 15, 25, 4, -23, 83, 14, 1, 16, 54, -33, 0, 32, 37, 25, -21, 33, 39, 41, 9, -37, 16, -45, 16, -51, -27, -79, -19, 17, -3, 52, -16, -20, 9, 46, 8, -28, -3, 0, -24, 58, 13, 35, -9, 28, -4, 9, 9, 42, -18, 49, -10, -5, -49, -1, 6, 28, 37, 18, 4, 9, 14, -10, 11, -34, -14, -41, -30, -23, 5, -62, -28, 19, -8, 48, 9, -4, -19, 20, 30, 6, -45, -13, 11, 45, 24, 0, 14, 36, 0, -62, -14, -3, 29, -20, 8, -17, 4, -16, -9, 12, -69, 27, 10, 1, -3, 39, -17, -6, -34, 10, 24, 65, -15, -7, 49, 43, 37, -38, 30, 5, -9, -20, 16, -58, -23, -9, -34, 13, -23, -1, -17, 57, 41, -8, 73, 36, -2, -4, -20, 18, 29, -20, -22, -47, 7, 36, 38, 12, 27, 39, 28, -10, 30, -2, -16, 2, -28, 30, 47, -51, -9, 2, 12, 11, 1, 18, -99, -23, 5, -30, 33, 52, 30, -25, 7, 36, -21, -14, -34, -32, 58, -24, 42, -39, -21, -12, -1, -2, -53, -47, 70, 48, 17, 15, 7, 32, 3, 34, -27, 34, -30, 25, 13, 56, 2, 2, 26, 6, 28, 35, -8, 22, 35, -25, 15, 6, 5, 29, -25, 2, -11, 69, 24, -20, 6, -56, 7, -18, 15, 9, -35, 18, -49, 58, -25, -23, -34, 22, -38, -31, 8, -3, 3, -16, -51, -34, 62, -41, 53, 76, 43, -15, -41, 47, 25, 22, 39, 36, 28, -9]
4994iM1k7j3k1OL5L5j21J07K5q1K3j6N0l3j3l1O6Nm0K7k0L1l8J7Ml3K0LK8k3m
5026@J7l7m9M8J8J0k2N0k8j5QO9r3N2k1p6P6OpL0l8j1%oL1Ql5J3O0r9Mj2L3K9
5060A3k4K4k1L4j4M5j2ro2j8M9KOL1%mMK4l0p3jK0oJ8K7l4j9l3M2qN6p0O9o1O8
5095C3k0KL1p5O5j0l8M6n1J9K8rk3MM6m3NN4q4P0o5N7rok3K5Jo6M9L8o2K9k4K1
5129A5J0j9pJ2m7K1L5k9Lk4O2l3k3J1O1m9qJ4K3j5l8M0l1P0j4Qr0J5K0L6j0l2
5161a3J3n2P1l9m4K4K9k2J2J1M7k5n3RQnm3Q6Ql2j7J8O2m7J9pj0k6O1k6o1P1q6
5194e9L8P6k1K7n1k8L1Knk7J5kk9LK3L5m6Lk0K0k8O2rj4Rk8K6J9m0J7L6m6j0j8
5228c9l1P7Oj8J9j1MJ6lm4LL6J5jj9kl5L9m9m8J04k6N7r2M4n6MN8m1K7l2K0PN
$$ y = [-9, 32, 5, -8, -29, -23, 12, 47, -74, 33, 58, -23, 0, -16, 34, 1, -12, -43, 23, 28, -12, 15, -5, 26, -12, 5, 9, -24, -4, -1, 27, 4, 0, 17, -20, -69, -21, -3, 7, -15, 35, 7, -8, 0, 69, -24, 28, 7, -69, 7, 13, 6, 36, -2, -13, -13, -19, 12, 20, -15, -2, 58, -41, -37, -49, -16, 13, -11, 13, -8, 26, 12, 57, 45, 36, -26, -44, 5, 7, 13, 44, 44, 40, 44, 68, 38, -35, -36, -16, -22, -4, 23, -11, -30, -63, -21, -29, 27, -43, 26, -35, 33, 13, 15, 46, -29, 36, 26, -12, 34, -17, 2, 30, 21, -2, 2, 48, 5, 10, 64, -20, 50, -15, 42, 33, 27, 4, 29, 30, -36, 13, 51, -11, 18, -6, 15, 25, 6, -1, 11, -36, -15, 20, -9, -6, -30, 32, -1, -24, -13, 48, -1, -9, 5, 28, 13, -25, 15, -16, 54, 40, 48, -42, -27, -7, 29, 19, -13, 0, -52, 19, -20, -64, -40, -11, -33, -21, -10, 37, 12, -41, -32, -24, -29, -72, 14, 22, -10, -27, -9, 53, 6, 25, 18, 8, -18, 43, 17, -44, 27, -59, -21, 55, 34, 61, 10, -18, 13, 15, 10, -17, -2, -4, -33, -30, -7, 28, -18, -15, -35, -15, -43, 19, 10, -4, 5, -23, 3, 22, -18, -1, 35, -11, -21, -39, -70, 7, 13, -5, 14, 3, 7, 23, 20, -24, -21, 15, 30, 29, 10, 8, -27, 12, -37, -85, 19, -7, 50, -42, 2, -54, -50, 8, -33, -6, -38, -18, -11, -6]
5262fJ5M8j6o0j6L8j5j1P0l8j7oO3n5j9M9Qm6PkL9KK2o6M4l0Lm1K5rL2Nl0jN7
5297D3k5J7l3l0j0Q3n2nl7K2M6M5q3N0m8O9p9l7J05k4ok1J2Q5o7l7j7M1J4nL4
5328E0m4%L0j1nk7JK4jnm6LL1j1L5o8N4mm6N5j8L5l5L5l7L4q6P5jl4j9M5nl9R1
5363E6o1l0N4J0l5K5k3L8o0L2RK6l0kk7O8o7k0n6O2L9J3mm9NJ2l5K9J2K0K2m6
5395a3RQj5J8j8L3J1l9j6Lk6Q3m4P7o1nJ5k7M4n7K4K4m6N9n9qrL3k6L9rN2m2k9
5429a7%ql4L4M1k2qOoJ6m7N4O3k6j4k1N0qJ1m1n2N9l3JKm1O1nrK0k3m2K5l1M1
5464dl7n4Q0J00j06M1j0p1O2N0J2r4%J2L2l9J7mMK6o2O7Jp9N9L1o6P8r9M5l0l1
5496f9M6k2N4Mm1L5j0J0k3%j8L0l4N8o5P2k7K0qRK9l0k1Lj12O7Q9j7j1lml8J0
$$ y = [-6, 9, 57, 41, -19, -35, 3, -12, -23, 47, 9, -8, -14, 49, -6, -25, 24, 32, -14, -7, -9, 30, 32, 54, -12, 32, 2, 5, -36, -11, -20, 12, 17, -13, -14, 43, 18, 35, 2, -28, -38, 45, -7, -12, -49, -27, 19, 64, -19, 31, -17, 52, -27, -64, 41, 17, 11, -10, 2, 87, 20, -17, -34, 7, 21, 16, 50, 6, 6, 36, 25, 20, -7, -6, 18, 17, 12, -34, -31, 0, -11, 24, -44, 10, 6, -40, 15, -3, 32, -3, 32, -5, 29, -57, 18, 17, -17, -36, 9, 4, -35, 56, -5, -35, 19, 29, -6, 19, -4, 34, -26, 6, 15, 41, 11, 9, -18, 50, -17, -37, -93, -31, 8, 21, 17, -32, -27, -15, -50, -21, -9, 11, 33, -13, -4, 4, -11, 7, -11, 22, 33, -6, -22, -19, -45, 38, -6, 71, 10, 5, 20, -7, 37, -20, 4, 28, -18, 41, -18, -26, -35, -2, -28, 11, 2, 54, 12, -17, -17, -25, -59, -25, 16, -6, -14, -8, -14, 2, -45, 9, 72, 46, 32, 11, 61, 53, 64, 23, -29, 30, -3, -2, 0, -41, 20, 15, 6, 26, 3, -39, -14, -45, -4, -41, -95, -15, 85, -21, 20, 10, -61, 1, 51, 63, -31, -31, -19, 13, -26, -9, -13, -9, 17, -45, 22, 23, -56, 3, 34, -32, 46, -53, -8, -38, -69, -23, -45, 9, 13, -28, 7, -3, 7, -16, -16, -34, -4, -38, 20, -45, 27, 0, 20, 12, 21, 50, 20, -1, 2, -110, -43, 46, 29, 18, 15, 11, -27, -17]
5529a7k7L9L6j2j9L3Mn1K4j0j7L8rj2n8Q3q9O0k5O0m8%j5M3j6J3Ro4P4l2k8K0
5561a3J3LJ2J6J9j21P6k6JK3J4J6l0O1k8l2j0J2j0prL5j9K3LJj6KLpk4k1M5l6
5595c1K4NO1n2n2P6j8nj8k4K7O6j10P2rl1K2MjQN0q2O3%k8K0j4p4K1M2P6r6M6
5628C8q6Q3l0m2L1L6p2k5R6m8P5n8j0L8KJ6k5j8k0K2KM9q6K6o7L5M1k6L0j9j1
5659b3L4M3Rn6K6n6P2m5m8O7l8J0RK0l4M8J6o4LK4ml5M3j4o5M3JM7k2J4J1Ol1
5692A1L2j7j6J6k6J5k2J4J7j6j6NJ2l3K4kmk9Q8m7k4K9K7j5m5%OrQnO6rp9K8N
5727a1Nk7N3j8j9M9j1%j5J5k0J1R3k9q7J4M0j5k7J7%K5m3O8o6m4K4M2o3J7J5j4
5759b1kojL0J5K6n3J6NqJ07j49N8Pl4J4M3Nj24P1M5l6m3N2k2P5p3j7l6O4J1L6
$$ y = [-17, -44, -5, 31, 19, 0, 33, 37, -14, 10, 0, -17, 21, 12, 0, -58, 25, -64, -4, -29, 31, -17, -17, -32, 11, -5, 8, 17, -47, 27, -5, -33, -13, 0, 3, 15, 31, 50, -71, 5, -21, -20, 3, 17, 33, 3, 64, 36, 4, -6, 6, -4, -11, -20, 15, -4, 19, 22, 23, 7, 9, 12, 5, -19, -40, 5, -31, -7, -2, 59, 7, -45, 31, 13, 8, -10, -34, -7, 59, -51, 21, 12, -19, 3, 7, 6, 14, 64, -18, 45, 45, 17, 37, 23, -51, -30, 12, 88, -8, 38, -48, 35, 5, -37, -6, 30, -42, -67, 29, -19, 56, -2, -12, 26, 28, 44, 19, 1, -19, 3, 5, 54, -32, -6, -73, -38, 3, -23, 7, -12, -23, 11, 54, 63, 7, 33, -23, 49, 4, -44, 23, -15, -5, 4, 24, -10, 38, 54, -10, -7, 17, 13, -22, 21, 7, -58, -15, -14, 33, 11, 25, 36, 42, 11, 43, 26, 10, 26, 0, 15, -7, 7, 24, 8, -8, -3, 9, -24, 0, -2, -6, -35, 53, 6, -18, 11, 38, 23, -22, -22, -16, -25, -17, -22, 44, 35, -44, -16, -11, -6, -33, 20, 2, -17, 32, 21, 21, 6, 21, 1, 12, 105, 76, -11, 3, 43, 28, 1, 18, 18, 43, 0, 68, 2, -42, -18, 24, -39, -22, -7, -21, -23, -29, -30, 0, 15, 41, -12, 4, 9, 1, 108, -41, 17, 24, -10, 4, 47, 52, -72, -1, 44, 8, -35, 17, -5, 70, -3, -20, -56, 8, 19, 55]
5791E5l3k0qj2K5k0M7j7o3M1k8O9n4O8j7m6M2k0Jl1j3P1jk9j4k5J5O4k4k6j3P3
5823E7m6m2L4Rl1L1M9k9Om1K1m6J02o3l2Q2n4l0%J2j1L7j0k1k6N7j9K9j3Rj1k
5855HM0l7NmnJ2Pk2n9M4P5n5Rl4nP2r8M4jj2kl1J6L6%rk5L3NkJ4k4n1P7j12J32
5891D1m5K7j8K3j5jOo2K0N8o3L8K4K6n7J3l5O8p5P1o1K2n0K2L6J6PJ6Jq2n9L5
5923e3P7K3k1j1m2q0J04mk3K3M1L3n7j8K4l5MN9m6j4m2LQ2k3M3m3K2L0k2k7M5
5954E2m3JJ0l5k0M3M6j5oJ0l2l3M7k1l5K4k5P4o5m8K2P1m7L8oL8j1o3M3L3n1p
5986a1l4R5m5MJ7l4P7q0J3P2Pl3J4o1qM9j4k9J3ll3Lj0mN0mOlqk3K3k6N2m3P9
6021F8o5N4j2mm4J9M5o2j%JJ4j6N2j9m7O6m2j0K7Pn2kM4lJ5ml8pj1J5n5R8qm9
$$ y = [55, 22, 2, -6, -18, 7, -13, 34, 17, -46, -5, -33, 36, -18, 50, 33, -13, 29, 9, 10, -21, -34, 37, 36, 7, -7, -32, -17, 47, 23, -3, -16, 57, 11, -31, 3, 12, -19, 12, 61, 32, 38, -3, 18, -28, 74, 11, -21, 61, 7, -23, -23, -11, -22, 15, 5, -16, -42, 15, -4, 25, 12, 21, 10, 8, 48, 11, 16, 12, 7, 19, 26, 4, -55, -11, 64, 9, 18, -16, -21, 51, -47, -3, -4, -16, -18, -49, -33, 3, 3, -6, -31, 2, 7, 5, 19, -5, -56, 21, -91, 41, -4, 23, 5, 28, 13, 12, 18, -44, -24, 34, -29, 9, 33, 59, 2, 15, -20, 48, -27, 44, -17, 5, -45, -23, 13, 29, 36, 52, 53, -29, -88, -53, 24, 47, 26, 15, -27, -107, -3, -7, -30, -7, 34, 67, 10, -8, 16, -19, -15, 44, -2, -16, -58, -55, 27, 4, 47, 4, 26, 56, 34, 7, 52, 9, 10, 20, -15, -35, 8, 54, 39, 33, 43, 11, -22, 25, 4, -31, -7, -32, 42, -23, -71, -49, 22, -25, 13, 7, 45, 34, -29, 14, 47, -4, -11, -45, 50, 5, 9, 26, -8, 69, -11, 2, 74, 81, 48, 62, 1, -7, 42, 28, -1, 12, 9, -24, -21, -31, -35, 15, 11, 17, 14, 6, -17, 6, -20, 32, -11, 68, 3, 57, 45, 41, -3, 16, 61, -1, -2, -2, -1, 13, -3, 49, 30, -17, 49, 7, -3, 24, 31, -21, -23, 21, 18, 33, 29, -9, -16, -27, -12, -67, 31, 23, -26]
6056b6M1n0M2k0oL0l8Q0q7j1J0O3j2Jk1O3o3j5J1M0n0RJ4K6Mq4P0K6m8J0l1L7
6088A5k1l3O7l9pk1K4P1l9l1lM1o2M6Qo0N1L2k1n9J02k6n5L6m4lQ3j4K3j9o4K2
6120@mRL0o0O0n4J2kJ9Rn6j9O8j5m7N1n3O3p5N9K9no6N2k8N5l0K9o9M1nJ8Qo8
6154d4K5Q1j12P2m1K8K8j03R1K7m8l5k5Q3l4l1J23j12K0K2K1qm8L0Ql9mj9K0M9
6184B5k1j4J3j9J7J4J5rk9mN7k1m2L8j0%Ok5N8n6M7n5K3rN5o4K1J3m7J8Mk2n9
6217h2J14p9N8n0J7O0q0N9n1K7k4KLQ0n4J6l3KM4k1J3N8r1J4J2nK3k3M6l8Lj0
6249A0k4L7n8Q8l5j8J2j6l6L2K3l6M0n1N8k8j3M3o9P2j4k6on%J3j1n2R3j9nj9
6281b0O0r8O0Q9q3PK8l5qKOL9m9l0O8l2OK3p2k1O6j3pK2N6q3J6j2N3k5l8K9l5
$$ y = [-26, 15, -35, 7, -13, -19, 11, -27, 53, -34, -45, -35, 28, 16, 17, -4, 59, -4, -19, -8, 32, -18, -9, 5, 31, 35, -49, 21, 47, -1, 9, -22, 15, -6, -39, 28, -11, -18, -39, -15, 56, 17, -14, -17, 24, -38, 8, 16, -44, 7, 39, 18, -41, 61, 35, -20, 16, -28, -31, 52, 38, 61, 42, -22, 0, -4, 5, 35, -25, 35, -19, -7, -9, 10, 19, -37, -56, 12, -3, -50, 1, -52, 11, -64, -5, 24, 19, -47, 5, -23, 32, 2, 31, -38, 3, -2, 16, 24, -44, -19, 62, -50, 22, -19, 9, 37, -66, 25, 52, 4, -31, -56, 27, -7, -38, 85, -27, -7, 15, 36, 28, -20, 10, 18, -21, -25, -44, -24, 25, 4, -10, 3, -16, 1, 15, 30, 21, -8, -12, 45, 24, -18, 20, 10, 10, 16, -9, 49, -7, 40, -15, 8, -1, 54, -10, 11, 24, -23, -5, -1, -23, -82, 32, -47, 11, -39, -22, 38, -42, 17, -34, -7, -31, -29, -26, 54, 0, 16, -17, -15, 29, 8, 21, 79, -12, 2, 14, 9, 32, 9, 55, 17, 20, 10, -14, 23, -35, 53, 18, 0, 12, -4, -40, -8, 15, -21, 19, -32, 26, -2, -15, 28, -41, 31, 17, -9, -15, -20, -20, -7, -18, -70, 23, 4, -1, -20, 40, -58, 2, 91, 8, 15, 43, 8, 0, 2, 8, 47, -2, -32, 36, 4, 10, 33, -39, -60, 6, -7, -14, 8, 64, -19, -3, -15, 38, 13, -25, 4, -31]
6314c1L8Jj1q9O4QK0m%PK7n2J6K2K4n3j4K6k0Oj2N2m0J7J1%k9pJ8L5rmn4j0Q4
6349C7l9rj3LL5J2o2N2Pl3N7l1M8l3rPJ0Kk0nK0n7P8k5m7M5m4RMnK8%Ql7K3k6
6385a0o6M6N8K0l2l5M9j8LJ1k6Km6N5K7m5L2p9R5j9p%J4o3P3q3P2Jl6N0l6J1n0
6418c2N7k6m6O7%OJ6m7M2p0Q9r4L7K4l2k5KN0l8K2J6o3N4l9J4j3LL3O9p6O6k5
6450D1k3k2kL3n8JPM5k3j0J6k8N6j6j8J7j9M9q4L4NMl7R0m6J9m2K0K5l6nnkk0
6484c4J27j01k8MnN6l9L5Pmj2r2J54o1l7J03j9k5L1p9J0K0m8O7L2n9Qj0K2m0k
6515a9L1m0M2m0M1mj6oO6m0o6P0J4k4m2O7%n3R6n6LJ0J6m0Mk5pj6N6n3rj6J13
6548E7j8l6l0R%k1O0j0J1j9rm4K6J5O7m7k5N7j9p2M5k3J2j1L1J1OMlJoL2m9j1
$$ y = [-31, 7, 8, -3, -92, -28, -20, 0, -4, -4, 3, 30, -22, -6, 16, 40, -13, -27, -1, -21, -15, -27, 25, -15, 2, 13, 13, -16, -23, -5, 30, 21, 17, -37, -47, 37, -2, -11, -24, -21, 14, 26, -36, 16, 23, -10, 47, 16, 64, 31, 22, 29, 39, 41, 21, 16, 36, -21, 57, 32, -15, 30, -14, -5, -1, -6, 22, 22, 30, -7, 16, -10, -76, -30, 28, 48, 16, -19, 30, 12, 15, 26, 0, 2, -44, 11, 38, -7, 25, -54, 41, 22, 15, 15, 29, -34, 39, -44, 28, 29, -7, 43, 7, 18, -32, 25, -1, -47, 20, 20, 26, 42, -5, 37, -33, 56, -38, -1, 23, -9, -34, -32, 18, -20, 2, 18, -45, 9, -30, -16, -29, -26, 7, 76, 0, 66, 41, 18, -4, -6, 27, -31, -30, -23, 22, -1, -11, 5, -23, 33, 17, -1, 16, -3, 46, -38, -4, 1, 5, -32, 58, 12, 31, -11, 9, 34, -2, -7, -12, -14, -34, 93, -8, -36, -32, -37, 19, -20, 15, 22, 18, 6, -86, 68, 7, -30, 73, 54, 29, 60, -19, -9, 11, -37, 30, 62, 3, 11, 1, 23, -17, -19, 12, -28, 14, -26, 15, 11, -5, -11, 55, 15, -51, 19, 33, 9, -33, 34, 34, -19, 77, 21, 24, 34, 50, 10, 14, -11, -18, -34, 22, -31, -40, -56, 57, 39, 3, -27, -18, -18, -39, 21, 11, 22, 3, -6, -50, -24, -9, 58, 11, -14, 43, 24, -48, -3, -26, -14, -25, 6, 17, 23, 27, 24, 25, 19, 51, 2, -9]
6582iL3m5L0n7N4l8L5Ll6M9m8J02r6NO6o5L9OK3p0rN1m9J6K0Oj6k1M7p8O9l9M4
6615B2l7jm8J09qn0KmlO0k7RJ0l4jRJ3OK1o4oJ2Jl6R1o6j7O1p6N9J0J4J1n2O3
6650E3q6M8J4j1Nj7qK3M4l1m7%k1K0N8l2l0oL1K3o1Q5l1l5n6J00m2k8L3j6Jrj
6683c0L5o5O4J7k9L5m2j1J6M8p4LJ9L9j9pL4l4j1M1j6n3J8lQL0k1N5r2O3n3M1
6715Fk4OL5n7O7j9k6P8q1M5Jl8J3j4j4RL8mKk6L6J6n2J6M1q8O3J2n6O4o5kN3j2
6749B3k0l2M6J7kk1oj0j6L4M7j9k9m6J2K8L8o3J9J2j5K6l0j0J9J0J1j4J6J0l5
6780@J8Qn7P7o4j3L4L2j4jj4L1m1pOJ3J3kj8k4j3qoO4j1K8k5l9%NJ6K1l1pJ7J6
6816DJ3j1RjqM3q2K5L6m8O0k1Mj0Qm1K9j9n6J07m3K1k8m2O6k4J9m9N2n2J9Rqj7
$$ y = [-9, 24, -21, 9, -48, 6, -32, 3, 6, -30, 19, -29, 73, -23, -18, 48, -17, 22, 28, 51, -19, -28, 23, -26, -10, 10, 16, 0, -21, 26, -52, 17, -22, 22, -15, -16, -64, 45, 37, -13, -11, -15, -18, 42, 15, 24, 34, 0, -1, 8, 21, 27, 48, -16, -22, -10, -9, -45, 46, -20, -37, 24, -52, 7, 17, 31, 42, -10, 53, -33, 15, 29, 18, 23, 6, -2, 21, 65, 34, -13, -13, -34, -14, 44, 12, -18, -24, 7, 30, -31, 54, 23, -12, -68, 32, -10, -38, -5, -21, -20, -29, -30, 5, -60, 4, 21, -8, 27, -15, -26, -10, 38, -36, -33, -14, 25, 6, -1, 33, -1, -12, 29, 13, -40, -22, -25, -17, 13, -8, 47, -45, 18, -35, 6, -18, -12, 23, -34, 33, 14, -12, 66, -15, 30, 31, -7, 6, -8, -22, -13, 25, 21, 23, -3, 33, 49, -3, 13, 54, -34, 29, 41, -15, 49, -16, -18, 35, 23, 3, -29, 17, 34, 32, 11, 5, -5, -21, 13, 60, 41, 12, -34, -22, 6, 44, -19, 0, 12, -3, 23, -7, -17, 2, 12, 23, 9, 25, 35, 0, 18, 26, -31, 46, -18, -31, 3, 35, 21, 20, 6, 37, -4, -11, -5, 8, 21, 19, 1, -23, -36, -44, -50, 14, 3, 31, 6, -33, -33, -28, -12, 9, -22, -29, -12, 4, 17, 6, 15, 14, 6, 49, -33, -8, 28, -20, 40, 19, 23, 13, 21, -20, 9, -10, -66, 41, -2, 19, -9, -51, 15, -9, 10, -39, 13, -39, -20, -11, -19, -36]
6850c6L4j7JJ2K1K1m2j7L7J5j2l5M1kJ5Km5JJ12j46N0L8o0k4J6J01k7o1j0L5K0
6881C8m1Mk4L9J1m9K8l2M9l8L3m2LNL0m3j4P3m4k8O3l7j7j6R3j6l9J4nN6m8M3
6913D9mLk8n7J3M4K1k7K0o6K9K2M4o3J1m1K5lKk0O3j9j4l6LoK5rn1R5J1m4KLM0
6948C7o7N2j7kL6j9j1JJ7l1m6kR4l1k8N1m9J6k1J0%J4l6K2M7n2j0K6J4l3j4K6
6980fK4K2n6m2O8K7p9M5k9Q5l0j1l1J0j4K0kL2m2N2m5J5J0l5J1o2O9j6P8r1K3
7011@L6l9k1J6KQm5Q3p5j0M7J6n3k3J03q1k9K1J02k6o2O7jn2j5LM9l1L7l1j7O7
7043D6p4N4k0K1k1K4l5J9k0L5J5kp1J3OK7pk1J2L0l2j02R1NRK8m0J0j0KK1j2j
7076@J1M0o1m0M6L0j8mK9kl8j1j5K0LJ8l2ML2p9K0N2j7P2q5k9O9j4l3nQ7m1l6
$$ y = [-36, -2, -19, -18, -6, 15, 36, -6, -23, 14, 29, 17, -18, 23, 21, 36, 38, -7, -6, 106, -40, 10, 48, -12, -36, -20, 81, 54, -7, -17, 18, 38, -3, 1, -23, 16, 27, -22, 6, -26, 23, -15, 18, -24, -21, -16, 14, -29, -43, 30, -14, -42, 21, -16, -33, -49, 44, 28, -11, 3, -2, 54, 6, 49, 45, 48, 20, -37, -24, 20, 41, 14, 34, -32, -3, 19, 63, 0, 11, -30, -5, -8, -6, -26, 37, 18, 4, -32, -29, -35, -10, -19, -70, 25, 36, -8, -6, -3, 37, -30, 22, 5, 3, 39, 20, 9, 10, 27, -4, -50, -52, 42, 11, -17, 34, -15, 1, -20, -10, -10, 4, -32, -10, 37, -15, -25, 1, 15, -18, -32, -6, 18, 40, -16, -58, 10, 37, -42, 3, -26, 59, 29, 18, -13, -3, -17, 3, 1, 33, -9, 43, -2, 13, 23, -12, -1, -63, 6, -10, 68, -23, 0, 36, -3, -24, -8, -6, 2, -43, 40, -35, -45, 2, 18, -35, -58, 45, -36, -65, -44, 58, 32, -30, 37, 36, -16, -31, -28, 21, -10, 27, -4, -21, 46, -28, 26, 6, 27, 6, 30, -5, 14, -6, 29, 44, 42, -29, -16, -10, 17, 10, -11, 1, 31, -1, -103, -12, -7, 2, 30, -10, 0, -10, -8, 13, 1, 0, 11, 51, -10, -50, -4, 26, 8, 4, 33, 31, -7, -18, -33, -13, -10, 8, -24, -20, 12, -67, -47, 5, -12, 60, -25, -54, 15, 1, -32, -37, 50, 9, -27]
7109b7M4j3J4Ol3L0k0L1k9O5j09L5J3m0M5k2N1l6m8K8K5j3Pj1J4%Rj7kl8O5o1
7141c7J2N9m0K4j7p7L7Q6n1J6k2k3R1o2j9J8KK1j1K0l7N7o4J5K6m7O4J4k4k4r
7172bJ7o0R4l4Op8J12n8K1m2K2lM0q5M6nK4L7n0Qn7L7n2J30r3O9Nl5j5NK7n0J7
7205bqj5L9J0n9L6P7j00LNkm2M8L2o3L7k9N0n3N7n4j0R7j02J1K6l5P2j6J5o5O5
7237B5p7Q8n2M6r0P5rj2K7K3om6kL9k3k0L7q2N1QM3J4l9j01J10Nk3j8o2N0K7k4
7269a8L3kl8O2k6m7N3L3r5L9L8Rm2l1O8K2ll2J9Ll7j5M5k4j8QL2o0J4N0j7J3n6
7302b0K0K0j6K5j2%j6O0n8pl7K7Ql7O5j8J2m6J2L8j5lK0mp1L3O9o7M3M3j02P2
7334C8j4K3p6l6L2K3omM5k9qPk1K4j4J5M5l5m5j4L4J5kM5l7Nj2J6k1O5m3L4p1
$$ y = [-27, 17, 4, 18, 24, -9, 21, 1, 32, 3, 68, -41, -6, 7, -33, 12, -10, 41, 5, -43, -15, 10, -3, 4, -7, 7, 7, 16, -1, -3, -41, 24, -37, -25, 34, -6, 18, 1, -76, -39, 47, -4, 12, -10, -33, 58, -4, -23, -5, -3, 18, 7, 27, -10, 47, -17, -2, 24, -23, 41, 55, 31, 7, -2, 15, -45, 49, 15, 21, -57, 55, -3, 18, -24, -2, -5, 35, -50, -4, -9, 15, 52, 2, 10, -47, -10, -62, 68, -25, 44, 49, 14, -1, 4, 31, -19, -2, -10, -25, 14, 24, -35, 1, 78, -22, -19, -14, -16, -58, -10, 22, -41, -4, -33, 17, -36, 21, -33, -43, 54, -48, -37, -11, -46, 26, 10, 25, -40, 25, -52, 36, -16, 30, -60, 15, 6, -6, 21, 44, 38, -8, -10, 29, 6, -14, 23, -59, -8, 0, 43, 57, 18, -83, 27, 32, 9, -9, -71, -21, 6, -18, 15, 13, -25, 37, 11, -36, 17, 50, -45, -6, 32, 41, -1, -32, 36, 58, 55, 23, 42, 45, 8, -7, 38, 14, -4, 4, 36, -24, -10, 40, 23, 36, -20, 0, 20, 4, 29, 17, 17, 1, 61, 3, -4, -41, -14, -6, -43, 22, 4, 16, -30, -18, 20, 5, 2, 22, 18, -53, -20, 49, -18, 25, 68, -34, 38, 24, 47, -29, -65, -33, -10, -16, -20, 25, -4, -12, -5, -26, -2, -16, -1, 44, 9, -36, -50, -16, -1, -3, 42, 5, 10, -2, 14, -7, 58, 15, 49, -22]
7367b2L1o4J04Ll2L5l9MN%j2K2k2j0J3l2m0J01j7m7J5qj2M1lj8Jm6O4k2L7o1L5
7400Dm2M8qj3K3k4L4j6Pk2k6O0m4L3qlL5p3N0l0L1m1R0j00M2RpJJ0j05O1L4jj0
7434al5Q0q0J7PJ0%Ok3pN5j9K9p4N0p3Q9j0K9k8j3l0j5M9q2N4N5m8OK5J0o2J3
7467a6K2rM5k8n1L4J9o2K3j8L2k0K2k5j3J7R9r7N9n8M5JNj6M6j5k4n9N8j6J0N5
7499F5m2JoM1p8kk3J06l8n0oOJ4J6J4m1N9l9l4J8oP2n0mL3J3r4J4L2j8P8q2N2
7532B1l9M3m3L7l5K5J1N3p5m2O2L1m4poLO7j10Q4j0J8Rj49Q2lj0L0m2M7Nl4%l9
7565f0N8K4l3j6J0O9n1oJ0J0N1n5j8L8q0oJ05m4j3M2l1N8n9j1J8J6J5l9K1Jj3
7596A1l1M3qrK7m0K9r5K4M6Nl6jO0p3K4N6ml1K5K2o1PL1Kk8jJ4j5K3l6L0k0qL0
$$ y = [-22, 9, -55, 49, 52, 20, 55, 16, 20, 25, 25, 13, 35, 13, 3, 16, -16, -56, 45, 28, -19, -4, -12, -24, 17, 14, -4, -3, -49, 15, -7, 30, -31, 4, -38, 10, 2, -11, 12, -12, 22, 6, 13, -9, -35, 25, -19, 14, 6, 3, 38, -35, 15, -15, 16, -25, 65, -35, 7, 16, 9, 10, 20, -85, -24, 10, 9, -1, -36, 44, -36, -19, -12, -2, -2, 4, -19, -26, 29, 10, 39, -35, 15, -58, 31, 21, 50, 22, 9, -21, -36, 13, -69, -15, 40, -8, -2, 23, 33, -29, -16, 6, -3, 42, 14, -37, -3, 16, -46, -23, -41, -9, -29, -7, -32, -45, -28, 71, -26, 33, -25, 20, 21, 26, 10, 56, 41, 17, -42, 16, 0, 10, 65, 23, 24, 18, 59, -19, -21, -44, 62, 24, -26, -32, -26, -12, 4, 18, -23, 36, -3, -37, -19, -25, 47, -3, -7, 26, 39, -55, -41, -9, -27, 51, -31, 21, -18, 25, -18, 19, -16, 9, 20, 73, -2, -44, 18, 49, 5, -2, -8, -5, 62, -48, 36, 26, 44, 53, -96, -14, -17, -27, 3, -39, 8, 13, -21, -21, -60, -2, 22, -11, -27, -17, 52, 1, -5, 5, 15, 66, 11, -7, 31, -49, -55, 50, 6, -7, 35, 4, 62, 3, -8, 10, 26, 41, 2, 23, 24, 11, -20, 23, 15, 6, 33, -7, 22, -73, -49, -3, 2, -34, -35, 25, -48, -24, 32, 28, -3, 22, 44, -17, -10, 21, 23, -5, -6, 8, -7, 16, -20, 10, -10, -18, 12]
7631A2j5m0M6K9p1J9K3k0k3jL9lK3o7R9j01M9l3m0P8M8q5L1l9L8k6J1KJ0MK0l5
7663a8K9K8m5M6m7qK9o5L9N2k8l8O0l8L2o4k4K9M1L3m7RQm6M7l2Q2p9j9kP4kk6
7696A0J5p5Q0n2M7K5o0Nm0L5J7L8k2m4P2o5N9rk6jk5N2o8L6k8M2k0j8L0nq1P7
7728Aj1M3M0r8L7l6L1j0n0Q8l6J0Jl1J7J3l7oO6j8k5M0o2P0m6J2J2j0L6m0l0L1
7760Bk3L8j4K8m2k5M9n3M1N6o7n1P6l7J4J3nj4M2JM7o9k6J1rKL0l2qj9QM1l0N0
7794B5k6N5o9L7n8K9j2MRn2L4LM5q8N7j4rK6O8o5J6oNn8PL4n3N6j3O6n8k2K4k2
7828b5L8k1%Rk8j8M5k9K0J7j8L4J0m2L4ol0J2JRn4L4N8o3K8k5K2j6L3K5n2nnn2
7862f0L4J6K4k9L8m0k9KM4Kk8J6N4j3Pl2k0J4jk4L3j2rL2n7oM4k2K0j3j8L2J9
$$ y = [12, -3, -43, 3, 32, -39, -20, 3, -17, -40, -41, -2, -5, 18, -49, 50, -51, -2, -35, -75, 3, 51, -34, -3, -42, -4, -30, -19, -17, -7, -3, 17, -18, 11, 39, -6, 40, -7, -15, 14, -51, -12, 40, 12, -26, 34, -4, 28, -36, -60, -31, 10, 43, -4, 5, 13, -33, 14, -18, 64, -15, -34, -36, 38, 36, 10, 25, -50, 30, -22, 25, 50, -10, -5, -45, -10, 7, 45, 23, -21, 51, -14, 45, 36, 10, 9, -16, 36, -32, 4, -24, 18, -2, -20, 10, 5, -76, 1, -10, 33, 73, -25, 12, -24, 7, -3, -53, 35, -1, 9, 10, -21, -4, 9, -28, -34, 32, 14, -11, 29, -33, 37, -9, 3, 15, 5, 41, 1, -29, 2, -21, 17, 3, 31, -11, -36, 13, -40, 1, 57, -10, -61, 15, -22, -8, 5, 0, -14, 28, 29, 76, 7, -19, -8, -17, -15, 15, -17, -25, -44, -36, 5, -25, 25, -1, 54, -15, 22, -36, -7, -19, -15, -6, -58, -24, -21, 24, -64, -7, -21, -30, -4, 64, -1, 15, 9, 14, -44, -37, -3, -56, 0, -13, 53, -5, -27, -3, -25, 13, -8, -8, 1, -27, -45, 0, -29, -9, 8, -10, 24, 34, -8, 26, 20, -10, 2, 3, 12, -42, -8, 50, -13, 15, -10, 12, -4, 29, 54, 2, -3, -8, -60, -26, -10, 14, -15, 23, -17, -46, -44, 0, 2, -26, -10, 44, 31, 38, 6, -14, 0, -1, -25, 8, -4, -13, 19, -38, -44, 0, -22, -2, -15, -33, -1, 18]
7895A8pMop3P3m3j6Q6o8R0j03L4K5m7P6j2l8%Om9N8K8n3PK2j1Mmj2K6L0n8Lo1
7929g1M4K8kK1l1rk2M0l7M2j4k5Q9n6K8k7L5l0mj1O5J8n4j3RN5p7L1Qj1m7Jk9
7962e6K8L4oqPk6rP0o2N6l0j2K7l6M5o2M9o3K4Jj9P7n9K5L1p3P9j7Ll0onl9N6
7996fK6M4l5k8lj3l5R7r1K0M8m8K1Lo6N8k6%pP0j4l0K3M4r0RN4l4K9o6Q4qj1l2
8030a3n0J47o1k9j4j5O2nrL2l0Oj1k6K4k8%J8o9J05p4JQ3m3k8L1O6j07K9j1J9
8061@o9P9L2m2l0K8kK1n0P2o0mQ7m1r7J18j8j4l7Mj7J08l7j5J5m2rPM4l3k7J9
8093a0Nkk0Kjj5J3L2j7M8m9J2j6J7KQo2M8N0k4q7Q8n4L4L6o6O2o6J3M1ok7N4k4
8127A9K2m0Kk8RK8M7q7O3k0j6J0j8m2l8O8M5J8l1J0o0pM0M6p7K5M1k6Pk8l0N2
$$ y = [18, 11, 15, 9, -64, 9, -34, -50, 36, -32, 58, -45, -11, 14, -33, 43, 31, -7, -7, -1, -50, 8, 36, -17, -10, 12, 1, 5, 1, -11, 15, 45, -13, -10, -71, -27, 1, -1, 20, -11, -20, -42, -2, -39, 3, -11, -36, 53, -3, 25, -2, 33, 3, -1, -12, 53, 71, 17, 4, 13, 68, -9, 22, 30, 19, -28, -27, -56, -28, 6, 0, -8, -1, -27, -36, 34, -28, 28, -2, -14, 13, -23, 22, -40, 9, -54, -30, -29, -48, 29, -30, -5, 26, -47, 32, 15, 18, -12, -18, -23, -62, -6, 20, 64, 29, 1, -2, -15, -50, 47, -44, -24, 24, -24, -3, 0, -66, -8, -34, -34, -41, 29, 15, -15, 8, 52, -38, -29, 25, -9, 20, -46, 38, 30, 19, -13, -63, 84, 23, -6, -20, -35, 27, 22, 13, 45, 15, 21, 10, -16, 8, -20, -20, -2, -71, 34, -40, -39, 44, 1, -27, 4, 70, -37, -8, -19, 0, -69, 10, 42, 0, -30, -2, -4, 17, -33, 39, -21, -25, 62, 21, -76, 42, 24, 10, -27, -23, -40, 68, 31, 16, 31, -11, -20, -13, 31, -2, -29, -10, -5, -7, -27, -25, -26, -41, -28, 4, -13, 35, -14, -2, -18, -1, 1, 9, -53, -5, 45, 21, -66, 22, -32, 2, 38, -28, 34, -32, -19, 22, 16, -11, 43, 19, 41, 1, 3, -25, -16, 12, 59, -28, 35, 15, -1, 9, -9, -51, -89, -21, 24, 42, 11, 21, -39, -46, -6, 40, -37, -12, 29, 3, 10, -18, -48, 4]
8159DjM0j9k4L4p9L2L5j1mM1j9k6oj0L3k7NN9j06L8J7l9M4m5J3k5O8n2J6K3Q
$$ y = [4, 3, 43, 24, 0, 34, -45, -13, 22, 11, 7, 48, 29, 3, -3, -13, 20, -7, -2, 57, -49, -11, 6, -33, 11, -34, -21, -46, 22, -30, -14, 9, 17]
8191A7
$$ Imaginary data points
##PAGE= N=2
##DATA TABLE= (X++(I..I)), XYDATA
0@%%%%%%%%%%%%%%%%%%qJ6j6J6j6J6k4L2l2M0m8M9n7O9p7Q8j04J13j21J36j53
39h1J76j99K17k41K71k97L25l63M01m41M87n36N88o46P15p92Q75r69J078j204
59f36J351j525J740k006K346k804L455m457O216j0202L6680m342o0245K6099K3593
74A5263n299j6434m250m584J5072R775j5015j4319K0188J3064j0804o352M776
87A081l655M355R243m635j0461L485N163l451n483K096L848K88l883m760K65O974
103D70K035l623o74J678M97Q55J32K017K624k443m083R18R57l191j402K979j08
120c62m879q2M317L31O07L196j178k723J362J599k88O56r5k332j462J455m11k877
138c166J382L002j878k250P73J328K043J147j550r25J106O5j156N26J288r73j344
$$ y = [0, 0, 0, 0, 0, 0, 0, 0, 0, 0, 0, 0, 0, 0, 0, 0, 0, 0, 0, -8, 8, -8, 8, -8, 8, -16, 16, -16, 24, -24, 25, -32, 37, -40, 48, -56, 57, -64, 72, -81, 95, -104, 113, -128, 143, -154, 171, -192, 209, -232, 255, -281, 307, -339, 376, -416, 459, -510, 568, -636, 715, -810, 930, -1076, 1270, -1534, 1921, -2536, 3680, -6522, 30158, 25816, -34429, -8330, 15263, 9964, -6470, -10720, -15304, -232, 9543, -5472, -19791, 397, 13461, 2657, -3695, 1081, -2574, 1781, 11024, 6389, -4072, -587, 4576, 1125, -4358, -2262, 1586, 1874, -2009, -6769, -6504, 470, 2505, -1118, -1792, -114, 383, 1238, 1370, 3387, 6011, 3568, -515, 403, 1360, -1831, -3233, -254, -362, -5241, -5323, -1006, -675, -68, 3128, 1950, -773, 589, 2188, 1900, 2556, 2461, 129, -1333, 122, -289, -3166, -1784, 1218, -660, -2910, -2137, -809, 1234, 2381, 831, -94, 1012, 1077, -79, 447, 1735, 762, -582]
155e82P22r38j665J806J530j244n99l84l74J911K033j074j267J329N83j883m78
172e74J468p08m52Q22j571j561J580J191l81J92j98q51P46J712q0j202P11J057
190A901j084q31k34j30Q80n7k175m09J164j01J43J307L5q01O84J260o26o02J245
209A569jj233J23o50j371J177J013j544j125J062O35m61M21J048l35j85J025m54
227G14q51R77N04p43l9l43r86N6R28l3j335l23J208j41p52O52O11K17M22j23k42
248C78K32L88M31l92r13k57k17k71K32k97n17L84L36Rk61K76J216M27n94j42L2
269D80l7M16j74n87p1k17k80J4l7J33m3K09K20o06l35J056N55m01j14p6J2M21
291E38l2j88k0j5q0m86l40K77n7Q1L21m98k80M62N87L01q2k95J55J21j96q1k35
$$ y = [-582, 140, -798, -2463, -657, 873, -371, -970, -1354, -1728, 183, 2216, 1142, -125, 1204, 1787, -96, -574, 894, 186, -266, 556, -1015, -2576, -996, 195, -186, 6, -192, -1043, -297, 1415, 1335, 133, 844, 1901, 817, -14, -248, -378, 502, 445, -1730, -2139, -975, -1076, -933, 374, 409, -392, 292, 1552, 926, 324, 1569, 1568, 335, 458, -192, -1563, -386, 627, -917, -2042, -980, -345, -806, -385, 663, 328, 143, 1168, 714, -137, 840, 1344, 601, 562, 219, -767, -711, 217, 184, -1151, -1474, -266, -407, -1159, -507, 104, 321, 743, 620, 378, 610, 998, 1429, 1037, 124, -133, -350, -621, -389, -686, -1203, -819, -483, -474, -735, -459, 757, 1184, 590, 448, 480, 443, 859, 685, 98, 27, -190, -470, -456, -493, -360, -403, -194, 26, -580, -915, 141, 696, 295, 181, 105, 117, 538, 506, 318, 298, 283, 203, -283, -623, -346, -403, -322, -1, -499, -779, -317, 270, 571, 489, 194, 349, 470, 274, 193, -42]
314d2K38J37o92l91L04K34J70J90j26j99j49L03N13j86k93J72n8k03j05n4L56
335A19J96k39l75j64K72M55m4j86J18k60j07K93P6mJp7L5k99k65M62K69j22j77
358b3m28Q0M11N7J9R8m8p5k06J21K82j15j5L4l92k82J15L23K27k51k88N4Q3K86
382F7J07l8K03J57l84j40J29R5J13j38k88k73j77K74L10qj09n6r9K38J67p3K09
405B86K32k31k89j34K21J24l6j19j21l32J17J98l1Q4Mk35N1Q3M7J61J84J86k15
428B35l79J33L08m7L6k40k36k3l7j9J26n4Q5K9j81J04J93J59K94j39k53r5j0K41
452B30l6l21J14k4k19rJ03P9J14n2j09o5M0K29R0o8M8j07k30K51K33j42j17Q2
476A14n2j76k15K78N0K1j3j34j48J97K71j21J06%j35pl1R6j1p0R7r5l21N9K68
$$ y = [-42, 196, 333, -359, -750, -446, -212, -42, 148, 22, -177, -326, -23, 490, 304, 11, 183, 125, -78, -183, -237, 119, 315, 76, -299, -463, -191, 264, 220, 34, 152, -108, -215, 78, 154, 150, 151, 74, 109, -190, -455, 7, 276, 154, -23, -451, -371, 40, 97, 116, 214, 166, 91, -115, 6, 288, 173, 158, 192, -200, -482, -367, -44, 183, -68, -356, -302, -219, 67, 174, 136, 339, 496, 112, -28, 101, 196, 309, 171, -117, -390, -567, -293, 17, 9, -100, -156, -255, -17, 150, 77, 286, 518, 287, -2, -136, 85, 209, 173, 54, -67, -399, -282, -84, -115, -31, -27, -262, -211, -128, -81, 80, 264, 450, 235, -144, -11, 297, 250, 286, 46, -190, -213, -250, -269, -143, -197, -112, -83, -264, -160, 33, 192, 486, 347, 94, -1, -11, 230, 194, -127, -13, -37, -256, -265, -162, -83, 31, -21, -130, -195, -155, 74, 164, 96, 144, 37, -193, 58, 291, 149, 32, 114, 62, -114, -329, -51, -1, 20, 7, -127, -275, -78, 193, 72, 178, 178, 43, 36, 5, 101, 90, 20, 117, 22, -299, -240, 28]
501B8O5jj16j46J40L2K8Q5o3N6r2j48P5J69l6J9m4m9o1l4J87O6j63j4J9j18J23
528Gj1o6J67m3j46q6J26J27L3m8J8j24j10J63J08o6k4j3o9P1m3%N7O4k4k63M6
555a49J41J1O5ro7j05J58N4k3O6o6K9o8l8q9lJ52M4k16o2Q3N2J9J8k5KN8m4J6
584DN0J47j27o2N1q3j2K4P4o4m5j13O7N0k7k4R2K7k2j3k8R5M2M0p0l1m9M3mk4
614HNn1j41R0kJ5K3M2J05j55M5M5P5pM7j37%K7Pm2N4j06L4On7l3qJ32N1n3p9K0
646d0N9L5L3j9N3l6p5o2O1Q2j1q9Km7m5J11P%k2j01L8J22QK6j6q2N0o7KMP7ol0
679B2j41J0J03l1P5j7q0K0R4r4R5J1k5Pm5k4LK7Q4M1j93J1N7l7N9J5p0nK6q4M2
710d4PO9J4m8j6jj0J15K7p4o4L9p8J09o7J3P0m6j9%r9J02L5k7J4p1K6M4K4qk4
$$ y = [28, 93, 92, -24, -170, -30, 2, 30, 115, 52, 108, 16, -132, -57, 112, 76, 95, 51, 2, -59, -93, 94, 160, -3, -17, 2, -116, 7, -4, -70, 97, 54, -92, -178, -52, 75, 108, 60, 78, -46, -156, 7, 115, 49, 25, 12, -57, 14, -29, -29, 28, 92, 68, -195, -149, -8, 3, 68, 59, -8, -113, 45, 99, 76, 142, 76, 105, 37, -1, -90, -93, 59, 103, -113, -175, -92, -40, -21, -3, -28, -26, 32, -12, 4, 54, 201, 74, 12, 63, -20, -32, -8, 66, 2, -43, -156, -89, -39, -66, -90, 2, 29, 7, -6, -34, 61, 103, 143, 73, 42, -7, 36, 32, 8, 13, -38, -179, -89, -91, -76, -53, -11, 94, -61, -16, 29, 104, 97, 144, 7, 7, 34, 41, -1, 53, -53, -19, -13, -70, -103, -111, 21, 72, 19, -60, -40, 19, 54, 87, 68, 121, 85, 10, -52, 9, 91, 80, -9, -7, -54, -99, 12, 19, 19, -3, -104, -66, 56, 64, 90, 74, -8, 42, -25, -23, -19, 58, 52, 22, -119, -109, -6, -37, 38, 21, -59, -39, 55, -39, 56, 67, 42, 49, 4, -20, -17, 10, 94, 135, -58, -47, 10, -27, 32, 47, -23, -28, -2, -86, -44, -37, 32, 46, -2, -18, -19, -29, 86, 113, 39, -25, 14, -64, 45, -22, -9, 61, 15, -4, -4, -103, -1, 34, 7, 21, -50, -24, 20, 44, 36, 12]
741A2k9JPM6j6K2j0rm4l1K3Lk2K1o6P2k2M1j7N7l2K8k2L0l5RLL2j32O8K1nM9k4
775B9m4qk3m6J11kr8J15m3j4lJ4J06q5K3n4j8k9O4l0j0KJ8L5o4LR8Oqj9lk4OQ2
809H7nj07K3n7O4k1K5j5n3R8p4m4R3M1o2J4l2K8L4L4Om0m7oK5l2kP1l9l2k7NL9
842hK0L3l5lMo0P6q1J03L9p2rOj5L3J5j9j05N0k1j3N8K1j6lJ4jl0L4JN7r8NKL8
877B0k0J8pRPl9n6Q8K9k2l3N8q2J1N8j8L3j9l6l2J4M6Jj6j7ok0k1P3j4mj2j9L2
911Dj9J1N7m8Rn8kK8lL5L4r0N5j7l1NO9q2Q8m4m9L2L7qL4Pq7L3M2J7k1qJ2k5q6
946f9L6P4m2l0L9L4p1m5Q6l8J1P2m2r5O9Q4mr9M8k1M2p4J9N2p8P1l6j0n0L5K0
977a2M4J1m5n1L0Q0l4M9j4p8M0oK0k6KRm9M0n2N8j5rj1L0l8J6K3O8p3n7N2L6j9
$$ y = [12, -17, -16, -9, 37, 21, 43, 33, 24, -20, -51, -28, -25, -47, -26, -92, -20, -42, -1, -18, 39, 7, 35, 13, 43, 8, 17, 20, 52, -80, -12, 9, 4, 53, 29, -15, -23, -46, -92, 19, 17, -81, 34, -9, -23, -26, -12, 94, 9, 32, -22, -40, -69, -5, -35, -45, -43, -25, 10, -54, -51, 47, 53, 45, 26, 23, -1, 5, 87, 82, -25, -2, -59, 5, -16, 9, -6, -59, 39, -35, -79, 14, 55, -7, 7, -25, 3, 37, 71, 77, 37, -10, -16, 9, -23, -25, 46, 7, -25, -52, -47, -8, 12, 45, 10, 7, 11, -49, 27, -54, 49, 88, 16, 7, 13, -2, 31, 46, 27, -78, -28, -49, -62, -4, 17, 1, -2, 12, 11, -19, 15, 16, 73, -25, -20, -18, 20, 0, 18, 11, 20, 27, -12, -68, 20, 49, 27, -6, 52, -30, -19, 39, 21, 54, 35, -1, -33, -19, 27, 28, 12, -5, -11, -31, -52, 21, 7, 3, -9, -28, 4, -15, -4, 53, 5, 14, -44, -46, -18, -21, 14, 48, -42, 13, -4, -35, -30, 39, -43, 45, 1, -48, -16, 21, 13, 47, 54, -33, 0, 42, 59, 38, 30, 42, 17, -69, -33, 41, -1, -31, 8, 42, -29, -74, 12, -26, -15, 57, 15, -80, -11, 73, 69, -30, 18, -3, 39, -35, -16, 36, -42, 29, -7, -17, -67, -32, -12, 32, 43, -2, -53, -23, 57, 23, 72, 58, -20, 20, 14, 34, 8, 10, 19, -30, 10, -42, 16, 1, -8, -19, 11, -27, -11, 12, 80, 7, -50, 2, 38, 19]
1010A9K8m4nL6r4Q8n2O5p0M6o4M1JK7j9L4L0m0p1M9M5m7K0M1r5L7o0K8K9K0l8
1041a5l3L6jM1k8L2mm0J0k1M9Mk0j7NMk1J4L5j9j2j1n3O6M2m8j5J0%J7m9O9j8
1074IqK4l8j2L2K8j7o5N3K2m8m0Q7l2Pl9P0q9M3%N5m8L3l8Rj2L1PL6oK9j06P3
1107E0m7l5O6o8M1L4r1O6o3J20p3K8Rq5L0O7l8j8j1J8j3jn0M8J6M0o2MM8j0K4
1138D4k6rq5J04K1op8P0n2L7Nk6%k3pj1J5K7l9N6j2Qo5O9K5k0ol1M3J9q8M0J4
1171A3p1P5j1j3l3L0K5kJ7k1l0L2j0M0n3L4oM1l3rP7j13O3m5Ok1NOj0j3L4mJ1
1204A1rPK4j8k7j8M3o8L7M7r3K6L7kj8k8M6j9QLK0m5O9k5M7m1K1j2O1j54R7n2
1236b5j2K9J2k4P6q6L1%M2m9J6K9o7j4M5Ll5L2k0N7kj2l2m1J8RJ5nM6l8k3M5J5
$$ y = [19, 47, 3, -2, 34, -60, 28, -24, 41, -29, 17, -47, -6, -5, 22, 3, 37, 67, 27, -44, 5, 50, 3, 23, 64, -31, 6, -54, -26, 3, 23, -15, -48, -12, -13, 28, 0, 32, 28, -12, -2, -23, 26, 30, 10, -7, -2, 2, -19, -5, 30, 11, -1, -12, -65, 1, 43, -5, -20, -10, -10, 7, -42, 27, 9, 1, 25, -13, -25, 7, 35, 18, -47, 6, 28, -20, -60, 27, -5, 2, -37, 33, -56, -13, -13, 42, -6, 27, -11, -2, -14, 17, 24, 60, 54, 83, -23, 50, 3, -32, 34, -34, 7, 41, -50, 16, -47, 73, 0, 28, 37, -48, -18, 49, 11, -7, -18, 0, -13, -14, -64, -16, 0, 40, -22, -18, 30, 20, 44, 18, 9, -76, 28, 49, 43, -35, 35, -17, 20, 25, -1, -1, -24, -31, -42, -27, 0, -39, 17, 5, 13, -52, 17, 42, 22, 16, -15, 28, 47, -41, -1, 13, -58, 17, 6, -7, -40, -10, 15, 13, 30, 9, -21, 11, 1, 41, -12, 22, 16, 57, 24, 15, 92, -21, 42, -3, 3, -18, -13, -7, -17, -30, 4, 0, 11, 2, 9, 33, 15, -12, -30, 13, -55, -18, 29, -64, -38, -1, -3, -21, -49, -3, -22, -14, -11, 9, -36, 33, 8, 55, 14, 35, 23, 84, -70, 27, -25, -37, -8, 4, -20, 56, -30, 1, 1, 43, -6, 10, 39, -28, -42, 3, 6, -29, 3, -17, 40, 38, 26, -6, -47, -29, -20, -5, -10, 36, -2, -25, 20, 35]
1269C5n0nP1j3Mo5K7M4K4n4m5RM0q1N5n3L1J9OJ3m1N9p9R1m6rkK8QL0j4L7k1p6
1303b3P8o7P0n0J9n9oN0J6k0N8n6m9N9j6J5n1Q2m9L0k9P7j04M6m0k7L0J0m7M3
1333a0K2%Kl0rM1j3k5l4N5j0JJ0M1n0p5J07j5j9R3j04J4M3k9l2j2L7J1%m2K0K9
1365A7LqK5q1O6k6J8qn3Q5kj1l3O0n0mk6L3k1L8n2N1L7n2L1k2Jnkl0P8j27O3n
1399a2J6qL3Mk7J1%O9j30M0pK2l3O1j09N3RL5m2k1P8m3J2Ll7M2n0J2j2jP6k9n0
1432c5L8LJ4%J5k3j5M8q6M1K9j6n9L5j6k6K4l2N5Nqo8L5L5k7Qk8j4L6N0kQo1J6
1466b1M1k2l2P2m3k6P5n5J9k6K6K8l3k5M1Kk2L4j2m2M7Jm1L2m4M6k7k6K2Pl3O1
1498B4l7N1n5J6J6k8QJ9o6N9mpk2L0K0j9j9j8K1J3K1j8M4n0rM3m9L8nj0Pm0M3
$$ y = [35, -15, -20, 51, 38, 42, -23, 4, 48, 72, 18, -27, -18, 22, -59, -4, -57, -26, -7, -1, 12, -29, 30, -49, 42, -4, -13, -15, 13, 21, 51, 37, 74, 53, -23, 55, -12, 58, 8, 27, -32, -38, 12, 28, 8, 66, 10, -39, 20, 4, 19, -32, 50, 1, 31, 2, 79, -25, 21, -19, -46, -16, -6, -53, -10, 12, 12, 14, -16, -25, 16, 3, -22, -56, -1, -11, -10, 0, 41, -9, -84, 23, 8, -11, 82, -22, -8, 35, 6, -26, -38, -1, 10, 10, -32, -12, 17, 20, 12, 37, -44, 22, -4, 14, 6, -47, 38, 36, 25, -8, 52, 2, -2, -28, 5, -16, 22, -30, 21, 58, 6, 37, 15, 16, 11, 9, -21, 57, -70, -7, -12, 4, -4, 29, 33, 6, 17, 17, 86, -44, -4, -11, 11, -22, 39, -70, -17, -8, 27, -15, -36, 42, -1, 11, 14, -23, 19, -31, -19, -31, -32, 44, 15, -35, 3, 6, 20, 20, 35, 12, -3, 45, -41, 0, 29, 13, -46, -11, -27, -53, -29, -61, -6, -1, -9, -77, -42, -7, -34, -26, -54, -68, -32, 18, 16, 24, -37, -21, 20, -2, -34, 38, -5, -31, 44, -11, 8, -18, 8, 36, 3, -22, 19, 21, -1, 33, 21, -21, 26, 27, -14, 18, -26, 20, -7, -33, -11, -4, -37, 24, -13, 38, -17, -1, 15, -13, -5, 14, -52, 7, 3, -4, -26, 4, 24, 5, -14, -32, -11, 2, 23, 5, 49, -1, -10, 33, -16, 22, 17, 7, 14, -26, 17]
1531A7J0Kj9o3N0k6L0k4M6Rj1l8J8m7N6m3N4l0O2q2K1j0K1j8N0m2MQ6o3Jm6L0
1563Ej6jmj1J2Q1p8K8Rm7N5j8n4l0J6kL3p5L0P3n2N5j8Lj5O5l7K6Kq5J1LKL4n2
1598e2J03kp0K8nK8k2k9L6k9J3m2K1J0oO0o0l3N6n9M4J4L1p9P9k0OPl9M5q2N3
1630Ek8oL9J5k0Mm2M8M1r9K8L2j6rM1m6L3Nn4L4L6k8qk1P9j01Q4m7k6j1N2l9M
1663b1k7L2M2k9J3j2mj4N4k7Ljl4%N0m6J6Q1j16R5m4qm4KM1l0j9MK1J2M4r7R8
1696C5o4k6J06m4k3K7J2j4l9Q0l4j4j3K8m3K3jj7%j0nON9O5r9O8l6m9J0J2L8m8
1728a0N4k2K0p0lL1JqO6j3n8P9q8N6Mk6m6PQn0L6Pj3K2j8J9KL8p0Q3p8R1o1N2
1762D2q%l9K4m7oL2o0K4M3NM3p0Rk2mR2p5O2l5m6O5l1j5K2L7k1nLl3K4k7J9j9
$$ y = [17, 27, 29, 10, -53, -3, -29, 1, -23, 23, 32, 21, -17, 1, -46, 10, -33, 21, -9, 53, -29, -8, -18, 3, -15, 35, -7, -3, 83, 20, 21, -25, 5, -11, -12, -16, -27, -15, 66, -12, 16, 25, -22, 33, 15, -39, -69, -53, -55, -22, -97, -67, 6, -46, 9, -9, -6, -21, 44, 7, 33, 35, -50, -39, -36, -34, 0, -52, 51, 49, -21, 7, 2, 30, 8, -21, 15, -14, -1, -43, -22, -12, -18, 42, -18, -51, 5, -54, -10, 4, 35, -44, 35, 15, 21, 28, -11, 34, -48, 5, -23, -29, 10, 25, 5, 9, -33, 15, 56, -43, -15, 17, 1, -8, 33, -13, 20, 25, -29, 5, 41, 13, 5, -16, 63, -38, 46, -1, -27, -38, 14, -25, -21, -48, -16, 26, -3, 10, -2, -6, -20, 34, 7, 10, 9, -25, -25, 25, -21, -5, 76, -40, 55, 11, 3, -41, -39, 2, -28, -47, -43, -22, -10, 34, -63, 35, -29, -55, 51, 7, -16, 11, 23, 9, -30, 50, 16, 2, -11, 17, -26, -3, -4, -21, -21, -31, -36, -30, 29, 94, -5, 63, 27, -22, -12, 0, 38, -10, 44, 22, 42, -28, -31, 0, 1, -7, 59, 46, -12, 67, -21, 35, 39, 13, -33, -26, -18, -68, -32, -25, -38, -16, -34, -15, -13, 25, -45, 38, -40, 51, -10, 42, 34, 34, -5, 19, -28, -34, -2, -62, -38, 5, 10, 53, -17, -8, -30, -34, 58, -17, 45, 10, -36, 29, -2, -17, 5, 42, 21, 16, 19, -14, 10, -17, 2, -17]
1796a7M6p0M6j4l4P6p0L1Mj0O2k9lj4j5Qqj0j0M0M6k3r6M0Jj1K1K7mRn6J0J8L9
1830C0J1o2mm0P4n0K6K4o5L9j6K3K2kk7O0r9P0m3K4N1p9Q8q3K5MnLK2J3n5NL8
1863B2J9j8j3qJ0l0M9l7kqN0m3o0N3K3l7L2oj5N0m7k5n0O0j0L6J2j3k2QO5lk1
1896B1j0K2m5J8rL8m6L3p9J03o1J0K8k5Ll5M3J3k8l7N5J5l4%Jj5Jj2P8PLp4j3
1929c1Q0r1M9J3j7J4L8Lq4P6m1k0j3O4j8Oj3q9R0j0j0J7K1o4J3j1l1O6l2K7%j3
1961a1N9m3n0J1j2N8j8l1M8l1K7J1p9L8k9O0k3PL0ll2L5j1k2L8j6p0P6l6K0pO5
1993E9No6j6N6p0J8mJ8J1m8J4l0M5j4P4j3k3j8j8L4L5k5n1j1N8J5m0RN2K0n0l5
2025ij1L5l6J9rK5m0O7p4J4K3k8K3j6O1j3n7O3r8N8m4L8Kk7QM5J7p5P1M8l6m0
$$ y = [-17, 29, -41, 5, -9, -43, 33, -37, -6, -2, -12, 50, 21, 18, 4, -11, -3, -11, -21, -31, 9, 55, 32, -64, -24, -23, -34, -13, 14, 10, 19, -37, -27, -9, 30, 41, -21, -25, -65, 9, -41, -15, 9, -56, -17, -33, -10, 12, 10, -17, 43, -56, 14, -29, -5, 46, -33, 55, -28, -3, 1, -4, -1, 21, 34, -21, -16, 22, 41, 23, 10, 2, 12, -18, 31, -6, -8, -16, 34, -9, -69, -16, 7, -30, 2, -4, -19, 31, -16, -41, -91, -31, -41, -5, 7, -6, -28, -20, 45, 42, 21, 11, 33, -12, 6, -3, 35, -11, 22, -57, 46, -15, -5, 23, -2, 1, -34, 9, 22, -6, -43, 12, 27, -7, -7, -6, -21, -20, -32, 46, 53, 56, -18, -31, 49, -42, 7, 20, 3, 17, 55, 58, -26, 50, 9, -11, -24, 40, 22, 28, 15, -74, 16, 6, -4, 13, 34, -30, -17, -28, -59, 7, -25, 2, 2, -11, 48, 5, -45, -34, -46, 12, -6, -37, 11, -20, 7, 18, -61, -23, -52, 8, -15, -8, 22, 19, -13, 22, 11, -11, 27, 11, -59, 17, -19, 1, -6, 59, 64, -2, -18, 38, -32, -14, -18, 0, 11, -37, -23, -53, -8, -22, 52, 39, 16, -2, -20, 14, 49, 24, -27, -38, 20, 35, -5, 4, 56, 76, 26, -9, -20, 15, -21, -2, -11, 14, -26, 41, -33, -19, 4, -24, -1, -17, 44, 31, -26, 37, -61, -3, -47, -9, -7, -34, -26, 19, 36, -39, 32, 80, 44, 4]
2057DJ3rLOJ6p6J6L8l5j8P5k8k3jmJL2j7N5jm6K6Mj7j8J6N1r2M7k5J7L6n0j6R
2092a1m4Q2j4j6P0m0J5m6K3l2O0l9k9nK6J0K1K1k1j9PM9p5K7NRn7N2l5kl2K1L
2125a6J1Jk5j5Q4o6j1k0O1klK4k6M3j2q0M7J1Ql6KM4K5k6m8L7k2j4RM8k6j1m2
2158d6J09m3m9M1j3L9J4r9P4j8%Rk8L8k5j9j0M7j7J1l4K1K7n4j3O4J6n8M5KJm9
2190a7M4k8j2K4j8K7nKk7qOJ7J8nJ2p8K5PJ5mk8J5K2K3pl6J1jM1J0k7l8N0l4L5
2225C1j1m8J5j5K7l3Q6k0Ll7oM3j7k3N0nl6k9L4k6K3j5J3Rk0%J1kK1Nm3K2l7M6
2259A6qPjmL5j5Qn9J0mRL5K0J8r2K4l1KM5l2N1n5R4rn7J3n0J7jLnM9o2M2k4j0
2295b1K2J1m7J16q7pM2n0K7k2Lo7R1j1l2N5nm5O9k7Rn7N8Nq8N7K3Qj0n8O6k9Q
$$ y = [4, 17, 8, 11, 17, 33, -43, -27, 11, -24, -42, 33, 5, -18, -19, -23, -22, 10, -7, 48, 47, 1, 27, 31, 14, -4, 12, 63, -29, 18, -7, 10, 46, -4, -20, -11, -55, 27, 13, -3, 67, 27, 42, -4, 19, -13, 47, 8, -21, -26, 0, 10, 31, 52, 31, 12, 19, 68, -7, 20, 25, 34, -23, 29, -6, -8, -40, -19, -16, -5, -4, -29, -44, 40, -26, -37, -57, 4, 2, -1, 23, -3, 40, 28, -52, -5, 6, 14, -22, -20, 24, 49, 23, -25, 12, -10, -24, -15, 33, 7, -4, -46, 63, 20, -29, 12, -1, 38, 52, -47, 27, 9, 9, 18, -10, 28, 3, -16, -26, 21, 4, 15, -19, 2, 29, -25, -38, 26, 42, -16, 29, 31, 32, -17, 27, -1, -13, 11, -7, 20, 15, 17, -10, -18, -12, 5, 23, 18, 30, -48, -23, -16, -1, -5, -33, -18, 4, 27, 20, -16, -5, -6, 35, 45, 18, -20, 30, -4, 31, 20, -28, -13, -28, -1, -34, 52, 32, 35, -2, -8, 35, 18, -5, 45, 40, 4, -25, 9, -17, 6, -9, 4, 13, -7, -7, 4, 2, 23, 28, -15, 7, -30, 16, 8, 15, 14, 10, 45, 30, 38, -21, -11, -15, -6, 29, 49, 67, -25, -1, -32, -30, 15, -17, 34, -21, 73, 64, 7, 20, -30, -13, -14, -11, -16, 33, -29, 13, -11, -21, 1, 12, -35, 81, -6, -13, 29, -21, 6, -16, -13, -80, 11, 0, -32, 23, 18, -27, 42, 15, 24, -33, 25, 30, -58, -1, 22, 30, 20, -38, 28, -1, 7]
2328Go2L9j5QK2j7K3l5J9RJ6m4NK0K9n7j0L7K9k9Pj2PK6p6L4J6l5R3p1K9M7o1
2361bOk9Qj9j1nM6K2k1lM8o1L9l6N5n4L2k2k4J4KRMj1K3KMm3rL1LL3o4m3Q4j4
2397fj3L6nJ8p9M3J9k8lL9l6j6L8k2N5r5K9L5n0j7R1m3n4MM3J8m7K9J0l1L1J3
2429Fl1J0J2mM6l9M0k2Mm2K1j3L9m1L6J2p4N7K5p4K3MNQn7J05j1n0K7n8N6l4l2
2462d6P1J0l9K1L4q8N0Np0M4k8K5L9kjk7k4j8K9k4Q6m1j1lL2PNm2L2j4q9J17k1
2495A9j7j9m8N0L2K1j9Pk5Kl8N3l3M2n8pK5M0l8j3oj2J5L8l2j0O6K6j9k3L8j14
2527e7J6N7l8L1k9L1N4r0R0n9mrjM4m5mk4M7m7K1PQOK3q5O2J0j7J4n9M0kO0o8
2561a7O9m1l1M4M9p0N2m3j5N6q0M2m1L7L4j01P0j5p0M6L0m7mL8oL9m0K3L3n2K5
$$ y = [7, -55, -16, -31, -23, -1, -18, 5, -30, -11, -2, 14, -30, -25, -5, 24, -33, -43, -6, 23, -6, 1, -11, -4, 22, -54, -20, -4, -39, 54, -17, 12, 59, -2, 4, -25, -17, -36, -47, -52, -6, 16, -5, -8, 40, -21, 18, -18, 37, -17, 15, -7, -31, -17, -15, -6, -2, -13, 10, 12, 16, -27, -36, -5, -2, 31, -33, -76, 8, -6, -19, 17, 12, 30, -49, -6, 13, -15, -18, 21, -15, -31, 7, -15, 40, -55, -26, 9, -41, -58, 33, -10, -64, -60, -17, 1, -46, -17, -7, -38, -7, 6, -25, -15, -3, -7, 39, 0, 40, 18, 22, -20, 1, -12, 27, -14, 22, 34, -40, 17, 42, -32, -9, -5, 0, 8, -49, 56, 45, -5, 22, -36, 20, -14, -46, 25, 35, -4, 17, 51, -37, 13, 18, -52, -8, -36, -11, 28, 26, 25, -2, -26, -44, -15, -39, 47, 6, -5, -8, 24, 31, 36, -6, 26, 12, -77, 40, 19, 2, -17, -65, -15, 17, 38, 19, 26, 1, 3, -35, 18, -15, 27, -31, -38, -13, 27, -11, -24, -30, -42, -27, 11, -21, -31, 35, 61, 42, 19, 57, -57, -41, 16, -22, 9, -20, 11, 65, -25, 65, 6, 2, -7, -8, 36, -9, -13, -37, 10, -37, -16, -9, -1, 5, 28, -57, 5, 15, -2, 12, -47, -7, -9, 51, -17, 52, 11, -20, 24, 73, 3, 55, 12, -3, 53, -27, 15, -26, 11, 45, -56, 14, -1, -71, -25, 5, -42, -46, -8, -14, 25, -15, 8, 41, -11, 14]
2592A4j7J7l2K2k3MK6J1n3M6mj9N0n1J4K5L1m2%N1j06J0M8l2J7j1j5n5P8J9j8
2623Ek2OM5m0L6l7rK4k9K3L2r6Q4l0k5N1j8K7q6M9l7O6K6p9O4o3N0mnM0l6j2m
2656dNOLn8O9l4rP7k8r7mJ07j1J9o7lQ9p9%lRLl5NOK7M9n6j5P2J6j14J7O9P%k6
2693A2%MJ2o8J2N9l5M1o3N1Mm8M1o2nP1m3Kol0O2j8J7kj5pM9n2k5N9p4J5L4K5
2727A7Mj8k1j8M1k9rJ09o5J6m8%j9Q4j3n5O6k3Lm0M7k9lJ9Prlj1o1M1J0Pl5j0
2761d8P1j2j7k2L9Mnl4M1l8k7J8qM0k2l0N3J0m5R1q8O3k1%J0l3j1m4J48q4jk7
2793b9N8j2KOn7K9j9JPnJ9jK9n7K4K0J9r3J28n1l5J3j9L8kK6K8p0rK7l1j5L8Q
2827A5jJ8m2L7m7j2O5lm2nl0K9RJ7K3l0j1%m2L6L6o3M4l2O3n6m6R5l8K7J9k7J7
$$ y = [14, -3, 14, -18, 4, -19, -15, 11, 22, -31, 15, 11, -8, 42, -9, 5, 30, 61, 19, 19, 70, -36, -26, 22, -10, 7, -4, -19, -74, 4, 23, 5, -17, -11, 34, -6, 30, -7, -16, 8, -21, 2, 34, -62, 22, -8, -33, 18, 0, 27, -59, -10, -47, 19, 45, -34, 30, -33, 17, 13, 8, 48, 12, 0, -4, 1, 7, 10, -48, 21, -13, -22, 55, 27, -70, -74, 33, 22, 41, -26, -29, 60, -19, -19, -22, -13, -10, -45, -40, -34, -7, 42, -14, -29, 43, 59, -55, -38, 31, 38, 38, 12, 12, 16, 28, -40, -28, 31, -4, 37, -26, 25, 29, -19, 22, -40, -45, 26, -17, -15, -21, -51, 11, -7, 10, 8, -7, -14, 35, -17, -42, 17, -57, -42, -8, 17, 21, 3, -18, -36, 5, -24, -33, 76, 11, 27, -21, -21, -40, 44, 31, -24, 42, 19, 22, -18, 29, 0, -3, 16, 23, 14, 11, 0, -61, -20, -10, -3, -38, -48, 23, 11, -6, -28, 11, 15, 10, -24, 17, -21, -48, -30, -38, 2, -20, -50, 3, 13, -32, 59, -29, 34, 13, 13, 23, -10, -21, -65, 83, -1, -2, -29, 29, 17, 19, 25, -32, -3, -22, -21, -14, -19, 0, -1, 28, -29, -5, 15, 34, -59, 69, 18, -17, -4, -23, 15, 13, 39, 67, -3, -12, 15, -16, -31, 7, 15, 14, 32, -10, 27, -20, -32, 33, 30, -12, -17, -47, -18, -9, 8, 31, 1, -10, -10, -52, -16, 20, -43, 1, -31, 32, -24, -70, 25, -13, 14, 33, 6, 23]
2860B3j4l2M8m4jP3l9l0L3k0J0j2J3l4qO2k9pMK7n2j3P0o0nL7k2N2j8q4K8M1k1
2893b4K9j9N2j7Ml5qO8l1n2M4RJ2j6l3M7o5N9L4n0K7m2MM3l4j15J39ll7PJ8oJ0
2926A9k0MJ7On9KK1J9k1N6j2qJ6Ml3j0J6j0n1M8l5L8L0m6L5l9K0j2L0M4l5l6K5
2959B3l1lm3N0j6N0n9J8J1J4o1N8kj8J5j8k1M8k8K3j5L2J1%m4K8K7r4L4k4M2M
2991A1QL4l4L8j8j8j3J2o0j5N6j0k9J3K6Jonoq4O5O9L6q2OK9mqk3K6k3m4M6K1
3025A5o1O3K0l0oL1n4L1n3Q2o3l3L4QK5j7l2P3o2L1J6m1M3k2Mk1%mK5%k0K7m9
3058d0M4Nkk8K3J4k7K2J8n4J1M6Qjk9n5R3j2j4o8O2Po3K4N6j2k0j2Rl2L6J3m3
3091b1K9j4M3m5M1k3l3M6j2J0l1L1j9j3j8L6J5oP3r6N3l1N5n9p%K1j8jj5K4%o6
$$ y = [23, 9, -23, 25, -19, -20, 53, 14, -16, 17, -3, 7, -5, 8, -26, -34, 28, -1, -8, -4, 23, -29, -42, 28, -32, -37, 0, -22, 30, 12, -72, -44, -3, -24, 5, -14, 38, 21, 25, -10, -18, 50, 19, -33, 11, 20, 32, 16, -17, 30, -35, 24, 58, 8, 35, -7, -3, 40, 6, -109, 30, 27, -10, -3, 15, 9, 19, -1, 3, 20, 26, -33, -31, -10, 9, -12, 44, 32, 24, 40, 44, 11, 1, 17, 7, -44, 4, -31, 7, 37, -9, 26, -13, 7, -5, 25, 69, 34, -2, 23, -8, -11, -54, -4, -20, 30, -29, -11, 0, 14, -47, 11, 9, -9, 6, -12, -33, 15, -13, 10, -5, 27, 38, 38, -6, 22, 49, -45, -11, -35, 7, 11, 19, 53, 19, 57, 39, 21, 8, 20, -40, -55, 1, -9, -38, -25, 1, 2, -4, -9, -15, -99, -34, 35, 71, -11, -5, 24, 20, 12, -11, 15, -8, -52, -6, 15, -46, 17, 37, 7, 1, 32, -22, 9, -44, 38, -25, -58, -24, -16, 9, -8, -40, 33, -29, 2, 18, -23, 20, -2, 2, -19, -19, -23, 2, 2, -18, 9, -40, 4, 9, 7, -21, 2, 16, -11, 11, 29, -25, -14, 32, 40, 39, 10, -45, 48, 36, 22, -46, 16, 23, -40, -16, 40, 28, 8, -4, 5, -27, 9, 22, -21, 8, -6, 37, -8, 33, 10, -23, 23, 11, 21, -10, 21, 2, -11, -29, 7, 22, 16, 89, -7, 46, 15, 70, 11, 4, 4, 25, 7, 6, -9, 15, 15, -51]
3124e1Q5K7o9k1Q5q7loJ0M5l0M9p0N5j8J9J8j6L7k1o2N5k2j0l0N0Pl4K6N3n6K4
3156C9m9K2k9PL1l9M9r6nQ3n0rO6j8rM6l1K1n7K9Pn5L6k2PL4L%J3kl0K1J1m6N0
3191B8n1pK4K8m2L1RK7n4Q0r8O3K9j5l1j4l0M9Ln3L1J6n5O6Qq6O6m1nJ0k6K7L0
3224A7Lol3J8L4om4mj0M4M6n4jK8o6O7mn8L4rj6J9L3J4l7J0k9M0l6mRJ4m4rL6
3259dL7m8m2J6J4P0l5Qk4j4k8P0j0k4j0PJ8J1l2M4m9L9J5m5j9J7J1lN0J4l2M9
3291G1p5OrK1J0k6l0M2k2J0k3k9N9k6n1K9OP0m6K3K1q1K5J1k5L2K4L4o5N7l1K7
3323C9k9kJ6j6o9M7LJ4L8k1l8n9Q8m2QP0p1N0r1J2O5q8Q1J5l5N9Lo0k9P8pmo5
3356d0R3j3l4Mj8J4K2j2L6m1mOm0O8k4o6R1%n3L8m7N9j5Jk0N6r9O7rp8R1j3m4
$$ y = [-51, 34, 61, -8, -29, 56, -31, -34, -40, -30, 15, -15, 34, -36, 19, 1, 20, 38, 22, 59, 38, -24, 31, 9, -1, -31, 19, 26, -8, 18, 71, 15, 39, -10, 12, -17, -10, 21, -18, 31, -65, -70, 13, -37, -46, 20, 2, -7, 39, 8, 29, -28, 1, 8, -47, -11, -33, -26, 8, 11, 11, 24, 22, -8, 13, 24, -22, 28, -23, -30, -6, 22, -20, 11, 20, 47, -7, 73, -25, 38, 67, 52, 21, 7, -23, 26, 29, -24, 7, 23, -32, 34, 42, -44, 22, -19, -24, -14, -40, -13, 17, 20, 14, -19, -1, 33, 27, -17, -21, -31, 13, 59, 5, 4, 32, -34, 33, 29, -29, 5, -4, -20, -1, 32, 46, 9, 19, -10, 30, -6, -10, -1, 13, -31, -40, -4, 33, -15, -57, -41, -27, 43, 8, 16, -8, -22, -50, 20, 10, -14, -24, -17, 1, 12, -20, 24, -25, 14, 29, -16, -35, -18, -7, -10, 40, 54, 22, 71, -4, 2, -7, 14, 24, -2, -32, 10, -12, -2, -25, -54, 5, -21, -72, -43, -37, 33, -13, 10, 31, -50, -25, -14, -39, -7, 17, 51, -14, 43, 12, 39, 10, 8, 24, 8, -61, -14, -11, 3, 41, 20, -18, -77, 11, -31, -23, 47, -24, 26, -65, -53, 12, -76, 5, 20, -15, 44, 47, -13, -42, 36, 29, 25, -40, 53, 40, 6, 10, -8, 6, 28, 16, 52, 11, 7, 13, -27, 41, 17, -49, 42, 42, -11, 27, -20, 39, 24, 25, 5, 61, -38, 29, 20, -58, 33, 20, -24]
3389b4MJ1Kk7MPO3o7k0M5M1kLm8M2m8Ol9M9M4k7p2R6m6k5j0K0J8nJ0J5j6k8nL8
3424ImJ3n8J7J8q5O2L3rlK6n5L3J2o0MK1O4Pn5J9M3r8N0Lk6k8P5k7Qr3R2j0k3
3458b5j5N4oj9j7nO0k3j6J7L6l2j3j1Ll9L9j8J6NL4p1K3M3oOj8L0k1QL5j3m2J5
3492A4L8n3M0m5Oj8L1k0J1n0O9m9%M9n0pN4l8K5J3m0j6N2Qp0M9KK0rk3M1p3K2
3525a7L5k5j3J3K6o1Q2m6J5QL0m5J4J8j4o1j5R5J1p4K4k1L1p7P7n8n0J23K3l0
3555A8J2Ql1k0L0j1l5L5k2M6k9K6k8KM6k9o2M4K8j4k2M0k9k3L3n0M0PL6k3k2m5
3587d4Q3j5l5KMJ0Nj0jj1M9n3m4N1m9Q9l2m6O7J7p3J4L1J0k4O4rn1o4R4n9J0J4
3620fn6P1j9krLM5l4k7J9J9k2L7p1O2J8pl4LK3l6K7k0J5K7K1q7NM7nn8L7K4k7
$$ y = [-24, -20, -9, -7, -34, -30, -23, 40, -27, -47, -2, 39, 37, 40, -8, 34, -14, -8, -47, 2, 46, 19, -53, 43, -3, -28, -38, -18, 0, -5, 5, 20, 4, -24, -29, 9, 5, 18, -40, -23, -5, -90, -28, 5, -4, -7, 19, -36, -3, 9, -51, -47, -26, 38, 45, -10, 9, 52, -46, 4, 7, -19, -47, 28, 1, 9, -84, 8, -2, -25, -40, 14, 8, -11, -28, -33, 27, 4, -12, 5, 41, 9, -4, -15, -12, -51, -12, -30, -14, -9, 25, -46, -23, 20, 14, 20, 2, 32, 11, 19, 54, 41, -1, 14, 52, -1, 39, -6, 0, -18, 13, -7, 4, -46, 23, -26, -26, 23, -27, -34, 20, -18, 7, 20, -20, -36, 16, 24, -46, 3, 5, 25, 16, -7, 34, -39, -17, 18, -7, -20, -7, 19, -42, 40, -6, 9, 17, 47, 2, 16, 34, 20, -41, -56, 39, 50, -24, 0, -21, 10, -67, 10, -48, -98, 25, 48, 18, 30, 38, 7, -13, 17, 6, -29, 6, -16, 30, 1, 27, -1, 1, 47, 18, -44, 0, 28, 14, -8, 32, 3, -20, 13, -37, 3, 10, 46, 23, 1, -44, 39, 24, -11, -9, -5, 5, 10, 0, -1, -12, 37, -16, -60, -9, -58, 31, -1, -47, 20, 37, -36, -22, 9, 19, -5, 59, 50, -1, -65, 29, -30, -20, -6, -62, 9, -10, -12, -21, -18, 27, -7, -34, -15, 4, -18, 19, -52, 10, 28, 21, -13, -10, 13, -23, 4, -16, -1, 26, 47, -40, -35, 12, 7, -51, -14, 10, -17]
3654a7Q8r5J9J5j4%jQK3k2K3j0l3j5N8r1P6J4l7RrL1k0n3M2L8pj9K3k8o0J03m8
3687ij1N8p9O4l6m2M2J6j8M0K3q7N8M6jq6L1k2L3K8m7L3j9K7o0k0Q8k4l9k1N6
3718B2k6Nl8J6J0m2N2lj1L6%j5L5l2j8L5j0Mk3k2O2L4n7m8KK6j9J3l0oK9K7L5
3751D3k8J0M0n7m0M3k2N6m9j8k8J03q7K3J6j2J5k6k1K7M6l8k8N1krrJ5k2L8n4
3782b4M9k7om3R7n7M7q7Q1k3J8%o3M9l9L9l3K4N1l5n2PL8j0nJ8rLl4M2o4P8oK5
3816D9m2Lq3M2k6J13o6oM1kQl8O1q8O5j2M3o1L8j7n5O6m4Ll2L8j2KN7j8J1q0Q9
3849D7l9l2%L0k7kL9Lp1L7O2k2K2p5NL2j0J4l5Ol6L8M0Jk7olN4m9J0n0K9K6lQ
3884A6n4L4k4j5j4O1j1k9L0j1O2l7o8O5l5JK9L3k3n6O6m3P1n8L3p9Q1jL0k3n2
$$ y = [-17, 71, -24, -5, 10, -4, -4, -5, 3, 26, 4, 27, 17, -16, -31, 27, -64, 12, 26, -11, -2, -11, 20, 0, -53, -11, 27, 20, 1, 24, -4, -64, 39, -9, -20, 38, -41, 23, -13, -55, -13, 3, -15, 25, 48, -39, 19, 65, 64, -22, 9, -13, 20, 48, 1, 34, 15, 42, -18, -38, 50, 26, -13, -34, 22, -4, 1, -37, -21, -11, -53, -1, -4, -15, 21, 21, 6, 41, 9, -9, 26, 16, 20, -3, -25, 37, 71, 14, -34, -32, -6, -25, -12, -42, -48, -19, 8, 43, 15, 25, 65, 8, -32, 11, -11, 45, -4, -22, -50, 53, -34, -11, 5, -7, 8, -18, -39, -12, 34, -4, -32, 19, 17, 8, -1, 14, -8, 30, -24, 25, -2, -8, -51, 46, -11, 36, -51, 30, 7, 25, 25, -38, 11, -28, 11, -22, 2, 53, 18, -34, -27, 11, 1, -4, 14, 5, 8, -26, 16, -48, 30, 24, 49, 7, 10, -73, -31, -57, 56, -10, -16, 25, 23, 31, -7, 54, -34, 31, 19, 62, 1, 39, 22, -33, 33, -11, -8, -40, -2, -14, -12, 45, 27, 38, -42, 47, 8, -24, -24, 6, -21, -23, 16, 19, -52, -15, 47, 25, 47, -28, -23, 9, -1, 13, -22, -16, -52, -14, 26, 27, 0, -6, -9, 45, -4, 6, -44, -15, 11, 8, 16, -38, -4, -28, -43, -57, 4, -7, -36, -6, -17, 45, 8, -60, 5, -30, -29, 0, 33, 10, -46, 20, -23, 48, -10, 23, -56, 25, 24, 54, 31, -21]
3915b1K8j1j0J8J3MJ9k0j2j0Ok6PjK8N6j01N9o6J3nJ2rjK3j1JQ2p1%L3L4o2JP
3950Go9N5L2l4J7j7O0j3l5k6qL4JqNJ2Pn7K7QJ3jJ9n2k3K6l2L6j9N1l9j9N5m4
3984c1O8m7ql3K2R6r2K3L1k6RO7p1J1J4o9J8O3Kq9M1mJ5n5O5l9N0j8oj7K2lk5
4017a6k4O7nn7K5N4kPn9J7J1k8j0j6L4q4J27o4K8QK5m1j1J9k2lj3KM7k4j9L2K7
4050C2k5j4n9P9nl5k3N8M5o6%L7n2P6m8l7N7j5KK1mJ8n3M1J4l8MK8pj8k8j0Q1
4083E6o3m1N3k8Q2on4j0N2l5j6L3k1J1l3L6Ml8oN8m4k1j2K9%j5K1M5kOl9j0K3
4116A5l8P1n5K3J9n0L7l4J4P8j11N7j7l8j5N8j4n1L0ok6P0l5L8N4j19O7pQn2N9
4147C0k7L9l6j9O5o3k9P2qo7O7K0o2oK8nK0m0L9Qm5J5l8N9J3j8J6l4Km1M6J9n0
$$ y = [-21, 7, -4, -14, 4, 17, 21, 40, 20, 8, -2, 4, -22, -15, -16, 12, 68, -33, 26, -40, -27, -32, -20, -29, -30, -7, -18, -17, 65, -6, -6, 27, 61, -1, 0, 7, -62, -7, 25, -9, 8, -9, 51, 38, 3, -23, -31, 3, 4, -4, 1, 13, 20, -37, -10, -2, 11, 10, 29, -23, -46, -20, -52, -16, -35, 16, -23, -42, 13, -31, 37, -10, -18, -51, -29, 67, -25, -2, 29, 3, 12, 79, 8, 19, 33, -36, -18, 45, 47, -42, -1, -5, 10, -45, 20, -19, 31, 13, 7, -10, 12, 9, -16, -40, 27, 22, -35, -10, 44, 42, 49, -10, 7, 18, -10, -20, -36, -2, -86, 41, -23, 5, 13, 38, -3, -14, 5, -17, -20, -33, -31, 16, -8, -27, 5, 32, 7, -7, -66, 13, 8, -27, -50, 8, 53, -13, -13, 24, -28, 48, 0, -37, 20, 5, 7, 28, 24, 42, -11, 30, 44, 6, 10, 38, 31, 13, -15, -25, 56, -7, -48, 5, -23, 59, 53, -1, -11, 41, 6, -10, 23, 2, 13, -20, 16, 20, -18, -24, 34, -10, -31, -43, -14, -14, -29, -8, 37, 35, 41, 2, -8, 15, -23, 48, -7, 16, 35, -15, 22, -12, 2, 80, -31, 26, 9, -29, -44, 14, 0, -51, -21, -27, -53, 17, -18, 20, 74, -45, 22, 15, 23, -29, 30, 3, 42, 6, -13, 52, -11, -40, 32, 24, -43, 24, 44, -18, -24, 4, -1, 19, -21, 18, 26, -19, -4, -42, 17, 30, 12, 28, -6, -4, -45, 1, 20, -30]
4180c0O1j0Kl2n0J08k2Pl8PJojK4ppk9N6J2p2L6J2k2O4j14L3P0j2p5rJ2Q4k0l3
4214@k6J0N5o5k4P6o4Q5m4kJ3n8j0M5Pn3K4L4p4J2O1k7N5rm6K1j4M5Qpj4J9p0
4247c7K0K8L2ko8K3L2o1K3q0N0J6P1o9jk4M4%j3K4K5m6k4N8m0RqRk8J6j3N7m2
4280a9RK1Pk2ol0J07p4K5n0J0L3j2K0K3j6k3m7M1O1p8j7N4n5K0L5l7J7K3oM8o8
4312fL3k3j7L1l3j5K9K1j2J1n3NL9Pj9K2j6k8J6jM6kn3L9l9jqM9k9k0P4n6J6q
4346aj3J8j8k9J4rL9J7o0L0pO6j8o3J26o0k0oL4l0J6j0j9k1lK5K4j0m6N3k9MK1
4379A5l4K6m7L1J0j4J0k2rj8L3m9O6l9N9K7k4m3L7n1M5j6J0JJ8l3Q4n3J2jn1Q9
4411F9o6kK3j2L7m7OJ4K6p3M9l0k0K2j1K8l1M4J6k3jK7o9L8o9Q8l5m8R4j0o0K
$$ y = [-30, 31, 21, 23, -9, -59, 49, 27, 34, -4, 3, 4, -2, -3, 21, 14, 7, -22, 34, 46, -26, 10, 22, 0, 64, -50, -17, 53, 41, -34, -43, -31, 53, 33, 0, -26, -16, 39, -26, -50, 26, -38, 47, 3, 1, 14, -44, -54, -9, -2, -55, -31, 3, -71, -59, 2, -25, 30, 21, -25, -4, -18, 27, 35, 28, 14, 33, -37, -17, 11, 43, 41, -27, -4, 28, -33, -10, -90, -40, -24, 47, -22, -23, -47, -3, -3, -16, 8, 33, -13, -37, 21, -19, -10, -18, -9, -37, -21, -34, 23, -19, -10, 11, 18, -4, -10, -40, 67, -7, 18, -32, -22, 11, -1, 19, 42, 26, 3, -44, -3, 58, -20, -37, 17, -38, -18, 17, -20, -3, 20, 14, 62, -6, 27, 4, -13, 18, -15, -30, -1, 20, 8, 19, -34, -29, 10, 17, -2, 20, 4, -24, -8, -9, 37, 35, -18, 21, -18, -19, -27, 22, -7, -27, 47, -9, 7, -1, -14, 4, -14, -43, -29, -38, 1, 18, -42, -12, -19, 47, 29, -34, 92, 32, 12, 6, 40, 10, 26, 16, -3, -24, -27, -2, 22, 12, -34, 19, -10, -6, 15, -19, 7, -40, -9, 1, -13, -3, -25, -34, -52, -19, -68, -2, -41, 18, 45, 21, -22, 15, -36, 9, -7, 3, 4, 22, -11, 73, 20, 32, 31, -20, 69, 3, 1, 24, 12, 49, 2, 8, 22, 48, -25, 24, -6, -26, -4, -15, 13, -18, 26, 42, 19, 18, 45, -24, 14, -55, 33, -2, -50, 44, 34, -26, -24]
4443b4K9K0n5j6J2K0L4j5M2jo1O3o2M3n4J7Ok2M3l2K3JOm0lM1j6l0j6M7o0J01
4475D1o1L4n7lP1j2j0j1J7qj1j0NnJ1O4k0l7k2K2M2k4l9N3o8M0J0NJ0m1Ok1NM
4509b0M2Qnrn2N8o6l5N7J1J7l7%M1j9k1M2%Rj7M8q0O1k1ll2O7k3n5L9jK2k5RK
4544A2M1q0j4L8pj5M0N0Qq9M6r0N9j2L4k4j2K1j5j9MmN9l3L6J0n7j5L3k3M5j1
4576A6k9K5j2k0N9n7j3K6NJ5l6n8N0L4nR%q5L3M0m2Q3q0O0K5l9k6M5n3J2L2m8
4608c4R5k0m0KM3n0J8l2K1Kl0J4K7j0j0L2m3k4J9k1M0J9n0M3m4J5Qj1%L6o2P1
4640B4r1J05m%j8j0Mm3R0o6RJ8p5J06n6L1K6l7m6lJ2Q7m3k4j4K8J4k5jk2M0J4
4672C0o0O5n9J2L9k5j3M7m3M6k0n6J08o4Qn1O3m6OoKpL9l3M3rM0o7M5L0p5K4o
$$ y = [-24, 5, 25, -30, -46, -34, -14, 20, 5, 47, 46, -15, 48, -14, 29, -25, -8, -2, -24, 19, -13, 10, 11, 17, -23, -26, 15, -1, -31, -47, 0, -60, 41, -20, 14, -43, -46, 25, 13, 3, -8, 9, 1, -10, -20, -15, -20, -9, 55, 35, -2, -24, -2, 40, 16, -23, 30, -38, 2, 12, 17, 27, -14, -8, -29, -24, -20, 22, 30, 25, 16, -36, 22, -44, -79, -22, -11, 6, -31, -31, 10, -9, -30, 12, 12, 21, 4, 52, -28, 33, 12, 9, -23, 44, 21, -34, 5, 4, 26, 1, 10, 12, 53, -27, -41, -3, -10, -25, 15, 65, 73, -16, 30, -60, -1, -13, 21, -3, -15, 6, -9, -28, -24, -28, 31, -2, 34, 44, -13, -28, 5, -18, 27, 16, -13, 12, 0, -20, 39, -18, -31, -5, 0, 15, -21, -79, -29, 5, 0, 9, 9, -76, -43, -3, -45, 38, -42, 18, 43, 4, -22, 23, -30, -18, 14, -34, 61, 41, 1, 3, 46, -4, 14, -18, 3, 5, -25, -11, 16, 6, -4, 28, -15, -39, -20, -41, -1, 18, -32, 11, -33, -18, -10, -21, -21, 15, -47, 24, -67, 38, 34, 34, 16, 6, 10, -33, 57, -9, 0, 18, -57, 49, -7, 24, 50, 13, -33, -36, -24, 63, 20, -4, -18, 10, 24, -1, -2, -24, 16, 30, -30, 35, -24, -12, 27, 2, -11, 36, -7, 39, 19, -37, 71, 7, 15, -36, 27, -19, -13, -19, -17, -24, 15, -18, 25, 16, 56, -11, 34, 64, -11, 13, 7]
4705Gk3J5L6o1J02j22Q0r7N6K9o4k1L0N3o8M7L3k7k1j0K5J8l3J3l0nK8K7j7o3
4735f3Q3L6l6J6J9n7K7%j6K3p2O3jl6JL5Nm9L8l4M1J1p0L9oM8k3J2o6k5L0K2M4
4768C9m9l0j2K8M3m8N6ok4O5l6lo4O0M5l0p8O3J7L7m3n2kL9k6L1Rj6l8J6mL2k3
4801dQk2J5P1p0MKo7M7k4O0j8L7n7L7k2k9L7M5m7o3R9l8k0L8j7m6J0L9NKMKo%
4836A2k7J4Oj6N0o0LPJ4J5k2Q0o8Kk9J1j7k4NR%M4M1k4j34Q0O3q2M2O0l3lj2n
4870Bj3RK2k9K8o9N8J6n0L0o4J01l7o3Q4l5oL2k6l1O7k8j1O3J7n4k9J3J7l1L0
4901A3J9o5K2jN6m9K2k4M7j13Q0J4m0j7M1K2K1m3K0kK7o9OJ7mk3j4J7N5kl0K9
4933C2k6m5M9o2P4K2nk6k5J6l5L4k3K2Lj9J0oJ9l1J5j0L1J8p7L7K4l2M7m9J1O4
$$ y = [7, -16, -1, 35, -26, 76, -46, 34, -63, -7, 22, -42, -63, -33, 20, -48, -1, 32, 5, -16, -26, -1, 17, -16, -3, -33, -38, -10, 17, 0, -63, 20, 56, 20, 36, 55, -2, 25, 25, 9, 32, -40, 23, 22, -14, -13, 22, 27, -22, 16, -18, 23, 34, -36, 3, -3, 45, 22, 34, -32, -57, -27, -5, 39, -10, -40, -52, -24, 19, -29, 27, 21, -3, 62, 26, 23, -41, 19, 64, 34, -44, 19, 36, 73, 30, -22, -24, 15, -11, 20, 29, 13, -25, -9, -13, 19, -4, 4, -18, -3, 68, -2, 2, 4, -63, -16, -40, 20, 2, 39, -18, 19, -3, -32, 5, 50, 3, -60, 39, 1, -19, 19, 2, -44, -34, 5, 10, 12, 16, 18, 12, 12, -15, -1, 5, -11, 39, -21, -18, -11, 3, 18, -4, 76, 8, 10, -19, -8, -25, -49, -44, -35, -35, 9, 50, 26, -108, -28, 35, -47, -5, 55, 22, 19, 7, 2, -11, -2, 20, -9, 19, -50, 8, 24, -26, 4, -60, 41, 4, -59, 25, -10, -16, 16, -10, -41, 26, -2, -13, 50, 67, 13, -16, -3, 14, -17, 13, 32, -33, -11, -12, 44, -5, 17, -7, 40, -73, 7, 21, -19, -36, 5, 27, 48, 5, 25, 23, 50, -19, -13, 4, 0, -23, -37, -20, 35, 33, 3, 32, 6, -39, 10, -52, 22, 44, 39, 13, -12, 4, -31, 3, -20, 2, 5, -14, -4, -10, 9, -22, -7, -17, 14, 32, -45, -8, 16, -16, 31, -18, -7, 57]
4965E7j15M7k5k8M8K8o1N5j6Km3P8r7L1qM6K5m0J7l0M8J8q0O3o5N8o5N8Rl7j0
4996c2L8Qj0Rm4k6O5k4J3l2Q0l5m8O2p4R4o7M1qm7M1L1m1n2k7J13k4J1l7L7m5
5027c0j0M6k1j1K1jJ2Oo0LM7k4N1PRL0l3pM5m8p3J0L3k0J0n0Q9k6jk3k1Q1p4N5
5061B2k0jj5l5nN9k8L5KmK9n4rJJ8mRj2M4l2j1K1j0o4O2J8om0O3j1L2k9p2J3l
5096c7RK8j0K7J5r7L8L2J2J0l9J8Lq3O0K8o6K6M9l6J2l9Q8q2Q6m4l1L2J2O2q7
5127drO7l5K5n1PN6l8%l3QOm9P0j7K9n2Q2o5lJ2q0J27p1P6l5o0M5k4K3K4Lm7N3
5161D0p0N8J4n9j7N8l1L4m0L2k9K6j0k6RJ5kk3L7ol8P2o7N8kn9M0K2n7l7L4N8
5193C4p8Q1m8Q2p3k7L6j6K5On7rL2P5k3%k9k8k2M3Lj2mM0n5K9k0k0M5n1M3L3J5
$$ y = [57, -58, -11, -36, -64, -16, 12, -49, 6, -10, -8, -51, 27, -70, -39, -47, -1, 24, -16, 1, -29, 19, 37, -43, 20, -45, 13, -52, 6, 15, -22, -32, 6, 14, 4, 13, -31, -57, 8, -16, -3, -35, 45, 10, -38, 24, -50, 44, -23, 18, 10, -37, 4, 35, -6, -58, -85, 28, 4, 15, -22, 15, -30, -40, 6, -15, -26, -5, -6, 6, 12, -48, -45, 2, -22, 29, 36, 45, 75, 42, 35, 80, 32, -41, -31, 2, -18, -8, -58, 31, 5, 4, -19, -40, 41, -33, 22, 2, 1, -14, -49, -54, 5, -23, 12, 14, 10, 39, -15, -24, -23, -5, -9, 0, -12, 32, 0, -11, 10, 0, -64, -2, 16, 10, -30, 33, 22, 54, 25, -47, -34, -37, -28, 0, -10, 17, 32, -65, -27, 5, 17, 27, -12, 6, 9, -74, -14, 14, -52, -26, 23, -13, -1, -40, 48, -34, 52, 8, -23, 9, 21, 83, -4, -13, 54, 19, 44, -7, 0, 56, 18, 18, -15, -7, -1, -50, 20, 3, 32, -20, 62, -3, -6, 6, -74, 53, -18, 58, 23, -37, 8, -16, 7, 31, 34, -13, 40, -30, 28, 42, -17, -34, 24, -7, 27, -13, 19, -10, 16, 6, -20, -11, 4, 2, -21, 16, 10, -28, 44, -23, 35, 33, -26, 14, 36, -21, -58, -24, 34, -44, 37, -11, 71, -2, -29, 7, -9, 16, 22, -35, -44, -12, 63, 40, 40, 11, -17, -39, 4, 7, -5, -9, 31, -24, 5, -15, -35, 10, -41, 2, 35, 50]
5226E0n5l8N5l0PN3k3l2K9K2m6Nj6M2m2k0N2L0m2k0l5O6k3j6P3pq3O3jKl3%%J6
5260CnP3mo1L2j7k0p3P1j2j2O8r5J7M6K3l6Oj3j7O0l0J2j1N2l4j5kj0O7k8n9P6
5293E2q6P7m4N0j03N9K8l1j9J7l2k2R4K1n3m8O2Ook9K6jkl8j9oKpJ26m2m7M1n2
5326b6K2L0p3Q0l1rj1M6l8ONoMm3N8OOlk4K7l4LN1p0lL5m1K4lmR0n8J9n3j5L4
5362Aj3L7lO6q1kL2qK0o0N0l8Pk1j2RM7l3L3k9K6k2J7kj7l5L4j9j7K5J8m2J2P3
5396E3o7J7O2k9Mm9N0QJ2j14N7J0K3l8K5L1k7Lo3O1Lrm3j4%R3j5j7j8L%N0o3j7
5430a8L1n9JO8Jl7k2N4n2P2%k3nj9M0m0k0L9J1K4jnq4Q1Ln1J0M9r3O9k1m4L7N5
5464E1o8NP4o4M8p6j9J7K5j2k0O2m3J2K6r0M6N8k0O9p0lk5K5Rl7K5j7JJ5J7K6
$$ y = [50, -5, -43, 12, -18, -11, 42, 19, -13, 16, 38, -8, -3, -19, 23, -19, -39, 13, 43, 1, -19, -54, 12, -11, -27, 46, 39, -44, 19, 18, 20, -13, -13, -13, 3, -2, 71, 67, 6, 38, 21, 1, -72, -1, -13, -25, 43, -52, -35, 11, 34, -2, 4, -9, -26, 34, 4, 16, 5, 57, 23, 8, 6, -4, 63, 35, -24, 52, -34, 43, -1, 49, -54, 5, 33, 2, -17, 0, -32, -54, 40, 61, 8, -40, 22, 28, 22, -7, 19, 18, 16, -22, -41, -47, -45, -52, 74, 32, -15, 26, -26, -4, 26, -47, 33, 2, -7, -18, 28, -10, -4, 1, -5, -1, -44, 14, 20, 26, 23, -1, 26, -8, -5, 46, -24, -27, 8, -33, -9, -12, -16, 74, 16, 35, -18, -33, 1, -12, 25, 22, 88, 7, 5, 37, 29, 49, -11, 39, 1, 8, -13, -25, -16, 31, -2, 31, 2, 28, 6, 23, 21, 4, -31, 3, -16, -33, -8, 10, -32, -20, 53, -14, 3, 65, 36, 40, -9, 41, 49, 61, -53, 4, 14, 37, -1, 24, 55, 28, 31, -32, 29, 32, 23, -20, -34, -34, 59, 44, 27, 9, 12, 12, 62, -1, -18, 13, -46, -45, 23, 24, -13, -35, 19, -33, 39, 39, 16, 11, -8, 32, -8, -28, 11, 22, 46, 45, 40, -44, 37, 40, -11, -1, 48, -45, 24, 3, -41, -4, 51, -17, -12, 62, -2, 46, -30, -49, -32, -7, -19, -39, 23, -20, -8, 18, -72, -26, 32, 12, 81, 11, 8, -17, 8, 17, -20, 5, -12, -11, 4, 21, 47]
5496D7l7j4j4O6p0N9j0j7n8L2K0J2Jo7P0J5l8J2Nj6Om9j2K2J8M6k1l0J8L4l4K
5528bj7K8l7L4k0K7k0%L2nj9l3N0l4RO6p2L2j3qoN5o6K6K8o8M1j3K5k4L0m8NL5
5562A8n8R8p1m0N8j0K9l8l7KN4j0l1M9Km5J02m5k3m3J7L3k6O8m2J6m3k5M9l5L3
5593FqJ9m4RNl3L3k6QNm4P1qnO2q5J12j19L5K9M5j6n8NlJ6Pn9L7N3l8l2N6p5M0
5628@j2O2n8NkQK0j2N1o1j0j4K2QK1n4J0K2l0nlP6o9RP6o3N4p9N4OoJ9p7K1K2
5663A1J9J1o9j3L1L9l7K7m0J01p6k6L9l3l3K3M7K4k0qp3Q0L8j03O6J8p7njK1O1
5694D2o2N6k6l0K7j9N5m5j8N3j6l0L6Ol6K3l0O0l2m2N4j0po2J00j02P0mm1P4m6
5725bN4r7N3m4K9K5M8l0p1O3l7N4k6J9p2M1M4m9lqL3l0J4J9k1J9J9Kk0k7J1rM1
$$ y = [47, 10, -4, -18, 48, -22, 37, 27, 10, -48, -16, 4, 16, 17, -50, 20, 35, -3, 9, 14, -2, 4, -45, -57, -35, -17, 29, 8, -22, -4, 30, -4, -2, -19, 9, -28, 6, -14, 13, -7, -7, 25, 20, 1, -32, 18, -16, -7, 59, -13, 19, 6, -2, -8, 47, -19, 7, 35, -33, 8, -5, 20, -4, 26, -22, -17, 18, -40, 58, -13, -53, 5, -5, 24, -14, -51, -49, 5, -5, -36, 13, 15, -30, 72, 27, 4, -39, -22, 11, -15, 53, 11, 27, -16, -41, 8, -27, 6, -2, 17, -27, -18, -13, -46, -13, -39, -31, -26, -70, 1, -7, -12, 50, -35, 77, -42, -7, 22, 67, 51, -7, -2, -5, 11, 18, -41, -4, 49, 11, -21, 35, -40, 0, -12, 50, -8, -3, -5, 3, 23, 11, 62, 1, -9, -23, -1, 7, 28, -26, -16, 6, -24, -29, -32, 44, -25, -16, 60, -3, 51, -28, 26, 32, 26, 45, -32, -11, 11, 30, 41, -28, -41, -10, 29, -8, 19, -21, 80, 4, -22, 17, -16, -49, -26, 21, 45, 25, 17, -56, 24, 62, -41, 25, 43, -34, -39, -40, -19, 42, -20, 36, 10, -20, 7, -12, 43, -2, -20, 33, 17, -13, 23, 29, -7, 16, -14, 46, 14, -28, 26, 16, 9, -53, 47, -55, 15, 11, -30, 44, -2, 52, -45, 8, -36, -7, 18, 66, 36, -35, 28, -9, 45, 19, 38, -34, 7, 51, 2, -1, -9, 24, -6, 8, 27, 6, 25, 44, 46, 26, -1, 10, 1, 42]
5758D2o6P2l8L7m6K%k7j2JL4l6j4M5L1m4K5KLK3pl1k1J5Kj8n1J26l0P3o8J1j12
5791g7Q4oj7N1j5Oo9N3k4O1j0m4%K3kq3Q2P1q6m4N8l2L6M5q8L7L5n9l6L8k1Q1
5823D8n8k0J00l5l6l8L1N6m8J9nj8Ro0N0N2j4pJ7n7K1k0K0n4O4J2j9l7Ll0M7K3
5855A6njkL3n2M8o1J6l5M6Rk7j1P5l0j4l0M7k6rM0k5K5n7KM7q8N9M2n3PM5qqn5
5890d0L2J7m2Q6q9K5j1M0j0l7kL0n5Q7m9J1Q6n8n3O1k9n5M0orQL2j7n3R9lj7j0
5923IL9n4k9L6L2l0j8K3L1n2l7R0j3j9j0m1L8K8l2J1Mj3k7J6N6q3M5L5r6P5m7
5954c3K1J9J6j8p1K2J19j05K6j4j6M3lJ2l7j8O8k6jj5j3jL6j7L3qj1j9j7M0k0
5985hj4L2M2p0k6M4j9O9r7N9j7K1j5O0m1k6l6O2n6N8m3oN1m5N9l9M1n7K3QJ8l5
$$ y = [42, -24, 48, 10, 47, 1, 3, 3, -24, -36, -35, -1, -37, -51, -6, 25, -19, 6, 8, 11, 34, 27, -4, -25, -10, -8, -26, -77, 49, 19, 92, 24, 35, -77, 7, 1, -16, 35, 20, 26, -43, 10, -14, 47, 37, -7, -7, 16, 14, -69, 13, 84, -2, -46, 12, -20, 16, 61, -27, 10, 45, -14, -50, -12, -33, 48, -10, -30, 70, 35, -1, -39, -8, 48, 0, 19, 14, -4, 5, -55, -5, 47, 33, 26, 43, -14, 7, -13, 7, -47, 17, 29, 10, -27, -24, -54, -7, 16, 11, 10, 8, 41, -11, 37, -24, -8, -43, 3, 12, -15, -26, 49, 19, 5, -25, 22, -4, -13, 27, 2, 27, -30, -28, 19, -69, -10, 32, -21, -14, 31, 23, 15, -40, -8, 9, -33, 53, -36, -11, -22, 18, 8, -29, -31, -1, -56, 31, -18, -7, 79, 21, -32, 29, 0, -55, -15, -21, -30, -22, 10, -7, -60, 39, 36, 19, 9, 48, -6, -35, 1, 33, 3, -15, 8, 39, -13, -50, 40, 27, 8, -2, -43, -5, 23, -9, 2, 6, -7, -34, -18, 38, -45, 0, 35, -61, 14, -33, -12, 7, 23, 5, -66, -44, 75, -30, -4, -18, -34, 9, 6, 18, -19, -37, 31, 5, 4, -11, -24, -25, 11, -6, 27, 19, 8, -11, -28, 12, -8, -22, 10, 52, -18, -44, 0, -19, 50, -47, 12, -5, 16, 1, 61, 20, -6, -42, 20, -36, 22, -21, -27, 24, -21, 38, -1, 40, -17, 6, 14, 32, -3]
6017cK6MNkp2P1o7L1K3l4L3n9K9j1M6k7K5J2Mp5O0m7O1k7M0n1K2K1j5l4M7l4M3
6050D5O8o5l5p0M5j2JJ6L3Mk0k1J3K9J8q4j2M5M7o1K8k2K2QM6l7o3KR8k5j6K0
6082D5l4l6M6o9K2J8Q6n4m8Q7m9n8P3K5q4L1J3j7K5j9j0m4P8o5J0K5o0M4L3J5
6112B9k7j0P3o1K8j0l5j5R2m6rm0P6j9p4NM4J8K8n5L1K7l7K0q0NL9Kj5J3K2j4
6144EKJl1kkjK8%k6J9K1o7J9O0k0k6l2N3J3l0M7J1Jj9k4k0O3n6L9Lj3KJk6j0J3
6180dM9l8j1pK0j2L1k1J4%m7M2l0J9K0n2LP5J2j3p5RQM4o4M5%m9%L6L8o0L0L2
6214D4k1J5l7j9M1Pk3kj6R8n8m6L1%j5j4Lk0M9L3k5m9klO6m5M3ol6J6K1K3p6L7
6248A4k9J8Lm7O1J4j7m8M7L4m0QqML7jn0l0N2l0lk8J8OMN0n3j8K9KjoKl1R8n6
$$ y = [-3, 23, 27, 32, 30, -42, 29, -38, -7, 16, -18, 15, -44, -15, -26, 20, -7, 18, 30, 34, -41, 19, -28, 33, 6, 46, -5, 17, 38, 23, -11, 36, 2, 45, 113, 48, 13, -57, -12, -24, -23, -7, 26, 30, 10, -11, 2, 31, 49, -35, -47, -2, 45, -16, 12, -10, 12, 20, 66, 29, -34, -32, 66, 41, 25, 45, 11, -25, 21, -48, -26, -8, 78, 24, -24, 63, 14, -44, 29, 54, -30, 1, 14, -3, 22, 3, -7, -51, 27, -38, -28, -3, -63, -19, 14, 29, 2, -8, 65, 4, 32, 22, -13, -28, 64, 18, 9, -31, 45, 26, -48, -43, 1, 19, 47, -8, 23, 50, 13, 33, -47, -42, -3, -1, -16, -3, 19, 5, 7, 8, -23, -25, -27, -28, 0, 0, -26, -7, 14, -53, -34, 26, 6, -20, -52, 1, 14, -16, 31, 42, 43, 24, 0, -20, 43, -13, 26, 29, 16, 18, 19, -7, -17, -4, 45, 7, -4, -11, 9, -3, 28, 7, 21, 21, -26, 16, -14, 5, 25, -27, -24, 51, 63, 50, -25, -16, -8, 36, -28, 17, 17, -32, -32, 4, 42, -18, 12, 44, 23, 38, 1, -18, 23, 30, 7, 5, -11, 87, 29, -17, 14, 14, -1, -15, -12, -32, 17, 50, 25, -24, -26, -29, 37, -8, 35, 29, -7, 9, 30, 53, -23, 14, -15, 3, 6, -41, 20, 34, 17, -31, 16, 50, 10, 18, 10, 14, 51, 50, 0, -30, 22, -8, -11, -39, -21, -15, -11, 39, -14, -32, -3, -1, -2, -8, -6, -37, 61, 5]
6284Ej7K5lJ6j9qpJ6J4l1OJ3K7K2o0K0m0PJ7o3N8K4m4K4J3K1j34J12k1k8O0l6
6316a1o3R4m0%jNk6K2L7p0j9O7l9J0N5Mj3kL2J1Mq8K1j0j3M3j6kQ4m3m9kL9k0
6350AjMK6k8j6M6j0o5O5k7Rl0P6q1O5l6j1L1l2L0k4J5j6OJ8jJ0l1O6m4m1J7OK3
6384B0m1qJ4J3J2Q8j05K3m4P2m3k4O0m1N7p6K6j2L0m9LL8pL1l0K0o5J2N4l8k3
6415c3M4Lj9L8o8K7L0l7M9q6M8N5j8k3j3L4l0J0k2K8k0j3P2p7O2l9m6J6jk5M3
6446a1jL7mRm5k6N8m2j4mN6J0j8oM3k2j2K2m9J1K1j7j3L3K3l2K8Km7J0%K5k0J6
6480B1L9o5L2j2qm2KOM6j7l6P6l2m2L3Kj4J8J6KKmJ4K4k2m5j4P9o8K7l0l9Pk7
6514g1O6j9K3j4J0j2L1Ol7J1NqNL7m3Kj4N7m6J7J6O4j34M3P3o6K7J9l2qk2K9k0
$$ y = [5, -12, 13, 10, 26, 7, -1, -8, 8, 22, -9, -3, 10, 37, 59, -1, 19, -21, -14, 3, -60, -2, 22, -22, 2, 15, 36, -98, 14, -7, -35, 25, -11, -74, 20, -20, -20, -21, -16, -42, -20, 17, -53, -72, -5, -44, -34, 21, 25, 12, 10, 42, 53, 57, -31, -10, -20, -33, 10, -6, -8, 76, 33, -16, -18, 21, 1, 0, 4, 30, 2, -14, 32, 22, -43, 22, -5, 4, -26, 50, -31, 34, -2, -13, 18, -14, 16, -8, 7, -9, -3, 15, 14, 24, -7, 59, 15, -26, -9, -3, 20, -21, -29, -15, -2, 10, 98, -7, 16, -28, 44, 1, -23, 37, -4, 53, -23, 3, -9, 21, -28, -25, 13, 6, 37, 7, 27, -38, -26, 28, -10, -33, 11, 14, -5, 33, -35, -8, 22, -15, 34, -52, -4, 51, 33, 10, -3, 31, 1, 11, -11, 17, -3, -16, 56, -21, 41, 2, -44, -28, -29, -54, -11, -12, 25, 21, 30, -15, -41, 17, -25, -39, -43, 13, 23, 5, -1, 42, 20, 8, 30, -19, -8, 13, -4, -17, 16, 39, 7, 35, 37, -10, 0, 0, 25, 5, 21, 60, -5, 27, 15, 7, -35, -33, -27, 19, 2, -34, 42, 10, -32, 1, 3, -11, 7, 23, 25, 27, 23, 37, 61, 39, -6, -20, 59, -9, 18, -12, -51, -44, -71, -5, -24, -1, -15, -5, -17, 14, 20, -17, -6, -1, -9, -4, 33, -10, -8, -22, 35, -11, 6, 22, 86, -48, -5, 68, 2, 29, 48, 16, 8, -14, 15, -5]
6547ej5J3J3Jn3L6qL5ll3K9J9k1j%%n2N1k5P9m6r4J09M8n7nk2n1M7J3J3m3O1J
6581C4orpO2r1OJ0k6L4K8k9K0o5P4K2m8l2j2K1mJ6K3On6N3l2j7N1M0m4o6P0l0
6614dM2r1J02J1j03O4o5O3l5k6M8J3j3m3K3%K7m6P4m9K6j0M0m6LK2lj8k1rNK5
6646Fk0kL9j0m8J0RKn8J29j19RM9Ll8L0L6J2Mk1M6r5OnK2K7L9p9RO2Pr1L2m5N2
6681IJ8nqjl1lMJ5l7L2M4J3k5pQn1KN3M3k7l0M5o0OlRl9N3K5r3N4Lm2O6K3n8J3
6718A8m4M4K1k3K6pl5M9o4pk4J7RL3J4m6R3n4m6L7O%L5p2rL1o7P1k9J7j3M4k6
6751aNm7R0n7j0K0J8m3N8j00Q5Mk3l5L8OpJ2j1j6M9l9J9n2J9j4kL2M2J5m4j07
6783i6J31m8N3n9OK6jm6M7J2l8L7J3l8J1l3K7J6p3J1M7N1o0j4L8K4l6j4l0jP2
$$ y = [-5, -20, -7, 6, 7, -46, -10, -18, 17, 14, -19, 10, 29, 8, 7, 7, 7, -45, 6, -19, 60, 14, -80, 29, 77, 20, 15, -7, -58, -11, 2, 15, -28, 33, 34, 28, 19, 12, 74, -17, -11, -1, -27, 7, 35, 6, 26, -39, 35, 57, 9, -23, -35, -14, -18, -2, 21, 27, -29, 24, -8, -25, 26, 66, 22, -44, 26, -4, 38, -53, 49, 60, -43, 21, -44, 19, -16, -42, 6, 19, 6, -37, -14, -14, 13, -33, 41, -8, 18, 8, 48, 2, 5, 27, 24, 6, -15, -24, -19, 6, -14, -16, 23, 13, -35, -25, -16, -14, -72, 57, -62, -53, -4, -1, -39, -9, 27, 39, 43, 22, 68, -27, -21, -26, -4, 23, 62, -17, -8, 54, 61, -30, 2, -43, 9, 27, 22, 14, 13, -18, -21, -17, -2, -39, -7, 37, 50, 25, 18, 26, -25, -23, 30, 73, 46, 16, 61, 1, 7, 4, 13, -26, 27, 52, -41, 13, 16, -26, 40, 63, 5, 18, -26, 18, 39, 16, 42, 35, 0, 49, -15, -22, -46, -29, -20, 13, 27, -19, 74, 20, -26, 11, 17, 17, 52, -20, -29, 2, -65, 6, -23, -6, -19, 25, -1, 4, -43, 47, -10, -20, 0, 18, -25, 33, -67, 18, 22, -1, -36, 2, 8, 1, 13, 2, -14, 35, -4, 15, -37, -18, -32, -34, -2, 40, 55, 11, -96, 35, -13, 40, -19, -13, 13, 12, -34, 13, 25, -13, 24, 37, -1, 10, -23, 4, 20, -53, -42, 5, 56, -4, -18, 20, 44, 8, -6, -36, -37, 35]
6814C5l3L2k6l4k6j2P5k5J9m7L6J4j1k6QN5m4J1L3l0L2k5ln1M8J2l4K0pJM8q4
6846c9O8mRK0m5k4j5N4k3O5m0l2J7m7k7Q8k0j9rl8O4%l7J9O9p7L7kj2J2m0J2P1
6879E5n2j9M1M1j8n4J7o5M5k5K9Nm4L4O0r0N5Lk6J5rpm0M1qK4ol1N4jl2J4M8n0
6913DJ3lJ4k7nJ5j6L6j3roJ7l3K7L0n7J1j9j1j9R4j0j01JO8pj4N4m7n6M9l1M4
6946gO3n6L6K5l7m3JP5p5K8Qj7O5j5k2k4kl8Q0k3pM2r1K7J9K0k1j8M8j4nj2l1
6979b1qO2p0M0oj2L0l6KJ4J9n5P9j6m0J1L0j7kmL7m2N3m0m3K2LJ9K7m0O7n9j0
7012fK2K3jJ4o3J2Om3K5j3M3J6k1k8k8P6p6k9N8M7M1o3j8K2K2j8J0Pq6L7M4k2
7044A0ll2J3N4r8J00n7N4j2r2J10j23Q5M4n7Rn7Q1J8k3j1o1N6k6J7m0L7J7n0M9
$$ y = [35, 2, 34, 8, -26, -52, -64, 11, -14, 5, -42, -6, 8, -3, -29, -21, 34, -10, 1, 34, 4, 36, 11, 8, -43, 5, 17, -17, 3, -4, -3, 45, -39, 29, 25, 34, 54, 9, -15, -30, 24, 1, 66, 26, -6, 11, -36, -63, 25, 5, -14, -23, -61, 3, 3, -34, -15, 54, -23, 14, 12, 0, 12, -28, -16, 55, 3, -16, 25, 66, 48, -6, 11, -54, -9, -34, -5, 0, -44, -10, 50, -40, 15, 18, -8, 7, -2, -9, -49, -8, -16, 8, 2, -29, 25, 24, -8, 6, 54, 4, 17, 14, 28, 1, -4, 11, -5, 31, 18, 9, 3, 20, -13, 14, 44, -13, -2, -21, -32, -51, 43, 33, -68, -67, 1, -6, -20, 34, -13, -69, -20, -51, -7, 56, 0, 36, 61, 24, -19, -18, 57, -18, 10, 18, 1, 66, 51, 29, 5, 3, -35, 45, 22, 15, 57, -34, -7, 12, 32, 11, -7, 41, 27, 22, 10, -21, -29, 33, -37, 3, -3, -15, 15, -21, -19, -5, 14, -41, 38, 22, -18, -7, 23, 6, 4, 0, 37, -5, 48, 8, -35, -13, -10, 9, 36, -4, 63, 4, -6, 16, 39, 38, 52, -11, 1, 7, -36, -11, -24, 19, 35, 14, -14, -42, 34, -42, -71, -13, 34, 75, 12, -6, 16, 38, 20, 30, 37, -49, -12, 32, 10, 7, -25, -12, 42, -56, 44, -13, 41, 29, -63, 47, -76, 9, 53, -4, 5, -52, 29, 47, 24, 13, -48, 8, -18, -1, -41, -4, 13, -37, 12]
7074A2l2K0K8Om9nO2m1l2N0pJ2J3k7K8p4Q5qm2J4%q1O4m6J17m6kk7J6k2L8o7K2
7107b1J13j35J11q4K6l8M7J6Oj3m7l8P8k4LN6n0jL8l0nJ8j4M6o9l3L6K1K7k0j7
7138CKK0l7L7k6j7l2Q4k0j3L2L0n8pM4l1j0K8l0J3k5N4n0j9J9LL0m2J8K8Pq7P6
7171B4k5J2k6M2p8J6L8M2j00J7O1J9k4n9J5N9j0k7Pnj4M3K5j0m0n4M7L9k6l7M6
7202A7J7K1k0K7q5L3J5l1MNpJ5Qk3k0L6l3poN1J7p3K9q0R3L3p0J3J6l5N2j1j7
7235a6K3Kn5K8J7RJ7m0l1P8n4O7j5q9P0K5qk2QL1o8J2J5m0L1L0ol9M9pK1k5o3
7268d5L7%njj8R8k5m2J7om4J7J2K7p4LK7oj1N7J3l6pL4ol1j4L3L4l4k3j8K0j5
7302c2QL8NNj4K2m0k5M4j6L7J4l8K1k6l5K5k0RL3j2J1r5O3M1onl1J2OkJ2n6L2
$$ y = [12, -20, 0, 28, 34, -15, -20, 42, 1, -31, 19, 12, 24, 37, 10, 38, -36, 49, 41, -1, 13, 13, -68, -4, -50, 67, 21, 19, -8, 8, -14, 24, -43, -21, 92, -43, 68, -16, 10, -28, 19, 35, 41, 28, -19, -57, 21, -3, 0, 56, 6, 5, 43, 13, 8, 26, 12, 58, -11, -44, -8, 13, 40, 20, 3, 5, 25, -12, 25, -1, -18, -50, 34, 14, 1, 33, 63, 5, -2, 42, 11, 1, 29, -1, 12, -13, 41, -9, -28, -9, -6, 24, -18, 0, 28, 35, -52, 24, -1, 11, -15, 27, -51, -35, 3, 45, -55, -38, 23, 42, 18, -41, -26, 33, 23, -4, 3, -2, -16, 27, 52, 42, 2, -52, -5, 34, 8, -29, 17, 34, 55, 35, 62, -23, 10, 25, -6, -2, 3, -4, 11, 19, -4, -24, 12, -21, -28, -34, 17, 34, -39, -10, -90, 3, 36, -34, -21, -5, -40, 12, 1, -16, 7, 9, -46, -18, -1, 8, 25, -15, -46, 32, -22, 45, 30, -59, 11, 36, 28, 6, 14, 45, -23, -11, 4, -36, -5, 25, 19, -20, 29, 22, 43, 18, -45, -8, -8, -13, -14, -32, 66, 41, -1, 16, 10, -34, -17, -5, 22, -52, -49, -22, -28, -39, 18, 31, -5, -12, 22, 16, -15, -29, 4, 38, 4, -19, -37, -17, -32, -24, 14, 19, 24, 10, 32, -8, -33, 11, -5, 32, 46, 8, 29, 3, -32, -7, -27, -18, 15, 3, 14, -81, -18, 23, 17, 12, -19, -7, -1, -3, 9, -47, -15]
7336a5L1n1O8j2k9M9p6L6m4K4NK9Qk0lN3o0j3L8k9M5q3Ml2J00q6O8N0k2l9K9j2
7368A1j1P1n2K8l7K8L6l8m0J2J7mo9M1Nk0P2l9Qnk2J0j5qM7j6k5k0L9K6m0K8k7
7401iJ6op7Q0j8j0Q0J1l8j2l5J5poJ5J3m3P1k0l5j8N4m2M0npOLJ7r4P0LNj9JK9
7437B8j6L5l3K5k2RNj3k0QJ2%o2O1l8K5N2r3N6m5K0Kj6N8k5k7Qj4L5k2Ml1N6m1
7471a9M6j0mm0L3k3pL8Ok5m8J6N5j1n2O3p4M8j6j4L0L1m0K9mmj9K1J2n5L7k2N2
7504C0nl4J9j2j0J9m7P4k2O2r9L8pj00J17J9n6K7k2L3m6J1J8K3ll3k8K2L0j7k1
7535b0N1l8n0N6L4r1N2Q4n8o8O1m0N2l5k1j5L0M7j1j5K1n7M9j4LOK1p4J0N3Ll5
7567ij6KqK8n8N8k2LJ0M1l0j5NK3OJ9j00J13m7N4j4n1j3N2l5qL3j3%Jn8L8J5J3
$$ y = [-15, 16, -35, 33, 21, -8, 41, -35, 1, -43, -19, -14, 15, 23, 3, 0, 53, -7, -20, 18, -11, 34, -49, -45, -77, 23, -63, 5, 55, 33, -6, 23, 11, 0, 71, 19, 47, 10, 38, 74, 36, -4, 8, 25, 21, -48, -7, -2, -22, 50, 11, 19, 14, -8, 2, -13, -21, 26, 10, -15, -35, 4, 30, -10, 18, -9, 7, 1, -76, 4, -14, -24, 56, 67, 29, 17, -18, -3, -10, -16, -1, 12, -31, 40, 20, -15, -33, 21, -21, 19, 14, 7, 13, 16, 33, -61, 9, 12, 17, -2, -1, 28, 12, 47, 14, 39, 17, 26, 31, 18, -2, 6, 18, 18, -44, 17, -21, 4, 56, -37, 19, -26, -6, -4, -20, 38, 13, -14, -6, -20, 15, -7, -3, -34, 22, -19, 27, 17, 13, -27, 6, -17, -24, 14, 20, -5, -53, -37, 18, 7, -45, 18, -56, -8, -24, -38, -8, 23, -17, 12, 8, 4, -15, 6, 18, -37, 0, -22, 30, 25, -9, 10, -2, -12, 7, -40, 34, 12, 74, -25, 13, 6, -94, 23, 42, -14, 13, -9, 24, -22, -11, 7, 30, 27, -6, -34, -12, 18, 1, -20, 31, -7, -57, -1, 33, -58, -6, 78, 20, -48, 13, -27, 25, -10, -31, -46, -16, 31, 20, 5, 26, -31, 18, 4, 7, 13, 34, -40, -30, 23, 26, -9, -25, -23, -31, -3, -61, -3, -25, -22, -12, 29, -1, -16, -11, 12, 18, 37, -63, 50, 3, 57, 43, -8, -21, 31, -4, -12, 21, 8, 8, 9, -49, -11, 4, 17]
7601A7J1j9j8L2LK3n0l0K2J6j7l4N4j7NQn6L8K6j9j0k2J7J2M7n4J1K7j5L2Qrj7
7634B2rJ6m3rP2o0k6L1J0L3rm8L7l6K1K0k7j3N0n8M2m2O4r0l1R8n1P0j4orlK2
7667B4l4LnoJ9L2m5N7m0J6m9M9j5K4p2O6k4k1M4qj4j9k5J8l3M7m3K9j6L9qJ4M4
7700D8p4M5Kl0J6K9o1M4o5M7l6J01o4L6r7MM1J1rk7O7n0k6R4k2l2%M0n8O3m1M9
7732D5m0Jo2N6J3qk5m9P3l4N7k3%mOK2l0l4O9j6k1j5J3L6l6jM1l6L3n0L7m9L2
7765An5LO2K7l0M8r0K8J6L2q2M5K6k8J3o1qkK8J6N8n3j5j7K0K7m7k4O3qK1m4J5
7798a5NKL4K6l0n7L5J0j9L1p3O2m5MK2M9m6j3K4PK4Mn5M9l4L6o1O3mm0qjl2M4
7832bL4l9K5m3Q9m0J8k6pj2pJ4L5n1K5n4O3k1O8r1j3Pp0J04K5mq0P1j9m5O3o7
$$ y = [17, 28, 9, -9, 23, 26, 49, -1, -31, -9, 7, -10, -44, 10, -7, -2, 6, -50, -12, 14, -5, -15, -37, -20, -8, 39, -15, -4, 23, 8, 40, 48, 39, 22, 13, 29, -14, -23, 49, -11, -37, -6, 4, 37, 28, -20, 17, -19, 2, 22, -5, -18, 32, -26, 16, -26, 38, -52, -83, 15, -36, 34, 20, 14, 5, 2, 24, -10, -7, -12, -18, 1, 33, -12, 45, 5, 21, -28, 21, 6, 30, -42, 24, 0, -21, 23, 15, 1, -18, -43, -25, -58, -11, -54, -25, -41, -2, -10, 4, 48, -26, 19, 21, -9, 7, 36, -25, 19, -46, 1, -35, 66, 2, 38, -59, -55, -14, -3, -12, -39, 28, -22, -48, 46, 24, -8, -8, 32, -26, 37, -4, 45, 5, 6, -56, 0, 13, 5, -20, -69, 4, -30, 27, 4, 4, 0, 6, 28, -2, -36, 33, 17, -4, -19, -6, 30, -6, -7, 34, -2, 31, -19, 18, -31, 1, -54, -51, 11, 38, 8, 56, -34, -6, 10, 42, -40, 5, 31, 3, 16, -45, -53, -55, -27, -11, 47, -6, -21, -38, -18, 9, -38, -62, 1, -7, 14, -30, -15, -10, -8, 26, 52, 22, -35, 0, 10, -9, 22, -51, 11, -34, -30, -8, 41, -5, -18, 6, 13, 37, 41, -14, 35, 1, 37, -24, 39, 35, -5, -13, -14, -46, -2, 32, -7, 18, -25, 64, 24, 42, 16, 9, -3, -10, 4, 39, -12, 13, -41, 22, 1, 69, -22, -35, -28, -98, 6, 31, 27, -53, 18, -1, -46, 17, -50]
7864e0M5rRn7M5l1Q4j8j5O6l5p4N9%j01M1JoP2j0j5k5O3r6O0j2K3j5mmKm1K8L5
7898A5k2J7J2Kj6n6L5L4o8J3K8J2k1l7j5J02m1j1mOnJ2o7O2L0k9mK2mJ6klk0L
7932dm4P7k8l8M0RL1j12N3J4M8Jo%m5m2oJ6O1l2j6L5k0K6p4ON7rn0N8o8N0M4n6
7966b4RN1K0k1k4L8m0l9O4m6K0n3N3N2l3K6r8O3RK6p2L0MK9l0j8O5q0JK6rjo7
7999f9Q7j6n5M8l6j0O0J7m1Jj2K9L1l5l5K7L7p3N3l6K7J1rj2J8l8J3J6mk1P6r9
8031e0O7Jj5K4m3M2j2kj1QJ8o3M6rk8Q7p1m4L8P3r6J3P7p5O4l2j8Mk2L5km6N2
8064A0l4L5j2P0Rp9k6K1J5pJL1k3k4M3k7O4k2p2J7j4M7Mq2R4j5j1k4K0j7J8L0
8096D0q0O1l7J7OK3ml4o4O5j2n7R9k8j3l1j1J01k1j0j0pj8J0jK5%l5N4l2L8k4
$$ y = [-50, -5, -14, -5, -62, -17, -48, 36, 18, 3, 69, 34, -40, 19, 19, -82, -41, -40, -46, 26, 16, 1, -24, 39, -57, 3, -9, 14, -1, -5, -9, -7, -48, -20, 15, -7, 10, 22, 24, 8, -48, -13, 21, -47, -34, -6, 6, -15, -52, -67, 35, -6, -17, -21, -15, -20, -8, -75, -13, 17, -12, -16, 6, 2, 18, 16, 13, -7, -4, -48, 29, 1, -37, 3, 12, 43, -69, -16, -2, 46, 47, 41, 41, -4, -46, -52, -36, 25, -7, -23, 12, -8, 18, -56, -50, 7, -2, -52, 6, -62, -12, 32, -24, -15, 36, 56, 35, 11, 49, 9, -30, 34, -12, 8, -45, 8, 60, 27, 53, -45, 18, 27, 53, -19, 11, 15, 44, 14, -4, 61, -19, -18, 8, -1, -2, -69, 18, 2, -53, -5, -41, -51, 9, 26, -15, -14, -26, 3, 34, -1, -36, -9, 28, -45, 8, -28, -1, 10, 1, -11, 7, -31, -18, -2, -6, -27, 49, -50, 17, 18, 3, 27, -16, 26, 14, 12, 1, 9, 27, -36, 10, 1, -27, 60, -11, -55, -17, 56, -40, -27, 50, -25, 39, 7, -11, -7, -29, 6, 4, -42, 10, -24, 11, -1, 69, 78, -1, -27, -6, 9, 2, 3, 34, 11, -13, 30, 3, 67, 45, -27, -10, -24, 23, 27, -55, 39, 24, 13, -11, 9, -8, 10, 40, -40, 21, -16, 1, 7, 30, 26, -8, -72, -7, -19, -76, 23, -5, -18, -49, -60, 41, 20, 10, 0, -7, -25, -15, -16, 9, 9, -26, 28, -4, 34, 10]
8128A0Rj7J2k8R7p7%m3R3Kn8j9Jl7M7O3m1k2mO6k7k1M1l8J4Ml8j8J8J7j3k0K7
8161@Lj5P8p2P2p1j9L8K6l7J3l5K9n9M3j7k3L8rO2k8m2L9M2j3j9o0L5j1k2
$$ y = [10, 19, 2, 14, -14, 83, 6, 6, -37, 56, 58, 0, -19, -18, -55, -8, 55, 14, -8, -12, 54, 27, 6, 47, 9, 23, 27, -11, -29, -11, 6, -7, -27, 0, 3, -12, 66, -6, 66, -5, -24, 14, 40, 3, 16, -19, 10, -49, -6, -23, -46, -8, -17, 45, 17, -25, 14, 56, 43, 24, -36, -1, -12, -34]
8191c4
##END NTUPLES=NMR FID
##END=
