##TITLE=1H_DE-102-ch_5_TFA
 200.13MHz,CDCl3,
 8 sc
 
 27.8.2025
##JCAMPDX= 6.0         $$ Bruker NMR JCAMP-DX V2.0
##DATA TYPE= NMR FID
##DATA CLASS= NTUPLES
##ORIGIN= UXNMR, Bruker Analytische Messtechnik GmbH
##OWNER= pz
$$ XWIN-NMR		Version 3.5
$$ Wed Aug 27 14:08:15 2025 Russian Standard Time (UT+4h)  she@DPX200
##.OBSERVE FREQUENCY= 200.1313
##.OBSERVE NUCLEUS= ^1H
##.DELAY= (6, 6)
##.ACQUISITION MODE= SIMULTANEOUS
##.ACQUISITION SCHEME= undefined
##.AVERAGES= 8
##.DIGITISER RES= 18
##SPECTROMETER/DATA SYSTEM= spect
##.PULSE SEQUENCE= zg30
##.SOLVENT NAME= CDCl3
##.SHIFT REFERENCE= (INTERNAL, CDCl3, 0, 14.3821)
##AUDIT TRAIL= $$ (NUMBER, WHEN, WHO, WHERE, WHAT)
$$ ##TITLE= Audit trail, XWIN-NMR		Version 3.5
$$ ##JCAMPDX= 5.01
$$ ##ORIGIN= Bruker BioSpin GmbH
$$ ##OWNER= she
$$ F:/spectra/data/she/nmr/H-C/1/audita.txt
$$ ##AUDIT TRAIL=  $$ (NUMBER, WHEN, WHO, WHERE, WHAT)
(   1,<2025-08-27 14:06:01.75 +0400>,<she>,<DPX200>,
      <created by zg, POWCHK disabled, PULCHK disabled
       configuration hash MD5:
       00 E9 B6 7A A2 85 ED C7 34 08 36 98 17 FE 4E 26
       data hash MD5: 16K
       19 36 7D 1F 9F 90 38 26 E0 58 A2 52 F7 76 BE 85>)
$$ ##END=
$$ 
$$ hash MD5
$$ 5C 5C 1C CE 5E 37 B4 98 44 6F E0 D4 02 F2 E3 37
##$RELAX= 
##$RELAX= 
##$RELAX= 
##$RELAX= 
##$RELAX= 
##$RELAX= 
$$ Bruker specific parameters
$$ --------------------------
##$DU= <F:/spectra>
##$EXPNO= 1
##$NAME= <H-C>
##$PROCNO= 1
##$TYPE= <nmr>
##$USER= <she>
##$AMP= (0..31)
100 100 100 100 100 100 100 100 100 100 100 100 100 100 100 100 100 100 
100 100 100 100 100 100 100 100 100 100 100 100 100 100 
##$AQSEQ= 0
##$AQ_mod= 1
##$AUNM= <au_zg>
##$AUTOPOS= <>
##$BF1= 200.13
##$BF2= 200.13
##$BF3= 200.13
##$BF4= 200.13
##$BF5= 200.13
##$BF6= 200.13
##$BF7= 200.13
##$BF8= 200.13
##$BYTORDA= 1
##$CFDGTYP= 0
##$CFRGTYP= 5
##$CHEMSTR= <none>
##$CNST= (0..31)
1 1 145 1 1 1 1 1 1 1 1 1 1 1 1 1 1 1 1 1 1 1 1 1 1 1 1 1 1 1 1 1 
##$CPDPRG= <>
##$CPDPRG1= <>
##$CPDPRG2= <>
##$CPDPRG3= <>
##$CPDPRG4= <mlev>
##$CPDPRG5= <mlev>
##$CPDPRG6= <mlev>
##$CPDPRG7= <mlev>
##$CPDPRG8= <mlev>
##$CPDPRGB= <>
##$CPDPRGT= <>
##$D= (0..31)
0 0.7 0 0 0 0 0 0 0 0 0 0.03 0 0 0 0 0 0 0 0 0 0 0 0 0 0 0 0 0 0 0 0 
##$DATE= 1756289161
##$DBL= (0..7)
120 120 120 120 120 120 120 120 
##$DBP= (0..7)
150 150 150 150 150 150 150 150 
##$DBP07= 0
##$DBPNAM0= <>
##$DBPNAM1= <>
##$DBPNAM2= <>
##$DBPNAM3= <>
##$DBPNAM4= <>
##$DBPNAM5= <>
##$DBPNAM6= <>
##$DBPNAM7= <>
##$DBPOAL= (0..7)
0.5 0.5 0.5 0.5 0.5 0.5 0.5 0.5 
##$DBPOFFS= (0..7)
0 0 0 0 0 0 0 0 
##$DE= 6
##$DECBNUC= <off>
##$DECIM= 32
##$DECNUC= <off>
##$DECSTAT= 4
##$DIGMOD= 1
##$DIGTYP= 9
##$DL= (0..7)
0 120 120 120 120 120 120 120 
##$DP= (0..7)
150 150 150 150 150 150 150 150 
##$DP07= 0
##$DPNAME0= <>
##$DPNAME1= <>
##$DPNAME2= <>
##$DPNAME3= <>
##$DPNAME4= <>
##$DPNAME5= <>
##$DPNAME6= <>
##$DPNAME7= <>
##$DPOAL= (0..7)
0.5 0.5 0.5 0.5 0.5 0.5 0.5 0.5 
##$DPOFFS= (0..7)
0 0 0 0 0 0 0 0 
##$DQDMODE= 0
##$DR= 18
##$DS= 0
##$DSLIST= <SSSSSSSSSSSSSSS>
$$ [...]
##$SUBNAM0= <"">
##$SUBNAM1= <"">
##$SUBNAM2= <"">
##$SUBNAM3= <"">
##$SUBNAM4= <"">
##$SUBNAM5= <"">
##$SUBNAM6= <"">
##$SUBNAM7= <"">
##$SUBNAM8= <"">
##$SUBNAM9= <"">
##$SW= 18.0517328524113
##$SWIBOX= (0..15)
0 0 2 0 0 0 0 0 0 0 0 0 0 0 0 0 
##$SW_h= 3612.71676300578
##$TD= 16384
##$TD0= 1
##$TE= 0
##$TE2= 300
##$TE3= 300
##$TEG= 300
##$TL= (0..7)
0 120 120 120 120 120 120 120 
##$TP= (0..7)
150 150 150 150 150 150 150 150 
##$TP07= 0
##$TPNAME0= <>
##$TPNAME1= <>
##$TPNAME2= <>
##$TPNAME3= <>
##$TPNAME4= <>
##$TPNAME5= <>
##$TPNAME6= <>
##$TPNAME7= <>
##$TPOAL= (0..7)
0.5 0.5 0.5 0.5 0.5 0.5 0.5 0.5 
##$TPOFFS= (0..7)
0 0 0 0 0 0 0 0 
##$TUNHIN= 0
##$TUNHOUT= 0
##$TUNXOUT= 0
##$USERA1= <user>
##$USERA2= <user>
##$USERA3= <user>
##$USERA4= <user>
##$USERA5= <user>
##$V9= 5
##$VALIST= <valist>
##$VCLIST= <CCCCCCCCCCCCCCC>
##$VD= 0
##$VDLIST= <DDDDDDDDDDDDDDD>
##$VPLIST= <PPPPPPPPPPPPPPP>
##$VTLIST= <TTTTTTTTTTTTTTT>
##$WBST= 1024
##$WBSW= 4
##$XGAIN= (0..3)
0 0 0 0 
##$XL= 0
##$YL= 0
##$YMAX_a= 26588
##$YMIN_a= -18726
##$ZGOPTNS= <>
##$ZL1= 120
##$ZL2= 120
##$ZL3= 120
##$ZL4= 120
##$ABSF1= 10
##$ABSF2= 0
##$ABSG= 5
##$ABSL= 3
##$ALPHA= 0
##$AQORDER= 0
##$ASSFAC= 0
##$ASSFACI= 0
##$ASSFACX= 0
##$ASSWID= 0
##$AUNMP= <proc_1d>
##$AZFE= 0.1
##$AZFW= 0.1
##$BCFW= 1
##$BC_mod= 2
##$BYTORDP= 1
##$COROFFS= 0
##$CY= -3
##$DATMOD= 1
##$DC= 2
##$DFILT= <>
##$DTYPP= 0
##$F1P= 0
##$F2P= 0
##$FCOR= 0.5
##$FTSIZE= 0
##$FT_mod= 4
##$GAMMA= 1
##$GB= 0.15
##$INTBC= 1
##$INTSCL= 1
##$ISEN= 128
##$LB= 0.25
##$LEV0= 0
##$LPBIN= 0
##$MAXI= 10000
##$MC2= 0
##$MEAN= 0
##$ME_mod= 0
##$MI= 1.114404
##$NCOEF= 0
##$NC_proc= 0
##$NLEV= 6
##$NOISF1= 3.799351
##$NOISF2= 2.8
##$NSP= 1
##$NTH_PI= 0
##$NZP= 0
##$OFFSET= 14.38212
##$PC= 1
##$PHC0= -1718.553
##$PHC1= 7.192278
##$PH_mod= 1
##$PKNL= yes
##$PPARMOD= 0
##$PSCAL= 0
##$PSIGN= 0
##$REVERSE= no
##$SF= 200.129724274929
##$SI= 16384
##$SIGF1= 3
##$SIGF2= 2
##$SINO= 400
##$SIOLD= 16384
##$SREGLST= <1H.CDCl3>
##$SSB= 0
##$STSI= 0
##$STSR= 0
##$SW_p= 3205.1282051282
##$SYMM= 0
##$S_DEV= 0
##$TDeff= 0
##$TDoff= 0
##$TI= <>
##$TILT= no
##$TM1= 0
##$TM2= 0
##$TOPLEV= 0
##$USERP1= <user>
##$USERP2= <user>
##$USERP3= <user>
##$USERP4= <user>
##$USERP5= <user>
##$WDW= 1
##$XDIM= 8192
##$YMAX_p= 0
##$YMIN_p= 0
$$ End of Bruker specific parameters
$$ ---------------------------------
##NTUPLES= NMR FID
##VAR_NAME=  TIME,          FID/REAL,        FID/IMAG
##SYMBOL=    X,             R,               I
##VAR_TYPE=  INDEPENDENT,   DEPENDENT,       DEPENDENT
##VAR_FORM=  AFFN,          ASDF,            ASDF
##VAR_DIM=   8192,          8192,            8192
##UNITS=     SECONDS,       ARBITRARY UNITS, ARBITRARY UNITS
##FACTOR=    0.0002768,     1,               1
##FIRST=     0,             0,               0
##LAST=      2.2672688,     0,               0
##MIN=       0,             -18726,          0
##MAX=       2.2672688,     26588,           0
$$ Real data points
##PAGE= N=1
##DATA TABLE= (X++(R..R)), XYDATA
$$ [...]
79D843p5p692p715Q603K0448J659j5922m104N574k43j854j547o819p430J745Q265
95b264O62q043j077R013Q459R27n675k932N463N680j635n840l009J46k571j450
111d146N399P2q848p41Q180J954n451j959M098M047J70j702j693K253N893O6n338
128B254j021j54k920n71J375j841l802k27M232K146j240J296L029J249J02q22
144C085m48J127m00k104j752j114q44j266K14L005j20l071J041L529Q52p72N3
161A015J194K91j254m15J14M18O43j421k300K47l7r85N82P26m46o82M28K129J148
180A395lJ280M73r58k00l74n38k39j199j276p51q47OQ39J287J222p36n58K581
199A404J593r49l25N97p0j240j216K45J62p74k86p61m69N26l39J61J651J71j070
$$ y = [4843, 4768, -2924, -10639, -2036, 18412, 20071, 4149, 45, 5619, 5376, 3522, 1975, -4844, -12274, -10529, -2264, -1602, -9645, -10722, -1709, 6750, 7677, 2002, -930, 4533, 10213, 8578, 2738, -271, -125, -2696, -4146, 1253, 1325, -7523, -8264, -84, 1870, -3581, -5540, -1442, 2605, 2775, 1073, -620, 1633, 7526, 7592, 2254, 1233, 1079, -1841, -2412, -1037, -2878, -6680, -6907, -2675, -529, -1769, -473, 2556, 3805, 3907, 3085, 2637, 3764, 3364, 1260, -492, -1606, -2450, -3716, -3502, -497, -617, -3688, -2647, 882, 1734, 962, 1015, 2209, 2500, 1246, 831, 945, 1363, 2006, 585, -1715, -1468, -1505, -2490, -1908, -1182, -1628, -2310, -1882, 247, 1395, 1392, 2672, 3145, 2187, 1987, 1613, 1075, 836, -363, -1639, -2390, -3237, -3231, -2392, -1105, 117, -619, -1177, 1404, 2997, 2048, 1723, 2320, 2250, 1010, -206, 39, 201, -573, -859, -1620, -2089, -1563, -1902, -1741, -90, 81, -989]
218i89R9J631J541k23n55P69m3j277m12j96m08p29j357m93N84k74K21J079J389
237C57O38p82K56K047L00j265k85N5p56j252m88Q88q2j133L2L86L69K63k77M60
257b69J242m28j136N18J326N07r86m22J007l94j299K53K33m55p94q41L78Q70k28
276i18J3J028Q96j3p08N83J248p65j241J06j50p97n63J23R40k0p38L12R64M93
296G93k91n05O58N43j281o77P85M81k94p62R4Q54j32p71L15O01l9p64o19R00O82
317E71p28n2P82J37l92l99M04M43p69o29Q5j17o3j05P6P86K13m10M34P38J63l16
339H52m49K22j50j060k22M36j9m39j80L86O26p5r3N71K92j59k82j34M63J76p88
360b6j14M34j81m27j83M11J33o75j40L48j41J69K69P6M35J76k04K57L30o7l49
$$ y = [-989, -890, 741, 2282, 2059, 1504, 2273, 2230, 953, 541, 345, -63, -792, -2149, -2642, -2058, -2332, -2111, -1032, 357, 995, 213, 469, 2516, 2816, 1551, 1266, 1321, 565, -687, -1175, -287, -369, -1502, -1470, -1084, -715, -452, -729, -269, 973, 545, -591, -73, 1253, 1760, 774, 352, 1359, 965, -334, -81, 152, -303, -1097, -1938, -1560, -690, -918, -905, 123, 1019, 1006, 298, 881, 2129, 1364, 123, 229, 79, -718, -1281, -1158, -218, -238, -976, -664, 300, 793, 502, -3, 655, 1198, -83, -760, 25, 506, 212, -550, -456, 398, 266, -505, -190, 411, 372, -392, -1011, -111, 571, -157, -209, 573, 710, 318, -81, 323, 766, -3, -632, -547, -664, -727, -832, -756, 30, 243, -167, 267, 1005, 1168, 852, 403, 625, 475, -585, -807, -371, -390, -829, -1009, -623, 3, -72, -165, 406, 698, 539, 257, 123, 586, 762, -26, -140, 294, 113, -314, -497, -86, 47, -628, -768, -420, -561, -392, -123, -47, 388, 564, 360, 617, 947, 880, 531]
381E31m70J06k62o37M1K70k80j04J26L75M54KJ10L64pj11j73q8K08j59n69J1J84
404g8k08r6N6J41J36l65O7K86o4J53J82r9J87J3J0P3p0l8j89k17r8j45j17K50
428b30Mk23J90L38J0J60N3O8J57k99j87mmk1l84r2L02P5j99J71K83L0o3j03N5
453H7J26j60n5K4rM3j53K2K61k05j80J57j65L1M2p7J82J03q4K25J43JJ9k17J11
478B72p5m42m5J04j37j72K5Q5L46M4o7L78K17q6q3j40Q7k3m00p6K5r4k3l9J27
503a92J51j23NJ51l7K7Q9j8J91Qj74K05J48j50j55j01J3j26l14o2J35j38l5J14
527c88J36M16K9l0K60J92j67j08n5o9j39m11O1J8j39L4M9N9K24k3N5Q8P8K0oq2
553A02Q4j6j05J69r8j25J9l2q4j20q7Q3qj19N7J10J23K71j05K1K28P5k42OK1j90
$$ y = [531, 61, 167, -95, -732, -691, -421, -701, -805, -679, -304, 150, 152, 262, 626, 619, 508, 335, 247, 455, 296, -273, -262, -78, -286, -382, -326, -185, -49, -414, -347, -61, -125, 28, 210, 111, 298, 311, 321, 394, 324, 286, 97, -120, -218, -363, -480, -230, -226, -449, -259, 79, 89, 249, 302, 370, 527, 228, 41, 37, 33, 12, -372, -464, -162, -87, -286, -115, 168, 198, 135, 32, 87, 213, 53, -2, 22, 13, 56, -97, -75, 186, -19, -199, -42, -207, -176, -134, -211, -29, 74, -10, 215, 358, 359, 378, 161, 272, 197, -245, -290, -186, -323, -495, -470, -385, -39, 5, -62, 316, 533, 447, 364, 224, 311, 288, -112, -188, -163, -257, -280, -319, -192, -41, -164, -159, -8, -45, -18, 71, 53, 244, 252, 78, 283, 431, 281, 126, 25, 38, -88, -402, -464, -329, -467, -502, -388, -252, 164, 193, 163, 423, 615, 448, 340, 285, 216, 77, -334, -273, -255, -394, -360, -311, -252, -28, -51, 4, 92, 170, 190, 184, 102, 186, 170, 65, 234, 136, 11, 30, -2, -86, -206, -293, -210, -218, -337, -280, -170, -47, 224, 119, 140, 368, 443, 201, 207, 228, 38]
579C8k06r0M9n9q0J45R1k7K38J0K4J37j39K3l5r9R1j76J1J34j58k3Q1Q0p9Ro4
606g4P1M5j12N0O0N0j1l9L0J17j71o6J05n9j07n3n8J23l0k5J99K1K3P7pJ2M9j70
634E0j45L3j1j03m6K3J32k3m2K70nl4L3n4KQ4j55o4J40l4j13o1J09rj37k2J34
661d8j10%J01pJ50k8RL4J08Ro5L0k6m7j53j02M5j74M8q6M8J46L6M8J73K6k6N6
689A95r6R3j9o8j07k9q9O3m8m4Q0m4%OpN6O5l5Q0l4J15N5J0n9M6o3q0j9j21m1
719a39j9p5K4l0P2J51K2J08P1n5K8P0j39J4j01m1Mq2l2J19o3R4m7l0L9L6o2O7
747DK1o5j7K9Q9K5RJ6M5j04o9K5n4M3o9m8M9J4QN6O5N9Lj03K1N2n1j43M4k6j4
778h6o4L8Q7L4O8k2J2L8n8p8M5kj42k3O9N2K9o3N3Q4Qj10J08koo0j8K6K7JRl4
$$ y = [38, -168, -258, -209, -268, -348, -203, -112, -139, 99, 109, 133, 270, 131, 154, 119, 20, 111, -65, -54, 80, -78, -101, -20, 60, -19, -10, -74, -3, 42, -70, -20, 40, 90, 79, 40, 70, 187, 16, -50, 55, -4, -111, -164, -222, -99, -129, -154, 45, 66, 89, 166, 159, 171, 220, 50, -95, -62, -73, -176, -222, -199, -67, -90, -132, 138, 133, 99, 132, 78, 80, 164, 9, -55, 85, 51, -62, -123, -14, -23, -160, -182, -48, -158, -158, -57, -64, 86, 58, 67, 101, 209, 218, 153, 183, 157, 110, -43, -145, -100, -274, -226, -312, -264, -118, -82, -34, 139, 165, 139, 195, 99, 192, 173, 105, -2, -31, -120, -57, -105, -149, -69, -113, -113, -107, -114, -58, 7, -28, 52, 18, 133, 188, 198, 139, 185, 122, 42, 23, -98, -139, -158, -233, -209, -239, -167, -16, 6, 114, 185, 130, 158, 228, 89, 103, 2, -39, -35, -117, -149, -30, -93, 1, -46, -76, -37, -1, -63, 4, 25, -40, -57, -28, 61, 86, 95, 111, 156, 52, -17, 8, -46, -3, -72, -120, -71, -57, -49, 7, 72, 131, 134, 31, 52, 104, 53, -90, -46, -72, -86, -150, -112, -25, 9, 77, 55, 67, 105, 47, -31, 14, 12, -130, -153, -84, -32, -3, -66, -13, 71, 79, -31, 77, 75, 69, 9, -9, 17, 44, 45, 54, 20]
810B0N0jj35O2Q2j33j16L3O2K7l5K1J47L8q1N8M5K7r1jr7o1o7p1M3J02J5o7O2
839f2P5J0j4Q2qQ3j04o6L1pL2n0O9n9m9o7K7J19r3q5K6K0Q3k2O6J02mp7J01j8
869A41L9o5j57k3Qj52P2QNN5m1P2J5N0L5J0P0l7j06k9R0j0m6J5o2L3l5o8P6P8
899D1q8Ko5J1J16qJ4L6K6l4OJ5Mo8k7k6m1j8K0M3j5Q5k9j5J43q8Q0n5l4l8k1m8
931g6J09l0r0R7M4r0J09j9Ll4m2J8m3RpM8k2Qp4K6N4Mpl2J0o5L3JJ24q7RJ10k
964I6r1O7l6o3L9j49K6K3kl2L8J8J48k8k7Q9j2N6j29K8n6l1l8j4O4l2j0m7Q8N1
994C4n9J0j0l9J01n0N0J6l1O2Qj1J9j10j2N4q1j01j4R3jj3K1M8P1p0P0J05Mqj20
1025C6m5M4pp0Mk4J6Rj05J06O1m3qM4J2j3K8mM7r7K9m1R1L6j29J5L4n0j29J17
$$ y = [20, 70, 69, -66, -4, 78, -55, -171, -138, -76, -49, -84, -63, 84, 122, 41, 99, 144, 171, 80, 79, -18, -79, -146, -217, -174, -72, -57, -124, -62, 13, 23, 9, 91, 83, 166, 62, -4, 27, 20, 52, 2, 71, 12, -37, -104, -77, 42, -51, -136, -110, -90, -7, -29, 37, 139, 135, 58, 159, 141, 180, 115, -42, -65, -57, -209, -137, -129, -124, -69, -110, -38, -23, 27, 62, 72, 142, 105, -1, -30, 60, 50, 4, 19, -43, -10, -45, -113, -37, 41, -47, -45, -110, -99, 17, 9, 23, 59, 85, 51, 57, 72, 76, 8, -19, -45, -86, -104, -84, -41, -56, 29, 0, -15, 128, 40, 120, 65, 31, -7, -28, -76, 33, 3, -87, 10, 54, -36, 73, 54, 57, 23, -19, -1, -44, -35, -42, 6, -16, -8, -82, -56, -2, 2, -5, -37, -27, -92, -59, -58, 66, -21, -12, 98, 96, 5, 72, 36, -27, 12, -137, -111, -88, -90, -122, -84, -66, 82, 54, 27, 116, 104, 160, 31, 59, 3, -28, -66, -80, -16, -48, -58, -105, -17, 34, -25, -15, -25, -64, 37, -13, 37, 53, 22, 84, 92, 81, 100, -10, -22, 32, -49, -150, -164, -71, -72, -85, -64, -16, 55, -15, 55, 160, 164, 156, 36, -9, 35, 28, -42, -38, -62, -46, -37, -142, -36, 25, -18, -26, 18, 30, 17, 45, 41, 88, -9, 20, -21, 70, 106, -23, -8, 26, -24, -153, -36]
1055c6lm4j4N7L6P7l7QR9l4p3k2MNn6m8L4R2r3M0n4Q6Rj05P8J5o5O7n9J9K5r0
1087h2K6O9J7n3L0rN9o1o7O0L8n6N1m1P3M9j37O3J4p6N9j36M5N5k1l3P3l2%R0
1117F7k3L2m5qM4n8n1Q1j01j8MNK2N3p7O6K9m5O2Mmn8K1OK4j8J7l3j4J1K0K8r3
1150e0M1o9L9K5m6O7rN0MnM0l8m3Jj7p4M9o1k9O2ll1R6n4L4O0m9N9k2M3%p6L2
1183B6jj0l8kL3k2K5j13M2M3RL7p2J8K5N8J2Lm5RK7l3p7j9L1Jo0j5M0K2J4N9n
1216B2P2r2J3j0nPj3m2P6Rr2N6k1P1n9Ql0pl9O4%l5L3l2M1L4m9N6j8j5O0o6m4
1249d7L3m4N0m1nM1K3lk6J4L7p1K9l6M8K6k9o3N3M0o2N9K1K9p3L0mqk4n7O9j7
1281hj3jLL9j9l8L7l9M4m0l5N8mN1l5K1K7K0m7k9Rm9LO6j8o3pQ4pOl3J03J7k6
$$ y = [-36, -39, -83, -97, -40, -4, 73, 36, 44, 143, 109, 36, 14, 18, 23, -33, -81, -47, 45, -48, -8, -62, 24, 33, -72, 6, 21, -44, 23, -36, -17, 8, -82, -56, 13, 30, -23, 7, -2, 57, -4, -71, -11, 27, -29, 22, -19, 54, 103, -34, 29, 43, -33, 26, -110, -65, -10, -31, -64, 9, -23, -23, 67, 44, 76, 31, 23, 67, 9, -42, 39, -62, -80, -76, -71, -49, 4, -73, -7, 22, -23, 39, 43, 39, -19, 2, 8, 32, 14, 31, -2, -16, -5, 15, 43, -50, -9, -78, -39, -14, -60, 7, -2, 48, 52, 47, 87, 49, 6, 7, -10, -84, -35, -96, -125, -63, -66, -97, -1, -55, -21, 39, -10, 49, 27, 70, 70, -6, 26, 25, 15, -23, -25, 8, -14, 11, -102, -60, -17, -8, 29, -43, -25, 0, 58, 70, 73, 28, 37, 64, 31, -46, -65, -34, -33, -93, -108, -68, -46, -32, 27, 22, 94, 2, 15, 5, 0, 7, -6, -48, 28, 37, -55, 1, -20, 51, -8, 0, -30, -37, -76, -12, -12, -47, -14, -46, -5, 29, -20, 36, 18, 3, 63, -3, -47, -14, -58, -8, -49, -54, -13, 10, 7, -19, -5, 32, -39, -10, -46, 2, 28, -1, -64, -11, 29, -33, 26, 47, 76, 3, 33, 29, 21, -3, -60, 9, -8, -21, -22, -19, 20, 1, -37, 0, -39, 5, -35, -70, -12, -16, 35, 0, 21, 48, 68, 21, -8, 1, -48, -45, 21, 3, -60, -67, 17, 10, 16, -17, 86, 103, 77]
1315G7k5j2j7%j3m8J0P1j22L4L0K7p0P7nm1l1R9q2O1k0k5R0q0K4L0K3m8l7O5n3
1346a1k0k3lJ7k3J06j1K3j5l8M4Pj5Ml7l8M0oj6L2j3J3l4j8L5o8Q1N7j10N0K2
1377C2j01J17l2J0n5O1k4oK3n3M8p5K7k6L2P4o6J5J6k4J7KRPm3J1q3O9n2O2k0
1408b8j0R1o2k1M1N3l3m8l2K9k1L6k7L2K7m8PL8k1K4j5l0J8j8nK0QJ8kK8l6r0
1440g7J16j5m6Jj3OM0p9R8l9K5Lk1M0k7mJ2%rn9kK8l8J8J9N5k3O1n6%PM3l1m3
1474a0pJ5Ro1qL1N7l7n1Q0m7K2k6lM7j9N2n0mM4o0O8m9mRm8OM7p1PLL2K8lkL0
1510B7k0M2M2l8qq4O9n7j3M0j8m6pM6K1K8q0Q2m4j2P3j2j7m2M7k4l8P0j9j6rk0
1542c7J0qJ7LL6k1k3NP6k4j6m2K0j1n3M5J7L1m0jk8P0J4m7k0R8p0M4n0j2L3j8
$$ y = [77, 52, 40, 23, 23, 10, -38, -28, 43, -79, -45, -15, 12, -58, 19, 14, -27, -58, 41, -41, 20, 0, -25, 65, -15, 9, 39, 62, 14, -23, 42, -11, -31, -54, -57, -40, -63, 43, 32, 55, 40, 2, 46, 53, 38, 42, 5, -33, 7, 1, -15, 17, 4, 17, -17, -35, 0, -68, 13, 70, -40, 10, 32, -69, 48, 16, 26, -29, 32, 8, 2, 25, -28, 20, -55, -28, -54, -22, 52, -14, 1, 17, -7, 10, 12, 21, 28, -15, -4, -87, -18, -70, -8, -28, -38, 53, -9, -30, 11, 64, 31, -17, -49, -20, -41, -5, -32, 0, 27, -21, -14, 24, 3, 27, 12, -18, 0, -18, -23, -3, 5, 23, 21, 49, 13, -77, 39, 24, -22, -21, -34, -28, 12, -67, 31, -8, 17, 20, -1, 39, 12, 8, 20, 20, 11, -48, -50, -22, -60, -42, -23, 32, 9, 70, 14, 14, 21, 64, 33, -10, -17, -2, 7, -54, -62, -31, 26, -11, -62, 18, -29, -7, -33, -36, 11, -8, 44, -6, -10, 34, -26, 42, -7, -11, -2, -50, -44, 3, -68, -61, -58, -26, 2, -1, -3, 27, 7, 49, 91, 53, 45, -39, 30, -27, -40, 0, -18, -64, -71, -25, -4, 24, -56, 26, -18, -30, 43, 31, 14, -28, 19, -5, -43, 27, 8, -8, -17, -37, -27, -35, -18, -15, 21, 0, -23, -18, 58, 34, 18, -24, -4, -15, -68, -23, -6, 25, -15, -16, -44, 26, 40, -7, -27, 71, 1, 45, -5, -17, 16, -2]
1574bl7J4J2L4k5l0O3p1M6JL0j6P7q2j9L2l0RK3p6J7K1k9L5j0nMlL2j3M7m6M3
1607D6J0p8O0k6qk8K6j8l0J2l8J8R6q7O3j6J1m9J07n4k0J9k5j5J9l5O7j2L4J0
1637E9n4k0k1oR4o0lK9K1j6%M1m6P8j21NL7r5P3q9M0P5m4k9K6L2p0R4j5k1K8p3
1669e1N7K6n9jL0j1k4L6k1L4l4n2M6m9R4k3K5J4m4K4J5lK8l7q2R4k1m4R3r0K4
1700fl2K7m1M3l3M3j0K8l9oN0m7j3J0kJ3K2n3K1L1j3J3k0j7K2oK0J0k4P6p6N0
1732D1n5K7J8Jo7L5mK2rn1N5K3k0MK2o8mJ14j34OJ1qL9m1lJ7L8K8p9R4o0RQRJ9
1767C7m9kmNK2k3k0M0L0k9k7M1K4r4M8L2Pm1L7K7l9l7l0Q9l2m7j1J8k7L8m3L5
1799b5RJ1k7N1M9n0M7r7N0K5j9l1N1o6K7QK0p1R5o6k0lL3j9k8R7n1k8N0l2O2l2
$$ y = [-2, -39, -25, -13, 21, -4, -34, 29, -42, 4, 5, 35, 19, 96, 14, -5, 27, -3, 6, 29, -47, -30, -9, -38, -3, -13, -18, -14, -17, 15, 2, 49, 3, 46, 56, -22, 38, 12, 4, -24, 2, -16, -46, -34, -72, -54, 42, -45, 18, 2, 13, -36, 71, 17, -3, 16, -9, -24, -5, -40, 27, 15, 49, 59, 5, -15, -36, -42, 52, -8, -11, 18, 39, 23, 23, 64, 18, 96, -25, -20, 17, -78, -5, -94, -54, 21, -23, -52, -26, 6, -64, 30, 15, -6, 22, -51, 6, 32, -27, -28, 2, -9, -33, 3, -18, 16, -18, -70, -24, -73, 21, -2, 23, 37, -7, 17, 32, 29, 57, 20, -62, 32, 11, -33, 60, -30, -6, -38, -11, -52, -9, -42, 1, -9, 19, -20, -26, 24, -23, -36, -26, -28, -15, 7, -46, -25, 6, -7, 6, -14, -31, -9, -15, 5, 15, -9, 67, -9, 41, -14, 13, 31, 32, -35, 0, -4, 18, 9, -42, 13, 36, 16, 20, 42, -26, -30, 84, -50, -44, -33, -41, -2, -43, -46, -29, 9, 37, -42, 52, -8, 1, 9, 18, 37, -12, -14, -18, -13, 9, -14, -34, 6, 36, 7, -20, 21, 45, -49, -1, 31, 38, -3, 34, 61, 22, -15, -45, 44, 12, -35, -46, -28, -55, -17, -60, -25, -16, -5, -32, 19, 68, 18, 65, -32, 18, 43, 24, -7, 44, -22, 5, 13, 33, -38, 57, -9, -29, -32, 1, -18, -46, 51, 0, -28, 22, -10, 52, 20]
1831B0n2l8K9N0rn6K5J3j1MK2JK1qjO6o5L5o3N1j07J15j00N8l6K5Kj7N6n3M5o3
1863d1N7j6J9l8K3M4o1l3P2l8j3mK0mJ5k3j5L1k1K3M7o0j8M2Rj8l3M7o1N7j4n1
1895e6L9L8l6M9k2MPL0m1l0P2r5K4M7j32J08o6O5m2K3K2jo4M5mK9Nl2Lj8j5L7
1927gJ9l5k1J0rP0mlL4o9K3KmL0k5k7L3N1r5K6J2No8P3j5l6J7NK0m0N0j6P0l0
1961D6p2j6M7k4j4N3Ol9m8K9M3Mj1l7O0n6lL9L5m9J4k1l2N7pM1m5Oop2N5L7n5
1994c5J6LP0m5J9L6n8l7L6p8R4k7k1J8m5K8O5k4j1J8m7K0k6M0k2K6l8J4O6n9K1
2025A7J6l3N4J6q8QK9k6L5m3M5n4J0P3q4O8m5j4K4j7m1M8Nl8J2K3M7On0N5k7r
2057B2l1rL3k9j8%l5N2J6M1m0k5K9L3l5k8n0P0n1Q0k9K3m1LK7r2J02m9N1l5l9
$$ y = [20, -32, -70, -41, 9, 0, -56, -31, -18, -29, -25, -3, -2, 19, 11, 10, 76, 11, 46, -17, 34, -73, 42, -58, 0, -36, -11, -9, -26, 30, -23, 22, -41, 16, 0, 19, -19, 4, 48, -13, -46, 26, -12, -25, -29, -9, -13, 2, -21, -36, -5, -26, -3, 44, -16, -34, 8, 17, -1, -34, 13, -48, 9, -5, -56, -17, 21, -15, 34, 12, 16, 23, 53, 12, -18, 54, -41, -17, 30, -102, 6, -60, 5, -37, -14, 8, 7, -57, -12, -16, 13, 18, -14, -11, -29, -44, -7, 12, -23, -44, -34, -43, 27, 23, 20, 54, -15, 8, 10, 6, 36, 11, -16, 17, 68, -27, -1, 11, 16, -52, 21, 6, -30, -13, -8, 12, -28, 22, 6, 76, 46, -26, -42, 5, -19, -33, 20, 26, -13, -61, -32, 11, 15, 4, -33, 27, -29, -32, 7, 42, -7, 7, -14, -46, 11, 4, 45, 0, 6, 0, -72, -17, 20, -35, -19, -16, 54, 9, 28, 64, 6, -31, 5, -73, 21, -6, -27, -9, -54, -26, 39, 15, 4, 22, -25, -5, -31, 9, -13, 13, -25, -11, 55, -4, 17, 33, 0, 54, 70, -18, -10, 19, -7, 28, -15, 30, -24, -14, 59, -25, 43, -2, -16, 8, -9, -50, -2, 3, -35, -23, 0, 47, 53, 3, 58, 31, 22, -9, -18, 15, -14, -32, -32, -67, -15, 1, 42, 2, -23, 6, 39, 4, -24, -74, -4, -55, 25, -4, 19, -22, -19, 8, -84, 18, -31, 20, -15, -54]
2088e4P8k9k2N1j8kj1K6k0L1j2N8n4j0pm2J0N0j7QK1j2o6J18o9M9n9k4rN0K2k
2120C3l9K1Nl6k2N5rOj7knL6m7k8M8opK6J0J9Pl4k9K2O1o1M5o4PL7o4N5l0N0m8
2155emm3M3j7M4l2OL1l4M3o4L3K3m0L0J3J5n5J7rj1%N2n4lO0m1kJ3K3k4mrK5p
2190A3rj5lN2l4j3pk4NJ6K3K2l1Pm8K5J8K5o9LM0n3J17r3N4m1O9m8rm7L0K3L2
2223C0l5lM7n9K3K8N2q3rM9km7J3M3nl8q7N3PL7k6K2M0j05N3KJ8kn9K8kl2M6j5
2257a8J3k0M2n6M6K1j5J6m5pM7ol8j3M4m0J3K2J1K9o1JQL1p8j8P1l9J5M1l1j0
2289b4POoOL8o0pN0L9q8K7O0n6K3j03J00l5L7m1kK2MN2%j8K6n4K4p2N8p0J18m1
2322B0j5L8m5K9m5O0m8J7Pk3J7m8K2K8m5LM9n8M7Rn4M2k8L7p2N9nO7r1J6K1j9
$$ y = [-54, 24, -5, -27, 24, 6, 4, -7, 19, -1, 30, 18, 76, 22, 12, 5, -37, -27, 23, 6, 14, 35, 23, -43, 75, 6, 55, -4, -28, -37, 13, 35, 33, -6, 15, 20, -16, -38, 17, 8, 14, -3, -5, -10, 26, -21, -49, -1, -7, -14, 12, 22, 41, 48, 14, -15, 7, 68, 7, 52, -12, -5, 32, -32, 23, -7, 43, -5, -9, -52, -9, -26, 18, -14, -8, 23, -11, 32, -32, 1, 24, -16, 14, 27, 42, -13, 4, -5, -16, -16, 36, -18, -21, 39, -2, -4, 9, 32, 8, 4, -5, 20, 13, 4, -11, -14, 38, 4, -9, -16, -40, -35, -19, 4, 26, -5, 2, -46, -21, -3, 22, -47, -44, -4, -57, 60, -33, 21, -20, 49, 1, -8, -55, -25, -2, 30, -5, -8, 39, -20, 3, 31, 83, 0, -9, 40, 38, -9, 4, 47, 42, 4, -83, -30, -23, 14, -12, 10, 50, -55, -2, 0, 18, 16, -43, -15, -17, -49, -3, -18, -5, -25, 17, -39, 7, 28, 13, 29, -16, -23, 24, 18, -20, -33, 11, -29, -16, 6, 17, 46, -15, -14, -6, 25, -53, -71, 0, -39, -24, 17, -14, -24, -17, -11, -17, -11, 27, -33, -40, 10, 49, -39, -12, 48, -8, 15, -88, 12, -23, 14, -27, -29, -7, -3, 49, 49, 31, 57, 3, 27, -45, 13, -57, 61, 20, 5, 43, -2, 27, -18, 42, -6, 11, 18, -5, 12, -36, -14, 14, -31, -28, 21, -37, 10, 19, -35, 7, -21, 16, -56, 3, -2, 65, -26, -10, 11, -8]
2354hp9M4Q4o6LN7m2J3m5P2l5QN1l8N3r7j0k4J26nj25N8qk0L2KJ5%q8J01j0N0
2386F9o1k0K7k7k1N1k0Po6Q7m1oK1Pj8oL8J0n4N5l0m5M4Nj8l6K3M3m2J7k9L2p
2419a1k7J9JK7K9j7K%J0m8N0J8o2j4N0k3N5o3M1Qo9j9K9R3p7Q9q7nkl7J3j3M6
2452Fj6k5MJ1M5on1R4n4k9K7l0K5k6O4o8L5l1j7P7l4l9L0LK0l6pM9L4r6M5Kk2
2485a6J5k8N6p4Rj0P7k2j0M1p1J1N6ko8K6J1k4R5o8%j7j3J1j9PRJ9n1L5NK6m8
2518c2K6K1%k9J4J6J7m5N7q0lN0K9l8qMj7M3l7j5K7O9n3k1N2k0k7L2l0k2O1j9
2550B2m8k6k4N7J4LM9n4N1K7p8J8pL9J3k0n5N3j6%j6l0M9rK9k1k4oknl2J06p0
2583a3kK6nmk4L4J3m2KJ3No0QJ06r2L7M8k2o0K4l0J07n9j5j6k3N1k3j1k9O5j5
$$ y = [-8, -87, -43, 41, -25, -22, 35, -7, 6, -39, 33, -2, 6, 57, 19, 72, -25, -35, -59, 67, 62, -63, -5, -13, -33, -1, 1, 16, 16, -72, 29, 19, 69, 8, -12, 15, -12, -33, 18, -2, 5, -61, 26, -15, -21, 0, 7, -11, -17, 21, 31, -23, 32, 2, -43, 1, 6, -12, -48, -25, 18, -24, -7, -36, -4, -11, -38, -19, -18, 9, 38, 21, 23, 23, 33, -15, 35, 53, -9, -23, 27, 4, 59, -4, 37, 45, -24, -43, -14, 79, 2, 91, 4, -1, -3, -40, -27, -40, 6, -10, -35, -31, -20, 25, 19, -32, 62, 8, -21, 6, -24, 1, -25, 39, -29, 6, -25, -42, 35, 1, -38, -8, -5, 15, -21, -28, 21, 55, -41, 4, 6, -16, -1, -29, 27, -47, -38, -48, 29, 7, -3, 38, -33, -22, 34, 32, -36, -10, 1, -23, 72, 4, 4, -13, -26, -15, -34, -27, -18, 1, -50, -15, -10, 16, -32, -6, 15, 15, -14, 0, 16, 33, -12, 45, -35, -38, 12, 41, 3, -5, -1, -18, 25, -12, -27, 0, 69, 16, -5, 47, 27, 0, 32, 2, -20, 41, 22, -26, -52, -76, -19, -5, -2, 47, -7, 44, 71, -7, 11, 4, 43, 56, 36, -19, 34, 18, 18, 2, -28, 21, 12, 41, 20, -4, -10, -12, -17, -49, 57, -13, -15, 11, 6, 2, -22, 12, 25, -17, -15, -2, 3, -57, -49, 57, -35, 2, 50, 28, -32, -8, -38, 69, 10, -5, -21, -44, 7, -16, -27, -56, 9, -6]
2615fK7j7l0L4L6o2L3jk3l5M6K1rn5L5L9mpm6k5M9JN3p9N8ml9O9r9L3QJ5nP2o2
2650B1j0jlNj5m3N5k6L9rm1N8q6N9j9L6q4Q4j09R5K1m8n8R8m8KJ0N7k5k5l0PM2
2683Ik5rK9k1M4j4j2m6N4m8O5m5L2Pl4K8K6p9PL6m1M1l9K0k4L6j3l5O0jrl2K3
2716a0r6J6P9K9n1M8Kl3K6MK4J1m6%K8k0k6J2m0N7L5l0j6Ml0P1k7l0l3M1j5nO2
2749D1n6NpK1L5m0K4Jn2M0j1K1Om1J8ql1j5R2n9lK7j0K0lO0j06M2k2M9o1Kjj5
2783c7mK3J3Rk8J4L8l1O1r1M%M2rk5K0M9p0j1K0nK7p6K8J3P2m3K1jj3m4N2l6K8
2817A0p6O6L8j3l3mk7K7M9%k0mk6PJ2L3r0J1N6J2k2m5Q4j8j9L3q3O0k0k8N9j0
2849A9Nj18J14m0M4oL2n5j6L7jl4kK1L7k1K6r9P8J2m2K2L0p3J9N8j3p1M1k1j7
$$ y = [-6, 21, 4, -26, 8, 44, -18, 15, 14, -9, -44, 2, 23, 14, -41, -6, 33, 29, 22, -24, -49, 0, 1, 54, -25, 33, 29, -10, 59, -40, -7, 1, 16, 11, 83, 21, 11, 10, 7, 12, -3, -46, 9, -17, 22, 13, -28, 30, -56, 3, -16, 20, -64, 20, -89, 6, 27, -21, -79, 19, -29, -27, -17, 40, 15, -10, -40, -33, 9, -16, -25, 4, -17, 27, 13, 1, -45, 9, -39, 26, -19, 13, 20, -14, 14, 40, -39, -32, 4, -37, 4, -35, -15, -39, -3, -16, -51, 9, 8, -1, -33, -10, -106, -90, -11, 18, -33, 15, 17, -16, 10, 14, 38, 49, 3, 3, 31, 11, -15, -3, -43, 14, 49, 19, 3, 7, -23, 48, 21, -9, -42, -1, -16, -21, 41, -15, -10, -17, 4, 39, -1, 23, 24, -28, 12, 1, 22, 28, -13, 5, -3, -34, -49, 43, -16, -19, 8, -2, 18, 15, 75, -31, 11, -11, 38, -23, -21, -22, -37, -41, -18, -5, 4, -24, -10, 28, -3, 58, -33, -29, -29, 13, 4, -21, -1, 48, -22, -33, -13, -18, 9, -67, -39, -26, 46, 3, 24, 23, 10, -34, 18, -18, 10, -66, 0, 38, 25, -8, -12, -39, -12, 37, 37, 17, 13, -13, -6, 6, 39, -51, -40, 16, 28, 6, -39, 45, 27, 8, 41, -42, 18, -2, -30, 29, 19, 24, -94, 20, -20, 24, 18, 50, -5, -21, 16, 15, -19, -21, 0, 37, 16, 42, -57, 21, 33, -9, 13, 43, -30, -11, 47, 34, -37, 4, -17, -34]
2880c4j2N2q3J1J16n7Lk1M3lm0O7m2mL0k8J7m0L2k1L2l0l6P6l4k1Q2p4O8k5p6
2911e2L4lL9l6j0M3mJ6k4K1m1LL0K0l3k0Rk7N3o2M2Lj3M9n2jL9j7k3%O4o3M2j9
2945GRL7m6L4l0j6l3O9n7kK0j1oL9K2m5Kk3k6K4oJ8lK7n6rO8J1l3k1O7l5j1N9
2979D4j4j25J38N%j20O3RJ5K8n8M0Jk7l7L9J2l4Ok3K2J5K0j7j6Pj6J3J0k3J0M4
3011C1m3l4K9j5LK6m7O7j15J07j9N5m2J2K0m4M3J2n4N7k2o4PLQ7j6k1k8j8prK8
3043a1l2M0mK6mK5q0N5n7M6k9JN5l2M3rl8PK2k8J0L3l3NNjj2K1l2p1Q5J6p6M6
3077hN8l2%q4L7M0k0k1L0j9j9K0l9M8k9M3Jo7O9j6J4LL9m9J8p8L7K8O1j4j2r4
3109e5P3l1L4k8k0O5k7m0K0J0k3j0j3R4q0N6l8j1jL1QRm5J7j9L5j00P8m9N4Lk9
$$ y = [-34, -46, 6, -77, -66, 50, -7, -4, -25, 18, 15, -25, 42, 0, -4, 26, -2, 15, -25, 7, -14, 18, -12, -48, 28, -6, -27, 55, -19, 49, 24, -52, -18, -21, 18, -18, -28, 15, 11, 27, 3, 24, -17, -14, 16, 36, 3, -17, -8, -35, 18, -44, -2, 1, -12, 37, -15, -16, 23, 6, -17, -17, 47, -16, 26, 7, 16, 53, 7, 41, 11, -5, -38, 31, -26, -28, -8, -19, -25, 14, 36, -9, -7, -30, -56, -32, -38, -20, -23, 4, -52, -61, 7, 18, -15, -36, 31, -4, -15, 44, 30, -95, 43, 48, 48, -72, -9, 0, 15, 43, -15, 25, 26, -1, -38, 1, 13, -21, -15, -38, -16, -1, 19, 2, -14, -7, -23, -10, 0, -23, -13, 31, -12, -46, -17, -32, -29, -3, -50, 17, -98, 9, -10, 45, 3, 15, 35, -9, 34, 46, -8, 49, 27, -37, -30, -27, 60, 44, 23, -5, -23, -30, -39, -11, -43, -3, -7, 19, 15, 40, -40, 15, -42, 4, -25, -24, 31, -1, 42, 33, -5, 2, 24, -4, 6, 39, 6, 11, 16, 15, 3, 24, -8, -79, 6, 22, -54, -8, 50, 18, 18, -66, -29, 11, -9, -30, 0, -19, -38, -18, -57, -9, -38, 5, 6, -61, 8, -8, 6, 9, 48, -1, 17, -61, -24, 4, 65, 51, 39, -55, 18, -13, 21, -7, -27, 38, 11, -29, -9, 1, -22, -32, -45, 49, -31, 25, -13, -24, -25, 6, 14, 23, -22, -5, -24, 11, -89, -11, -60, -6, -3, -32]
3141c2O1l7RK3rJ3l3k5M2J6m3k2P0q2R7p0qN7m7N5ol8k4N9L4l7lj9m1P0o6kL2
3174fK3rj8L6o3M0K8k5n3K6M3k0lpk1M6j2mrL7j9L8q2L7Qnm0L1j0P9m6j9L6j5
3208B2J3l7k9J5k8K7O1k2j7J0Jm3K5j1J9j3NNJ0Pnk6l9P8j4k5MK4L8q1N1k7j1
3241a3M0r0M3j1KL1O2m5K3%l3Kk7J9lJ5k0m2P2n9K4j5j1L8l1KN6k1l2M7k1Qmj
3275Em1Q0l3l6J5O2o3N0rj1n3L6l7O3l3m2M7Ll6P1o4O1qj19M3K5k8N8l2L7m8N5
3307A8qn1L0j0MK7PJ2n3L8L2k4k9p1J06L7kp6Nk1L7m4J0mO4j02J9L1jN5p8J0P
3340b5Rm2M1j1k6P9j7L2j8l5N7o6K2LLJ9m9l4R8m3j2mjN9o6KPN9n1J0J7k2j9N1
3374B7k9k4LO5j08L2M3nj6J0mJ2l1L6m9M3N4q9L4knm7OR3n1j1Mo0M1K9pRJ1K8
$$ y = [-32, 29, -8, 1, 24, 15, 28, -5, -30, 12, 28, -15, -37, 33, -49, 48, -22, -30, 27, -20, 35, 29, -9, -33, 26, 60, 23, 20, 1, -40, 30, -36, -38, -6, 17, 8, -10, 26, -37, 3, 31, 6, -47, -21, 22, 2, -1, -8, -29, 17, 5, 1, -8, 29, 10, 48, -34, 3, 11, 6, -34, -3, -13, 66, 20, 1, 37, 22, 35, -2, -31, -16, -44, -17, 44, 22, 5, 15, 16, -27, -2, -13, 6, -7, -2, 3, 13, 20, 15, -11, -50, 28, 14, -11, -7, 17, 55, -26, 25, -2, -13, 27, -63, -20, -31, -29, 2, 64, 19, 42, 42, 9, 11, -16, 3, 0, 15, -5, -47, 25, -34, -10, -25, -36, 2, -29, -27, 29, 8, -24, 23, 2, 10, 6, 5, -36, 44, 11, -25, -10, 52, -11, 39, 30, 19, -34, 2, -35, 28, -5, -47, 0, 3, -33, 38, -26, 35, 27, -92, -49, -24, -52, 6, -26, 11, -37, 18, 10, -41, -11, -21, -17, 10, 17, 29, -24, 14, 46, 22, -7, -78, 28, 65, 63, -13, -8, -29, 8, -36, -26, -30, 34, -68, -49, -18, -19, 36, -42, -32, -25, -16, -58, -17, -28, -54, 25, 8, 40, 22, -13, 44, -22, 0, 3, 6, 25, -24, -58, 40, -3, -15, -19, -20, 39, -27, -25, -18, 41, -10, 0, 17, -5, -24, 27, -2, -26, -23, 42, -66, -34, 9, 4, -12, -2, -6, 6, -25, 11, -38, 5, 59, -30, 4, 2, -3, -50, -44, 49, -2, -13, -9, -69, -28, 1, -6, 3, 14, 42]
3408D2m4pqk4J1M6m7N2j7J8ll0K8n0M8n6K3L8l4M7j3o6R6j10K1N6m1J2k6KO0r
3440A5m9m6J08m2K0k6j2N3j4J5o0k3N0n4N1J4l2P9o6KN4n7K7k7L0rM5j06J3K4
3470b3k4O9%n9K2L9l3k9N1K8m8m7L8N5k5l6pL6QOK2o2K0L3M1m3m7K2K7K9m5k5
3502gL2j9o4O0L9k8Pk7pML3Pn3M7l7jJ5M1l3M1l9k2K0k3K0k6K0k8L8J0l4K8k2
3535hmk0N2K1p1K0J4k3K3qk8K2j5M4l8L3ok3rpl0P6Pn2J7j9K6oP4o8K4nn2Q5j9
3570B7l7L9m6k2N1Q7n6j4k5QK8n9K5J0l9K5j1lL2m0J6K0l4RM0o0K0l5N4j5oq1
3602i2O7Q7m7r1N7J1N1o7M1ML3q0O6n3L7n1K8RpL2j1j4J6l4Kpj9N0q0O7MKj5j2
3636a6M9pp5M0J7L7r9M7rQpP3o8k3J9k3M2J6K9pl1j2J0j9NpL0l4lJ4jKP2j01O3
$$ y = [42, -2, -9, -17, -41, -30, 16, -31, 21, 4, 22, 19, -11, 17, -33, 15, -41, -18, 20, -14, 33, 20, -46, 50, -60, -39, 17, -24, -12, -38, -36, 24, 15, -34, -80, 28, -14, 6, -20, -32, 21, 7, 22, -38, -61, -11, -65, -14, 0, -32, 47, -19, -17, 37, -20, 7, -20, 10, 1, 46, -60, -47, -23, -47, 22, 22, -37, -15, 24, -9, -38, 13, 41, -7, -54, -16, 39, 14, -22, -29, 7, 15, 21, 43, -19, 1, 34, 75, 32, -15, 7, 34, 63, 18, -7, 25, 6, -58, 2, 41, 13, 20, -7, -14, -10, 23, 30, -23, 24, -13, -14, 1, 42, 9, 50, 11, -11, 9, -14, 6, -20, 0, -28, 10, 20, -14, 14, -8, -12, -32, 20, 41, -30, -10, 4, -19, 4, -4, -32, -10, -25, 19, -19, 14, 8, -15, -24, -31, -61, 15, 22, -30, -13, -32, -6, -12, 62, -6, 18, 13, -39, 46, 27, -10, 29, -17, -39, 12, 99, 43, 29, 4, 12, 40, -19, 6, 16, -23, 2, -9, -12, 20, -20, -4, 16, -18, -9, 31, -29, -9, -44, 10, -5, -11, -92, -25, 62, 15, -76, -19, -8, 43, -24, 17, 21, 54, -26, 40, -13, 24, -27, 1, 10, 3, 35, 24, 10, 26, -8, -6, -13, -32, 18, -62, 5, 9, 11, -4, -16, 33, 26, -49, -9, 8, 45, -54, -7, -16, -8, -15, 58, -10, -33, -14, -37, 5, 21, 50, 43, 12, 0, 10, -9, -4, -11, 19, -15, -18, -4, -5, -3, 69, -32, 31]
3671C1m2K1krjO7p4Rj2j5K1k7JlK3K2k2Oj1m1N1oJK0QO9p3l0R6o8K9k0j7L5m5
3706hJ4l1K7nJ7J5Lk0rOk3k9O2j03P5m5Q7l5mM7l9l0J6k5J2j9O9j0%nm4N2Qk4
3740BL1k2k4l7O9pO5k8n3K1n3N6J0o5O5j12P7n3N9J5m0KPk2M8l9K5m6R4l4j2j3
3772a4m7N4jNQl3J0L9l9L5l9M0J3n2J1k7O4j4K0k7j9J7n7N1%J9l2L3%m9L0k8L5
3805Fm3M1M0o7N9J7o2Mk8M9Kjk7m7O3M0m8pN3J0n0L6p5O3p4K9K0k7L5m9k8K2N1
3838Gj9K0Rp0N4O1n3j6k3LM1j5qR%m1J5M7PKp1N5n3N1l2M9m5K4l6m5P0o7R0N1
3872G1q8M3q0N9l5kN4Nn5J1qK3k2qNL3j1KrLrm5M7PJ1l9O1p4LJ9L4l1M2jkL3o6
3909a9Q7n4lJqKl9M3JLp5R4k8MM2q4M2j4O9l6k4j2Ro3O7p3J08j3j5j0J3k7O4o6
$$ y = [31, -11, 10, 8, -1, -2, 65, -9, 0, -12, -27, -6, -33, -32, -35, -12, 10, -12, -6, -17, -58, -7, -13, -12, 8, 16, 85, 12, -18, 78, 10, 39, 19, 2, 37, -8, 6, -25, 2, -3, 14, 29, 32, 12, 3, 9, -14, -43, 19, -84, -9, -54, 33, -2, -6, 41, 2, -28, -12, -37, -25, -44, 25, 15, 15, 10, -34, 18, 26, 2, 33, 11, -13, -50, 19, 12, 77, 49, -4, 17, -36, 20, 30, -35, 30, -82, -5, -58, 1, 16, -24, -22, -15, -37, 11, -28, -3, -49, 45, 11, -1, -14, -61, -7, -8, -3, 5, -28, -18, 21, -18, 17, -22, 18, 31, -21, -10, -37, 27, 13, 33, 6, -13, 4, -53, -2, -2, 17, -15, 18, 18, -31, -1, -29, 6, -37, 4, 44, -23, 36, 53, -9, -5, -33, 16, 18, 17, -10, -57, 6, 46, -2, -9, 44, 54, 4, 40, -35, 28, -46, -17, 3, -24, 11, -38, -66, -44, 7, -12, 8, 17, -53, 1, 62, 9, -7, -30, -27, 14, -1, -9, 0, 0, -41, -26, 21, 28, 30, -41, 14, -39, 12, -20, 29, -16, 8, -28, -73, -3, -70, 20, 71, -17, 26, -54, 5, -30, -32, 22, 27, -28, -17, -25, -2, -24, -32, -27, 6, -5, -3, -12, -9, -18, -63, -16, -9, 2, -37, 24, -50, -47, -28, 6, -25, 17, 16, 14, 47, -19, 68, 14, 11, 12, 4, 6, -33, 10, 11, 14, -61, 33, 5, 9, 51, -33, 9, -5, 64, 28, 4, -8, 1, -62, 5, -68, 40, 27, 12, 2, 15, -12, 52, -14]
3943a4O9m0m2K5O5ql6L7l9lm3K2N2o7K9j5L5K1m5O8j41M6M2Lm3J5n3N2Jn0P5j6
3975Bn2L0N4o6P6p1j2L5j6K5m3P7l7M5j0J9m3kM3j13N2k7L7j9QJ9k9N7J3p8J8
4006hM5M2l4j7K1n3J5K3l4O6p6MM1p9M9l0K5j9j9R8m9K2rjl8K8nn8N9n4K8Pk2
4039c2M5l3M0k6K1Rrl7K7oOm0%O3l8JK8m3J8No0N5Nj9L0l4M7K2o5J25p1o8N7o
4073A7m1N9n1L4k7L7M7q4K3J5rk0MkK5k6j6K7j5J8m3P4n4L5j3pql4M0m1M6j4r
4106a3M8l7m1O6Ok1l9N5K0l4j4Rk1K8M1m1K2qk2K5l2k5j7O3PLk7m6L5oO7n2l0
4139c1O6k9rmK5j0j5M1M8j05L5o2M3j1JK9K9j4M9l6o3M0K1n5L6k4N9l8l6J6P4
4170G0o1N3k3j9p3QK3l0L7L0k6K7K5k4J1oK6Kk5k4k0J9j0J4L0n8L2L7J7k9l1k8
$$ y = [-14, 55, 15, -27, -2, 63, 55, 19, 56, 17, 14, -29, -7, 45, -22, 7, -8, 27, 48, 3, 71, -70, -24, 18, 21, -22, -7, -60, -8, -7, -57, 18, 2, -50, -20, 34, -32, 44, -27, -39, -4, -20, 5, -38, 39, 2, 47, 37, 56, 13, 11, 54, -59, -7, -34, 3, -16, -8, 11, -18, 39, 52, -26, -8, 37, 79, 45, 28, 49, -4, 11, 34, 0, 66, -10, -6, 35, -44, 5, -25, 0, -19, -38, 60, 11, 33, 24, 23, -15, 13, 8, -50, 9, -45, -17, -10, -32, 13, -20, 20, -6, 15, 24, 15, -22, 5, -1, 5, -35, -35, 28, -10, -9, 19, -24, -6, -1, -61, -6, -1, -20, 10, -24, 23, 45, -20, 105, 34, -34, 23, 17, -24, 35, -16, 18, -9, 28, 75, -9, 14, 29, 20, 0, 4, 2, 27, 1, -15, 12, -3, 15, -28, 46, -8, 27, 14, 7, -1, -35, 5, -36, 10, -4, -13, 35, -2, -43, 23, 29, 8, -31, 24, 44, 10, -4, 5, -16, 12, 53, 12, 34, 26, 4, 29, -3, -28, -45, 18, 25, 28, 1, -45, -10, -16, 51, -1, -31, 35, 6, -3, -7, 18, 8, -7, 34, 82, -23, 12, -50, -7, -18, -17, 12, 41, 27, 76, 40, -23, 17, 38, -17, 19, -5, 54, 16, -20, -4, 70, 9, 62, 39, 20, -53, -45, -22, -52, -15, 15, -11, 16, 41, 17, 28, 22, 48, 50, 25, 1, -19, 0, -10, 4, 34, -24, 8, 45, 62, 33, 2, -26]
4202b6J8J2n8N6K7ok7MrN0j2l1J5Mk1m1K0n9P4J7j7j5K5M2j1j01N7pK4j4j3J9
4234dJ2mj2K7mL8o6K8j3k0l3M7j1Q7p8K4nj4NL8l0K3l0nK4ko3M3O3n0K3k1jnN
4269A6l2J2K3K3L1j06N5l0N1l4rj2L4k0nJ6j6M3K7r4Q3o9KN6k4J4k9RrJ3J5m4
4301a0J0m4N7mj0j1Mm0N4m6M1k0j1M7Kmj5mlj4M0K9m1k6k5J02n5m2R6k1rn8l5
4334f6O7NN2r7M5L5p5LkRK3l2M2o8M7j5QL2k1J8l0K2rj8L8j7O3q2Q0j3n7JJ0N2
4368E0r0M2M8n4O2k9j0n5M7k6j2O8j08M7L7pPk9K6j4k2L1ll7k7J03n1k7n8J05
4398A4K8n6kN8n8%O2n2ll1K2K5k2Oj2m6M9Lk5L4M3l3%m2J5mK9M8p2Mj6N4m4k4
4432d8O8m5pO0k9J2j6j2n5L5R2l2J7J9n0J0Pj8NNj3l6M1k4K2N7o9k0L5M4k3K6
$$ y = [-26, -8, 4, -54, 2, 29, 23, -4, 0, -9, 41, 29, -2, 13, 17, -4, -45, -25, -84, -10, 7, -10, -25, 0, 42, 31, -70, -13, -20, 4, -10, -23, -4, 8, 4, -8, 19, 15, 53, -13, 15, 2, -18, -51, -4, -15, 72, -6, 18, 13, -1, 4, 42, 12, 35, 5, 0, 24, 22, -41, 2, 65, 15, 38, 17, 16, 11, 16, -16, -4, 19, 42, 73, -33, 22, -8, 43, 9, 0, -12, 22, 2, -3, 13, -3, 40, 67, -27, 56, -13, -11, 45, 21, 35, 6, 15, 6, 19, 34, -10, 0, -44, 13, 9, -1, -12, -8, -48, 6, -40, 1, -19, -30, 17, 19, 15, 0, -4, -7, -21, 19, 48, 7, -19, -44, 58, 3, -39, 57, 36, 27, -31, -66, 1, 6, 58, -39, 6, 41, -34, -31, -33, -24, -1, -33, 9, -59, -12, -27, -19, 13, -8, 10, -20, 2, -7, -25, 13, -4, 59, -23, 57, 44, -13, -12, -2, 50, -40, 2, 50, -4, 58, 29, 19, -36, 11, -15, -27, 41, -67, -20, 17, 10, 17, -12, 14, 0, -22, 9, 6, -31, -58, 45, -6, -33, -91, 14, 42, -14, -16, 42, -16, -16, 46, -6, -9, -40, -18, 7, -15, -9, -21, -67, -18, -15, -40, -6, 37, 4, 4, -38, -23, -27, 2, 50, -22, -18, -34, 20, -24, -48, 20, -25, -32, 28, -1, 11, -5, -17, -72, -37, 55, 23, 40, 59, 9, 19, 26, 8, 13, 18, 5, -31, 10, -14, 8, 65, -4, -24, 11, 55, 32, 58]
4464E8p6O7j03L0L9r3O3j9O7l0k9M0k3K2j9k5K6J5K2k4N9o2LK6k4J7l2k3P7n8
4494iJk3L3OljRJ1l4K2n1J5K3n7R4l5Ko4P9l8J6J1%k2P7m3m7Pp7R8k8P7o0K0J1
4529B0l1lj7K6O8p7L9ln0N8j8rRKJ9rm5OL8j4J4K2q0M7J4o3QM3l6J2j2K9k6QL1
4564B0j7K4n8M1j3Qmm9O0K7j7m5K5J2rk7J9N1p4J5K9K9m9N7l9Qp9j3J8M9L5l3
4596Ak8LK5K2n9M1j5%m9O2J9n0rK3j3Kj3P7n6J7K9n8N7n9J6j1P7n9L1l1j9J0N5
4629C8l7o6L7mNm6Q7l0k2N4m7KrP8j4p0N9l5M5l7J1n5RN0j6O2nm9j3kK3j2lL2
4663B0k1n5O1m0QR6o1Rm0J3J2Pm0oK7lP5o4Ml4KRl9N9Rj1l9R3m2m1L1N8p4lP4
4698E4k2j2n1NN8l7%M6m0Qk5K2rk7R7j19P2L1o2L6n9P5n1l0m3N0M9k8K4n1k0O4
$$ y = [58, -18, 49, -54, -24, 15, -78, -15, -34, 33, 3, -26, 14, -9, 13, -6, -31, -5, 10, 32, 8, 67, 5, 8, 34, 10, 27, -5, -28, 49, -9, -8, -31, 2, 8, 5, 4, 13, 24, -10, 12, -39, -24, -1, -58, 36, 1, 3, -61, 18, -20, -4, 7, 7, -15, 62, 19, -28, -21, -98, 0, -28, 49, -11, 9, 20, -11, -14, -31, -5, 63, -14, 25, 22, -28, 30, 12, 3, 12, 14, 33, 24, -21, -15, 23, 9, 23, 45, -35, 12, 26, -37, -29, 14, -22, -10, -22, 7, -19, -11, 20, 3, 27, -31, 10, -3, 5, 1, -48, 12, 39, 22, -23, 2, 14, 5, -22, -3, 48, -26, -11, 18, 47, -2, 55, 16, 24, -55, -68, -50, -1, 34, 1, -27, -24, 1, 23, -36, 5, -10, -10, -59, 3, 22, -28, -37, -14, -27, -25, -38, 39, -17, 0, 29, -29, 28, -31, -15, -26, 51, -8, 23, -8, -27, -17, 38, 1, -65, -28, -32, -27, -73, 14, -16, -38, 16, -31, -29, -38, 40, 26, -44, 15, -20, 25, -12, -1, -56, -47, 3, -13, 49, 44, -5, -18, -20, 3, -9, -12, 20, -1, -56, 5, -35, -27, 69, 8, 17, -23, -10, 2, 9, -31, -37, -10, -13, 62, -2, 2, -32, -30, -21, -60, -1, 8, -3, -42, 51, 9, -32, -1, 57, -17, -20, 54, 32, 20, -31, -26, 32, -5, -5, 41, 1, 9, -16, 6, -3, -30, 67, -52, 20, 51, -11, 25, -34, 41, -10, -40, -83, -33, 16, -12, 12, -39, -59, 5]
4730Ek4rnRP7o9j3LK0LPj5Q%j5K6K1Ol7L4j1k1k3M0j4J5J0j6Mm8J5jJ5L1n4L1
4766EN3p5M7o9J9J8k1L4K0mq0L0k0M2K4j4nK1J4p1K3M1o8L1M1m4L0j3k2M7q6O3
4798A1Jprn3O6J3m9O1j1k1k8k1J6kJ8pK7j5L0q1Q2n8M5rOM2k3j8l0L3PKj4K2j4
4833A2k7N6k7m4R3l1j9J8J5n7Qk0P9j6n3M5p9pM9l4N2k8m9P6J8j9K4l8Lj7Jn5
4865g1R3k7QK6l2N9o2J3n9L7L5l9K9K7k3N9p7M4p2M8L6J4m5r3Q2k3QnK5l8M2p
4897A2jn3K3jk7J4L5M8pp9K8M0m6kK6LLK4o8L2pK6%n5Jk8L6N9n5QJ4M4m1m5J5
4932b4L7o0M3j8L8n8K8OJ5j7o5O5J6rQo5N7j0O4l6ml1k9Q1m5L1J3m4Koj5rN1N3
4966F3j00J5k8O0k4L0l0L7o3Q0Ok0pJ0p9O6kl1%K4K7k0qk9lK0j5L8qlLk3QN9o2
$$ y = [5, -19, -28, -33, -24, 53, -16, -29, -26, -6, -3, 4, -11, -3, -3, -18, 8, 29, 35, -2, 32, 21, 0, -23, 17, 3, 18, 28, 12, 16, -32, -17, -18, -3, 28, -26, 5, 58, -17, 30, -39, -20, -2, -23, 11, 31, 27, -53, -23, -43, -1, 23, 9, 4, 25, 39, -32, -9, 32, -36, -5, 36, -8, 22, 9, -13, 34, -52, 11, 12, 5, -4, -57, 9, 22, -27, 34, 23, 2, -26, -47, -31, -33, -15, -22, 5, -10, 20, -61, 21, -37, 8, -1, 5, 47, 24, 6, -24, 9, 16, 18, 4, 26, 12, -15, 41, 14, -30, 63, 32, 13, 31, 46, -11, -3, -23, 56, 40, -13, 32, -47, -54, -5, -39, 13, -15, -64, 12, 30, 11, 35, -3, 0, -17, -16, -71, 22, -5, 3, 29, -3, 56, -6, 7, -52, -15, 20, -19, 10, 37, 14, 73, -4, 40, -32, 16, 52, 66, 21, -72, 10, -13, -5, -10, 15, -23, 19, 12, 11, -42, -19, -20, -47, -33, 2, 50, 43, -36, -8, 32, -14, -16, 10, 13, 16, 40, -28, 4, -3, 23, 23, -32, -31, -59, -23, 36, -19, -11, 3, 47, 6, -39, -24, 13, -47, -4, -22, 16, -42, -14, -8, 7, -10, -75, -10, 6, -3, 5, -60, -3, -13, 51, 15, 11, -20, -49, 32, -13, 18, 31, -13, -11, -17, -32, -41, 10, 63, -37, -22, -50, 10, -14, 16, -14, 23, -40, 40, 46, 26, 19, 29, -50, 16, 14, -17, -17, 7, 34, 14, 6, -23, -26, -6, -21, 17, 9, 6, 9, -14, -6, 53, -9]
5001ik3J12o9J3j2pJ3m0K4J4m0L2K6p4O4Ln6J2Mk4P2Qj26Q2PJ3o8K9K2J1l3OJ4
5034@k4M8j9k1MM9l9l5L3K9pOl7QJ2Ol1noR0n6m7L1k8L0lqJ3M2l7m0j1K9N9k0
5069A5n8R2r2P8p1L0O1o3j6N3k9K9rkK2n1J2j9RK9j8mJ3m1L4qRoJ8l0J0LK5l8
5103a3j3J9J8km0kM3QJ4o0L4N1m1lk8J5N5m5%l6OL4Om2K4%K6j4L3l0ON8r8K8Q
5138A9o2QN3k4kK1%j2pj4K1j6M5p7N2o9L1N6j2okPK0k3J2nk8L4j0P1r3K5j3M2
5172D2l9L3J2n3N7p5K6j9J3lK1j4m8L8j9j1mm8N0j0J7J0J8j2%M1k8NJ3QmM6p0
5205gL7n6N5o5l9J01l0L1K4lq3R5k3Jl7%j0N6m7J5K9jk9l8J3k4M1L1k7n0L4Nj1
5238a2J0K1m3N0q1O3NJ1Jm2j9J9j2J9lK8l7MM5k9l6M3K4J4m4l0O7n1KM7l9K9m5
$$ y = [-9, -32, 80, 11, 24, 12, 5, 18, -22, 2, 16, -24, 8, 34, -40, 24, 27, -29, -17, -13, -37, 35, 43, -83, -1, 6, 19, -49, -20, 2, 13, -20, -14, 0, -24, 24, 5, -16, -12, 37, -2, -37, -4, 25, 18, 24, -13, -5, 7, 13, -18, -23, -29, 61, 5, -42, -11, -39, -9, -12, -20, -7, 35, -2, -42, -53, -24, 35, 15, -43, 49, -43, 35, -36, -6, 55, -8, -24, 29, 0, 29, 20, 18, 40, -11, 1, -18, -9, 20, 2, -2, 11, -30, 4, -4, 5, -1, 17, -13, -3, 0, 25, -13, -26, -7, 11, 9, -31, -33, 10, 18, 32, -28, 6, 57, 16, 13, -15, 0, 55, 10, 10, -26, -20, 14, 20, -22, 2, 2, 28, 14, 47, 17, 23, 81, -17, 11, 19, -43, -35, 18, -6, -8, 13, 13, 1, -6, -20, 1, -15, 30, -47, 5, -64, -33, 23, 11, 5, 3, 10, 30, 7, 19, 14, -14, 20, 10, 81, -12, 13, 0, 42, 3, 36, 48, -5, 52, -23, 3, -16, -3, -6, 15, 1, -47, -9, -28, -39, -43, -91, -41, -51, -34, -24, -6, -18, -18, 23, -5, 0, 13, 21, 17, 63, -7, 30, -26, 29, -36, -75, 26, -4, 27, 51, 48, -35, 60, 37, 38, 1, 1, -9, 47, 0, 15, 44, 43, 14, -24, -11, -35, 6, 37, 10, -40, -6, -1, -12, -2, 19, -24, 26, -55, 8, 13, 24, 25, -17, -36, -17, -29, -10, -13, 15, -22, -18, 27, -2, -38, 5, 29, 43, -1, -31, 36, -15, -13, 34, -5, 24, -21]
5271b1JlL9j8J6J5n0N6k2m9K5%RPJ8k0M5k0q1M1pj7jM8Kk2J7l4L5J7m1M2om8K9
5306BmM0j5Nm2K4o3J7m1R0Kj8M1o7M7l2joJ5Kl4O7p7M1J7L9J5po1KoN2K1o6k9
5341c0K9JJ6k4J8k9Q4o2J4N8p9K7m5K9m7P4n1K1k5j8L3j9%M6l8K9K2L5p2J2K8
5372C7k4k3OL1p2J11l8J7q0K1RK8rl3O6o7L8J8q3O8j7J4Pl7kj3P4j8m0K5l4J4
5404fj4M9Op6J3M1Qk9K1k5l0O4J0K1m0k7L1M3p9J5QoL2pp5Q2j7j6J4J5k7o9O4
5437fk8J00o9j2LlJ5L6m1K5m0pK5OoM0n7k3K3K3Lj5OK2L3j9p3N9Rk7oK1J3n2J0
5472a2l0N9l5K1%m1L8K3mm3K6p0L3M3nK7m7ln9M1J2PLN1l0k0J2P0o5l2K0N7l7
5505A0m4L4m1N9K9Kl9m3J6j4k2M8M3p2M2ol1l1N7L9q6mK5j0j0O5j2J7L1p9L7m7
$$ y = [-21, -20, -23, 16, -2, 14, 29, -21, 35, 13, -36, -11, -11, -2, 5, 23, 3, 48, 28, -53, -12, -19, -36, -37, 11, 13, -9, 8, -26, 9, 26, -15, 27, 21, -27, 2, -2, 38, 23, 28, -14, 10, -53, -36, -77, 13, 15, -3, 38, -29, 18, -14, -15, -21, -6, -4, -38, 29, -48, -7, 10, 49, 64, 57, -4, -2, -8, 44, 65, -1, -30, -1, 0, 16, -8, 10, -19, 65, 3, 17, 75, -4, 23, -22, 7, -40, 34, -17, 4, -21, -39, -6, -25, -25, 21, -17, 12, 34, 69, -3, 9, 37, 13, -10, -4, 27, -45, 66, 28, 45, -35, -14, -5, 23, 14, -19, 47, -20, 18, 36, -47, 21, 4, 18, 25, -12, -14, -27, 47, 29, -11, 14, -20, -6, -20, 29, 35, -41, -28, 13, 21, -8, 13, -12, -42, 22, 32, 53, 13, -14, 17, 60, -19, -4, 4, -2, 30, 23, -52, 30, 13, -3, 11, 26, -1, -70, -6, -34, 66, -3, -15, -12, -15, 0, 36, -5, 20, -20, -27, -2, 4, -2, 38, -19, -42, -19, 4, 7, -8, -2, 20, 53, 34, -39, 20, 29, 2, -4, 17, 30, -22, -12, -42, 17, -18, 3, 3, -38, 0, 23, 19, -24, 2, -68, -35, 8, 3, 30, -17, -20, -79, -38, -26, -19, -16, 35, 5, -15, -3, 67, 2, -30, -10, 47, 10, -34, 0, -41, 18, 47, 49, 10, -33, -17, -31, -53, -5, 38, -34, 8, 2, -29, -60, -3, 36, -50, -54, -29, -39, -49, 16, 4, 21, 52, -27, 10, -37]
5537c7J5K5Ml0%J8O5Lj05JK6O3l8l5k6O1n4J08n9K6l7Nk6K3M9q5OJ3M2j1P2p2
5569A0Pj9o1R5m5l9R3l9PNj2l2oO6n3O9o5oN1j0m5O0j2l6M0k1L1k6j2O9j34K0
5601e0OK2L6mq8R5J2m1rO8j09P8m3N2p8M2K1l3l5J4K4J6J2Qk5jk0J3j0O4q2J04
5633E9k1qj9m2M9j2Pm7MJ6M7q0k1M2P4q3N2mk7l8rQ0n2L2l6M6o6R9q9O3j7J1n
5666En3J2O1j9K7K3p5L1nl7P0n7k2N8j5Onrk8L2k2J5oJ1No3L0J9K3l8m9K2M6M1
5700C4l0pM2l4m0N5nL2m8L9Rm5M6k3RjPOj6oO2r7P2p4pLL7o6M4j4j1k2Q9m9j1
5735b0qL0pqk8K0P9n2rJ3l3L6l1J7j9M8J6n0K6O4m0l4l7j4N9J6m8J3PN6n6l2N1
5768B5o0Q3l7kl7l2J8j1K4L4qK0n1L1J0nk0j7R2n4J7k4k7P4n5j0K1K3L6n9N5o1
$$ y = [-37, -22, 3, 7, -23, -23, -5, 60, 63, -42, -41, -15, 48, 10, -25, -51, 10, -44, 64, 5, 31, -6, -1, -27, -4, 45, -40, -34, -21, 21, 10, 82, 10, 17, -2, -63, 32, -13, -52, 41, 2, 9, 14, 2, -30, -36, 30, -23, 46, -19, -25, 26, 16, -29, 31, 19, -17, 23, 2, 33, 7, -5, 64, -70, -50, -44, -22, 14, 10, -78, 17, 29, -12, -21, 47, -62, 16, -27, 25, -53, -11, 10, -23, -58, -44, -20, -4, 8, 16, -9, -10, -30, -17, -27, 37, -45, 59, 38, 30, 11, -31, 18, 6, 13, -34, -30, -14, 33, -47, -68, -26, 48, -35, 17, 13, -14, -52, -61, 19, -33, -1, -37, 9, -57, 42, -47, 16, -1, 10, 5, -48, -36, 25, 6, 33, 56, -19, 12, 7, -30, 40, -17, -39, 19, 4, 10, 5, -4, -32, 0, -22, -7, -13, -2, 3, -60, -30, -11, 12, -26, -75, -53, -7, 34, 4, -3, 39, 5, -35, 20, 15, 47, -1, 38, 47, 2, 48, 25, 34, 33, 40, 46, 30, 24, 86, -11, 61, -13, -20, -17, 20, -46, -2, -16, -27, -49, 40, -9, -20, -28, 2, -5, -13, -41, -21, 58, 6, -3, 10, -23, 13, -18, -1, -20, 28, 44, -6, 20, 84, 44, 10, -27, -41, 18, 34, -14, -1, 6, 62, 6, -26, 25, -35, 48, 11, 9, -28, -60, -42, -53, -29, 5, -3, 17, -34, -3, 7, 2, -18, -35, 57, 3, 20, -4, -31, 43, -12, -22, -1, 22, 58, -1, 54, -7]
5800gJ1lo1P1mKk1j8L5k4JL7q1L4M8ml5j0mM6k1L4k6J1jj3LNK7k2n2O6k0mMm8
5836d4N3PoJ0m8N5m6P2m2n1R0l5j13Q2M1q9P4n8M0lj2J6L4J8Np9L8k5PJ0l0P0
5868D1q5K2L2Pk7Rl0J6K1k4L8J3j9L0k8K1m0L3pl%l9K4L7l9qok4L3O2j11J9j5
5901d7O9p4L7J4lk4j2OjRO9p0J9lJ1k9N9o6NM8Pk5J6m9M0K2l2j1L4J1%j3p2O3
5935Hm4L1J4Rq4J7RK4%K5on9K8N3jk4l4K9k0J2j0j4M5L1l3K5l5L7n0L6j6j2j5
5968b4%J2N7ln9M8m8L9j1m6N0K5q9L6l4R2l0o0N3r2Q0J0M7p1K9l1J0L6M8p0j9
5999a5k9L1k4M9K6o0J8kK8J7m0m0N0Lj5K4oo8L4L9j6n7N4J0nm3J9M6j9j7K6Kj0
6032A0k7Q4j59J14J8l1lK9n7P7p0K9m5L3k5L9m5N6nm7O9j4l1nNM8m9m5J10p8m1
$$ y = [-7, 4, 1, -60, 11, 7, 9, -12, -30, 5, -19, -18, 19, -62, -28, 20, 16, -19, -29, -33, 13, -8, 26, 0, 11, 10, -3, 0, 5, 32, 10, -42, 24, 4, 0, 4, -44, 9, 16, 10, 20, -28, 27, -19, 53, 11, -40, 50, 15, -98, -16, 25, -64, 10, -48, -8, -11, -23, -7, 27, 45, 50, -29, 9, -16, -9, 1, -29, 41, -44, -22, 10, 17, -10, -1, -31, -15, 6, -18, 20, 33, 14, 44, 16, 37, -3, 30, 23, 20, 20, -19, 5, 42, 3, -5, -11, -35, -2, 60, -51, -32, -47, 22, -52, -15, -1, -4, -28, -40, -34, -35, -26, 43, -27, -8, -11, 0, -29, 30, -36, -31, 17, 24, -1, 15, -34, 6, 28, -4, -15, 19, 30, 30, 17, -55, 8, -36, -5, 9, 18, -66, -49, -40, -16, -16, 9, 3, -56, -28, 25, 24, 0, -34, -5, -25, -13, -23, -37, 8, 39, 6, 31, -4, 33, -17, 19, 3, -9, -24, -24, -12, 45, 42, -17, 31, -17, 22, 11, -35, 15, 40, -49, -13, -47, 45, 15, -45, 8, -84, -4, 6, 53, -18, 11, -20, -10, 26, 74, 4, -15, -44, -13, -37, 12, 38, -22, -4, -6, 22, 39, -1, -41, 9, 12, -3, 21, 15, -53, -19, 20, 4, -53, 1, 11, 6, -37, -18, 28, 9, -8, 18, 20, 10, -17, 67, -92, 22, 40, 9, 6, 35, -22, 55, -15, 14, -31, 2, -23, 16, -29, 27, 22, -25, 44, 30, -1, -6, -1, 47, -2, -47, 63, -15, -56]
6063e6O2n1N0rn5R6Om9Ml5pL3j6P1m6L7k1n2O9j0k4NL1mpq%qK8m6lL6K9n6O3l2
6099B5k0K8JJr4N4m4J05j2o4L9pr5O7lqk4L1Q6p0NJ2m4L2kN7o1mJ7k6K4m8O4k
6133B0m6j4L2L1ln0L9J4j6KoL7k1k2k7qrK0OM3L6q9L8K9m9K0J6nk5o9M5QL0N3
6167F0o5J6N1j1n2p0J10mo7J0J3L4p2J3M2r6N0K9PJ4n6M9l5mP9p8Q3oK9k5j07
6198e9P0m2QL0l0M1k7j4P3k4Mp1pN6J2mNjl1Q2r5qN0P6j04K9n8K0J6Lj1k0K0Q
6232cL2k9Rj5qJ3J3j8k4j3K3J4mPPM0J2k4M0r5J8j4n2J25o3M8l4j0L0n7J21q4
6264EJ5k8j8J1P8l5l9j8J3R2r0L9p6j5K8Q6p1L5J1J1n2j1O0m8N9pj3l8j6K0O0
6295D8k8K9%n4J3ol5P4l8k5L3j5l5P6r0N4L5p7N0L4p4J5j5M3k4mJ4m9M5j4J7n4
$$ y = [-56, 6, -45, 5, -4, -59, 37, 43, -6, -2, -37, -44, -11, -27, 44, -2, 35, 14, -38, 31, 21, -3, 2, 33, 29, 22, 14, 14, 6, 34, -12, -15, 21, 50, -6, 57, 25, 5, 33, 34, 35, -59, -5, -49, 56, 44, -20, 19, 12, -83, -16, -19, -27, -51, -20, 66, -4, 1, 13, -31, 1, -1, 56, -5, -9, 8, -18, 6, -42, 22, 20, -26, -40, -8, 23, 20, -30, 9, 23, 7, 9, 3, 40, 19, -3, -30, -38, -47, -27, -21, 22, 58, -31, 7, 36, -13, 7, 23, 18, -7, -76, -31, -23, 7, 60, -5, 11, 62, 51, -1, -71, 39, 35, -32, -22, -9, 25, -47, -34, 8, -88, -38, -9, -2, 12, -44, 5, -30, -34, 45, -33, 50, 44, 73, 48, -59, 11, -31, -23, 7, -23, 18, -9, -23, 50, 26, 30, -41, -48, 8, 20, 16, 21, 20, -11, 71, -24, -32, 18, 94, -10, 19, -39, -19, -3, 0, -11, -31, -11, -3, 29, 0, 9, -6, -14, -1, 12, -6, -30, -43, -20, -6, -10, -3, 4, 44, 56, 32, 72, -23, -5, -19, -71, 54, -9, 39, 5, -5, 25, -32, 89, 5, 20, -8, -26, -15, 63, 28, -11, -29, -16, 76, -14, 25, -51, -66, -38, 48, -23, 12, 23, 34, -18, -29, 31, -17, 42, 35, 22, -16, -32, -12, 48, 20, 49, 49, -5, 8, 2, -33, 41, 3, -22, 11, -4, -39, 37, -53, 1, 36, -41, 9, 43, -31, -16, -31, 12, -12, -16, -2, -51, -6, -20, -3, -57]
6327e7J1QK3jN7j1o0K3l1O2k4K0jm4O6j3m6L8j5j6l1J5rN0O3j12j6R8q0O4k3l6
6359b8ONj0PqJ3M9rk7m7M8J4l9O3m0J7p8J10J1l0mo5L0qJ0K7m1K8M4r3R4n5L9
6392C3o5K9k3N8k4k6P0q9O9o0K7K5k1Ll3pJ6qk9P5j3m3R0k8o0L4j4L2K9p1K7J9
6424B2o4P5J3n0Ol3lL9K0J2o6K8K8Rk1K0J1m1K8p9J10o2m7J0K9j3O1k3o3R2m8
6455@l9M7J9n0J7MM7jk5k3L3Ok2l5N5n1k9O7j4Pj5N0%l0k1Ool2N2j2j1LK0Ll8
6490a8m3J3K7J9k7MM3l5L4J1l6%j6J1N9Jn7o7M4O2N2q2j3P4o0l4j0L7k4M9n6L5
6522cL1r3J4M5lN1l5n6N0l2Q8q3K1J2J3j5rl4N3j6K2J4r5R7o7J1O5q5K4M4l4M4
6554C9m8K3K8%o4NM6n1LL5n6kK9K7j0l4L3o2ON4mm3P6n6M2j3k6O5k8jJ5j2j9M9
$$ y = [-57, -46, -38, -15, -16, 41, 30, -30, -7, -38, 24, 0, 20, 19, -25, 41, 28, -18, 20, 5, -11, -42, -27, -36, 14, 77, -35, -51, 47, -33, 31, 8, -28, -22, -17, -27, -20, -28, -15, 34, 25, -2, -49, -1, 13, -26, 37, -3, 14, -64, 46, 57, 27, 23, -42, -12, -20, -10, 17, -24, 4, 48, -45, 49, -6, 33, -32, -3, -26, 32, 8, -18, 52, -37, 32, -28, -1, 24, 3, 6, -27, -34, -18, -26, -55, 20, 7, -36, 54, 26, -34, 0, -14, 18, 47, -24, 3, 22, -42, 33, 46, -4, 2, -31, -34, 5, 25, 37, -29, -1, 27, 36, 15, 35, 46, 5, 33, -46, 64, 2, -45, -35, -6, -19, 42, 19, -44, 48, 0, -39, 8, 27, -23, -6, -2, 45, 44, 19, -4, 29, 35, 13, -22, 33, -18, -47, 20, 6, 13, -2, 48, 48, 18, -3, 3, -3, -35, 17, 5, -6, -3, 17, 20, -18, -61, -48, -21, -2, -29, -25, 18, -17, 17, 28, -8, -8, -24, -13, 46, 47, -10, -77, -33, 29, 81, -1, -14, 60, 0, -34, -44, -7, -31, 18, -38, -3, 28, -65, -51, -6, -9, 42, 7, -49, 1, -31, 57, -26, -5, 7, 20, 5, -4, -38, 15, -1, 21, 35, -60, 37, -30, -19, 46, -39, -15, 29, -5, 39, -9, 14, 42, 42, -22, -17, 29, -22, -19, 16, -40, -42, -13, 14, 4, -30, 3, -59, -53, 1, -3, -46, 30, -26, 16, 3, -23, 42, 14, 13, 28, 16, -3, 46]
6588D6q1M1J6k9L4j3l2K8m7K5N8j2mJL9q0Jj5L9J4rKQm8M2J3o0L4j04J06lK8k7
6621A1Nk1M1j16J65q5j6L8n2J3oL%KJk0J03n0j4Mj1LjNOq3K7M5n9Q7Qm2nj6J7
6656a3L5j9rK3Pqm5k3L3Q7m8n4Q3o3N1nn9Lk0O3OL6Ro1K5k9J5k1qOj6J4n3P4l4
6691a8K3k7pjl2K6L0k7P1m0j4M6o1K4J4K1n0J4N7k9k7L0p3N0K4m8N0n3J42j10
6721EJ3L2m2OlJl1M0j0j0l8K7k0KM6q4N7M0o2%j7K6j4J1pQK4J7j1L0rk7j0J8Q
6756A6nNJ8lK3j2lo1M7Oj8j2j1%N7l1l0rQK5k2QkL9m9M7j9Qk9j0J3j4j9Q1Mn4
6792hj7L3k9L0k1M7k8l7J01p7j3N4j9k7nkJ8Qj8K5K8k3k9K6M3l0m0M2m9M5p9P0
6824A9l1j5L8k0K7m7K4l5J6O8r0L6pj0J0N8n8P5j9nk5J1K7m6K4n0j3J1Q3l0j3
$$ y = [46, -35, 6, 22, -7, 27, 14, -18, 10, -37, -12, 46, 34, 30, 31, 70, -10, -9, -24, 15, 29, 20, 22, 30, -18, 24, 37, -23, 11, -93, 13, 10, 38, 11, 16, -5, 36, -80, 85, 0, -16, 22, -30, -17, -23, -20, -20, -18, -17, -37, 66, 16, 2, 6, -5, -2, -3, 2, 8, -75, -48, -3, -62, 25, 33, -9, -14, -30, -13, 22, 3, -6, 17, 24, 16, -29, -52, -19, 68, 20, -34, 49, -14, 37, 32, -27, -24, -44, 19, 25, 61, 70, 9, 34, 5, 20, -1, -9, -3, -19, -5, -58, 16, -18, 5, -22, -29, -30, -62, -36, -6, -33, 38, -2, -16, 30, -31, -7, 7, 28, -22, -8, 49, 20, -7, 23, -50, 0, 24, -24, 26, -27, 115, 5, 18, 50, 8, 14, 11, 12, -19, 21, 11, 1, -37, -10, -30, -28, 18, -66, -9, 31, -31, -31, -48, -22, -36, -25, -32, -24, 0, 17, 6, 36, 27, 0, -10, 8, 16, 11, 16, 34, 31, 54, 42, 39, -22, 25, 31, 13, 1, -10, -10, 47, 16, -14, -23, -15, 10, -12, -4, -6, 33, -16, 31, 12, 20, -9, -19, -6, -20, -39, 42, 46, -8, -25, 8, -21, 9, -12, 35, 7, -30, 71, -6, -19, 35, 16, -11, -16, -18, 0, 8, -10, 15, 43, 20, -9, 17, 60, 30, -10, 32, -17, 28, -51, 19, -12, -27, 11, -9, 18, -29, -5, -40, -24, 44, -46, -10, -17, -27, -17, 41, -17, 58, 39, 34, 9, 20, 47, 1, 25, -25, -38, -27, 56, 26, 13]
6855A3LK6o6Q6r0j1R0m3L3o3k8O4n8P0M3q7pqK6%j2K0j2nJ7pMPm9O8PL5m8l2M4
6890C0k1J8n2P3m9m2R1k7p6J03m7pK1J6qn6j5Q3m4J7l6KK8m5M8k6l9M4K1l3K5
6921cNj5P8k2j9l3Rm8N1P2m5n6L8L6q1mL9k4L0J6m7j6Qj5N8Nm3J2OnRQJrj4K8
6957A0RrK3K5j06L0J0Rj2J8lj5j1mL6rPM3o2j1N4j9l4K6NnJ7Qj6k2K6n3K2j5L7
6992Ip3K1J4M3j9J6k7j8J0J6L3q3M6K2L3l7L8J2j06O4N3q5J6n6Q7k1l4N9p5L6
7022fJ5j0j8J6j5J8qj9QJ3NJ1On5L0j7K2j5J9N3qj00P3M5q6K1K2n3P6j2n6K0L9
7055C4k1JM5m3J9n3Nj4J4LL4m1LM1pk3k7J5J02j20k5K8M7k5PQ6o8qkn0MM1M0j8
7089B4Ml5%k7K8M0k6K9M2qr1nK3L3L7o4K2n7M0Kl2K9l0MJ0m6J0N0J9k0m2M1k8
$$ y = [13, 16, 42, -24, 62, -28, -39, 51, 8, 41, -22, -50, 14, -44, 26, 69, -18, -25, -33, -7, -7, -19, 1, -11, -16, 1, -6, -2, 5, -44, 24, 31, 66, 18, -14, 30, 9, 27, -25, 48, -1, -43, 48, 21, -55, 48, 1, -6, 15, 31, 23, -33, -48, 35, -9, 8, -28, -26, 2, -43, 5, -21, -60, -16, 5, -28, -3, 2, -13, 65, 43, 24, -9, 0, -48, 3, 75, 30, -26, 12, 48, -33, -37, 2, -22, 8, 24, -23, -39, -31, -46, 12, 17, -26, -14, -8, -13, -4, 4, 5, -4, -18, 10, 19, 10, 33, 58, -48, -18, -8, 1, -11, 7, 4, -11, -22, -26, 10, 1, 8, 51, -11, -22, 32, 13, -21, 5, 10, 5, 22, 30, 14, -8, 18, -35, -13, -28, 9, -64, -43, -29, 14, -5, 11, -16, -34, -24, -8, 25, -58, -12, 10, 43, 6, 44, 56, -50, 14, 67, -18, -2, -58, 29, 8, -26, 33, -42, -6, 9, -1, -19, -3, -18, 0, -8, -27, -19, -6, -1, 10, 16, -39, -9, -26, -4, -19, 0, 53, 45, -55, 18, 63, -23, -2, 20, -33, 43, 31, -25, -5, 34, 13, 14, 59, 16, 35, -18, -13, -27, -13, -10, 24, -17, -14, 27, 20, -3, -30, -15, 87, -33, -58, -30, 17, -8, -1, 85, 17, 9, 7, -43, -39, 2, 42, 24, 28, -7, -7, -34, -6, 34, 8, 37, 79, 71, -20, -25, -2, 31, 68, 4, 26, -31, 9, 11, -21, 8, -22, -18, -8, -54, -44, 6, 25, 5, -37, 4, -24]
7122b4M2k2k6M2lJ1m2M1nJ3lKn4M0l0j5N7j5rK4J1Ro2LN7o1K9k1n1Q7J0k9NK7
7156C8r9K4L1L7j8n4O2L4j06R%P4o6jMM5l8%%M4%j6K0J2j0p0M0J6M1m3nm0N1k3
7190gK7r3O3Pj8M9Nj7l8%n4R7j3l2LK5l3J2j7M8ol0J5k2L9J8j0m5N0l8K5k6N5
7223C9m2QP6r4JK8Kj3K0l9J3j2j2N8nn7N8k6l7M4n4K3K7K8m9L1mm8M1Rl8M9k8
7256cPMJ7K1l5j6k5%L4J0m1P9j6o5O4%o2jQ1n6j7M5Oj9o2K9lk2K1l1L4jL9n3j5
7291e2K7Kj0MQ8n7kJ1lo5Q2kq9M1K0MJ5m6N6j4J8j0K0j9n5PJ2p0Q1pl8M2m5L2
7325b2j9Q3r1J3L7k2PJ9n6N6pk6J3M0l9K8LK5L3j02J06q0n5L8M0k2k0MLJ5N1o4
7357a1k0K6k6LM9P5p0k6n6M1M0p9K8M5o2R5n9nm4K8K2k7M7m5OrK9j4ML9j3klR
$$ y = [-24, 18, -4, -30, 12, 9, 20, -22, 19, 14, 27, 24, 26, -28, 12, -18, -33, 24, 9, 0, 24, 35, 44, -18, -15, 42, -19, 10, -11, -62, 25, 35, 6, 11, 38, -61, -37, -6, 31, 13, -41, 21, 55, -51, -42, -42, 32, -34, -35, -31, 14, -24, -24, -24, 20, 20, 4, 24, 36, 26, -44, -4, 12, 53, 10, 5, -35, 16, -7, 20, -73, -10, -3, -21, 28, 33, 16, -22, -22, -76, 21, 8, -24, -21, 4, -29, -17, -34, 14, 8, -22, -7, -29, 10, 28, 18, -27, 23, -15, 10, -16, 39, -3, 5, 81, -13, -12, 16, 18, 5, 25, -14, -1, -13, -25, 33, 28, -29, 29, 3, -34, 10, -44, -21, 6, 34, -15, 16, 12, -36, 5, 14, -24, 25, -3, 4, 8, 25, 46, 11, -5, -30, -30, 4, 14, -27, 52, 36, -29, 35, 35, -27, -28, 53, -3, -20, 25, 31, 12, -50, -21, -24, -46, -25, -56, -22, -23, 16, -37, -52, -25, -23, -33, -29, 59, 2, 0, 11, 8, -57, 25, 23, -66, -25, -5, -1, 14, -32, 24, 10, 28, 18, 38, 19, -36, -29, -17, -87, -6, -13, -51, -9, -54, -22, -41, 42, -49, -36, 1, -21, -14, 5, -51, 5, -2, -28, -15, 25, -14, 14, 17, 42, 75, -27, 79, -1, -56, -18, 22, 0, -20, -16, -13, 2, 53, -11, -31, -5, -31, -28, 21, 96, 26, 0, -56, -15, 25, -54, -26, 19, -43, 52, -7, -12, -56, -28, -6, -33, 14, -31, -25, -34, -5, -19, -15, 24, 11, 9, 6, 15]
7391A5qJ8j4K0k8j2J2M5n8K2Lk1J6k1lj3lk6M0opMK8n2J0J6O2n3J9J8o6O7o8N9
7425A5pp6N6jK3J3l6O8j1j6m8k3Q8o6kJ1k3Q5m8n8O8J9j6m1K8qJ0n2PoR9l9j8
7458eJ0KJ3o2L4k5%N5Kk1k5R6o8J0j2M7k9MK8k2k9mM2rp3L1%l2J2N2l7mL2Mo7
7493e0qN7o4M1j5k9M4k0L0j1jN1l1PO4k6L6o3M0k6J2m1J6l8J8nL0oj8M8l3J2l2
7526a1J1k3L1k0K5k7k2LM1l9%L9k5M2l5K8q7J2L8K0l6P4Mp7qM4L7j08J8L4J6K
7558AM1j0L2o2m0J7k7O0K3%j6j1jj8j7O3j5m4M0l0L9k8m1Q0n1m6O4Ro0M7L7k3
7590A3jm5M1rmQK7Or6N4L7j2J0l0Pm5%O8j2j3o0J07p3k6P0J6q1k3lK9kK1L0n6
7624d7L7L7L2j21P9l0J4qj6l5L2J02q1Kk0L7Ml1P3q0J34o6n8K0n2M9j5%l3O5p5
$$ y = [15, 7, 25, 11, 31, 3, -9, 3, 48, -10, 12, 15, -6, 10, -11, -14, -27, -30, -56, -16, -22, -29, -25, 3, -49, -39, -23, 39, -14, 5, 23, -43, 24, -44, 15, 8, -68, -12, -13, 10, 23, -13, 55, 44, 28, -20, -43, 45, -21, -23, -12, -35, 50, 2, -56, 12, 31, 15, -26, 2, -6, 4, -48, -41, -47, 52, 13, -5, 5, 7, 20, -42, -8, -33, -33, 22, 24, 3, -22, 74, 6, 16, 4, 51, 22, 26, 54, 32, 3, -1, 41, 32, -41, -10, -10, -42, -30, 22, -15, -19, 13, 17, -50, -58, -1, -65, -24, -39, -68, -24, -44, -14, -25, -26, 25, -6, 1, 65, 39, 75, 12, 52, 26, 38, -3, 13, -25, -7, -12, 18, 12, -6, 42, 9, 21, -11, 0, -23, 8, -12, 13, -14, -36, -33, 8, -31, -31, 8, -17, 25, -10, 18, -69, -57, -19, 1, -35, 39, 43, -34, -42, 2, 39, -69, -51, -17, -1, 1, 42, 32, 64, 2, -38, -21, -48, 12, 35, 35, 19, 8, 7, -11, -28, 35, 20, -24, 16, -14, 25, -3, -44, 36, -15, -61, 3, 12, -48, -1, 36, 13, 12, -33, 8, -1, -5, 3, 30, 36, -60, -6, 31, 19, 29, -1, 6, -39, -39, 29, 17, 4, -56, 51, -22, -48, 22, 38, -43, -66, -69, -40, -42, -21, 9, -47, -10, 27, 59, -62, 17, -13, 1, -7, -23, -58, -26, 76, -5, -3, -23, 14, 18, -13, 60, -20, 114, 48, -10, 10, -42, 7, -8, -8, -41, 24, -51]
7655e1N3l3M7%l0l0O0o9M3J3j0k6J6LJ1l3KRL4oM0j5j2j08J15n4K5Q0n2k0L7l4
7687Ek0nO5l1J0k9Lk6k5O1k6K8k1lj4J0l6P1Ljp2KO8l9j8M8Ol4L4k8L4L1l4qj1
7722bj2j1L5M5o2L3%k4MJ4j4m5L0J5o2O8JK0m3L3n4RQl3J8J2J3L6Om7JK0J7o6
7756c7L5nj5K5m8PJ0P0r4P5Mp5J08l8J2kK9j6q6O5k2M3p7K6n8N1M1l7PK0j7m1
7788d0K6N4k8n6K7J5n5J9l1P2l9Q5o5L9Rn4jj2J11p1l0K9L2n0RK7n1M7Mk3J9j8
7820@j9L0L3m2n9M8J8j9K3n0M3j6l5l7O5j1M3j8M5j7op4K8K6L6l1m2L7rK1j2J4
7852A3M3n0ML2n7M1l2L5J4Qn4NL5j19R2mm5m9O2M5n2J4j2L0N4n8M2k2n9K5K5o
7884@j6j1M0J7L6o2K1p3O8J0j6l6P0m6l6Q1l6j2J1p8Q8m9RJ7l7L8l7J0J5L8n1
$$ y = [-51, 2, -31, 16, 16, -14, -44, 16, -53, -10, 3, -7, -33, -17, -14, -3, -36, -34, -25, 9, 3, 43, 28, 16, -92, 23, -31, -6, 74, 22, 2, 39, 5, -15, -20, 45, 14, 24, -5, -2, -28, -53, 8, -18, 10, -11, -14, -28, -18, -54, 17, 20, 19, -53, -51, 17, -22, -40, 8, 14, -20, 14, -14, 20, 51, 17, 9, -2, -14, -25, 10, 55, -7, 26, 26, 2, 6, 20, 6, -39, -9, 6, -56, 12, 13, 33, -10, 23, -31, -22, -14, -47, -29, -17, -4, 32, 38, -9, -8, 12, 29, -37, -2, -7, -22, 3, -45, -38, -28, 42, -52, 23, 27, -48, 60, 22, 34, 32, 61, 45, -41, 24, 2, 45, -32, -6, -64, -13, 28, -9, -2, 18, 1, -40, -14, 40, 12, -44, -17, -2, -57, -38, -69, 3, -36, 49, -16, 23, 32, -22, -23, -35, 76, 5, -25, 4, 36, -14, -5, 22, -29, 18, 22, -1, 18, 0, -19, 11, 44, 2, -57, -9, 9, -10, 13, -37, 6, -10, -45, -82, -17, -28, 15, -3, 42, 25, 19, -55, -27, -1, 35, 4, -38, -1, -10, 11, -1, 13, 56, 6, 10, 42, -15, 26, -6, 29, 43, 51, -3, 2, 37, -82, 10, 6, -39, -88, -26, 19, -33, -19, -31, -1, 53, -5, 37, 15, -44, -19, 6, 0, -16, -27, 13, 30, 66, 4, 25, -48, 20, 30, 14, -22, 48, 2, -34, 47, 11, -1, 10, -68, 20, -29, -20, -3, -40, -2, -39, -29, -14, 24, -27]
7915b7M7l8J7J5j7OM1r4O8k4RM3o0j9j8N4j9P2lm3m2O2j7J1p7O5ONJ8p1RO3k2
7948B0k9J7ln1j1L9o4O3O2r1M3J1oj7P2p3Q3m5M7r6K0J4k3L0k8m5R0n6QM2m8P5
7980E0j0l9LM8p2QK3N5p6rRK6J9l1n0j6M4k6M2jL9j5l6j1N6lo9M0J2k1MK7J0k1
8014IO8j06j7L7K0noJ2j1qM7n3O9p0N4l0K3J7q3N6l0kM7p1N3q3L7K2k8K9k6J4
8046a5M2m0K1k2K9J0j2k6L2j9QJ1p0M5nK8J4Rn6K2Rk0LrK2k4j8O9n2N4l2l7J6
8079a3k1M3qJ1l5l2M6J2J6Mm0JN2lm4M4m6NPN2j17O3NJ5l0J5J2l8P5r1N4J2l9
8112a3QK5l1J4k4on4Q6qk6L5k9N9o7K7k6K1K4m9O4J8m6K5n0K6N3n7Qj5mRl6jO7
8146B7K0l0j5k0j3J1M1j8OkJJ5l3l5N2l4M7l8M6o2M2k9qKj3M8j1Q3o0lPRKj7K4
$$ y = [-27, 20, -18, -1, 14, -3, 3, 44, -50, 18, -6, 3, 46, -14, -33, -51, 3, -16, 56, 53, 10, -32, 30, 13, 24, -53, 12, 18, 23, 41, -30, -21, 42, 20, -9, 8, 5, -46, -57, -18, -82, -19, 43, -48, -5, 6, 0, -17, 55, -18, 65, 20, 67, -29, -9, 5, -18, 12, -16, -61, 29, -27, -19, 23, -25, 50, 40, 1, 4, 52, -20, -12, 11, 66, -10, -19, -10, 16, 35, 4, -46, -62, -18, -44, -2, -3, 36, 21, -15, -26, 30, 27, -42, -2, 10, -11, -7, 20, 30, 9, 77, -29, -46, -9, 11, 6, 0, 12, 1, -7, 40, -13, 56, -14, 40, 10, 33, 50, -33, 23, -7, -9, 38, -33, 20, -63, -26, -4, -32, -3, -29, -15, 27, -13, 8, -14, 15, 25, 13, -13, 19, 0, 8, 19, -51, -6, -11, 17, 31, 40, -16, 6, 15, -5, -2, -11, 11, -13, -31, 38, -14, 40, 8, -29, -13, -34, 9, 1, 12, -23, -55, -9, 3, 19, 23, -17, -16, 36, 33, -11, 33, -13, -8, -1, 51, -66, -3, 2, 17, -13, 2, 14, -24, 51, -40, 14, 26, -13, -5, 20, -11, 3, -21, -27, -81, 5, -3, -29, 6, -23, 36, -31, -4, -30, -9, 15, -34, 30, 48, 2, 27, -23, 3, 56, -1, 7, -8, -12, -3, -39, -40, 27, 47, 17, 2, -18, -31, -20, 21, 3, 9, 7, 8, 23, -10, -45, 7, -27, 20, -18, 28, -34, 8, -21, -29, -27, -40, 8, -3, 80, 20, 17, 24, 33, 35, 18, 42]
8181D2n1N8l3m0K0L6J2qm0L3
$$ y = [42, -9, 49, 16, -24, -4, 32, 44, 36, -4, 29]
8191B9
$$ Imaginary data points
##PAGE= N=2
##DATA TABLE= (X++(I..I)), XYDATA
0@%%%%%%%%%%%%%%%%%%%Qj6J6j6J6j6J6k4L2l2L9m7M8n6O4p2Q0q8J04j19J29j40
41g4J56j77J99k16K39k65K90l20L54l90M30m75N23n78O41p08P88q82R88j116J272
62F79j467J718k054K533l274M580p580K8352L101l9863J1192J0828j644j0552
76c451n297q051M564R217K075o099K962K232J315P826M257j2645m888J1830R022
91A4869p380j0390j513M898J583n20k781n237k232L358L338R04l150k661M178
106b736Q306K665n839l576Q965O820q492q783J517J016k844j163j73k256j417
121g990L061M349J968J401r03j497L841K804m520k833K904J093l302l153M58J115
137a204p14O43O22k455j070J871K466J678q22j581J413K498L85j616j052K012
$$ y = [0, 0, 0, 0, 0, 0, 0, 0, 0, 0, 0, 0, 0, 0, 0, 0, 0, 0, 0, 0, 8, -8, 8, -8, 8, -8, 8, -16, 16, -16, 23, -24, 24, -32, 32, -40, 40, -48, 56, -63, 66, -74, 82, -95, 104, -112, 127, -138, 152, -168, 186, -204, 226, -249, 274, -304, 337, -371, 417, -465, 523, -593, 679, -788, 930, -1124, 1409, -1865, 2715, -4865, 23487, 26588, -13275, -2083, 8745, 7101, -3451, -8748, -16799, -12235, -3018, -943, -7042, -4080, -1848, -533, 7293, 11550, -1095, -5983, 5847, 14869, 7489, -2901, -4414, 484, 2067, 1547, -1234, -6471, -8703, -5345, -2007, -1103, -4253, -6914, -2736, 5570, 8235, 2396, -1180, 7785, 14605, 6113, -2670, -1153, -137, -2981, -4144, -4317, -6573, -7990, -4929, -580, 1388, 2789, 1886, 389, 4230, 7034, 2514, -319, 2585, 3678, 376, -2777, -2319, -1204, -1918, -1275, -653, -3108, -4178, -2307, 159, 1837, 1015, -566, 847, 3345, 3730, 2114, 1062, 3074]
153C074L3m235j808J446n71j205K28N14J30j05J830K665R94L18n58j009J002J54
171B897k373r41J27j026j607o10J110J212M3N52M58n97R12J746L76k7o88o96N37
190A405j87o38l97k04j6j351j798J055J048q96J40J306K24j44P42K141J306j008
208B728q12l18l79Q0j207j730K61k25j449j32J178J212L88K2J257N83q23N52J228
227B414%p77j455m31P73l38q98j11n5j90q94j38J456L93j058O65J257M7k04N66
247A022J427K31j443p46J95l21m77r87p17N15l96p89R23J581N52m53J55J408J26
266A806j155L02N93p44j008p89J78Q23m28n31M78M37l92l79M66J225o40j099Q19
285c8P00m35j59M63O27o4j203k58O96j38o51o65L40N96q33k05J375R11l73m69
$$ y = [3074, 3107, -1128, -2936, -1490, -2061, -3266, -3038, -2524, -2394, -2499, -669, 1996, 2990, 3308, 2750, 1741, 2743, 2897, 524, -417, -290, -1316, -2923, -3533, -2423, -1211, -1168, -616, -158, -755, 157, 1903, 2279, 2252, 1564, 868, 1405, 1218, 580, 183, -21, -37, -1388, -3186, -2131, -1083, -1979, -1839, -533, -309, -453, 289, 2430, 3736, 2728, 1916, 1598, 1219, 1299, 92, -1638, -1377, -1602, -3051, -3183, -2005, -793, -405, -383, 874, 1457, 634, 1186, 2414, 2414, 1637, 182, -249, 524, 186, -712, -823, -878, -1068, -1962, -2100, -644, -251, -1309, -644, 613, 660, 456, 1022, 2449, 2680, 1237, 491, 686, 365, -112, -1099, -1816, -1301, -1697, -2486, -1563, 18, 570, 117, 272, 1680, 1806, 651, 953, 1546, 802, -206, -995, -817, 6, -422, -953, -475, -38, -430, -809, -343, 882, 242, -857, -38, 662, 227, 68, 531, 1158, 1094, -109, -367, 329, 191, -460, -1125, -785, -189, -1022, -1227, 148, 1059, 686, 217]
305B17K24P95j96j141k9M24n29q67m22R08P98o32r9J047K88l60j64M53L62p60
325C17p63K51J49l50p1j7M25M9o43K69O96n3l31j48L57L29n32j2P93J24o21k22
347dK26J62m04o20J69J04m34k41J81P34M94l72J63Q78P9m86o5K69q4q88l98K47
369b90k26l14J74l4K14J91k4K19N40R2j62j52K20J55m52M5L61l62l51P1l5J1k41
392c50k08J76l5j66J57K35M00J52k12J67M46j38j86o9p5j38n34j66K28j59j22
413e97K05pK16K70J3J42K18j33J2q6j02m0j40O3J4l60K7K76k6j20%K4J49j10j56
438b48L28J31M1j79m3L18O3m42J3J46k60j53j78J05K08p7J56J31J31J43M0p2J57
461D59j95k99K1j09j76L2o3M8J49j19K65K28o3l4L5J00N2k58p1K23o0k44q3P1
$$ y = [217, 441, 1236, 1040, -101, -130, 294, -235, -1102, -1524, -616, 182, -450, -549, 498, 786, 426, 262, 715, 1077, 317, -446, -195, -46, -396, -467, -484, -59, -10, -653, -384, 312, 259, -72, -220, 137, 466, -66, -78, 715, 839, 218, -4, 222, 384, -20, -640, -471, -367, -801, -1042, -861, -127, 367, -5, 158, 1036, 1115, 629, 564, 833, 749, -139, -537, -290, -516, -830, -656, -690, -476, -285, -309, -90, 450, 542, 380, 228, 448, 603, 151, 196, 557, 195, -156, -85, -120, -109, -350, -558, -382, -417, -583, -426, -191, 209, 361, 149, 316, 762, 624, 438, 369, 294, 156, -378, -544, -316, -475, -597, -392, -399, -183, 87, 100, 242, 460, 327, 339, 253, 151, 111, -29, 34, 48, -312, -285, -9, -35, -155, -155, -131, 18, -92, -248, 80, 211, 252, 73, 30, 348, 411, -31, -18, 128, -132, -285, -463, -358, -150, -227, -71, 60, 191, 334, 374, 302, 459, 264, -35, -14, -123, -299, -267, -330, -282, -133, -252, 13, 241, 178, 144, 179, 279, 331, 73, 2, 225, 165, -79, -162, -91]
485i1J70j52k72J77J05j74p6K3K64K41k12R4L28J6o3M0j39k1k73k86M5j63j95
508f14J24K1J68K24o4K50L88o2p4L3K5p5k76o3L1j36j92QO0J19j15m4J31J61j65
533a37j0J60K04Oj06Q4K54j50k1Rk35J3j94j65j06J7%n2Q5J77J85kK61K51k08
558C20Q2Rk04j08j88J06j87j30m6J42J8Q4k4OK87rj26j0J37n7p6rJ41J7j48J01
584A28J3j96J8k0j41L0n1n2R2Q8J16J4M7K28o9j88J49K5k80l3q5k7N9p6j0J91
610c0M7J4L4%K04o1k20J16j0j27q4l9J23l1p6N5P4K7N6pl3O3j07n5J04N6k8r8
638c3J01J05j22j34J48j27j22k2J29j24J77o0O9J70J7J0k1R4Mj68j05O2j95j08
662b55M1j1PO0j9Q3J42J00p3N3L0P7j65l9J02k9j10J1n1P8j05n3J14j67J8M1j0
$$ y = [-91, 79, -73, -345, -168, -63, -237, -313, -290, -26, 215, 3, 97, 425, 441, 378, 418, 279, 258, -15, -301, -256, -419, -614, -490, -469, -301, -77, -141, 109, 497, 435, 361, 394, 419, 344, 68, 5, 36, -100, -292, -284, -224, -105, -220, -264, -133, 28, -137, -147, 13, 217, 223, 117, 201, 455, 305, 284, 293, 58, 71, -123, -288, -394, -377, -377, -429, -344, -167, 18, 16, 277, 528, 320, 402, 411, 207, 99, -89, 17, -170, -300, -346, -204, -186, -102, -126, -120, 167, 158, 32, 22, 159, 102, 26, 17, 158, 175, 27, 128, 141, -55, -37, -57, -198, -168, -219, -271, -179, -91, 25, 39, 86, 314, 245, 57, 206, 231, -49, -82, -167, -194, -135, -211, -221, -30, 17, 31, 65, 65, 269, 208, -12, 104, 94, -33, -117, -156, -33, -64, -140, -85, -11, 16, 72, 65, 32, 95, -12, -67, 37, 93, 65, -33, 68, 173, 51, -83, 65, -62, -184, -206, -77, -201, -24, -84, -15, 155, 172, 182, 161, 255, 259, 91, -14, 48, -147, -255, -214, -225, -218, -158, -177, -94, 48, 148, 75, 128, 158, 235, 70, 31, 133, 104, -6, 5, -46, 32, -73, -126, -12, -179, -161, -120, -130]
689a30P5L8O0O3J16j4J1P9Mj74j02j18jq9m0K5p6N4J55k2J23N9Q1m4J4j23J21
716A45n8m6Rp5KqLjNj9K7j20n5Q4R3o8J07kR7j5j0J06l0n0p6k8o8j7o2m5R4r0
748a71K0J66M6P0J6m3Q5r0j45J23j04k6L9r4Q3J4J8j1J04p9Po9K8M6rp4K9L0j7
777hL0n9J13j5o3k6K7j8Pk7m5J13k2%J24n7N9p9oM6j28n3o6O9K5j40%J40J03J6
807F0K8O6Nk8l9p8Q6j52o8kj1Q0m6L7J36k2q7l2P3M4pl8K8pj4MP4j9j9r1lJ07
839F5j79k7N0J1l9pJ3R7J59q4M7O1nj5m7j3m0j29m9n6L7J6JL4M7O8r1R9N9K0n
870I8j12P1k0nK4k0J3K5r6rOj4o0J9j0K7j1l2J44N5k5nK2QLk7Oq1n2j00O9oN9
903c6k1K6J3P0j6M0jk8J8j01L1K1n3J8M4nJ0kl6j9M1j0J0q9J3O0MjL9l8J00o6
$$ y = [-130, -55, -17, 43, 106, 222, 208, 219, 298, 302, 128, 26, -92, -93, -182, -222, -197, -273, -219, -64, -86, 37, 96, 177, 133, 147, 24, 145, 87, 41, 50, -25, -23, -31, -28, -29, -24, -43, -16, -136, -191, -107, -14, -82, 25, 23, 120, 105, 95, 201, 171, 121, 45, 17, -51, -68, -130, -175, -81, -171, -151, 15, 61, 131, 147, 104, 189, 99, -46, 77, -27, -53, -14, -108, -25, -11, 7, -4, 100, 21, 28, -41, -13, 33, 24, -50, -21, 9, -8, 22, -37, 76, 61, -2, -28, -1, -19, -12, -39, -84, 29, 7, 7, 131, 74, 133, 54, 48, 94, -34, -87, -153, -84, -59, -199, -199, -59, 44, 60, 88, 154, 159, 131, 92, 14, 100, -52, -120, -122, -133, -53, -99, -62, 74, 52, -35, -67, 6, 50, 43, 5, 33, 26, 12, 16, 90, 71, 52, -39, -42, 65, -114, -141, -91, -80, -119, -126, -113, -16, 143, 59, 106, 167, 162, 147, 100, 87, 47, -82, -131, -187, -150, -134, -133, -99, -52, 16, -75, 24, 83, 103, 98, -14, 57, 37, 32, 56, 36, 49, 74, -22, -31, -25, -39, -99, -80, -90, -63, -74, -106, 38, 93, 68, 63, 85, 93, 96, 69, 75, -6, -58, -158, -89, -95, -36, -57, -31, -18, 52, 36, 76, 75, 47, 65, -36, -5, 16, -37, -19, 25, 20, 30, 28, -8, -27, 14, 4, 14, -75, -62, -2, 2, 1, 40, 2, 102, 36]
935C6k8LJ6o1k7l5K2O4pN0M0n3jN7m2K3l0n6n5k8OK0kR2L8o1Q0j1k3J5O4m7k0
968C9p2K9O4j33L3k2J5J21j51lN2J7o2k7Q3Q4L7n6N2j0L0rm7jL2j16j11L3J2o3
998a50L6N2J00q3J2R4N8m6J1Qm3j1n4j4L5ln4p0O5N6p7l8J00l5N3j3m0N8L0Qj2
1029C3J01l0Oj05P5l9j55J10r5K4p7M7Q5m6N6lR9Knm8j5K6rp6rJ0J1L3l6J0JJ5
1061do1R7m7J1n4J0Q4J2l5Q9p1J8L1p7j5k0l9k0O4l0O4jo9J45j05L2L0K0j2k7
1091B0k1M7r2j01J09L5j6L2n8O7P2m1k4j7k3Lm3M3P9r5q5R0J8Pjk7O1oj2q1M9
1122a1OJ6o1N0%J6j5M0m5l4N4o2l6M0m5M9M4J5J2l4O1M2n1PQ6j63JQom6Jl1R1
1155ao4Q1k7MK7J1j2rj6Q8o2L5J0r0mJ07j08m3J05j11Mo0R8J1qLK8L2L4m8K0O
$$ y = [36, 8, 11, 27, -34, -61, -96, -74, -10, -17, 33, 73, 20, 19, 76, 34, 57, 27, -29, -84, -112, -106, -86, -88, 4, 42, -19, 61, 50, 27, 42, 106, 59, 39, -33, -4, 60, -73, -40, -62, -47, 74, -77, -80, -28, -11, -73, -100, -17, 67, 104, 48, 100, 90, 120, 111, 64, 63, 95, -21, -132, -99, -87, -150, -114, -62, 38, -45, -33, 61, 119, 73, 84, 92, 49, 38, -16, -30, 5, 2, -52, -122, -57, -1, -78, -116, -16, -51, 2, -11, -51, 7, 37, 45, 33, 134, 104, 110, 5, 80, 41, -114, -4, -99, -75, -152, -105, -20, -66, -10, -13, 86, 88, 83, 35, 20, 46, 37, -39, -48, -38, -27, 6, -30, -20, -19, -4, -65, 32, -15, -4, -58, -48, 36, 48, 13, 102, 31, 49, 80, 3, -12, -32, -71, -91, -27, -57, 7, 6, -63, 82, -23, 9, 39, 59, 47, 20, -1, 46, -46, -147, -38, -3, -19, 13, -45, 22, 94, 53, 29, 12, -11, -8, -51, -8, 71, -24, -109, -19, -1, 6, 5, -22, 39, 33, 21, -60, -11, -5, 11, -50, 0, 0, 16, 1, 41, -4, -38, 16, -46, -82, -42, -87, -38, 6, 21, 33, -1, 60, 102, 51, 58, 144, -19, -18, -10, -16, -62, -61, -92, -1, -65, 16, -11, -7, 20, 31, 19, 10, -6, 82, 20, 55, 65, -25, -29, 78, -30, -73, 32, -79, -75, -135, -37, -26, -34, -31, -3, 29, 63, 15, 35, 41]
1187D1K1m2o6J7OK0l4J4o9J07J5n9J14m6l5J5l4M4j1kL4Nn7Rn3M2l8O2o9k5M2
1218c2k6L6mK3m9P2N1P9n4n4K5l0j5n1K4pl9O0m8k3J02n8RM9l0L9j6m3P5n8l8
1249c1P7j0j7l7KN2K2k5Qk0K8n9o%N7o0mP0n4mN1o6K0Qn0L4%M6l3J2l8R9n3O9
1283H8k9J5n4l8KPJ0j8J7l9K2nP7m0L8j9nK5J5m2K4o1l4l0M0J04r9k0P4om0m7
1315f8J19r5O7J3l3O0j8K4l7K4p9L4m2Pn5j5R3j5l0L9k7O1J3Ok6K3m7L2k1Jk7
1346a9K2o9JJM4k9L2J9LOpoO2o3Mj9M1P9m2J1Kl0m4o0%L9ql0j5R0j2k2M7nK4L0
1382G7k3m2Lm5Q1ql5Jl5QM4m6J1Rl8QO6oj7j7QM5m3mM3n1J1N6n7K9Qm5Q5n0j1
1417B0Mp9P5M1p2QL0n9LL5l2MKk6K3N1nk2K5j5k4K6k1lnKK9K1l9r9J11oo4J05
$$ y = [41, 62, 20, -46, -29, -23, -3, -37, -23, -92, 15, 30, -29, 85, 39, 4, 19, -15, 29, 18, 16, 50, 55, -2, 7, -46, -4, -42, 20, -49, -74, -32, -58, -22, -26, -3, -52, 20, 71, 150, 96, 42, 67, 37, 22, -29, -5, -12, -51, 9, -39, -62, 40, -18, -9, 40, 10, 49, 33, -10, 65, 7, -31, 46, 36, 19, -18, -16, 36, 58, 33, 41, 21, 49, -10, -16, -16, 41, -19, -23, 47, -7, -11, 40, -26, -6, 2, -48, -14, -14, 32, -1, 11, -27, 72, 19, 88, 59, 74, 20, -18, -16, -9, 1, -17, 0, -39, -17, -22, 55, 15, 53, 34, 29, 54, 69, 27, 51, -10, -44, -74, -34, 70, -29, -49, 25, 19, -21, -68, 51, -44, 23, 36, 3, 63, 45, 69, 32, 56, -23, 11, -31, -24, -79, -94, -1, -16, -46, -7, -34, 27, 40, 46, 20, 43, -4, 28, 7, 8, -19, 3, -66, -65, -64, -20, -49, -17, 2, 5, 11, 4, -2, 60, -3, 1, -18, 23, 102, 60, 71, 73, 43, -1, -61, -61, -22, -30, -60, -75, 15, 3, -19, 28, 23, 47, 77, 54, 12, 15, -30, 51, 43, 8, 9, -26, -18, 26, -20, -9, 0, -38, -30, 36, 30, 13, -4, 4, 49, 6, 2, 45, -6, 5, 61, 4, 33, 41, -4, 81, 31, 20, 24, -55, 20, 61, -11, -3, 27, -32, -29, 6, -26, -22, -20, -46, -23, 28, 23, 1, 26, 11, -13, 13, -8, -11, -16, -14, 15, 36, -3, -102, 9, 3, -61, 44]
1451D4j4J6m8N9p4P0j2m5KK9m9J3K0n4K5J4j7Ll0K5mm1J37m2L8k6o5J18p9j4m5
1482d6N8k2n8K4J7j5L6j4K0M2n1N5l2L2N6p6PNm2rL0n4R8j32M9J7N1n7j0K3l2
1513c0R4r1N5nnj9L1n7J3KL6j9k0O2k4n9pP8pJ5m2rK9L4qK8q3N9j05R8o0N2m8
1546a2M3l7PM7n2J4Pj0l4kJ6MQ9j34P8j9J2Mp3O4p7R3r1O6jPKo0O6Rm9O9m7N5
1580E4r5O7n5P2mk3k5J2mL2oRm7OMK1l3l6k6L9M2kook8N8m8OP9Lo9ok5P8l3l8
1616c3L5Q4q6J0k3K1j6Jp4J03PLl0M0m1K6K3j4k5J5pm9j5M2m2qN2k5%K7m9O0l9
1649b7K5N4j9j0rN2j01M6K7k2J5n0KJ3J9k1QL5n3j0K7j4O4l1o4P6Mj2k6j1J7J7
1681B1m5N1l6M8l3Lj3Qj1Ml5KJ4OP3l5l0PL0j4k1L3j0p3J1L9%nP9o0L0n8m0O9
$$ y = [44, 30, 46, -2, 57, -17, 53, 41, -4, -2, 27, -22, -9, 11, -43, -18, -4, -21, -18, -48, -23, -27, -68, 69, 27, 65, 39, -26, 92, 13, -1, -46, 12, -10, -68, -44, -27, -42, -6, -20, 0, 42, -9, 46, 14, 46, 102, 26, 33, 38, -4, -13, 17, -37, 61, -71, -22, -5, 46, -11, -21, 2, -30, 64, -27, 28, 23, 18, -1, 30, -27, -14, -12, 24, 5, -15, 47, 23, -36, -43, 35, 28, 43, 1, -8, 21, 55, 47, 75, -8, 51, -54, 44, -16, 36, -12, 31, -6, 1, 48, -4, 10, 17, 7, -27, -29, -13, -9, 80, -54, 24, 5, 17, 21, -52, 12, -65, 28, -63, 3, 2, 9, 11, -49, 17, 26, -23, 46, -1, 54, -41, 26, -29, 43, 39, 16, -9, 3, -1, 31, 25, 34, -13, -7, -3, 18, -15, -51, -77, -38, 4, 2, -4, -10, -38, 20, -28, -22, 57, 60, -9, -15, -40, 38, 5, -33, 2, 86, 0, 10, -13, 8, -8, -7, -81, 22, 29, 32, 2, 42, 1, 27, 50, 36, 11, 26, 19, -30, -45, -3, -45, -53, -1, -26, -26, 1, -48, 12, -27, -2, 52, 33, 23, 14, 66, -35, 11, 38, 16, 31, -19, -17, -4, 15, -6, 2, 37, -16, -26, 1, -13, 51, 20, -44, 32, 36, 24, -2, -13, 4, 21, -24, 27, -9, 39, 6, 9, -4, 4, -7, -3, -38, -36, -22, -16, 57, 22, -8, -1, 29, 15, -6, 27, 17, -56, -45, -6, -6, -11, 68, 8, 38, -20, -60, 9]
1715Ip4N1mN9n8l8P0m0K9k3O6r6N7N7or1j1Q2m1j7K0Lj5K9%l7O4l4Pj9M9l9J3
1748B2o2K7O4j00N6K8p1rL1k2M0j8K0qmkN1m5m3N8k7N3m0N1j00P8n1J9l4O2n6
1779c2k3O3rk2P4k8J9m1O3q1N7o7K3L2o9mM8L2j1r0J0Q1o0L5rj0j7M3J7K1j1m9
1811a5N6Rp7L7K8o8k9lO5n6ML2QK9L3o2kL1K4q6N3nn3J8l5N4Jk2M1j4L7p4L2n
1845a4K7OJ5l3j0j1L1k5L1k9pnK4J0j4k2rL9j8O7l4N8q5OM3k4l1L4prN1n8j6N2
1879C3mn7J2MJ9L0k6l2L6l9J5L2p5QJ9oL9pm2Q9m0K1M8r3J1k2N1O%J2n3j6OpP
1914b1K0Ok0%N1k0KK0n8k6M8nR0q0rpk3j1Q3m5LPlJ2Qm6j0L9PRj8OJ8J5o9RJN2
1952C5k6J3j8m3K5Pj3J6k1K6j6M5n1N5m5N1l4l6O4j1l9N7j1p5N6LL0k5Kk1oO9
$$ y = [9, -65, -14, -18, 41, -17, -55, 15, -25, 4, -19, 47, -49, 8, 65, 59, -32, -43, 39, -2, -19, 1, 4, -11, 18, 18, -19, 45, 11, 18, -1, 48, 9, 22, -40, -13, 51, -49, 7, 35, -36, -45, -14, -36, 4, -14, 6, -2, -6, -8, 43, -2, -45, 13, -14, 39, -1, 50, -50, 28, -23, -4, -38, 24, -32, -55, 8, -1, -23, 51, 23, 42, 1, 64, -17, 40, -27, -4, 28, -41, -45, 3, 35, 24, -66, -56, 25, -35, 0, -9, -19, -36, 7, 24, 45, 34, -15, 41, 50, -27, 10, 38, -30, -59, -62, 3, -53, -49, -17, -9, 20, 53, -9, -11, 20, 44, -42, 11, 6, -47, -29, -64, -10, -9, -31, 10, -4, 33, -41, -9, -14, 13, 19, 34, 1, -9, -20, 11, -14, 17, -12, -19, -24, 0, 10, -4, -26, -35, 4, -14, 53, 19, 77, -8, -2, 41, 17, -14, 20, 13, 4, 55, -3, -19, 33, 29, -28, -16, -12, 7, 37, 11, -21, 15, -24, -9, 23, -52, -44, -25, -31, 8, 1, -41, 48, 8, 29, 77, -16, -5, -27, 24, 30, 30, 42, -11, -27, -21, -28, -21, -1, 5, -15, -15, 36, 16, 18, 38, -20, -46, 2, -3, 87, 7, -2, -9, -32, -43, 40, -5, -2, 5, 2, 14, 22, -24, -34, 5, 12, 21, 3, 9, 27, 42, -27, -18, -17, 35, 9, 22, 4, -39, -14, -7, -20, -4, -25, 1, -15, 30, -21, 34, -11, 40, 6, -30, 34, 23, -16, 41, 30, -45, 11, 14, 44, 19, 21, 0, -6, 63]
1984F3q5l1M5M3k7l5J4J3n7J10j29Q7p5RO8qN3n9j1K2jk3L6k2Qk6k6L7j1K3L8
2015D3m0n2oK9PQ6n9J2l6J8J2m2M5m0K3j3j0j9N0p4lJ33m8l1J6N0m5kM5m1n0K9
2047a3pK7%k3L1j6m9N5NJ0lJ0r5J08j9K8q3O7j0q5M1J9j6l3K1M0QJ3K3j07N9k1
2079a5kOL4j7kn4LL1RM2k6K1j4j7M0n6k3L4k2l1M5N0n3K3k5jK7l8L0l9K0K1m3
2112d2P0j7L0m3L2K0p7Q5j7n9L5qN5j9n0oRMPk1kj1J1j1kn9J12Ok5m1L7pPk9L0
2147DK0k7l2L2Mj2l7N8l6L5J3m9M8j9K9Pl6K2K0o0M8p9N5m3N5k4oK7kn1nM9j1
2180cj4j3j1M7Mmok0l0nM1m5Q8m7j3M9oj3j5K1J3o0O0pK3m1K2J5l1N6r3M0J5j4
2214CJ1p4P2qO5j36N2OL6k6k5qL5j2k4O1o8P0Ok2K5m9K3J2qk2K2Lk9o3N4L0n6
$$ y = [63, -22, -53, -8, 35, 8, -27, -13, 0, -57, 53, -76, 11, -64, -55, 13, 5, 58, -1, -12, 10, 9, -14, 22, 0, 8, -18, -44, -7, -18, 5, 43, 3, -49, -55, -26, -19, 67, 8, 20, -16, 2, 14, -28, 17, -23, 0, -13, -23, -42, 8, -66, -69, 64, 16, -15, 1, 51, 6, 4, 49, 8, -42, -13, -20, 7, 7, -16, 15, -1, -50, 5, 10, 20, 17, 27, -68, 40, 21, 49, -34, 33, 23, -62, -21, -2, -18, -51, -30, 10, 18, 31, 54, -53, 6, -15, -17, -11, 23, 6, 4, -50, -47, -16, -7, 35, 9, 30, 16, -1, 39, -17, -40, -6, -28, -59, -14, 36, -17, 6, -19, -20, 7, -31, -1, -40, -20, 1, -42, 28, 11, 41, -2, 30, 50, -27, 58, 41, -18, 17, 9, 64, 45, -5, -11, -2, 2, 9, -12, -14, -25, -14, -25, -27, -86, 26, 32, 7, -34, 3, -4, 3, -26, 4, 24, -3, -35, -3, 1, -11, -48, 10, -26, 9, 22, -27, 21, 2, 31, 38, 2, 24, 44, -16, 32, -47, 8, -35, 20, -4, -10, 17, 15, -36, -41, 8, -3, -17, -30, -41, 6, 10, 6, 0, -20, -50, -55, -14, -59, 29, -18, -31, 18, 12, -1, -16, 5, 18, -42, 18, 11, 34, -7, 15, 30, -1, 55, -38, 2, 17, 3, 14, -60, 12, 4, 69, -67, -15, -9, 27, 1, -24, -32, 3, -9, -33, 28, -40, 30, 36, 14, 39, -10, 13, 25, 17, -5, 17, 20, -9, -72, -18, 12, -44]
2247d4K4P2m2JJ0k8kp3J05qK5j5mj3Lk7O1l0j7J3k8K0o9L2Q8n7kk5M6pM6l0j00
2280g5O8L4m3l8O9j5K0j5k5K1N2m2ll2n2N5N5n2Mj0lL8m2M8q5O3oK5l0J4oLk4
2313b9kJ7NM4l9pJ2K7j6Pm2K8L9n3PK1pl0j6L1l2J4J9NJ5l7%J3N5o7K1K9j6PJ
2348B4Km3K2k6k8j7N6j6Qk1K2Lj2k8Q1l5j0m6O7K5rm1j1j4P9n0J3l8O1m9J2M2
2380B3m8K5J5k1l1N0k3n9J05k1m6P4p0N1m1j8oL6k1M0k8j4N7n3KM8olJJ2KQm2
2413bPl6m7J15p4O4m3J0J5k4J2Nl0lMK5J9m9L5M1n5J9j7M7n3N4n3J7l8Q%L1j2
2446hM1m7mPl0J8L7j5j5j7oN1P9j03J5J8j8o4O5qM5n5PJ4k8O3l8L5k2k6m5O9m7
2479c2lj5Q8r2N3pjJ7k2jj6KJ7K5r2J14j7m5K2J7n2O5K1m1O6j6p9M9Ol4M8j2p6
$$ y = [-44, -20, 52, 10, 11, 21, -7, -9, -82, 23, 15, 40, 25, 21, 8, 11, -16, 45, 15, -2, 11, -17, 3, -66, -34, 54, -3, -5, -30, 16, 9, 55, 25, -75, -7, 27, -16, -54, 15, 0, 20, 5, -20, 1, 53, 11, 8, -24, -76, -21, 34, -18, -14, -24, -27, 11, -31, 17, -68, -5, -11, 14, -16, -2, -8, -5, -29, -31, -14, -9, 35, -4, -11, 1, 28, 12, 19, -23, 5, 44, -9, -2, 19, 12, -18, -34, -3, -35, -21, -2, 3, 18, -19, -19, -6, 49, -18, 3, 32, 16, 23, 24, 26, -17, 5, -21, -49, -66, -10, -26, -18, -39, -17, -14, -26, -54, 27, -8, -18, -64, 3, 28, 19, -22, -33, -47, 32, -18, -5, -43, 18, -31, -19, 23, -25, 0, 15, -6, -37, 13, -10, -69, 36, 15, -31, 43, -27, 24, -17, -35, -41, -5, -26, 14, -14, -28, 29, -24, -22, 26, 20, 17, 18, 30, 32, 40, -2, 5, -31, -78, 37, -37, 27, -16, -6, 9, -15, -3, 2, -28, -31, -27, -2, 17, -32, 3, 44, -11, 8, -9, 38, -15, 39, -14, 3, -35, -27, -27, 4, -8, 33, -14, -18, -11, -41, -23, 14, -1, -16, -33, -39, 12, 91, -12, 3, 21, 3, -61, 4, -4, 41, -14, -7, 7, -21, 42, 4, 39, 17, -9, -54, 15, -32, -35, -50, 38, -54, -1, -8, -9, 8, -14, -15, -31, -29, -12, 13, -79, 35, 18, -27, -5, 12, -40, 25, 46, 5, 71, 55, -24, 25, 31, -3, 45, 33, -43]
2512d3MK9K6k1l1N1m5L8m1M1j9l2P4j3n6M2L2k3k7m4Q9p5K4m9Q3kl8L9K1ok3M7
2544E2o0j1L5m6K4Qj0j4j6L4M1q7J7O2l6mJ2oK4m6M0Mj0jp7N1N3l4k0M8kmJ2l
2578C0k4k1J4j8rJ4L5Qk2k0J2J3m4K1Mj6RJ2N3q3L4j3M1j2K4PJ4n3mK7m5K3n3
2611d2K6K0Rn3j4J0M1j5O6j2n4k4O6j1m7pL4j7RO1p0M9l4n6N2Pl2K2mP6k5p9J0
2644c8K0O9m6jj3J01p2l4K1n3N2m2O8rk6K8n9M4l7J7Mj6K4j7N5j03L5j1L1mno
2676b3J0K1M1k1l9J3K2k3k2LoP3k4l5L1rRl2j4j4M8j1j4J9k4L5o4R6k7l2l9J20
2708F8l7n2J1L3Qp5J7J1M3k0K9j5J5n7J4n3N2Ml8M1PJ2K0km2Pp2O5mK9o9kJ08
2741E6p2pRQ8m8K3p5O4nk8rn2K5N6j7k4M6j5M0q8K1L5j3l5K0KL6oo4j2N6nk3J6
$$ y = [-43, -39, -10, 16, -5, -36, 15, -30, 8, -33, 8, -11, -43, 31, 18, -38, 4, 36, 13, -14, -58, 31, -44, -20, -69, 14, 12, -26, 13, 34, 28, 5, 52, -8, -19, 16, -30, -6, 2, -8, -22, -38, -4, 37, -50, -33, 29, -7, -11, 1, -5, 19, -27, 13, 17, 7, 6, -71, -20, 33, -1, -21, 27, 25, 21, 33, 30, 6, -15, -1, -19, -28, -14, 21, 29, 7, -13, -1, 12, -32, -11, -7, -23, -14, -2, 51, -32, 2, -11, 30, 18, 42, 49, 63, 10, 6, 33, -12, 11, -42, -16, 4, 13, -40, -54, -44, -3, -18, 48, 36, -18, -42, 24, 13, -34, -41, -7, -24, -15, 46, -24, 25, -9, -65, -13, -6, -38, -16, -20, 56, 31, -48, -38, -18, 51, 5, 4, -9, 92, 20, -14, 7, -46, 6, -36, 32, 23, -3, 25, -34, 10, -27, -10, -6, -22, 2, -15, 40, -63, -28, -39, -8, -12, -17, -23, -13, 8, 49, 28, -11, 2, 24, 1, -21, -18, -24, 49, 25, -10, 21, 12, 21, -11, -25, -39, 9, -2, -16, 3, -21, 14, -50, 46, 19, -13, -52, 68, 31, -21, -10, 23, 31, -44, -27, -16, 27, 7, 36, 21, 36, -21, -7, -60, -8, -4, -42, -1, 6, 18, 38, 36, -6, 1, -71, -6, -10, 19, -50, -52, 56, -16, -23, -14, 74, 26, 49, -26, 38, 33, 5, -4, -56, -31, 25, 8, -16, 30, 15, 55, -33, -12, 23, 10, -25, -5, -3, 33, 27, -37, -49, 7, 2, -21, -5]
2775erN8k3m5J9M4k2k6MnO8n8l4L2Pm3M7k9J1rLK7kn1M8lm6P3m7J3J0L4j2m0N
2810fM5j9J7pJ7n5J1m3O7o7M1J7j2K6j4L3p7L0M0mp2L7k5L1K3J4p5R9q1O2j18
2841f5N3K0PmroJ0pMj0m3N4Nj3L0K1j7m4K1p7R1k1J8p8Q3m1k6M4k4N9n1K8k6L9
2875B5k0rj3j7L8K2l3L7m3J6m4M3J2n7O6n5k4P2m5KK4PO4j48L0L0N6m4k0mK9K6
2907B3nqOl3RK1k4N6K0r9Q9n0j5M2mk6l7K6J4P6j06O7n2K6j0J6K5l9Mk5j0J0N8
2940D5n8K7k3jpM8rk4j1J0k4J3RnlO0o3J8J3m3K0m4J06m0k9L6o4R4l1M2o5L5p7
2973d5L0NL5l2j8R0j20k0O9L6k8j8N5m1J2n0oP2l4ML2J0j5l4k2Q4Nl2M1p7K4m9
3005c7J15j02PQl5N0j0J0m9R7k7kn5J1pLjM5p4%Q7n0Q2o0NK0n8j4P1jn3ON0J0
$$ y = [-5, -14, 44, 21, -24, -5, 39, 17, -9, -5, -10, 58, 0, -34, -2, 5, -38, 9, -20, -9, -18, -15, 12, 10, -41, 7, 4, -42, 31, -16, -3, 7, 41, 29, -11, -6, 39, 20, 37, 30, 47, -8, 3, -40, 27, -40, 1, 18, 6, 32, 18, 51, -26, 4, 44, 40, -32, 5, -20, 11, 34, 48, -27, 72, -9, 53, -65, -12, 8, 15, 11, 2, -4, 6, -1, 3, -7, -50, 4, 9, -4, 26, 47, 30, -14, 7, -70, 21, 0, 18, -60, 23, -18, -44, 0, -24, 35, -16, 12, -14, 25, 5, -4, -17, -34, 4, 26, -7, 30, -13, 3, -41, 2, 14, -43, 23, -32, -56, 16, -29, -27, -3, 4, 68, -80, -50, -20, 36, -8, -28, -32, -3, 23, 18, 10, 16, -17, -8, 13, -11, 45, 65, -34, 55, 5, -10, 32, 28, 2, -35, -9, 5, 81, -25, 42, -10, 16, 6, 22, 47, 8, 12, -13, -23, -13, 45, -13, 14, -9, -10, -17, 31, 22, -2, -13, -3, -27, -14, -5, -10, -13, 47, -16, 2, 15, -28, -8, -52, 54, 14, -15, 21, -43, 51, 20, 62, -3, 32, -45, -15, -10, 25, -7, -25, 65, -55, -75, -6, 30, 2, -16, 39, -2, 10, -40, -46, 26, -8, -4, 28, 38, 23, -11, -33, 51, 56, 24, 65, -12, 12, -37, 78, -24, -17, -9, -44, 6, -4, 6, -43, 54, 27, 25, -30, -19, -26, -23, -24, 21, -53, -53, 34, -16, 66, 6, 11, 31, -27, -41, 30, 29, -24, -18, 32, 42]
3039D2lOm7L0l1l2M5k1j1M9Pn3J9mK6Jj16J27o9M2n8Q4l4Jj9m1L3j0K6k3K8No1
3072f2O9J0n9K2k2O9q0k0J11K2j13qJ03k3m4NO2j9m5L6Nrm6R2k7j9K3k0n7j9J
3103f2N0L3k0k1OOrL5jJ6l3L6m8k8ML2Km9Q8o2L8Qm0K5J1qN1l0j00L1j0M5m5n
3137e4O0Op5N7K2o0M2J9Kl2l1J0jM9k3k7J7M3l5J2J1n0m7R5j1j4J5k8M5K5k4j9
3169aJ0M7q7K1j6P4o1L1J7j0qQl2qkoK7j7M4Ql5%klQj9K3Rl7J3K6j4qJ8L4n3l
3206dm0J07n1l5P3q4R1q5J6K6j9P0p5K6j2qK8l3L7J8p0J7M1k8nN9m5j8O0J0o5
3237Bk6O6k7k1J%l0N1o0Q8p0L3Nj5M6m2j7l8N2K7k2Ql5N2k4M8j05M1J3j8j3k6
3269e6O7l2j7N3ll3K0oj9J1KLoO5m9K1k6L0l5J0l2O1m7J6j6mj7J6mK2K9l1j7M6
$$ y = [42, 39, 45, -2, 28, -3, -35, 10, -11, -22, 27, 34, -19, 0, -4, 22, 23, -93, 34, -35, 7, -51, 33, -1, 0, -19, -60, -27, -37, -11, -34, -6, -1, -62, 7, 17, -42, -20, -42, 27, -53, -73, 38, 60, -53, -61, 42, 19, -25, -20, 42, 23, -22, 14, 19, 10, -36, 56, 29, 10, 33, 13, -44, -63, -62, -12, 21, 1, -20, -14, -8, -17, 18, 17, 33, 0, 36, -12, -40, -36, -4, -2, -51, 37, -25, 13, 21, -19, 6, 17, 9, 60, 30, -70, -39, -49, -4, -49, -54, 6, 12, -63, -6, 16, -44, -2, 17, 19, -13, -44, -34, -35, 14, -9, -36, -19, 24, -11, 1, 12, -38, -85, 10, -1, -15, 0, -28, 17, 42, 18, -1, 9, 56, -31, -10, -26, 48, -13, 18, 35, 25, 17, 25, -7, -15, -17, -23, 4, -13, 31, 39, 4, 4, 2, -1, 7, -12, 11, 20, -17, -4, 22, 8, 0, 18, 52, -1, -4, -44, 63, 12, -23, 50, -34, 57, -28, -12, 14, -5, 65, -10, 16, 4, -4, 24, -9, 28, 46, -24, -7, 34, 6, 1, 60, 15, -3, 57, 67, 2, -24, 42, 15, -6, -5, -5, -35, 16, -44, 44, -26, 7, 12, -3, 43, 1, -16, -54, -2, 25, 3, 11, -24, 28, 4, 52, -53, -12, 1, -17, -30, -56, 11, -21, -38, 15, 12, -21, -1, -7, -26, -15, -13, -10, -16, 49, 0, 21, -5, 25, -10, 0, -32, 29, -18, -2, -18, -22, -39, -23, -27, -5, 24, -7, -24, 22]
3303B2j2n1J4L3J4k4k0KJQ8m1k9J1J1pK1m9OM7k3rl9JqP9l4m1K0K9No5N0M0l5
3337Go9P8nm5J8o3R9l4JK3Nk0J1Pj0j2K2jk0J8m5pN9k4k4O3l2K5o1N2n8M6n5M1
3371a0N3Kj2j4N7q3L4o6N1n3Q1J8J9q1L8m0L1k0J9%j5j5k7nL9j9K6L1l8J4l4J2
3403gl6K3Nj4LmM9L8m2n8L8L4m9J5j0JJ2O2l8k8KL0q6Q6j6lJ2l9L0J4l1j3M1k6
3437e%j2L1kn6ON2L8n8l0RR7p3j5J3M6k5o2O2m9P7p1M9Ko8J2KN7l1kJ7j3j4LP9
3472F6n8kk5K9qK7l9J3j3j6K0k5l2Q5m1k9M1Rkn7j4L9J3K8j9k9J4K5n0O6Njp9
3505e9O3NNOk0J9rj6nK4l4L0Rpjj8Jk6N5l7K6J6l3j3LKO9k3k3mp2J14m4m2L5j9
3541b3KpK4j0k8K7N0K4Qo7J9j7j8L9J2k4k8Qk5J8J1k9N1k4L0J2m3l8K4K8nk5L9
$$ y = [22, 10, -41, -27, 6, 20, -4, -24, -22, -21, 67, 26, -3, 8, 19, 12, 33, -16, -10, 37, 14, 5, -34, -33, -41, 38, 4, -37, -17, 12, 17, -48, 2, 42, 7, -62, 16, 11, -34, -16, -79, 20, -14, -13, 10, 15, -5, 6, 13, 3, -9, 13, 12, -8, 10, -35, -42, 17, -7, -31, 32, 0, 25, -36, 16, -42, 4, -51, -10, 43, 45, 33, 19, 76, -7, 27, -39, 12, -41, 40, 58, 77, -4, 34, -6, 25, 5, 24, 24, 9, -6, -33, -38, 1, -18, 8, 39, 1, 15, -19, -7, -43, -20, -15, -29, -26, -30, 19, 57, 15, -43, -5, 29, -20, -5, -15, -14, -2, 60, 22, -6, -4, 26, -60, 26, 10, 7, 19, -20, 10, 24, -7, -20, 21, -5, -5, -17, 14, 12, -44, -38, 14, 52, -6, -36, -27, 70, -3, -18, -5, 41, 16, -46, 16, -33, 44, -27, 22, 24, -44, -32, -30, 27, -4, -6, 11, -2, -16, -13, 66, 8, 6, -19, 10, 2, 29, -10, 3, -10, -26, -6, -31, -63, 22, -19, -48, -7, 2, 0, -57, -71, -32, -19, 9, -10, -39, -25, 0, -50, 16, 21, 20, -59, 4, 9, 14, 20, 0, 19, 10, -6, -11, 13, -21, 9, 18, 11, 10, -8, -7, -33, 22, -15, 11, 27, -6, -19, -16, -14, 55, 32, 9, 5, -67, 47, 3, -39, -4, -23, -21, -28, -4, -14, -42, -15, 35, 59, 67, 0, 19, 2, -16, 23, 35, 11, -17, -9, -34, -16, -5, -34, 17, -7, 23, 35, -8, -46, -22, 6, 1, -24, 15]
3574A5l2M6m8PM9n6K0k9P7o5J8l0l6Q0p0N7J7N2l2k2l0M7o7L9ok6L3J1J6l8N5
3605E2k1n3R3q0N2k1kl3l0M7l9NO5j7L0o6J6M1p5O3K1m2j2k1K1l7M2k8O3n4L9
3636A9l6k2j5Q1J2n5L6n6M3K2q4P3l2L6k9O1q7K7k2j6Q9m5j1JqJ4M0n7N8q6J1
3667c8J6M1rk5J5l1K8n5K1P5l6L8j9k7m9J07q0K2Lj5m2M7J8l7N6L2m3m8K5M1k7
3698Dk0L6n6K4Q7j04K6K3j8L4n9M6QJ2k9N7p3K2m8K1k9N5oq0O2J9m4j9L4N6n4
3729a3N1M1q6j7M0p7O3m9J1K1J9O0o3K6l8j8L6j5KkNN6j3n3o1J4O6LN5p0K7k0
3761AM8q8L5QK9n2l5O0J9m6k5L5rJ6M6l3pM0j5n5J5mNO0j7j6%k1oN%M7p6L9K6
3796B9k2M8m0j3Ok2N0l4n2O0o6M5k7N1MK5l1oRj5j5J6j9J9Pl3pM3p1R8K6r9J8
$$ y = [15, -17, 29, -19, -12, 37, -19, 1, -28, 49, -16, 2, -28, -64, 16, -54, 3, 20, 72, 40, 18, -12, 35, -32, 7, 1, -25, 8, 19, 35, -3, 52, 31, -22, 71, -9, 43, 22, 20, -13, -43, 4, -35, -30, 35, 18, 48, -18, -2, 39, -36, 27, 48, 6, -6, -27, -6, -43, -1, -29, 34, -20, 19, -17, -39, -54, 27, 39, -16, 20, -36, 7, 29, -55, 18, -14, 22, -7, 54, -33, -6, -28, -44, 45, 0, -11, -10, -18, -4, 36, -21, 37, -49, -38, -22, 19, 10, -15, 0, -31, -3, -58, -37, 38, 2, 40, 21, -6, -55, 52, -28, -6, -3, -18, -60, -13, 5, -32, 24, 56, 13, -35, -10, 31, 4, -16, 20, -36, -12, 75, -29, -3, 20, 2, 36, -23, 23, 31, 43, 14, 71, -2, 20, -28, -7, -36, 19, 13, -67, -5, 14, -30, -49, -15, 41, -13, 38, 79, -7, -24, 16, -61, 2, -47, -36, -15, 4, 64, 1, 27, -11, -29, 7, -8, -6, -8, -3, 53, 40, -13, -74, -60, 6, 9, 64, -6, 21, 1, 49, -39, -4, 4, 33, -19, -54, 6, 25, -21, -46, -11, -20, -4, 42, 9, 2, 42, 27, -28, -13, -17, -12, 48, 31, 15, 15, -6, -12, -7, -7, 40, -36, 3, 29, 7, 55, 15, 2, 8, -14, 36, 2, -50, 10, -56, -11, -38, 13, 17, 42, 11, 5, 14, -1, -16, 0, -19, 0, 7, -26, -33, 10, -61, 37, 63, -36, -18]
3829a8L9j9m2Q6o6K0k0O3J1o3J3K1jn6K4JO3Mo7j5nK4k9P0m9j0J5N3q7L0L0k6
3861fj6K5pM6o2M1k2J6%K2o3JJ6mJ7pj5p6R9l8M4J2l4J0k3J7L7KJl1k6K2m7M1
3895hQL0m7RL2j8l5L0jk2MlK4KRlm1O7n2K2J8k2Qj4K7l9qO4j01L1N7m4J8l3Q6
3930E5l7ON3r3NM6l0j3ll7L7M1LJp7L6k7P2o7L0J2K7n9K6k9ML2L4l6J1J9n6LN5
3964D4l1Mk2j1kPrL8k7J5J0jl0L5K9q0kL2j7j4nP6k0K6m4n2P4l1k9M6oL0l2l0
3998b9O4l4n2M1K4JM0n4k6K6J8ml8QK4l2L0Jj5N7q4O1p2N4RmN2p5J5K3j03R2%
4031A8j3K6p5P8n6M0J0n8N0K5pOp0N7m8kK8OKj5N5n4m6K5kKM8J2j8n1Ql3N3L0
4065C1k9n8K3L8Lj5RJ3p8P3K6o0O0ql3K4r2N7N0k7L4n4MN5l8K1j6k8L7j3J5r7
$$ y = [-18, 21, 2, -40, 46, -20, 0, -20, 43, 54, -9, 4, 25, 24, -32, -8, -7, 56, 60, -7, -22, -27, -3, -32, 38, -11, -21, -6, 47, -40, -10, 20, -6, -22, 3, -4, 42, -20, 21, -1, 15, 15, 37, -26, -25, -9, -13, 4, -3, -18, -94, 5, -33, 11, 23, -11, -1, -24, -7, 30, 32, 33, 2, -24, -2, -49, -8, 0, 30, -17, -8, 24, 6, -29, 1, 0, -22, -18, -21, 3, 5, 14, 11, -30, 37, -15, 7, 25, 3, 11, -3, 24, -15, -23, 41, -60, -29, 28, -16, 2, -31, 55, 18, 24, 77, -16, -11, 35, 5, -8, -11, -48, -11, 30, 33, 34, -43, -7, -34, 38, -29, 1, 13, 40, -19, 7, -22, -18, 14, 48, 12, 23, 42, -14, -11, 44, 13, 17, -5, -16, -18, -11, -20, 18, -9, 6, 16, 15, -15, 20, 49, -31, -33, -1, -18, -32, -37, 39, 19, 45, 1, -51, 23, -8, -37, 9, 3, 33, 1, -29, 35, 1, -51, -10, 14, 15, 55, 1, -25, 1, 19, 15, -23, -15, 9, -23, 7, 8, -7, 50, -34, 27, -45, 9, 18, 14, 66, -9, 6, 29, -74, 18, 18, 5, 31, -44, 34, -22, 18, 28, -30, 20, 45, 38, 44, -26, 31, -17, -19, 9, 15, 17, 2, 57, 3, -43, -18, -20, -18, 30, 42, 24, -27, -19, -52, 1, 31, 2, -56, -33, 5, 8, -7, 2, 15, -63, 10, 36, -24, 36, 28, -5, 19, -73, -16, 34, 7, 41, -13, -9, 46, 8, 29, 13, -15, 22, 9, 24, -73]
4097g3Q9k7J0j9j6k5N3J8K8p3M4QK3pk1l6K7Nk7l7P8o0NO2j6n0oL7Rj4M0l6JM4
4131C8l6k7L5m5Q3j4QJ0l5jk8L6o2N0Kl8J4pL4j6Pj8K8J6l6J6L8o5m8M8O%j4j6
4165c7MJ3O7m4n8L9L4l7j2M0j2K5k6K7J7kl9L6k4k5J5l6RK2K1l7k2o2N8K3J2k1
4197c2L2J5pnj8L4pqk5J5N0q0J03j18L0K6QpON5o6K2k0kOqK4nL2n5k3K7Pk5L2
4232A3k6PlK0o1N8K5o3M8k2m2PM3q3N7j8M4JK7Mk9n7N8j0QQjPo7N4m5M9k9oN0
4267B6J0p7L1nJk9M6J8mk2L4j9L4oo5P5n4L4jl9M1q2J0L7j2qNJ9N7k8pq1P4k2
4301iM2j6Om7j9R0l5rj8J7Om5K4L7k2K7p0N6j9J7j7n7O3l5Rj5M9L0rk2J5j0J9
4334C3l1o6M5l3N4K0j2k5J6K8k9n1L3L8oj1n6Q2p0M5j2K2Q2p4l2NJ1olJ6J1Jk
$$ y = [-73, 16, -11, -1, -20, -36, -61, -8, 10, 38, -35, 9, 17, 40, 33, 12, -24, 3, 8, -19, -56, 22, -38, -33, 29, 13, -37, -43, -6, 3, -11, 29, -7, -6, 38, 2, -25, 10, -35, 48, 34, 42, 52, 17, 16, -12, 24, -38, 12, 14, -24, -10, -17, 17, 1, 8, -10, 18, 34, -2, 14, 52, -13, -61, -13, -7, -7, -21, -37, -33, -20, 47, 3, -55, -16, 18, -19, -31, 9, -3, 22, -4, 23, 40, 38, -1, 35, 11, -14, 1, -35, -26, -4, 17, -20, -42, -104, -46, -23, -11, -32, 0, 15, 8, 3, -15, 19, 12, 4, -21, -6, 44, -36, 67, -51, -21, 5, 13, 6, 12, 67, 1, 23, 3, 1, 7, -1, 23, 18, 50, -5, -28, -1, 6, -19, 13, -13, -6, -9, 11, -50, 8, 33, -30, 18, -4, -46, -39, 4, -79, -22, -40, 4, 5, 32, 36, 7, -50, 8, -2, 6, 14, 13, 20, -47, 7, -38, 11, -18, -24, 26, 36, -41, -10, -15, -14, -43, 3, 21, 17, -5, 29, 10, 44, 38, -27, 48, -6, 28, 27, -12, 29, -53, -43, -6, -18, -26, -21, -2, 55, 27, 20, -61, 13, -9, 33, 17, 23, -24, -43, 47, 12, 3, -15, 2, 8, -37, -13, 24, 2, 29, -41, 15, -4, 13, -4, -61, 2, -33, -24, -39, 10, 40, 31, 9, 24, 14, 33, 2, -64, -19, -52, 2, 22, 10, -15, 1, 29, 0, -51, -18, 20, 14, 3, -53, 29, -41, 4, -8, 14, 96, 22, -10, -5, 6, 0, -3, 13, 24, 25, 23]
4367B3j4l5k0P6o0M1k8K1J0orJ1L3lm2K0l6k1R6m5KJ8J2k9o0M9Rm2j8N0L7n3L6
4400B3l2kJ0km6O7m6k1N9p3M9j4J8noL4lL2p6K6L1n5L3O6p0l4L5K4pLk4l3M1n2
4434e0M8k4L3rK6kn0kK7KK4q2K9Q1j01K5LL6n0l9P4QK5k5J6k7j6P8j22N2K7jK
4467A6l3PM4l3J8Jj4Oll1O9n5Rj4L8n8L8Jl1%P8p2N5mn3ML8k6l7M2o4N7j4k3Q7
4502D3ko5Q2l5m2l0K4j6qL1L4j1L7K6p5rj1Q5p1j4M7Kk0MK4m4j4P4J5q9P6o4K
4535a4Rm1M5L7l2J0l3K8qJ7m5J5j7L8m5N5L1l5mk9J5M6o0L3j0J7j1j8J3o2R6j5
4567B6n0N6o7J8J5M7p9N4m7N3l1K8Ql2K7r9N8K3OmorK6n1j1J3L5K2m6J8J3k8P
4600gqL1okk7k2M8j2jJ6Ql5O8Jp5n2P5n7L1J4k3L3rj2k3L7K8l0J6K6k7l0PM4J9
$$ y = [23, 9, -26, -46, 30, -30, 11, -17, 4, 14, 8, -1, 10, 43, 40, -2, 18, -18, -39, 57, 12, 14, 32, 44, 15, -45, 4, 13, -29, -47, 3, 40, -13, 23, -9, -11, -1, -3, -49, 18, -28, -49, 10, -63, -14, -28, -10, -15, -21, 13, 10, 42, -34, -8, 23, -32, 1, 67, -3, -37, -2, 22, 15, 18, -6, -39, 2, -50, -2, -26, 7, -2, 24, 22, -28, -30, -3, -1, 23, -59, -30, 51, -50, -25, -22, 14, -36, -75, -1, 7, 32, 7, 23, -4, -20, 58, -64, -12, 15, 14, 16, -17, -10, 34, 1, 19, 20, 6, 12, 9, -22, 47, -8, 1, -13, 25, -33, 5, 6, -25, -25, 53, -19, 36, 32, -21, -17, 21, -5, -42, 0, -64, -7, -21, -44, 43, 41, -24, 58, 23, -19, -49, -25, -41, -49, -18, 16, 5, 42, 68, -7, -16, -27, 58, -13, -27, 20, 22, 2, 6, 30, -14, -28, 46, 61, -28, 48, -16, -14, -5, -46, -1, 36, 4, 14, -19, 9, 1, 18, -27, -12, -29, 9, -36, 19, 50, 15, 11, -18, -3, 43, -17, 16, 6, 23, 12, -6, 7, -55, 41, 26, -24, 32, -35, -17, -2, 45, -34, 20, -27, 26, -5, 23, 31, -1, 26, -73, -15, 8, 14, 10, 4, -5, 21, -30, -41, -28, 7, 29, -17, 1, 14, -14, -7, -15, 16, 10, 8, -19, -41, 7, -5, -6, 10, 18, -17, 51, 52, -23, -75, 0, -57, -26, -12, -35, -2, -11, -23, -46, -9, 19, -11, 5, 31, 4, -26, -19, 25, 44]
4635D4k5l4rK8qj5L2m6j1P6k1Kj6%j2J5jn7J36q2j4k9K0Q1m9qJ4Pj3k1%K8k0K4
4669A6nJ8n3J3j5p7Q5N5n3N4n1L0j1k8K0QK9k9L0o9L5J2o0L7kJ3J3J6n2L5l2L5
4701A7j0Kn5P0Qk5l9j1P8l7Lk0JlO7Kn7j0P7o1Lo0PM4k4M6qm3N0K1j4k8K7rn8
4736d9K0M9n1J2K3Pm9OM0k5O7n2K6l6Ql2Q8q9K9JNm2M1l7O3%m3K3O1o6%j0j0K9
4770Gn9N6p2Q2m1M9n0M2J7j7P5j31L1M6ok0jLM2l7j1m9N9jj3N6j37P3OK7L6k7
4802C5k9j5K3j8ml9J05o5K5K0k2M0m1jRl5K0l7lM9n9K6M1n2mPj1j9J4P5l6m4M5
4835@K5j13J03l8J04p7j3l7M7K2n8N5o0N7J3n7L7l2N7l8M0J2l8l8L6k8N5p0L2
4864bj9j2k8M5N6n6Oj4L3l1K0k9M0n5J2L3N5l1j4oKM1n1P4k9q6J12jq5LJ4j8N7
$$ y = [44, 19, -15, -24, 4, -4, -19, 13, -33, -44, 32, 11, 13, -3, -3, -15, 0, -1, -58, 78, -4, -18, -47, -27, 54, 5, -3, 11, 18, 5, -16, -16, 12, -8, 16, 11, 29, -24, -11, -26, -103, -18, 37, -16, 38, -13, 17, 6, -22, -2, 6, 35, 6, 36, -33, 2, 14, -46, -9, -11, 2, 15, 31, -21, 14, -18, 17, 7, 9, -46, 24, 32, 7, -32, -43, 35, -2, 1, -19, -18, -21, 46, 48, -9, -19, 58, -3, 0, -60, -53, -9, -33, 13, 5, -38, 12, 33, 19, -9, 18, 9, -49, -29, 20, -31, -19, 4, 11, -38, -32, 8, -17, 50, -2, 24, -12, -4, -36, 52, -37, -8, -7, -2, -44, -3, -40, 23, 23, -20, 3, 64, -2, -2, -12, -22, 7, -52, 4, -68, 14, -27, 22, -28, 14, 31, 14, 89, -42, -11, 35, 29, 9, 8, 11, 53, 16, 5, -44, 15, 14, 1, 57, -80, -7, -1, 26, 62, 35, 6, -9, 14, -4, -8, -47, 58, -7, 18, 38, 16, 56, 15, 14, 23, -12, 8, -29, -32, 17, -42, -16, 25, -27, -31, -24, -35, -54, -40, 35, -1, -45, 0, 25, -88, 15, -23, 81, 4, -9, -46, 1, 23, -35, 20, -40, 17, 30, -27, 10, -22, 35, -3, 37, 49, 11, -27, 9, -19, 36, -34, -2, -21, -33, -61, -16, 40, -16, -10, -24, 9, -22, -2, -31, 9, -46, -34, -1, 54, 23, 9, 3, 5, 46, -5, 69, 40, -46, 66, 65, -20, -17, -3, -21, 36]
4897C6j3j7N7n4k3PL0l0J7Mrn8J21o0K9nr1O9pM2m6Ok8K0k1K0M3l3j5L5NJ4n1
4930fJ9k8L8JPrqo4L2O3l6Rm2K7L4mm8j6K9Ok9j1n1P4PN4m1K4l4K8J4J8p6P2L
4965E6k8l0L0l1J9k6NK2j0j8k0Q6l3Kk1kl4N6k9L4q6R9j5ml2M8j9n9OL0J1p4J02
4998C5j5n0L7Qqll7N3J1o1M2k7L6k6k9L9Jj7J8l6L7l8M8J6n2N0j8J9o3K8k4jN8
5031C1Pl0j8p4J07J2l7mP7o3Nl7j5J7K2j2rJ8L8m9L0Qnm6L4k7mQ8o9m5J12m4n9
5064d1Q4m1k6L4J3ql7m1O2l6N7K8o1kN1j0on9K3J1n5M7K9Rj4M7j3l6k5j0K7k9
5096b8K2lNL6k1j1L4Om2N9l1j8qk5J5L5m9K7n9R9l6J05j32K4Pk1QLKJ8J5o0nk
5130c1L1l8L1k2N0l3N2l9j2jL8K7j04O2J5L0l6lL3n4L0m6KJ4L5k3k2N3k4mM1o8
$$ y = [36, 23, 6, 63, 9, -14, -7, 23, -7, 10, 14, 5, -53, 68, 8, 37, 32, -59, 10, 3, 45, -1, 5, -23, -3, -24, -4, 39, 6, -9, 26, 31, 45, -6, 13, -15, 23, 24, 31, 22, 14, -50, -18, 45, 9, 18, -24, 3, 37, 33, -15, -31, -2, 4, -25, -36, -87, -13, -6, 48, 7, 31, -3, 25, 39, 57, -19, 53, 56, 28, -2, 28, -3, 16, -10, -5, 17, 7, -11, -31, 55, 22, 24, 3, 1, -33, 23, -6, 28, -58, 41, 26, 22, -10, 38, 19, -40, -34, -4, 7, -67, 35, 20, -30, 7, 15, 7, 4, -33, 20, 31, -30, 12, -15, 21, -5, -34, 5, 6, -11, 7, -29, 8, -30, 18, 34, -18, 32, 14, 33, -30, -2, -26, -27, 31, 38, 8, -10, -84, 23, 35, -2, -6, 71, 8, 13, -24, -39, -22, 0, -12, -21, -3, 35, -14, 16, 24, 19, -27, 7, -20, -24, 64, -5, -50, 62, 18, -41, 43, 2, -24, 10, 23, 15, -22, -63, -1, -37, 20, 48, -13, -15, 36, 26, 20, -39, -16, -5, -60, -13, 16, 25, 11, 58, 45, 9, -16, -26, 1, -28, -6, -9, -4, 32, 11, 0, 34, 40, -2, 57, 26, 8, 0, -25, -10, 25, -24, 3, -56, 43, 7, 112, -20, 4, 11, -10, -2, 1, 3, 21, 36, -24, -29, -31, 0, -38, -7, -29, 21, -12, 40, 1, -11, -12, 26, 53, -51, 11, 26, 56, 20, 17, 50, -4, 26, -20, -18, -4, 31, 8, -14, 39, 15, 11, 52, -16]
5162a6qN9k0ok3K6j9nJ6M8q2OL4J3l3L6j2K4qk0m6M2j4K1j4K7k5p2P2jm2N4J8
5195C0%m2L1k3%K4n6NP3l2mJ9K3k7l0JK1l8R6q3K5J8m1K3jmJ2J4n1J5l8NO6kl0
5230ao%K3l1K1J5Lk3J2%JNn7RN9k1L2l7Mk3%kL6J3m0O7k3J3l6k4Rn3K6K1l1Q0
5266D1L0n4mm6L3L6m3M2o8K5RK8Mj03L0K1K4j8k3K8k1kj6K3L1Pn2O7m3Lj7kKK0
5300hNm1N0lK9n5j1M8OpJ6l4k0J7M7k8J2j2j2J4mL7QKp5%n8N9k8M9L1p2K4J9Q0
5335H5j13K4L9o6M2j4Ok6L0RRpqJ7QRk1JRr9Q6k8L9qPpl9L0k4j6J6Lj9J0Jj5K4
5372fJ2K7k5j1k3K2J7m9L7m2L8jM5n5M1k6k3OM6l5j5N5l5nj1j3KO6n9N1k6l8K0
5405a3jj0K4m8Q7n9N0k0n3M3l8K0j8L6j3K3m8P4jk6k5K9nJ5k4k5L5n0K5j2M7m9
$$ y = [-16, -24, 35, 15, 9, -14, 12, -7, -12, 4, 52, -30, -24, 10, 23, -10, 26, 14, 38, 30, 10, -36, 6, -8, 13, -1, 26, 1, -71, 1, 0, -42, 12, 30, 30, -12, 19, -4, -4, 20, -36, -31, 42, 10, 6, 25, 48, 21, -9, -8, 13, -25, 71, -12, 13, 31, -10, 13, 12, 8, 20, 34, -17, -2, -40, -35, 31, 29, -1, -7, -7, 16, -15, 6, 21, 24, 1, 13, 13, 14, 19, -38, -29, 30, 9, 41, 4, 8, -15, -15, -17, 19, 32, -8, 59, 36, 49, 13, -11, -2, -55, -29, -8, -39, 41, 71, 17, 13, -33, 0, 36, -7, 35, -33, -8, 1, 29, 33, -70, -40, -19, 5, -13, -36, -8, -29, -31, -47, -24, 7, 14, -38, 29, -14, -11, -28, -30, -28, -8, -3, -44, 6, 3, 32, -23, -34, 14, 20, 13, 29, -5, -25, -8, 39, 11, 23, 11, -1, 13, 9, 46, 54, 56, -19, -19, -77, -18, -46, 3, 34, -38, -14, 5, 85, -28, -4, 35, -31, 11, -3, 3, -23, 7, 16, 25, 18, 10, 27, 35, 44, 23, 24, 33, -66, 20, -8, 31, 23, 30, 23, -16, 14, -10, -26, -10, -7, -26, -16, -15, -30, -6, 6, 33, 8, -3, -26, -4, 13, -36, 1, -41, -3, -4, 41, -14, 27, 1, -22, -16, 30, -5, -20, 35, 0, -5, -16, -29, -27, 39, -20, 31, 5, -33, -13, -14, -24, 0, -48, 39, -20, 30, 10, -43, 0, -38, -18, -36, 0, -13, 10, -38, 36, 35, 9, -16, 13, 8, 23, -1, -26, 9, -41, -16, -28, 19, -30]
5437c0K7O4r2L5j7J4PlK0k4jJ2rom4PO3nK8k3j9k8JL4l4L1RJ5k3j2M1m7rJ7J8
5472A7l8K2J1m1J9kPJ2L3p2N4m7O1qn3j9L7j2jPL3K8m1J5pJo7%O6QL4l7o8JJ8
5507b9M6l3%K9n9P5oo3J06k0l2q3O3Lnn2M3K7k9K9k5RMj7l2K2L6n8M3MN4l6j8
5540dQMj5nM5p4R3m9k5K1Jj0K7m6k1RQM4l4j7P3j0k2Kl6K7pJ9J1RK9m8m1M6k6
5575a4J9p2M0QM5o1O9n2j6N0j5j1l1MK6oJ1KO3l7n3J7l2nRJ8JlL7L9p9j8O9K3
5609D5r7K7J5K9rK2k6M6k8L6j21N7pnJ5n3N1K2Nr0J01m6JL7n5N2k4M2Po5M1qL0
5642D7q4M1p4Q5k7m3O6m0M1k3%mJK8opj7l2P6ml0PnnpM3j4l7J06o7j9koO9Lo3
5678cN0r9P6J6k3jqP0p8j4JM2j03R3k2NL9k3K6p5j1QL2K7l8K1J5rmqk5LN0k2o
$$ y = [-30, -3, 61, -31, 4, -13, 1, 8, 5, 25, 1, 0, 12, 3, -3, -47, -40, 23, 18, 46, 23, 4, -24, -23, 11, -23, 8, 17, 32, 9, -3, 38, -9, -18, -1, 17, -21, 1, 12, -29, -10, -12, -5, 7, 40, -32, 22, -25, 36, 28, -25, -44, -7, -19, -20, -13, 20, 48, 7, 22, 15, 16, -51, -51, 15, 23, 57, 20, -48, -47, -29, 17, -16, -16, 13, -46, 29, 23, -40, 66, 46, 14, -69, -6, -3, -8, -60, -17, 10, -19, 10, -15, -6, -2, -19, -51, -29, 7, -51, -8, -4, 50, 14, -4, 4, 8, -7, -12, 33, -41, 52, 3, -22, -1, 0, -10, 17, -29, -50, -41, -33, 11, -23, -40, 33, 23, 1, 3, -33, -6, -13, 6, 17, 26, 55, 7, -34, 12, -14, 5, -67, -27, -19, 26, -35, 34, -18, -34, 16, 1, -10, -41, -37, -11, -17, -6, -4, 59, 22, -31, -14, -46, -51, -42, -24, -23, -26, 11, 50, -29, -47, 22, 45, -52, -25, -10, 19, 10, 32, 6, 52, 24, 60, -61, -4, -11, -16, -1, -54, -3, 19, 24, -66, 35, -11, -10, 27, -28, 24, 0, 42, 49, -16, 25, 17, 47, -37, 4, -70, 15, -12, -55, 11, -29, 12, -11, -11, -15, -14, 14, 8, 1, -16, -48, 28, 24, -6, 1, -4, -9, -16, 27, 13, -24, 82, 15, -4, -6, -12, 57, 60, -3, 47, -52, 24, 40, 17, 16, 8, 78, 0, -14, -13, 29, -74, 19, -3, 2, 41, 18, 44, -31, -42, -34, -2, 25, -13, 8, 23, 14, 10, 2, -23, -20, 30, 8, 2]
5713B%j2j3jP4l1L0n0j5K9p5R6p4MP8lol0P0r9J0LJ3j4M6m1m0N6L1j1o6M6j7J8
5747Hj0n0M3M6%n1qK0l3P0o6M9nn5K5K8p8O0P5o5k9N4K6m8lL6k3K4o3M2l7J1j7
5780b4m3P6k6M5J6k9jnJ6l2j7N4l9l2Q0q1j4O8J2l4nN8o0L2Jm2K0J1n1N3lQlp4
5814f5O0K8J3k1k1K1J6q2L3O0%n6J6Kk6M7k1k0N6ol4plL0k0L0m5j1K2L8Qk5J5
5847C2qj1m5N4j1m4j2Q1n3K4kqL1p9L3rM4Kn9N5J4j10O9ok6L6j9j8M2jj2pJ7J6
5881A0J1O9j16N1j8O2p3J0l4J9k7O8n9L1J4m8JLN4k8J2M0j1k0l4K0QJ1n5j2k5
5912f6N9K4j6PKJ5o2M1PK1k2N9n0m5QJ8J7k3J4j6J7K4j3n8O0Pj7M7o8K8m4L2l9
5945c2L3l7J9K8l4k9M0K0NOqk7P6n4j9JJ8J2k3J9N0r7L5j5L0kl9J4l9P7k2K2n1
$$ y = [2, 2, -10, -23, -24, 50, 19, 49, -1, -16, 13, -62, 34, -40, -36, 42, 39, 33, 3, 73, -26, -16, -13, 0, -14, 32, -9, -49, 7, 38, 27, -39, 7, -10, 8, -2, -52, -9, 37, 37, -14, -22, -2, -35, 35, -31, 18, 13, -42, -17, 11, -67, -7, 68, 3, -26, 28, 54, 6, 3, 39, 16, 40, -23, 19, -18, -7, -24, -67, 9, -17, 28, 44, 15, 14, 9, 25, -7, -24, 30, -9, -41, 39, -42, -56, 12, 24, -10, -15, 43, -17, 15, 16, -26, -6, 5, -46, 7, 4, 12, 9, -65, -5, 23, 36, 15, -6, 15, 31, -51, -18, 42, 42, -14, 2, 4, -22, 25, 4, -16, 40, 34, 0, -7, -10, 20, 0, 30, -15, -26, -4, 34, 42, 17, 32, 24, 13, -32, 22, 11, -33, -45, 36, -17, 7, 5, -3, 28, -51, -18, -27, 17, 19, -40, 15, 29, -81, -12, -18, -44, -8, -27, -45, -3, -4, -16, -23, -6, 10, 21, 90, -26, 25, 7, 69, -4, 6, -28, -9, -36, 32, -27, 4, 18, -30, -29, -26, 28, 0, 12, 52, 41, 21, -13, 7, 15, 26, -29, -41, -66, -7, 17, 1, 8, 10, 25, -37, 4, 11, 32, 10, 69, 19, -26, -18, 0, 17, -6, 8, -8, 9, 33, 20, -38, 22, 29, 12, 59, -9, 19, -25, 7, -32, 1, -36, -17, 11, -23, -52, -12, 8, 13, 19, 11, -16, 60, 6, -13, -12, 6, 18, -5, 14, 64, -33, 2, -13, 17, 15, -24, -10, -49, 28, 6, 28, -23]
5978b3J1L1nnQJ3q9P0lJ4k7m7M6K7j7l0J5%OP0n3j1M0l4J4Rj8m3ql8M7lM5L1k2
6013B1n0M6Pk3qJnk4N1mJ2j2K2l8Kj0J6j1JK6jK0m2M0kk9kLj8Ql9J0Mk6N3L0n9
6050c0J3M8Rl5o6O0mJ6m5L0Rk1O9q1N3k3K8j4o1J6J18r7rJ0QM2n9k2N2K4m8N0
6082D0p1K2j9KM5J7j06K3R9m4Lk5L9k1mk2NJ1M5J4q3j7LQ4j7jn2L9Nj2qL4o9j2
6116e3M3O7o2mJ9k6M0J2n4ml0N2J7m9J5%J7K0k0n4K7J7K6o6P4o6K5k4K6KJ1QJ1
6149A7l2R0j10Q0M4q7l2M8l7N9l0l4J2OM3k3J0m2K8k1l0RO7k6p6N8m0M4k2J6L9
6180B8m5MQOkOjN9n7K0n2N8j5n7L8L2ln1J8K7j9k8J4jJ2l8P8l8M6j13P1j3l5P
6214c6K4M7j1n0RR1o8N2j8o4L2l4OJ6n6KM6k0J1J7rN5o7L5j9M1J1lqk1l0j3nK0
$$ y = [-23, -12, 19, 14, 9, 17, 30, -59, 11, 8, 22, -5, -52, -6, 21, 4, -26, -11, -11, -5, 65, 12, 1, 41, 7, 21, 30, 12, -31, -39, -77, -30, -33, 12, 43, 21, -29, 17, 24, 1, -7, -6, -11, -35, 16, 12, 24, 12, 34, -4, -2, -12, 4, -7, -6, 20, 19, 39, -3, 37, 35, 6, 4, 7, -11, -3, -42, -32, -28, -54, -1, 29, -30, -17, 31, 40, 5, -61, -1, -5, 11, -34, -4, 5, -16, 53, -28, 25, 2, 30, 16, -45, -29, 89, -8, -17, -7, 1, 43, -16, -38, 14, 38, -10, 40, -31, -9, -28, -26, 19, 36, -70, -47, 52, 8, 11, -14, 25, 4, 0, -22, -17, -6, 39, 53, -30, -47, -44, 40, 23, 22, -30, 9, 14, 2, -6, 28, -41, -53, -10, 57, -5, -9, 10, -16, 24, 36, -18, -22, -52, 0, 17, -32, -17, -17, 0, 20, 0, -54, -27, -10, 16, -50, 24, -42, -17, -41, -15, -13, -2, 6, 17, -15, 75, -35, 45, 89, 2, -30, 18, -19, 40, 10, -24, -12, -6, 37, 14, 24, -18, 10, -11, -41, -32, 35, 9, -67, -9, -49, -5, -27, -11, 28, -17, -13, -5, 1, -1, 5, 4, 63, 6, 26, -26, 32, 17, -40, -2, 30, 27, -24, -6, 21, 2, -26, -12, -13, -1, -39, 39, 1, 47, -66, 5, -8, -43, -36, -12, 35, 24, -26, -17, 74, 6, 58, 40, -24, 8, -26, -20, -4, -60, -58, -12, -32, -21, -4, -13, 42, -25, 10, -9, 32, 43, 40, 32, 11, -19, -32, -37, -17]
6248a7MJ1mn3Q6j8K1j3Qk6Kl8N0K7j1Qo8L2j9J4N7j01N1J2J9q0M7KMk7P1k0n2
6281b1pO1n5K1K6j2J9n4Kj6K7O2p6QL5ko2j3LM2M4k9M9p7l1L0L6J7K3k6j7N1m7
6314A1m0N1m3K3l5M7J8j0k6KQqK6l8L2o2J9N9j9l7j5J9N7j09M1j7O6M0p6K3l1
6345b4K8pJm2K4J4K9p5J1M2j7K3n0M8P4r8M4L8l6k0m0R0k8q9L8j5MPJK3l1PP4
6378D8r0M9J9lo8Q2k9p%j5K8K2k2j9N9Oj05P0l0k1JK6l1K4nK7J0n2qN1k9j6KL9
6412A3k5l5N6J1l3L5l9L3m7K0rkL1n7K6K0j5k1L7qj7M5J3qo1lO9j9m0P5n2M5k6
6445A2Jm6O4o9N7Jl0J0k4J32j15nML0n7N3j7L0l6J2K1o6M3l0j4P2m7qJ0LK3J2
6477B6j3nm4O1n6L0j9k3JO8j1k7K2l8j0N7j7Jl0NJ3L1l3l9J04n3l6R4n6J9k3k5
$$ y = [-17, -13, -2, -6, -59, 27, 9, 30, 17, 25, -1, 1, -37, 13, 40, 29, 37, -31, 1, -18, -4, 53, -48, 3, 15, 34, -46, 1, 3, 7, -20, 51, 31, -21, -28, 33, -22, -1, 25, 13, 32, -22, -20, -36, -9, 53, -23, -15, 20, 18, -44, -57, -54, -12, 32, 3, 52, -25, -56, -26, 10, 27, 50, 24, 7, 58, 11, -29, 22, -21, 2, -33, 14, 32, 22, -4, -2, 6, -2, 24, -14, 18, -44, -25, 34, 15, -22, -37, -18, 39, -70, -29, -46, 20, 60, -16, 7, -24, 4, -3, -2, -44, -20, -6, 23, -52, -41, 1, -16, 7, -43, 5, 79, -19, 25, 63, 27, 7, -33, 57, 29, -60, -22, -37, -33, -26, -25, -2, -33, -26, 48, -42, 7, 26, 23, -45, 37, 8, 1, 1, -14, 14, 36, 14, -5, 54, 60, -45, 25, -5, -26, -25, 1, -30, -6, -11, 16, 26, -26, -34, 17, -12, -28, -26, 13, -12, -47, 9, 20, -13, 22, -17, 16, -31, -11, -20, -22, 9, -48, -22, -2, -17, -38, -1, -9, -26, 19, 32, 24, -37, -40, 29, 10, -30, 45, -7, 38, 12, 13, -33, 31, -38, 19, 20, -10, 0, -24, 108, -7, -12, -8, 22, -35, 18, 1, 31, -5, 7, 28, -38, 5, -25, -39, 33, -14, -22, -12, -9, 14, 26, 13, 8, -36, 25, -31, -1, -20, -43, -42, 26, 15, -12, 10, -28, -38, 19, 2, 3, -27, -22, -9, 22, -11, -50, 54, 1, -35, 59, 3, 22, -1, -26]
6509b6M2j6J3l0mM4k5pkK5rJ1k3J8J0J9n1PNL7p5M9j0l1M5m4N1L4m0J5k0m3qL1
6543hK8m5J6k8P9m2K3o0N0m9L7k8K4M7o8L5r0J8J04o1L5k1j9Q0q3M8Qk4j0nO2
6574E3m8m0QK2L4l3kJ9K8m2L7jo7J7j7JPRoL2m6K8pk5J10r0J2RK2on4N6p6Q2m8
6609b2M4o7k6R5o7mO4q3N8N8p4M1J7r0J08n0opNK5m7O1p0O3Rm1lNL3j3l0K6PK1
6643D0j2j8J2k4JmL7kk4j3K6Nm4PK0j4K3n2K7K1Qk0N1q9K9K3J5o4M8kk4L7q8N8
6677fl9Q6k7p9O2K4Nl5K7m8J1j1P0l9l5M5j2pJ9J8Knk9l7L5J1j4K1k8K8pn1P9
6710C4m2K1km9jL6J8J8l9j8LK6K1n4M7l1K7J3pm6L4L4k8mKLk1M6k2l0kNj5K5K
6745DJ0L9j0o2OMj3j9K2j4j4k3N7K7J3m9qln2P9l3P8m4o9Q0nN3p4M0J8j0K5n4
$$ y = [-26, 16, 0, 13, -17, -21, 23, -2, -9, -11, 14, 5, 16, -7, 11, 21, 40, -11, -4, 1, 38, -37, 12, 2, -29, 16, -28, 23, 57, 17, 32, 12, -31, -39, -8, 20, -25, -9, -37, 42, 0, 23, -37, 13, -36, 1, -27, -3, 44, -24, 11, -79, -61, 43, -18, 17, -4, -23, 57, -26, 22, 30, 6, -4, -9, 53, 5, -35, -27, -5, 29, -4, -6, 13, 41, -1, 36, 35, -32, -15, -32, -31, -24, -15, -21, 11, -35, -7, -14, -39, 71, -19, -7, 2, 24, 18, -36, 20, -56, 26, -22, 22, -45, -71, 24, -43, -47, 17, -66, -8, 50, -24, 17, 34, -56, 52, 2, -4, -11, -6, 19, -28, 33, -37, 26, 35, -6, -9, -4, 29, 16, -14, 12, 19, 40, 28, 10, 22, -2, -1, -5, 32, 30, 6, -7, 19, 24, -20, -13, 7, -7, 16, -36, -9, 12, 20, 0, 51, -38, -9, 14, 29, -35, 13, 11, -13, 24, -64, -6, -45, 41, 14, -65, -3, 21, 26, -9, 18, -30, -19, -30, 40, 1, -34, 11, -1, -8, 11, 29, 31, 26, -3, -40, -5, 6, -8, 13, -15, 13, 6, -45, 34, -8, 13, 11, -38, -39, -3, 15, 33, -6, -24, -21, 5, 26, -28, 19, -12, 15, 28, 21, -25, 9, 43, 15, 11, 13, 16, -5, 41, 19, -11, -13, -8, -23, 2, 4, 14, 53, 43, -19, -13, -9, -22, -41, -19, -33, -47, -70, -13, 14, 27, -22, -30, -33, -85, -6, -39, 39, -5, -74, 6, 1, 54, -20, 20, 38, 28, 53, -1]
6778am5N1QJ1lo9J7k0M7J8k3LpO4n2o2K5K4RM3n4L7k2l4JJ3K7K1j8j9M8j3K1k0
6812B6k5K0Oj1k7j3M0M3m3m2jK8m4M3K3rJ3n3N9l7j5J4L9j08M6J5J1J0J5j9n0
6843d6J39j02j3K1J4l3K2l1J6nj3m8O0j5L9K1J6p2N7Rpno5L5L6l5j0poJMM1J9
6876C7n4O4o5Q0q5P7p3K4K7o0K8j2j4K9M4m1K6m6nj2M0j3L8r9O0n5Q6m8M1rL1
6907D1J7k9m3J0LnJJk3J6P9o9l9Lk3J0P1j9J8K2r8P3m6J0l7N4K9rJj2j9K7k9j4
6941b8Q5o6l3J19j10J2O4k5n0N8k3J2n4O5k2Oj4N7o8nK4m1M2rl4K9m6N9J0l7j
6972b4K6O1j03K4j2L5j1j6j3L5Pm4J09j01K5pj6L7j4P3o0LlK3j8K7n5k5N6J0j7
7003A2KM0n8J7Opj05P7M9o8L3N4l5m5L9k6LL4o2L3J8k0N9j7j8j0M4k2o9RmO0o
$$ y = [-1, -46, 5, 13, 24, 21, -48, -31, -51, -4, 14, -9, -6, -13, 51, -1, -63, -38, -14, -5, 38, -16, 21, -1, -35, -34, -21, 6, 27, 9, -10, 38, 25, 46, 26, 1, 21, 27, 16, -11, -24, 16, 59, 16, -26, -27, 1, -43, 0, 23, 14, 27, -26, 33, -4, -19, -5, 34, -74, -28, -13, -2, 8, 23, 4, -46, 93, -9, -22, -1, 13, -20, 2, -29, -13, -18, -31, -79, -19, -34, 5, 26, 42, -30, 27, 36, 29, 24, -41, -6, 30, -5, -15, -22, -28, -27, -23, 18, 37, -17, 47, -18, 62, -23, 54, -19, 5, 32, -28, 0, -12, -26, 3, 47, 6, 32, -14, -19, -31, 9, -4, 34, -65, -5, -60, 26, -22, 19, 10, 41, 58, 29, -14, -4, -1, -6, -5, -4, -27, -11, 68, -1, -40, -37, -60, -50, 21, 2, 20, 42, -56, 17, -29, -19, -56, -2, 27, 18, 19, 7, -12, 15, -14, -28, 57, -9, -42, 77, -33, -21, 43, 18, -32, 26, 3, 15, -39, 26, 4, 10, -4, 53, -15, -20, 4, -37, 5, -4, -38, -9, -55, 4, 14, -23, -24, 2, 63, -40, -16, -28, 7, -4, -20, -33, 2, 9, -35, 74, -27, -2, -9, -25, 12, -2, 71, 11, 14, 11, 34, 16, 43, -12, -37, 19, 29, 12, 14, 54, -4, 13, 19, 12, -93, -16, 33, -35, -2, 52, 17, -28, 11, -15, -12, 22, -40, -7, 11, -9, 50, 33, 15, 5, 49, 27, -42, -33, -37, 23, 17]
7036A7K7m0J2l3j5k1M8mJ0K0L2q5P1o9QN6m5M3kl3J6kj5L2n2m8N6J9k2J1kNO1
7069E6J4n3l6J3K4k4L2m5R1o5NL6o1M1n2N6q4R2j6k5l5K6K8o5L6M4J2l3Jm9M3
7100Gj8P4l9J2m6kkK3L8Lo6J5M1q3k9J0K8rO1k6L1K9k2o0N5K5m5Jn2L6Qk7K5j8
7134b2k4M3QK5p6L8J3J6Kk1M8L1r0m0j5N0pM6k2lRlk5O0l4lk2N6o8K0K5Rl7J1
7168bpJ1Rpj2q7O3O1j8k3M5jp1L4j4K6MJ6q5R2q3L9N3k0j7Ll2L0oj8M1o1P4m1
7202dK1K8j23R2m8M3J2lk9l2K5L5Pj0mj5jM9j4m1K0rLl0J6M0m0PJJ1K8m9P1n6
7236AJ7jPm0KL6l0N1o1O4n6PjM2pm2kN1L0o5O4j04M1OK0m1M7rKK8n8o5P6j3L1
7271B8k4J6K3o4MM4j3K2o6P6o5J8L3K8o5J0l5K3j4P9n2oLm1O7rrk6qk5J19m8l6
$$ y = [17, 44, 4, 16, -17, -32, -53, -5, -9, 1, 21, 53, -32, 39, -30, -22, 34, -11, 32, 30, -3, 13, 11, -4, 28, -24, -72, -16, 3, -19, -8, -10, -5, 56, 70, 17, -19, -6, 18, -6, 26, -19, 72, 7, 12, 48, -13, 28, -24, 32, -52, 40, 24, -1, -36, -10, 18, -47, -11, 33, 45, 12, 13, -36, 7, -11, 63, 24, 36, -10, -12, -14, 9, 47, 50, -16, -1, 40, -43, -72, -62, -34, -43, 18, -8, 23, 52, 30, -30, 25, 50, 5, 6, -46, -10, -2, -29, -4, -22, -46, -3, 5, 30, -46, -8, 5, 21, 23, 2, 50, 81, -9, -49, -64, -14, -21, 25, 3, 0, 9, 6, -19, 41, 7, 4, -18, 38, -30, -10, 15, 24, -13, -2, -9, 2, 11, 4, -8, -95, -32, 29, 11, -12, 33, 32, -39, -5, -19, 7, 11, 27, -58, 34, -49, -10, 43, 23, 6, 9, -23, 7, 1, -17, 24, -37, 37, -4, 17, 45, -78, 14, -34, 9, 21, 18, -11, -43, -18, 17, 24, 14, 10, -5, -6, 43, 29, -12, 8, -1, 2, -28, -12, 28, -12, -5, -4, 7, 35, -14, 57, 1, 18, 17, 24, -16, -14, 22, -8, 43, -18, 46, -10, -3, -4, 38, 31, -11, -13, 38, 68, 3, 67, -37, 4, 10, 30, -11, 36, 27, 29, 57, -1, -66, 10, -3, 28, 4, 20, 43, -21, -17, 27, 14, 36, -30, 46, -19, -1, 32, 60, -5, 5, -30, -7, -21, 58, 6, 0, 3, -38, 29, 20, 11, -15, -23, -48, 71, 23, -13]
7304a3Jk0Pk7M9nl9J02l8j7oL4m2N5m2m2N7j1K9k6k6M2J0Pn7j8L7m0Nk8N8j3k7
7337d4O2o1P4m5K6k0M3l4JN0l9No2O4k3M6j03L1Q9k5p9L8nk4l4R7lRqk7J6Nn3
7370c3P8k6k4L6j5j2j4QLk0n0J06n3J7k8J8N0jp3k6O7j6k3O2j9J5j1kl0P1m8J2
7402A9J8Jn2KP2p6lK4Q4p6K1l3K4n0Q8r8M4n8N8j2J6lnk9M3l6M6j5j6N3k2q1N0
7435bpK4j6j2Qj2L3l0mK1o0L6OjN8p3l8M1K8k2P9l5K1r2RM2Kn3J9k8O7j2k6J8
7469a1j0J1Nl5O0k0m1nM6rN2kj32J24o1kJ0kJ3M1l1J4k9LN6j3j5l7P7m8M0l8m7
7502c6L2J4m2J6j1K6OK7%r1%Q1n1J6K0l0J0M1q2N5M0j6K8o7J7o2O4l6J2l0J09
7533F0q0j9K7J3RJ5n5J14n7j6m7KJ2K9O9Oq4LqM1o5M0N8p5J7K1l3j2K5J3j7l0
$$ y = [-13, -12, -32, -25, -52, -3, -8, -47, 55, 17, 0, -6, 28, -14, 41, -1, -43, 14, 3, 32, 6, -20, 22, 32, 39, -18, -36, 1, -39, -34, -62, -4, -17, -44, 18, -43, 31, -14, 12, -8, 35, 1, 2, 52, 13, 18, -44, 20, -3, 43, -60, -29, 60, 35, -44, -6, -11, -35, -69, 28, 25, 34, 26, -1, 15, 20, -33, 45, 19, -5, 31, 16, 4, -10, -2, 1, -19, -69, 37, -16, 1, -27, -9, 41, 40, -33, -59, 8, -8, -31, 31, 12, 27, 16, 14, -16, 55, 7, 19, 37, 38, -14, -12, 60, -16, -19, 5, 89, 13, 34, 1, 25, -25, 63, -35, 9, -49, 9, -3, 13, 10, 5, -24, 19, -17, 29, 14, -2, 51, 29, -52, -2, -9, 15, -1, -13, -5, -17, 16, -14, -18, 3, -57, -21, -15, -16, 42, -31, -69, -28, 0, -22, 57, 22, 43, -49, -40, 2, 4, -49, -30, -58, 9, -3, -29, -11, -21, -10, -5, -40, 20, 0, -41, -46, 0, -9, 43, 41, -91, 33, -28, -30, -20, -22, -9, 32, 1, 15, -14, -11, 45, 32, 17, -20, 57, 9, 49, 11, -36, -4, 10, -32, -16, -27, -1, 5, 32, 32, -59, -59, 22, -29, -13, 7, -23, -13, 28, -54, 1, 41, 25, 53, -14, 3, -59, 5, -31, -19, -49, 60, -20, -39, -12, 1, 10, 25, -30, 84, 27, 11, -36, -34, -22, 7, 76, 82, -2, 1, -7, 34, -31, 9, 67, -8, 9, 30, -3, -15, 10, 23, 6, -24]
7565b4L1M1p4N0l9j7J21m2n8K0L8q2O7j4j0l6K5n7N4Ll7P4l2N8r0L5j9l1nO9m4
7596b5M3k7M8m6N1m2Pk5j5L2l6M3j3%pk5Q1o0N3l1Lj2lKLK4K3m5ml0M4m2O5k4
7630A0q0P3L6n5M9k8j4mL8j8M8l7n0L7Mq2K7L7K1jpM6n5O1o3j6N3k1Lqn9R5Jm6
7664emRK1K1J4p9l4R3r6K9QL7J3m4Qj5N9k3k6K8o1K3oL1j0Pj1n1P1k7L5l4l%Q5
7699F3p0jK3p3O5m5K8J1j7RO6l3K1On8k1l4J6M5L4p0K9K9r2M6jRm6L8P8j25M0
7731c0J1K0l8R7j9m8k5O6m6j4N2m9K3l1N8rp9Q3m5J7K8J7l7PmJ1m0O4n2L3m8L2
7763EOm6l7R9K3j00M1OO3r7M3Lj9OM9r0R9n1kN1l0k3J2k8L2nj2l5K8l0K4LJ9m9
7797d2M9J4pn9Q8j3j3pl8QJ6N3n7l2M4m5oO8m6O2m6J9Q3j15l5R1p1l9P6J4j4k7
$$ y = [-24, 7, 48, -26, 24, -15, -32, 89, 47, -11, 9, 47, -35, 32, 18, 8, -28, -3, -60, -6, -3, -40, 34, 2, 60, -30, 5, -14, -45, -50, 19, -25, 18, -9, 39, -7, 44, 2, 9, -16, -31, 1, -35, 8, -5, -5, -12, -37, 44, -16, 37, 6, 9, -3, -6, -4, -1, 23, 46, 1, -3, -33, 11, -31, 34, 10, -70, 3, 39, -16, 33, 5, -9, -13, 25, 7, 55, 18, -32, 5, 9, -73, -46, -9, 12, 11, 4, 50, -5, 56, -7, -23, 30, 9, 12, 4, -55, 40, 41, -5, -9, 0, 21, 42, 56, -23, -57, 36, -60, -31, -23, 14, 27, -17, -9, -24, 35, 12, -14, 14, -47, -24, -30, 1, -9, -2, -13, -64, 7, -20, 15, -19, -22, -22, 63, -7, -8, 15, -58, 7, -38, -10, 1, -16, -7, 59, 26, 47, 53, -5, -26, -60, -44, 1, 35, -35, -6, 23, -69, -23, -24, -15, -61, -23, 55, -70, -30, -19, 1, -37, 60, 41, -7, -32, 34, -12, -26, 26, -23, 0, -31, 27, 18, -61, 22, -23, -6, 22, 39, 2, 9, 5, 16, -24, 40, -12, 21, -27, 5, 11, -35, -72, 27, 50, -50, -9, -3, 60, -37, 6, 9, -10, -4, 45, -45, 54, 3, 1, 52, 22, -1, 11, -17, 15, 10, -2, -37, -9, -39, -15, -12, 7, -42, 7, 21, 14, -45, 43, 30, 17, 10, -28, -20, -4, 49, -8, -40, 4, -41, -47, 21, -25, 37, -9, 10, 93, -22, -57, 34, -37, -76, 0, 14, 0, -27]
7829b7O7l4m7O2j9J3j5p7P8n4PkJ1J1MqK0o1M6J6k8P8q0J3O0l3k9N9o5Rj2J0k0
7862d7M8OL9l8n5J1RO2n1kN0j1L0m3l9L1J9m7L0l1oL6%j6O0l8K3o1rR2o1%J8L
7896A2K0l3l1M5L7k6M4n7jk7M4m6K9l8L6N3j1l4Rj9rJ2pm8K4k4Q5l9K8m0K3qj8
7929a5KM5n5L1L%K9k4m2NJ0J6JQl3oPqK8n8P8k6K7J5n0O0m0m4%K2J0jk2M3m0L5
7965A1J1p1L2K4L9q5K8mL0k5m5K3L4Rj2J2j4l5K8rK0l4Q2J9n3k2mQJ2K0ml6L3
7998B2J4m2J2J6K9p0j5L7j4k3M9j7k5M8k7MKj4J8Jn1K1qoP7k9k9K6LOm6%NJ4J5
8033Cn4J0P5k4k7qR2n5m1L8k3l7K9oj1L9k2pM1mK2L0r1L9JnJ8m7LjN1m6k3N0j6
8068gK2jMk6j9N5k3l0j5L4m3J16l9jj9jk9L0Rk6j3L7m4K5l4O7j8o7M3n3R9n4q
$$ y = [-27, 40, 6, -41, 21, 2, 15, 0, -77, 1, -53, -46, -48, -37, -26, -22, -30, -10, -71, -25, -9, -37, 41, -39, -26, 34, 1, -28, 31, -34, -25, -37, -27, -47, 1, 7, 46, 8, -47, -36, -27, 35, -16, -18, 32, 21, 51, 8, -31, 0, 19, -28, 2, -29, -35, 1, 1, -15, 45, 7, 30, -31, -40, 52, -9, -9, 9, 12, 32, -1, -32, 13, 50, 24, 68, 11, 10, -17, 27, -19, 10, -28, 8, 61, 50, 16, 25, 6, -3, 9, 2, -46, -22, -46, 39, 0, 28, -12, 11, 3, -15, -13, 32, -23, 8, 11, 11, 40, 16, -26, -21, -11, 5, 6, 14, -19, -25, -18, -26, 2, -56, 22, -4, 23, 38, -12, 48, 8, -36, -36, -14, -4, -5, -27, 16, -24, 11, 22, -49, -17, 7, 46, -39, -11, -15, 15, -10, -55, -32, 2, 11, -1, 11, -3, -38, -10, -19, 1, -33, 49, 68, 15, -7, -11, -3, 9, 29, 25, -11, 22, 36, -6, 6, 22, 51, -19, -34, 3, -11, -34, 15, -2, -27, 21, -6, -2, 0, -14, 4, 5, -46, -25, -33, -39, 38, 9, -20, 6, 9, 15, -31, -31, -26, -12, 3, -51, -41, 34, 10, -17, -25, 67, 12, -29, 9, -14, -51, -22, -28, -39, 0, -22, -29, 12, 8, 30, 60, -31, 8, 9, 4, 22, -25, -22, -23, 28, -18, -41, 9, -7, 15, 14, 18, -8, -27, 28, 5, -25, -40, -6, -49, 67, 28, 27, 8, 7, -22, 8, 17, -9, -22, 15, -29, -4, -38, 29, 11, -56, -13, -66, 33, -21, -29]
8101b9QL8l5k0mM3qL3L3l0m8P9l1q8M4K7l8L8k1J7j5o1J04m5j8qL3J9l0L4rm0
8133b8N6l3jl3K6J2kl4R5j1n2pk7O8l1L0o3L0n4Q4j2j1k9j7J3L6k6N0m0L4j3K
8165A2J7m7K4k7L7n6K4M1j04J9M3PM2J2koql5K6npj0k6Q2o3J
$$ y = [-29, -21, 17, -18, -38, -42, 1, -7, 26, 59, 29, -19, 60, 29, -59, -15, 12, -26, 12, -9, 8, -7, -68, 36, -9, -27, -35, -2, 17, -13, 21, 12, -28, 28, -5, -6, -39, -13, -1, -3, -37, 58, 47, -5, -12, -39, 29, -2, 28, -35, -5, -59, 25, 13, 2, -27, -44, -31, 5, -21, 29, -11, 23, 10, 12, 29, -18, 6, -21, 16, -40, -16, 25, -79, -60, -17, -10, 32, 44, 42, 36, 28, -7, 19, 14, 7, -3, -29, 53, -10, -9]
8191i
##END NTUPLES=NMR FID
##END=
