##TITLE=1H_DE-101_TFA2
 200.13MHz,CDCl3,
 8 sc
 
 14.8.2025
##JCAMPDX= 6.0         $$ Bruker NMR JCAMP-DX V2.0
##DATA TYPE= NMR FID
##DATA CLASS= NTUPLES
##ORIGIN= UXNMR, Bruker Analytische Messtechnik GmbH
##OWNER= pz
$$ XWIN-NMR		Version 3.5
$$ Thu Aug 14 14:08:14 2025 Russian Standard Time (UT+4h)  she@DPX200
##.OBSERVE FREQUENCY= 200.1313
##.OBSERVE NUCLEUS= ^1H
##.DELAY= (6, 6)
##.ACQUISITION MODE= SIMULTANEOUS
##.ACQUISITION SCHEME= undefined
##.AVERAGES= 8
##.DIGITISER RES= 18
##SPECTROMETER/DATA SYSTEM= spect
##.PULSE SEQUENCE= zg30
##.SOLVENT NAME= CDCl3
##.SHIFT REFERENCE= (INTERNAL, CDCl3, 0, 14.3821)
##AUDIT TRAIL= $$ (NUMBER, WHEN, WHO, WHERE, WHAT)
$$ ##TITLE= Audit trail, XWIN-NMR		Version 3.5
$$ ##JCAMPDX= 5.01
$$ ##ORIGIN= Bruker BioSpin GmbH
$$ ##OWNER= she
$$ F:/spectra/data/she/nmr/H-C/1/audita.txt
$$ ##AUDIT TRAIL=  $$ (NUMBER, WHEN, WHO, WHERE, WHAT)
(   1,<2025-08-14 14:06:32.85 +0400>,<she>,<DPX200>,
      <created by zg, POWCHK disabled, PULCHK disabled
       configuration hash MD5:
       00 E9 B6 7A A2 85 ED C7 34 08 36 98 17 FE 4E 26
       data hash MD5: 16K
       B3 AD C0 6C 18 18 4E FF 50 6A 73 15 A1 35 FD 57>)
$$ ##END=
$$ 
$$ hash MD5
$$ BB C0 C1 0D 32 ED E9 EE 05 B4 B5 A4 C8 5E 4A F5
##$RELAX= 
##$RELAX= 
##$RELAX= 
##$RELAX= 
##$RELAX= 
##$RELAX= 
$$ Bruker specific parameters
$$ --------------------------
##$DU= <F:/spectra>
##$EXPNO= 1
##$NAME= <H-C>
##$PROCNO= 1
##$TYPE= <nmr>
##$USER= <she>
##$AMP= (0..31)
100 100 100 100 100 100 100 100 100 100 100 100 100 100 100 100 100 100 
100 100 100 100 100 100 100 100 100 100 100 100 100 100 
##$AQSEQ= 0
##$AQ_mod= 1
##$AUNM= <au_zg>
##$AUTOPOS= <>
##$BF1= 200.13
##$BF2= 200.13
##$BF3= 200.13
##$BF4= 200.13
##$BF5= 200.13
##$BF6= 200.13
##$BF7= 200.13
##$BF8= 200.13
##$BYTORDA= 1
##$CFDGTYP= 0
##$CFRGTYP= 5
##$CHEMSTR= <none>
##$CNST= (0..31)
1 1 145 1 1 1 1 1 1 1 1 1 1 1 1 1 1 1 1 1 1 1 1 1 1 1 1 1 1 1 1 1 
##$CPDPRG= <>
##$CPDPRG1= <>
##$CPDPRG2= <>
##$CPDPRG3= <>
##$CPDPRG4= <mlev>
##$CPDPRG5= <mlev>
##$CPDPRG6= <mlev>
##$CPDPRG7= <mlev>
##$CPDPRG8= <mlev>
##$CPDPRGB= <>
##$CPDPRGT= <>
##$D= (0..31)
0 0.7 0 0 0 0 0 0 0 0 0 0.03 0 0 0 0 0 0 0 0 0 0 0 0 0 0 0 0 0 0 0 0 
##$DATE= 1755165992
##$DBL= (0..7)
120 120 120 120 120 120 120 120 
##$DBP= (0..7)
150 150 150 150 150 150 150 150 
##$DBP07= 0
##$DBPNAM0= <>
##$DBPNAM1= <>
##$DBPNAM2= <>
##$DBPNAM3= <>
##$DBPNAM4= <>
##$DBPNAM5= <>
##$DBPNAM6= <>
##$DBPNAM7= <>
##$DBPOAL= (0..7)
0.5 0.5 0.5 0.5 0.5 0.5 0.5 0.5 
##$DBPOFFS= (0..7)
0 0 0 0 0 0 0 0 
##$DE= 6
##$DECBNUC= <off>
##$DECIM= 32
##$DECNUC= <off>
##$DECSTAT= 4
##$DIGMOD= 1
##$DIGTYP= 9
##$DL= (0..7)
0 120 120 120 120 120 120 120 
##$DP= (0..7)
150 150 150 150 150 150 150 150 
##$DP07= 0
##$DPNAME0= <>
##$DPNAME1= <>
##$DPNAME2= <>
##$DPNAME3= <>
##$DPNAME4= <>
##$DPNAME5= <>
##$DPNAME6= <>
##$DPNAME7= <>
##$DPOAL= (0..7)
0.5 0.5 0.5 0.5 0.5 0.5 0.5 0.5 
##$DPOFFS= (0..7)
0 0 0 0 0 0 0 0 
##$DQDMODE= 0
##$DR= 18
##$DS= 0
##$DSLIST= <SSSSSSSSSSSSSSS>
$$ [...]
##$SUBNAM0= <"">
##$SUBNAM1= <"">
##$SUBNAM2= <"">
##$SUBNAM3= <"">
##$SUBNAM4= <"">
##$SUBNAM5= <"">
##$SUBNAM6= <"">
##$SUBNAM7= <"">
##$SUBNAM8= <"">
##$SUBNAM9= <"">
##$SW= 18.0517328524113
##$SWIBOX= (0..15)
0 0 2 0 0 0 0 0 0 0 0 0 0 0 0 0 
##$SW_h= 3612.71676300578
##$TD= 16384
##$TD0= 1
##$TE= 0
##$TE2= 300
##$TE3= 300
##$TEG= 300
##$TL= (0..7)
0 120 120 120 120 120 120 120 
##$TP= (0..7)
150 150 150 150 150 150 150 150 
##$TP07= 0
##$TPNAME0= <>
##$TPNAME1= <>
##$TPNAME2= <>
##$TPNAME3= <>
##$TPNAME4= <>
##$TPNAME5= <>
##$TPNAME6= <>
##$TPNAME7= <>
##$TPOAL= (0..7)
0.5 0.5 0.5 0.5 0.5 0.5 0.5 0.5 
##$TPOFFS= (0..7)
0 0 0 0 0 0 0 0 
##$TUNHIN= 0
##$TUNHOUT= 0
##$TUNXOUT= 0
##$USERA1= <user>
##$USERA2= <user>
##$USERA3= <user>
##$USERA4= <user>
##$USERA5= <user>
##$V9= 5
##$VALIST= <valist>
##$VCLIST= <CCCCCCCCCCCCCCC>
##$VD= 0
##$VDLIST= <DDDDDDDDDDDDDDD>
##$VPLIST= <PPPPPPPPPPPPPPP>
##$VTLIST= <TTTTTTTTTTTTTTT>
##$WBST= 1024
##$WBSW= 4
##$XGAIN= (0..3)
0 0 0 0 
##$XL= 0
##$YL= 0
##$YMAX_a= 307472
##$YMIN_a= -288674
##$ZGOPTNS= <>
##$ZL1= 120
##$ZL2= 120
##$ZL3= 120
##$ZL4= 120
##$ABSF1= 10
##$ABSF2= 0
##$ABSG= 5
##$ABSL= 3
##$ALPHA= 0
##$AQORDER= 0
##$ASSFAC= 0
##$ASSFACI= 0
##$ASSFACX= 0
##$ASSWID= 0
##$AUNMP= <proc_1d>
##$AZFE= 0.1
##$AZFW= 0.1
##$BCFW= 1
##$BC_mod= 2
##$BYTORDP= 1
##$COROFFS= 0
##$CY= -3
##$DATMOD= 1
##$DC= 2
##$DFILT= <>
##$DTYPP= 0
##$F1P= 0
##$F2P= 0
##$FCOR= 0.5
##$FTSIZE= 0
##$FT_mod= 4
##$GAMMA= 1
##$GB= 0.15
##$INTBC= 1
##$INTSCL= 1
##$ISEN= 128
##$LB= 0.25
##$LEV0= 0
##$LPBIN= 0
##$MAXI= 10000
##$MC2= 0
##$MEAN= 0
##$ME_mod= 0
##$MI= 1.114404
##$NCOEF= 0
##$NC_proc= 0
##$NLEV= 6
##$NOISF1= 3.799351
##$NOISF2= 2.8
##$NSP= 1
##$NTH_PI= 0
##$NZP= 0
##$OFFSET= 14.38212
##$PC= 1
##$PHC0= -1561.559
##$PHC1= 11.19228
##$PH_mod= 1
##$PKNL= yes
##$PPARMOD= 0
##$PSCAL= 0
##$PSIGN= 0
##$REVERSE= no
##$SF= 200.129724274929
##$SI= 16384
##$SIGF1= 3
##$SIGF2= 2
##$SINO= 400
##$SIOLD= 16384
##$SREGLST= <1H.CDCl3>
##$SSB= 0
##$STSI= 0
##$STSR= 0
##$SW_p= 3205.1282051282
##$SYMM= 0
##$S_DEV= 0
##$TDeff= 0
##$TDoff= 0
##$TI= <>
##$TILT= no
##$TM1= 0
##$TM2= 0
##$TOPLEV= 0
##$USERP1= <user>
##$USERP2= <user>
##$USERP3= <user>
##$USERP4= <user>
##$USERP5= <user>
##$WDW= 1
##$XDIM= 8192
##$YMAX_p= 0
##$YMIN_p= 0
$$ End of Bruker specific parameters
$$ ---------------------------------
##NTUPLES= NMR FID
##VAR_NAME=  TIME,          FID/REAL,        FID/IMAG
##SYMBOL=    X,             R,               I
##VAR_TYPE=  INDEPENDENT,   DEPENDENT,       DEPENDENT
##VAR_FORM=  AFFN,          ASDF,            ASDF
##VAR_DIM=   8192,          8192,            8192
##UNITS=     SECONDS,       ARBITRARY UNITS, ARBITRARY UNITS
##FACTOR=    0.0002768,     1,               1
##FIRST=     0,             0,               0
##LAST=      2.2672688,     0,               0
##MIN=       0,             -288674,         0
##MAX=       2.2672688,     307472,          0
$$ Real data points
##PAGE= N=1
##DATA TABLE= (X++(R..R)), XYDATA
0 0 0 0 0 0 0 0 0 0 0 0 0 -8 8 -8 8 -8 16 -16 16 -24 28 -32 40 -47 55 -64 72 -84 96 -109 124 -141 162 -180
34 -180 204 -229 259 -288 321 -358 398 -443 491 -541 599 -661 729 -804 887 -974 1075 -1185
52 -1185 1307 -1443 1594 -1769 1969 -2197 2467 -2788 3175 -3658 4277 -5099 6248 -7971 10831
67 10831 -16379 31010 -149449 -288674 194068 75966 -203815 125550 296643 -83718 -26678
78 -26678 270035 14517 -216960 86422 131596 -168296 -127003 41285 -88338 -132231 -20257
89 -20257 -26958 -4078 84184 22735 27813 159714 76523 -65869 73186 145766 -58064 -113120
101 -113120 35187 3566 -109815 -63102 -13949 -28274 1275 -5610 -25026 43692 36638 -47556
113 -47556 26750 104470 -11334 -33126 105398 51649 -94124 -9033 70834 -54080 -72286
124 -72286 45912 -2458 -88783 -7441 23094 -58774 -27892 53437 27328 11619 56498 39090
136 39090 2128 25106 16318 -27663 -7154 12750 -34555 -46665 -11434 -24070 -43228 -8521
148 -8521 17207 5294 9170 27312 23535 12480 12063 12824 11459 6637 -4045 -6799 -6714 -16918 -17459
163 -17459 -7221 -12128 -12442 1096 -5690 -13633 6320 13416 -3068 6406 29620 15682 -2460
176 -2460 13205 15780 -9066 -8208 2660 -12793 -18448 -6910 -15013 -22101 -7371 -464 -3312 6668
190 6668 16147 15442 14433 13916 8223 6930 8627 -1556 -7959 -83 -4954 -18437 -12733 -6639 -12275
205 -12275 -8742 -1564 -1638 2797 6398 4302 7308 12275 8727 7477 12623 7671 -2001 1794 2769 -12572
221 -12572 -12999 -3448 -12803 -17393 -4845 -5568 -9866 4171 10034 3224 10128 19386 9836 4537 11478
236 11478 5629 -5255 -616 -2882 -14553 -8116 -3053 -15018 -10897 3569 -2502 -6492 7026 8152
250 8152 -495 6096 11892 2587 2327 10829 3989 -3768 3938 2382 -8049 -5345 -2884 -9254 -8090
265 -8090 -4176 -6757 -5176 1269 1706 2317 7431 9187 6986 9550 8276 1289 2051 2336 -6849 -8757
281 -8757 -3553 -7484 -10129 -3513 -2305 -3622 3217 5813 959 4123 9706 3294 -1047 4958 2863
296 2863 -4714 -750 1777 -5118 -3274 2792 -2673 -4709 2260 1581 -5015 -1528 3046 -1053 -2466
311 -2466 3212 2906 -334 3263 4655 523 892 2497 -758 -3005 -2540 -2646 -4039 -3408 -1526 -1396 -360
328 -360 2314 3370 2718 3208 4094 2850 1372 -754 -716 -1284 -3635 -3324 -2183 -2727 -1408 984 214 883
346 883 3256 3363 801 656 2475 343 -2322 -816 -438 -2401 -1877 -274 -1206 -1032 1371 574 -671
363 -671 829 1932 613 -381 1215 1411 -358 230 921 89 96 708 -338 -906 -478 -176 -1035 -1566 -479
382 -479 -293 -851 -191 1156 967 430 1082 1821 143 -212 188 -106 -1253 -1408 -371 -1132 -1405 -283 -13
401 -13 -344 948 1300 619 777 2276 1603 -333 -5 785 -400 -1683 -847 -815 -1001 -908 -445 -436 33 1288
421 1288 627 -83 553 1357 275 -979 91 910 -658 -1183 -217 -291 -778 -803 -104 68 -93 639 487
440 487 -93 413 911 -23 4 1083 727 -463 -607 142 -334 -1367 -815 445 -414 -793 87 -251 -831
459 -831 306 574 401 529 1484 1140 -538 217 844 -922 -1371 543 -121 -1509 -987 92 -544 -687
477 -687 632 707 187 854 1061 -617 -766 931 469 -676 313 1271 -499 -837 -6 118 -720 -284 822
496 822 -20 -876 -155 -460 -710 -369 359 903 754 816 512 -284 -577 434 -107 -839 204 532 -1035 -1077
516 -1077 -91 293 -268 478 1266 370 -323 143 -773 -1045 169 537 -448 283 795 253 -911 -254 1032
535 1032 574 28 796 26 -1056 -623 -774 -1022 -409 730 407 132 121 301 -484 -110 525 284 -39 64
555 64 -50 -571 -591 -137 398 527 992 1296 240 -626 -593 -206 -833 -605 -145 -60 -176 -155 -91 151 372 1444
577 1444 1720 499 194 382 -575 -1612 -1112 23 -213 -463 664 302 -949 22 563 -622 86 1609
595 1609 323 -1318 -516 143 -720 -204 1659 1252 338 1226 544 -1175 -815 -203 -935 -1164 -229 -457 -1332
614 -1332 -970 -28 8 421 1669 1732 882 1191 452 2 -525 -454 424 -219 -1065 125 261 -1557 -1026 677
634 677 265 -811 294 1030 -1292 -1380 1388 -44 -839 2351 2992 -311 697 2076 -861 -1627 983
651 983 -149 -2565 -807 578 -2756 -2494 1058 178 -414 2433 2097 279 1491 2009 -426 -420 1447
668 1447 673 -1113 -912 -420 -1064 -1458 -865 -769 259 34 -640 -384 485 -367 402 1184 115 1345 2521
687 2521 167 -488 1776 369 -1871 -1134 1011 -1753 -2705 102 -735 -2579 350 1743 -1050 701
703 701 3241 693 -619 1783 1342 -854 90 1216 -1160 -1582 301 -376 -2370 -293 622 -1063 -294
720 -294 601 -268 -215 514 544 -8 308 1207 340 -282 317 493 33 -587 -295 -8 -184 -775 -764 -182 -339
741 -339 210 407 -278 417 1248 24 -655 252 900 -570 -1049 381 415 -673 216 505 -377 364 670
760 670 -179 112 420 101 -725 -451 149 -398 -524 56 127 -465 315 423 -14 162 337 280 -23 174 237
781 237 51 97 166 -226 -398 50 101 -767 -822 -105 -303 -626 -471 402 653 196 542 992 657 1166 1296 32
803 32 -14 421 -270 -899 -723 -314 -1208 -1083 -410 -193 -379 699 285 175 712 1044 138 257 735 257 -105
824 -105 -47 319 -367 -346 -79 -619 -718 -567 -390 -583 -415 -153 -59 115 390 768 1025 1029 1018 570 376 240 -123
847 -123 -551 -923 -542 -518 -883 -1251 -411 -237 -292 -49 73 162 755 937 183 258 679 484 -85 -147 380 -98
869 -98 -801 -370 -390 -888 -156 -356 -758 -347 256 -192 -203 493 772 595 439 738 558 175 129 -275 -511 -247
891 -247 -407 -607 -385 -384 -193 -140 -211 67 135 331 725 6 65 468 398 2 -173 -241 362 -76 -134 -151 9 -235
915 -235 -66 -329 -473 -17 -149 -332 239 517 311 -82 -250 350 181 -6 366 129 -401 242 -435 -458 39
936 39 38 -17 -45 71 19 -94 -31 129 -257 -218 35 -309 -519 -5 16 26 153 200 389 316 128 45 -21 -34 128
961 128 -37 -363 162 -105 -174 -482 -342 240 72 -126 302 84 183 228 186 -109 324 589 11 -183 191 428
983 428 -204 -215 -8 -170 -452 -170 -467 -456 -25 149 -144 211 384 591 -63 164 274 -159 100 181 65
1004 65 -413 -302 -201 -579 -52 -146 -91 -80 -14 14 3 138 471 82 243 241 181 151 177 -26 62 -116 -410 -4
1028 -4 -131 -320 -78 -232 -96 -102 -129 1 13 376 363 -179 9 98 2 -417 -67 -70 -91 -98 -266 -295 -218 -145 -214 -69
1054 -69 55 517 -128 -63 40 46 343 -78 25 111 415 84 -82 -103 -3 -166 -152 -4 146 -178 18 -29 -172
1077 -172 263 133 87 126 225 143 -79 -143 219 196 28 -89 9 -95 -160 -52 -23 -105 119 -136 60 -101 40
1100 40 -276 -90 113 -288 -85 135 156 161 -182 -40 -19 -183 -38 -15 271 -128 160 65 -22 486 -125 -225 24
1123 24 -123 -38 -76 20 149 110 -14 -15 -121 165 -277 93 72 47 111 -90 51 -45 102 -91 -98 136 -55 -36 72
1148 72 -104 -176 -159 -331 1 -156 -184 186 -23 -223 204 114 -20 -90 -8 104 -44 69 96 -220 -314 -264 -157
1171 -157 -134 85 52 -223 173 -28 155 198 116 297 355 46 105 204 140 12 122 -42 -18 -203 -220 -279 -335 20
1195 20 -3 -32 -230 7 1 -58 111 183 -14 -120 20 -8 40 213 -135 119 -105 -169 -229 -33 -242 -49 -110 -59
1219 -59 23 165 53 -178 114 133 -109 331 77 178 39 -19 -158 -216 -175 -292 -229 194 -219 6 -77 -59 224
1242 224 19 -27 38 243 -247 159 171 5 -20 -88 -317 113 135 -53 -104 -135 203 172 -216 -23 111 -163 -113
1265 -113 23 82 220 245 -61 -21 219 347 -84 -51 12 -225 -204 -73 149 32 14 136 -142 -244 -41 87
1287 87 -109 -440 -207 -141 -152 127 -68 -31 34 46 317 186 199 412 63 98 205 110 -126 83 -124 -181 -31
1310 -31 -282 22 -96 102 232 -243 65 -58 218 13 179 44 -300 69 71 -61 2 -44 -136 -166 -354 -137
1332 -137 -253 -108 20 27 -234 29 179 251 179 370 493 -257 -41 72 -327 -310 -289 -380 -402 -2 -236 39 68
1355 68 228 183 123 52 150 154 17 283 126 154 -74 14 -79 -361 -398 -324 -127 -332 -151 -153 -34 527 95 3 165
1380 165 519 355 203 57 427 63 -155 -243 -165 -389 126 -267 -433 -301 1 -77 -129 298 -5 72 126 157
1402 157 -52 143 63 -109 79 190 105 2 -84 -121 -194 -167 49 -200 -97 68 103 -220 70 393 341 199 35
1425 35 283 170 -11 -56 567 -167 -88 23 -110 -112 109 329 -40 -6 -30 154 27 -2 21 18 -202 87 5 131
1449 131 269 148 110 -15 15 161 -163 -46 -16 -145 123 105 -228 -93 280 -262 156 -153 281 208 -24 113
1471 113 132 340 -257 19 -75 234 148 17 -179 -7 -188 -393 -453 -331 -178 -360 81 266 101 147 189 384
1493 384 391 30 156 141 182 12 38 -38 -500 -39 -274 -161 -297 0 -381 127 184 209 41 161 99 -31 -110
1516 -110 -30 108 101 -336 -122 0 37 163 -307 12 -333 -84 -296 206 -26 77 -4 -98 349 336 227 320 -105
1539 -105 -253 108 -23 -198 71 -200 -354 -243 -162 -30 -132 -151 -82 33 -20 -46 136 -319 1 -129 -49 42
1561 42 -88 135 -47 136 3 143 140 -60 -98 -350 -92 25 74 -82 -285 -26 -160 350 -99 83 6 -181
1583 -181 64 197 257 85 47 87 -139 -90 140 -60 -303 76 26 -171 -24 38 -52 122 61 -52 104 235 182
1606 182 182 -53 -56 310 35 -154 61 -187 76 -68 -217 -159 144 -251 -324 -29 108 266 -304 376 230 136
1628 136 -4 127 48 296 -9 169 44 -43 -54 -159 -101 -229 -74 41 89 -102 49 243 98 93 299 224 275
1651 275 157 86 -219 91 76 16 -153 82 122 201 -79 220 -280 115 138 -89 8 78 211 241 242 44 -71 11
1675 11 -122 475 210 -90 -29 87 -15 -264 -189 7 -28 -75 -54 142 159 45 76 148 26 295 -132 76 -87
1698 -87 8 -187 -212 -167 -109 -51 149 151 45 132 175 107 223 -35 55 116 -17 -40 350 109 192 -100 38 -56 -187
1723 -187 -85 209 274 99 96 -84 18 77 185 13 89 -10 75 165 155 0 -68 -78 59 124 -130 -421 173 88
1747 88 -182 -211 -78 -26 -184 100 -41 -15 236 -117 51 115 104 -6 72 -212 213 63 -12 -77 88 -268 -75
1770 -75 -46 34 -154 -51 -113 -117 -76 -70 -180 25 -154 -29 216 -96 25 -6 46 248 207 -135 221 -220 -216 -22 -11
1795 -11 -42 -20 -276 226 -102 216 8 -38 205 100 202 73 100 102 105 78 -377 -53 177 72 -133 -275 33
1818 33 38 -187 -67 29 -83 -81 35 169 -89 37 -173 271 140 -178 -177 -192 -206 -130 -95 -106 -69 9 133 164 18
1843 18 -6 49 -182 75 58 -26 -278 3 -132 -13 -39 69 -131 28 122 77 -187 308 136 267 171 -99 127
1866 127 32 228 128 109 248 -73 -12 104 -197 36 -160 -36 -88 -124 39 -301 130 -37 -91 141 262 -49
1888 -49 7 -96 60 117 -238 186 108 13 99 197 105 4 -37 -51 67 -13 132 158 31 -260 -47 -185 12 -69
1912 -69 -210 -124 131 -53 48 -55 156 285 190 -52 220 -85 68 -35 -49 121 237 -102 34 6 -85 253
1934 253 -409 -166 -17 142 104 -33 -48 -49 -141 22 -308 -120 -69 181 -64 -30 135 90 -55 120 -153 -108 231
1957 231 246 74 43 122 142 177 -146 -40 37 -34 83 -182 196 -52 -159 30 -181 -132 -242 -192 -326 228 -50
1980 -50 -187 181 -27 -30 173 5 -319 -101 221 -76 -243 103 -172 -14 -44 -201 95 221 -87 25 195
2001 195 61 71 77 60 -85 174 -121 41 -105 -162 183 44 25 -35 -26 -144 -280 -22 25 -24 -37 -258 122 -125
2025 -125 -116 -189 144 290 276 83 -65 1 93 -179 -93 242 149 55 85 -58 -159 76 -109 266 115 268 -22
2048 -22 -135 -158 -78 56 -111 137 8 217 -220 -146 -114 194 132 60 180 -95 -323 119 -150 -52 9 131 53
2071 53 -133 355 -6 21 146 -15 139 -106 164 127 -56 49 -141 -167 217 -190 18 131 -229 -86 160
2092 160 -134 22 17 23 -44 -48 168 26 228 168 -4 188 66 24 76 -80 103 -100 -17 -53 -198 -122 50 69 -67
2117 -67 -25 10 9 -76 -153 261 -115 75 -5 57 75 -68 138 -180 -89 -67 -114 38 303 78 -7 9 -89 -25 -160 -89
2143 -89 -76 140 69 130 -78 157 -82 -86 183 46 -8 94 205 -269 -92 -268 -134 45 -103 -301 95 -376
2165 -376 142 -285 206 93 -305 -51 253 -209 -83 -5 26 129 115 39 -15 366 -236 49 -132 -275 -215 28
2187 28 -140 -34 -123 -79 263 -46 -115 -69 -4 137 54 187 33 -35 165 341 34 269 58 -11 3 1 -153 -47
2211 -47 34 -51 153 110 -4 36 -40 -3 4 144 91 -83 55 -5 42 198 -47 145 -179 -220 34 81 -2 14 59 166
2237 166 91 -192 -185 -150 -90 -21 -152 86 -87 -37 -75 99 -115 32 0 20 -18 141 -150 16 -99 -437 -33 -148
2261 -148 -1 19 -35 -137 131 66 -216 -75 -189 175 -13 6 19 394 -82 -74 -96 -84 69 146 -38 240 -149
2284 -149 -141 -89 55 275 -223 -214 316 129 55 -192 -130 -20 -141 103 -88 -30 -90 37 204 -36 -11 45 -18 -141
2308 -141 30 292 -110 -15 15 24 -79 -11 -47 -222 180 -75 6 -2 99 -1 -286 -15 16 159 62 -74 -214 -35
2332 -35 120 48 1 -339 -267 143 -197 44 -90 103 38 -165 45 18 147 155 -164 -59 -222 253 -67 87 -37
2355 -37 27 81 -292 23 -70 -27 -38 0 -79 -100 -18 169 -179 165 -78 48 97 128 -284 -54 173 126 80 -34 1
2380 1 93 -179 160 -339 -38 67 -55 -104 -27 -278 21 88 90 135 21 -192 -13 123 -35 73 -108 67 298
2403 298 -11 110 -125 99 -168 -93 -7 259 61 -170 -144 47 -103 -58 100 -137 -119 127 113 -102 4 36
2425 36 -161 23 3 57 143 231 231 7 -151 -10 269 205 20 43 310 59 47 -119 47 -41 115 203 61 81
2449 81 154 -118 -38 -41 -53 -66 -141 -105 172 -260 -237 51 200 81 218 -9 -107 -147 -53 106 41 -269 93 119 -37
2474 -37 -36 112 -103 61 198 -234 -151 -36 111 6 -138 -25 68 -40 71 70 -3 120 -15 190 212 -14 -120
2497 -120 -12 -114 -98 69 -65 -173 -120 -246 -9 156 100 38 -89 -90 -88 50 49 -169 95 56 -59 17 -172 1
2521 1 36 124 60 -18 -64 -34 126 15 80 161 -36 34 -54 218 250 -116 -156 78 3 201 -153 -197 -57 113 87 262
2547 262 -322 9 124 -56 176 -112 67 115 -119 -54 190 -2 206 80 82 -91 -10 277 -216 85 -161 163
2569 163 3 88 0 17 -107 -9 -177 -102 -81 -74 -215 -162 -5 -148 -141 -55 175 82 -14 -140 -114 -93 -23 -168 -166 49
2595 49 76 -79 -182 18 29 -107 -185 -12 69 -236 43 -193 -84 58 -137 -225 -163 97 -28 8 -23 85 42
2618 42 -328 -51 -209 -27 2 -269 -2 121 -38 -143 -82 -53 -54 198 -295 -61 -95 -19 -16 -131 -164 -249 -96 -91 -191
2643 -191 15 157 121 -115 -257 -31 -209 -2 23 132 -71 -57 -78 -144 -268 72 27 51 -11 -164 -70 32 67
2666 67 -136 173 -191 143 107 -159 -33 39 44 243 104 -111 -153 111 -179 -124 91 -26 197 -207 -2 15 149
2689 149 56 -266 -147 -261 -220 117 235 -54 148 -1 102 -77 -74 -238 218 -36 300 95 -43 102 125 184
2711 184 -196 -9 -11 -168 -43 104 -130 87 19 -51 28 -29 243 -108 -46 19 176 -176 -11 29 119 -270 -222 43
2735 43 47 39 90 54 114 19 -98 109 -67 230 244 -168 -119 -188 -242 160 -6 -208 19 188 111 111 100 52 -94 -114
2761 -114 -158 30 152 4 30 -128 155 204 28 106 -8 126 -232 -147 65 4 20 -5 28 70 1 190 -14 107
2785 107 -6 47 -49 290 85 -130 285 -64 -1 174 -66 -94 235 26 -99 -232 -343 -103 -256 -18 43 93
2807 93 -54 -310 -80 93 -12 59 -132 -45 -10 43 -139 -46 -80 -108 -54 -45 133 -17 15 -95 -49 44 38 156 -124
2832 -124 22 -26 -77 -37 161 -142 50 14 150 192 133 -149 74 123 -230 141 -146 137 -81 208 -147 172
2854 172 160 15 162 -1 151 242 -318 -47 -31 -50 42 -29 -130 -156 168 116 261 -33 201 -105 -163 -104 107
2877 107 96 -43 10 -126 -77 -15 167 -55 169 9 63 -151 155 -1 -47 59 -45 211 -2 31 -119 -27 102
2900 102 -78 -251 14 0 46 -140 -20 -57 -255 23 -10 24 -129 -106 -139 -370 11 76 146 -21 -259 -114 -32
2923 -32 -94 -139 20 67 -78 -21 168 103 97 -166 66 278 10 -117 62 -155 -145 -17 -61 169 173 92 102 -98 44
2948 44 83 -40 -216 79 34 116 42 -157 215 28 -231 315 -125 -81 42 -431 168 -166 280 134 79 137 168
2971 168 161 446 -89 -42 85 -159 53 -100 1 -196 50 81 -10 -215 -180 41 -84 53 -100 27 -147 -169
2993 -169 -22 91 48 -186 105 0 25 -133 169 10 23 -78 42 36 84 -21 -129 102 -153 51 87 -172
3015 -172 280 -72 -137 64 51 203 -96 -175 -340 45 49 81 116 -177 -227 102 -69 -107 -106 410 48 -53 156 76
3039 76 143 -109 14 90 -269 -56 7 -77 -22 149 11 -177 -279 58 -14 223 -34 149 134 80 12 142 116 -30
3063 -30 116 -269 100 -93 -69 -310 99 -93 -281 -134 -53 -243 -271 -95 -90 232 121 -86 108 278 -70 -194
3085 -194 354 231 189 -17 -117 238 -1 -66 12 158 -92 3 -222 158 -133 -54 18 -96 -204 39 75 139 -122
3108 -122 -275 251 -51 -124 -5 300 -35 -108 -43 -141 -149 -78 82 -11 16 -209 150 149 104 -57 56 -351 -130 -16
3132 -16 78 18 197 -25 -222 121 -131 -54 243 -163 190 221 362 249 363 -4 81 237 41 -103 62 141
3154 141 -140 -14 32 71 80 -129 -56 -129 -13 41 209 -49 -12 95 -132 8 -259 1 81 -146 53 182 89
3177 89 123 -166 -232 54 84 220 99 -209 -147 -107 -340 -120 234 227 138 -85 -272 -3 -59 85 259 -39 -168
3200 -168 160 -192 200 -39 319 130 -71 42 229 103 256 156 -166 77 21 182 -73 65 3 -118 134
3221 134 -142 -191 108 120 -25 -59 -37 129 -113 123 172 41 134 -32 -29 176 162 132 262 -90 43 98 209 -241
3245 -241 -76 -50 -179 -92 -64 263 52 97 82 3 -289 -67 -264 124 168 -123 -64 -121 -231 90 -7 229 -87
3268 -87 -356 -135 62 46 -104 57 -44 -33 -139 93 225 16 -57 23 175 -170 -206 -15 70 -18 -9 -104 -180 34
3292 34 -206 184 -312 -70 79 -54 104 17 -93 292 -160 -4 63 87 -222 -129 9 -41 -116 -32 57 -268 149
3315 149 -119 -16 -225 115 -71 2 125 101 -282 11 -112 -160 20 -23 -395 365 -78 157 157 -59 80 -120
3337 -120 16 -139 150 -111 -58 -81 25 -133 114 -6 -5 -41 421 50 -200 110 131 174 0 221 -159 41
3359 41 200 382 -215 8 -217 -67 148 66 -238 89 -110 -292 -41 -217 -30 178 -181 -105 109 244 30
3380 30 186 175 -41 -18 25 286 132 -227 -23 199 37 -84 11 -146 -262 200 79 -140 -7 42 72 -26 153
3403 153 -125 42 126 -328 -124 -92 206 82 -200 59 91 -82 4 242 70 115 110 -297 -231 324 -28 79 10
3426 10 -34 273 -100 195 173 164 170 28 -16 76 -35 179 30 74 -196 -134 -437 62 262 67 137 0 242 15
3450 15 102 -60 -186 320 66 48 -91 -108 -10 70 176 -104 -263 11 130 -115 -78 105 -143 -60 -144 98 157
3473 157 -60 -62 523 176 -124 13 -10 61 -79 -126 97 107 57 -223 -47 141 -141 -75 -292 -51 -184 -226 -65
3496 -65 165 -176 15 -255 -62 140 -5 157 -156 -158 -72 75 -52 212 -109 50 184 210 394 126 -3 -35
3518 -35 207 210 -115 -247 70 122 -333 -186 219 -206 43 53 -93 18 89 -107 28 8 71 181 57 78 76 206
3542 206 107 27 153 -68 119 56 -106 7 -240 101 113 31 86 -37 -11 -170 92 -75 163 5 -109 52
3564 52 25 181 -161 154 -42 -38 30 -249 -171 -30 -107 8 380 52 189 66 236 -209 -201 -158 74 58 125 57
3588 57 -73 31 -220 62 27 112 -7 115 -36 -50 -162 -635 234 -97 90 82 -228 -204 -172 169 79 42 54 120
3612 120 -106 -65 -32 -97 -183 -42 -229 108 170 -116 -7 67 292 64 148 42 165 147 -149 58 195 -18 97
3635 97 -111 16 -38 9 -359 -165 187 10 -99 -4 178 116 -11 -167 19 89 -304 -211 -137 -188 -155 -197 66 -62
3659 -62 -183 115 -38 7 -149 38 53 51 20 164 83 59 -83 -162 -99 -66 -227 -193 116 15 264 14 -5 166
3683 166 120 14 106 10 -76 113 116 -111 -42 70 53 -136 -262 -117 -119 -136 -142 142 196 -147 122 -306 -301 17 139
3708 139 -50 -7 25 71 -163 212 -277 73 364 85 -135 -127 -125 137 159 61 -97 -116 168 134 473 -349 99 276
3732 276 -134 9 -36 61 28 242 66 142 41 -196 62 -128 11 154 -57 56 211 -62 239 -96 -5 45
3754 45 -72 -94 -311 125 -7 74 -22 -137 -9 90 -116 -131 -41 36 48 43 58 -296 130 -239 67 51 -141 118
3778 118 -65 196 -34 -91 -199 3 -39 -37 -154 218 38 30 -239 -125 21 -1 251 268 -88 -148 -138 -38 -61 -27
3802 -27 -43 -17 -120 36 -140 155 -210 -171 72 97 306 -158 308 -119 38 122 -112 16 373 42 191 -206
3824 -206 150 146 -91 -92 -154 -47 41 -24 -85 -26 153 12 134 81 -132 49 14 -234 -97 46 84 -9 -129 -187 -339
3849 -339 -113 344 6 -167 158 -40 -109 -103 -60 -149 -50 -33 158 -175 -91 -45 -118 33 39 17 -262 -9 253 -3
3873 -3 238 146 -170 52 219 -119 -186 -14 53 -82 178 113 24 -56 -62 183 46 51 199 164 45 10 -481 65 -93
3898 -93 -25 207 229 176 228 32 159 16 19 144 15 -51 25 -107 -18 -3 48 -12 -75 -293 62 -32 -325 156 45
3923 45 130 52 107 -141 93 -5 -107 -136 65 -249 175 -146 -203 69 50 367 -36 79 10 193 -68 136 -102
3946 -102 299 49 81 -49 -160 -147 -26 -196 -130 54 -9 28 -131 -187 -303 -91 137 -51 -298 -145 -93 -116 256
3969 256 218 32 0 223 -166 227 20 -102 56 116 -92 29 -118 19 144 63 -203 -97 -228 67 126 58
3991 58 -101 103 31 93 62 -286 -120 17 25 -62 10 -114 194 -27 180 -170 194 35 0 -16 -72 7 -216 272
4015 272 130 58 -32 40 -118 -99 -136 -203 -187 -45 3 47 -163 -100 37 -40 -22 -27 -83 81 -173 217 -4 -106 -82
4040 -82 45 -4 -105 -181 256 -69 -178 -76 -126 51 176 -2 20 -165 89 -70 92 309 100 -168 31 -76
4062 -76 31 281 4 152 134 27 94 59 235 297 142 -34 -161 -251 57 146 -272 262 39 196 113 189 -61
4085 -61 -124 -46 -199 38 10 -140 -226 8 103 -115 62 157 175 55 142 63 23 86 10 -149 98 -45 46 68 171
4110 171 -8 48 -62 102 -4 -68 -266 159 -235 31 -42 -89 -76 -114 -87 8 -56 52 24 -96 -314 -152 158
4133 158 -253 136 -10 174 37 -13 -29 -262 38 -100 -24 63 -183 -52 -142 -217 -221 -41 240 323 205 457 -56
4156 -56 192 -20 -112 152 -14 -89 -206 2 44 -75 -21 -52 -77 191 196 -53 61 -22 189 -252 -290 21 326 144
4180 144 71 -19 -142 197 -96 -209 -80 -76 -57 20 388 106 -27 6 87 86 61 242 233 -14 5 20 -349 -34 59
4205 59 240 -110 -132 -176 -31 -178 151 151 54 -15 188 1 -105 -36 106 -169 -285 70 72 -60 -29 161 90 -89
4229 -89 88 -18 -133 -143 28 -189 -161 38 -152 130 103 31 -81 214 133 158 -43 -161 -239 -311 53 -95 -16
4252 -16 -191 -99 -159 -185 24 -6 71 179 -268 205 -39 -154 -77 -85 395 174 121 -151 199 -72 -387 -10 -140
4275 -140 5 169 -238 -192 -154 -107 127 72 -110 253 -13 -125 -85 -224 74 92 109 -165 -5 -128 -134 -143 83 140
4299 140 170 -162 -377 174 -30 -151 134 -280 2 46 116 -49 2 -116 70 100 -153 -30 39 34 115 -16 119
4322 119 77 83 11 -16 373 74 -92 -60 -121 -33 74 -129 287 83 168 13 151 -206 -134 136 80 -82 -32 -1
4346 -1 28 -101 -195 145 254 -161 -165 178 60 -214 12 8 24 -162 -194 -112 -21 14 -103 15 102 153 148 137 -53 -281
4372 -281 217 -139 270 204 15 -190 -244 9 22 -52 -106 -4 173 -66 -77 363 -9 -280 -37 -67 39 142
4394 142 25 83 134 13 42 -29 184 3 -73 -10 -51 4 190 -3 -316 5 108 -74 21 31 -248 -131 211
4417 211 -138 -4 -40 -195 -77 302 169 135 170 240 15 209 -1 -217 311 64 -42 104 4 -39 35 -24
4439 -24 120 -159 -175 -71 48 36 115 -71 14 64 -163 -361 177 56 237 120 -143 174 -39 -189 121 -6
4461 -6 151 -15 -124 -217 -16 -236 -55 -55 250 252 259 -138 -223 -19 174 -188 -109 8 184 -206 420 148 -75 196
4485 196 173 35 94 238 -224 183 153 160 457 129 21 127 119 104 -23 -61 244 -23 -233 480 -114 -219 76
4508 76 127 43 -11 -24 66 -228 174 -66 87 -187 73 87 -40 92 -159 -139 74 -288 36 -44 124 -41 135
4531 135 54 92 203 134 54 -23 -90 33 52 94 249 339 -107 -201 138 -220 99 42 133 -192 -106 -119 -138 -349 224
4556 224 1 54 80 78 142 158 -379 -29 20 -11 -93 111 -106 -143 -87 -96 -324 -182 -36 146 67 -150 -96 127 -37
4581 -37 97 332 164 -67 45 87 31 -176 262 226 298 6 -61 75 -123 -40 71 278 144 -33 -38 -39 112 305
4605 305 87 353 -78 -18 -155 177 0 50 70 138 140 -146 -302 -54 35 -198 103 119 40 2 179 2 68 63
4629 63 -82 71 295 55 -88 62 -93 131 57 243 100 -156 64 109 78 139 -71 6 -262 85 229 -343
4651 -343 42 -20 26 91 46 -30 257 -26 -38 -131 -34 -102 -188 124 218 103 -99 -66 -169 -185 175 -147 -21 150
4675 150 -228 25 7 112 185 -13 -13 -265 -57 -28 -36 68 51 -40 -14 24 183 -69 168 69 2 -174 109 22 171
4700 171 -81 -71 60 223 207 128 62 125 5 -34 -31 -57 -66 62 151 -39 40 -98 -161 -113 116 -192 -121 -133 -110 153
4726 153 200 9 -237 32 -134 -7 30 76 -117 49 107 -109 -29 88 69 235 69 -209 23 -58 -381 -247
4748 -247 86 -52 -59 8 67 93 291 -32 -81 91 -232 53 74 -201 -149 154 -46 -252 118 -12 17 54 -23 -58
4772 -58 58 194 -70 -264 249 -57 244 -15 46 -101 282 -58 235 21 -28 213 -220 180 -128 134 137 64
4794 64 139 94 -35 55 -22 156 -252 -117 -229 101 244 24 -26 243 122 -423 98 168 -83 137 -52 133
4816 133 -109 -243 116 142 -21 61 -25 -12 1 18 73 89 -136 -183 -83 -195 -144 -62 2 -17 83 -202 56 48 133
4841 133 -76 -17 173 42 101 54 46 26 -47 134 134 -13 -49 52 2 133 135 199 -118 72 -221 183 -137 -113 -24
4866 -24 -64 27 162 40 155 -42 -58 116 102 -217 235 -49 -328 -167 -137 -46 61 -97 -61 103 -81 -73 -62 -112
4890 -112 94 101 -473 189 309 -99 4 -11 -32 127 17 -112 -220 47 118 262 -33 -92 35 -120 -100 131
4912 131 -162 11 -270 -90 68 42 -26 -187 16 40 -48 -245 173 -41 -122 87 61 132 122 37 -19 -157 15
4935 15 -26 427 -75 140 268 -120 251 48 259 36 160 132 74 -140 -85 104 -65 118 56 -10 -185 79
4957 79 -114 174 237 154 55 246 -215 -317 112 101 -5 225 88 -76 134 -178 129 -6 101 -215 -124 214
4979 214 -108 -17 285 174 -11 -76 -57 -123 -177 -1 81 106 126 47 -98 -129 -217 -7 -122 11 20 -145 -213 -65 25
5004 25 57 100 -176 -58 53 -87 -49 125 -189 108 135 12 -146 -96 5 -5 -35 -55 -36 -165 -181 -6 -61 -176
5028 -176 104 -64 95 -52 -23 38 -26 -81 -114 218 39 -285 -211 -209 172 -175 102 -90 -7 -58 -24 -89 166 -68
5052 -68 -148 107 -30 439 256 -207 -34 50 52 -66 31 -14 6 97 -56 -10 -61 -58 -119 -64 -20 -153 56 102 231 127
5078 127 -79 -17 -307 28 -62 -115 -244 -66 -83 -53 37 -105 36 -253 -294 -11 86 37 -137 -210 198 -34 37 251
5102 251 -71 68 -23 -5 176 -41 112 136 -126 68 18 51 65 83 -100 -126 114 -46 -199 -147 168 119 193 -47
5126 -47 164 -100 21 17 34 76 208 -19 -8 -118 -171 -75 -18 23 -96 187 -17 71 89 -61 -30 20 -50 3 -269
5151 -269 109 234 -133 -185 -386 52 17 -215 48 -51 77 174 -6 -2 5 108 -186 -229 -161 -110 105 179 12 259
5175 259 -266 -53 -137 -179 172 37 -95 80 62 -252 84 20 10 -181 26 215 140 192 -74 249 -354 -212
5197 -212 -17 -36 1 -132 -119 -64 91 19 -110 -146 -184 -109 128 65 -80 143 -141 216 -154 194 -63 -40 92
5220 92 -70 106 -180 -287 -281 -33 75 66 -75 157 8 -124 -10 -108 253 178 46 4 -62 54 -98 -12 11 -73
5244 -73 -142 106 261 122 30 -60 -159 -250 -86 93 -26 -130 184 375 -22 -88 303 -92 -223 92 147 -37 -98
5267 -98 -37 -24 301 -110 117 -149 28 -216 6 -232 -29 -101 -56 -271 -300 -190 -116 47 182 -299 87 98 125
5290 125 -180 -19 63 103 67 -87 -108 54 18 -10 -30 -60 234 -40 21 6 -162 145 55 253 -201 20 -115 119
5314 119 -17 -99 -35 -44 7 123 -89 -77 -90 -5 40 -28 -153 -117 7 125 -12 -317 -68 -164 -68 -135 263 68 4
5339 4 50 -131 -80 10 91 18 211 -51 -62 -203 -174 58 273 -148 230 -137 9 -69 198 39 99 -146 77 212
5363 212 55 184 -29 144 109 28 183 299 -237 -186 -193 -105 -47 138 4 124 86 58 -221 -129 -76 -221 123 -171
5387 -171 -35 189 110 129 37 138 5 268 -60 89 -139 67 -110 60 147 83 -10 -45 91 -27 11 196 -132
5410 -132 -49 202 -29 181 187 -49 132 -68 -68 67 145 -47 -207 2 109 103 -173 2 214 -122 -55 177 145
5433 145 1 130 186 96 -64 75 -112 153 206 148 43 -83 -83 99 -26 167 -62 121 -56 -166 -46 -157
5455 -157 -105 -4 120 -400 143 -116 149 -195 35 -231 -109 -106 -182 -37 -337 2 71 -251 -5 31 30 262 -291
5478 -291 -5 176 -105 -20 9 -144 -41 268 198 60 -10 124 48 125 -88 135 -42 -15 -115 168 164 -60 89
5501 89 -188 -52 38 10 -156 154 -155 -172 100 -265 -73 104 -271 135 -142 -60 144 82 121 -68 21 -24 240
5524 240 -153 -156 -260 -62 -164 76 -129 -263 -182 96 -35 -86 -63 -47 -228 -66 -44 85 47 -77 -355 -4 289
5547 289 13 431 -181 13 -89 315 128 -46 129 -62 127 72 247 -193 -356 14 -42 -128 -144 51 -126
5568 -126 27 161 147 7 247 274 40 -45 10 -192 -1 29 105 -40 50 -167 40 -39 99 -196 -335 105 -105
5591 -105 -118 -189 -32 49 -91 179 89 -142 -212 218 298 38 19 11 -198 218 66 -163 -51 -73 169 -67 -104 76
5615 76 -126 -198 -246 -84 -90 -215 14 158 55 58 -94 -211 21 -268 160 43 36 -210 -121 53 113 -31 178 135
5639 135 99 17 -30 196 -88 -8 -76 26 148 -10 -75 -162 86 143 -86 -42 -156 -64 19 14 -97 59 87 -31 -90
5664 -90 245 74 -114 -206 -37 -57 151 -217 -88 -196 -92 -104 16 22 79 -91 -12 -23 37 116 -84 91 -28 87
5688 87 -108 -1 -8 -50 43 -98 230 -27 -60 -211 173 163 -224 68 -221 -64 -124 228 -157 23 -216 118 -84
5711 -84 -97 59 -376 -213 88 47 6 -39 188 28 -34 -177 102 -105 -44 -9 338 30 145 72 -174 -52 160
5734 160 54 195 97 -104 -135 -46 -35 -77 212 -10 10 -121 84 28 211 -78 -35 99 97 -216 150 242 271 193
5758 193 -167 -197 124 86 -25 31 225 -124 14 -14 143 60 51 -102 102 -7 119 -211 -206 60 5 -112 -95 -137
5782 -137 -130 -415 146 -130 71 -165 9 62 172 345 212 49 -137 265 155 73 -244 103 -143 -135 -39 -113 -36
5805 -36 -174 -192 -123 26 42 54 -114 70 -22 90 87 127 84 448 -90 -211 122 -76 -4 149 -168 -85 84 -11
5829 -11 -45 -230 262 -77 -65 46 22 51 -92 -53 276 -237 -51 -84 -212 -39 248 -9 95 72 -193 -190 -283 184
5853 184 -167 -64 176 165 33 -99 22 56 226 124 -191 26 -58 28 41 165 -133 146 161 -54 -167 -159 -121
5876 -121 164 -450 -32 22 -129 139 -155 57 -217 7 49 -62 53 -153 102 195 1 -219 -139 350 37
5897 37 23 -56 -204 223 96 123 67 -153 -106 -18 -255 41 69 3 181 29 14 -80 -27 -50 242 -209 70 0 -47
5922 -47 -17 127 331 247 -217 -53 -50 -58 -140 -120 -196 64 -162 -130 -118 -36 155 189 6 -11 -29 43 -71 102 108 -31
5948 -31 211 -47 -6 -49 281 128 143 77 -31 -3 -248 331 -47 65 -207 -17 -148 84 -54 -98 -39 152 205
5971 205 -342 -297 -117 44 171 100 -53 -56 -14 151 -302 -121 21 141 210 -135 -276 135 -193 39 -93 -123
5993 -123 42 -9 24 -166 -3 -267 -83 140 -61 -144 125 53 -124 86 24 -340 -219 -43 -88 -47 -137 16 5
6016 5 152 -144 58 90 217 -322 -61 -344 115 233 -98 35 71 -163 -46 -95 -89 20 -99 105 -100 255
6038 255 30 13 -34 175 -2 -41 -151 -309 37 84 -156 155 47 -119 29 -224 -1 -75 72 18 3 102 2
6061 2 -173 84 9 112 117 228 75 28 75 -55 62 47 63 -42 -5 132 -77 122 -292 108 -91 11 -85 -95
6085 -95 340 62 206 244 95 27 178 -107 -8 -160 86 -29 62 -129 -97 1 -3 149 -180 -102 173 77 14 63
6109 63 38 111 -16 34 8 64 57 -84 45 69 118 -29 78 -59 -75 -46 174 273 147 -26 268 -60 22 -188 73
6134 73 33 -105 139 -121 -187 78 -94 -18 -171 126 -31 -87 123 -90 109 178 -79 85 281 -41 30 -258
6156 -258 -143 -219 171 -89 42 298 131 24 0 390 -142 -136 -106 61 108 -11 346 129 -100 -47 -5 -217 -44
6179 -44 -21 -70 113 98 -10 -40 -203 -34 -65 100 79 37 -373 -199 194 -21 26 152 89 8 206 263 -125 -39
6203 -39 104 85 -48 -84 -93 -138 12 -45 32 14 -96 -51 -234 159 -73 243 -11 -76 -53 157 -365 49 120 100 1
6228 1 -39 82 150 188 -109 -161 -190 -56 -57 16 -196 98 46 -49 238 -147 23 52 -244 -6 -105 -11 -66 -156 8 122
6254 122 -56 39 -116 150 -236 -114 -61 -77 -27 308 171 -11 -86 90 -78 -177 23 30 -322 -84 -223 -11 52
6277 52 25 -7 70 -151 66 149 -124 31 133 -28 85 1 -181 -62 160 -74 78 -47 138 -64 -114 36
6299 36 -267 33 -2 -112 -49 99 -76 -20 -179 65 35 -150 -60 -243 30 -147 27 129 -111 -186 -7 178
6321 178 109 114 -102 106 -47 -216 -113 112 100 -177 -110 -109 -44 149 70 19 88 -97 110 -302 -157 109 -85 -204
6345 -204 75 -35 104 223 -124 34 81 81 30 -141 28 40 44 97 284 326 92 183 242 -224 -230 -23 -10 -235 -162
6370 -162 27 92 57 -180 -101 52 37 158 -58 -215 -88 65 -245 474 250 129 186 16 129 18 -107 178
6392 178 163 12 33 -329 41 172 20 222 110 136 -15 -27 7 62 67 45 187 -204 -181 -61 37 -103 -275 89
6416 89 206 45 84 -106 88 -51 -46 -178 -185 31 -60 274 88 -122 -111 10 -48 -174 -30 115 376 107 -144
6439 -144 -39 -17 -13 -62 205 87 -62 91 -115 -180 71 -85 -17 334 -84 46 -21 -319 -326 9 -15 70 -5 -33
6463 -33 96 23 -26 143 -50 -138 29 63 81 -109 182 101 -33 -91 -10 -134 113 33 -219 -35 -92 -59 -7 -15 -71
6488 -71 -53 60 -140 69 35 -113 46 85 -96 0 35 10 -274 -35 28 182 -125 193 -45 -112 120 -163 -55
6511 -55 -157 -53 117 -31 -94 -108 -160 -59 47 141 150 230 -101 211 -115 195 251 102 191 84 76 -13 -26 -85 -134
6536 -134 -126 -63 52 -42 84 63 27 199 19 98 -168 112 64 46 -136 81 194 84 121 120 -55 -86 183 241 -51
6561 -51 -17 -115 44 207 -84 -192 13 -6 -314 151 9 139 38 100 -95 76 -15 -13 -246 121 110 34 96 48
6585 48 32 -67 -184 119 -91 -185 51 -40 9 149 -224 -39 118 81 90 -77 -168 -124 -31 -11 -52 -26 -227 -57 142
6610 142 -67 -200 -209 -74 -105 53 172 7 105 226 -132 30 -188 114 28 120 33 339 -67 192 -34 15 84
6633 84 38 17 -254 -83 166 41 -131 4 136 252 83 -41 229 -20 26 54 -296 -58 -17 -112 -53 85 116
6656 116 198 -282 50 -111 -170 -164 148 -103 153 118 -136 211 -61 75 153 -135 165 57 -10 2 -199 152 -52
6679 -52 -72 -62 -172 -228 89 -42 115 -93 -28 -115 -24 210 -80 -276 -56 126 205 -38 -41 124 122 -84 -164 61
6703 61 150 -46 112 -80 -111 -1 93 44 -57 98 39 46 89 217 -123 43 272 -8 -5 103 46 192 -15 -13 -72
6728 -72 -63 -21 8 -218 51 258 114 204 43 207 -77 -119 83 -61 -99 171 20 42 284 -49 31 -126 -147 239
6752 239 98 -278 -138 78 -29 133 40 72 -244 57 122 82 25 36 -99 -176 -45 125 187 -55 190 79 348
6775 348 -91 19 188 134 -117 160 -119 88 57 93 52 59 70 -42 -202 -117 24 -91 -22 149 -16 -140 -63
6798 -63 -96 136 -37 -159 -4 -21 177 21 146 8 -176 168 156 114 -131 92 68 -50 -267 97 7 -17 160
6821 160 -81 64 -184 20 203 -44 -7 -62 56 -8 -10 121 -238 -183 45 143 -58 -29 -71 -168 -27 -37 92 342
6845 342 28 -207 207 -76 -174 -25 10 159 -23 26 172 17 -125 -177 -33 82 39 39 160 135 -17 -53 127
6868 127 35 109 85 72 3 -53 -48 -29 -164 -152 42 28 -203 -97 -120 -222 31 -193 -216 15 188 -70 -55 -335 -91
6893 -91 201 42 37 -164 180 -128 -24 -73 -185 203 49 222 -387 -125 143 -203 -41 -84 -69 -198 -475 -108
6915 -108 233 121 103 56 -46 215 270 61 -144 -340 -238 229 144 29 150 12 88 86 27 -14 -8 27 -142 104
6939 104 149 -181 -93 286 3 -119 16 106 -57 -182 135 -335 -167 -104 53 131 2 196 -5 282 89 93
6961 93 39 199 -141 -111 253 -181 -118 -122 -45 177 -124 -55 -32 3 111 -38 -232 -68 94 262 105 216 58
6984 58 199 274 147 70 153 -182 39 52 -260 138 236 -80 156 -188 142 -417 -97 -255 -56 -251 -18 41
7006 41 -36 115 36 -69 -251 -78 51 3 -117 -120 -147 210 -41 186 -348 112 -94 97 52 -121 -32 175 21
7029 21 -115 132 35 -125 60 -7 172 -67 60 24 -64 95 -42 118 138 116 226 -4 312 194 -251 113
7051 113 -19 -139 -22 120 -170 71 -185 -93 -32 13 297 266 -7 -26 -13 116 75 134 213 -17 39 -160 -12
7074 -12 131 13 16 272 51 66 67 60 68 -102 -78 -28 45 -93 -69 101 74 23 -161 -200 -123 -57 -98 231 27 27 -255
7101 -255 -136 98 -236 -318 37 -173 44 83 167 80 61 219 -12 31 8 151 -130 -129 -214 -312 -11 -25 109 156
7125 156 -70 -4 40 -161 187 -16 185 -123 -124 -263 115 -27 -650 -43 386 221 -75 90 28 170 -140 -20
7147 -20 54 42 111 103 -17 -65 -69 6 126 36 -121 28 -40 177 -1 -91 119 -35 171 -51 -134 144 -94 -7 -143
7172 -143 266 43 -48 -6 22 -139 -17 139 43 -96 -113 -74 -144 167 265 -83 16 106 150 131 40 -49 -128 -123 -199 -153
7198 -153 -102 -55 -55 -5 47 -69 -26 81 84 -419 32 -31 -191 -42 51 68 28 41 -85 126 -205 -17 -196 54 -83
7223 -83 33 181 276 160 22 110 -43 145 -76 -13 1 143 199 347 -5 -73 -8 -124 133 75 244 25 30 -195
7247 -195 155 46 -266 49 -4 8 13 26 44 -143 -188 159 -16 -3 -44 -185 -261 179 141 -100 -4 -137 3 24
7271 24 308 -73 -119 249 346 -190 116 170 -136 43 186 189 157 -26 -154 192 -282 10 -416 -144 -72 243 -57
7294 -57 -243 -54 -83 59 -76 277 122 18 18 271 -33 -314 -155 -192 47 29 41 -132 -80 80 -50 118 204
7317 204 147 -89 120 26 112 75 335 -125 -89 -46 -42 -103 -54 -60 -131 2 -32 111 -106 203 15 4 24 -130 -157 343
7343 343 42 273 36 106 -42 -129 59 -137 112 -18 -254 -298 -30 -91 -207 -350 254 -216 -182 5 179 -8
7365 -8 150 -79 -76 -10 -43 -103 -145 29 -239 -4 130 40 201 12 -97 -50 77 150 311 157 14 14 -168 -123 -134
7390 -134 -27 -93 -10 -30 -166 -146 -56 -68 -97 -292 285 -33 57 -68 68 -310 185 111 114 158 -247 211 102 -8
7414 -8 16 -61 -158 -57 6 -67 74 -254 -75 139 37 -117 -14 16 43 -193 78 -7 181 -137 -27 -151 -212 -64
7438 -64 260 -2 -175 54 117 65 -154 -75 54 -20 -142 48 39 -203 68 175 -90 -220 4 -132 28 -234
7460 -234 -12 40 -67 68 -16 -58 -26 -23 152 152 73 47 -69 -74 123 -176 -200 -135 3 128 -22 -161 -89 49 -15
7485 -15 14 297 -120 46 37 88 143 77 24 53 228 -60 -66 -47 -240 -153 27 -19 -29 142 127 -355 212 -66 -55 -262
7511 -262 112 -76 -99 49 -146 -148 285 -76 -67 -32 -146 115 80 221 -11 9 -198 -58 -211 -29 2 113 -130
7534 -130 96 104 11 -153 -67 49 -94 -68 -108 -38 -122 -105 100 294 -198 -26 -363 -116 13 -92 149 0 46
7557 46 60 157 192 -112 258 253 -165 123 -133 64 227 -156 21 -43 209 -60 250 -3 -49 167 -179 -198 23
7580 23 348 181 26 -140 121 -7 -136 0 50 117 48 10 76 72 -365 -225 38 -86 228 88 -5 -17 -23 156
7604 156 65 -135 77 51 253 82 62 -16 119 -206 369 138 -228 179 -171 94 -46 131 37 92 -75 113
7626 113 -47 302 -17 58 111 35 -97 139 -105 0 52 -114 -41 -7 5 182 3 -216 120 15 -130 -86 -122
7649 -122 122 189 214 -113 133 182 -89 199 -105 -37 -130 194 183 24 -76 -84 141 -11 -110 95 -246 157 -191
7672 -191 -73 37 -254 -96 -50 181 116 144 77 -50 206 -6 256 63 75 257 126 -56 -18 -89 44 52 87
7695 87 -98 182 -55 -17 10 35 -77 -57 -112 268 -25 210 -254 -286 18 -64 173 -102 64 -307 -72 102 -412
7718 -412 -78 -69 -26 183 150 -30 -221 175 12 104 -102 -25 53 106 36 109 202 -95 20 202 -287 -227 101 209
7742 209 108 102 -3 -166 50 155 -326 -132 -167 244 23 118 -103 -68 34 -39 133 287 313 -19 48 1 -36
7765 -36 171 265 -261 11 101 154 242 133 -153 -17 -47 -7 175 75 -77 223 -17 -137 186 3 38 -10 307
7788 307 141 77 364 -150 -212 160 -46 -16 74 174 -431 224 43 40 155 18 0 118 -44 -255 41 -8 -259
7811 -259 93 125 -25 -44 111 -175 -151 -25 -77 -228 -158 -8 143 -43 33 -17 59 -96 108 -116 354 25 168
7834 168 -89 24 52 -23 191 -126 78 -9 38 4 -286 -182 95 353 -102 -282 107 -54 156 183 -106 -162
7856 -162 33 -58 -140 -286 -31 -150 154 133 -93 -2 -78 -43 -198 -113 -88 162 0 -62 108 79 102 -53 197 -186
7880 -186 136 4 -3 -21 125 -81 -89 -435 -70 -133 -4 -57 -210 -168 -232 -78 86 258 314 -81 226 -44 79
7903 79 -229 295 0 33 22 -316 75 -181 177 190 -123 -43 47 102 212 108 130 -305 9 -98 -3 -44 -14 -109
7927 -109 -129 -179 -146 153 0 -71 -59 135 -73 -32 -21 87 250 4 211 -21 143 123 -28 143 -112 -71 -26
7950 -26 58 -141 252 -219 74 -21 92 173 136 -52 -123 65 213 13 184 43 106 -273 -83 -121 -138 4 -207
7973 -207 79 -47 55 -69 -175 -36 17 -46 -158 -69 -91 -116 -162 112 222 18 257 147 -9 -168 -22 21
7995 21 24 -86 253 47 100 -133 -34 149 -246 -161 185 -139 25 63 65 -116 -260 -227 82 223 301 -82 36 -167
8019 -167 -106 -65 -126 -83 380 69 28 3 -31 124 -12 -138 5 -91 -43 84 -42 0 106 -104 -290 9 -73 197
8043 197 508 77 -277 -3 -36 13 110 67 -146 12 31 -328 16 -276 116 -87 -133 125 -104 -135 210 141 -117
8066 -117 -31 -178 -54 -58 58 -446 43 -55 -182 76 148 110 -132 -353 267 53 -12 -48 -57 105 -96 -19 48 -78
8090 -78 -205 179 -230 117 -66 8 -9 -145 -70 -91 358 -117 -48 193 -99 -106 38 124 -193 -1 -71 83 -62
8113 -62 -146 94 161 42 46 20 34 87 226 114 -26 84 -122 -324 -153 -35 281 18 -10 169 -95 118 -86
8136 -86 138 4 59 -58 -103 -225 -100 68 -85 104 -49 150 -61 189 -222 111 -7 -220 36 -11 194
8157 194 -147 -27 -26 -150 137 -96 -194 182 -152 -54 218 106 156 8 -160 54 -213 -134 -150 476 -126 -319
8179 -319 -161 -69 69 -241 -131 -56 -77 27 110 341 -78 260
8191B60
$$ Imaginary data points
##PAGE= N=2
##DATA TABLE= (X++(I..I)), XYDATA
0 0 0 0 0 0 0 0 0 0 0 -8 8 -8 16 -16 16 -24 32 -40 48 -56 64 -80 96 -112 129 -152 176 -206 238 -272 311
31 311 -355 403 -457 516 -581 652 -731 817 -912 1015 -1129 1252 -1387 1533 -1693 1869 -2062
48 -2062 2272 -2502 2756 -3036 3347 -3692 4081 -4517 5014 -5583 6243 -7022 7954 -9096
62 -9096 10531 -12398 14932 -18595 24372 -34884 60155 -253388 -81532 307472 -241308 -193313
74 -193313 170287 85463 -109627 74662 57600 -342 136572 118285 -74218 56223 115189
85 115189 -119108 -107047 119284 -26379 -162195 24754 56343 -121507 -58968 38978 -36902
96 -36902 -25962 70752 17927 -12992 63557 59478 17604 55985 25058 -28581 31163 11398
108 11398 -114984 -71061 13489 -75285 -89040 35132 17763 -38822 53479 75573 -14655 32548
120 32548 102954 14080 -9489 72169 3750 -89880 -4963 16716 -96081 -62212 50499 -75
132 -75 -57534 16766 37332 -23684 -4974 41243 18110 10637 35334 15642 -4702 7965 -3150
145 -3150 -17920 2442 2723 -24218 -19024 -5230 -21880 -28005 -3329 7570 2197 11227 22752
158 22752 20206 15670 14473 17857 16865 -637 -9353 -560 -15041 -35934 -17164 -1563 -21841 -19106
172 -19106 13154 10786 -9774 7125 26562 10441 4571 20064 12231 -201 3984 -4243 -14847
185 -14847 -5699 -4988 -15043 -9827 -2800 -8929 -10780 -3481 -1379 705 10032 11709 8471 16090 16501
200 16501 4067 4840 8338 -1822 -6432 -5476 -12633 -14659 -11478 -14452 -12824 -3494 -586 110 9039
215 9039 12467 7555 11867 16433 5804 1886 10658 1042 -9843 -1918 -4135 -15215 -7727 -2299
229 -2299 -12614 -8579 2922 -2467 -6838 5731 9253 2141 9305 14125 4666 6501 12359 -545
243 -545 -4751 5036 -4121 -16308 -7219 -5363 -16346 -10595 250 -3896 -2834 10109 9709 3182 11780
258 11780 14758 3574 3289 6514 -1827 -5756 -2881 -7468 -9581 -4876 -5114 -6511 -1907 892 -677
273 -677 1683 4490 863 2865 7157 1956 245 6558 4142 -1857 2222 2055 -4003 -2360 -1136 -7464
289 -7464 -6928 -839 -4050 -7299 910 4709 -930 3456 9626 3922 3085 8582 2990 -3837 841 -107
305 -107 -8526 -7084 -1264 -4599 -6293 516 2614 -386 3061 6500 2680 2029 4285 1406 -1452 -445
321 -445 -1211 -2446 -2491 -1145 -1332 -1326 533 1186 97 681 1437 504 -154 -229 222 893 -411 -478 1129 496
341 496 27 1007 54 -1497 -207 -371 -2945 -2681 244 -47 -2045 542 2912 1228 983 3021 1623
358 1623 70 1211 -133 -2240 -1748 -1093 -2007 -2712 -624 289 -378 757 2582 2016 1570 2251 1180
375 1180 259 266 -311 -1730 -2048 -1333 -1099 -1413 -1118 267 237 -62 835 1474 1004 683 1547 1827 -123 -503
395 -503 892 114 -892 -301 -38 -1014 -469 180 -583 -467 615 790 -720 -683 1387 700 -925 436
413 436 521 -1 -417 -90 -306 -778 -34 -365 -1450 -428 615 -347 -989 714 1665 417 175 877 1182
432 1182 -63 -84 186 -427 -558 -724 -872 -1568 -1015 -77 -283 -357 798 1497 179 20 1222 926 -433
451 -433 -144 937 -225 -1295 -514 -402 -1328 -396 232 -38 -290 581 385 -515 -63 1075 38 -585 1412
470 1412 1198 -975 -597 861 -89 -836 17 295 -806 -595 -60 -1159 -1300 768 610 -256 857 1570
488 1570 228 -365 360 707 -359 -132 518 -415 -1131 -513 -356 -787 -73 667 610 93 135 -110 -734 -617
508 -617 385 103 -441 469 611 -632 -642 490 802 360 -98 663 -191 -1019 -680 -475 -902 383 1008
527 1008 -153 -80 695 538 -423 -15 971 304 -111 209 -240 -988 -443 170 123 312 1146 409 -216 -234 -307
548 -307 -563 -681 -61 52 -610 -126 -152 -427 -101 434 993 1116 1138 690 -439 -1032 -677 -483 -289 -274 198
569 198 -32 -213 -272 -36 268 393 523 546 -551 -976 -317 -850 -805 437 1325 1481 378 982 419 -848
589 -848 -57 665 -1011 -1239 95 -859 -2126 -1339 289 8 141 1806 1456 -111 982 605 -1127 -378
607 -378 788 153 -367 340 95 -975 -902 686 208 115 642 228 -1081 -1119 -762 -915 -237 562 1616 1203
627 1203 285 1188 1500 -87 -136 1275 580 -1484 -998 -680 -2560 -2423 655 18 -1375 1639 2650 -761
645 -761 -137 2169 274 -675 1950 1647 -1579 52 1544 -1377 -2001 1006 304 -1805 12 241 -2439
662 -2439 -1300 497 -1021 -607 1912 1530 504 991 1759 1188 426 693 549 -257 -270 -2000 -2197 -1268
680 -1268 -1686 -1332 43 -454 174 1717 226 -483 1874 2277 -549 416 2598 419 -1679 694 262
697 262 -2394 -228 1109 -1988 -1814 1412 -618 -2579 752 1499 -906 226 2214 586 -528 1830
713 1830 1291 -773 491 1055 -1035 -1189 -215 -992 -1422 -361 -195 -632 -199 1086 466 -346 705 1030
731 1030 297 205 4 205 178 -491 -410 256 -183 -32 418 -715 -462 504 -231 -1166 -6 805 -447 -531
751 -531 529 574 -89 121 618 -560 -9 476 -292 -572 296 377 -432 -112 311 206 -275 330 440 -479
771 -479 -230 132 -684 -1089 -34 -76 -494 -59 229 292 868 722 871 433 471 700 -116 -571 105 -242 -1043
792 -1043 -1007 -272 -59 -833 -352 79 67 254 415 -185 108 1089 841 111 487 866 384 -336 198 -101 -746
813 -746 -359 -534 -1319 -734 -227 -731 -516 827 649 582 834 1031 1084 561 855 335 -390 -356 -200 -847 -814
834 -814 -643 -778 -674 -534 -276 90 164 558 214 332 692 423 304 603 540 592 275 -337 -20 277 -676
855 -676 -809 -612 -1013 -834 -496 -719 -238 -9 452 242 455 1043 704 462 572 536 -476 -200 -301 -848
875 -848 -368 -419 -715 -702 -305 213 -280 -237 552 279 21 453 173 185 278 434 127 126 306 159 -176 -418 -643
898 -643 -623 -443 -627 -485 -465 122 381 -319 255 595 476 518 203 318 470 36 -313 -269 -213 -242 -35 -373
920 -373 -430 150 -30 -172 -134 270 68 -169 -65 62 -122 339 -125 -64 21 231 -94 -58 183 328 -266 -228
942 -228 -74 -275 -218 -55 -206 -426 -116 -64 -321 -6 -40 -80 -164 -20 -61 -153 52 266 -24 -15 292 227 -182 83
966 83 198 193 -94 -537 -268 -83 -475 -257 -25 -123 112 350 266 93 473 313 109 127 331 9 -279 -40
988 -40 -202 -373 -259 -95 -376 -413 200 -242 -368 -63 333 329 179 374 320 137 211 368 -249 -24 184 -290
1010 -290 -327 -273 -457 -310 -419 0 84 -307 327 77 -41 11 384 507 -6 318 210 207 -203 -29 -176 -205
1032 -205 -348 -406 -307 -173 -160 141 15 -6 304 230 -109 71 323 197 82 176 -145 313 141 -321 -259 -247 -199
1055 -199 -173 -158 -69 6 232 -88 1 121 211 -74 67 119 244 -35 97 -12 84 -89 -47 -41 -134 -159 -125 -127 -80 -40
1081 -40 225 -258 -36 331 135 -279 71 354 30 -122 24 -99 -187 91 -33 -43 -120 231 -30 67 156 -81
1103 -81 -275 220 202 -177 4 128 81 13 191 156 -247 19 -109 -34 56 -80 142 -235 40 272 207 -193 -93
1126 -93 148 102 -391 290 65 -143 -176 14 79 -18 150 -78 -275 -148 155 -87 33 48 185 53 -336 70
1148 70 -31 -201 94 266 16 -123 -169 -134 -100 -180 306 -88 259 175 -179 1 8 93 -174 -241 194 -96 -18 -120
1172 -120 215 -81 -477 -8 -49 -235 -198 -92 54 -106 253 231 193 187 199 -3 -215 264 9 -88 16 -36 -97
1195 -97 79 -226 -46 -30 -101 -70 -32 -238 -97 -55 36 27 -1 -51 175 97 5 -65 -40 -133 -286 49 59 -222 -73 -387
1221 -387 -137 95 439 11 -109 -78 -173 39 121 -187 217 271 -196 -133 182 157 -152 -167 -156 313 -264 -23 -44
1244 -44 -59 -351 -234 231 -243 62 -22 265 267 55 191 210 9 -25 45 -247 -96 37 -32 -174 -80 64 -37
1267 -37 84 222 46 -47 7 -207 -220 -45 -116 -214 103 19 2 -301 -55 79 -223 -186 -184 137 -205 -132 -210 -296 -5
1292 -5 -202 -60 -152 177 287 -23 -69 219 -108 16 223 33 178 66 119 -192 152 -170 -85 -104 -120 -326 -178
1315 -178 -302 67 -25 -153 137 262 -21 -74 316 367 85 -15 347 76 -266 -209 -157 -362 -114 -113 -132 -322 -167
1338 -167 44 -38 -3 458 184 236 256 303 43 -122 293 -210 -26 -62 -273 -119 -303 -214 -138 -205 10 -111 19
1361 19 31 233 360 115 126 367 209 -95 82 -175 -94 -224 -177 -343 -96 -165 -39 50 -39 -95 -20 126 30 -36
1385 -36 84 164 46 430 267 395 194 90 46 243 -79 -136 -226 -150 -63 152 80 -355 524 355 74 130 500
1408 500 395 65 75 39 -120 -140 -334 -83 -78 -29 -183 -181 83 -10 126 -107 -207 217 38 -181 358 -173 -66
1431 -66 276 115 -34 232 142 105 -136 -112 -169 -76 -165 -182 -72 -237 323 -113 -37 1 -149 20 -50 395 150 -63
1455 -63 -174 272 90 -210 349 -32 -242 3 156 -186 -110 166 -210 -124 -206 -191 -78 -79 42 138 123 125 348 233
1479 233 179 191 -194 -33 -227 -99 -235 -327 -375 -267 -38 64 -11 -264 -150 178 92 -11 -162 174 79 -11 41
1502 41 105 178 97 304 -55 20 -285 -288 -262 -44 -195 -227 68 -83 1 100 249 61 34 118 38 -118 -259 -195 -36
1527 -36 5 -304 -133 18 -86 30 20 -80 26 348 40 56 -45 25 149 62 -130 88 146 -80 -125 169 -186
1550 -186 -132 85 -121 -232 -121 -214 -133 -112 147 192 -295 118 187 142 -162 51 -138 9 -237 52 -142 120
1572 120 349 55 -35 -81 34 197 -230 75 -59 -37 3 230 65 20 71 238 212 162 -80 50 161 173 -54
1595 -54 -249 207 -161 -97 -108 74 -376 -366 -191 -32 12 1 16 53 64 41 231 190 88 -210 -20 -14 79 -20 -159
1620 -159 -11 -118 -15 -249 -7 -201 -158 -65 -12 492 276 103 230 249 11 -17 16 -69 -43 -2 -327 -488 -106
1643 -106 -35 -87 -167 -27 -75 155 235 187 34 253 314 219 -117 98 -45 65 -43 240 -250 86 -366 -373 -162
1666 -162 -29 75 2 19 241 107 234 -25 -200 -16 255 77 -187 -232 78 -216 32 -96 -236 65 -241
1687 -241 -157 27 24 178 -30 33 142 84 230 -100 -104 -76 -11 248 -79 -178 -170 -41 -326 107 -287 -169 -313 160
1711 160 -145 207 262 41 -195 8 -163 -189 -102 -170 -136 -54 77 -58 -227 -94 -44 -277 29 -129 -19 -120
1733 -120 -103 147 -88 -59 -5 94 -66 49 194 37 -169 -99 276 -96 -293 212 -164 -200 6 -87 -30 258 14
1756 14 -77 127 55 137 -48 31 276 39 -41 -275 85 1 183 53 -119 7 -35 -296 -336 -36 47 144 -33 -55
1780 -55 -22 -44 -24 63 -199 -68 270 37 224 -45 -236 92 92 327 -125 -64 -152 2 -170 -50 -86 22 -207
1803 -207 -82 94 -61 39 20 135 195 -139 98 -41 36 150 75 -204 144 -195 142 162 -16 -30 101 -226
1825 -226 84 45 -43 24 23 230 178 34 196 346 16 157 135 -40 -347 -246 -390 -21 -332 147 93 1 41
1848 41 -28 80 -115 -80 86 -223 219 59 -59 153 62 -157 -106 49 7 118 -193 61 94 -43 -248 138
1870 138 23 -184 51 146 282 -167 33 -80 127 -354 391 92 -166 4 33 264 138 213 58 49 -195 -159
1892 -159 -96 -32 -95 -208 -221 -7 -60 206 99 7 23 -49 -9 -108 -46 -16 -181 31 138 -319 -223 30 30 -5 -236
1917 -236 -365 -86 89 31 -300 -16 -11 62 -73 -184 169 16 -89 -180 238 168 12 -75 -97 32 136 -127 169
1940 169 118 71 111 -10 9 11 -85 12 110 -205 11 83 -120 -109 -245 195 -83 -74 210 -100 171 -132 -5 -85 -220
1965 -220 12 -45 -235 -3 -93 240 321 6 -47 -149 -51 2 15 -306 -45 -91 -22 -31 -206 -187 103 -19 -188 236
1989 236 81 -2 107 28 117 106 206 229 -160 -312 -100 56 -92 36 -199 57 -298 126 57 -173 71 -115
2011 -115 274 176 -232 -133 -49 -310 -10 215 15 22 -145 -49 -131 198 296 -138 47 65 -117 -26 -231 219 65
2034 65 -64 172 243 139 -44 -52 -205 8 78 137 -113 167 -300 7 -230 296 104 15 224 100 159 181 -3
2057 -3 -4 11 -295 -40 -178 38 91 1 74 -153 -67 -9 41 75 44 15 -30 179 38 -88 -67 259 -10 61 256 -64
2083 -64 41 112 -329 -125 71 52 -180 -30 -217 203 172 -390 156 -202 111 59 -217 363 -178 128 90 159
2105 159 -25 137 -29 214 -68 -76 111 4 -4 -288 -184 1 150 262 -42 -20 333 -20 33 57 -131 -21
2127 -21 -290 40 236 -38 108 -110 205 -128 -70 -268 151 -93 -218 88 -310 64 -149 10 128 -83 -71
2148 -71 -138 144 -62 -198 65 34 -24 66 -60 -24 120 -239 -116 -230 238 44 26 90 -220 125 -225 16 -39
2171 -39 52 -101 -4 135 2 -107 123 -481 6 121 -279 -110 132 -82 -104 10 91 271 -107 230 27 295
2193 295 334 -111 79 -207 -115 -126 12 250 -30 128 84 45 111 -13 13 18 -49 184 59 -62 -108 58 -70 13
2217 13 13 -86 40 21 -88 125 59 -121 152 91 72 -78 48 -256 -22 -18 -127 145 4 -218 -20 -106 -118 -24
2241 -24 -160 105 -42 220 113 -105 -118 -185 81 32 -235 -247 -33 18 238 -51 -64 76 116 1 -157 62 265
2264 265 -207 -303 28 16 -112 -163 213 169 192 -5 3 -11 197 160 84 156 -212 17 -27 121 -67 -27 -33 -115 -6
2289 -6 137 11 -181 61 -47 -102 47 16 78 4 -139 207 -94 327 -57 2 -125 77 107 -156 -230 75 165
2312 165 -100 72 -62 -15 206 -110 89 125 11 -363 -32 -139 29 -170 78 106 -74 210 189 -53 263
2333 263 211 174 52 12 104 14 -36 -221 40 21 257 -112 205 183 83 -89 171 70 21 164 -192 -155 -431
2356 -431 -397 -85 192 -89 7 66 -119 174 17 -68 83 -318 46 261 48 -38 -122 9 -117 54 -195 136
2378 136 19 -74 -100 119 24 -173 69 179 47 -12 -175 -398 106 -30 -135 15 45 -118 -94 66 -157 -80
2400 -80 185 -28 -87 -58 79 197 -206 26 221 -62 182 -165 -51 194 3 17 151 125 112 228 -92 -107
2422 -107 -61 33 -243 176 0 -80 106 -68 -167 -142 347 84 71 -171 -185 -1 200 -32 56 117 -13 -62 -166
2445 -166 81 38 149 -50 -163 223 86 208 178 25 -15 -96 128 -75 109 196 122 -181 -119 96 -195 96
2467 96 41 -119 265 -144 74 -146 -153 -108 -48 -151 135 -51 -162 -113 42 -144 -111 -38 -282 -23 -148 -5 -256
2490 -256 95 256 66 -150 71 -243 -23 44 189 330 -76 -214 -132 38 164 -486 107 62 -11 -138 -30
2511 -30 -67 80 -6 -152 -8 -157 287 -22 -143 402 245 -354 -84 265 -6 -202 150 162 -42 248 146
2532 146 77 -18 116 -91 -59 -217 139 32 -14 291 81 -22 65 167 -223 110 221 -88 -207 -60 329 93
2554 93 2 82 74 -86 -113 240 119 -55 -73 29 -176 -7 -4 -101 33 -306 171 -41 235 -89 321 150 -62
2577 -62 -78 73 194 24 -52 30 249 -73 -41 46 16 -171 -151 239 177 231 -38 -131 213 81 -37 291 -269 -156
2601 -156 36 140 -35 -12 106 -128 -81 -198 40 1 -7 -59 -153 -130 81 -29 -184 4 223 180 -169 102 -36
2624 -36 30 -150 -62 24 80 150 -155 -49 123 219 65 -201 -18 -255 98 -11 51 -88 -101 103 -56 -148 -147 94
2648 94 -72 -184 -51 18 63 -233 -40 78 -168 -355 -149 -131 179 90 -139 52 80 -70 33 80 -56 276
2670 276 152 10 1 -17 -147 -107 38 58 131 -78 70 40 40 11 -72 50 -160 -135 -162 25 -132 1 235 -176
2694 -176 -25 12 -17 -23 293 52 80 17 -237 -41 45 -141 140 -51 23 141 -31 -259 -81 68 205 152 -15
2717 -15 7 392 -130 -11 -246 -179 -112 -91 -80 -187 -209 153 -83 -101 258 204 253 15 -66 -85 -153 -18 -13 29 -68 79
2743 79 -105 -281 -151 -18 272 18 148 96 110 -145 4 113 23 83 -23 14 51 -25 -85 -326 -209 -73 -8
2766 -8 26 -36 -154 -62 -164 27 69 121 53 -36 -90 56 245 169 157 -30 -132 277 -165 -177 -259 -341 -72 114 -138
2791 -138 -137 24 185 -208 -239 276 114 75 150 46 -9 -189 166 330 68 -134 263 -145 102 -15 -132 -123 87
2814 87 66 125 82 204 138 -49 138 -20 98 177 109 -280 -202 244 -8 -226 -27 1 300 117 -24 189 -325
2837 -325 -106 52 90 133 116 220 -15 35 312 -58 -19 25 -130 -7 -358 73 15 14 -256 134 -17 -51 -1 278
2861 278 -75 -218 -85 88 -93 -79 180 -80 49 -67 -189 178 -61 -142 -30 66 42 -94 99 -261 -101
2882 -101 -161 286 164 -51 132 43 77 -159 -66 -268 132 47 205 93 -198 -247 38 -206 -137 -365 -103 -41 21
2905 21 -80 -75 54 -6 30 -38 134 -149 -90 194 152 -47 35 -112 -115 -191 28 -200 -114 78 107 0 170 58 24
2930 24 -1 66 -36 371 40 -174 79 -37 -78 -251 113 -22 2 -190 -14 -47 130 -12 64 -71 157 8
2952 8 194 105 -98 -86 -190 152 -191 -17 -20 356 10 164 -204 -35 5 101 -82 130 85 -194 -4 147 -51
2975 -51 -27 -81 -76 97 81 -105 124 -183 -112 71 54 -90 166 -161 13 -196 -99 124 -99 268 345 278 32 -149
2999 -149 93 -16 -176 59 96 53 -165 -270 89 -131 -180 165 11 -75 -126 62 37 -285 7 -18 81 245 61
3022 61 91 30 -24 88 -130 191 62 -240 25 78 -114 51 230 186 -8 -61 103 -118 254 3 143 88 -42
3045 -42 -67 -106 291 -36 -69 147 29 52 -7 121 -307 -175 -6 -161 31 133 19 -206 205 253 -85 -38 -86
3068 -86 -119 57 -16 76 -18 306 49 -213 -18 -35 55 145 292 146 59 230 108 163 119 -108 181 -15 -230 30
3092 30 202 -247 62 -76 -199 -98 -20 18 360 -210 186 -98 51 -152 -18 22 -7 14 88 -277 -185 -241 118
3115 118 -103 179 -48 16 144 178 249 122 -107 -53 107 68 294 192 87 -154 -105 -169 -139 156 146 -263 28
3138 28 -62 -51 -145 99 -128 10 106 -205 -59 -168 -205 128 -102 55 -157 37 4 316 -52 -145 -115 110 -25
3161 -25 11 -170 -77 12 -115 -148 75 194 116 231 23 -65 -40 257 -57 -49 108 20 -261 -129 -75 -214 -111 60
3185 60 -95 -60 91 67 -67 -20 13 -113 225 -218 -225 -220 -1 101 -200 -212 -60 95 -71 -188 107 127 -88 -202
3209 -202 -5 17 -40 -70 85 -14 67 240 225 -82 -59 48 -179 -222 28 -208 71 104 -4 -26 -93 -197 17 69
3233 69 -94 -19 249 56 48 -239 199 71 -21 96 -58 77 115 -84 22 29 45 -134 -14 60 -2 -11 258 111
3257 111 307 216 183 105 144 -191 15 140 59 -33 -316 -276 -21 -18 -139 -5 41 98 -150 33 -257 0 161 132
3281 132 -111 34 185 -202 -142 214 262 -65 159 153 89 -64 63 -146 185 70 -69 -103 9 -138 -115 174
3303 174 -92 188 -120 17 -83 -150 44 34 78 66 19 59 -278 -148 -29 0 -136 -92 -183 -53 41 18 10 397
3327 397 -2 38 -47 134 -58 -16 65 -284 -185 -26 56 28 -44 1 -60 -40 136 30 -23 -181 -11 -130 51 -51
3351 -51 -73 -47 -92 -87 -93 -419 79 -72 360 -173 -41 -117 36 178 15 13 -40 -160 -121 237 -123 -395 -99 371
3375 371 -112 67 117 368 -235 -200 68 -139 348 110 -189 6 -53 -113 -139 -80 136 37 203 -14 -111 131 196
3398 196 45 -305 -189 -151 -52 -83 109 -61 171 54 44 -171 -11 73 -99 -416 -27 209 219 10 -11 -130
3420 -130 -23 152 78 14 -3 5 268 -297 88 -34 195 -66 92 -4 -225 126 -128 -72 -117 -205 10 195 119
3443 119 -38 -286 201 -144 158 283 -57 -52 28 158 53 180 -11 -150 -172 31 -182 -46 152 -202 241
3464 241 -304 311 27 88 55 -80 151 205 -221 117 111 -99 18 -85 -167 97 26 -17 -133 76 172 16 144
3487 144 -203 85 -145 -119 -39 165 -220 -164 -86 179 135 -123 34 -141 17 30 -69 205 -123 59 263 -370
3509 -370 -245 -158 -26 -27 300 138 -181 24 -237 -17 15 -81 -49 -200 -29 2 -80 -107 323 24 -174 -239 -134
3532 -134 -119 -87 -38 141 -108 -46 -96 147 149 -74 29 24 -290 -236 67 33 -9 197 -23 142 92 142 -44 -28 -17
3557 -17 62 168 119 3 -267 -73 107 -166 130 -59 -23 141 -109 -44 163 -154 44 441 -26 57 35 -35 348
3580 348 66 2 -75 2 59 6 -305 147 249 -58 159 178 -147 107 42 81 210 147 360 -176 -41 -307 34
3603 34 -31 -109 194 -150 2 -57 -268 59 -204 -47 -153 -26 41 -194 143 -133 18 198 -236 11 -24 -284
3625 -284 -184 -217 -96 -11 31 -16 77 129 87 -61 -82 21 -68 -380 -84 -80 -248 4 86 176 177 74 8 65 70 211
3651 211 26 -172 -203 -105 -29 101 -129 102 -73 -156 1 82 120 -51 -5 -8 -17 -13 43 -137 -64 114 80 -112 9
3676 9 96 135 -106 -123 91 -196 129 -33 59 197 78 6 133 -40 151 132 -98 -155 232 143 74 49 56 213 220
3701 220 11 -342 -166 -191 -14 279 61 -26 95 111 135 -130 167 102 -90 222 65 -97 -158 -106 -51 181 -140
3724 -140 -216 -82 -56 75 319 41 97 89 301 94 46 253 81 30 94 90 175 -290 -19 7 59 -176 -225 -283 -107
3749 -107 30 5 -112 -142 -98 -313 7 -92 61 -12 -122 100 -41 -215 43 -41 223 32 -291 -268 166 -136
3771 -136 151 -58 -106 138 -47 132 -15 -64 125 -124 109 161 61 1 23 104 220 35 -123 -115 -94 -63 -61 2
3795 2 351 201 -41 -67 143 -43 268 58 -82 -185 -172 50 96 88 52 74 -77 -168 -49 -212 -167 53 -19 -192
3819 -192 -224 -106 -20 -194 -26 30 48 -101 -74 -12 -103 -105 -91 54 -150 8 211 -97 -107 401 -141 -105 -163 -254 51
3844 51 -19 -49 236 26 19 66 -233 -147 -213 -29 91 -202 -109 19 -243 -33 57 2 -66 -1 59 -32 -100 25 120 172
3870 172 166 33 114 -129 -124 -108 -257 16 -9 -90 22 11 45 -95 -117 -75 -4 18 116 -202 255 -51 -55 -66 -177 150
3896 150 -11 93 -47 54 6 -163 -95 -141 12 112 10 -153 -224 -41 -223 -118 174 -121 29 -16 -173 42
3918 42 338 -30 -48 -16 18 146 165 -152 -131 -7 -79 24 29 46 -57 209 -237 -245 -183 -332 -86 -122 -76 12 -91
3943 -91 160 -186 75 252 -155 126 133 88 77 -71 155 123 -130 50 8 -178 -33 -25 -75 -30 110 -52 -195 -131
3967 -131 -105 -182 186 -38 -120 -74 -68 152 -6 -76 -70 185 33 -237 -25 87 252 10 -228 -103 21 43 -82
3990 -82 -42 -62 62 22 -97 50 -77 -286 -110 160 72 -153 -89 70 195 224 -64 16 168 -88 126 -97 141
4013 141 -110 -192 -121 -173 -131 73 -43 -146 176 -1 -16 -214 89 98 155 280 -21 -141 -68 -2 -106 95 -150
4036 -150 -39 240 -52 9 159 -27 251 20 1 127 14 -95 -70 -147 25 33 -166 -33 -22 32 -63 -8 -33 -162
4060 -162 -152 127 -83 -201 98 118 -18 64 -101 -122 41 6 -48 -115 -131 -143 -213 7 2 -177 119 -8 -153 181
4084 181 130 -5 112 -192 -149 -19 69 -99 235 515 -15 54 158 288 -280 -8 -31 -74 47 29 5 -147 -50
4107 -50 -47 -33 156 0 194 -79 -162 -25 -169 200 -8 -69 -44 161 117 56 301 242 110 -57 281 107 -62
4130 -62 368 140 -8 55 -226 76 27 128 -223 -112 113 179 106 -127 -77 -158 55 -51 -159 -140 23 -114 22
4153 22 47 -9 -487 -60 110 146 51 -112 -9 -78 87 -19 59 -157 -90 -72 94 -4 137 -139 -157 69 81 13
4177 13 36 49 -35 -84 106 148 -24 -63 149 276 12 95 290 -233 -4 -40 -80 56 215 21 -126 73 -145
4200 -145 35 23 -50 -239 -136 -126 84 -80 -97 79 243 15 -13 170 -69 236 -87 -6 -14 193 -292 -182 219
4223 219 50 94 239 -219 96 -115 18 61 -28 -137 -131 214 -144 -30 -220 -14 -273 2 6 53 48 184 72
4246 72 -8 25 186 -51 -110 68 203 -45 260 -92 38 58 267 246 179 -102 118 -22 -49 240 195 88 -81
4269 -81 -230 19 -218 -39 194 -64 61 222 19 169 214 -226 -107 -295 -61 -95 177 -330 -49 -77 22 199
4291 199 -90 -80 185 316 154 -41 222 69 61 40 120 11 -71 -172 49 107 36 -69 69 149 -120 -78 11 21
4315 21 -384 152 44 -181 -4 24 62 112 -43 211 130 -129 -95 -332 304 -107 44 -82 30 44 82 44 -33
4338 -33 254 -10 -36 104 51 -215 1 152 176 34 -40 57 150 146 -103 21 134 -109 -30 258 29 65 75 -79
4362 -79 71 365 -83 189 -83 -98 -74 85 -11 78 -62 -74 -81 76 147 154 -28 -62 277 101 0 -2 136 34 139
4387 139 180 79 -26 -33 -11 -43 -102 90 58 -107 96 212 -22 -139 -81 142 -143 175 -113 189 231 69 -302
4410 -302 -2 130 -198 70 16 239 -199 -340 137 108 -247 325 130 63 86 -193 -1 -325 286 -60 -267
4431 -267 -18 -106 192 63 207 -16 20 101 70 -18 -49 -169 -39 -24 -40 -133 30 243 -97 -216 6 -81 -259
4454 -259 -130 179 245 161 130 -75 60 -57 228 -65 -50 82 -26 71 -67 65 -151 61 -108 -20 -23 -64 27
4477 27 144 238 -44 -179 -18 46 -136 -163 -68 58 -134 11 -39 -123 72 60 -124 -128 -74 -116 216 -82 -106 15
4501 15 308 81 -62 -39 14 38 11 42 142 99 134 -25 -34 -199 -160 -44 -1 93 101 233 51 49 -75 86 -319 52
4527 52 -88 -200 -29 -11 -212 -28 -120 -90 144 177 -201 -125 -366 61 232 61 -39 103 -296 147 282 -56
4549 -56 193 23 -27 97 205 166 115 25 257 -74 -13 29 181 46 -6 -239 122 427 -72 50 52 32 97 -157
4573 -157 -67 -53 -6 50 -60 -8 -61 -17 72 -154 75 67 -12 -16 -61 70 -288 -24 111 -68 157 165 -130 -66 -34 138
4599 138 120 -293 -163 -114 117 46 -63 -99 44 75 -55 32 -33 -64 125 -18 -72 8 266 28 62 -95 80 -24
4623 -24 -106 -169 -155 -37 -76 244 -160 48 176 -30 107 -48 -128 -94 2 28 146 16 279 76 87 -151 -175 -134
4647 -134 -122 43 -88 54 -84 86 -21 -83 -183 14 36 159 68 9 112 58 -134 10 98 19 73 -39 -152
4670 -152 -52 -138 250 -82 12 -47 -100 -282 -53 -72 -115 -35 -16 -77 -210 204 -56 -4 76 146 -62 89 -33 -216
4694 -216 -34 -149 35 -54 -38 102 55 -122 -237 108 140 -94 111 -209 41 -7 99 163 -119 -107 -16 -177 14
4717 14 273 -310 -101 -24 11 -3 211 24 -139 150 -214 -176 83 151 -33 -236 12 46 -52 -51 -123 213 8 114
4741 114 -113 95 98 153 -9 -239 -137 -2 -119 -73 1 -171 -277 -184 -111 -75 347 -78 -163 -39 -111 47 99 195
4765 195 -77 -13 183 -21 51 15 204 12 37 -34 23 -143 95 201 4 -91 -24 73 89 97 -69 23 104 3 255
4790 255 -24 100 8 34 32 54 -96 -120 92 49 17 31 277 -7 135 125 82 -24 -19 -138 -39 -100 67 6 -33 -40
4816 -40 9 -128 29 40 16 61 -85 230 -73 -124 -72 153 379 150 -246 -196 269 -252 -33 -68 106 -162 -282
4839 -282 -335 -289 89 47 338 -11 15 21 -31 5 -74 16 -126 44 15 -29 366 -145 77 -206 -180 -6 17 -127 201
4864 201 -21 4 80 97 174 -38 230 -126 -30 -106 269 73 40 105 180 183 127 -211 330 184 71 -210 159 -25
4888 -25 -259 -3 -29 23 151 -197 37 98 180 -165 202 -36 -172 117 -37 -147 152 -22 -151 -234 -78 40
4910 40 -2 29 -103 7 186 -95 -171 -120 -6 -23 -5 -99 20 -19 -136 235 113 49 -52 63 51 -201 -106 115
4934 115 -34 -155 -169 -48 -23 -176 -214 8 -196 200 -35 46 -10 43 -54 -17 -133 2 -108 215 9 -121 -126
4957 -126 -55 -138 -118 -336 -201 76 22 -216 -323 -80 -213 -51 -78 -34 -21 68 -151 17 28 112 79 -85 -85 -25 117
4982 117 43 44 -473 116 -11 43 -68 -166 6 153 -159 28 -1 -238 138 28 -160 -60 -75 170 149 -224 -62
5005 -62 2 -43 -115 -69 194 -131 -39 -180 108 -27 57 47 29 1 114 82 -127 23 -6 290 254 -37 43 112 132
5030 132 66 230 0 -46 -134 47 -190 -113 169 41 -51 2 197 -116 -43 -229 -193 -249 107 -98 -38 -14 232 -37
5054 -37 85 71 -181 68 235 4 -52 -300 -155 -34 160 60 -33 112 -5 -50 136 51 174 20 -1 70 -66
5077 -66 216 126 28 4 -112 -167 -133 25 220 -147 94 28 -156 133 -243 -2 18 42 67 -134 -14 -12 4 283
5101 283 -16 79 -15 -72 103 -175 -44 -136 246 92 -118 105 -203 105 -8 -404 146 149 280 -151 134 86
5123 86 46 -56 -79 58 -91 65 -341 -86 30 373 -109 -137 -57 39 -120 84 -101 176 -59 -342 16 -44
5145 -44 87 47 -84 -12 116 -196 -73 124 56 -297 -253 373 -42 69 -23 -189 -230 57 62 -243 86 175 -128
5168 -128 -84 30 146 44 48 -119 152 57 139 253 93 -296 118 12 12 -100 174 168 -93 77 -29 -3 -211
5191 -211 55 12 333 227 169 6 -6 -80 -275 -63 -256 -76 -89 29 -3 75 -56 -81 -29 67 -106 176 65
5214 65 131 259 174 6 -102 110 -98 -25 135 31 -159 73 226 -214 91 -41 -91 -259 -172 -98 -334 66
5236 66 -75 102 210 -102 39 14 115 82 241 30 -46 -104 -313 17 -156 476 -9 42 -82 257 65 136
5258 136 32 61 68 118 -40 6 -52 -40 293 219 101 -48 -23 -24 54 19 255 -73 52 -73 -87 120 27 15 -314
5283 -314 -52 141 111 120 300 80 -140 -6 271 57 -123 377 98 55 -38 -249 144 264 18 361 72 -145
5305 -145 -297 233 160 -92 214 -282 -111 -229 -96 53 215 17 93 -70 -287 -160 80 256 220 -46 44
5326 44 -124 34 -139 -100 -139 -101 191 -20 11 -202 -156 141 -96 81 165 102 -11 -106 91 -85 5 -13 138 -64
5350 -64 7 -278 197 -176 -78 6 21 -73 -44 -124 22 -121 319 -3 66 27 -24 -93 -99 74 88 -31 122 -119 -32
5375 -32 143 -86 63 -30 -99 -114 -9 164 235 -96 -147 -79 166 -7 -119 13 70 176 -134 -49 45 -99 -97 -75
5399 -75 -101 -98 -80 -238 160 303 196 137 -99 -246 -26 -68 -112 -63 103 -28 -59 -10 -26 -36 -121 123 20 200 -18
5424 -18 258 9 116 -16 -2 -49 223 -170 -40 52 101 194 124 151 -34 0 133 -140 -188 -70 -132 -197 253 13
5448 13 51 -144 -214 68 87 7 50 166 -45 -50 170 144 121 87 123 -139 -27 254 -12 56 -32 -223 -97 31 -308
5473 -308 144 -74 233 -159 -17 -40 56 64 81 -109 150 -18 -1 103 -18 69 -233 -167 -96 -161 293 -137 -83 -135
5497 -135 -133 174 115 -9 -82 92 -144 -34 -43 100 235 -97 12 -107 33 37 17 123 -80 -396 -203 41 -36
5520 -36 -219 116 -13 -49 65 -151 409 -86 -191 52 37 -230 117 140 97 30 -29 -359 -171 -4 -137 88
5542 88 10 -248 51 -185 177 -41 222 -5 27 34 34 56 195 -396 120 -13 -244 43 -137 13 44 -54 -74 185
5566 185 -139 -87 -79 53 68 -157 18 -7 170 -230 160 194 -179 68 -72 39 -128 53 425 87 -166 411
5588 411 -277 186 129 279 -38 159 17 254 -6 -15 174 -16 -9 -352 123 -48 -183 69 23 40 -168 -31
5610 -31 17 -192 -368 190 -176 -29 45 72 -61 -19 157 35 -108 -59 99 303 66 40 -99 -131 -39 -129 14
5633 14 -82 92 92 -33 230 -202 -115 -18 -36 11 -113 -159 -69 277 96 -176 -127 241 164 217 55 25 -194 -68 147
5658 147 -21 -352 30 6 129 -144 12 -115 78 266 -186 272 -15 -9 304 224 97 63 60 -255 37 75 227
5681 227 152 38 52 -361 -167 -44 -200 69 188 -51 -79 40 -83 64 33 -5 139 -39 76 67 90 -129 -71
5704 -71 -34 -87 -324 -122 -147 48 -318 -15 -81 -146 205 38 13 -330 -49 175 42 -175 -241 -119 -132 180 93
5727 93 -121 138 28 21 163 53 -6 -10 200 -181 -14 68 -24 -173 -107 -128 70 -26 8 323 -51 -22 -309 270
5751 270 -138 148 122 -128 -217 143 74 195 75 -84 -98 190 266 68 -12 26 -3 -43 7 8 70 -119 -133 -9 221
5776 221 153 25 169 71 105 181 68 85 127 -274 126 -66 62 -185 -145 93 -119 140 -80 41 84 173 -51
5799 -51 -110 54 128 224 -25 -95 -51 -9 94 -77 74 249 -118 -161 52 174 -194 -40 -75 68 -85 -26 170
5822 170 -82 -177 -102 -85 -150 115 -56 216 105 73 -92 55 60 47 114 -231 96 36 104 -79 -227 258 46 -41
5846 -41 11 130 222 -19 -20 -32 163 39 -22 -12 -51 -251 11 -61 38 89 -44 -19 -173 -263 -271 98 80 -239 236 188
5872 188 268 -14 75 189 43 114 -421 -22 227 -69 -45 -72 -166 -23 92 6 84 -170 99 123 -68 -119 232
5895 232 -93 23 82 -191 53 -139 152 283 43 -321 -120 -67 -200 167 -123 74 38 -66 75 14 210
5916 210 -114 104 218 60 -108 248 -256 -117 -4 -131 100 70 -304 33 38 54 239 296 196 171 20 5
5938 5 343 151 158 144 116 -58 234 -55 -303 156 32 -95 71 -227 -54 -189 47 -54 -145 192 254 37 85
5961 85 2 46 -103 -86 17 54 158 -160 -166 -107 84 71 68 107 -140 -102 -18 -32 -260 -179 265 -109 -60 -129 -328 51
5987 51 163 -77 2 -51 -9 253 -83 46 -49 -18 78 -171 161 -198 246 56 -63 48 184 216 25 -83 -120
6010 -120 -116 -150 -25 50 48 -56 -20 305 -123 -185 -69 -114 139 168 219 -69 131 -43 -101 -20 -69 -156 -82 -4 -84 -26
6036 -26 -106 65 84 -26 -82 -17 38 -39 -168 358 85 -67 -19 -59 -31 -89 -157 233 170 90 -131 137 190 -25 -109
6061 -109 103 24 -87 142 11 13 50 -42 39 41 -135 -93 -94 -105 -34 -16 42 275 -109 -188 326 -39 -94 27 -77 -41
6087 -41 46 -70 287 -73 116 -107 97 -32 -58 -41 -98 -45 -152 254 -91 -34 -142 292 -29 109 -66 -50 311
6110 311 -401 25 100 76 -195 105 22 -31 -23 -157 -48 -7 179 6 91 56 -190 -155 213 132 -138 55 130 -156
6134 -156 271 118 18 27 -22 -116 -19 -266 -277 -152 261 -135 -161 20 -163 184 82 106 -283 51 -200 27 -102
6157 -102 28 30 -96 114 45 -73 -167 305 109 -346 -136 -276 66 -83 318 -59 126 -9 10 -82 -6 -54 174
6180 174 58 -394 -46 26 59 -209 -158 0 -200 -52 10 162 -66 -278 126 46 -126 -109 -69 144 14 40 144
6203 144 56 -40 -108 106 234 -18 -132 41 50 304 306 -18 52 -247 111 124 -302 3 -141 -101 53 -57 114
6226 114 -27 31 87 38 -130 -138 -182 11 125 -102 63 -85 -14 -80 46 -6 10 -22 -51 189 84 73 -317 -136
6250 -136 59 -188 7 -84 148 -30 -132 362 -38 -79 -170 -235 69 142 -180 65 -19 196 38 -176 -52 -118
6272 -118 -134 -205 143 130 100 91 -140 -67 -68 113 -32 -171 57 147 236 66 -54 35 93 70 -26 -118 172 -159 -39
6297 -39 -210 88 3 109 -161 -42 -39 -43 45 63 -411 10 -88 -424 -163 -100 52 -187 -157 -121 68 170 -63 210
6321 210 -404 98 -49 30 69 -32 152 -234 97 -100 -314 -56 -129 128 -109 -74 -245 -36 -10 72 71 -237 -130
6344 -130 120 179 117 115 -116 340 97 274 93 237 26 58 65 -154 286 69 -201 52 41 -22 63 144 132 202
6368 202 177 -62 -145 207 -94 -27 37 -161 -60 332 124 -84 208 -51 -324 37 44 55 227 5 73 63 100
6391 100 -185 -104 41 78 -153 176 103 -12 -264 31 -330 -80 -62 75 -122 74 75 -131 32 74 -63 164
6413 164 124 43 33 23 -33 -2 -43 95 -35 274 79 -247 281 -28 80 3 124 179 -3 130 -69 -214 -20
6436 -20 -44 -82 123 70 -56 107 -58 -113 11 -129 199 -157 -43 -215 -6 -288 136 403 101 -153 -91 44
6458 44 24 -154 -98 186 -38 -135 201 53 47 -26 4 -132 170 -22 -108 -1 51 38 219 -21 -61 -120 121 -157
6482 -157 65 166 51 -98 -22 -86 -43 2 51 -34 -65 139 4 -116 -15 -72 -66 -93 217 -17 -70 -102 -226 14
6506 14 29 33 -27 -11 -291 211 41 -71 -258 -116 190 82 -22 -254 -204 52 -111 -43 91 -14 52 345 136
6529 136 -89 -14 21 31 200 -276 99 94 -354 -79 -93 61 232 -35 -117 -89 -151 -57 -178 11 143 -222 -100
6552 -100 174 130 138 -108 -149 5 244 -320 123 -23 -28 -33 -374 297 38 10 1 -8 249 104 184 191 -219 373 -93
6577 -93 -165 20 -229 77 -123 -329 -260 9 211 -122 121 210 -64 136 -72 -9 -247 21 -73 152 -120 104
6599 104 145 63 -214 -284 63 -28 -128 -60 100 -329 -225 75 54 -176 -76 80 -32 318 302 -82 -10 -106 39
6622 39 -60 156 160 -56 158 206 -71 -69 -222 1 -59 76 -153 197 -37 70 76 -28 -176 1 -14 93 31 -76
6646 -76 -72 195 192 -106 -155 30 160 -78 -62 476 142 -186 92 328 48 -178 -219 133 6 -75 68 -138 -38
6669 -38 -163 96 6 96 -13 4 -226 153 62 -18 161 -132 32 241 -150 -152 182 -154 144 -224 -73 -86 -50
6692 -50 23 151 127 13 -7 62 -96 -55 3 20 148 55 61 -44 -10 -108 131 -63 51 -140 8 -83 -89 168 -263
6717 -263 106 37 2 69 27 172 62 8 -208 13 -12 -174 152 -101 75 -174 1 240 -114 -197 -222 -94 190
6740 190 15 92 127 -42 -49 38 -26 167 99 -160 49 -212 152 -11 -87 -19 38 -128 -232 7 32 -23 -73 144
6764 144 39 -54 -101 173 -323 -204 -195 106 162 90 -161 76 -41 95 -78 65 18 89 234 80 307 182 -17
6787 -17 11 221 -35 -169 -107 -24 22 111 -28 55 -56 65 -157 77 75 -231 71 -51 24 119 42 -124 -91 -183 -122
6812 -122 42 -108 87 108 -86 -161 81 182 -270 -18 142 -18 -52 -33 102 38 -42 -101 58 -123 307 48
6834 48 -28 -21 251 -261 -9 49 6 219 -4 -82 41 -108 75 75 -62 103 371 -308 79 251 71 0 -122
6857 -122 -160 -395 -118 39 -339 -56 -88 179 -3 -84 145 158 -139 -167 125 191 60 106 102 -36 -36 -7 -17 61 -124
6882 -124 -2 -172 -173 134 178 44 -302 52 -87 43 82 -129 60 -5 -118 -3 73 -273 27 166 78 181
6904 181 -15 -84 -58 63 80 -151 -4 73 30 -250 -43 -25 -10 96 -75 -183 171 78 -51 -33 128 184 283 35
6928 35 88 173 -55 95 192 -161 79 83 -35 -276 109 54 42 -162 -106 -48 53 -171 11 -62 68 36 -66 43
6952 43 41 58 -211 -29 -32 -148 274 -70 -88 101 376 -122 100 62 -9 312 137 92 -19 -133 -39 82 -37 -183
6976 -183 166 126 -113 -127 152 172 -400 -128 15 265 -19 2 -73 87 434 -30 -142 -46 -17 11 -278 -172 -85
6999 -85 -135 106 31 201 69 -198 -22 250 -66 133 35 65 47 -108 -98 130 40 180 105 183 381 118 -317
7022 -317 -208 494 -108 75 -320 -140 -33 -224 -198 -164 -159 -85 -80 168 -222 134 158 56 183 53 36 -134 -115
7045 -115 75 -2 12 -11 -204 -122 -124 -99 156 189 -255 101 79 51 156 -2 50 53 51 136 78 -94 -21 194 88 -107
7071 -107 166 61 -112 37 99 18 123 -112 -14 -123 -135 -90 -225 45 -148 41 52 103 -198 -82 207 100
7093 100 196 267 149 8 -57 -129 34 8 24 -141 -91 89 -143 64 232 -36 107 275 -65 -28 201 -10 -310
7116 -310 66 -31 173 -92 -216 -122 -3 17 -134 5 137 -295 40 269 52 58 -159 -86 -30 250 -248 966
7138 966 -62 -209 -10 -227 194 37 145 -87 117 27 -28 -97 -216 -29 169 -150 -10 160 -138 -51 -152
7159 -152 -275 9 -115 166 10 94 70 212 29 -79 -11 -56 119 -176 127 -71 159 -120 174 -78 -92 -249
7181 -249 71 88 101 86 -26 75 -204 -124 -214 -118 -123 -43 221 -129 -269 -148 -265 128 35 -117 -20 49 -156 214
7205 214 59 -216 -77 96 14 -8 -98 36 46 147 57 -96 79 -209 -70 -177 441 -84 103 3 -351 -110
7227 -110 17 -30 41 -192 77 213 300 71 -238 -57 -186 15 -74 -127 -98 -155 -1 83 -26 89 -71 13 170
7250 170 106 -4 -83 8 146 -29 150 184 341 148 61 186 139 -85 188 -153 36 11 184 176 185 -98 84 129
7274 129 -60 -13 -78 -66 -186 30 -48 42 -133 -168 18 -9 286 168 -92 -215 -39 -348 49 73 238 -38 108
7297 108 28 121 -82 -89 -130 -9 263 -199 218 15 -37 -5 -148 -280 11 124 -84 -190 -164 -30 168 -87 -42
7320 -42 103 -17 -111 269 -236 91 -142 75 104 9 34 -224 -87 281 65 72 113 215 187 177 -120 -105 -85 -82 108
7345 108 141 30 144 11 -73 -12 -98 4 124 -55 115 -211 -231 -164 26 142 -289 -25 -179 332 -320 -331
7367 -331 124 128 88 96 -67 47 -51 62 -248 163 -9 204 -78 -51 260 28 -109 233 -112 -153 89 -16 32
7390 32 -229 -71 217 -268 4 135 42 -111 -106 -198 -175 -70 -14 28 -205 169 10 -176 71 2 16 147 152 -101
7414 -101 41 4 270 237 186 73 18 -63 256 29 -247 -124 -226 -68 126 -25 -145 -30 163 -70 -142 59
7436 59 4 92 -118 92 85 -100 13 -127 -109 147 -86 294 -22 -10 210 20 -150 95 -77 -291 -258 40 -105
7459 -105 108 65 65 131 52 174 48 -197 90 -51 44 -135 -31 108 -62 31 11 145 65 -178 17 -111 -109 -137
7483 -137 119 84 133 21 153 -117 -92 -100 -146 -77 207 -77 250 -41 81 21 168 -185 218 -48 -54 -36 -181 230
7507 230 75 -293 370 250 24 142 65 68 -46 67 -21 70 -107 245 59 41 -77 97 149 34 -146 -26
7529 -26 57 192 -251 286 27 1 131 -154 -31 94 24 180 -165 16 -164 102 -113 -64 -223 323 -65 125
7551 125 55 -126 106 137 153 -65 -165 41 32 98 -256 -18 -117 -97 -58 27 141 -228 -178 -167 -107 -40 -89 37 -38
7576 -38 190 -217 168 169 10 135 323 11 -192 230 -132 -255 101 66 -99 -131 236 267 90 276 -325 -94
7598 -94 114 164 97 -48 127 -100 -29 134 19 -243 389 329 152 -81 94 14 103 239 65 96 -55 -123 -31
7621 -31 -133 44 68 -54 -130 -172 124 -127 8 39 263 -8 43 -29 -34 71 -149 -144 130 -205 24 -174 109 -204
7645 -204 -4 -231 -26 28 72 33 15 -230 72 -99 -279 -58 -69 51 234 47 65 132 9 -99 149 129 -10
7668 -10 -128 -12 55 83 196 -266 29 137 470 202 178 -254 154 -68 31 199 -122 222 218 209 105 186 -157
7691 -157 -86 133 -44 -223 -103 87 184 25 154 182 233 -170 232 -159 11 185 97 -51 -228 -10 58 -100
7713 -100 -327 -122 51 11 63 -29 -8 140 152 216 64 -130 134 115 -161 -71 -149 -179 -93 -177 29 -125 461 39
7737 39 51 -134 194 11 35 97 75 -72 -113 -50 -121 4 -50 -51 154 10 -102 -141 -32 -196 -46 25 108 -306 -210
7762 -210 313 78 202 -25 -3 -68 78 172 -125 -159 -7 121 264 87 46 -66 -190 -34 -37 83 183 76
7784 76 37 197 182 -73 -175 -176 134 79 127 -97 -28 280 -196 -229 -78 -172 186 -216 185 -235 176 76 -53
7807 -53 -10 220 -16 -129 -42 58 92 -50 337 52 -78 -87 239 84 298 94 -178 59 -63 -229 4 167
7829 167 -9 -217 122 142 -218 -63 260 -162 -21 -28 -3 -28 -81 -155 -231 14 -57 -133 55 77 44 -27 18 161 -33
7854 -33 -126 -278 40 -224 -23 -18 65 -373 -19 -50 -199 -4 60 -2 166 -273 263 -116 117 -176 -81 108 -74
7877 -74 -103 -44 137 143 216 229 201 180 -133 72 23 -151 58 181 276 -177 -103 6 322 -29 79 31 -160 305
7901 305 -95 3 -91 -180 -47 -59 -60 -43 58 108 -34 -21 204 -29 -128 102 -35 -115 10 -253 -1 241 -342 32
7925 32 37 -214 -63 10 -120 -205 -171 154 -146 161 -69 -1 124 111 28 -41 96 87 71 -235 170 85 -71 136 134
7950 134 70 -9 110 -23 -93 -39 -290 48 -9 44 -97 -53 153 160 15 -149 198 108 -85 -41 -190 -500 205 -210
7974 -210 -229 -170 -5 41 -140 -45 -63 299 -119 122 188 -11 85 107 -170 140 -5 101 -108 -49 165 258 -79
7997 -79 74 -209 124 206 7 98 -100 259 -229 -47 -14 -86 59 -7 -42 -211 -413 54 177 -133 -20 81
8019 81 -60 -17 108 -107 -62 117 -206 -60 -1 -62 134 222 4 107 63 98 -38 -64 42 -199 -118 305 280 -6
8043 -6 -2 -145 61 16 -108 100 103 315 -257 -118 147 79 -92 -87 116 73 279 -183 -134 -59 171 -1 102 -37
8067 -37 -206 158 -195 -167 105 11 -54 203 216 9 -60 -18 117 -30 107 179 -66 211 243 49 153 55 26 -303
8091 -303 -203 17 81 -47 -114 62 62 32 -223 -217 132 -286 36 -203 -117 151 136 -27 156 -218 -74 -18 88
8114 88 -90 186 -153 -45 -25 189 22 356 -2 -164 -3 -82 -210 -36 179 -99 5 94 -151 210 -25
8135 -25 168 -7 66 170 -76 -69 -8 -39 -49 57 -48 -148 -168 168 -145 -94 -154 -267 138 -48 55 23 78 41
8159 41 13 134 36 3 21 -20 -195 -1 -232 -185 59 115 307 -55 144 -54 -129 60 330 178 115 -108 -20 146
8183 146 -286 -120 -35 144 99 130 115 -170
8191a70
##END NTUPLES=NMR FID
##END=
