##TITLE=1H_DE-100oil_d6TFA
 200.13MHz,DMSO-d6,
 8 sc
 
 3.7.2025
##JCAMPDX= 6.0         $$ Bruker NMR JCAMP-DX V2.0
##DATA TYPE= NMR FID
##DATA CLASS= NTUPLES
##ORIGIN= UXNMR, Bruker Analytische Messtechnik GmbH
##OWNER= pz
$$ XWIN-NMR		Version 3.5
$$ Thu Jul  3 15:29:06 2025 Russian Standard Time (UT+4h)  she@DPX200
##.OBSERVE FREQUENCY= 200.1313
##.OBSERVE NUCLEUS= ^1H
##.DELAY= (6, 6)
##.ACQUISITION MODE= SIMULTANEOUS
##.ACQUISITION SCHEME= undefined
##.AVERAGES= 8
##.DIGITISER RES= 18
##SPECTROMETER/DATA SYSTEM= spect
##.PULSE SEQUENCE= zg30
##.SOLVENT NAME= CDCl3
##.SHIFT REFERENCE= (INTERNAL, CDCl3, 0, 14.3821)
##AUDIT TRAIL= $$ (NUMBER, WHEN, WHO, WHERE, WHAT)
$$ ##TITLE= Audit trail, XWIN-NMR		Version 3.5
$$ ##JCAMPDX= 5.01
$$ ##ORIGIN= Bruker BioSpin GmbH
$$ ##OWNER= she
$$ F:/spectra/data/she/nmr/H-C/1/audita.txt
$$ ##AUDIT TRAIL=  $$ (NUMBER, WHEN, WHO, WHERE, WHAT)
(   1,<2025-07-03 15:27:44.32 +0400>,<she>,<DPX200>,
      <created by zg, POWCHK disabled, PULCHK disabled
       configuration hash MD5:
       00 E9 B6 7A A2 85 ED C7 34 08 36 98 17 FE 4E 26
       data hash MD5: 16K
       09 3D BD 1E ED 37 D6 98 1E 47 74 7E 1D DC 33 BC>)
$$ ##END=
$$ 
$$ hash MD5
$$ F7 F2 A0 04 73 10 CC 60 BE 76 5B A4 C4 F2 34 98
##$RELAX= 
##$RELAX= 
##$RELAX= 
##$RELAX= 
##$RELAX= 
##$RELAX= 
$$ Bruker specific parameters
$$ --------------------------
##$DU= <F:/spectra>
##$EXPNO= 1
##$NAME= <H-C>
##$PROCNO= 1
##$TYPE= <nmr>
##$USER= <she>
##$AMP= (0..31)
100 100 100 100 100 100 100 100 100 100 100 100 100 100 100 100 100 100 
100 100 100 100 100 100 100 100 100 100 100 100 100 100 
##$AQSEQ= 0
##$AQ_mod= 1
##$AUNM= <au_zg>
##$AUTOPOS= <>
##$BF1= 200.13
##$BF2= 200.13
##$BF3= 200.13
##$BF4= 200.13
##$BF5= 200.13
##$BF6= 200.13
##$BF7= 200.13
##$BF8= 200.13
##$BYTORDA= 1
##$CFDGTYP= 0
##$CFRGTYP= 5
##$CHEMSTR= <none>
##$CNST= (0..31)
1 1 145 1 1 1 1 1 1 1 1 1 1 1 1 1 1 1 1 1 1 1 1 1 1 1 1 1 1 1 1 1 
##$CPDPRG= <>
##$CPDPRG1= <>
##$CPDPRG2= <>
##$CPDPRG3= <>
##$CPDPRG4= <mlev>
##$CPDPRG5= <mlev>
##$CPDPRG6= <mlev>
##$CPDPRG7= <mlev>
##$CPDPRG8= <mlev>
##$CPDPRGB= <>
##$CPDPRGT= <>
##$D= (0..31)
0 0.7 0 0 0 0 0 0 0 0 0 0.03 0 0 0 0 0 0 0 0 0 0 0 0 0 0 0 0 0 0 0 0 
##$DATE= 1751542063
##$DBL= (0..7)
120 120 120 120 120 120 120 120 
##$DBP= (0..7)
150 150 150 150 150 150 150 150 
##$DBP07= 0
##$DBPNAM0= <>
##$DBPNAM1= <>
##$DBPNAM2= <>
##$DBPNAM3= <>
##$DBPNAM4= <>
##$DBPNAM5= <>
##$DBPNAM6= <>
##$DBPNAM7= <>
##$DBPOAL= (0..7)
0.5 0.5 0.5 0.5 0.5 0.5 0.5 0.5 
##$DBPOFFS= (0..7)
0 0 0 0 0 0 0 0 
##$DE= 6
##$DECBNUC= <off>
##$DECIM= 32
##$DECNUC= <off>
##$DECSTAT= 4
##$DIGMOD= 1
##$DIGTYP= 9
##$DL= (0..7)
0 120 120 120 120 120 120 120 
##$DP= (0..7)
150 150 150 150 150 150 150 150 
##$DP07= 0
##$DPNAME0= <>
##$DPNAME1= <>
##$DPNAME2= <>
##$DPNAME3= <>
##$DPNAME4= <>
##$DPNAME5= <>
##$DPNAME6= <>
##$DPNAME7= <>
##$DPOAL= (0..7)
0.5 0.5 0.5 0.5 0.5 0.5 0.5 0.5 
##$DPOFFS= (0..7)
0 0 0 0 0 0 0 0 
##$DQDMODE= 0
##$DR= 18
##$DS= 0
##$DSLIST= <SSSSSSSSSSSSSSS>
$$ [...]
##$SUBNAM0= <"">
##$SUBNAM1= <"">
##$SUBNAM2= <"">
##$SUBNAM3= <"">
##$SUBNAM4= <"">
##$SUBNAM5= <"">
##$SUBNAM6= <"">
##$SUBNAM7= <"">
##$SUBNAM8= <"">
##$SUBNAM9= <"">
##$SW= 18.0517328524113
##$SWIBOX= (0..15)
0 0 2 0 0 0 0 0 0 0 0 0 0 0 0 0 
##$SW_h= 3612.71676300578
##$TD= 16384
##$TD0= 1
##$TE= 0
##$TE2= 300
##$TE3= 300
##$TEG= 300
##$TL= (0..7)
0 120 120 120 120 120 120 120 
##$TP= (0..7)
150 150 150 150 150 150 150 150 
##$TP07= 0
##$TPNAME0= <>
##$TPNAME1= <>
##$TPNAME2= <>
##$TPNAME3= <>
##$TPNAME4= <>
##$TPNAME5= <>
##$TPNAME6= <>
##$TPNAME7= <>
##$TPOAL= (0..7)
0.5 0.5 0.5 0.5 0.5 0.5 0.5 0.5 
##$TPOFFS= (0..7)
0 0 0 0 0 0 0 0 
##$TUNHIN= 0
##$TUNHOUT= 0
##$TUNXOUT= 0
##$USERA1= <user>
##$USERA2= <user>
##$USERA3= <user>
##$USERA4= <user>
##$USERA5= <user>
##$V9= 5
##$VALIST= <valist>
##$VCLIST= <CCCCCCCCCCCCCCC>
##$VD= 0
##$VDLIST= <DDDDDDDDDDDDDDD>
##$VPLIST= <PPPPPPPPPPPPPPP>
##$VTLIST= <TTTTTTTTTTTTTTT>
##$WBST= 1024
##$WBSW= 4
##$XGAIN= (0..3)
0 0 0 0 
##$XL= 0
##$YL= 0
##$YMAX_a= 206191
##$YMIN_a= -292751
##$ZGOPTNS= <>
##$ZL1= 120
##$ZL2= 120
##$ZL3= 120
##$ZL4= 120
##$ABSF1= 10
##$ABSF2= 0
##$ABSG= 5
##$ABSL= 3
##$ALPHA= 0
##$AQORDER= 0
##$ASSFAC= 0
##$ASSFACI= 0
##$ASSFACX= 0
##$ASSWID= 0
##$AUNMP= <proc_1d>
##$AZFE= 0.1
##$AZFW= 0.1
##$BCFW= 1
##$BC_mod= 2
##$BYTORDP= 1
##$COROFFS= 0
##$CY= -3
##$DATMOD= 1
##$DC= 2
##$DFILT= <>
##$DTYPP= 0
##$F1P= 0
##$F2P= 0
##$FCOR= 0.5
##$FTSIZE= 0
##$FT_mod= 4
##$GAMMA= 1
##$GB= 0.15
##$INTBC= 1
##$INTSCL= 1
##$ISEN= 128
##$LB= 0.25
##$LEV0= 0
##$LPBIN= 0
##$MAXI= 10000
##$MC2= 0
##$MEAN= 0
##$ME_mod= 0
##$MI= 1.114404
##$NCOEF= 0
##$NC_proc= 0
##$NLEV= 6
##$NOISF1= 3.799351
##$NOISF2= 2.8
##$NSP= 1
##$NTH_PI= 0
##$NZP= 0
##$OFFSET= 14.38212
##$PC= 1
##$PHC0= -1203.923
##$PHC1= 9.192225
##$PH_mod= 1
##$PKNL= yes
##$PPARMOD= 0
##$PSCAL= 0
##$PSIGN= 0
##$REVERSE= no
##$SF= 200.129724274929
##$SI= 16384
##$SIGF1= 3
##$SIGF2= 2
##$SINO= 400
##$SIOLD= 16384
##$SREGLST= <1H.CDCl3>
##$SSB= 0
##$STSI= 0
##$STSR= 0
##$SW_p= 3205.1282051282
##$SYMM= 0
##$S_DEV= 0
##$TDeff= 0
##$TDoff= 0
##$TI= <>
##$TILT= no
##$TM1= 0
##$TM2= 0
##$TOPLEV= 0
##$USERP1= <user>
##$USERP2= <user>
##$USERP3= <user>
##$USERP4= <user>
##$USERP5= <user>
##$WDW= 1
##$XDIM= 8192
##$YMAX_p= 0
##$YMIN_p= 0
$$ End of Bruker specific parameters
$$ ---------------------------------
##NTUPLES= NMR FID
##VAR_NAME=  TIME,          FID/REAL,        FID/IMAG
##SYMBOL=    X,             R,               I
##VAR_TYPE=  INDEPENDENT,   DEPENDENT,       DEPENDENT
##VAR_FORM=  AFFN,          ASDF,            ASDF
##VAR_DIM=   8192,          8192,            8192
##UNITS=     SECONDS,       ARBITRARY UNITS, ARBITRARY UNITS
##FACTOR=    0.0002768,     1,               1
##FIRST=     0,             0,               0
##LAST=      2.2672688,     0,               0
##MIN=       0,             -292751,         0
##MAX=       2.2672688,     206191,          0
$$ Real data points
##PAGE= N=1
##DATA TABLE= (X++(R..R)), XYDATA
0@%%%%%%%%%%%qJ6j6J6j6J6k4L2l6M4n6O4p2Q8j04J20j37J57j81K09k39K71l06
34a62L44l87M34m88N45o05O75p52Q34r23J022j130J245j371J512j665J832k019
52a059K226k457K716l008L340l720M163m685N314o089P064q335J0074j2603J6629
67I570k4019M1840j64559j46906L97264N3635j48245R6754R0857j00566N9263
78A64888K3610j74428m3998Q9398j08231r8026O0952m041k5632J02805Q861o4332
90f8174Q6686Q3114o7772q249N3007k4197j9454J3293l9045l679M5301l3144n6283
103c8596K8800J6457m3609k0547R995J0605J3033j5790o374O4476L5869m3655
115A0664P964N2336j2602j6065Q616m3902k3939M6725j8480p5301J3688M9190
$$ y = [0, 0, 0, 0, 0, 0, 0, 0, 0, 0, 0, 0, -8, 8, -8, 8, -8, 8, -16, 16, -20, 24, -32, 32, -40, 48, -56, 64, -73, 84, -97, 112, -127, 144, -162, 182, -205, 229, -259, 286, -319, 356, -396, 438, -485, 537, -593, 652, -719, 793, -872, 960, -1059, 1167, -1290, 1426, -1582, 1758, -1962, 2201, -2484, 2830, -3259, 3805, -4530, 5544, -7059, 9570, -14449, 27391, -137168, -284074, 113190, 166825, 18580, 115334, 206191, 105625, 164888, 188498, 14070, -29928, 59470, -48761, -146787, -85835, -89876, -115508, -12703, -3842, -68174, 18512, 101626, 33854, 25605, 78612, 54415, 34961, 48254, 9209, 5530, 50831, 17687, -38596, -9796, 6661, -36948, -57495, -47500, -36895, -23862, -39652, -46026, 18450, 54319, 10664, 18628, 70964, 58362, 42297, 50913, 7011, -16928, 29797, 11317, -63984, -50296, -1106]
127a106k2628k5583J8366J1166R922J5206j2193K705M2016M671l2175J1304K7113
140D8784j1400j7672q117j5279l209L180k4738k8624J6895L3057j1996l1220J9279
153c1060N0632J2284j7432l382J1075J8946J2696l1943m2923K2751L8408l9360
165F92n3216J8596L1656p435j3617j0878J11L4930J6927l2073m021L6447P613
178B5732r207P834n934p832J7712m855l5397k218J2927k0246j1538J4565o124
191b4581p241K1229J1393l066J2708M547q839J3346J3082j9569j5772P844Q591
204A3672j508j5510k1304R796K8158j3939l7006O600K9483L524j1589p358O832
217a0149K9576J6413k5655j5576K6318J3770k3551k0043m8N729L173j1262j5587
$$ y = [-1106, -23734, -49317, -30951, -19785, -9863, 5343, -6850, -4145, 37871, 42542, 10367, 21671, 48784, 37384, 19712, 11595, -3684, -6893, -3713, -28451, -57075, -40180, -7123, -19119, -50339, -31060, 19572, 31856, 14424, 11042, 22117, 41063, 53759, 21816, -21107, 1644, 40052, 692, -52524, -33928, -2272, -9707, -23324, -34202, -34091, 839, 17766, -14307, -18328, 18119, 25732, 16525, 24359, 18425, 10593, 28305, 23450, -11947, -14165, -1238, -21484, -33022, -18457, -24581, -31822, -10593, 800, -2266, 10442, 14989, 6150, 19496, 32578, 13009, -2763, 5081, 13672, 12164, -3346, -24650, -14854, 13304, -635, -37641, -31041, -1558, 1966, -9623, -16981, -10149, 19427, 35840, 10185, -5391, 20927, 34697, 11146, -8897, -8945, -3216, -43, -11305, -26892]
230b6892R713J9805o315j1464R328Q763l62K520k882l761J4652R020j6895p217
244a987J7986K743j8987j0420L042L283j327r908r640J1675K0097k558j4171N882
258d290J9243N614j1712j2000M869J3842k381j7465m119J2442L561j0019n925
271h340J016P79K5j69k107P23M870M347M166L813O83k212J613L000j979r632o626
288f030K198M436k159p480l246N916R377J400j0106p033J0851J5293m725j8613
302i921J130K1573R448j5959j5554Q567J6707l460k0979r501J1565J1472o831
315a743j3537J147J4381Q524n716p783L710J0709J958p799m894K129M301P12m663
330A436m934O56M242r18o143j502M331J330l463L4N542J848k731J156N635J754
$$ y = [-26892, -17179, 2626, -3689, -15153, -5825, 2938, 2576, 5096, 2214, -1547, 13105, 22125, 5230, -1987, 15999, 18742, -245, -10665, -7623, -4340, -5667, -15575, -25215, -13540, 6557, 3999, -10172, -4290, 14953, 20567, 8855, -3145, 1724, 15566, 13185, -4280, -8399, 4043, 7604, -2415, -8340, -7324, -6545, -6520, -6689, -8796, -8073, -3203, 1144, 5310, 9123, 9806, 7594, 9207, 12207, 10228, 596, -6030, -3832, 604, -1555, -9035, -12281, -6365, 3012, 4412, -5694, -12727, -1876, 13417, 8692, -9921, -8791, 12782, 22230, 6271, -9283, -716, 15991, 12531, -8448, -17949, -6384, 5088, -1743, -15280, -14133, 248, 8772, 3056, -4727, -1017, 9692, 11650, 3851, -1043, 1086, 5387, 6099, 1436, -3498, -2842, 1400, 482, -5661, -7163, -2832, -1502, -4965, -4931, 611, 2459, -272, 884, 6519, 8273]
346H273m250k804K209K563k021o570l507L141L269m049o105J608P156K367m751
361c471j131N986N066k481l567J771K930j216k958o09J733j069k909j282K424
376g83J073m124l527K219M331M93k703j367O122O562r49n294r55N293L376m638
392E129r901l620P525O110q172j0963N517J3724J034j1186m141Q839Q691l808
406D778q737r88Q137O379m084p214O06O316J374o036n480j850K272L041j689m285
422g460J170P120M211j186j882l8K747L541l464o309L90L393j265j162k55k806
438c255RN023o69o625l11M092K064K33j652k046M275P845j802p020L22M945K57
455E685n382o123K15N481K0o395l05N534K340j384l67K52K716J478k335n88K751
$$ y = [8273, 4023, 1219, 3428, 5991, 3970, -2600, -6107, -2966, 303, -3746, -9851, -8243, -1087, 1280, -3471, -4602, 1384, 6450, 3969, 402, 2173, 5103, 3887, 929, 320, 2053, 984, -1925, -3207, -783, 290, -3834, -7361, -5142, -811, -318, -3021, -4388, 1734, 8296, 7347, 2053, 1098, 6391, 9767, 5129, -4772, -8392, -867, 5243, -2929, -13892, -8375, 5349, 6383, -4803, -8944, -105, 8586, 4778, -3959, -4947, 3190, 9569, 5485, -1729, -1123, 5193, 6567, 531, -4949, -6799, -4527, -1486, -3175, -7460, -6290, 830, 5041, 3855, 1973, 1935, 4682, 8223, 4759, -1550, -1160, 2233, 968, -194, -449, -3255, -3246, 1777, 1108, -5517, -5828, -1736, 328, 561, -1091, -3137, 1138, 8983, 7181, 161, 483, 5428, 5685, 303, -5820, -5605, -124, -104, -6499, -6804, -1270, 1070, -314, -681, -429, 2287, 3765, 1430, 842, 3593]
472C593j60k171O20J41j268j08j642k874J289K183k667j962K271Q86K758K222
488C111m312r59Q451K367p882k773N386K062l367m113k448K365L642l385n066
503f921K430L719L44L29q57j363L985L797k014k704K28O97K059N84o105k886N007
520C29K901m393l592j55K660L252j497m188J487N414J628l97j377j633K280M514
536G233k886p418n5L761L40k377l858j141N442M706n156m235M449N525n35l989
552a94j777K763M201j194m233j41K797m90q18j735l082L79K445n13k504P9K512
569a505K082J309n43l29J973J469j904j690L54q78n29j087o32N6M99p85o68K144
587f64M75k421Q90K341J88r80P65J393O4L73J33j219o13K3l33j506j624p80L39
$$ y = [3593, 3433, 1262, 1882, 2023, 755, 647, -995, -3869, -2580, -397, -3064, -5026, -2755, -1869, 889, 3111, -1201, -2160, 6291, 8658, 776, -1997, 3389, 5451, 2084, -2029, -4477, -2112, 1530, -1855, -6921, -4491, -772, -428, -99, -956, -2319, 1666, 5463, 3449, 745, 973, 1670, 3729, 4313, -1792, -4678, 329, 3230, -1163, -4755, -4910, -2250, 1002, -495, -4683, -3196, 2218, 3846, 3449, 2072, 439, 2719, 7233, 4347, -3071, -3126, 635, 975, -1402, -5260, -6401, -959, 3747, -1409, -5644, -1195, 4330, 3795, -194, -1971, 792, 4993, 3799, -434, -575, 2222, 1732, 914, -821, -3903, -3524, -1079, -1592, -4096, -4017, -1505, 577, 1886, 1343, 1014, 2987, 4456, 2552, 862, 1216, 338, -191, -1278, -1910, -1854, -1355, -2140, -2808, -664, -189, -2610, -1720, 621, 809, -171, 594, 1987, 2051, 2424, 2557, 1338, 725, 748, 415, -1091, -2715, -3495, -3156]
606c156J275N00j010k34K825K783m46k241k72K357K387k442m342L69L421R0k676
623h12j939O57J291J206p10l221n29L715K804k074k302J410L812J937k122l965
639h42L50M092N9n352k820K374K834j161k518j029L018L072r27j722m29J906J497
656B402R45j943k820J264M024p72m180j329K573J201j671k435r23J719K606o53
672Hk069J108K562J169j027q96k05Q79P01j107j719k04L81L49k09j617m97J149
690a244J540j402o80J280J237K76k20K80N46N17m61r57J55m82r00l52J88k43k37
709a159n93o2J447P00j413m51J786Q45m60N90J61p25O59J268r59k314k89R52K7
728A0j010k399K03K951J009j972q20J946J853N67k136j282J418K275p51k478j56
$$ y = [-3156, -1881, -1381, -2391, -2625, 200, 2983, 2537, 296, 24, 2381, 4768, 2326, -2016, -1647, 1774, 1864, -812, -2751, -2094, -803, 403, -307, -3528, -4057, -342, 2462, 388, -1914, -504, 3308, 5245, 3123, -842, -492, 3600, 3659, -1693, -4513, -2139, 695, -466, -2984, -4013, -995, 2077, 1150, -572, -1001, 905, 2402, 3347, 1404, -1416, -152, 3872, 3100, -1080, -2409, 164, 1365, -306, -2741, -3664, -1945, 661, 8, -2061, -953, 1609, 2778, 1751, 855, 650, 1529, 2230, 1123, -596, -800, -419, -70, -279, -1896, -2393, -1244, 296, -1106, -1786, -506, 731, 1007, 787, 1067, 1613, 2130, 1669, 712, 867, 385, -515, -867, -679, -922, -1159, -1752, -1814, -367, 333, -1080, -1531, 255, 1100, 640, 1230, 1391, 666, 1325, 2593, 1634, -680, -969, -17, 10, -1000, -3399, -3196, -245, 764, -1208, -2028, -82, 1771, 2338, 202, -1080, 338, 2613, 1862, -616, -772]
745g72J062O78J59j423k585O41K479l2k844r56K670L161j83k644k43K939J621
762C728j572k785j53J093Q53j021k090p38K286J231j143j467J61J687J191o61
778F00j524m3J946J591q01k320M75J755O99k454j834L30J287l73j038m85Q74J332
796A7O93q52j42O18J130r4n05k23k26J56K47k05j098m67Q20J73j020m28K30P42
816d34p25L64R02N45l07J96N24M97p28p54K84P45l68j053m23J87L80l97o04o67
836a836J086Q00k02k42J80P60Q85Q21j456r77P63J016n28j813j354J275J797j169
854a94j792K11J919Q36j020j171l1J493J233m34j338nJ812R22r00j688p67J065
872A51O71j124k229k70K320J458j078j653R49K682K57j875r07J141R22j64j092
$$ y = [-772, 290, 968, 1127, -296, -2881, -2240, 239, 207, -2637, -3593, -923, 2238, 2055, -589, -832, 2107, 3728, 2156, -629, -782, 311, 1164, 143, -1947, -2685, -399, 832, -311, -1778, -1617, 70, 1261, 600, -924, -967, 979, 2570, 1769, -551, -76, 1679, 2378, -76, -1910, -1580, -293, -666, -1704, -2189, -1315, 17, 710, -142, -284, 334, 1464, 1370, 865, 642, 416, 572, 819, 614, -484, -951, -131, 42, -978, -1406, -1176, -434, -1159, -795, 107, 652, 345, 541, 1065, 1562, 834, 80, 364, 1109, 741, -312, -735, -548, -168, -565, -1169, -1836, -750, 50, -152, -394, -214, 546, 1431, 2252, 796, -181, 582, 1598, 1070, -743, -2097, -822, 975, -194, -1986, -1775, 144, 980, -40, -1211, -1242, 251, 1484, 1050, -288, -293, 1519, 2441, 1541, -147, -914, 151, 822, -302, -2531, -2801, -481, 977, -101, -1754, -805, 1877, 2134, 259, -648, 493, 1415, 1251, 159]
889A59j017L84J347r8j295p47q3J507k26j460n40R56J983J74r81j77J004J178
907B068j53j815l20O07j1r94q30K29M70L18J09l23O1J81M98L93l90l68N61P03
927I94j67j76J87k63N0j46j036m04O36m68j024R45O57m56K70N01N01J78l34n65
947a20R76O03p96j279P66M43n41l37m78m76N97O07m60p24L48N78J061R0j174J2
967c04J530R62r36j844L13J143K73j586j689J204J410o90p48j43L22Q02J107j452
985c26p44J169J388k41o78q56J46J481L1k280j003J625N55n09q56j65M09J670
1003H16j88j389j68J732K92l67o09r7J76J149k10j627l06P94L53n21j233O4O92
1022f47R81n70n97N19P81N71j49p63J13N86J15q34n55J65J06j18j20J46k06j22
$$ y = [159, -858, -474, 873, 775, -520, -1267, -1350, 157, -69, -1529, -2069, -1113, 870, 1044, 63, -114, 890, 2068, 1915, 100, -220, 387, 376, -618, -1448, -1219, -749, -431, -322, -645, -584, -403, 95, 488, 98, -270, 291, 994, 827, 651, 838, 575, 625, 479, -557, -961, -325, -793, -1817, -872, -215, -671, -401, 100, 601, 779, 445, -120, 856, 1459, 663, -616, 150, 593, 52, -285, -763, -1239, -642, -35, -495, -1219, -871, -293, 768, 858, -316, -304, 1226, 2188, 1252, -592, -279, 864, 1137, -449, -2138, -934, 476, -214, -962, -1105, -783, 19, 1126, -326, -1070, 99, 1487, 1246, 568, -288, -142, 1339, 1370, -910, -1913, -288, 267, -242, -1098, -1263, -854, 816, 628, -761, -929, 803, 1095, 728, 119, 22, 198, 1347, 1137, -490, -796, -2, 351, -170, -1403, -1339, -647, 334, -236, -833, -314, 467, 1038, 889, 126, 239, 825, 940, 106, -449, -284, -178, -296, -416, -270, -476, -598]
1042e98L49J15k24J4L59L48L5j31N5L06j8l91K31l4n11l97L08j4j24o03M4J015
1064A34N76q14o25O18J040J29j353M57M74j0k02j96n88j34O70P0n68l48J19N15
1084c6O68j098r23J303R17J30j342K30N67N55k32p75o80Q51M93o68q76L7M67M61
1104D9L60r50m24J035R20n83r77P0Q83M71m44r59m75J353N97q81r88M46P60J14
1124C77o56p89N69N47K35l86PJ10L08M44p02l25J43Q16n17k44l42k90Q20Kl77
1145b50n19P17K21O5m05L46j40K35Jl44k01N08k1k06Q0J3o10J01L80l12l64O25
1167h0k80M66j47j9L06m75M15j20K31k91j18j71O13o9p54l17O54J51k13Q1l47
1188d84Q41Q9n8q06J13N28L43k51m10m58K48J009k96o26l76R61K30o33m98n6L54
$$ y = [-598, -249, -134, -358, -344, 15, 363, 398, 267, 322, 628, 610, 219, 450, 416, -95, -492, -184, -198, -322, -925, -881, 134, 710, -104, -729, -111, 929, 1058, -295, 162, 636, 626, 424, 228, -360, -494, 176, 246, -322, -670, -551, -36, 632, -466, -1389, -86, 831, 961, -381, -151, 416, 971, 739, -36, -716, 135, 628, -40, -916, -879, -412, 49, 409, -541, -965, 70, 990, 407, -570, -500, 383, 854, 410, -549, -1024, 329, 926, 45, -943, -497, 263, 377, -279, -1068, -499, 48, 283, -103, -96, 14, 322, 766, 64, -261, -118, 698, 181, -63, -405, -695, 125, 127, -250, -769, -52, 169, 234, -171, 175, 35, 270, 271, -73, -274, 234, 213, 7, 87, 100, -510, -409, -29, -341, -705, -80, -360, 106, -41, -60, 246, -229, 186, 66, 297, 6, -112, -283, 330, 261, -493, -810, -156, -5, -218, -137, -484, 357, 446, 388, -418, -305, 223, 566, 315, -95, -553, -305, 704, 408, -218, -594, 367, 597, -36, -534, -590, -236]
1209b36P93m80p85K57R73L38n21o99J25O04M38q77j98j53P12l3m23l96K24M54
1229A17M61p25o25L69Q97j9p59k44O84M30j37n54J8K88L0j45k18k23J0N83k03
1250C5m07J8J49M01J6n26J31K17J90nl64l14P62M2N3o36K20J15P0p7l93J0R5o1
1274b59J13J18j92R0K27J5J38J0j78l39N64j05l86J43l14M94o7j34j17q0k1M86
1296B06%k94K31l7pJm07K5O97k9m85j99J07M34j04n99jM67K48r6k75j29r4P92
1320D52J95o91l85L21N50q6k95l79K00M88m77n51N5M11M71m94K6m4K51K15j94
1341C9l42j29K48O13k53k88j05L79L65m16m67m02P69K68l33n79L71K75K31j59
1361H5j61J46N04k00k95j54j1K50l72R9ql55M05RJ62k91J72j40K7L10m73K24J82
$$ y = [-236, 557, 77, -708, -451, 522, 860, 339, -360, -235, 369, 807, -70, -268, -421, 291, 258, -165, -561, -337, 117, 578, -147, -772, -403, 494, 475, -284, -528, 156, 586, 449, -105, -87, 201, 231, 86, -132, -355, -345, 238, 35, -372, -354, -205, 196, 212, -314, -183, 34, 224, 219, -145, -459, 303, 345, 398, -238, -18, 97, 167, 90, -303, -293, -198, -259, -146, -28, -220, -130, 97, 112, 250, 260, 82, -257, 307, 202, -184, -41, -355, 139, 72, -62, -179, -259, -280, 206, 206, -88, 143, 106, 99, 100, -307, -282, 415, 386, -99, -298, -191, 243, 139, -460, -461, 6, 254, 158, -117, -246, -340, 452, 647, -44, -429, -108, 442, 356, 61, -318, -118, 370, -107, -658, -603, -192, 279, -215, -189, -233, 18, 233, 39, -303, -432, -184, 429, 176, -112, -217, 162, 527, 111, -356, -758, 11, 279, -54, -633, -262, 13, 244, 85, -76, 70, 574, 374, 79, -75, -86, 164, -208, -109, -117, -472, -67, -58, 104, -187, -15, -155, -128, 182, -291, -67, 115]
1384A15J39J19k00j05r5K70l14l7j09j01J47K89l66J03j80M40K93n49m6L56J22
1405B91K33o65M19k1j64P4k12j07l1m9K17p8j23j63K69J54O8k34L9K43M4o2k20
1428g8l0K12K39k50l65K0K24po0k24j68M82N87m70m45K51M68r7q8k06k88M83J51
1451C41m97m23Q5N20P6j08k70o2M59j02k19J43j88N03p8j28K5r4L29J41n01k35
1473b83L8O47k13m03k99M35K11J00k42n1N6jJ29k01M1j09J83M04m83l0K9J03J41
1496B02l03j51J67nk9q6J25P2Jok8K19K17m49K09j2o1n3m0j69J96j68L46k25j3
1521d4L9J20m8j93k8J21L94j71m17L84J15j86k03l42L49J84p6k84o1O43j05k36
1543d5j47k7M70l20j28K76j97J08Q2p8Km00O62k53p4J25j08K44j16O6n43O17n0
$$ y = [115, 254, 373, 173, 68, -27, 243, -71, -108, -217, -318, -171, 118, -248, -145, -325, 115, 408, -141, -187, 169, 291, 524, -141, 278, 257, 93, 167, -45, -152, -183, -232, -15, -93, -216, -379, -110, 44, 112, -122, -83, 160, 204, 142, -78, -108, 104, 343, 93, -272, -252, -28, -35, -95, -319, -487, -5, 582, 112, -333, -82, 386, 289, 201, -5, -293, 190, 341, -156, -579, -494, 26, 102, -6, -276, -338, 121, 19, -200, -57, -245, 258, 180, 52, 77, -17, 312, 453, -48, -283, -245, 402, 189, -214, -513, -78, 133, 233, -9, -60, -4, -5, 124, -77, -36, -145, 38, 442, -41, -71, -42, 61, 202, -101, -252, -85, -90, -119, -205, -80, -8, -7, -13, -41, 178, 395, -54, 155, 143, 82, 29, -11, -180, 16, -152, 194, -31, -44, -5, 115, 67, -126, -154, -33, 361, 190, -227, 157, 272, 86, -117, -459, -110, 74, -2, -286, -347, 296, 191, -45, -192, -219, 251, -69, -197, 79, -118, -10, 72, -6, -4, -404, 258, 5, -69, 56, -52, 192, 76, 142, -401, 216, 166]
1566A66J88l69k61Q7K21K76m19J01p1O0K3K35m67o1J16J95k15j64K18K88J43l76
1588h6p9N18n1l8j67k25J06K28k50l07J69K20k1q6j1O8j23M14k06k76J81M8K5
1611E1k63K96j19j5n2NJ12j48M34k35Mj89K63k33j23J94K07l78J77O9J14k56m2
1634a27j73J50L0Ql2j41L68p9K58l15K2M5p5J01l8j25J65J50k74J30L9J8J8k8
1658I5j74J04J38m3o2r3k34K26K8o5L9L69l36j47K87j02k55M51n9k1l22k10N51
1681A65J95l76j25PM7N09m79n5K60Qj18j96JK18R5K20n11j13R6K85o7K2l94M21
1705A15J26k81m8M1M0R2j41J16k35L89j24K5Lj61O9k60N82l47K39m10j4J14K45
1728A75k95J06j03J90l16J21J48K4j39m2J4J68K43k09M0k49J81k10K15j41m7Q2
$$ y = [166, 354, -15, -276, -189, 32, 308, -111, -10, -81, -21, 2, 237, -230, -291, -175, 20, -195, -359, -141, 147, 290, -86, -165, 353, 302, 264, 97, -128, -22, 206, -44, -351, -182, 38, 17, -69, -80, -12, -135, 279, 73, -203, -22, 26, 51, -212, 84, -35, -50, -102, -97, 15, -133, 301, 66, 70, -119, 144, -89, -212, -18, 189, -189, -12, 57, 171, -85, -127, -300, -150, -120, -112, -144, -285, 83, 4, 262, -53, -31, 14, -61, 40, 2, -123, 42, 192, -82, 48, 87, 105, 123, 95, -79, 25, 163, 120, 58, -35, -269, -43, -15, -80, -41, 328, -8, -155, 132, 30, -225, 226, 167, 146, -176, -386, 165, 360, -16, -141, -134, -87, 422, -57, -112, 148, 156, 38, -158, -157, 61, 156, 376, -135, -248, -152, 133, 66, 88, -306, 115, 241, -40, -88, -47, -7, 85, -56, 60, -175, 214, 90, 115, 118, -43, 26, -234, 348, 1, 240, -170, -184, -70, 175, -120, -14, -117, 73, -243, -122, 26, 50, -89, -131, -117, 51, 294, 85, 125, -124, 57, -153, 62, -79, -126, -44]
1750d4p1Pj00J85N9p0j51R7J61J76n87K79K73m33O4mO9K21k42J57k15m9N85j88
1774A79m5m27J36K27q5k29J26L01r0k29L6q0J02J18m1j92L69k72K09l40J28K74
1796A75l69K38j98P0k6N2Q9J35m22M63k04K28j61m09P85k38M9j04j86J80mK8k44
1819g3J84m56K98J9K16lr3O4n0J38j78R2j66K6j30n8K06J45k86m4K53j96R0mK25
1844B19q0l1k1j62p7J94r4M8q1l6K1J13o3j26K31j44L4K72j44p1k28J22J49J88
1868B33k12Q4j26J28k01%K80n20K07L24j58%j04L07j77j11J30j28L5r7J47qp9
1891d6K7P2j46j66K52J43l6l35q4K73J93J09j10k90K57k13K9K22j31k35J16M43
1913C44j93j29j75J5J59l5k25J29N8K45k06n4k50J16M47m42M9j58N52Q1k16j59
$$ y = [-44, -115, -108, -208, -23, 36, -34, -185, -88, 73, 249, -338, -59, 214, -219, -155, -159, -90, 131, -111, 46, -169, -218, 367, 179, 134, -293, -157, 70, -15, -244, -118, 183, 93, -136, -100, -180, -78, 40, -1, -193, 176, -96, 113, -227, -99, 175, -194, 44, -154, -84, -110, -58, 31, 166, -256, 207, 3, 231, 70, -339, 446, 208, 257, 153, -33, 147, 143, 171, -73, 111, -345, -47, -28, 188, 185, 92, 156, 106, 244, 66, 158, -8, 18, -112, -170, 36, 181, -105, -149, 104, -92, -2, -6, 219, 139, 108, 87, -75, -152, 42, -52, -4, -85, -121, -100, 13, -50, -176, 55, -89, -55, 217, 73, 2, -226, -104, 45, 233, 21, 105, -21, 107, -94, -94, 186, -334, -127, 197, 39, 39, -65, 242, 65, -46, 84, -44, -9, -106, 41, 33, -46, -19, 53, -93, -259, -7, 136, 100, -235, -319, -46, 147, 256, 146, -144, 113, -100, -71, 151, 20, -215, -99, 344, 151, 22, -153, -138, 21, -14, -239, -110, -52, 193, -13, -67, -317, -201, 246, -196, -147, -305, 247, 328, 112, -47]
1935d7L5j05K97k31jN4J89j35P3p3L4k08R4K78k01Q8r1J67m0l13J38qj7l5J30
1960G2q7l3K5P4n2m6r1j64L26L0k38J29J65j40p4q5J38P7l4m72L22K33k70J18
1984g7J73J16l22J60L6j81n4j6j04J67O7K95k47K18l48K29l82N09k56J72j8j2
2006A25p5QK1jo8l2m9o9K66k87J05J96j50q8n1M0Q3k36K25l4J07l57K30mR9j62
2032a58M39k43l26J29L79k61q5J30L2J17Jp3O4j06k56K03O1m3j06q8K00j67K41
2055H4o1j86L95n4l39J12K9J33j26P8l02L06j13J90j0k91K42Q1o1j61J4j33K37
2078F4k3J15R2k14Q2p5J3j46J42P6l11K63k4r5o1j8Q6J61k38m7N24k41n7p0j34
2103a36K0n4J07o6k6KK45J46j38j65r3J10K1J8j90K34L4K5j10k17L02k58M1M3
$$ y = [-47, -12, -117, 180, -51, -52, 2, 191, 56, 129, 56, 90, -118, -24, 254, 53, 141, 50, 217, 177, -136, 2, -6, -23, -58, 72, -15, -48, -23, 51, -1, -47, -138, -302, 24, 54, -184, -55, 110, -30, -104, -189, -51, 26, -8, -480, -158, 75, -195, -77, 96, 212, -110, 50, 86, -95, -149, -165, -269, -102, -35, 260, 13, 231, -117, 112, -270, 239, -17, 155, 137, 125, 50, 58, 79, 78, 10, -22, -71, -140, 126, -161, -56, 140, -10, -98, -149, -109, -26, -262, -37, -71, 36, -321, -91, -95, 4, -158, 281, 38, -288, -159, 220, -41, -126, 4, 36, 153, 154, 81, 145, 39, -217, -14, 47, 4, -102, -190, 10, -157, 84, 23, -163, 232, 178, -161, -49, -20, 113, -13, 65, -237, 69, -44, 146, 136, -155, 87, 168, 107, -54, -40, -173, 64, 41, 156, 248, 34, 116, 41, 54, -92, 50, 126, -185, 78, 54, -41, -102, -120, -34, 127, -111, -158, 366, 125, 68, -2, -136, -116, -170, -63, -129, -155, -153, 92, 238, 100, -65, -158, -48, -27, -9, -199, 35, 69, 94, -16, -233, 69, -189, -148, -105]
2127a05J03MP0K1m78J59M32k47O1n1R9J9o2K8J39N7m5l06j26K06J40k34J04M6
2151C4j53P9N4M3p4R0r5M00k83r7j67J19J63j28J84l58O0L0J63j47j16M09l86
2174a76K26n9j9MK86k87J41P9k56P4Nr9L04l52l1K8K71j47N6j01J62p3Q4k72J08
2199d4J06J55j20n5J49l17R3l15J70J4P7k1k2O3J40k20L1p5K75J75k84J29k44
2222a40n7o3J59J99k37J80M4k35P6J20O8j84k4J13M1j10J81o2k63K09J44j69J12
2245A02r7K25m29R1L13k56M0P0j61J74p0K74m61J75j3jj64lN70j78n26J47L16
2268A38j55R0J18m05K54L65m88J92p3p6K35l82K98j8l18L97k01J70J10k09j45
2289a03K95k48L5j41K11Ro0k90k3K32J28m7j57N8J80R8k76K13J01o3j03k60RM53
$$ y = [-105, -2, 2, 72, 93, -385, -226, 206, -41, 20, -31, 68, 87, 25, 53, 192, 249, 204, -102, -228, -22, 118, -116, -12, 34, -119, -40, 14, 57, -17, 73, -22, 378, 95, -2, -169, -50, 113, -15, 169, -189, -129, -99, 64, -83, -199, 210, -176, 50, -9, -28, -24, 262, -25, 116, 195, -61, 13, 18, -81, 223, -129, -160, -132, 139, -8, 48, -53, 109, 36, 120, -152, -44, 62, 217, 97, 42, 191, -126, -33, -348, -178, -164, -87, -108, -130, -67, 73, -147, -116, -191, 84, 259, -25, 104, -140, -197, -260, -101, 98, -139, 41, 85, -150, -74, 46, 114, -70, -94, 19, 60, -50, 131, 69, -194, 15, 159, -10, 102, 5, 230, -199, -108, 205, -51, -11, 59, -102, 72, 2, 276, -185, -10, -23, -24, -188, -191, 379, 201, -325, -178, 138, -17, 73, 191, -214, 40, 405, -83, 109, 36, -40, 195, -187, 111, 93, -225, 172, -29, 141, 251, 42, -103, 192, -56, -21, -162, 49, 58, -2, -292, -315, -83, 45, -2, -159, -101, 79, 177, -99, 114, 215, 152, 49, -211, -202, 251]
2313B51j02j27J67k3p7qK8l14K52J9m27P7M08j85J28m2k6K08l38L33k86M18l66
2336c2J61k00P1L3p4J64o2k5k14L38K35o54J20R2l3J63k56K32M6OR0m66K95P4
2360A04j58N5K33j51j66J17J2K70k29K7j54j75o6L13J09O6k69l7J19k1j66J90
2382B3R9O8j58J61j53k88L55k4J64j86Mm8l08L41j76l8N6K57n4j43j23K96j6j86
2406g7oP0pK47q2j83J63j48m9j21J79Q1R7Pp1j40L5m2J93k43J62j69J06J7k3K80
2432B76l43L7J14J28r0k32L68j02q0j53JK69j34l4n2r7J65m6K74k38J4j25J74
2455I4L1j72L22k48o4N8k04K96k01k14L11K73j87J12j22lJ3k51O3K6P7J57n6n6
2479E5J08j49m7K00k26J57J47j78j53J50l6O4j3j13K70l61Q9J32j89J15l12M39
$$ y = [251, 149, 22, 189, 166, 89, 81, 109, -205, 47, 66, -361, -284, 124, -61, 67, 25, -1, 207, -131, 202, -84, 334, -32, 129, -71, 0, 33, -41, 123, 61, 36, -178, 160, 395, -259, -139, -47, -80, 83, -173, 59, 105, 111, 201, -265, 30, 104, -54, 1, 234, 83, -83, 34, 46, 316, 87, 114, -40, -215, -281, 32, 141, 207, -62, -99, 20, -1, -167, 23, 122, 190, 32, 193, 40, -248, 107, 83, 247, 61, 65, 17, -291, 50, -126, -164, -108, 149, 95, -48, -171, 125, 109, -77, -83, -13, -20, 227, 145, -38, 125, -23, -72, -193, -14, 67, 164, 171, 100, -40, -5, -47, 146, -97, 65, -104, 2, 19, -4, 276, -67, -30, 84, 212, 122, -110, 258, 156, 76, -77, -76, 193, 59, 25, -27, -124, 41, -5, 269, 31, 45, -80, 94, 125, -47, 275, 27, -37, 21, -183, 113, -88, -302, 9, 282, 95, 207, 85, 82, 95, -156, -93, -67, 10, 167, 111, 55, 163, 14, -33, 167, -59, 98, 245, 67, -86, 64, 28, 92, 79, -34, 236, -125, -36, 96, -93, 22, -290, 149]
2501A49l7j30j22p2K11K5J08PK8l00L08k14J17R1k01N1k74L17j13J4J61k48K75
2524A51j52j05j29J92j20L38m9o6K9j15Q2l8r0LP0n6K21j11q7J03r1j21M6R1L4
2549C0o3Q0r8j93K65j63J06l13J51K35K0j29N8L68l41J13k27j43M40j60J23k76
2571a17K32k10K55j77K49k16k3J37l29L05O8k66n2O3K15n2k49K31j4j56K94j66
2593B2J28j45j08L6M3j55J18J0J25j87J25q7L7J98k95K38k03j9N9K42l54r3j3
2616b78R4K18m00N29k58J03r3k03L00r3O2K14J4k59r6j24K94k49L44j84K97k70
2638c8J61k79K4K07l20O8J20j54oJ60m1j73L3J57K94j20j74P6J92k37j5K18k92
2661a39Q1P5M7k54J73q6J63j55O9l17J52L1K12Q5l22k8L16n0J83n73M44k4n11
$$ y = [149, 112, -18, -140, -212, -1, 24, 132, 139, 167, -133, 175, -39, 78, 169, -32, 19, -255, 62, -51, -37, 124, -124, 151, -1, -106, -235, -43, -163, 175, 126, 60, 89, -26, 56, 18, -72, -69, 1, -55, 166, 55, -32, 71, -20, -141, -95, -4, 30, -33, 47, -51, -244, 21, -142, -36, -349, -198, 37, 57, -72, -14, 354, 13, 126, -101, -244, 196, 36, 159, -117, 115, -95, 160, -17, 232, 16, -7, 130, -199, 106, 174, -92, -144, -81, 134, 82, -167, 64, 50, -106, 188, 22, 150, 5, -103, -67, -24, -179, -61, -51, 74, -113, 12, -75, -38, 160, -135, 103, -100, -119, -60, 182, -172, -265, -278, -184, 34, -366, 163, -95, 8, -85, -288, 12, -81, -19, 195, 209, -50, -146, -270, 24, -225, 119, -65, 232, -38, 123, -156, -132, 75, -245, -177, -57, -211, -217, -57, -98, -271, -238, -81, 213, 93, -81, -5, 187, -50, -65, 153, -139, -58, 17, 64, -190, -17, -103, 60, -95, -26, -343, -191, -160, 52, 137, -185, -213, 103, 53, 236, -337, 107, 83, -428]
2684d28M88Jp5j97L67O3k05K0p7r3R8m4K31j99l0J06k42L39l7j13j77K59Oo5J0
2709Fo3K98r8k54j43J77kn5q0K42J57k91K39j21j36m3K25J21l93J77j38J86k0
2732iL3j89K9L22j82o6j19L45l60L79j70j73K47N5k44l2J54P4J75k50R1j82k8
2755a00K94l64R6K98j20p5j68pK32J46m99M70k05J97k5K33k19k40K51j24j09l71
2777d09K57J53l07L02J05k25J76O3o6Qk02K27p0J91m24J99M4k8j95J52m3Qp0r4
2801b48M03k10o0K8J30j26K48m32J03M4L15j62J32j19j96J86K04j75k9J15j97
2822d6J04L1L6j22M9j66n8J31j41J27k22K00K07l14K20K86l51N8j99N3J52j65
2844a30j10K42Q0L3n1k5n1J45l89P3J43r0J41J59l68J44j09J88q1QJ51l30QL21
$$ y = [-428, 60, 61, -14, -211, 156, 219, 14, 34, -43, -136, -38, -82, 149, -50, -80, 26, -216, 123, 86, -27, -204, 55, 61, -4, 6, -57, 241, 143, -111, -254, -77, -79, -134, -214, 28, 185, -106, 133, 12, -124, -167, 58, 179, -214, -37, -175, 11, -9, 24, -165, -136, 186, 4, -62, -181, 164, -196, 183, 13, -160, 87, 142, -102, -134, 20, 94, 269, 19, 110, -72, -100, 194, -170, -74, 224, 104, 29, -139, -146, 86, 232, -267, 203, -2, 195, 170, 403, 184, -56, 195, 71, -38, -409, -152, 1, -306, -4, 101, -124, 52, 115, 49, 57, -145, 82, 12, 203, -221, -22, 22, -6, -201, -49, -92, -84, -154, -248, 155, -55, -115, -87, 43, -83, 165, -267, -164, -120, 195, 33, 165, 46, -150, 36, 240, 65, 36, 151, -46, 58, 89, 125, 3, 52, -114, -172, -41, -182, -55, -277, -77, 130, -184, 36, 322, -29, 29, -170, -117, 35, -130, -240, 2, 82, 115, 64, 39, -12, 133, -256, -183, -40, -130, 11, 170, -198, -54, -163, 25, -56, -48, 103, -227, -219, 102]
2868A02j57j20K46j34J89j76J15M0o0m7J04j19k8J10j01L4r6K3K31k11J0L5K15
2891B05k97j32J03L4L5j00K86K9l01J81j41L30k33l2JN6Kj8m7j08L9L7J63j93
2915a01K36N9l1J70n90J04K24j14J01j92o9K82k2qj28j06J54L40m84J50j86k5
2937b36K33L5j97J36k38P5J15K04k5M7J7j09j61J11j44N5l0P4p6J3J24O0n5j05
2961g7p9J93j1Ol5l55L89j07j00L87k85m7K79m65J26j8K12j49J71k39J71oJ05
2984F6j25J95o3n7OQ3k33K45j26o3K24k76R6J73k34J84j80J3n2q5K34p0NK4p1
3009h7J5J67k40o0L36ok81R8k22L36J28k64J8j35K71j25K20l08n8K50J80j91l4
3032Hj16R3K58k49r7R3q8K05R0k51m7L6r6K96%o2Q3l2l10L58N0j77k5J56j47j10
$$ y = [102, -55, -175, 71, -63, 126, -50, 65, 105, 45, -2, 102, -17, -45, 65, -36, -2, -98, -75, 156, -55, -45, -10, 205, -92, -224, -121, -87, -52, -152, 134, 163, -138, 43, -98, 232, -1, -33, -32, 24, 26, 8, -39, -147, -108, -71, 92, -101, 135, 194, 163, 333, -257, -153, 71, -43, 58, -134, -203, 79, 57, 49, -79, -185, -31, 309, -175, -25, -211, -236, -3, 32, -165, -29, -267, -192, -77, 127, 102, 149, 166, 57, -104, 7, -137, -82, -112, -38, -114, -101, 23, 83, 28, -77, -156, 37, 26, 32, -3, -358, 31, -76, -176, 211, -74, -121, 158, -307, -181, -199, 13, -136, 35, -204, -33, -39, 66, -59, 136, 73, 16, 22, 105, -128, 117, -9, -72, 152, -124, -28, 145, -89, 95, -85, -72, -124, -209, 25, -45, -40, -16, -87, -72, 95, -145, -205, 131, 125, -156, -58, -280, 56, 184, -80, -62, -197, 74, -51, 169, -139, -197, 53, 233, 42, 8, -108, -15, 243, -6, -103, -10, -98, 107, 197, -54, -101, -65, -161, 135, 135, 73, 156, 124, -186, 172, 222, 45, 20, 176, 29, -81]
3058h1k6J65o0q0M6J09kj51J03k41j88L91j04J05r9J81k29J16N0K71j35J60j73
3081A28j29M4j75J79j04l8p1J85J7K31l15%J51j64J1J8O3j57J45j83K50k32J88
3104D2Rj16J77k34j5R8k4N4j86K58j08L48q8j64Kj79L83k19R2l69L55k75k1P4
3128a06K92p7O2k54J28j04j24K81o5k5J35k70J67K1j65K26j65J8J79k44q6J79
3150Cm4J38n2k97R1L59m89L41J40l37J11k8m54N72R2J07k79L01l22J3J16o3l9
3173b0l1J4K23k73j21P3J36j14O1K6K94k84K0J9r8LK23j77O0j02m36M44J9J04
3197F3J4m4l9m1j42K89p5J55j34k7K6j33j1K70p1j96J47m3j62J43N4j86P7J34
3221F8k76J45J94J37l46J0q1L03k20O9j9Q4J7N9o8J9l6k80L84j05J24l24M3J52
$$ y = [-81, -107, 58, -2, -82, -36, 73, 71, -80, 23, -218, -406, -15, -119, -14, -113, 68, -161, -45, 5, 276, 141, 301, 128, -1, 43, -132, 47, -57, -95, -166, 19, 36, 267, -48, -48, 103, -61, -50, -32, 31, -126, 19, -164, 86, -146, 42, 51, -65, 112, -122, -137, -39, -63, -9, -195, 63, -45, 303, 215, 51, 53, -126, 257, 38, 130, -239, 116, -159, -180, -106, 186, 109, 171, -83, 45, -59, -183, 98, 33, 8, 143, -127, 40, 61, -104, 122, -43, -25, 154, -90, -176, 3, -41, 97, 45, -252, -161, 198, -291, 50, 190, -147, -36, -64, -518, 54, 146, 253, -26, 275, -47, -34, 82, 19, -20, -51, -37, 186, -87, -208, -135, 1, -113, -52, -26, 268, -16, 4, 23, -75, -72, 151, -26, 34, -68, -504, -60, -41, 63, 77, 33, -6, -47, -189, 100, 25, 180, 46, 19, 45, -88, -99, 171, 100, -96, 51, 8, -154, -11, 43, -143, -66, 68, -208, -63, 131, 268, -78, -68, -149, 154, -66, 3, -16, 68, 85, 144, 76, 95, 59, -221, 163, 58, 182, -142, -99, 53]
3245E3p5L05j59k63M21k56j99K46j20K23j01l3K91n97K37J57Pj05L34l88j02J18
3267fJ22k82J17M7L2J46j3k40r2J86m7j06J65J78m55K50N3j89L39n20L05j60O68
3290D98m99J24k44J7J09k45M34j56j48R6j38K23j16r0Q7n4K09J7k00j3L34k44
3312Aj89L38L8j71k21K8o4L68j73M6j01m4J87j6j00J13k31Q5m2L30J11r7l18K46
3336A24l22J58k0K75k23j58K53j70J12%l7N3k18J90r5o6J7K32l3j54K40r9PL09
3360C75l31j68K52j62L17j72j24j25R6L98m33P8Q6j04N8k48L35J4%p3K66l89K5
3383b9j17J35mj7J61k25J52J52J2k19k13K34j55J84M7J76l21K5MK0L2jK35n21
3407b53p3K23K48k0n1j3M9j24K11r9m9j3p8R6k89J06L50Pp2l10M67j27k20J41
$$ y = [53, -22, 283, 124, -139, 282, 26, -173, 73, -47, 176, 75, 42, 333, -264, -27, 130, 137, 32, 366, -22, -124, -6, 116, -166, -49, -2, 30, 176, 163, -77, -169, 17, -30, -136, 29, 207, -248, 2, 55, -134, 205, -315, -10, -170, 498, -1, 123, -121, -104, 5, -240, 194, 38, -110, -14, -152, 71, -45, -135, -48, -102, 107, 124, -76, -89, 245, 1, -188, 150, 188, 17, -204, -176, -240, 128, -45, 1, -100, -144, 43, 27, -73, 40, -191, -106, -148, 182, 293, 196, -122, 124, -198, -40, -60, 215, -8, -166, 87, -83, 29, 29, -8, 45, -173, 17, -78, -144, -127, 105, 72, -82, 158, 59, 66, 375, 44, -124, 128, -34, 283, 111, -13, -138, -42, 356, -77, 1, 87, -17, 41, -207, 128, 142, 142, 69, 335, -54, -29, -146, -11, -15, -32, 129, -96, 56, 208, 220, 1, -212, 22, -133, 51, 98, 274, -47, -22, -18, 2, 34, 33, 268, -253, -326, -103, 145, 125, 74, 61, 110, -14, 197, 98, 49, 36, -42, 54, -235, -129, 221, 228, 156, -154, 313, 186, -34, 107]
3431A07l36L28m2M3P7k95K44k55q3L03n5j57J81J15l61L7k66L08J04J06P9j68
3453A4O9j66O7k4l02N11R7l91P6J45m4k25K14o8J00j77M07l00J69l85p5M39l4
3476A17N4l68L38j70j51L07n3L0k37L34j87J66m0k33j76L51k49K34k50K45o6N6
3498E2j8Q9k01n6P8J14j52m7K2N0K47l00M12k86R9L8j90j30J00j3P7k38K12J14
3522G3j36K14q9j76Oj16J79J28L1J51j98P3j8j76J32P2R8k62k34K11nm0j49J08
3546a23L21k63J54j81j2K93m8j31j25M9n0K41p3J10l42J38R1N6k04o2L75k24K2
3569A2J37r2j43N5k42K30j6p3kl09m3P04j53L2J28k01j30Q1N4P2k11n4Q8O8j75
3594a83K8O1K28k68J54K60j87k41o9N3m3J52P3J18p0l15J33O8J50j52J67k9l6
$$ y = [107, -229, 99, 57, 100, 177, -118, 126, -129, -212, 91, 36, -121, 60, 175, -186, -149, -415, -107, -3, 103, 182, 14, 83, -83, -16, -40, -342, 169, 266, -125, -49, 96, 52, -173, 41, -27, 73, -104, 303, 3, 172, -213, -288, 151, 117, 171, -197, 141, -29, -180, 127, 74, 104, -133, 201, 14, 180, 140, -93, -269, 82, -167, 67, -183, 62, -4, 52, 34, 123, -78, -134, -56, 58, -94, -141, -119, -69, 178, -122, 290, 4, 103, 141, -49, -179, -79, -92, -15, -253, -41, 73, -63, 151, 62, -114, -108, -224, -45, 83, 114, 265, 67, 140, 122, -54, 78, 150, 248, -14, -248, -37, -42, -82, -231, -123, 198, -65, 89, -92, -104, 189, 141, 10, -115, -66, -116, 125, 52, 162, -180, -42, 49, 105, -99, -161, 214, -10, 12, 149, 57, -86, -31, -273, -43, -59, -132, -134, -443, -486, 218, 65, 97, 225, 24, -106, -25, 29, 101, -110, -164, -76, -8, -183, -155, -94, 134, -134, 20, 280, 93, -148, -217, -164, -207, -55, 18, 136, 66, -249, -116, -48, 102, -50, 117, 88, 52]
3617E2O8j09L6R4k08M6J14j44L36k69j01J26k3J74k33M7K11j62K52m18O8J40J3
3640A10QQ7n6j42J7n2K58l45M7J85J6j02L9j25J37N2J20p2r5j05j83L85k9j41
3664A4Q8j08J36j67R9m11K23P8J19k01K28r3J12p6n1J09r3J4o9l6P2k86M06j63
3688e6J43j41k6%K36k22j98L8K59j85o0J45m4K22k14L32m54L7k3L51k49R6j41
3711a54J13j12K45Oq2l89N43k51J17O9l63J30L09R3j12l57J07L86l42j92Q7J28
3733b1J05J58l32K36k01mj1j6R8N3k76K07J8l26K16M32l31r2K33k85J27m4o0J48
3757C2NJ7KK24k95J49l5k95M55j13k05J7J24m9j65K37k08K16k04r7mLJ20j57N32
3782C06k73lQ2nk80J96oj61J92N8J1o9Qj82K38l02M21j82J62l56J48j23J76P5
$$ y = [52, 120, 11, 47, 141, -67, -21, 93, -51, 285, 16, -85, 41, 18, 192, -41, 6, 217, 55, 307, -111, -43, 97, 110, 118, 205, 149, 7, 24, -28, 230, -115, -68, 117, 133, 31, 70, -55, 82, 134, 254, 182, 87, -18, -201, 184, 155, 14, 102, -6, 130, -37, 62, -349, -126, -48, 71, -130, 98, 5, 117, 41, -10, 99, 6, 20, -49, -85, -13, -299, 107, -56, 87, -54, -80, -80, 156, -66, -264, -226, 33, -152, -212, -67, -111, 111, -103, 229, -225, -188, -211, 140, -109, -13, -154, -41, -153, 92, 98, 16, -373, 170, -81, 36, 105, -258, -128, 181, 274, 162, -195, -88, 298, -44, -236, -149, -21, 84, 242, -90, 146, -55, -59, -70, -86, 12, 65, -211, -4, 14, -312, -96, 336, 5, -87, 146, -139, -12, -56, -116, 32, 37, 54, 56, 280, -15, 134, 99, -196, 259, 146, -59, -42, 82, 33, -132, 105, -103, 113, -91, -188, -192, -189, -69, -226, 306, 33, 30, 112, 107, -173, 23, 17, -144, 48, 106, 117, 48, 56, -126, 112, -190, 231, 49, 211, -145, 3, -120, 56, 131]
3806A31j28J42j48j48QJ05J54k1j30Q6m7J03j97J98k50p7OK09K56l70Q7J27M9
3829A45p3J20m52J77o3j7J97j36j08J21LJ78J45o3k61J91p5M1j04M4O1K5k20J99
3853G5j20P2K6J2j79J01K41n2J70l98J96o7p8r6J27m3J5K42O5l70q6L95l22l0
3877a04J88o7O5j94J58l41L69m9J15k50K5K41j67j2J62k46j17K3J50J89j64q8
3899a14J87J46l88p7K61J41m17k3L82k32M3J3RqJ77N8m0Jk50N65l53j85L35n55
3923c24P61l76j25l3j8P6k8m2m0k16L57j90J23K6j47J94l2O9n6P6J4j4j28j13
3947a86J73J12O0k13N7Rp2J45M9j33J49k48J48J19m15M99o4k67J51J44j61K11
3969B67k69K4O1j07O7j43J73j43j24K32j51J24L9J21m00K16K9lR0j42l9R1q2K85
$$ y = [131, 3, 145, -3, -151, -143, -38, 116, 95, -35, 51, 4, 107, -90, 108, -142, -219, -213, -4, 252, -118, -31, 96, 145, 72, 192, -260, -83, -146, -163, 34, -102, -210, -89, -86, 92, 237, 174, -87, 104, 29, 70, -34, 10, 71, 96, -124, 75, -45, 27, 53, 65, -114, -13, 228, 176, 346, -52, 144, 77, -1, -97, 30, -13, 2, 244, 309, -61, -147, 248, -74, -104, 84, 17, 82, -112, 46, -295, 74, 25, 140, -110, -85, 156, -11, -23, 139, -107, -224, -201, -51, 138, -26, -114, 73, 219, -169, -246, 15, 156, -261, -284, 98, -134, -91, -78, -69, -77, 100, 158, 118, 119, -131, 434, 81, -104, 231, -324, 437, 61, -64, -97, -115, -39, -67, -109, -149, -365, -8, -198, -75, -49, -196, -2, -34, 35, -21, 55, 69, 55, -73, -186, -13, 99, 159, -54, 3, 12, -60, 85, 134, 1, 150, -98, 50, 169, -246, 253, 189, -78, 73, 217, 56, 267, -2, 22, 83, -24, 43, -100, 73, -70, -194, 38, -113, 11, 50, 171, -229, -13, 16, 13, 103, -39, -78, 13, -69, 216]
3993B16k46J35rl64M16k12K49k82N5K43j94J83j06m44K81J11R0k14J3LK01K69
4015C94l24j87m9K75l09o8L19p6j1R5J02l1l6l4Mj85L03p3q2j64L6K08P3k11J19
4040H8j76j8K68r8q2K23j11N1l1j45n0P3k46K15J1j23j42M31j25J17j27j7j44
4063a58K3J16Oj5P3R3k41R6J02j35o1L18J46l19Q4j34j61K78Q3j04J1j53P4p1
4087d9P2k26K28j35K18lR0r4J05r7q6Lj34j03Q8L90l32M0l9K23k07j03O5J26j77
4112a37m0K6j17J12K50P6k45j16j1J72J62l6J59m13K04K5l29l2P6L02n8O7k8l15
4136b46k0J48q0O1K44l07LK61K9j67O0m4l48K01M2L8r9K18RJ16k13K33n6Mk68
4161a81J32K03j50k38M42j43rn3Q2j57j68J01J5J47j02P9j00K01P8J6k22k4j26
$$ y = [216, -30, 105, 96, -268, 148, -64, 185, -97, -42, 201, 7, 190, 84, -360, -79, 32, 122, -92, -79, -76, 125, 394, 70, -117, -166, 109, -200, -268, 51, -25, -36, 59, 161, 130, 94, 60, 64, -121, 182, 109, 27, -137, -101, 107, 180, -31, 88, -88, -106, 162, 64, -18, 205, 94, 145, 114, -31, -81, -8, -254, -39, -28, -151, -293, 138, 13, 130, 3, -14, -158, -135, -19, -13, -28, 45, 138, -103, -7, 95, -40, -101, 217, 363, 44, 128, -6, -167, 111, 194, 90, 101, -52, 22, -49, 23, -203, 25, -110, 108, 105, 195, 101, 206, 109, 23, 26, -108, -211, -123, 267, -65, -25, -64, 159, -48, -151, -86, 40, -137, -177, -151, -268, -156, 94, 170, -75, -191, -202, -30, 132, 96, 255, -158, 46, 71, -258, -290, -214, 88, 30, 97, 69, -246, -266, -118, -198, -137, 107, -200, -197, 64, 93, -74, -14, -58, -406, -205, -163, -125, -224, -6, 3, 119, -94, 139, 83, 87, -181, -49, 154, 4, -234, 208, 65, 56, 3, 85, -72, -240, -139, -124, 23, -79, 0, -100, 101, 179, 195, -27, -51, -177]
4184a77L28N5M8j49R3q1k35K11K6J01k61j17Q4M7j0J68k30P7j5j75M45l20m6J44
4208A1j28P6K09l79L50j54r1K19R1l91K87J30m70J28Q3j47J27J34j39P0Rk10K08
4231B3r4n7K91J6m88N09l80N61l39m8L5j83L9M1M38j69j70q8o7P0J22k5r9k1K67
4256A84j3j39l2j27K2j34l6K53P6Mk30K55j13qK16P3j12j73l36M91l52J75O8R9
4280A11J26m04L81m7N5k07R6J41l73J74j28j92J19o7M05j49k06J82k28M4J84J48
4302A65k54J24k23J51L75p7m78j69K88M29m07o4K97l53L7M50l07O3j79N2Lj56
4324b33M51k00j07J10j82Q1L2J85n1j43l4OJ86P3k62R1k2J08k29K68j12k17L07
4347A06l8L1l4j54J12Q7q1R2n1O9l51J07K00N3k91K54j30K43m26L10pJ5m2j18
$$ y = [-177, 151, 206, 254, 105, 198, 117, -118, 93, 119, 220, -41, -158, -74, -27, -37, 131, -99, -22, -37, -212, 233, -87, -133, 11, -117, -41, 168, -211, 139, -15, -106, 113, 204, -187, 100, 230, -240, -112, -29, -176, -49, 85, -54, 16, 25, -185, 23, -71, -128, 163, 179, -309, 200, -180, 381, 42, -6, 29, -154, -115, -74, 364, 195, 25, -63, -130, -60, 62, 37, -62, -83, 184, 171, 32, 0, -127, -105, -239, -275, -22, 54, 58, -172, 83, -30, -38, 178, 251, 139, -34, -370, 121, -231, -56, 12, 111, 237, -167, 214, 167, 222, 15, 111, 252, -121, 53, -75, -267, -148, -215, 190, 41, -165, 17, -211, -167, 17, 165, -89, 35, -188, -37, 338, 261, -217, -386, -98, 331, -76, -140, 157, -196, -159, 291, -16, 47, -132, -80, -77, -233, 218, 18, -89, 21, -161, -80, -48, 137, 86, -57, -91, -85, 101, 174, -88, 3, -19, 89, -140, 128, 16, -201, 106, 68, 99, 65, -89, 23, 110, 29, 121, 70, 139, -212, -105, 95, 148, -143, 111, -19, 224, -202, 108, 101, 116, 74, -44]
4371d4N3J35n20L07K28k16k05K16J07j00K49r1j53J30p8j15K81j46Nl1J40j91
4393c9J90j43J63k36J43q5K05l51j39K91J8J69j22N3q7K18k72J79j86k0j00J86
4415C5J18j75j00M8j9K66l25J93j28K75p9n9J1J50j85p3N5l17L32j26L03l88L52
4438A64l35J26j3j29K33P2P6j09M0j45k9j47J63k4OK3Q6J1q3k4L74k48mJ2j88
4463i2k6J50L8m4o1N3q6P3j11j67J81J6Q1j57j6K39Q5j57J34J9J24m95K25q7p
4488h8R6J8n7K6J27j58j78M24k44m5pK8K86m46Q3K0j4J33rJ41J26k08k11M66l46
4513c7J3j06Qj73K59K30m14L26j28j6Mj67M46k71K07k5k76k84M00N9M06m40J25
4536A46j88r7M19k00o9J3N3k64K59j05J11l90J20K36J34l69K64J18r3o5j87JK01
$$ y = [-44, 9, 144, -376, -69, 159, -57, -262, -46, 61, -39, 210, 119, -34, 96, 18, -97, 184, 38, 43, 12, 152, -39, 151, 8, 171, -65, 78, -7, 198, -153, -292, -1, 17, 186, 64, 117, 30, 248, -24, 155, -31, -51, -151, 35, 153, -22, -122, -74, -93, 173, -152, 41, -87, 188, 109, 50, 61, 211, 26, -47, 8, -309, 23, -103, 200, -188, 164, -171, -45, -58, -187, 46, 118, 194, 85, 125, -20, -49, -196, -33, -57, -51, -28, 58, 69, -14, -38, 336, 88, 84, 96, -92, -118, 32, 70, 26, -35, 18, -68, 5, -106, -273, -92, -76, 5, -152, -168, 71, 156, -1, 133, 152, 276, -219, 6, -81, -88, 8, 26, -31, -5, 122, -36, -214, 210, -34, -79, -86, -58, 228, -218, -135, -115, -129, 4, -5, 136, 262, 54, -157, 309, -37, -24, -130, -122, -295, -36, 194, -220, 106, -22, -38, -34, -201, 245, -26, 181, 156, -120, -404, -4, 55, 461, 21, 146, -42, -139, 280, 80, 11, 24, 77, -187, 72, -33, 78, -312, -192, 44, 178, -191, 73, 191, 98, 33, -154, -153, 48]
4559D8j28N5j63K03J88j81j40L03n9o5j1J45q2j52J39l1J50k47K76l03m4J82K6
4582A09j30K49k32n3O7o1k9k0Q2J6j33J59j12k45M65l87N11j71N8k62j31M9K34
4605C3j46m0J04O3j18m7K10J83m6k51j3j9J3j61J92L7pJ93n58K19q3M08k09J8
4629b5j33K7K79j7j85j24K58k45J67R9j93LL1K37k68J48J60j47q2q4L03k4l59
4652a74J90n0m4j9L00j70P6M2j2j18k11K43k35K41k05J92r0jJ97j48P3j52j1N9
4676b7K01k08MJ70l08K37k0O1J08m79J39N7J61lp9k9J11J47k65K64l81J76p0k0
4700e3L0K3J99k26j46n3J2K07j09K93j64J60k05j07K95n3k74Q9K52j75l9J83j82
4723d3J45J1L0j49j82J80P1k49l2K48K6r2m3N3K1J53k54J72M6j96K87m35Q6K32
$$ y = [48, -80, -25, -188, 15, 203, 22, -118, 185, 126, 61, 50, 195, 113, -39, 100, 69, 219, -28, 248, -55, -99, 83, 109, -21, 228, -4, -57, 10, -51, -80, -100, -18, -2, -135, 24, -88, -333, 132, -255, 256, 85, 143, -119, -250, -201, 33, -113, -153, -49, 14, -104, -151, 59, 242, 196, -55, -68, -87, -74, -235, -43, -6, -13, 180, -378, -159, -242, 166, -43, -25, -158, -131, 148, 131, -54, -178, 80, -165, 2, 101, -92, -89, -58, 179, -89, 59, 219, 72, -10, -94, 209, 185, -174, 16, -34, -78, -97, 203, 33, 109, 151, 139, 21, -190, 53, -182, 59, -146, 46, -44, -45, 152, 4, 77, -75, -86, -27, 174, -34, -30, 140, -168, 69, 49, 110, 218, -261, -122, -65, 96, 93, 14, -15, 96, 243, -22, 242, -139, 37, -33, -53, -23, 0, 199, -27, -173, -226, -214, -7, -116, 177, 13, 173, -32, -139, 156, 103, -171, -82, 170, -5, -44, 139, -43, 102, 113, 143, -6, -188, -8, 63, -186, -218, 30, 56, -36, -79, -26, -5, 148, -106, 66, 112, -84, 203, -232, -146, 86]
4747H6j93L31k73j6m9J8J53k24N8J92j72m5OJ46j16N7j3J17Q6Q5j02j89J03n4
4771hk21J10r1M30j40j34m4J79j83J46q2N5%j63J05p1p8K00m2J54k09J03O7j02
4795a9K16l18M3R7L6M2j0j94J39j1J29l80K48L0Qj56R8j3o2Q9j13K71k98J23j31
4820a36K67o5J49j79J6l4k5J38m0k29N8J84P5j92j49J94N9jk33K22k06J08Nk4
4844c8l3q0K15j15K40l06M05l43L32l98P9J78p8j22j38K39P4j65K19j03j23l6
4866i7J88m8J46M1m60L49p8n9o5J01p2J37L3q4j9R3R1l91j81K69K90q8l95J05
4890a94L00j37L3P6j78J27l01L25JP1NJ04k13J77k50JN7j3j03J5K7J13O3q8J39
4915A57k69M46j86r4J64o4k04p3L8P8q0K36k0K07n20L1L03l13L48m41O5J74J66
$$ y = [86, -107, 224, -49, -65, -114, -96, 57, -167, -109, 83, -89, -134, -128, 18, -98, -41, -54, 63, 149, 234, 132, -57, 46, -8, -229, -119, -210, 220, 80, -54, -98, 81, -102, 44, -38, 17, 17, -146, -41, -112, -190, 10, -32, 122, -87, 16, 83, -19, 197, -121, -78, 19, 55, 97, 87, -107, 32, 21, 150, -230, 18, 48, 56, -100, -2, -15, -77, 12, -101, 170, -128, -5, -136, 131, 66, 215, 36, 52, 18, -7, 131, 91, -138, -80, 104, 179, -13, -162, 32, 91, 90, -143, 79, -127, -19, -14, -38, -71, -151, 64, -51, 189, -117, 288, -55, 277, -121, -42, 136, 58, -64, -202, 37, 111, -54, 165, 62, -61, -97, 91, 43, 189, 230, -230, 119, 41, -18, -83, 18, -54, 83, 116, 32, 13, 106, 197, -194, -375, -106, 184, 96, -299, -194, 106, -31, 2, 78, -100, 27, -274, 51, 52, 123, 128, 232, 19, 196, -54, -53, 4, -9, -112, -97, -70, 43, 106, 18, 157, -112, 334, 148, 54, 218, 154, -50, -123, -85, -7, -87, 149, 129, 336, -184, -153, 150, -163, 185, -256, -191, -17, 149]
4938A49j78K37l28K3p0J29j68K7K47j46K42k22J38j34K0j49M23k6k38l9j80J84
4960e9K41j96mR3N2q7l10N15k30K13j74k01J23J70ql35rK93m1pk0n1p0M8J67k76
4986a63mk13K69K69j67P1k36N5J65j66oO7j40J85K19k94Q5J59q2l11K68m5k22
5009b37M31n44L03K4R6j64K5Q3j15J38k11L9N1L8j66M18j67J54n3j96J24k9j07
5032f5r7J11J36K00m63M82n20M53n99M34j5j27r0J41k4k9J01j07M2M5J19N3l3
5055A48o8j63Q2j67K9K89l11M60l01J47k28M66l33j07r8J43j46j52L34K81n10
5076b05J50J76j31L7J13j17l0N4k05L45j95N9q3J60j88J09P9J3K3j04k62J32N3
5099a7O9ln9k49J30M6q2R4j01p1L05J7J27k58k01K36kOK15l26J00P1R7k64j48
$$ y = [149, -29, 208, -120, -97, -167, -38, -206, -179, 68, -78, 164, -58, 80, -54, -34, -183, 240, 214, -24, -63, -243, -59, 182, -14, -18, 75, 127, 40, -270, 245, 15, 228, 54, -147, -24, 146, 138, -197, -206, 87, 46, 39, 19, -32, -102, -54, 113, -163, -167, -380, -111, 158, -9, 62, -174, -119, 46, -120, -126, -59, -199, -14, 205, -89, -4, 155, 73, -238, 30, -15, -237, 194, -350, -47, -23, 73, -91, -66, 17, -98, 40, -171, -132, -81, -43, -209, 209, 42, 196, 143, -53, 71, 42, -65, -162, -51, 85, 285, -178, 304, -216, 237, -362, 72, 57, -70, -160, -19, -43, -72, 29, -78, -36, 9, 128, 181, 148, 80, -83, -1, -168, -139, 150, -161, 299, -2, 145, -83, 383, 50, -57, -155, -12, -158, -310, 24, 305, -205, -55, 121, -10, 27, 140, 23, -7, 47, -158, 187, -8, 51, -32, 128, -60, 49, 128, 141, 164, 60, -202, -70, -17, 52, 49, -10, -259, -129, -83, -165, -71, -172, -243, 62, 79, 206, -52, -253, -17, -19, -13, 202, -124, -24, 47, 144, -120, -268]
5124b68N10m19j8M39j44R1j34k36K3J73J13k12p8J42R3l84K62j67K32J2K0J98
5146B48m15J29J0J71j87k69K57K64n00K5M26r4k16J50k4J90l18j36L48k67K09
5167Ak8o5l3J48j18l6K06k2r3J69j49r9J25J26r7qk5J51L9l10J80r5j01K45p0
5192D1N0j08j33jK95Q1l49J94j41L6K57p1j60L15l84J11n8J8p8J55m4J82l79R8
5216g3J8J86n2j90K36j74P2r3K73rk07N5n3J29n06K90mJ76l2oq0N9lM6N0M2J55
5243C05n15K82j04P7k9j19J03r3o4K16J70o9m57ML06O4n3J8N3J5L5p7j93N6J24
5268E5m3m4m4l6J64j71J38J40j33j3L4m2L14l91r3K80m07K96J9j1M1L1K10l71
5292g7R6l21J86oJ79N7k58J73mK8O2l7j02k7j16R4L26j60o3K35k22j41L17k67
$$ y = [-268, 242, -177, -195, 244, 100, 191, 57, -179, -156, 17, 130, -82, -160, -18, 75, -309, -47, -214, 18, 30, 50, 248, -167, -38, -28, 143, -44, -313, -56, 208, -292, -267, 159, 65, -151, -1, -25, 165, -153, -289, 59, -208, 1, -27, -92, -125, 23, -95, -131, 75, 53, -40, 129, -20, -119, 6, 132, 35, 27, 2, 153, 192, -118, 62, -33, -134, 111, 41, 91, -17, -150, -151, 144, 225, -124, 70, -71, -35, 222, 151, -9, 306, -78, 33, -25, -7, -85, 70, 26, 208, -171, -73, -55, 131, 79, -111, 125, -49, 23, -70, 203, 194, -13, 42, -11, 118, -388, -98, -102, 74, 42, 36, -44, 15, 12, 58, 108, 150, 305, -210, 72, -32, 45, 16, -103, 0, -93, -157, 59, 229, 160, -297, -293, 13, 77, 24, 42, 95, 110, 145, 68, -125, -69, 55, 12, -32, -76, -112, 52, -119, 19, 159, 26, 13, 47, 5, 319, -72, -165, 115, -292, 4, 23, 12, 53, 84, 294, -77, 19, -302, -116, -122, 57, 114, -144, 29, 25, 53, 115, 78, -24, -51, -167, -73, 253, 93, 30, 265, 43, -98, 219, -48]
5316d8O1k14j27K63R9j03J28j51K1M79l47J6M2j60mn1j18N6K87j23r3l0Q6L16
5340B85m13J97J11j07k40K78k02J6N8L31k91oj87J80K08p3m7Jq3j41r1J04K6K
5364h4M7p7K16l70L19j52M12m96L82l10L15L9k59J1k3J39q4k4p1J81O5l39J21
5387d2Q1Q6l43K52j76j36L18k38L03M1p8k53l6J86k5L30j29k75J29j10J92J12
5409A89j8J2rj33l32K92q2K07q6j42J09q2n5K62j98N4q1Q5j30J5pj20j25M20j81
5434a36m8N7j95Q89n38j32J39J14j32J4j90K30q6k4O5Rq6N03m56K71k35l6J70
5457A67L5q1J16k96J47l5j69j61M86J24o30L65J5lRj50J45p8j27J03k56J46L28
5480B00j46j06J84k26M46j58l27J63L7k6N8j49J7j93K24K39l57k2R8K03j35o5
$$ y = [-48, 13, -201, -328, -65, 34, -69, 59, -92, -71, 408, 61, 77, 119, -41, -45, -96, -214, -158, 129, 6, -87, -117, -31, 285, -128, 69, 180, 73, -167, 111, -91, -75, -17, 314, 23, 17, -170, 10, 218, 145, 98, 99, 16, -125, -216, -112, -86, -84, -37, -114, 102, -268, 51, -101, 311, -185, 197, -113, 202, 241, -18, -7, -30, 109, 25, 1, -70, 111, 176, -163, -42, 39, 125, -218, 34, -142, -278, 40, -198, 105, 146, 68, -185, -221, -35, -60, 270, 141, -134, -5, -115, 77, 189, 171, 183, 174, 41, -291, 1, -81, 126, 40, -102, 7, -75, -130, 132, -66, -12, -93, -8, -138, -123, -130, -250, -375, 45, -136, -184, -127, -322, 567, 29, -103, 36, 150, 18, 32, -158, 72, -14, -38, 27, 36, -50, 453, -3, 268, 33, -3, 167, 202, 121, 237, -59, 88, 53, -116, -277, 209, 333, -297, 68, 83, 80, 89, -61, 84, 6, -121, -18, -274, -128, 200, 54, -52, 132, -94, 352, 194, -133, 30, 67, 41, 99, -50, -33, -226, -2, 237, -120, -142, -44, 159, 24, -41]
5502d1q7K2J73n1J66j35J82J02k90J13l52j33K39oJ53l2r6PK16k50n8J77m7J7
5526a1L00m28J29m0q6n6L16r5k74J88R6m6M7j13K82k39k54K4L54k50r7K02j01
5549a52J23P0J64j19j28o1mJ50n33O32j37q0J24Q5n6m7j02M3J24l8K11m94L67
5572A42l31K39J7P3k85J00j23K38k40k4J79j87J24P0j10L06l21J74P9M7j84j72
5594a89L07j32q5q5L89m24k19L72o7L58j43J20j45j15n4J82Q9k17r7J64J48q1
5616G6j55J26o4k1J32j72j14R8K35K57m13j84L58k87n2M68j85j00r9K23R0j01
5638A16m10Q1J91J21M4R2q6k61J75K11l30Q9O2m5j30oJ14K54l03J37j40k08K09
5661b3K96l63J2M9j10M19j49j47R6j42p5m4P2J28M8qM2lK15n10K06p2J38j79%
$$ y = [-41, -128, -106, 67, 16, 182, 47, 229, 331, 41, 154, -198, -331, -92, -98, 55, 23, -73, -66, 150, -100, -158, 19, -28, -11, 289, -139, -10, -50, -136, -192, 124, 29, -245, -57, 39, -7, 40, -73, 209, -30, -284, -260, 94, -156, -253, -51, -152, -29, 41, 205, 86, -42, -103, -107, 43, -490, 142, 5, -75, 49, 134, 78, 31, -71, -28, 96, 58, 269, -225, 142, -189, 50, 67, 140, -145, -45, -168, 70, -170, -194, -15, -202, -78, -8, -118, 188, -133, 41, 120, 167, -17, -189, 118, -14, -99, -184, 205, -219, -438, -66, -133, 225, 82, 202, 57, -58, -112, 70, 159, -58, -155, 9, 157, 76, -79, 47, -17, -38, 94, -78, -192, -94, 141, 398, -15, -199, 159, -128, -180, 288, 103, 3, -96, 127, 217, 116, -294, -213, -22, 99, 143, 235, 149, -112, 63, 274, -56, 33, 95, 50, -80, -86, 28, 282, -21, 116, -24, -232, -23, 273, -90, -78, -29, -139, 280, 131, -16, 80, -62, -137, -181, -109, 19, 67, 59, 101, 98, 313, -197, 9, -63, 75, -104, -104]
5686a04p9L20l81J22j22L29q9K2M9k34K87l06Q2K09K00k15m8N3q5M0j83L63l08
5709g8J24J33j86J12j89J24p0K57k01j58J2OK68j34j06J22k16M55k45J8p7p6J51
5732D6j14J32N7M9m29K60J43j84J39j03j12K85k40J29l39L98q7K14j44L1j61J00
5754G0K5j52J04J74j61j49J09L7K3m06M56n5K32r7l17O4J46nK2L9l53J06N1O6
5778B9J23J65k02m0R7k64K29k04J36J81k01k03K55k18K23O5l81J70o2m8J37K19
5800B06k92K19k30l1L61k46r6J14j74j71L52j12O9R0pj42J06J0N6l4L5j19K5J70
5824A59P5m69J23J43P8k9k14J62k39J86K41k72Q7j55J11M5J90j7l47L5k3K8K8
5847g4L18k57K1K24k94M3R9j24k31J12J73K07k72l51L63nK2L4J77k07l27L61J03
$$ y = [-104, -183, 137, -244, -122, -244, 85, -4, 18, 67, -167, 120, -186, -104, 105, 305, 90, 42, 95, 10, 50, -133, 230, -78, 46, 179, -7, 105, -84, 40, -30, 227, 26, -132, -120, -114, 154, 20, -86, 36, -180, 275, 30, 48, -29, -105, 46, -68, 64, 121, 170, -259, 1, 144, -40, 99, -4, -116, 169, -71, 58, -281, 117, 30, 244, 100, 131, -30, 70, 95, -57, 47, 221, 60, -89, 20, 57, 80, -326, 130, 75, 307, 210, -107, -43, 103, 98, 120, 159, -194, -88, -37, 29, 152, 317, 115, 75, 172, -92, 137, -67, 69, 250, 49, -154, 101, -117, 106, 171, -210, -40, -102, -150, -13, 206, -86, 133, -97, -128, 233, -13, -109, 5, -169, -340, 12, -100, -31, 59, 52, -90, 16, 26, 82, 48, 83, -36, -11, 159, 234, -235, -112, 31, 109, 80, -134, 28, -211, -25, 216, -56, 31, -124, -13, 32, 222, 205, -142, -107, -130, -102, -74, 244, -13, 8, 232, -62, -19, 80, -44, -275, -163, 10, 217, -55, -406, -43, -48, -26, 8, 185, -22, -349, 12, 115]
5870A15l2J31o0j37O5J79l75K01J08k42l9K53m76L28j23P9K92l87J32J01l49J61
5892g5k8K69l7m5k10j92M81J48j17l43K86p9K9j33R8j26L27j4k70J36K1p9k6j64
5916a43J78l9nk78kL02J40k22Q9j32O3L11l57k4J72m1K52m21J28N4j88K47j42
5939e8J49k04J83j20j78K59j57J18mk5j42L42j53j72L91k48j69K55j19N7M6n4
5961cJ20k39M7J60m4N2k60K66J85m21j95K49K50k65J80k62O9J14o9M2K42m02P3
5984a11j15K19L7q7n2J05J44K01o10J61p8J96K62l42J2J54j15j94J71q7M5K13
6006A29J12k42K7k5J07l08J55p7M9J22J8M8j66J07K15j88k61L58k81J11%M3J77
6029B30j83j48j19K51o6ljk17N09k83j85J54L0m1J53l26K63J06q6k37K15k11L19
$$ y = [115, 83, 214, 154, 17, 82, 261, -114, 87, 195, -47, -86, 167, -309, 19, -104, -25, 267, -120, 12, 113, -236, -75, -103, 166, 129, 84, -126, -318, 163, 311, 194, -149, 137, 58, 87, -46, 52, -74, 253, 239, -31, 105, 126, 47, 21, -143, 35, -4, -9, -287, -289, 13, 153, -69, 20, -112, -49, 262, -95, -119, 53, 12, 264, -157, -29, 25, -163, 84, -58, 91, -113, 70, -50, -228, 31, -126, -8, -12, -37, -179, 163, 10, -162, 229, -19, -188, 67, -52, 5, 51, -3, 117, -122, -75, 85, 41, 93, -167, 99, 284, -137, -332, -83, 167, -98, 82, -180, -111, 3, -66, -24, 218, -184, -111, -226, -7, 30, -57, -109, -4, 140, 341, -269, -108, -186, 10, 272, -70, -58, 96, -19, -213, -42, -129, -84, 129, 241, -1, 26, 1, 108, -200, -45, -122, -73, 49, 67, 115, -51, 56, 271, 83, -178, 180, -101, 10, 10, 53, 230, 47, -101, -220, 31, -35, -38, -39, -256, 253, -30, -215, -61, -31, -72, 81, -245, 18, 124, 38, -199, 16, -195, 124]
6052A24k13k7l9J52R7j43R2J1J7j39l8R2K8p9L8j33K01j59KQ9Q1J07j87K6P9j55
6078g6L32j76l07J11Q1j37K97k45K26P3K5r7m35L79k24J79k35L31K6l39K33J64
6100A86R9m20J66n2O9k04j42L62k12L17l15K44l20L53k65K78O0k87j80K40K5j67
6122a65K30o7p0K71k96M6PJ9M7k25K39m3p8n0Mm8M06m19K32j83K28q3J06K18k19
6147A07j5l93L55l2j47J25j90%K86j1k48J97o4J24q0O5J42k21J58j65r3J87j9
6170F8r4q9K04j78j60J65Q7J89k0j12k7K06l75R6N0K89l25rN1k99L7N8J54J20
6194H6mrj36K00j32L41l26K45k55L3J20k82K7K55k93j4K01N0rk58O18o46M85k46
6218E1L3j47l2N5p0J93k62L31k35K30%k32K0r7K91J35l55J03k3J93j90j32K06
$$ y = [124, -89, -116, -155, -3, 94, -49, 43, 54, 71, -68, -106, -14, 14, -65, -27, -160, 41, -118, -116, -27, 54, 161, -26, 0, 79, -76, 256, 80, -227, -116, -35, -172, 125, -120, 106, 179, 204, 107, -328, 51, -173, 6, -229, 102, 128, -211, 22, 186, 285, -135, 31, -21, 48, -156, -298, 64, -148, 169, -146, 98, -222, 131, -134, 144, 204, -83, -263, -23, 2, -165, 65, -2, -72, 199, -97, -51, -44, -25, 22, -203, 36, -7, -85, -135, -131, -179, 227, -192, 40, -143, 85, 2, 108, 326, 107, 92, -301, 54, 22, -125, 0, -190, -190, 96, 85, -163, 34, -30, 94, 14, 79, 221, 0, 158, -7, -100, 87, 68, -26, -115, 89, -89, -249, -84, 3, 192, 172, 60, 33, 239, -136, -40, 10, 299, -26, -35, 16, -283, -246, -188, -34, 86, 82, 73, -63, 137, 5, 346, 20, 265, 10, 43, 163, -119, -92, 163, -130, -144, 57, 107, 98, -160, 458, -188, 297, 51, 84, -63, -95, -40, -110, 83, -179, 152, -83, 147, 147, -85, -65, -162, 129, 264, -91, 12, -11, 182, -8, -140, 66]
6241F6m9n6P0P1k8n1o9j10M01l16J72k26L30k26J85r8J87j18k77k9L7K70l8j05
6265gJ62k5J1j38J77j49l6K56l03O2j64k1J46J18k86L12k94J00L7L67k85l8J63
6288A65l32N9L12l48J15K39k20J3J60o0k49K49j36l3r7l7J67O0j75K31j25N1l99
6311c90N58k35J2J06L9j74J37J1o5j3k30N09r9j81J59j11j57J97J52j93QL05k62
6334H3r7J14j44j23P3K33R1j51k9j03r5N1K4J60R1m37K70K29l42K58j00m7j73
6357a64J29n8L1J83mj72L20l89J55J4J80l28J31lr3k9k39M04P9q6j25j14j27K19
6381h6j00M1q6M36l09J70J45l96K53m3k04J56j45M8K25j01J11k41n7Q2m7L22m
6404A70k93k9J63N3k14K05l99J50Q8j2Q7O4j21K82k71n9J18k4Q7j71K12L4J6j3
$$ y = [66, 17, -39, 31, 102, 74, 23, -46, -156, 245, -71, 101, -125, 205, -21, 164, 66, 253, 135, -142, -171, -134, 136, 98, -7, 155, 130, 141, 3, 180, 31, -5, 251, -52, 10, -154, -175, -29, 89, -197, 115, -179, -79, -42, 325, 40, 2, 165, -167, -108, 204, -144, -29, 210, -10, 3, 163, 103, -146, 103, -33, -66, -163, -200, -33, 27, -148, 83, -42, 9, -390, 168, -67, -55, 51, 90, -84, 53, 64, -1, -14, -244, 265, 166, -15, 144, 33, -124, 73, 225, 32, 40, 345, 83, -14, 100, -44, -167, -94, 139, 230, 79, 50, -53, -148, -97, -73, 87, 178, -259, 11, 240, -102, 156, 56, 9, -164, -35, -93, -62, 121, 117, -55, 265, -124, 31, 45, 225, -103, 28, 25, -68, -97, -336, 68, 147, 61, -64, -178, -305, -86, -186, -145, -231, 205, -104, 66, 211, -185, 68, 25, -179, -23, -168, -120, 105, 4, 115, -126, -183, -101, -148, 174, 170, -123, -152, 11, 64, -150, 55, -344, -194, -106, -118, -31, 33, -88, 194, -77, -136, -18, -42, 45, -126, 86, 120, 136, 123]
6428A23r8R2K43l56j23J88k03O4N9Mj6J23k01R8j6k93P5J64O3K93m74J78j38j58
6452c09L24K32Q2l77l4OP2pp2K87l96K06j04P3J55p0j49j90K23K29j90L1j5R1
6476I8Rj67j08N16j99k90P5L41k36q0rq9J50L0J10j33k12K06m3j09J6R0J13j79
6500a00K1J56J9M4O5k2l77J19K14l6k84L15Q1k74J85j47J64j18M1j68K55p4j49
6523g0J97m3j17J18M3l56J16J78l6J64k46J27J04l39J02K02l9j56o0l4K70J42
6545B67M4l09P5P8j25P3k66L94k63m1K34m36l2L10j73o0K66p9R1n6RR6m0l31M36
6570A62j10j39P8k09K15j73J79Q9j06Q8OR5kJ02m32jO2J78J18m19K12mk05J29
6594h7K33r8l17K50J25Jl33J19Q4J42j00j07L18k30p7N6R0o7j50K42j59P9n3N3
$$ y = [123, 25, 117, 360, 4, -119, 69, -134, -70, -11, -7, -23, 100, -101, -3, -19, -312, -237, -73, -10, 283, -191, -13, -151, -309, 15, 247, 329, -48, -82, -76, -4, -11, -83, 204, -192, 14, -90, -17, 138, 68, -81, -271, -48, 181, -9, 22, 7, 98, 107, -60, -168, 348, 149, -141, -66, 275, 39, -41, -50, -139, 11, 41, 151, 18, -194, 12, -31, -140, -124, -34, 79, -100, -79, 77, 96, 140, 205, 183, -194, -75, 139, 103, -181, 134, 215, -59, 126, -21, 143, 25, 66, -102, 153, 79, -70, 127, 84, -33, 85, 128, -228, -112, 66, 30, 194, -52, 75, 179, -160, -58, 144, 105, -51, -111, -145, 125, 267, 311, 2, 77, 155, 30, 103, -163, 231, -32, -73, 161, -275, -307, 3, -170, -230, 36, -43, 48, -8, 1, 97, 57, -274, 162, 52, -87, -9, -218, -3, -176, 3, 92, -14, 74, 80, 175, 173, 275, -157, -158, -96, 82, 200, -219, -7, -11, -216, -87, 146, 48, -269, -19, 106, 107, -226, -107, -23, 119, 19, -88, 230, 0, -77, -21, 69, 2, -148, 94, -65, 14, -39, 14]
6618A4o0L46j90j77j5J46j42j51J86q2J39K0P9m7KN2j8j26J58K1m33N4K92ql78
6643c18J82J92L1Rj07K9J50k62J4K9K35l25J14k8J2p0N09l43j59J33j25K41l09
6666a66N12k56k6O2k83J49l6L6M3k18N11l76J72q5n5j75K03m1J95o8M1l11K65
6689I3k93K07j43J58k4O1J45k46pJ55k96K97L4k61J76j16O6J48k20J75q0J07L9
6712A75j92Q9j22P2j3o9K8p0m6J35J25k91q4J14J34J52K2p5K27l03l2q4K08J50
6736B50k60Q3j21K44j13m7qL1j41J23jl7j79M92l65j3J61j42N1K71k8k51R7l74
6760b77K52j5P9r6l7K58l41L45k55j5L6J64r4JJ55m16J61j43K30R6J11j91P6j31
6784d7J10j56O0r5L14J58m79L65j21q7r1J78l18J95o1NK45j14j20J08j4o0j37
$$ y = [14, -46, 300, 110, -67, -82, 64, -78, -229, -43, -125, 14, 34, 113, 66, 68, 120, 102, -24, 134, 155, -278, -224, 68, 60, -318, -136, 56, 87, 96, -11, 18, 168, -94, -80, -51, 184, -141, -27, -55, -43, -113, 396, 53, -106, 27, -98, 143, -166, 346, 90, 64, 126, -157, -8, -44, -8, 35, -183, 328, -48, 124, 39, -16, -191, 12, -29, 166, 98, 139, -172, 93, -200, 7, -136, 22, -2, 59, 204, -42, -49, 106, -190, 107, 141, -120, 56, -60, 6, 154, -66, 109, 29, 136, 175, -17, 72, -50, 22, 9, -60, -32, -102, -148, -13, 112, -179, -263, -149, -15, 137, 159, 84, 311, 8, -24, -108, 100, 250, -10, 73, -48, 196, 83, 36, 28, 59, -82, 41, 40, 3, -176, 316, -49, -62, 99, -43, 8, 279, 251, 0, 97, -277, -25, -40, 39, -57, -94, 164, -177, 168, -87, -102, -66, 98, 4, 5, 160, -256, -95, -238, -8, 88, 199, 8, 84, -47, 63, -93, -33, -128, 186, 344, -135, 230, 109, 22, -69, 109, -209, -14, -75, -70, 175, 61, -59, 49, 35, -25, -162]
6807a62J70j18P0L85q9o6l87m7K71K87l36k62L93k49M1R5J50l6o0L8j7k20L81
6830B32k53k50K79M1R4j9n8rj77K93kl1K9R2l09R4k77J69J22j38Q2J43l21L08
6854A34q7J32l27q7L20j27J06k10K54j55O0J17l01J96K2L1o5m23M26L3L58l01
6876A06r6J13l02P1j09K03J90j30J17j30lJ99j81m8K69j52o0j80J5k28N87l04
6898e3K29N5l61O2J57J68k34p2l7K04J38m89L92L2L9j4k1n0j41L7k42J69n5o6
6922a53J62R5k31L13m8J4q1k22J93k71K25j01j19L63J72k68k11L26q5k86L54O
6944A47j86n7JK68k74r4J50j85M22j09J31k48o0J12l2J28l2j33m5J47pQ7j72L42
6968C01n50j35M38O1o0Q7k44jO9j63J15oJ59l37L02l7K19j27n2j88J97j69K22
$$ y = [-162, 8, -110, -40, 345, 256, 190, -197, -244, 27, 314, -22, -284, 109, -140, -99, -4, 146, 110, 50, 88, 71, -149, 232, -21, -271, 8, 49, 143, 124, 66, 57, -120, 173, 171, 140, 169, 261, -48, 46, -231, -62, 60, -78, 4, 147, -174, 134, 47, 179, -148, -235, 85, -42, 64, -146, 108, -47, 13, 130, -171, 25, 47, 78, 13, -410, 16, 49, 407, 106, 10, 123, -179, -108, -217, -14, 176, 46, 163, 33, 30, 229, 48, 0, 269, 117, 57, -123, -108, -336, 251, -53, 176, 231, -130, -68, 89, 257, 23, -49, -86, 118, 256, -233, 159, 191, 230, 216, 195, 145, 4, 41, -201, -32, -87, -153, 9, 104, -127, 186, 138, 152, 71, -151, 42, -229, -4, -105, -224, 139, 311, 43, -168, 158, 73, -213, 141, 147, -39, -96, -95, 173, -101, -195, -45, -230, 192, 83, 214, -34, -94, 18, -14, 114, 82, -51, -96, 51, 44, 131, -41, 301, -249, -384, 54, 115, 55, 142, -102, -103, -34, -197, -82, -88, 71, -266, 36, -1, 218, 91, 39, -149, 48, -121, 101]
6991A01q9O9j23k07J50L27j34k77K29k25N7Q1M01k00j82j61K95j91J36R1k78l8
7013a68L23k83n6K01n2K57l20j6K8L72m71m7K48k17J47K60j12q4m5j38n5J87p6
7036a17q7K86j25L32l64J04L08m56j5M05k22k19O4L04l75j01L33M2M9K53m85J68
7058H2j17J15j2q8j6J24o6P9L5j30J51k97J72l40J95Pj2K79j29j98J24l7J71l40
7082b48N8L94n9o7K3l7k1J21k64j9L71rj84M3k86J28L5r2K59Ln11M70n7j8k57
7107b24J87J48Ql5j89J15m1J59k44p3J93l7j37L59o7k30j50L75j11n3K35n0j69
7130c1j27J83K22m00L11p8n1k86O0K07n1n7p4N7o4p8L14r5J96k13p2K31k94kL90
7155A98j14j33P2J80j58N5N0k01J32l16M78l07J43j09p9J35L9j33J6J69l07K24
$$ y = [101, 12, 81, -42, -249, -99, 228, 94, -183, 46, -179, -122, -41, 360, 160, -22, -183, 112, -79, 57, 148, -130, -168, 155, -128, -184, 17, -35, 222, -98, -114, -86, 286, -185, -232, 16, -201, -54, 206, 94, 10, -35, -173, -228, -41, -117, -204, 82, -43, 289, -75, 29, 337, -119, -134, 271, 49, -170, -106, 198, -177, -278, 55, 97, 146, 399, -86, 82, -35, 80, 68, -20, -36, 88, 22, 101, 136, 6, 157, -140, 32, -308, -113, -106, -118, 161, 32, -166, -42, -79, 92, -248, -190, 204, 145, 78, 101, 64, 43, 164, -100, -119, 252, 243, 59, 102, -184, -56, -21, -113, 146, 149, -362, 108, 51, 33, -224, -37, 111, 119, 84, -105, 10, -31, 128, -116, -189, 4, -33, -170, 189, 122, -108, -258, 117, 6, -47, 188, 138, -31, -158, 25, 247, -153, 158, 80, 29, -257, -197, 10, -41, -98, -172, -115, -179, -257, 57, -38, 158, -55, -127, 104, -190, -192, 198, 84, -49, 23, 203, 45, 100, 150, -51, 81, -235, 243, -64, 79, -30, -109, 26, 65, -68, -52, 117, -190, 34]
7177C4j82J96o5Q8j34K3K98j26j98K85j64K27j73P3k61J34q0j51LK00R4l4j13
7200b6k23L45l23M79k37o8K81k45n8l5r2J95Qk83N20j57j71j78K37LO2O7j88K06
7224A19O5k45l7K53j87k5j89L2JoK65Rlj51j13P4J44o1P2n3K1L5n3J00J90l12
7250e5j4j37J36K60k20J46k51r7K36pj25Q5K40k84L43m80%J05K79j76mK70l74
7273a24J77Pl93N7K90k87L85j86k34K71J74j6m1k45L98m75M70l91K07J18k5k15
7295g8L91j83J86m27J59M2R5j36j21j40J41r7L54k54L50j59j81j08J72J80l50
7316a64K41r3j0J76k14K33j62j67J27J42r1j04kJ90j80M4k6J03k88K55K12k34
7338a2q6oK73q1j8m46K48L74k26j23J75l02K54R3n3K8L4k29J5j27L5K59L3k48
$$ y = [34, -148, 48, -17, 71, -63, -40, 258, 132, -66, 219, 55, 282, 109, 182, -79, 55, -25, -176, -173, 27, 121, 87, -26, -249, 96, -227, 252, 15, -53, 228, -17, -75, -110, -202, -7, 1, -282, 238, 81, -90, -268, -31, -28, 34, 101, -87, 119, 184, -61, -98, 155, -32, -57, -246, -214, -213, -219, 46, 55, 52, -99, -212, -138, 6, -55, 17, -36, -15, 20, -33, 67, 257, -55, -69, -206, -70, 190, -30, 116, -135, -232, 4, -3, -128, -43, 197, -87, 256, -224, -224, -119, 160, -16, -20, 250, -124, 53, 60, -333, -276, 14, -273, 112, -74, -308, -37, 137, 121, 80, -165, 233, -242, 228, -163, 44, 162, 137, -78, 313, 130, 316, -111, 48, 90, 185, 49, -72, -212, -71, -168, 186, -68, 282, 123, -58, -166, 6, 186, -164, 77, -16, -26, 150, -64, 169, 7, -160, -33, 109, 18, -86, -88, 102, -78, -34, -60, 43, -245, 10, 222, -12, -98, -104, 169, 88, 70, -376, -128, 246, 20, -103, 72, -230, 24, 117, 64, 92, 126, -103, -88, -215, -180, 79, 112, -136]
7362a36J67p6n2j4J83n7J05j41L5kr3j46K17J10qj39j0K26j95j55L60Nk81M40
7386C43m55L8K15r8J09j53j9J56N3p5o7ql5j43P4j27RK14j09J93j56N1o4j0J08
7411D4k03J95j23K06k58J33n3J30k14J00k4j55K46j59k05J81K32J13m7j86m2O6
7433b3j82J33r3o0J65q6J08k5L1J86Ml36K62P6j18q9M5n8K9N0l7k9P8k43O4L41
7459A93k75L17k17k10L89j70L39j75P5k5l81P1J53k59L64L9m52J33J66k54J92
7480A3k27J79o6j91N63m56P3K81k1j37j07K27L2k97K48j70K97m1k15Q7j18k26
7502b72O09m38J81j74J32Q6j55J07j48J69m6j17RP7j4j99J86J71K35n94J65j16
7524a46QL19M0k77J4k16J76O6j95N44n23K78p4J16q2o7l7Q3L4M2K05l11J66k83
$$ y = [-136, 31, -45, -97, -111, 72, 15, 120, -21, 14, 12, -81, -227, -10, 100, 92, -47, -57, 169, -26, -181, 179, 184, -97, 343, -112, -74, 141, 43, 152, -1, -20, 136, 189, 114, 47, 39, 4, -139, -65, -192, -183, 31, -78, 115, -41, 10, -54, -64, 44, -159, 36, -87, 119, -139, -6, -59, 71, -143, -43, -67, -222, 24, -135, -340, -159, 73, 186, 139, -47, -89, -23, -205, -72, -165, -225, -60, -146, -38, -63, -32, 154, 158, -178, 84, 160, 42, -47, -2, -60, -31, 19, -18, -47, 31, -212, -148, 193, -82, 235, 18, -192, 197, 27, 366, 191, 266, 241, -140, -69, 84, -175, 189, 228, -224, -91, 75, -179, 13, -214, -35, -101, -292, 271, -185, -112, 169, 148, 11, -96, 131, 163, -134, 114, -56, 241, 200, -15, 72, -46, -272, 337, -101, 80, -94, 38, 124, -31, 76, -72, 97, 51, -66, -57, 20, 6, -193, -7, 164, 399, -195, -30, -146, -138, 181, 221, -56, -42, -258, -82, -16, -211, 333, -190, 88, 14, 130, 48, -19, -56, 27, 61, 103, 308, -3, 163, -120]
7548a20J31J72j15K18k55k51M83n19M28k01M1k51J94lJ59P2k7j16J81j74k96N9
7570a90K9P2mk6J1L37j78p6q3q6J35L89o8l48K88k80j7K78k45P0o6J61k40J85
7594D8m67K76Q3l9j02J3J81K61k27J75l27m2M31j99J48l76n1N0N4nm5K04k62K40
7618B2l8M7J0p0pQK68k08j83J00J05q3l5n6J98j13R7K9j08j64K94n0J09k94r1
7643b13J65O9J0k53Q3l3J12o0k7J25J4N6k58L06l3j16n8N5K56l08O5K55j01j1
7667A00j59jj45J38j37L01j37o7J53J32n5L08n30J91m16J86J03j01j5K11N0l83
7689b73R2K92R9j49kj08K38j92j36J0J81r2j40J94J29j19rK11k01m9K19m36K27
7712a4J73l19K38j00J58k91N4J31J1j90P7K56m41L38r7j89K5Q7L66j67j11K71
$$ y = [-120, 11, 183, 68, 286, 31, -220, 263, -256, 172, -29, 12, -239, -45, -48, 111, 183, 156, 40, 221, 47, -249, -190, -161, -89, -93, -119, -108, 229, 51, -25, -108, -194, -59, 330, 262, -86, 202, -78, -95, 183, -62, 8, -58, 103, -137, 48, -419, -143, -60, -99, -201, -188, -7, 254, 27, 202, -125, -167, 264, 65, 213, -163, -214, -164, -110, -115, -160, 44, -218, 22, -16, 31, 41, -29, -36, -28, 240, 32, -151, -51, 54, -29, -64, -120, 78, -35, 62, 91, -17, -181, 113, 63, 172, -122, -213, -48, 21, 31, -222, -139, -172, -60, -120, -147, -22, -8, 48, -210, 96, 63, -53, -111, -56, 200, -108, -43, 212, 111, 100, -59, -60, -205, -67, -204, 97, -40, -107, 46, 178, 123, 431, -99, 92, -324, -138, -35, -136, -151, 60, 110, -273, -181, 111, 210, 61, 59, -49, 189, -3, -139, -129, 52, -40, -180, 14, 143, 24, 15, 226, 25, -24, 195, -241, -14, 159, -160, 78, -22, 136, -155, -101, 30, 41, -149, -72, 184, -257, 81, -16, -205, -180, -93, 273, 106, -5, 266]
7734B66k77mN5k61K41J6j76J60J14k73K87j72Q7k73N07kn43L27k11M0J91J6J31
7757B46m10N0k5J59l45K91Rj72J94j41K84k22J23M4j55J70j84J8R9O7j92K55N
7780A68k00j72Q5K8J30K36j83k13J16l1K08j09l31K64K5j29k0l2j85M42o8r9K73
7803B03j76M8k7M3j76N9J53l37Mj0L26j46J07j03QK9j95K74j67l7J36%k0j39j0
7828a53K29LJ74j42q3J65J22l83r0M50l94j68K66j22O1K23k11m3J98k88M15k55
7850b6l4J27N9l55J83J88m06K0K07M3K2O6j53O8M6k38K35q3n3J62j46j93J06M04
7874B49o2j39l3p3M2Q6m59L91K15l28K72k00R7p1k12K65J23l54M16l57K03Oj14
7897c7j3qJ32Pk36K54j9m1K95l20j1j96J48n5mJ35J19l78L53j89J50j9R0k64M7
$$ y = [266, -11, -15, 40, -221, 20, 36, -140, 20, 134, -139, 148, -24, 63, -210, 297, 295, -248, 79, -132, -92, 99, 115, 246, -164, -114, -139, 20, -325, -34, -25, -197, -3, -144, 140, -82, 41, 85, -70, 100, -84, -66, 33, 100, -92, 163, 168, -32, -204, -119, -91, 39, 275, 92, -121, -5, -36, 172, 63, -268, -4, 21, -108, -128, -160, -345, 97, 29, -70, 203, 27, 75, 48, 91, -85, -26, 127, -210, -206, -216, 110, -36, 71, -32, -24, 5, -190, 84, -83, -120, 16, 16, -4, -143, -153, 76, 79, 253, 111, 28, 193, 315, -68, -158, 292, -102, -270, -4, -126, -65, 158, -53, -96, 102, -186, 229, -26, -60, 67, 126, -229, -46, 142, -264, -244, -37, 6, 28, 94, -59, 9, 55, -183, 52, -31, -84, 78, -68, -261, -155, 249, 187, 48, 15, -58, -16, 70, -389, 2, 217, -111, 161, -39, 58, -13, -225, 40, 163, -191, 225, -132, 71, 77, -37, -50, -58, 74, 81, -155, 99, 80, 39, 334, 14, 3, -193, -45, -100, -104, 31, 150, -228, 125, -64, 86, 67, 157, -107, -60]
7922f0L29k88j71K80J05k57pK7K20k18J82l01J71J84mk9k21oK33l35J74j13m1
7945a46J09J97j49nj79K59J15r6j22K12k89L84k29j90k93L09J18oj40J88K44l3
7967B58j50k64P9k9q0K92M1r0jP8m00K63R1n8j27K41k97Q5N8KJ52p5P0j27R9K3
7993A34j92R9j7k08K66r0J40k30j19N0L74k81q1K43j68P2J29j85L24k81r5K42
8015A26j66J00K32k96O7j27M7K32l09j12J44k38M28K08k41r0L8j59P9R5J47j01
8037A04m3k33K47N8m2J9p0L54k57k77K31k50K02J12j10M1m1j47K30L5k49J55%
8060F9k00Qk19M25n3P4Q4j41j73K01j76R7R1j57J02k44M9K09j21j72L75lk38J09
8084dj37K69K2l69N78p38L14J06M5k01M6K69l2k70J47j98L61k36M1J22j13k23
$$ y = [-60, 269, -19, -190, 90, 195, -62, -69, -42, 178, -40, 142, -159, 12, 196, 192, 163, -58, -64, 169, -166, 8, -105, -146, -37, 160, 11, 6, -173, 86, 201, 105, -17, 195, -94, 290, 61, -129, -422, -113, 5, -1, -141, 47, 291, 258, 108, -156, -77, -106, -186, 106, 147, 57, 56, 134, -266, -3, 88, 30, -97, 144, -153, -68, -10, -8, 144, 69, 139, 12, 111, 134, -58, 41, 24, -184, 82, -8, 132, -98, -217, -167, 207, -74, -155, 88, -80, -8, 121, -64, 260, -21, -116, 126, -40, 60, 292, -4, 63, -64, -17, 215, -94, -206, -62, -300, 128, 336, 95, 5, 43, -116, -37, 58, 205, 104, 61, -172, 75, 133, 91, 110, 40, 394, 137, -140, 91, -159, 43, 155, 45, 86, 45, -102, 128, 163, -86, 69, 69, -131, -123, -342, 83, 30, 104, 188, 47, -126, 75, -101, -4, 87, -70, 32, -212, -163, 46, -75, -247, 128, 125, -113, -4, -141, 128, 150, -219, 359, -379, -65, 41, 86, -115, -69, 200, 168, -102, 45, -153, 208, -28, 13, 135, 22, -201]
8106b01J01L00N0o5k52L8L58k98J08l3j15j76M67j8k31J37k93J03J68k97L0q4
8128b03J22L5M2l7J87j64Q8K9j83k12J42O0O3l1N9j67M8K95k53m2J03K9O9j40
8152f1J19J94k54j41K78k43J82j74J30Q0n6K23m37K83qj09R1j56j38K63j4k26
8174a74J99R7nK7j45K6OL01k64L0j4R1j46p4j59J70J04
$$ y = [-201, -100, 200, 250, 185, -67, -29, 329, 31, 139, 106, -9, -185, 282, 264, 33, 170, -123, -20, 148, -149, -119, -203, -81, -46, -4, -41, 146, -18, 70, 99, -84, -296, -154, -94, -31, -62, -3, -170, -122, 173, -80, -122, -19, 10, 79, -61, 58, 252, -2, -143, 135, -108, 74, -100, 30, 110, 54, 277, -160, 123, 115, 6, 97, -59, -197, 66, 52, -174, 25, 122, 117, 144, -1, 25, 31, 332, 68, 98, 84, 175, 29, -45, -204, -34, 70]
8191G0
$$ Imaginary data points
##PAGE= N=2
##DATA TABLE= (X++(I..I)), XYDATA
0@%%%%%%%%%%Qj6J6j6K4l2M0m8N6p2Q8j04J20j44J71j95K29k69L12l59M09m66
32b48N30o01O81p69Q63r68J083j210J350j502J666j846K046k262K498k755L036
49A592l346L687m061M474m935N447o023O678p423Q285r294J0492j1947J3754j6067
64h687J9156k3516L0180m1764O7670k34299J0376J64658k76525J12750J66775
75a3226j7099L6691J25509j08706n866J35101m3757j33795O8355J3394p3270K2940
87F271k00j07234L5367O5289q2218l8739Q4760O203j1886M9726J9281Q282N5992
100I0894j2020n1176K4348K0040o0266l5331R931m735j2727j5959r930M1726K3372
113H167n2874p414N7747o000k6586K7616J600o693N6629J2450n6912J5488N5160
$$ y = [0, 0, 0, 0, 0, 0, 0, 0, 0, 0, 0, 8, -8, 8, -8, 16, -16, 24, -24, 32, -40, 48, -56, 64, -80, 91, -104, 125, -144, 168, -191, 218, -248, 282, -319, 362, -407, 456, -512, 571, -639, 711, -791, 875, -971, 1075, -1187, 1311, -1444, 1592, -1754, 1933, -2128, 2346, -2589, 2858, -3165, 3513, -3910, 4375, -4919, 5573, -6374, 7380, -8687, 10469, -13047, 17133, -24631, 43039, -191260, -180884, -16226, -292751, -180001, -13226, -30325, 6366, 131875, 23169, 17303, 152404, 108647, -25148, 43207, 56601, -16669, 6271, 6071, -101163, -65796, -507, -82725, -121464, -36704, -30501, -42387, 7339, 26620, 34902, 90894, 78874, 27698, 52046, 72086, 11820, -23511, -13580, -18315, -31042, -47001, -56931, -15205, 8167, -44707, -52121, 5626, -374, -26960, 656, 2256, -4437, 52192, 64642, 7730, 23218, 78378]
126G8378l2262n2209J625o028k3635n117j3757o389L4702J6058k0838J9405M2996
139C2929O85j0286Q658q0q27O687j7492k5901J0790K2827k2558m2982M703L4622
153A775o163l6346o695K1259K3802J4881j4594j7355L9266N1328k8664n0923K4926
166A6497L7544k5315l6784j3551j213J7738M260l7960r272M0161R659j9038R210
179h064J1474n02J8610Q133k2424L817K3619j4197j6765J2052p724k2892O823
192h040M030j7710j560N282n532J1157J6887j0450o201K2332J6677l735r838q824
206D475R923J9852j6835l7588M719K6877q343k4731p608P273J8114R927k2244
219a6189j1496L2209K1485j8830j2612J3079J2523J909j0308j4947M606J4246
$$ y = [78378, 46116, -6093, -4468, -10496, -34131, -39248, -53005, -59394, -24692, -8634, -29472, -10067, 32929, 33614, 23328, 31986, 31906, 31079, 37766, 20274, -5627, 5163, 27990, 5432, -37550, -32847, 1775, -4388, -40734, -47429, -26170, -2368, 12513, -2081, -19436, 19830, 71158, 42494, -8429, 16497, 54041, 28726, -8058, -21609, -22822, -5084, -824, -38784, -48056, -7895, 1764, -17274, -8064, 3410, 2908, 21518, 29651, 7227, 11044, 34663, 20466, 3701, 15753, 8029, -14863, -8040, -4010, -21720, -23280, -17998, -23530, -12373, 4514, -5936, -12137, 10195, 26872, 23137, 13299, 4475, 14398, 34250, 17415, -20173, -15454, 11423, 3080, -21651, -29259, -21986, -3872, 6055, -16189, -27685, 4524, 26009, 7179, -5433, 7646, 20169, 22078, 11770, -3177, 1429, 15675]
231A5675j1568k0517L353P962n448k890j190k000J2932J1903j2467m757K3101
244A4089R366j7071o551J0540O059n596j1992r505P660J1972j1447k0048N187
257a7337J8686P76j4246n088J2183J6434j490j3793K030J7139L626j1845n594
270A481L776K76m481l907l826k718Q66J206P81J275R3j10M598O789j42n134o32
287A91O646N320l900q210p50N189L313m894j1613n184Q541R870p939j6389M200
302a5609K2134O545j5426r298J4583J7961m466j9278m591J3913Q946j1240j5426
315a1252J028J3107M175j0887r006N026J1286R1q879k946O588O951N89l285j545
330A041M544N184j552o756k328K815j887o693k091L496J07l788J475O715K423
$$ y = [15675, 4107, -16410, -13057, -5095, -10543, -13433, -14623, -16623, -3691, 8212, -4255, -9012, 14089, 23455, 6384, -167, 10373, 16432, 10836, -1156, -10661, -3001, 8971, -2476, -22524, -17337, 1349, 2125, -12121, -17209, -5026, 11408, 9918, -3875, -1845, 15294, 18920, 7075, 1481, 5257, 5533, 1052, -2855, -6681, -9399, -8533, -7327, -6546, -5271, -5178, -5288, -690, 6099, 5957, 823, 191, 6837, 12157, 8257, 47, -703, 4486, 7799, 2905, -8708, -13892, -5351, 4519, -3420, -19809, -15609, 6525, 13070, -2356, -11654, 2929, 20890, 16424, -2854, -7445, 6468, 15414, 4174, -11252, -10224, 2883, 7058, -3829, -12835, -7809, 3477, 3568, -5311, -8257, -1669, 5282, 5871, 2586, 1041, 5585, 10769, 9217, 2461, 133, 2948, 1061, -5632, -7723, -4227, -4120, -7908, -6433, 282, 2705]
345B705l491k54N084L237k428n337o46N185K985m409n283K489N612j583p600l219
361f953M218J873m537l547L669N500J007l4L123L071L10k486r12R95j677n517
377a897l323K098K967j687l451k08M822M074l539n423P35N872K931l326m882J839
393b398R551N673q092j0028M910J0700m292j5047m715R447O515n396q096L134
407h134J0968O024m895o658K348P527O91o770m098K387L786J335k858m999M98
422b848M821l50m952l079m9L305L546q21l374L457O608J15k064p7k143p30L337
439D702k163p956q93N474N99k293j892j166L387N813k991o487L186P201Q89l901
455A509k353K840M862j080o542j942M557m64m447j768K78J746J497j454l61L494
$$ y = [2705, -786, -1040, 4044, 7281, 4853, -484, -1130, 4055, 7040, 2631, -2652, -163, 5449, 3866, -3734, -6953, -2735, -862, -5399, -8946, -5277, 223, 1230, 1196, 4319, 7390, 7700, 5214, 4302, 5297, 3620, -1897, -5220, -3122, -155, -1842, -5293, -5501, -679, 3395, -144, -5567, -4832, 1040, 3971, 645, -4237, -2398, 7153, 12826, 4734, -5294, -384, 10316, 6024, -9023, -13738, -4291, 2224, -3172, -11268, -8134, 2834, 8858, 3963, -2695, -347, 7180, 7871, 1101, -2997, -610, 3176, 4511, 1653, -3346, -2848, 1973, 1623, -3329, -6408, -6457, -3152, 394, -427, -3801, -344, 6264, 6379, 4315, 4238, 2095, 1365, 4702, 2539, -5417, -6310, -836, -237, -2530, -4422, -5588, -2201, 3612, 621, -5866, -2680, 4521, 5410, 1509, -844, 1996, 6858, 5778, -764, -2706, 1851, 1387, -3060, -4828, -4550, -2804, -1307, -2761, -3122, 372]
471C72R53j457J295K038j130N41O52j796N50J960l317l481O38O00n64n6l865j182
489g249P885L314p227j356Q305K940m138l029k04L287L138m329n240K584M273
504B954k207k507j335j720K269K162k855k657L016L548K548J482l224j250N245
519E469K751o045n158R41K009P99k786m264J411N788P24k983j068J37K100M080
535C905k315n331K710O403K84l318k185q2L813J239o852n995L821M704k773m239
551f211Q72M603M431n29l635J046L941j16j993j396j950L85K867r03l889j79K509
568a47J89r67j597j027K034J557j068j66J657J624N88L22J62l4l02j538j607O7
586b53k93k961k24K590k6j947J342J744N3K22P06l35L42J140J10n05p92J14n0
$$ y = [372, 1325, -132, 1163, 3201, 2071, 2612, 3264, 1468, 2018, 3978, 661, -2820, -2182, -1582, -2146, -2202, -6067, -7249, 636, 3950, -3277, -4633, 3672, 6612, 2474, -555, -759, 2528, 5666, 1337, -3903, -1319, 2954, 747, -1760, -3095, -4815, -2546, -384, -3239, -5896, -2880, 668, 3216, 4698, 1474, 224, 5469, 8220, 2175, -2983, -2042, -33, 766, -2020, -6284, -4873, 915, 1639, -1344, -2412, -2275, -175, 3905, 1590, -3741, -1031, 5372, 5656, 2338, 153, 71, 3884, 5123, -1729, -7724, -3903, 801, -1972, -6211, -5339, -736, 3695, 3166, -469, 577, 4518, 4402, 2409, 1013, -937, -552, 2315, 1412, -2477, -2656, -147, 42, -925, -2522, -3549, -1515, 42, -1026, -1192, 465, 2089, 2677, 2999, 3161, 3127, 2825, 1287, -320, -253, -546, -3507, -3731, -1141, -1167, -3114, -1772, -28, 25, 247, 953, 618, 960, 2100, 2210, 1705, 913, 1027, 977]
605I77ok63k417j243J390J374j388k486O43L015K516j665k340J646L858N76l265
622I22j360J681J161n4j936l141m66L029R36l379k424J882L834J148k061k108
638b336K044M855J45m883j722L471K597k500l340m94K131J910k045k961o8J845
654a351Q56M25j633j169K766L763n73l745L65L723J024l110k352l92J134J439
670A170k109k648O89K780L00j170m38P71J231R50j86j315J41J257R86k48j200
687I61j170J158M51j942j915R00P21l61r13O99P86J024Oj28R66O52n05k42L71
706A519K8q37r42N1P95q9k072p96J347Q75j221j72Q86N1P80J540l54j545Q26J497
726B167N6j265j749K20K027P7k940j632J938J238n18j650m80J646K480q29j781
$$ y = [977, 971, 708, -1709, -2952, -1562, -188, -1576, -4062, -3419, -404, 2112, 447, -1893, -247, 3611, 4187, 922, -438, 1243, 2404, 2350, 414, -2727, -3193, -164, 772, -2607, -5031, -3149, 685, 1833, -228, -2336, -292, 4563, 4708, -175, -1897, 1574, 4171, 1671, -1669, -2163, -32, 1878, -167, -3128, -3196, -1351, -495, -70, -1703, -2872, -106, 3657, 3084, -661, -296, 3427, 4451, 1341, -1011, -1403, -269, 1170, -939, -3587, -2898, -118, 182, -988, -1426, -655, 576, 1526, 1340, 25, 166, 1423, 2409, 2161, 961, -209, 949, 1400, -542, -2457, -1557, -836, -1197, -2110, -1411, -625, 399, 405, 277, 1243, 1895, 1390, 1148, 1519, 1547, 710, -232, -181, 614, 525, -1547, -2343, -996, -121, -1342, -1514, -628, -577, 203, 1743, 1389, -156, 670, 2167, 2223, 958, -791, -571, 1456, 1533, -1407, -3039, -1101, 137, -381, -2031, -2511, -865, 1615, 786, -995]
743i95N21K344Q74o93j162j512P84J984j010l338j013K540K096j464k656K02K884
760C86J759k305j443J143J723J159j114j610JK183L91j906j460k51J030K69r52
777i97k066J54K701J355j475j085J096K545M54j711j438J044J243m41j809n95
793a025O13M89k70q84n26N32R18l27k75j16P59O83O87o89j36M33Q34Mj392o27
813c15M55O2r90n35L73p6j94m2J061L16j59j27P47Q60l51n97j24K98L76n88o78
834b28o39J038J04j066n62J27K84O13K00p67m65J372J672n28j021k92J649J048
852B539j161k338K55J215L67k141q12J48J678P10j159o42M94J647J012j148j216
869e52L92J727M48j491j458M1J839P39j971j866P16K276o52k158k49J667J477
$$ y = [-995, -474, 1870, 2744, 2051, 889, -623, 161, 2145, 1135, -2203, -3216, -676, 1420, -44, -2700, -2498, 386, 2145, -160, -1603, -460, 1263, 2422, 1308, -302, -301, 1882, 2273, 367, -1093, -1344, -314, -45, -997, -3063, -2909, -208, 1147, -328, -1413, -317, 2228, 2682, 971, -467, 577, 1820, 1379, -430, -1025, -412, 77, -193, -1077, -1603, -1071, -153, -480, -755, -871, -112, 571, 1258, 569, 433, 866, 1700, 1704, 312, -315, 140, 202, -788, -1323, -950, -1026, -1220, -1262, -201, 115, -44, -171, 576, 1436, 1085, 488, 364, 662, 1038, 450, -228, -867, 171, 275, -791, -1353, -1226, -942, -329, -129, -896, -1361, 11, 1683, 1155, 134, -158, 1491, 2539, 1378, -960, -705, 510, 877, -1264, -2076, -1928, -250, 460, -699, -1341, -847, 800, 1812, 664, -552, -160, 1567, 2015, 524, -934, -893, 946, 1685, -286, -2152, -1436, 840, 188, -1970, -2219, -552, 925]
886I25k10o22m67J208J177J9j607n87K25O86l02j617p42R97J227l37j255j14J038
905c58J458l80j353l5J848L08q23o84M77L47k30m93l26k68m82O80Lo17o48J223
925c53M31j3m84J017j23L54l5p9j82K26k74k84K4r3q21n09N29R9m4l33J5P56Q95
948G19o24q32J192J060n82l15n04K63J20L25p66j107J12O37K29o27q71k5J786
967A90P05j210q59J258J670l2j222j009J114Q10r12j469N7N89N05J08j251o87
985a645J097J398n33r15p9N21J358N89j994m64J748M80o66j247j49K41J065j008
1003b03j536j8J709K08o19l9L77N60O95L9j287j39Q48O92j009l99k47N11L65p20
1023b12p35L4J061l86m18l02K68R40K18m29M4N43M26k63j38l64m43J98m7p9l51
$$ y = [925, 715, 93, -374, 834, 2011, 2030, 423, -164, 61, 747, 445, -1172, -1914, -917, 310, -27, -1282, -1396, -358, 1100, 720, -633, -668, 1180, 1488, 665, -19, 458, 805, 575, 82, -244, -512, -994, -314, -311, -928, -1576, -353, 78, 65, -419, 598, 475, 829, 794, 715, 533, 759, 485, 201, 225, 132, -689, -1198, -669, -570, -614, -947, -932, -176, 719, 95, -737, 455, 1515, 933, 618, 114, 377, 497, 822, 56, -1051, -939, -302, -73, -700, -1571, -1596, 190, 895, -315, -1174, 84, 1754, 1722, 500, -509, 605, 1415, 503, -966, -909, -320, 185, 293, -958, -1645, -548, 850, 317, -598, -677, -156, 1202, 1791, -203, -667, 1081, 1561, 895, -352, -501, -260, 805, -203, -1739, -1757, -48, 160, -459, -498, -121, 439, 1134, 1173, -114, -253, 595, 1287, 278, -121, -368, 143, 508, -212, -947, -913, 148, -238, -656, -958, -690, 250, 468, 39, 83, 626, 1052, 789, 651, 287, -156, 42, -5, -84, -435]
1044d35j44JL67j63q2K24N20m6k03R2M63k09j46J99L48o54n53K68L97l40n75o48
1066a319J025N69n87o25J82J002N49n86j95O1M11L44J78q36o18L31O99m49p50
1085f14p99P14J092n16p28k44J579M44n79m17l36R88P68j086r46K3J305q9k15
1104C44r54j33P13N02p04p09J82R34M63o70o11L31J562j44m40j052K56Q70m91
1123B49p10n92N17O51K73p71k88Q04P9J67m95j61K38M76j83k50p5pQ14Lp96l17
1145c74O18K49r47k39K82L36pJ95p4j7M5K54J23j47m9p09J83Q52l84p45L85M51
1167B81o33J24K10q3Q9q4r6P7K15j59m6N96j10o45k50R73j14j54m64j80P02j02
1189A47k48l24K7N04q0j53j50K71M2K13M0m91L8N42L75o76o46K10Q39K1p60o30
$$ y = [-435, -579, -578, -211, -374, -456, -232, 288, 242, 39, 131, 594, 385, 239, 438, 786, 132, -421, -153, 244, -96, -671, -1319, -294, 275, -312, -937, -755, 247, 796, 210, 15, 76, 487, 831, 1009, 173, -445, -114, 585, 136, -614, -1413, -699, 393, -123, -851, -1095, 484, 928, 349, -68, -404, 584, 1352, 266, -680, -657, 648, 559, 344, -610, -743, -30, 472, -232, -941, -759, 175, 638, -32, -643, -312, 1250, 1106, 666, -386, -130, 740, 249, -461, -1053, -536, 115, 388, -383, -671, 133, 212, 379, -116, -277, -39, 437, 254, 4, -71, -78, 736, 739, -57, -374, 244, 493, -454, -693, -411, -75, -82, 113, 39, 22, 67, 321, 444, 297, 248, -461, -278, 574, 190, -555, -170, 281, -352, -228, -18, -101, -12, -96, -192, -115, 100, -59, -105, 491, 381, -264, -514, 459, 345, 191, -273, -453, 249, 147, -101, -425, -398, 106, 26, -127, -277, -6, 36, 249, 289, -202, -164, 378, 753, 77, -569, -359, 480, 501, -259, -889]
1211h89O23R12M9q78l95N92J00J09m95j32K68N45J72o64j64J33M35J8n62o78O22
1232b79N03k77k70m53P94O54l36n23j60P87L9l39k40k68N62K8R9l7l58K67M09
1253F02l46l37k74K7K63n3l65k1P97J01j88q4j42J61J3k06k37L10J7k37K8K95
1275A24n09M79j2l14R5J8NJ63J16j06K90m91N43j95m2j63O7k39J57K86m30k93
1297d51K00J31K06j30l81K06O06n4n19j74M28K12J31l84k88L23J58J36j83p29
1317e56R2N42J47m05j48j9M18K73o87k38M24M81K00p59m3M14K98n79k16m7L67
1338d1R3j28m93K45L17M32k07l33R0J96J63L02r35M3K96M73n45n74K31K59o9p1
1360b56k60L93l7Q7J03n55M27M09N3m11J91M6j25L91n84o5K28j74r9o8o8L64J25
$$ y = [-889, -266, 646, 695, -183, -578, 14, 114, 223, -272, -404, -136, 409, 581, -83, -247, -114, 321, 339, -223, -901, -279, 224, -53, -323, -776, 18, 672, 336, -187, -347, 440, 479, 140, -100, -368, 194, 222, 321, 284, -74, 193, 602, 256, -81, -355, -328, -65, -118, -483, -504, 293, 394, 206, 122, -20, 141, 154, -52, -289, 21, 38, -199, -171, 124, -385, 94, 82, -232, -137, -119, -114, 49, 165, 59, 349, -142, 401, 206, 164, 1, 68, -171, -14, 272, -158, -451, -251, -120, 86, -44, -425, -219, 387, 333, -186, -360, 68, 280, 411, 27, -261, 62, 220, 356, 173, -556, -464, 78, 225, -180, -328, -347, 71, 344, -343, -581, -157, 324, 524, -235, -278, 136, 434, -145, -361, -408, -41, 52, -76, -569, -324, -7, 425, 218, -115, -25, 171, 334, 636, -299, -256, 40, 513, -32, -606, -375, -116, -185, -256, -516, -123, -160, -73, 30, -525, -98, 311, 364, -47, 144, 190, 65, 456, -128, -193, 35, -139, -238, -306, -374, -10, 115]
1383A15j53n8K17r4R8M3P6J04n7l78J50R7M11p34Qn2K35k20j7P2J25J09Lr9MJ7
1409B2l5M97n48j31L22L5L5k44k68J49L60j67o57J12O27K54m11J44l59L63L42
1430D42m69l2J61K31L0k71j11k27K97J87l52n11K21M87J14k39q2k42N53K05l70
1451B2k88q4O24K27n45l91O20k37K69j88k73k1L58j18k5k40J99L03J39n78L42
1472A15k92L24r3o0l78N81q1r5k11j41K71k56J3P9L9M2L81m12L68m9o3m2M39n31
1496e2j20J16pP2k56K7P2L79l38JR2Rj02M3N1M1JN6K1R6l02J1K12k10P7m2o1l6
1524a49R4k55J25o0K99K4l9o9r8J73J86j24k78K11l33K86J4k40Q4P3L76m41J25
1547a6j41J21P8P5k43J72%J41J7l50J68N5J59j76J76o08K53K61j80k22k1K53J36
$$ y = [115, -38, -96, 121, 27, 125, 168, 244, 348, 291, -87, 63, 160, 571, -163, -155, -207, 28, -192, -209, -137, -12, 97, 100, 1, 5, 22, -13, 484, -64, -195, 127, 162, 197, -47, -315, -166, 194, 27, -630, -518, 109, 363, -48, 96, -263, 100, 442, -27, -59, 102, 333, 363, 92, -19, -246, 51, 238, -114, -625, -404, 83, 197, -42, -124, -366, 187, 392, 22, -266, -350, 274, 501, -44, -435, 185, -52, 217, 29, -244, -265, 93, -25, -50, -290, -91, 212, 351, -227, 115, -177, 147, 54, -6, -384, 197, 116, 21, -190, -331, -60, -316, -303, -224, -185, -143, 238, -174, 194, 145, 82, 40, 479, -52, -172, -56, -63, 9, -247, -220, -148, 231, -107, -106, -14, -5, -107, -64, -13, 28, 29, 85, 106, 202, -100, -89, 123, -87, -10, -52, -113, -149, -55, -310, -185, -245, 54, 78, 39, -30, -128, 45, 231, 107, -171, 40, -293, -7, 7, -233, -149, -76, 300, -141, -16, -157, -36, 42, 117, -126, 46, 46, 187, 204, -146, 22, 77, 236, 60, 236, -372, -119, 142, -38, -260, -281, -28, 108]
1570A08m2k88J88K70j77j9p3L5J54k49M9J93l43Q1M38k4j74l29M69j96P3l99K00
1593e5J16J10k12j06L40QJ64l93k46J06L60j77k21K35l20M3L16r9k2k62L49J37
1615A71O4k65K1p2o5K08k85M32l06r4n4L96j42l19L65J1k21J23R5J39n7N7j37
1638F5K67k39j26n1p1J99j92J57J11j64J18k57J58J53k12p6K22N0k07P8j25J68
1660B6k7j28j83M2L93j98L4jj66O2M78k93kj29o3K64M4P0m67L67j38M45l56m3
1684C1K60k04J17l85JL85j87j10j25J58L18k70j96m6N45m9n1l17J13p8K02R3l16
1707a11K00r8K03k3J09m05kM05p02K44n0K11Q2j1k6k36L55k51N8J38j11R3L1M9
1731A52o9q0qO0j0q6O0j24l9K28k63L98m56L12J51l51J33k45K38O3l6l40o5K45
$$ y = [108, 66, -222, -34, 236, 59, 40, -33, 2, 156, -93, -44, 149, -194, -113, 325, 301, 127, -202, 267, 71, 144, -255, -55, 61, 171, -41, -147, 193, 201, 365, -28, -274, -168, 192, 15, -206, 29, -291, -248, 68, -31, -53, -315, 34, 171, 235, -30, -9, -81, -146, 62, -223, 209, -97, -191, -245, 151, 9, -310, 55, 66, -155, -32, 63, 202, 145, 202, 65, 332, 93, -33, -84, -155, 44, -148, 9, 120, -44, 74, -183, -25, 128, -84, -160, 62, 112, -95, -17, -142, 26, -1, -129, -312, -270, 123, -75, -41, -42, -208, -146, 332, 39, 37, -92, -155, 109, 153, 223, -244, 123, -15, 430, 74, 31, 291, 87, 204, -181, -180, 205, 18, -92, -217, -59, 259, -11, -207, -253, 292, 243, 192, -125, -12, -90, 112, 205, -111, 89, -9, 194, 171, 280, -125, -127, 278, -424, -180, -230, -19, 63, 52, 26, -210, 145, -106, -48, 90, -21, 72, 103, 152, 83, 3, -5, 55, 45, -41, 19, -105, -144, 84, -179, 219, -237, 75, 226, -125, 8, -237, 1, 64, 28, -312, -377, -132]
1755a32K58k89L63j78j53J84J91j87j60l3K71P4k72M2P0m04L89j6m7R6j66K00
1777A01k64L1q3K57N6k17j21J16R6M9K8j06J22J71m42j6J80J95k60L42k83j66
1799b14L83M6r7j29J00N1j64L57l47n2j25O9J86k69J14o8L91j70l89J96J91k4
1821C6m1k4j81N0L65Kl46J53j59K44j20N4k43K46K61j93J68l80K73j18k38l8L02
1844G3N0j65q9L23k48N5M11m33K35p2j78J49J49j27j11p7L7n9J72j2k66R3J05
1867A5p5j5k01j26O20o4j35k31K46K63j87j24J86j71J89j65j53j19L55j0L2J67
1889B97l83J44j19o8o3K00k10M18k18K6J22j27L49k80K9r4j05p0M12n41J25K97
1911A41J19j58j89J36j98K52j31l13J41M56o8O5m53j6L52j36n1k58M75r3K36l54
$$ y = [-132, 126, -163, 200, 22, -131, 53, 244, 57, -103, -136, 135, 209, -63, -21, 49, -355, 34, 18, -29, 67, -99, 101, -163, -132, -215, 42, 98, -119, -240, -124, -28, 21, 49, -57, 65, 236, -206, -222, -42, 153, -107, 235, -48, -214, 169, 215, 118, -11, 89, 140, -24, 333, -14, -66, -191, -122, 64, -205, -91, -159, 232, 62, -327, -131, 60, 36, -5, -29, -210, -160, 205, 207, -139, 14, -145, 99, -21, 33, -210, 36, 297, 104, 272, -108, 165, 47, -191, -229, 73, 123, -42, -131, 192, -56, -1, 410, -23, 212, 140, -38, 111, 260, 133, 22, -55, -18, -77, 95, 83, -183, -90, 15, -60, -75, -276, -402, 218, 154, 19, -212, 34, 297, 110, -14, 172, 1, 190, 25, -128, -247, 108, 98, 130, 297, -86, 58, -61, -129, -192, 8, -202, 216, -2, 24, 146, 19, 368, 88, 117, 23, -82, -152, 260, -281, -156, 141, 260, 102, -87, 49, -149, 103, -28, -341, -200, 256, 188, 253, -200, -216, 136, 0, -51, -309, 166, 73, 309, -45]
1933d5j40J40O3oM4J17j89o9J44j43l20N72k28L07l74J87j52k02K61r4M63j96
1955A40l88L15r5J53j14N1m13L67pl7M23m24k21j8J96J81j04J01k86O2o8K95K7
1978A36k03q4J66l4j99P6J65l8k12K97k63L91l0l01K13o1q6J43q0K90k29l52L82
2001H7q8j08J01k21J48K00M93p68q4J07J21J89k90%k40N26k12J10k67J43K84j20
2023A11j76n8K28k28L39l76K20N9j79k8J00m7J16M4j83K00j27n1n8Q7k82M13n2
2046G2j62O8k17L22q7P8Pj22J22J25k92M26m71L5l5N8J84k02J10J83m8l20J46
2069b0L14k97J42q2k78K23J31j40j9N0k47L38k44K04P2k96L40j78j5j4k67O77
2091C94l25o4l8r3J86M0r1Qr9K15p7r6J86p9L4j87k03M73j36l89L65J56k37j72
$$ y = [-45, -185, -45, 18, 12, 56, 173, -16, -85, 59, -84, -404, 168, -60, 247, -127, 60, -92, -294, -33, -127, 336, 140, -248, 67, -28, 125, 11, 62, -351, 16, 9, -28, 395, -29, -250, -268, -72, 109, 5, 106, -180, -118, -186, 109, 136, -67, -151, 15, -19, -218, -142, 23, -15, -227, 70, -193, 198, 168, -133, 80, 19, -67, 76, -4, 286, 57, -295, 87, -1, -109, -8, -229, -81, 119, 612, -156, -240, -133, -12, 177, -113, -113, -353, 173, -39, 71, -196, -53, 231, 111, -65, -123, 105, -123, 216, -160, 60, 119, -60, -88, 12, -35, 81, 125, -58, 142, 15, -36, -94, -7, -289, 124, 72, -90, -22, -239, 83, -4, 74, 81, -41, 81, 206, -86, 340, -131, -96, -131, -73, 111, -91, 19, 202, 154, -166, -20, 294, -3, 139, 57, -221, 2, 133, -7, -26, 24, -223, 115, -129, 75, 147, -149, 191, 13, -2, -16, -283, 394, 69, 5, -33, -126, 60, 100, 9, 17, -82, 133, 56, -40, 146, 67, 101, -86, -289, 184, 48, -341, 24, 180, -57, -229]
2115b29J90j54L26k27J56P2j04J79l25r8K55j27M9K74l48q7J95P8jN5j39K77j74
2138I3K27l42r4j7L4J53J7j14J24n5r5M9j57L4K90j67J74k68J6P5L25k68j90O7
2162h9J59l9j74L42l78L82k75N7j92J10j07K98q6q7L6J9l92L70j15J68J52j01
2184E8k54L60k37O5M4M9K16k17J23j89J21j70N4l2J22k47R9K04l66J03R2j62P8
2207h6J2q3R7J04l1k4P3j93pL66N9k06j45J73k42L11k88N7L0k51J11K76k88K61
2231H6q6j25L25l48K89k70J13j76K34j9rk11L57j41k28N2L0L03J7n5M1j49j65
2254a35lj51J51K03np5J03K5j43J59k52L01q8m8q9J94l76J88J79J66j52k32N1
2277b9p4J22J3k4K48k99k9M1L4q0K5L21j77j69o3J81p1J33j26n7N1J39k81J47
$$ y = [-229, -39, -193, 133, -94, 62, 134, 30, 209, -116, -214, 41, -86, -37, 237, -111, -198, -3, 75, 74, 129, -10, 267, 93, 320, -22, -116, -133, -99, 54, 71, -43, 81, 26, -69, -20, -177, -143, 147, -20, 154, -114, -98, -23, 302, 34, -156, -89, 70, 31, -143, 199, -179, 203, -72, -15, -207, -97, -204, 94, 8, -79, -43, -24, -416, -46, -161, 7, 159, 58, -196, 164, -73, -8, 36, 85, 301, 84, 207, 18, 139, -31, 23, -9, 113, -134, -35, 169, -197, -94, -2, -164, -86, -74, -157, -60, 44, 13, -11, 62, -131, -138, 228, 287, 81, -64, 109, -133, 178, -110, -53, -23, -274, -163, 113, -175, 86, 0, -125, 200, -148, 141, -129, -16, -192, 42, 23, 14, -197, 160, 19, -209, -157, -127, 176, 193, 138, 179, 30, -135, -138, -289, -138, 65, 60, -15, 88, 113, -30, 129, -123, 178, 90, 42, -47, 147, -229, -41, 138, 304, 152, -80, -29, -103, 19, 32, 8, 256, -43, -72, -31, 3, -77, -52, 269, 92, -77, -140, 41, -30, 103, -23, -80, -29, 110, -171, -24]
2301b4J8J39n30N55J12k82K30j61j64K12j9j81J70n0p1Q6j36J47q8J42l55K32
2323a8J64k23k9J65m31M20Ml90N25Mj74K52m14j8J56K01k65l2K62j18J9m41N14
2346A33P6m78M9K7K49J3kJ45r1j24N4M5k6j35P1J27k08R8Kj45j66L63q6j14O4
2371e9O3P9j20K81j72j85K46n5jj82j4R3K04l89j06J08L97j12j3R0j77K04n3k07
2395h0O7J42NP3k20o0J6J88m18N78m34K14J02r2k33M37m31L57j96k03M11k07j12
2418i6K26j98j9K46k51k8q4K94n3J34j17j72L2J57J2J8J42l15J52j9j90J50N4
2441G5J83l58K48q4k75J23J37k10J81n1N2j3J26P4l2l51L7K52k19J41J21k49J74
2464H2p0k24O8R9k17L35J07k38J13j92K20m0K56k76K09J12l98R7r7K31j60N3j81
$$ y = [-24, -6, 133, -397, 158, 270, -12, 218, 57, -107, 105, 86, -95, 75, 25, -46, 40, -96, 51, -37, 105, -250, -18, 146, -77, -106, 59, -372, 48, 52, -338, 187, 191, 17, 269, -145, -163, -7, 194, -71, -103, 159, 41, 60, -381, 133, 209, -269, -220, -193, 56, 69, 67, 212, 121, -3, 51, 96, 70, -65, 6, 133, -75, 23, 25, -120, -286, 77, -9, -123, -59, 4, 83, -37, 244, 72, -113, 133, 78, 77, -105, -119, -26, 178, -211, -317, -209, 188, 76, 63, 153, -24, 180, 127, -80, -13, 129, 134, 207, -13, -73, -57, 131, -287, 291, -143, 71, 173, 81, -152, 285, -146, 211, 15, -188, 223, 16, -96, 130, -68, -87, 159, -92, -120, -204, 90, 37, 171, 54, -118, -86, 71, 83, 101, 243, -72, 80, 61, -129, 21, 75, 258, -100, 148, 64, -211, -88, 49, -161, 20, -31, 21, 8, 134, 208, 176, -175, -138, 114, -105, 36, 157, -92, 82, 12, -212, -144, -45, -262, 73, 180, -58, 55, -137, 83, 43, 299, 23, 232, 344, -54, 43, -54, 177, 17, 70, -111]
2487a11J58k2J51J8l47J26lJ55k47%R7j72K79j02o7K63Q2l80K24l6J88j18j14
2510B2q1m4r0J37n1N4L71k95J95k39j51J70j12K27j53J68j04j57J83k85L12K4
2532A01O8l36L4K38J12l70K3L45j83j15m7l8J26M23l63J8L2p6n6K58k45K4J46
2555A19l36K83m05M28L1n1%p7k0j79K50j09J52k88L61m20K49k1n2K1j8j76K81
2578B3n2Q0j06L07j24j50L84p18M82j69J13j25n0K53m00K43m0J78k69K28j15K31
2600B04Nj03j52Q4k14K63k0nLl53J22K7Pk6L33m36K13j83J34k0j1K26j41m0K59
2625A76J01l86J54j05M0Q3pk9q9l8K77N0k32j15J4k6L58k62K40j35J1k09J79P8
2649A28k88M89m48J06m9m7L17m45J03K76%l2j38M%K9K92m56R2K62j30j69J52K17
$$ y = [-111, 47, 25, 176, 194, -153, -27, -30, 125, -122, -122, -25, -197, 82, -20, -87, 176, 258, -122, 102, 66, 254, 136, 22, -59, -103, -193, -56, -107, -53, 318, 23, 218, -21, -172, -2, -114, 113, -40, 128, 24, -133, 50, -235, 77, 101, 169, -167, -133, 105, 217, -153, -130, 215, 32, -83, -130, -168, -42, 381, 18, 36, 68, -8, -64, 194, -51, -27, 119, -217, 66, -339, 89, 120, 69, 69, -8, -28, -207, 43, -66, 86, -202, 159, -261, -12, -33, -85, -64, -82, -258, 23, -29, 51, -55, 252, 128, -22, 362, -356, 126, -43, 70, -55, -105, 148, -252, -9, -49, 129, -140, 88, -27, 204, 209, 106, -46, 38, -176, 87, 67, 62, 65, -288, -166, -139, -132, -158, 175, -261, -48, -231, -97, -117, -128, 98, -43, -83, 176, 277, -109, 45, -60, -20, 63, 56, 27, -62, -100, 177, 227, -5, -120, -106, -132, 226, -36, 204, 69, 80, -129, 50, 128, -160, 329, -119, -13, -62, -109, 208, -237, -134, 142, 142, 110, -28, -24, -24, 5, 297, -159, -67, 195, 65, -104, 48, 265]
2673B65n49nK13k3j54K19l1J85p0k47L69k63N1l0j9J78J1k28J00k89L94j4m71
2696d08M19n0R8O0n3j52j98K66k4j08J63jKP5k33L54k6L9r7j27o6K28j03j00q0
2721a22L49k51L23m7o1m50P5J79q6L9l8pQ8J61r2j77K17p7J05R3J4%O6m14O3K24
2747A74Q6m07mO4R2p9n0J78J5J02k02J31K21k08l10J16M3l0j59K02K21j06r4j47
2771a51L70n7m21L29K46l15p8j07J42Q7J56j58j12O6K05l95K31R3m23K38J5l6
2793g5j4K74k08R1j80K68q0q4L1O5n3m1o6j2P4n2J23j70J82k39j36K95KJ00j93
2818i8K52j01L9O0l59K42J3l9jj85L31o1k14K6r4K23Jj5m2Q1k24K4J34j36L21
2843A78l82J91L06k32J87q9L0k97M41m67Q5K33q9N2k83M4p0R4J41j76j27K1J83
$$ y = [265, -284, -289, -76, -99, -253, -34, -65, 120, 50, -197, 172, -91, -40, -70, -89, 89, 100, -128, -28, -317, 77, 63, -408, 11, -39, 59, 119, 66, -86, -284, -18, -42, -150, 13, 12, 14, 89, -144, 210, 184, 223, 126, -1, -67, 161, 58, -42, -122, 227, -24, 299, 252, 191, -259, -184, -5, -91, -52, -90, -97, -9, 152, 60, -117, 100, 23, 128, 221, 235, 235, 301, -113, -50, 174, 260, -147, -151, -87, 5, -74, -124, 54, 69, 171, -31, 100, 321, 113, -197, -81, -38, -68, -227, -25, 196, 90, -4, -151, 219, 162, -259, 70, 316, 1, -77, -184, -42, 45, 201, 43, -69, -3, 202, -193, 38, 131, -292, -54, -39, -75, -89, 185, -23, 68, -112, 156, 76, -8, 23, 88, 35, -6, -72, -84, -10, -62, 61, -109, 73, -166, -302, -7, -5, 95, -98, 154, 53, 92, 152, -207, 35, 48, 9, 8, -177, 154, 93, -121, -95, -189, 34, 35, 20, -22, 59, -165, -141, -7, -143, 178, -204, -13, 293, 61, 248, 159, 189, -108, 333, -134, -49, 184, 95, 147, -136, -92, -162, -68, 73, -103, -230, -209, -26]
2866b6K50j47k15PR4N3l35J76J71N8m1l3m8k12o4M18j48j1R7j80L86m30K21lj97
2891a59Q5J57k18m2K70j59j82K05r2L38j04l8j09r2K68k02R4P1j40L74l21J53
2913A57q5l39L48j98J17J0j61J86P2j87Q6j05K54k8j26K1K02k02J95k06nK16j66
2936E6Mq3j12L36j88Q4j12l66O65j91J47l06J80K4k34j8J27J44q3r1k44N06l99
2959a54O3L15l27R1J78m33L92j08j32J60l9J24j21o3J00J5J73k44K2O0k2m3Q6
2982I3mP7k77J98R1j25k85J81q8j77L88n4k12M09j2k43m0n2oo6O7J58j7n7q0J85
3008E2n6j21M9J29J16n13M11j59K10L6j09N0l49k0M05k46O7q9j15N97k47J5j52
3031c9m0K50k5M6l8l1k8M6L6m59J13K45K09j68j11j95K62p8n5L6l0J5K91p5q3
$$ y = [-26, 224, 77, -138, -131, -37, 16, -319, -143, 28, 86, 45, 12, -36, -248, -312, 106, -42, -53, 44, -136, 250, -180, 41, 38, -159, -74, 83, -135, -177, 93, -66, -248, -43, -135, 203, 99, 61, -48, -140, 128, -74, 20, 91, -49, 325, 4, 157, 72, -267, 81, -117, 0, 10, -151, 35, 107, -80, 6, -99, 155, 127, 1, 22, 224, 22, 217, 11, 6, 222, 56, 60, -23, -135, 201, 13, 97, -15, -381, 284, 93, 240, -66, 114, 138, -96, -114, 13, 157, 74, -17, -261, 245, -154, -91, 224, -103, -12, 166, -267, 125, 17, -115, 45, 6, 130, 9, -54, 46, 61, 234, -10, 12, 72, 50, 7, 93, 89, 166, -111, 87, 178, 53, -232, -51, -139, -316, 72, 18, -194, 215, 203, -40, -80, -132, -138, -204, -137, 21, 4, -53, -133, 52, -4, -125, -76, 53, 169, -344, 67, -92, 118, 154, 45, 95, -254, -274, 131, -115, -48, -137, -252, 345, 98, 113, -39, -79, 171, 146, 192, 154, 123, 95, 141, 177, -282, -169, 76, 285, 117, 6, -189, 73, -5, -60, -24, -54, -39, 252, 177, 94]
3056I4N7l24J87k35K35Kj23M53l55k14N8n3M1J66K4R1N2j90l4m4L4J09J38j42
3080B7k25M0M73l63J43L6LJ24m32K1l9N08j21o7j2l34J67M4k43J30J38K00n5k85
3104a22R2K73j10q6k11Q4J16l72L04Ok2K6J78l68L61n1J97k79J11k76N7K15J08
3127B31o5k50P4j52L37m04J09L29l16O9j59K63n0l41L40j79N7K44K11m77p8Q3
3149a24J55O3k04j50K75J33k42P3O1J62l53R7J15j32K08r9L7l27L08N0r3q5J35
3172F3j57L26l75M01k16K9k42J86j94J06O4r0J53n6J27k65M67k30j34J92o6k95
3194b06R7K29O3j29L6j47j92M78l62J56OJ68r6j07j22o3R3j05m8M48k53K4nk10
3218b47K33k6j02j80M36nr8k8L5O5n0J30l9k08J5K8K3k42J15K6L51k34qn3N6j7
$$ y = [94, 151, -173, 14, -221, 14, 16, -107, 346, -9, -223, -165, -218, -177, -11, 13, 104, 156, -34, -68, -112, -78, 31, 169, 27, -198, -158, 315, -48, 95, 131, 134, 258, -174, -153, -192, 316, 195, 128, 116, -218, -51, -7, -250, -120, 18, 218, 163, -122, -30, 243, 133, 47, -164, -80, 36, -336, -32, -26, -48, -22, 156, -212, 149, 98, 295, 16, 127, -149, -92, 123, 231, 166, -84, -10, -162, 175, -229, -120, 209, -107, -38, -197, 66, 16, -325, 15, -164, -107, 137, 348, -129, -207, -124, 31, 94, -110, -260, 15, 148, -94, -21, 40, 202, -151, -54, 61, -71, 137, 38, 75, -252, 56, 106, 13, -72, 63, -94, 232, -143, 258, 42, 71, -171, 15, -179, -73, -9, -99, 54, -2, 125, -140, 327, 97, -37, 155, 89, -206, -109, 120, 183, 54, 90, -57, -249, 229, -133, 23, 29, 197, 101, -6, -128, -191, -98, -203, -251, 197, -56, -32, -37, -247, -14, -40, -142, -322, 114, 109, 11, -17, 18, 83, 33, 163, 124, -84, -69, -41, -18, -260, -145, -119, 232, -2, -10, -63, -7, -24]
3244b4j16OK07p7J32%oo6J2o6N0o3j44J85n1L15k92q2pM4p6L05m57K88k35M30
3270B12o7k06K2j9L3P2R1k50J40P6j48J53j63J25P4n05M85j05K39k36Nj5K42k35
3294B0r5K89k25qk07N30l25k2l56O18j81m3q7J41P3k39m5L8KN7k09L68k25J01
3318c0J36k13K38k30o5l2K58o5J4R0k09Q3q5J13K93k36j89N0R9j0Or5k03J80Q7
3343a5k88K49J83R0n9j05k40J15m3K47k40K30j93J15j8R0M3q8j41J05m0L47k49
3366I5k0j30J76j55n8nj94M29M7j62J42l17K93j46L59n14L7J10O2N4L0r1k29K17
3390C0J85k11J70j68L7m92N27j63J68j26j0J75q1K33l69K10q6KJ74l50j04K54
3412Ej41K33m05R2L07k88J24K64k11J85j25j07Mj4r1j30K96k04Q6R8L12j37j3
$$ y = [-24, -140, -134, 73, -4, 128, 128, 122, 56, 68, 2, 52, -11, -155, 30, -21, 294, 2, -80, -87, -43, -119, 186, -271, 17, -218, 212, 145, -61, -39, -58, -25, 47, 138, -112, 28, 104, -44, 109, -54, 71, 145, -360, 125, 20, 259, 23, 28, 13, 255, 20, -75, 214, -11, -19, -226, 304, -21, -43, -399, 219, 38, -5, -92, 49, 122, -117, -162, -124, -122, -65, -274, 94, -131, -30, 106, -107, 131, -99, -164, -196, 62, -3, 11, 101, -108, -25, -110, 3, 296, 60, -129, -79, 20, 10, 16, -79, -282, -102, -15, -303, -54, 129, 219, 160, 55, -185, -70, -113, 134, -106, 124, -69, 46, 28, 118, 161, 73, -68, 37, -3, 344, 95, 75, -55, 121, -34, -92, -97, -291, 138, 185, 23, 165, -152, 141, -5, 354, -160, -123, -13, 49, 103, 133, 42, -187, 30, 215, 4, 174, 6, 43, -449, 78, -85, 83, -43, -53, 122, 41, 274, -95, 115, 29, 31, 205, -145, -249, 5, -136, 97, -308, -216, 91, -197, -73, 191, -20, 165, 40, -67, -63, -77, -168, -298, -2, -206, -120, -22, 290, 153, 140]
3435A40k92L76j83k64M31n31L60j84J45K5j83J28r5K05j45J75n3L1Q2l57K68m60
3457c81N34j07j61M06k55j45n5J81m8j54K37k2r3J03K11k58N9oj71L01L8n7l22
3480a65K10o4j18j52K96J31L7k43J64j28q4R5J72m90N81j93k04M32l49k0K25k4
3502A09N2m00K45o1J96q9Q0o5P7k2p0j22R8j09K60k06J16j38J32m5m2J5k64J75
3526g8K28j32Q0M1j70r4M01j7m67J21L10k07N5J34j42j93J51ON8ok10L85j84m5
3550B5j39K27r4K21m29K98k52Q9n7J11j15M9r3J10J4j68M54k82N3k79K64P5M5
3573A27j87k32N79l22R8M2l20P1K29o4j76L30k07j11J3J21P4k99L8RJ93L3j9n
3597A5j50J64l4k44K26nJ60Qk41R5oJ32J14q7k15K2K74m61M66q1m8k56J7Q8p5
$$ y = [140, -152, 224, 41, -223, 208, -323, 37, -147, -2, 23, -160, -32, -127, 78, -67, 108, 55, 86, 168, -189, 79, -381, 153, 46, -115, 291, 36, -109, -164, 17, -31, -185, 52, 30, -63, 40, 251, -7, 52, 46, -125, 176, 214, 157, -165, 45, -19, -137, -289, 7, 138, 175, -68, 96, -32, -116, -21, 151, -339, 242, 49, -155, 277, -72, -92, 133, 109, 161, -239, 6, -55, 141, 52, 132, 67, 144, 122, 52, -70, 28, -81, 179, -27, 89, -49, 83, 38, -4, 11, -253, -78, 150, 18, 98, 139, -31, -125, 276, 259, -208, -87, 223, 16, 71, 205, 63, -130, 21, 27, 85, 79, -131, 254, 70, 25, -114, 113, 19, 240, -189, 109, -143, -54, -111, 0, -115, -66, -159, -49, -35, -203, 251, -31, 22, -257, 7, 82, 127, -60, -292, 287, -35, 63, 105, -215, -144, 85, 21, -155, 175, -32, -143, -130, -9, 65, -234, -196, -187, 6, 39, 20, 15, -135, 29, -5, -249, -23, -28, 132, 140, -101, -6, -12, 120, 234, 147, -68, -46, 228, -233, 233, 152, 104, -152, -135, -47, -122]
3622a22q6J95J6J26l14L91l81K02k84L91k68K56k26L86k03l2j78j38M86l66K44
3643I5o2p6J81j94j40K19k35J45j95L01J01l1j24P1j03J92M8K21l34k61J29J02
3665E0j53K8K72n04K17K50r7j08J27k03j10L00Q8k30L23k6p4l30k7M2J46q9R7
3688a1k7k5j24K70K1o7k35N86j79k12n6q6j15J62L6j71J77qR6J29k06R5j26j13
3712a89L07j93P3k21N59k29K4J08k50j50P5j5M1J29J57k70O8r8j94M20K01k53
3734A00q1K62j88Q2k17o3j13K73k43J97n7K59k83J01P1P1j32j85L1J59KL9J42
3757B27j81l04K00R8j5j38J40q2J31K5o9l4Q1j72K53P3kj86OK0k9K51p9l63K03
3782E4Lj27J51r1j2R7r1j00r4M10p9j61K3P7j76j21J88p5K51k51J05j27R1j74
$$ y = [-122, -208, -13, 3, 129, -185, 206, -175, 27, -257, 134, -134, 122, -104, 282, 79, 47, -131, -269, 217, -149, 95, 33, -43, 138, -56, -196, 23, -212, -67, -262, 39, 140, 109, -15, 56, -47, 145, 193, 414, 80, -181, -52, 50, -103, -75, 197, -307, -90, 160, 63, -45, 82, -121, -231, 69, 157, -73, 250, 224, 150, -180, -207, -165, -19, -108, -11, -38, -63, -187, 83, 104, 37, -198, 388, 209, -3, -59, -145, -260, -98, -62, -233, -56, -64, 32, 161, -45, 50, -76, -189, 118, -75, -2, -223, 336, 107, 131, 239, -11, -161, -86, -101, -60, 69, 226, -44, 24, -74, -268, 152, 353, 100, 19, 281, 93, 175, -42, -105, -218, 55, -188, 9, -48, 211, -72, 29, 100, 171, 39, -146, -115, 44, 46, 85, 227, 46, -258, -58, 40, 25, -113, 27, -55, 76, 101, 32, -2, 79, -93, 160, 233, 231, 45, 51, 71, 42, 293, 214, -149, 54, 57, -70, 81, -10, -22, 75, -16, -116, -210, 200, 121, -40, -17, 60, -116, -237, -49, -124, 127, -124, -19, -146, -55, -229]
3806b29K20p8M2j07K56j16K21j82K26l0q5J1J14m10L90k33k50L86m01L47l11J70
3828d9l52K82K50OJ19l06nJ60j99J20RJ5K07k84l7R3j93J4M32k34j18K12k0k58
3852a36L14k91N3K78l23J21r5R6O8O3l79K09J0J06r6P9l48M8J01J46m4J87l03
3875a36K09k48J85N8Nl6j13K14l49K45K25m50J37K16j98n3Q8k5K74m00M27k51
3897B4k16K49j07P9j44K30j90O8n2R2p9Nl3j28M37l35J19K33j69j98LJ61k5K22
$$ y = [-229, -9, -87, -45, -152, 104, -12, 209, 27, 253, 223, 138, 149, 263, -147, 243, 10, -240, 146, -255, 92, -219, -49, -401, -119, 131, 137, 256, -50, -55, 105, -94, 26, 35, 50, 257, -27, -64, 29, -164, -150, 282, 48, -70, 142, 122, -136, 178, -113, -60, 218, -105, 16, -79, 17, 85, 148, -231, -22, -12, 94, -2, 77, -271, -223, -122, 24, -20, 167, -136, 73, -175, 10, 68, 73, 37, -76, 138, -211, 34, 259, -191, -54, 162, -36, -89, -1, -26, 248, -152, 275, 24, -192, 57, -50, 29, -115, 115, -75, -7, -59, 33, -46, -41, -74, -202, 235, -100, 19, 252, 83, -115, -112, 49, 24, 246]
$$ [...]
8191a64
##END NTUPLES=NMR FID
##END=
