##TITLE=1H_DE-100m
 200.13MHz,CDCl3,
 8 sc
 
 8.7.2025
##JCAMPDX= 6.0         $$ Bruker NMR JCAMP-DX V2.0
##DATA TYPE= NMR FID
##DATA CLASS= NTUPLES
##ORIGIN= UXNMR, Bruker Analytische Messtechnik GmbH
##OWNER= pz
$$ XWIN-NMR		Version 3.5
$$ Tue Jul  8 16:31:24 2025 Russian Standard Time (UT+4h)  she@DPX200
##.OBSERVE FREQUENCY= 200.1313
##.OBSERVE NUCLEUS= ^1H
##.DELAY= (6, 6)
##.ACQUISITION MODE= SIMULTANEOUS
##.ACQUISITION SCHEME= undefined
##.AVERAGES= 8
##.DIGITISER RES= 18
##SPECTROMETER/DATA SYSTEM= spect
##.PULSE SEQUENCE= zg30
##.SOLVENT NAME= CDCl3
##.SHIFT REFERENCE= (INTERNAL, CDCl3, 0, 14.3821)
##AUDIT TRAIL= $$ (NUMBER, WHEN, WHO, WHERE, WHAT)
$$ ##TITLE= Audit trail, XWIN-NMR		Version 3.5
$$ ##JCAMPDX= 5.01
$$ ##ORIGIN= Bruker BioSpin GmbH
$$ ##OWNER= she
$$ F:/spectra/data/she/nmr/H-C/1/audita.txt
$$ ##AUDIT TRAIL=  $$ (NUMBER, WHEN, WHO, WHERE, WHAT)
(   1,<2025-07-08 16:29:37.68 +0400>,<she>,<DPX200>,
      <created by zg, POWCHK disabled, PULCHK disabled
       configuration hash MD5:
       00 E9 B6 7A A2 85 ED C7 34 08 36 98 17 FE 4E 26
       data hash MD5: 16K
       A3 CD A3 15 DF 02 0A A1 18 23 98 D4 71 E2 8B 85>)
$$ ##END=
$$ 
$$ hash MD5
$$ 95 A0 18 95 63 68 92 86 43 93 58 08 4A DA 0A 0E
##$RELAX= 
##$RELAX= 
##$RELAX= 
##$RELAX= 
##$RELAX= 
##$RELAX= 
$$ Bruker specific parameters
$$ --------------------------
##$DU= <F:/spectra>
##$EXPNO= 1
##$NAME= <H-C>
##$PROCNO= 1
##$TYPE= <nmr>
##$USER= <she>
##$AMP= (0..31)
100 100 100 100 100 100 100 100 100 100 100 100 100 100 100 100 100 100 
100 100 100 100 100 100 100 100 100 100 100 100 100 100 
##$AQSEQ= 0
##$AQ_mod= 1
##$AUNM= <au_zg>
##$AUTOPOS= <>
##$BF1= 200.13
##$BF2= 200.13
##$BF3= 200.13
##$BF4= 200.13
##$BF5= 200.13
##$BF6= 200.13
##$BF7= 200.13
##$BF8= 200.13
##$BYTORDA= 1
##$CFDGTYP= 0
##$CFRGTYP= 5
##$CHEMSTR= <none>
##$CNST= (0..31)
1 1 145 1 1 1 1 1 1 1 1 1 1 1 1 1 1 1 1 1 1 1 1 1 1 1 1 1 1 1 1 1 
##$CPDPRG= <>
##$CPDPRG1= <>
##$CPDPRG2= <>
##$CPDPRG3= <>
##$CPDPRG4= <mlev>
##$CPDPRG5= <mlev>
##$CPDPRG6= <mlev>
##$CPDPRG7= <mlev>
##$CPDPRG8= <mlev>
##$CPDPRGB= <>
##$CPDPRGT= <>
##$D= (0..31)
0 0.7 0 0 0 0 0 0 0 0 0 0.03 0 0 0 0 0 0 0 0 0 0 0 0 0 0 0 0 0 0 0 0 
##$DATE= 1751977777
##$DBL= (0..7)
120 120 120 120 120 120 120 120 
##$DBP= (0..7)
150 150 150 150 150 150 150 150 
##$DBP07= 0
##$DBPNAM0= <>
##$DBPNAM1= <>
##$DBPNAM2= <>
##$DBPNAM3= <>
##$DBPNAM4= <>
##$DBPNAM5= <>
##$DBPNAM6= <>
##$DBPNAM7= <>
##$DBPOAL= (0..7)
0.5 0.5 0.5 0.5 0.5 0.5 0.5 0.5 
##$DBPOFFS= (0..7)
0 0 0 0 0 0 0 0 
##$DE= 6
##$DECBNUC= <off>
##$DECIM= 32
##$DECNUC= <off>
##$DECSTAT= 4
##$DIGMOD= 1
##$DIGTYP= 9
##$DL= (0..7)
0 120 120 120 120 120 120 120 
##$DP= (0..7)
150 150 150 150 150 150 150 150 
##$DP07= 0
##$DPNAME0= <>
##$DPNAME1= <>
##$DPNAME2= <>
##$DPNAME3= <>
##$DPNAME4= <>
##$DPNAME5= <>
##$DPNAME6= <>
##$DPNAME7= <>
##$DPOAL= (0..7)
0.5 0.5 0.5 0.5 0.5 0.5 0.5 0.5 
##$DPOFFS= (0..7)
0 0 0 0 0 0 0 0 
##$DQDMODE= 0
##$DR= 18
##$DS= 0
##$DSLIST= <SSSSSSSSSSSSSSS>
$$ [...]
##$SUBNAM0= <"">
##$SUBNAM1= <"">
##$SUBNAM2= <"">
##$SUBNAM3= <"">
##$SUBNAM4= <"">
##$SUBNAM5= <"">
##$SUBNAM6= <"">
##$SUBNAM7= <"">
##$SUBNAM8= <"">
##$SUBNAM9= <"">
##$SW= 18.0517328524113
##$SWIBOX= (0..15)
0 0 2 0 0 0 0 0 0 0 0 0 0 0 0 0 
##$SW_h= 3612.71676300578
##$TD= 16384
##$TD0= 1
##$TE= 0
##$TE2= 300
##$TE3= 300
##$TEG= 300
##$TL= (0..7)
0 120 120 120 120 120 120 120 
##$TP= (0..7)
150 150 150 150 150 150 150 150 
##$TP07= 0
##$TPNAME0= <>
##$TPNAME1= <>
##$TPNAME2= <>
##$TPNAME3= <>
##$TPNAME4= <>
##$TPNAME5= <>
##$TPNAME6= <>
##$TPNAME7= <>
##$TPOAL= (0..7)
0.5 0.5 0.5 0.5 0.5 0.5 0.5 0.5 
##$TPOFFS= (0..7)
0 0 0 0 0 0 0 0 
##$TUNHIN= 0
##$TUNHOUT= 0
##$TUNXOUT= 0
##$USERA1= <user>
##$USERA2= <user>
##$USERA3= <user>
##$USERA4= <user>
##$USERA5= <user>
##$V9= 5
##$VALIST= <valist>
##$VCLIST= <CCCCCCCCCCCCCCC>
##$VD= 0
##$VDLIST= <DDDDDDDDDDDDDDD>
##$VPLIST= <PPPPPPPPPPPPPPP>
##$VTLIST= <TTTTTTTTTTTTTTT>
##$WBST= 1024
##$WBSW= 4
##$XGAIN= (0..3)
0 0 0 0 
##$XL= 0
##$YL= 0
##$YMAX_a= 159452
##$YMIN_a= -227767
##$ZGOPTNS= <>
##$ZL1= 120
##$ZL2= 120
##$ZL3= 120
##$ZL4= 120
##$ABSF1= 10
##$ABSF2= 0
##$ABSG= 5
##$ABSL= 3
##$ALPHA= 0
##$AQORDER= 0
##$ASSFAC= 0
##$ASSFACI= 0
##$ASSFACX= 0
##$ASSWID= 0
##$AUNMP= <proc_1d>
##$AZFE= 0.1
##$AZFW= 0.1
##$BCFW= 1
##$BC_mod= 2
##$BYTORDP= 1
##$COROFFS= 0
##$CY= -3
##$DATMOD= 1
##$DC= 2
##$DFILT= <>
##$DTYPP= 0
##$F1P= 0
##$F2P= 0
##$FCOR= 0.5
##$FTSIZE= 0
##$FT_mod= 4
##$GAMMA= 1
##$GB= 0.15
##$INTBC= 1
##$INTSCL= 1
##$ISEN= 128
##$LB= 0.25
##$LEV0= 0
##$LPBIN= 0
##$MAXI= 10000
##$MC2= 0
##$MEAN= 0
##$ME_mod= 0
##$MI= 1.114404
##$NCOEF= 0
##$NC_proc= 0
##$NLEV= 6
##$NOISF1= 3.799351
##$NOISF2= 2.8
##$NSP= 1
##$NTH_PI= 0
##$NZP= 0
##$OFFSET= 14.38212
##$PC= 1
##$PHC0= -1224.508
##$PHC1= 47.1925
##$PH_mod= 1
##$PKNL= yes
##$PPARMOD= 0
##$PSCAL= 0
##$PSIGN= 0
##$REVERSE= no
##$SF= 200.129724274929
##$SI= 16384
##$SIGF1= 3
##$SIGF2= 2
##$SINO= 400
##$SIOLD= 16384
##$SREGLST= <1H.CDCl3>
##$SSB= 0
##$STSI= 0
##$STSR= 0
##$SW_p= 3205.1282051282
##$SYMM= 0
##$S_DEV= 0
##$TDeff= 0
##$TDoff= 0
##$TI= <>
##$TILT= no
##$TM1= 0
##$TM2= 0
##$TOPLEV= 0
##$USERP1= <user>
##$USERP2= <user>
##$USERP3= <user>
##$USERP4= <user>
##$USERP5= <user>
##$WDW= 1
##$XDIM= 8192
##$YMAX_p= 0
##$YMIN_p= 0
$$ End of Bruker specific parameters
$$ ---------------------------------
##NTUPLES= NMR FID
##VAR_NAME=  TIME,          FID/REAL,        FID/IMAG
##SYMBOL=    X,             R,               I
##VAR_TYPE=  INDEPENDENT,   DEPENDENT,       DEPENDENT
##VAR_FORM=  AFFN,          ASDF,            ASDF
##VAR_DIM=   8192,          8192,            8192
##UNITS=     SECONDS,       ARBITRARY UNITS, ARBITRARY UNITS
##FACTOR=    0.0002768,     1,               1
##FIRST=     0,             0,               0
##LAST=      2.2672688,     0,               0
##MIN=       0,             -227767,         0
##MAX=       2.2672688,     159452,          0
$$ Real data points
##PAGE= N=1
##DATA TABLE= (X++(R..R)), XYDATA
0@%%%%%%%%%%%%%%Qj6J6j6J6k4L2l2M0m8N5o3P2q5R7j12J28j45J64j85K10k37
$$ 0 0 0 0 0 0 0 0 0 0 0 0 0 0 0 8 -8 8 -8 8 -16 16 -16 24 -24 31 -32 40 -45 52 -60 68 -77 87 -98 112 -125
36a25K65k98L32l70M12m56N06n60O19o84P54q31R17j011J114j226J351j491J647
$$ -125 140 -158 174 -196 216 -240 266 -294 325 -359 395 -436 481 -530 584 -642 709 -782 865
55H65j825K028k260K533k855L242l720M324n118O209p810J0386j5177K6971j08618
$$ 865 -960 1068 -1192 1341 -1514 1728 -1992 2332 -2786 3423 -4387 5999 -9178 17793 -90825
70i0825j36942K92502R4717j49994j6455O6758p5155k5379P0954J889n8854Q277
$$ -90825 -227767 64735 159452 9458 -6997 59761 -15394 -40773 30181 32070 -26784 -18507
82a8507K0872o610j712Q555m973J365R28m186j11N979l26J313J155j711j695K722
$$ -18507 2365 -4245 -5957 2598 -2375 -1010 -82 -4268 -4379 1600 1274 2587 3742 2031 336 3058
98C058k54k778j621M47M03J225l51p91J51K33j080l66j303p83K517L535j219j551
$$ 3058 2804 26 -1595 -1148 -745 480 129 -662 -511 -278 -1358 -1724 -3027 -3810 -1293 2242 1023 -528
116e28J951J870j366o03j1j790j802P51J559L04j69L62R4k79q29J05M79l86p98
$$ -528 1423 3293 1927 1324 1313 -477 -2279 -1528 31 335 166 528 622 343 -486 -381 98 -288 -1086
135a086J56Q39K57O15K56j04j282j46L93k2n76k31K81L41J052M62Nn12m19o23
$$ -1086 -930 -91 166 781 1037 933 -349 -495 -102 -124 -700 -931 -650 -309 743 1205 1210 698 279 -344
155c44j46m4j46j48L47J46K60L35J57O4k78m7P2L0k56j34k6j94J99k0j28J7L27
$$ -344 -490 -534 -680 -828 -481 -335 -75 260 417 481 203 156 228 258 2 -132 -158 -352 -153 -173 -301 -284 43
178D3j25J53j1J16QM8j89L0q0j71l8J33Q8mjoo0n2K2o9J82q4l3k4J45N2r0K03
$$ 43 -82 71 60 176 184 232 43 73 -7 -178 -216 -83 5 1 0 -6 -66 -118 -96 -165 17 -67 -100 -124 21 73 -17 186
206A86j40o4m9NJ26k4m7p1K5o3K16j77J26m3J03j92q4Q5k7k9K35j81J32j27Q4
$$ 186 46 -18 -67 -62 64 40 -7 -78 -53 -116 100 -77 49 6 109 -83 -167 -82 -109 -138 97 -84 48 -79 5
231EK9o2l5R5ol6J42l5j1j49N7O7j25M3J69j49j44L50k00J14j15LK6j9o1K02l30
$$ 5 34 -28 -63 32 26 -10 132 97 86 -63 -6 61 -64 -21 148 -1 -145 205 5 119 4 7 33 14 -47 155 -175
258a75K14rQj9J50j06j38J73j38J33j25J0p4M3n4J06r3j05J49k3J22K86k85O3
$$ -175 39 30 38 19 169 63 -75 98 -40 93 -32 -22 -96 -53 -107 -1 -94 -199 -50 -73 49 335 50 113
282A13j70j6P0j36K56j22N2j73j9K12j81L33k41l9j66K12O2l2Q2M1j64k8J15j89
$$ 113 -57 -73 -3 -139 117 -5 47 -126 -145 67 -114 219 -22 -61 -227 -15 47 15 97 138 -26 -54 61 -128
306a28J24Km0n0J11J05j89J1K%J77l5j70O9j25M6J03r5J19J04o4o8J5j55J03N6
$$ -128 -4 -2 -42 -92 19 124 -65 -54 -52 -52 125 90 -80 -11 -136 -90 13 -82 37 141 77 9 24 -131 -28 28
332B8n6L1J17j51J06n1R1j23l5K6mj9qj13K17j18R2j00J99j08n8Lj61K29l9R2
$$ 28 -28 3 120 -31 75 24 115 -8 -43 -17 -21 -40 -48 -161 56 -62 30 -70 129 21 -37 -34 -195 34 -5 87
358H7k4J20j81M7k0l6J4Q4n4L6j77J63k86K55Jq9N4j95Q3o3K63k04J76Nj9L4j66
$$ 87 63 183 2 49 29 -7 7 91 37 73 -104 59 -227 28 29 -60 -6 -201 -118 -181 82 -122 54 59 40 74 -92
385i2m1K44j72L8m5nK20lj95r0J46P0M4j64O3J9M2Mj0J2j11q1J17om4Q0j14R0
$$ -92 -133 111 -61 -23 -68 -73 147 144 -51 -141 5 75 119 -45 18 37 79 83 73 85 -26 -107 10 4 -40 40 -74 16
413A6J72l33J78O6j52J26N6j93J31o2o7j8J30k00Q2K3L6l7q2M3J81k00J38J1k3
$$ 16 188 -145 33 99 -53 73 129 -64 67 5 -62 -80 50 -150 -68 -45 -9 -46 -128 -85 96 -104 34 45 22
438B2n6R2j31J29r3N8M2k44K61k89K79k76J11J04QQ7j41J43n6j40M3K77k31l8
$$ 22 -34 58 -73 56 -37 21 63 -181 80 -209 70 -206 -95 9 17 104 -37 106 50 -90 -47 230 -1 -39
462c9O5n1Pr5L43k90j20J58lJ07j27J23l16J09J60K0m7J13r7M3L5j88P8N1j49
$$ -39 26 -25 -18 -113 230 -60 -180 -22 -25 82 -45 78 -238 -129 31 51 4 117 20 63 98 -90 -12 39 -110
487a10K1o3R4L2j10N2k3K02j03R4k11n3L42j00oo5m3J5l9lJ8l9Q5l9J40n7j35
$$ -110 -89 -152 -58 -26 -136 -84 -107 95 -8 86 -125 -178 164 64 58 -7 -50 -35 -74 -77 -59 -98 -13 -52 88 31 -104
514a04J04j6P3n1r8k8Q5l6Q7q0J15K4J36j88k52K47n8P0o6O8j79N1L12l43P7O5
$$ -104 0 -16 57 6 -92 -120 -35 -71 16 -64 51 75 211 23 -229 18 -40 30 -36 32 -147 -96 216 -127 -50 15
540A5j09J4K2J19q9LpN2M5l4q9R2l4k9O1o6q8K19j42n1J34j24M2J96j19j03J78
$$ 15 -94 -80 -58 61 -28 -25 -32 20 65 31 -58 34 0 -29 32 -34 -122 97 -45 -96 38 -86 -44 152 33 -70 108
567A08J7l6k38K09j28o7J23Q2j96J30mN7j7j00k10K19K95k07P6j4M2r8o2qo6k9
$$ 108 125 89 -149 60 -68 -135 -12 70 -126 4 0 57 40 -60 -270 -51 244 37 113 99 141 43 -19 -27 -93 -122
593a22K01k6r6Q7J4o0M9N3o3j02J99p0j28J28q0j61L55j71P2j21Q4nj30J33j19
$$ -122 79 53 -43 44 58 -2 47 100 37 -65 134 64 -64 64 -16 -177 178 7 79 -42 42 37 -93 40 -79
618g9JQ6Q5q3o5Q7j33J20L1o5Q9j70j6J45l0M8jp0J9j6J52o1p6J14jN2j40m3j72
$$ -79 -78 8 93 10 -55 32 -101 19 50 -15 74 -96 -112 33 3 51 50 -20 -1 -17 135 74 -2 112 111 163 23 -20 -192
647a92J47Q5L6m7M8k1j72R6r6J67N6k16J53j08R2r8J36k1M9p6j22L8L5K03k71
$$ -192 -45 40 76 29 77 56 -116 -20 -116 51 107 -109 44 -64 28 -70 66 45 94 18 -104 -66 -31 172 -99
672i9R8O9J81k17r1O9j06P2q4Q1lJ08j20L7j37P2p0J10j6J22k4k10J81P8j09J37
$$ -99 -1 68 249 32 -59 10 -96 -24 -108 -27 -30 78 -42 -5 -142 -70 -140 -30 -46 76 52 -158 23 101 -8 129
698A29k28J10M1j27K17j43l3Np5J85j14J13M2j68Q7j22J92p2j38J95n9j14K4O5
$$ 129 -99 11 52 -75 142 -1 -34 -29 -104 81 -33 80 122 -46 41 -81 111 39 -99 96 37 -77 -53 12
722A2j45K6P5k7L2O4l4O7n3j10K22J10k98J62o7j50J14p1J96LO7j70R6k63K9P8
$$ 12 -133 -107 -32 -59 -27 37 3 70 17 -93 129 239 -59 103 36 -114 0 -71 125 128 195 25 121 -142 -113 -35
748c5J91j05n3j83J14J22n1n0J0l5k8J85l02K34km9R8j17J32n7p7N6%k8p6J9J08
$$ -35 156 51 -2 -185 -71 51 0 -50 -40 -75 -103 82 -220 14 12 -37 61 -56 76 19 -58 -2 -2 -30 -106 -87 21
775B1p5k0K21j29O7j02K5J29j62l9Q3r5L0k7o2K17j18j26J44k7K1k3o2K3J91j57
$$ 21 -54 -74 147 18 85 -17 8 137 -25 -64 19 -76 -46 -73 -135 82 -36 -162 -18 -45 -24 -47 -109 -86 105 -52
801e2J64j34R7k04J84m4j07J13q5J06P5j63N6k4N2M5n1K2J7l0N2q9j04N5J18j10
$$ -52 112 -22 75 -129 55 11 -96 17 -68 38 113 -50 6 -18 34 79 28 50 67 37 89 0 -104 -49 69 -41
827d1J22o9K0K3Nk24K93k33q8K56K0q2Q8j07q4Q3n4Kj8%J0J3J81K6j03r1o5P9
$$ -41 81 12 32 55 60 -164 129 -104 -192 64 84 2 90 -17 -101 -18 -72 -70 -88 -88 -78 -65 116 142 39 -52 -117 -38
855c8o6l3J60L5p7l6J32r0p3L4nJ47l6n6qj03K26j34j99K45N0j14j1j4P4k64K39
$$ -38 -104 -137 23 58 -19 -55 77 -13 -86 -52 -57 90 54 -2 -10 -113 113 -21 -220 25 75 -39 -50 -64 10 -254 -15
882a5rJ87k75J85N9j36m1N3J1n1Q0l3r1J60k14J98j96K22o4m2P0q5RN4o3J69j82
$$ -15 -24 163 -112 73 132 -4 -45 8 19 -32 48 15 -76 84 -130 68 -128 94 30 -12 58 -27 -18 36 -27 142 -40
909d0N5j07N9J72j14j3N8j62K39j10k4N3l16L93l35J93R3j16r8j09K38j1j14K8
$$ -40 15 -92 -33 139 25 12 70 -92 147 37 13 66 -250 143 -192 1 94 -22 -120 -229 9 -2 -116 -88
933h8K24L4k38J32k7M5o5J96j97j45o3J70j41J67J31j70R6M2l2k58J44K8k3j1
$$ -88 136 170 -68 64 37 82 17 213 16 -129 -192 -22 -163 4 135 -35 61 103 71 -187 -43 -15 -38 -49
957d9J14j66m3J29J67l52J03o0K88j24J47r9L6j89R7m7RK5j55J69m9Q7o8pn3K1
$$ -49 65 -101 -144 -15 152 -200 -97 -157 131 7 154 55 91 -98 -1 -48 -39 -14 -169 0 -49 38 -30 -37 -90 -69
983f9K14j81K09j94J04j34N2j1N2j64J72j9j26R1O3j89J76j62J35J67j48o9o1
$$ -69 145 -36 173 -21 83 -51 1 -10 42 -122 50 31 -95 -4 59 -130 46 -116 19 186 38 -31 -92
1006i2O6J15q4L4n9j22J25J05j05m8J11P7j0p4j49J45jq2L1J62k14J47j6l30J99
$$ -92 -26 89 5 39 -20 -142 -17 88 -17 -65 46 123 113 39 -110 35 34 -48 -17 145 -69 78 62 -268 -69
1031f9K18j39k6jj51K62o8n8j10R3K2m9K1K71k77j57K68j97l6K82r8J42q6k17
$$ -69 149 10 -16 -17 -168 94 26 -32 -142 -49 -27 -76 -55 216 -61 -218 50 -147 -183 99 1 143 57 -160
1055a60R4N6R1p3M9j12p1J04J2Qk8Q2j93l3L9K23o6j10NJ20J54k28R6j29j22K48
$$ -160 -66 -10 81 8 57 -55 -126 -22 -10 -2 -30 52 -141 -174 -135 88 22 -88 -83 37 191 -37 59 -70 -192 56
1081E6j49J75L8j79J60j34n1O4j76M4Q8kK08j39k2J24p7k3kJ05j8j38k6J76p9
$$ 56 -93 82 120 -59 101 -33 -84 -20 -196 -152 -64 -66 142 3 -19 105 28 5 3 108 90 -48 -74 102 23
1106B3j69R0o5K99j27j31p3K8O0p8RJ1L3J15l9K12k33q9k4K99q3l8j10J7J47p
$$ 23 -146 -56 -121 178 51 -80 -153 -125 -65 -143 -134 -123 -90 25 -14 198 -35 -124 -148 151 68 30 -80 -63 84 77
1132G7k59K73K4j28Q0j53J2q7L9J7J37j34L6m7R5p6N7r9K30j44Q0n9k0L2Q1mp6
$$ 77 -182 91 115 -13 67 -86 -74 -161 -122 -105 32 -102 -66 -113 -18 -94 -37 -136 94 -50 30 -29 -49 -17 64 60 -16
1159a6r0K11J10l77J98l6j06j15J55p6K79j23m3O9k14K60j69j36L04J33l62J06
$$ -16 -106 105 215 -162 36 0 -106 -221 -66 -142 137 14 -29 40 -174 86 -83 -219 85 218 -144 -38
1181c8P9o1M9m1r0K9J27J25k12p0J90n9n2j16K78j64o5R4M9k42K21j33R6R3r6
$$ -38 41 -20 29 -12 -102 -73 54 179 -33 -103 87 28 -24 -140 138 -26 -91 3 52 -190 31 -102 -6 87 -9
1206iO0j55J14k4lo4RJ07j19PM7J21n5R8j76K15k45J56k01J61k79K78Q0Q7j19
$$ -9 51 -104 10 -14 -17 -81 -72 35 -84 -77 -30 91 36 134 -42 173 -72 84 -117 44 -235 43 123 210 91
1231I1j14oR0l4j4P4k11J49K4Jj90Q6J00l8Q1p9k8j00K44j30j69J45k07L44l23
$$ 91 -23 -29 61 27 13 87 -124 25 49 50 -140 -54 46 8 89 10 -18 -118 126 -4 -173 -28 -235 109 -214
1256b14L44j94L0j6j0K6KO5J12m0j73o0K41n1j12Q5k38K57J7j29K7j10Q7J22q4
$$ -214 130 -64 -34 -50 -60 -34 -32 33 145 105 -68 -128 113 62 -50 35 -203 54 71 -58 -31 -141 -54 68 -16
1281a6N7p3j33L24k12J91n5k0j80J00o0mJ67k76L8P8R8Kj09O2Pm8J03m9mM0n9
$$ -16 41 -32 -165 159 -53 138 83 63 -117 -17 -77 -81 86 -190 -152 -74 24 26 -83 -21 -14 -62 41 -8 -12 28 -31
1308c1J23j77J97k02J56j09J32j05K3r3K01j54Q0k4N7j12P0j10QJ96r5j20J81
$$ -31 92 -85 112 -90 66 -43 89 -16 7 -86 115 -39 41 17 74 -38 32 -78 -70 126 31 -89 92
1331I2j41k8R8l3l5j03J48K5L20l13k06J30L8M2K3k51K03Pj11O2o0Q4N4j46J05
$$ 92 -49 -77 21 -12 -47 -150 -2 23 343 30 -176 -46 -8 34 57 -194 9 16 -95 -33 -93 -9 45 -101 4
1356DJ04Q2j99J32k42Q9l6J96r5l0J4m8J16p9l8o5R7R6l95L70oj03J35j00R2J56
$$ 4 108 190 -9 123 -119 -30 -66 130 35 5 19 -29 87 8 -30 -95 2 98 -297 73 67 -36 99 -1 91 247
1382B47l25J24j53Q9Kk35K74J36k50Q4R3j63R8k04J47q7J49J08j68r4J72l2L0
$$ 247 -78 46 -107 -18 -16 -251 23 159 -91 -7 86 -77 21 -183 -36 -123 26 134 -34 -128 44 12 42
1405D2N0pJ16k00j8j84J89P8r6L8m1j03K10j72K58j21k2Q5j30n4K2M1l8J86l20
$$ 42 92 85 201 1 -17 -201 -12 66 -30 8 -33 -136 74 -98 160 39 17 102 -28 -82 -60 -19 -57 129 -191
1430a91K06RJ5l23L50p6K1L4l1K4j32K59k85K23k65J46j18J47J59k45P3K9Kj40
$$ -191 15 24 39 -284 66 -10 11 45 14 38 -94 165 -120 103 -162 -16 -134 13 172 -73 0 29 31 -109
1454a09J35M2j17L1j3N5j23L1j4K2l2j46L35N2j64O0j42R9r8r6N3R9P7j50L45
$$ -109 26 68 -49 -18 -31 24 -99 -68 -82 -60 -92 -238 97 149 -15 45 -97 2 -96 -192 -139 -40 37 -113 232
1479B32k01m6M5j20P7O2j44R4k22K25Q6k07K06k29R9r5J52j27k0K20m6j25K39
$$ 232 31 -15 30 -90 -13 49 -95 -1 -223 2 88 -119 87 -142 -43 -138 14 -113 -133 87 41 -84 155
1502A55m4j91j40J50L1R4Q9k15nj3q5J88l13M06r7q6J44%N0j56P5l46L54j83K07
$$ 155 111 -80 -220 -70 -39 55 144 -71 -76 -89 -174 14 -299 107 10 -76 68 68 118 -38 37 -309 45 -138 69
1527F9Rp8l6Q3j0j47J92J2k61R8J15L4j33p0J81j40Kj0r2J17J17j98J45J17k52
$$ 69 78 0 -36 47 37 -110 82 94 -167 -69 46 80 -53 -123 58 -82 -80 -90 -182 -65 52 -146 -1 116 -136
1552a36P1lJ30o2P2M1r5%J0L2k40J62L5%rL2j5J00k20P2J9L4o5L3mJ70q7r4j8
$$ -136 -65 -68 62 0 72 113 18 18 28 60 -180 -18 17 17 8 40 25 125 -95 -23 -4 30 -35 -2 -6 164 77 -17 -35
1581c5k6J55k76Q6K45q6j16j3M8r9K03j47M3J3K5j60J61J2K0j0j38l4N4j08l5
$$ -35 -61 94 -182 -96 149 63 -53 -66 -18 -117 86 -61 -18 -5 20 -140 21 33 53 43 -95 -129 -75 -183 -218
1606b18K42oM5j14j09R9R6J12k14o8M4K22l48K32J07r0p6P4j33Q5J34k23O5J78
$$ -218 24 18 63 -51 -160 -61 35 147 -67 -135 -91 131 -217 15 122 32 -44 30 -103 -18 116 -107 -42 136
1630A36k32K06o0l8j21J75O4J6j85J17j15P0p6o3J71j66J71j17J27Q6n2k15K96
$$ 136 -96 110 50 12 -109 66 130 146 -39 78 -37 33 -43 -106 65 -101 70 -47 80 166 114 -101 195
1653A95j63j10QJJ37k6j85Q3n3J62m1j5K4r0nj6J47j29J05o8l9j4J82r2j58K18
$$ 195 32 -78 -70 -69 68 42 -143 -60 -113 49 8 -7 17 -73 -78 -94 53 -76 29 -39 -78 -92 90 -2 -160 58
1679E8o3nK7j2J15o4r8J7l8O0p1N5P5j51R8mJ96j78l9K1j5j11J5N8M8l0J52j19
$$ 58 -5 -10 17 5 120 56 -42 -25 -63 -3 -74 -19 56 -95 3 -1 195 17 -22 -1 -16 -127 -112 -54 -6 -36 116 -3
1707cK40k88m9O8n8J56j12P6J61l40KJ88ro6R7j91J21J33k28J38j81J48l9L6J12
$$ -3 237 -51 -100 -32 -90 66 -46 30 191 -149 -147 41 32 -34 63 -128 -7 126 -102 36 -145 3 -36 0 112
1732A12j92L3J49n5j10K7J8Pm0l6N9J09j60L4J01q2J61j18j4M9q6j1P4N1J4K3
$$ 112 -80 -47 102 47 -63 -36 -18 -11 -51 -87 -28 81 -79 -45 56 -26 135 17 3 52 -34 -45 29 80 94 117
1758A17l4q9o9K04r6N1j16N4j5o7N0J4l8Q5j86Lk3K67j29N7J14j38mo5J38j33
$$ 117 83 -6 -75 129 33 84 -32 22 7 -60 -10 4 -34 51 -135 -132 -155 112 -17 40 154 16 12 -53 85 -48
1784d8J13O8j88M0q0J07j17J46j98O0RJ30n5N2R5k17N4j05J41O5k06L6J82Q5k16
$$ -48 65 133 -55 -15 -95 12 -105 41 -157 -97 -88 42 -13 39 134 -83 -29 -134 7 72 -134 -98 84 169 -47
1809d7j0Q2L4J15j89l8J40o8K9j53J09K6l7J07P5r0j50P4r1RJ94n5q4J00n7Q5
$$ -47 -57 25 59 174 -15 -53 87 19 48 -105 4 30 -7 100 175 85 -65 9 -82 -73 121 66 -18 82 25 110
1835A10j85J10K6j99R7j0O8j31P0M7J8N6M9L0o0j55O0M0o2l5N2j26Q3rl1J85k08
$$ 110 -75 35 61 -138 -41 -51 17 -114 -44 3 21 77 126 156 96 -59 1 41 -21 -56 -4 -130 -47 -56 -87 98 -110
1862a10P9J68k30J02J95j15K4NM9j35p2J62r2j87R0J61K7k24N7P3j37J35j17P8
$$ -110 -31 137 -93 9 204 89 113 118 167 32 -40 122 30 -157 -67 94 121 -103 -46 27 -110 25 -92 -14
1886a4k22J43J30j51J83J15q7K2k94K3K31q4j0N5j48J3J13k00K66Mj5o0k2l2O8
$$ -14 -236 -93 37 -114 69 184 97 119 -175 -152 79 -5 -15 40 -108 -95 18 -182 84 88 73 13 -9 -41 27
1911B7j31rP6q8J75J05j70J40M8k04L2Q5p4k0N5m7j07J03k0l3q2J44J42j90P4
$$ 27 -104 -113 -37 -125 50 155 -15 125 173 -31 1 86 12 -8 47 0 -107 -4 -24 -57 -139 5 147 -43 31
1936C1L9o7j0O4mL4rj57k5J26Qj4J19j09p7O3q4j2J19K7q0Q9R8j21k45L27j65
$$ 31 70 3 -7 57 53 87 78 -79 -104 22 30 16 135 26 -51 12 -72 -84 35 62 -18 71 169 48 -197 130 -35
1963c5n5J09J23j49j67J03O6p3%R5k38K67M6j17N9l3nm3J33J3j99J78N6k71O2
$$ -35 -90 19 142 -7 -174 -71 -5 -78 -78 17 -221 46 92 -25 34 1 -4 -47 86 99 -100 78 134 -137 -75
1988g5Q9j37J05lJ76k21Q8j73K17j86K83k37jK00k30O0n4L1J5O7P5k08j05K20
$$ -75 14 -123 -18 -21 155 -66 22 -151 66 -120 163 -74 -75 125 -105 -45 -99 -68 -53 14 89 -119 -224 -4
2012dQ8n3o9K9p1l0P5J32q6J02p0k4j13K36j26q1J95j06p7Q4P7j32J05j69K64
$$ -4 84 31 -38 -9 -80 -110 -35 97 11 113 43 19 -94 142 16 -65 130 24 -53 31 108 -24 81 -88 176
2037A76j41j36J33j34J99p5Q0l4j20J12j19J17K7l15L46j27M2J29j70J11j41o9
$$ 176 35 -101 32 -102 97 22 102 68 -52 60 -59 58 85 -230 116 -11 31 160 -10 101 -40 -109
2059a09J74j13J17o1J15k15J67k32J78P6j05j65K40m0n8P6O2m4P3k67J51J42j25
$$ -109 65 -48 69 8 123 -92 75 -157 21 97 -8 -173 67 27 -31 45 107 63 136 -131 20 162 37
2082C7p2k2O3j51K58j25N5J7Q1l4n8j10J37r7m6M5j05k0J3J67l5j47k2r3K74M1
$$ 37 -35 -57 6 -145 113 -12 43 60 141 107 49 -61 76 -21 -67 -22 -127 -147 -134 33 -2 -149 -171 -264 10 51
2108E1k1mk4M5J40j54rm6j33K03q3J80j15j14J18m3N2j54M0J30n5P7k5j10M1M4
$$ 51 30 26 2 47 187 33 24 -22 -155 48 -35 145 30 -84 34 -9 43 -111 -71 59 4 81 56 -54 -13 31
2134C1r5J43n2k10L03j60M6M8j85K35j37J3p0K41p6K2j39J55j53N2r1k6L8J26
$$ 31 -64 79 27 -183 120 -40 6 54 -131 104 -33 -20 -90 151 75 97 -42 113 -40 12 -79 -105 -67 59
2158E9N9j46P1O3j09rj9J00j61J21K3po7M2j58J26l5PKl0R5k8j22K84o6j48Rk2
$$ 59 118 -28 43 106 -3 -12 -31 69 -92 29 52 45 -22 20 -138 -12 -47 -40 -38 -68 27 -1 -123 161 95 -53 -44 -66
2186f6L2J27j59K32j48Q5j82J52L5m8k4j00J05l0m2o5J48j51Q0K45k28n7J20j53
$$ -66 -34 93 -66 166 18 103 -79 73 108 60 36 -64 41 11 -31 -96 52 -99 -19 226 -2 -59 61 -92
2210i2J7O8j2J23j70l9Q3o5J03o5N6N0j97O3j6J4J0J55q0L2j29J08MJ97k64q2
$$ -92 -75 -7 -19 104 -66 -105 -22 -87 16 -49 7 57 -140 -77 -93 -79 -69 86 6 38 -91 17 21 218 -46 -128
2236a28Q1J21j1j64J59k4m9N1p6J6j00J86p7Q2Pj53J20j45M4o5L39k39RP7j99
$$ -128 -47 74 63 -101 58 34 -15 36 -40 -24 -124 62 -15 67 74 -79 41 -104 -60 -125 214 -25 -16 61 -138
2261a38K29p1LP2k51J27R3lq0M2k4m4K5J59j52J77k09J80j48j3j08nJ00mM3Mk79
$$ -138 91 20 23 95 -156 -29 64 61 -19 23 -1 -45 -20 139 -13 164 -45 135 -13 -26 -134 -139 -39 -43 0 4 -275
2288b75K69j15K71j01K8j48r1K71j68J50q9q7J18Q8j50P7J3K8r9j4K6Q1o5J08
$$ -275 -6 -121 150 49 77 -71 -162 109 -59 91 2 -85 33 121 -29 48 61 89 -10 -24 2 83 18 126
2312A26j10j1l2j2P3j78J24l3j29K71j1L0J8k73R8J44j08J36k64J86L1P1o8j67
$$ 126 16 5 -27 -39 34 -144 -20 -53 -182 89 78 108 126 -147 -49 95 -13 123 -141 45 76 147 79 -88
2336h8O5Q3q5J19j11M2o2J01k1OP0j98N4j44J59p7J02m3p4J0J41j07J18j09j54
$$ -88 -23 60 -25 94 -17 25 -37 64 43 49 119 -79 -25 -169 -10 -87 15 -28 -102 -92 49 -58 60 -49 -203
2361b03J03J44n5Q3j87K02p7N3M6j02j18J48q9J26%Q1j23l1Qm9L5j08J23P6k8
$$ -203 -100 44 -11 72 -115 87 10 63 109 7 -111 37 -52 74 74 155 32 1 9 -40 -5 -113 10 86 58
2386E8k67K12NJ0n6n4J28R2M6j88j22J41m7R1K7M6j44J14j04K9K6J56j73j77J02
$$ 58 -209 3 8 18 -38 -92 36 128 174 -14 -136 5 -42 49 76 122 -22 92 -12 17 43 199 26 -151 -49
2411d9o3j0Q5J40j46J52L5j24L0j94Q8K27K4o3j87JJ19p4K6r0j96J69J53j65K0
$$ -49 -112 -122 -37 103 -43 109 144 20 50 -144 -56 171 195 132 -55 -54 65 -9 17 -73 -269 -100 53 -112 -92
2436i2J23Q8j16J8j3J08j34J18M7m7j18J02j25J21n9r7K50m18J79J00mq7Q3L7
$$ -92 31 119 3 21 8 116 -18 100 147 100 -18 84 -41 80 21 -76 174 -244 -65 35 31 -56 27 64
2460F4N2p1Pn0j6K06k71po5J97p1k9Q2pjo9J44j39R5N8j92J55k47J10J89j05K6
$$ 64 116 45 52 2 -14 192 -79 -86 -151 46 -25 -54 28 21 20 -49 95 -44 51 109 -83 72 -175 -65 124 19 45
2487D5%Q0L2j32J26j58J68l08M6L46j19p0l8P0j38O4n9J23m2l5j9J55k70J69r5
$$ 45 45 125 157 25 151 -7 161 -147 -101 245 126 56 18 88 -50 14 -45 78 36 1 -18 137 -133 36 -59
2512e9O7rl4j50K71j50P3j79K01K9l8j06l3J81L9j45l5J65k7j07k3P4jo7j1Q9
$$ -59 8 -1 -35 -185 86 -64 9 -170 31 60 22 -84 -117 64 103 -42 -77 88 61 -46 -69 5 4 -63 -74 15
2538A5k2j77L15o5j78L24k70m2M0J67r6j12R1j5K0P4p5j04J01j33J40m8o4%P9
$$ 15 -7 -184 131 66 -112 212 -58 -100 -60 107 11 -101 -10 -25 -5 69 -6 -110 -9 -142 -2 -50 -114 -114 -35
2563c5J17p9L8q0j65J94j15R4j9M0J47n7J36j05p8P0N1j54J37K3j04p0j58J46
$$ -35 82 3 41 -39 -204 -10 -125 -31 -50 -10 137 80 216 111 33 103 154 0 137 160 56 -14 -172 -26
2587b6j04O6J02q6L2J2Q9Pj30p1qR6O6j1p5KK64k30n7r7K45R4j89KKp3J77j77
$$ -26 -130 -64 38 -48 -16 -4 85 92 -38 -109 -117 -21 45 34 -41 -39 225 -5 -62 -159 86 180 -9 -7 -5 -78 99 -78
2615g8j4J87j04j27K76k28M3O0j40K36l04K71j28P6q7K09j55O4p4J71l31J85J61
$$ -78 -92 95 -9 -136 140 -88 -45 15 -125 111 -193 78 -50 26 -61 148 -7 57 -17 154 -177 8 169
2638A69n1j66J79k21P8J9L9j4J6L3j42L09k29j78Q9R5k03K80j00NM4L9j16J16
$$ 169 118 -48 131 -90 -12 7 46 32 48 81 -61 248 19 -159 -70 25 -178 102 2 7 51 90 -26 90
2662I0o9n7J83j62p2J07p0J6Q9j42P2Nk0J1O7j09K2n2P7K24l11Km1J86k86J64
$$ 90 21 -36 147 -15 -87 20 -50 -34 55 -87 -15 -10 -30 -19 48 -61 -39 -91 -14 210 -101 -99 -140 46 -240 -76
2688g6J35n7j7q3O3K7J25k98J69m3oM7l7J1l9p0J85L8k10J15K7j20J77m4Op2J76
$$ -76 59 2 -15 -98 -35 -8 117 -181 -12 -55 -61 -14 -51 -40 -79 -149 36 74 -136 -21 6 -114 63 19 25 -47 129
2715A29l19k3L97j06Mj78J05J9po2J43j7j08%R1Mj37P1J26k13k7P2R7p7M6p9P5
$$ 129 -190 -213 184 78 82 -96 9 28 21 -41 102 85 -23 -23 68 72 -65 6 132 -81 -108 -36 61 -16 30 -49 26
2742B6J32j86R5qPj15Q1n0rNK3j07J15K1j2M6j06J23j23o6pK6Q2K48l48Q1k3j6
$$ 26 158 -28 67 59 66 -49 32 -18 -27 -22 1 -106 9 30 18 64 -42 81 -42 -108 -115 -89 -7 241 -107 -26 -49 -65
2770f5O7l1j09N2R4j37Q6k3P0Qo5j4K13m5M6k19N3Q6j53J79j27k1O7j7J47j13
$$ -65 2 -29 -138 -86 8 -129 -43 -66 4 12 -53 -67 146 101 147 -72 -19 67 -86 93 -34 -55 12 -5 142 29
2796B9N2j41N6J57j17Q2q6j56P0J51j78N7l1J43K3r8J14k26j6j71J57K63j83N5
$$ 29 81 -60 -4 153 36 118 32 -124 -54 97 -81 -24 -55 88 111 13 127 -99 -115 -286 -129 134 -49 6
2820Fm0m1R0o4J51K1n0n8P6n3j1m4o7M2O5n0p9J83j09k8O3P7j62N5M2Qm0O8o1
$$ 6 -34 -75 15 -49 102 123 73 15 91 38 27 -17 -84 -42 23 -27 -106 77 -32 -60 3 80 -82 -27 15 23 -17 51 -10
2849a0m0O2L3m1k2Q2j23L4N3q7R1j98P9K56n6j83J41j13PoJ10j91kL01j78j34
$$ -10 -50 12 45 4 -18 64 -59 -25 28 -59 32 -166 -87 169 113 -70 71 -42 -35 -41 69 -122 -124 177 -1 -135
2875a35R5m4J35k67K29L0J5j15J08j0l2j18J7P6J33j58p6l9J23j1N0K2j16j0j04
$$ -135 -40 -84 51 -216 13 43 58 -57 51 41 9 -109 -92 -16 117 -41 -117 -156 -33 -44 6 28 -88 -98 -202
2900b02J87nR3j29J69k7q3J6Lj09J5K85j34ro4q1LR1j0R9j59l1J62r5K26k26j99
$$ -202 -15 -20 73 -56 113 86 3 19 22 -87 -72 213 79 70 6 -75 -72 19 9 108 -51 -82 80 -15 211 -15 -214
2927b14K07K9l5J07n8jO5o2J2P6k32Q5kJ71r3j74J5J32m4Qp9O0L3n9K30j44k13
$$ -214 -7 22 -13 94 36 35 100 38 50 126 -106 -21 -23 148 55 -119 -104 28 -16 -8 -87 -27 6 -53 177 33 -180
2954a80K41l8p7Q2pn0k6J36k6q3J40r1O6j71J93o2p4K35k25j76J59lM9K2j4R5
$$ -180 61 23 -54 28 21 -29 -55 81 55 -28 112 21 87 -84 109 47 -27 208 -17 -193 -34 -37 12 34 20 115
2980A15nj70K03j01l1MR3j99L0K4j79L29o9k1J82n7k93R2K27j31m9L0r9O9J8M4
$$ 115 110 -60 143 42 11 15 108 -91 -61 -37 -216 113 44 23 205 148 -145 -53 174 43 -6 24 -75 -6 12 56
3006E6o6j86K09o5J60j97J74j15P6J48m14K16j27J34l5M1m4J00m2m9OL4P5n3q1
$$ 56 -10 -196 13 -52 108 -89 85 -30 46 194 -220 -4 -131 3 -32 9 -35 65 23 -26 -20 14 89 36 -45
3031d5o4J23o7N5j38J72o7J14j54J96Mj50J28q1n3p3L10k28M4N8j0j72K9L3N8
$$ -45 -109 14 -53 2 -136 36 -31 83 -71 125 129 -21 107 26 -27 -100 210 -18 26 84 74 -98 -69 -36 22
3056B2M3p3K7M7q7L4n2L23k41j0J20k46N6M3j2m8N4o8k1J30q7J64j81o1K25O8
$$ 22 65 -8 19 66 -21 13 -39 284 43 33 153 -93 -37 6 -6 -54 0 -68 -89 41 -46 118 -63 -124 101 169
3082A69k30Q3j62J01O5M1j08o3J99O1j09Ml5n5R1J9j71J10%Q4q6J36k69J70p0
$$ 169 -61 22 -140 -39 26 67 -41 -104 95 156 47 51 16 -39 52 71 -100 10 10 94 8 144 -125 45 -25
3107b5P3j54R8j98J08N2Q7k9p7J14M3k45L2K82j20J98l46J79m9J50k51J61j39
$$ -25 48 -106 -8 -206 -98 -46 41 12 -65 49 92 -153 -121 161 41 239 -107 72 23 173 -78 83 -56
3130e6N5J55j53O7k92M11p7k8j20j2k9R2J10j14J4L7Mm9r2O1KM8M5j02J26r9R3
$$ -56 -1 154 1 68 -224 187 110 82 -38 -50 -79 13 123 9 23 60 64 15 -77 -16 -14 34 79 -23 103 4 97
3157I7o9k6j4J65J6j04j22n3R6n5J27j32J02kk8rj20K72k32J90r0k3RJ05r5j25
$$ 97 28 2 -12 153 169 65 -57 -110 -14 -69 58 -74 28 26 -2 -11 -131 141 -91 99 9 -14 -5 100 5 -120
3183a20Q6K47j66p1N3o7R4L1j62J30K9k00K01m6pJ89k90J02j1j73n6K54j28Q6
$$ -120 -34 213 47 -24 29 -38 56 87 -75 55 84 -116 85 39 32 221 -69 33 22 -151 -207 47 -81 5
3207EJ9qj14K41j93L9J42j41j16J49j7J4l34K04J40J7r3P1RR0k06j57K67o7q5
$$ 5 24 16 -98 143 -50 -11 131 -10 -126 23 6 20 -314 -110 30 47 -46 25 34 124 -82 -239 28 -39 -124
3232a24J09k4J42j52j29K19j20l2J8K15r9j34Q5j66P8Q5P8l1r2R7r2R7O6r2R8
$$ -124 -15 -39 103 -49 -178 41 -79 -111 -93 122 23 -111 -26 -192 -114 -29 49 18 -74 23 -69 28 94 2 100
3257A00j83J37L7j17J8Q7k9j24M3O6r8n0K68j57l5N7o3J2L0J76k32O6q3Q3K2R
$$ 100 -83 54 91 -26 -8 79 50 -74 -31 35 -63 -113 155 -2 -37 20 -43 -31 -1 175 -57 9 -74 9 31 40
3283D0rM1o8k12K73qR9j09m2k6J16j8j85P2j34K20on7K2jK9k18J37p1J76p5O5
$$ 40 31 72 4 -208 65 57 156 47 5 -21 95 77 -108 -36 -170 50 44 -13 9 8 37 -181 -44 -115 61 -14 51
3310E1j92R9n2P4p5J4J26J44l36K17O5j44m4jM1J14Lj59J76l5j78J80m3m8j1K13
$$ 51 -141 -42 -94 -20 -95 -81 45 189 -147 70 135 -9 -53 -54 -13 101 104 -55 121 86 -92 88 45 -3 -14 199
3336A99k06O4j2pK1k5j26L8O4Q0n7m6J04P4j57r6R9j13JJ03o2n2J71k78k6J24
$$ 199 -7 57 45 38 59 34 -92 -54 10 90 33 -13 91 165 8 -88 11 -102 -101 2 -60 -112 59 -219 -245 -121
3362a21K11k1j1L5j82LK13j86J70j44p1P6o6j5J49K5j36K4O1m1m7N6J85k53J3
$$ -121 90 69 58 93 -89 -86 127 -59 111 -33 -104 -28 -94 -109 40 65 -71 -47 14 -27 -74 -18 167 -86 -73
3387g3J84j07K00l29K24j62P8j4k42K52Q2j08J8l4J04j10J17j48jk7M9J83j27
$$ -73 111 4 204 -125 99 -63 15 1 -241 11 93 -15 3 -31 73 -37 80 -68 -69 -96 -47 136 9
3410IO5o3j46R5J86k1qn4o2n6R0Mm4k5j71J32K18j57P9j62K57k06o6K0J43p0j44
$$ 9 74 11 -135 -40 146 125 117 63 1 -55 35 39 -5 -30 -201 -69 149 -8 71 -91 166 -40 -106 -86 57 -13 -157
3437a57K98j75k6J25q4P2k3k6j37K39j97oK95l28l5J02K13l17K96k80j4K17j37
$$ -157 141 -34 -60 65 -19 53 30 4 -133 106 -91 -97 198 -130 -165 -63 150 -167 129 -151 -165 52 -85
3460h5J40J4j8l7q6OK47r8N7j21l2j67K32o2Oq9J35qj47J27j6R3j43J9j7J98J
$$ -85 55 69 51 14 -72 -66 181 83 140 19 -13 -180 52 -10 -4 -93 42 34 -113 14 -2 91 -52 -33 -50 148 149
3487A49k78J54j0n8l3J47j59J59j69J25K4L5j99J17N3r4m8J19r2J71k16O5j12
$$ 149 -129 25 15 -43 -76 71 -88 71 -98 27 51 86 -113 4 57 -37 -85 34 -58 113 -103 -38 -150
3510a50J08K38k87J92r0L6j46K01n5k9m1J55l9o9j86K08qP3j58R6j18p4J45q4
$$ -150 -42 196 -91 101 11 47 -99 102 47 18 -23 132 93 24 -162 46 38 111 -47 49 -69 -143 2 -82
3534h2J37lJ18k62k6p5J91j49J43Q1J7pj36J80j40m8j3J98j48j06L54m86M45k87
$$ -82 55 52 170 -92 -118 -193 -2 -151 -8 73 90 83 -53 127 -13 -61 -74 124 -24 -130 224 -262 183 -104
3558a04J47L2j48J09j12j2K38j25m8j07R2K02j12r6J08j51J07L9j94P6l6K29l57
$$ -104 43 75 -73 36 -76 -88 150 25 -23 -130 -38 164 52 -44 64 -87 20 59 -135 -59 -95 134 -223
3581b23J47p8K30j54J21J35Jr7m8k03O2J00o9P7JK0n8j9Q4O7j77J57q1l8q8K27
$$ -223 -76 -154 76 -78 43 178 179 82 34 -169 -107 -7 -76 1 2 22 -36 -55 29 96 -81 76 -5 -43 -131 96
3607I6j93J16j4J36j43O1o3R0k4j83K9J49q2P5N9j56L5k2J9O6L1j35J75J57m46
$$ 96 -97 19 5 141 -2 59 -4 86 62 -121 -92 57 -25 50 109 -47 -12 -34 -15 51 82 -53 122 279 -167
3632a67M0J93J53k58M2j42K17q0k3l4j0P9L8L2k50K01K2m50L80P2p7L8J13j54
$$ -167 -127 66 219 -39 3 -139 78 -2 -25 -59 -69 10 48 80 -170 31 53 -397 -17 55 -22 16 129 -25
3656b5Q5r5Q7o0M2L4j15Nl6J5J35j44n7Q2O8q9J08PR0m6o6K7P7p9J6p1p9K8m5
$$ -25 60 -35 52 -8 34 68 -47 -42 -78 -63 72 -72 -129 -47 21 -68 40 47 137 91 25 52 129 50 66 -5 -84 -56 -101
3685a01J42j05l1J59j28J6Q3O2k03J77l9P5j69J77O8j84j23J07N7k65K11Q0mQ
$$ -101 41 -64 -95 64 -64 -48 35 97 -106 71 32 107 -62 115 183 -1 -124 -17 40 -225 -14 66 62 70
3709G0p4qp9K4K48j85j57O1P0K6P1o5N0j20N7J12JJ0O0j34q6n3l9J53r1K06j28
$$ 70 -4 -12 -91 -67 181 -4 -161 -100 -30 -4 67 2 52 -68 -11 101 102 112 172 38 -48 -101 -140 13 -78 128 0
3736@J32j2j73p9J19l9m0J9J18r3O0L8N8k23J61o4j42J21J29j05J70k39N0R6j90
$$ 0 132 120 -53 -132 -13 -52 -92 -73 45 -48 12 50 108 -115 46 -18 -160 -39 90 -15 155 -84 -34 62 -128
3761a28J32j32J61j66J80Qkj83J46R9n5o4k3K33j16j66P1L7p9Kj2N2n7Q8m8J15
$$ -128 4 -128 33 -133 47 55 53 -130 16 115 60 -4 -27 206 90 -76 -5 32 -47 -45 -57 -5 -62 26 -22 93
3787I3j22k5olJ02o4N2Q3j73J71J02l16J39j7J1K0J1q4J6r6J34L8r7P7j06R3j72
$$ 93 -29 -54 -60 -63 39 -25 27 110 -63 108 210 -106 33 16 27 47 58 -26 -10 -106 28 66 -31 46 -60 33 -139
3814a39K35k12J09N3m0l4R1p7Or8J18p4n1N9J12oj01J48q2J21j41J20j36J56j24
$$ -139 96 -116 -7 46 6 -28 63 -14 -8 -106 12 -62 -113 -54 58 52 -49 99 17 138 -3 117 -19 137 13
3839A3K8m1L0J40l75J11jj17M32k64M8M4j69J06l4O8o1JqR0k4J15p9j96J65K6
$$ 13 41 0 30 170 -205 -94 -95 -212 220 -44 4 48 -121 -15 -49 19 -42 -41 -49 41 17 132 53 -143 22 48
3865D8j38P2N5R4j75K7J16k31P2P6Q4l46J67J3P5qj07J23L4j98k1R7J51j31K14
$$ 48 -90 -18 37 131 -44 -17 99 -132 -60 16 100 -246 -79 -66 9 1 -106 17 51 -147 -168 -71 80 -51 163
3890A63k39J17L8k2n4n4K26k54M2P3l7p8J27j22R5R7k48J68l7M8J16k18J44p3
$$ 163 -76 41 79 57 3 -51 175 -79 -37 36 -1 -79 48 -74 21 118 -130 38 1 49 165 -53 91 18
3914A8n3k6J58m6j26J0J82N4k49J57o6k3j1N1J44r1k4j83J60j9J03k33J15P2K9
$$ 18 -35 -61 97 51 -75 -65 117 171 -78 79 13 -10 -21 30 174 83 59 -124 36 17 120 -113 2 74 103
3939A03j22n2O1j1pn2l8k4J64l5K4j88K66j36J52j07QQ4q3K8p6J38j36L0m1j49
$$ 103 -19 -71 -10 -21 -28 -80 -118 -142 22 -13 11 -177 89 -47 105 -2 6 90 7 35 -41 97 -39 -9 -50 -199
3965a99J80M4KM6n9OJ95j86R8k30O7R9k90J70J08j51J77J0j50j7J88j86M7O5k24
$$ -199 -19 25 27 73 14 20 215 29 127 -103 -36 63 -227 -57 51 -100 77 87 -63 -80 108 -78 -31 34 -190
3990a90J23L2Q4j52J29j8p9J29j3R1nj62J29Q3j53K7o3n8O6Nk7J58j11q1J97K3
$$ -190 -67 -35 49 -103 26 8 -71 58 45 136 131 -31 98 181 28 55 -8 -66 0 5 -22 136 25 -56 141 164
4016A64k36M0Q4Q5j46mJ0R3n7J4j21L8R1NM9k11J52n2Qr3q8J17J48j06q6J16R8
$$ 164 -72 -32 52 137 -9 -13 -3 90 33 47 -74 -36 55 60 109 -102 50 -2 6 -87 -175 -58 90 -16 -102 14 112
4043A12k44J40p1J56j62J14J30j98L4j6j63Q6J0J18r7j2J68K0l62L55j49J24j27
$$ 112 -132 8 -63 93 -69 45 175 -23 11 -5 -168 -82 -72 46 -51 -63 105 125 -237 118 -31 93 -34
4066c4jJ93k31R8L4j14M3N0j52K6qr3K73p7k4p6o6L18k66L7M2P0P0lj16j43K03
$$ -34 -35 158 -73 25 59 -55 -12 38 -114 -88 -96 -189 84 7 -17 -93 -159 159 -107 -70 -28 42 112 109 -7 -150 53
4093E3l8m9J15O9k55lJ3M4n5L51j78j42L3J55RJ98l19k2J8j01J70k18J41N4p0
$$ 53 15 -34 81 150 -105 -108 -95 -51 -106 245 67 -75 -42 113 122 320 1 -21 -3 -104 66 -152 -11 43 -27
4118b7%j1J71j64J35q3j33P6m2O1J06q2j29O1J28j67J30m0l4O1j1j55K21j30J29
$$ -27 -27 -38 133 -31 104 21 -112 -36 -78 -17 89 7 -122 -61 67 -100 30 -10 -44 17 6 -149 72 -58 71
4143G1j10Q6K1j65J03J25k41m9K67k28J00p8l7N5q1JK15j55J88p6j38P5Q4j69
$$ 71 -39 47 68 -97 6 131 -110 -159 108 -120 -20 -98 -135 -80 -161 -160 55 -100 88 12 -126 -51 33 -136
4167a36J27N7o1J3p9K08j09nj63L31l7n3k10P7Q5j43K80k09L8j36J58joo0j19
$$ -136 -9 48 -13 0 -79 129 20 15 -148 183 146 93 -117 -40 45 -98 182 -27 11 -125 33 32 26 -34 -153
4192a53O7K31j97M4O1q6K21j47n3Ol9P7LJ4j37J30j59R7J51j89K1J32j51J70j56
$$ -153 -86 145 -52 -8 53 -33 188 41 -12 -6 -45 32 35 49 -88 42 -117 -20 131 -58 -37 95 -56 114 -42
4217d2J12j11o9Q9pJ45k83J53L9p2L8M3j2j12M1J28J3O2k96J44J6ro3J29p9J16
$$ -42 70 -41 -110 -21 -28 117 -166 -13 26 -46 -8 35 23 -89 -48 80 93 155 -141 3 19 10 -53 76 -3 113
4243A13j71j9N7J11j39m3K59j18l7r9J36l3q9J20n2k7J73o7N7j63J27j19N2ql6
$$ 113 -58 -77 -20 91 -48 -91 168 50 13 -86 50 17 -72 48 -4 -31 142 75 132 -31 96 -23 29 21 -15
4268a5K2N1r5l1J08p1J0j08J0K2J08j23P8o5j25K99k38J21R0j49Q4K7M6p2K1p3
$$ -15 7 58 -37 -68 40 -31 -21 -129 -119 -97 11 -112 -34 -99 -224 75 -163 -42 48 -101 -17 10 56 -16 5 -68
4294f8J6R6K5o9N1Q6n6j54J57k4q4k3J87j61j24J85o5N0o4nJ58k25k4J35R4K2
$$ -68 -52 44 69 0 51 137 81 -73 84 60 -24 -47 140 -21 -145 40 -25 25 -39 -44 114 -111 -135 0 94 116
4320A16m1LJ2k6j98J17K35m28J67J0O9q3R4j76K0K3J82j9j12kJ55k12J80k15K30
$$ 116 75 78 90 64 -134 -17 218 -210 -43 -33 36 -47 47 -129 -109 -86 96 77 -35 -37 118 -94 86 -129 101
4345A01q2Q2j26k2J54k57m1L12K9j71R2j33n5J53l6O5k33K55k9j64q1JJ18m8J25
$$ 101 19 101 -25 -47 107 -150 -191 121 150 -21 71 -62 -117 36 0 65 -168 87 58 -106 -187 -186 -68 -116 9
4370IQ4j74R7Q0j74j17K33r8J5J40q8L14m09R1j10N0J24J12J8k15N7k04J05r8
$$ 9 93 -81 16 96 -78 -195 38 -60 -45 95 7 321 -88 3 -107 -57 67 179 197 -18 39 -165 -60 -158
4394a58J06J48r5j41J90l8n4j04R6J14q7j39J89m9n8k0J45m0N2J18j86j0j66K31
$$ -158 -52 96 1 -140 50 12 -42 -146 -50 64 -23 -162 27 -22 -80 -100 45 5 57 175 -11 -21 -187 44
4418D4m5J5M9o3J08k54J30N8r6J33o5MJK1nk8J27k69N2J13n1K2o6m7J56L0M3j69
$$ 44 -1 14 63 0 108 -146 -16 42 -54 79 14 18 19 40 35 7 134 -135 -83 30 -21 1 -65 -112 44 74 117 -52
4446e2l4K1O9j0J56j08j22Q4%J2R8k36O6R2k51K27M1M2m9j2o8rR2q2J48j42N2
$$ -52 -86 -65 4 -6 150 42 -80 4 4 16 114 -122 -56 36 -215 12 53 95 46 34 -34 -43 49 -33 115 -27 25
4473B5Q4j23j8K48j63j81K2J44j64R1J70k40kJ10R0L3k87K74r5L8K5j28J5P0J3
$$ 25 109 -14 -32 216 53 -128 -106 38 -126 -35 135 -105 -107 3 93 126 -161 113 18 56 81 -47 -32 38 51
4498E1kn6n5J10o8J2J03j45J41j57J50q6R0j09J33j25k9P0r9J59j77M4j18J77
$$ 51 49 -7 -62 48 -20 -8 95 -50 91 -66 84 -2 88 -21 112 -13 -42 28 -71 88 -89 -45 -163 14
4522A4j75J37j86L12l3N9r0m2O6K1j89R0r9K90k68J61R1k70K63k69J25L6k8J87
$$ 14 -161 -24 -210 102 69 128 38 -4 62 83 -106 -16 -115 175 -93 68 159 -111 152 -117 8 44 16 203
4546B03o7m2j05q0pK38l2j45J72l97J45J74j8J69p8j37m2qJ11j16K2J2j2J46k25
$$ 203 136 94 -11 -91 -98 140 108 -37 135 -262 -117 57 39 208 130 -7 -49 -57 54 -62 -40 -28 -40 106 -119
4571a19J93j8j20n6K15n3N6j43l8J78k1j47J1j56K08L5k7j03J28j33J56q0j26
$$ -119 74 56 -64 -120 95 42 98 -45 -83 95 74 -73 -62 -218 -10 25 -2 -105 23 -110 46 -34 -160
4594a60J55j07R6Mj9o1j5K31j30Mm1k5J36J55j44k75K05j09J68j44O7q5J37j01
$$ -160 -5 -112 -16 -12 -31 -92 -107 124 -6 -2 -43 -68 68 223 79 -196 9 -100 68 -76 -9 -94 43 -58
4618e8M2rj7L9p7K0O4k13K88j38K3J15k18J39J26m4k77L39j15m8j38J62j42K06
$$ -58 -16 -25 -42 -3 -80 -60 4 -209 79 -59 -36 79 -139 0 126 82 -195 144 29 -19 -157 5 -137 69
4642F9r3Q4q3K6J32j50kP8m8LP4J4kq8K1m4oj67L2P4R6K7OLk8O8j19l6J4J28p2
$$ 69 -24 60 -23 3 135 -15 -17 61 13 16 90 104 102 14 35 -9 -15 -182 -150 -76 20 47 53 56 28 96 -23 -59 -45 83 11
4673A1O6k2L4j86J49Rj45K80q5l18J03J60K8k04J50P4m5Kj37J88k83K54j77Q5
$$ 11 77 55 89 -97 52 61 -84 196 111 -207 -104 56 84 -120 30 104 59 61 -76 112 -171 83 -94 -9
4697iQ6j24N4O3m4R6k36J07k2J2K01k08L3J21j49N8K1j37qJ18j83J77J1r3P7K5
$$ -9 77 -47 7 70 26 122 -114 -7 -29 -17 184 -24 9 130 -19 39 60 -77 -85 33 -150 27 38 -55 22 47
4723D7L7j07j8M1O1j32q4L09n5j11q7K62j41J3J32j41q8K35j25Nj82J39k20K46
$$ 47 84 -23 -41 0 61 -71 -155 154 99 -12 -99 163 22 35 167 26 -62 173 48 53 -129 10 -210 36
4747C6o5j43K05M5j30J4P6N0r4l8K4L3j05J39J16l90L48j83p0K76N3j51j61J26
$$ 36 -29 -172 33 78 -52 -38 38 88 -6 -44 -20 13 -92 47 163 -227 121 -62 -132 144 197 46 -115 11
4771A1J86j20j02KK8rj7R2Jj41J72R8k31J6J07j35Q6j53L01j26M2nj19o3R0j45
$$ 11 197 77 -25 -23 5 -4 -21 71 72 -69 103 201 -30 -14 93 -42 44 -109 192 66 108 103 -16 -79 11 -134
4797a34Q1Q1r2P5n4rJqJ65j32m4J35k14K76k59N4o6J98k8%J23j87%R5l5j69mJ19
$$ -134 -53 28 -64 11 -43 -52 -51 -59 106 -26 -70 65 -149 127 -132 -78 -144 54 26 26 149 -38 -38 57 22 -147 -151 -32
4825c2R5l9oN3j98J31j7K0L1kK6j30J90l4j37n6Q3J1j8m4J79lj51M3l4M3K0j5
$$ -32 63 24 18 71 -127 4 -13 7 38 36 62 -68 122 88 -49 -105 -22 -11 -29 -73 106 103 -48 -5 -39 4 24 9
4853Iq0M5J50j11m0K2N3P2J1r9k7k58L05J07j20q4jJ82J66k24j45K2J04K3p3J
$$ 9 -71 -26 124 13 -27 -5 48 120 131 32 5 -253 52 159 39 -45 -46 136 302 78 -67 -45 59 82 9 10
4879A0Q7j90J03P0Q7j35j08J68K7r9Q2k0j34R4R7j11K5o0J1J25p3j04J36j50L6
$$ 10 97 -93 10 80 167 32 -76 92 119 20 102 82 -52 42 139 28 53 -7 4 129 56 -48 88 -62 -26
4904b6J63j6j64N5o5p4l8K24qNk2j3o1J8K2J02o6p4J52k44J40P9o1k0j51O6J90
$$ -26 137 121 -43 12 -53 -127 -165 59 51 56 34 21 -40 -22 0 102 36 -38 114 -130 10 89 28 8 -143 -77 113
4931A13p3n7K8j6l4J59M4l58K90q5j08n8M8J21j38K19k7j2p7J4N9j9k8O7r5O7
$$ 113 40 -17 11 -5 -39 120 164 -194 96 11 -97 -155 -107 14 -124 95 68 56 -21 -7 52 33 5 72 -23 44
4957D4n4J17j70P9O7j65J53j34k6P3J16j23o3K07j53J90k05o6K09j14j9q0R9J6
$$ 44 -10 107 -63 16 83 -82 71 -63 -89 -16 100 -23 -86 121 -32 158 -47 -113 96 -18 -37 -117 -18 -2
4981bM8Qr2L0LP0l00K17N3j22J63Q4p3J07k40R6j11p9K8K15K33l03k10J2K04J4
$$ -2 46 54 -38 -8 -5 65 -235 -18 35 -87 76 160 87 194 -46 50 -61 -140 -112 103 336 33 -177 -165 39 53
5007E3R7o1j19o7K34j83M2j49K48k92J83n1J75j15j17J57o7m1m2r4K39lJ9J4o3
$$ 53 150 89 -30 -97 137 -46 -4 -153 95 -197 -14 -65 110 -5 -122 35 -32 -73 -115 -209 30 27 46 60 -3
5032cJ55k15R3j01j0J20j26lO0O5k0m5J06J39k11kJ3J7K14j34j42M2o5P2m6J71
$$ -3 152 -63 30 -71 -81 39 -87 -90 -30 35 15 -30 76 215 4 2 15 32 246 112 -30 12 -53 19 -27 144
5058A44o6j91J05J06N1j99P9p1Q1j98J66L5q6J18j08q3J50n0L5r2J15j45Q4M8
$$ 144 78 -113 -8 98 149 -50 29 -42 39 -159 7 42 -44 74 -34 -117 33 -17 18 -74 41 -104 -20 28
5082B8n4J58j56rN4k2K4m9o6K36j44J48k8k27m5R7O8jj68J32J49N2j43L4lj20
$$ 28 -26 132 -24 -33 21 -1 23 -26 -92 144 0 148 120 -107 -152 -55 13 12 -156 -24 125 177 34 68 65 -55
5108e5O8K7k6l9J67k12J80j04R1p0L3p0l6J83n5j07n7O6q6J10%J84k21K6N4j72
$$ -55 13 40 14 -25 142 -70 110 6 97 27 60 -10 -46 137 82 -25 -82 -16 -102 8 8 192 -29 -3 51 -121
5134a21m6K78k15J69j21J97q6j79J36P7K09j92j48m1k4J02J72k10P2j60K16k8
$$ -121 -167 111 -104 65 -56 141 55 -124 12 89 298 106 -42 -83 -107 -5 167 -43 29 -131 85 57
5156E7%n9j32J19N4l1j4Q7q4k7P2j67K70qo2k40K11rj42J78k59K02j63J11J34
$$ 57 57 -2 -134 -15 39 8 -6 81 -3 -30 42 -125 145 137 75 -165 46 37 -105 73 -186 16 -147 -36 98
5181I8j87K3R4m4j19J46p0O4P9j17p5P1J0p2J26j34qJ67J7j49J12j12O6J35j71
$$ 98 -89 -66 28 -16 -135 11 -59 5 84 -33 -108 -37 -27 -99 27 -107 -115 52 69 -80 32 -80 -14 121 -50
5206e0J12j90J87o9L3n1M0K0q9J57p9m4J02j02J7K3Kj53l4K71l76L97j86P4J39
$$ -50 62 -128 59 -10 23 -28 12 32 -57 100 21 -23 79 -23 -6 17 19 -134 -168 103 -273 124 -62 12 151
5231A51j66o4M3M3L4k6J62j82k2l2Q0o1J4N2M1m1p2J50K3j38K15l15J6q9L43l9
$$ 151 -15 -79 -36 7 41 15 177 -5 -27 -59 21 -40 -26 26 67 26 -46 104 127 -11 204 -111 -95 -184 159 120
5257A20j25K43k56J45m1l2j91K08p4%P4j30J38j73Q9J34k73J51N8j06K3L0Q5j44
$$ 120 -5 238 -18 127 86 54 -137 71 -3 -3 71 -59 79 -94 -5 129 -144 7 65 -41 -18 12 97 -47
5281d7K09k45j5J44j44RP4K7o2J10L1k1m8K5m0J73o9k32K20k33J31jJ30p4l2r1
$$ -47 162 -83 -98 46 -98 -89 -15 12 -50 60 91 70 22 47 7 180 111 -121 99 -134 -3 -4 126 52 20 -71
5307g1J21l3j97N1J6K07j79KN2Q0r8K31j55Lj43L3J71j18K6J15j20k71K75L5N0
$$ -71 50 17 -180 -129 -113 94 -85 -83 -31 49 -49 182 27 30 -113 -80 91 -27 -1 114 -6 -277 -2 33 83
5332H3L0j17j40K79j42K01k35O7J00j52K09j95R0j40M4M4p4j20Q8J07j28pJ07
$$ 83 113 -4 -144 135 -7 194 -41 26 126 -26 183 -12 78 -62 -18 26 -48 -168 -80 27 -101 -108 -1
5355aj20k3K27m1q6j8J0o7K90j55K7j03J56j35NO5j19J10J1m1r6K2J43j61K45
$$ -1 -121 -144 83 42 -44 -62 -52 -119 171 16 43 -60 96 -39 -34 31 -88 22 33 -8 -104 -82 61 -100 145
5380A45p3j92P3j49K42n9M1j51P6L9qk8K7M7j16J72r0J1n1p1R9J76k58J22j07
$$ 145 72 -120 -47 -196 46 -13 28 -123 -47 -8 -16 -44 -17 30 -86 86 -4 7 -44 -115 -16 160 -98 24 -83
5405h3L4K0Qk9q5J37j63K52r7k1N2M4K9j50m0K1J10k3N0j15p7kJ09r7J62l9M0
$$ -83 -49 -29 -21 -50 -135 2 -161 91 -6 -27 25 69 98 -52 -92 -71 39 16 66 -49 -126 -128 -19 -116 46 7 47
5432D7J10k80LK02p6j90K66q9OJj3k7N0O7L1L1q6j00J56L8l1ko4o0J25R2k40l2
$$ 47 157 -123 -120 82 6 -184 82 -7 -1 0 -13 -40 10 77 108 139 53 -47 109 147 116 114 50 -10 115 207 -33 -65
5460f5J88j02j15L21j28l39K82j35N8P6r2J7l2j39L31j58J17j86q9J15J14o8K2
$$ -65 123 21 -94 227 99 -240 42 -93 -35 41 -51 -34 -66 -205 126 -32 85 -101 -190 -75 39 -29 -7
5483go8L3n4M9P1Np6mk8J66j02N4o1Q1j13%r3P7J67j45L1m3M8o0J30j27K4R6j54
$$ -7 -75 -42 -96 -47 24 29 -47 -51 -79 87 -15 39 -22 59 -54 -54 -147 -70 97 -48 -17 -60 -12 -72 58 -69 -45 51 -103
5512a03O5O6m3O0m5j19K23n0R1O0l26J30rl4j7J04q3J62k23j07K76j73j03J96
$$ -103 -38 28 -15 45 0 -119 104 54 145 205 -121 9 0 -34 -51 53 -30 132 -91 -198 78 -95 -198 -2
5536bJ41j56j45K65j61J05q0Pj03K33m9q4J99j74n5M6N2k10O7K21j11j34J50q
$$ -2 139 -17 -162 103 -58 47 -33 -26 -129 104 55 -29 170 -4 -59 -13 39 -171 -104 117 6 -128 22 14
5560A4l8R3j57K30k22J20q3NJ2j26K16j34J04K7P3j26M5p1n6Q1J25j35P0J7q5
$$ 14 -24 69 -88 142 -80 40 -43 -38 -26 -152 64 -70 34 61 134 8 53 -18 -74 7 132 -3 67 84 -1
5585al3K02p4j38l1O8p4O0O2m6kj10J08j34R6L5J07N3j8Nm3l5j40k4L4J4J01j75
$$ -1 -34 168 94 -44 -75 -7 -81 -21 41 -5 -7 -117 -9 -143 -47 -12 95 148 130 135 92 57 -83 -107 -73 -59 42 -133
5613a33J51j43K37j98P5J46j28J79k25R1j02K02k50J08P0P0j24j31l1K84j15M6
$$ -133 18 -125 112 -86 -11 135 7 186 -39 52 -50 152 -98 10 80 150 26 -105 -136 148 33 79
5635G9M2p3j35j17K93j08m1Q6j13M4j3k9%L7J05n5k5K2K6r4J60k73L09j68J81
$$ 79 121 48 -87 -204 89 -19 -60 26 -87 -43 -56 -85 -85 -48 57 2 -23 -1 25 -69 91 -182 127 -41 140
5660A40j10K2j74MJ23M6n3M0j08O0M3j32P7J47j98J19L7j96O1k3K16l04J19N7
$$ 140 30 52 -122 -118 5 51 -2 38 -70 -10 33 -99 -22 125 -73 46 83 -113 -52 -75 141 -163 -44 13
5684A3j19K11j21J24P3j87j14J53P0j47O8j00J26JM7j82L4K0k0R3o3Q9j04O1O2
$$ 13 -106 105 -16 108 181 -6 -120 33 103 -44 24 -76 50 51 98 -84 -50 -30 -50 43 -20 69 -35 26 88
5709H8o1R0j38r9J64L3j80N8K2J98j04j06M8R7l1l4p3r4J17J01j96K09p8q8j16
$$ 88 27 117 -21 -120 44 77 -103 -45 -23 175 71 -35 13 110 79 45 -28 -122 -5 96 -100 109 31 -57 -173
5734a73J99m4R3q1L7L2q6M6K0k9k41K77m2j13J64L4Q7j56O2j17J05k1o4pP0n6
$$ -173 26 -18 75 -6 31 63 -23 23 43 14 -227 50 8 -105 59 93 180 24 86 -31 74 53 -11 -18 52 -4
5760dK2Pm6K5l9KQ0L0p2R4p7j81J58k13K85l1j16R5OJ9J51k58J49o2J09j40k8
$$ -4 18 25 -21 4 -35 -33 47 77 5 99 22 -159 -1 -214 71 40 -76 19 25 44 195 -63 86 24 133 -7 -35
5787c5ok1J8K43k03Ml6q3J35L3r9J02r3J74j6k01N5R3J01k05Q0j80J91Nk47L16
$$ -35 -41 -62 -44 199 -4 0 -36 -119 16 49 -50 52 -41 133 117 -84 -29 64 165 -40 40 -140 51 56 -191 125
5813A25p7O1j49J23j22J13r3k4M1J31q0m0N5o9k16J87j14J94O9j65j0R4l7L2J48
$$ 125 48 109 -40 83 -39 74 -19 -43 -2 129 49 9 64 -5 -221 -34 -148 46 115 -50 -60 34 -3 29 177
5838A77k23J05j55N8j7j15K58J02m33L69j18m8P1J07j92m7M5k7K19j42Q2j6p2
$$ 177 -46 59 -96 -38 -55 -170 88 190 -243 126 8 -40 31 138 -54 -101 -56 -83 136 -6 76 60 -12
5861a2ko0K5QK06j71NQ2j21J12p1J30j72J22l7j29q1N1K53j47ok9O5M5r5n0P6
$$ -12 -14 -74 -49 -41 165 -6 -1 81 -40 72 1 131 -41 81 44 -85 -166 -115 138 -9 -15 -44 21 66 -29 -79 -3
5888cn5j21K31qq9j36J01P3Q0N0k35O6jR0j31N3p3K00r2L8r4J39j37J06J33q7
$$ -3 -58 -179 52 44 -45 -181 -80 -7 73 123 -112 -46 -47 43 -88 -35 -108 92 0 38 -56 83 -54 52 185 98
5914I8l3p6l9r8J08o1NKm1N5N6N9k1O2j56R6K9j05J5k3K11j27q9l0J59j50R3m0
$$ 98 65 -11 -50 -148 -40 -101 -96 -94 -135 -80 -24 35 14 76 -80 16 45 -60 -45 -68 143 16 -73 -103 56 -94 -1 -41
5942d1j82K15M4OJ05Kq1kM0O0k21j37L71j88k15N2J16M8n1j6K09J45k41p5j37
$$ -41 -223 -8 36 42 147 149 68 66 106 166 -55 -192 179 -9 -224 -172 -56 -8 -59 -75 134 279 38 -37 -174
5967a74J92J38k91J67j34J48J1M1j71M2P7j99K54o7M9J7q8P5k37K20j97K12j6
$$ -174 18 156 -135 32 -102 46 57 98 -73 -31 46 -153 101 34 83 100 12 87 -150 70 -127 85 69
5990F9Qp0L1j46R3O1j01n5J76P8j59J9n7K14j53N1N5j1J41j99j72K01j15J9P4
$$ 69 77 7 38 -108 -15 46 -55 -110 66 144 -15 4 -53 161 8 59 114 103 244 45 -127 74 -41 -22 52
6015E2J8N7j64m0N0N6L4k66J17J57j19J26k2j13M0J20k31J41j13j4Q8Q0j51J50
$$ 52 70 127 -37 -77 -27 29 63 -203 -86 71 -48 78 56 -57 -17 103 -128 13 -100 -114 -26 54 -97 53
6039E3P6j89K34j30mn5l8J33r0j39J91Qj06N1p7oL48j69p2J44j00p3n2L3oL4J38
$$ 53 129 -60 174 44 40 -15 -53 80 -10 -149 42 50 -56 -5 -82 -88 260 91 19 163 63 -10 -62 -29 -35 -1 137
6066A37k25J63K3k12J92o5M6j20J22r6L2N4K7r1n8K49j21m7l1p2j74K15O6pL1
$$ 137 -88 75 98 -114 78 13 59 -61 61 -35 -3 51 78 -13 -71 178 57 10 -21 -93 -267 -52 14 7 38
6091C8q4p4r7K48O3o9J1J85j70j17J8K03j44k0p0K87l50J74M8Ql7L3j1nj31R6
$$ 38 -46 -120 -217 31 94 25 36 221 51 -66 -48 155 11 -9 -79 208 -142 32 80 88 51 84 73 68 -63 33
6117C3rK44k33m1J80j61n7L6J37q3r9j06J70K3o4k9k3K0N9j25J98j01j4OM1j38
$$ 33 24 268 35 -6 174 13 -44 -8 129 46 -53 -159 11 34 -30 -59 -82 -62 -3 -128 70 -31 -45 -39 2 -136
6143a36Q1J24j39K1Q3kq8P9j02K04r0M0j66j1pL2J92k49J80K4O9n8l8J00j53M8
$$ -136 -55 69 -70 -49 34 32 -56 23 -79 125 35 75 -91 -102 -109 -77 115 -134 46 70 139 81 43 143 -10 38
6169C8j43J20j4J03Q0j39j95J00M7O8l4Nr3K7L2l6j7J01k0k3M5o7j9J62j51k02
$$ 38 -105 15 1 104 184 45 -150 -50 -3 65 31 36 -57 -30 2 -34 -51 50 30 7 52 -15 -34 128 -23 -225
6195b25J54Q5Q5q7j75K4K61j38J83j49j50J93k04K90j14O0j85J16J13l05K15q8
$$ -225 -71 14 99 12 -163 -139 122 -16 167 18 -132 61 -143 147 33 93 -92 24 137 -168 47 -41
6217d1J02j26O6P6k56J40N9J05k80L5J60j12J98m8k5o3L8n2N5j60O2oMK3m5O1
$$ -41 61 -65 1 77 -179 -39 20 125 -155 -120 40 -72 126 78 53 -10 28 -24 31 -129 -67 -73 -69 -46 -91 -30
6243c0J45j16J77m9j46K0M3J3Q1j73o0J60m7p8J7pJ0J73k73J35N1m3r1J25J9p5
$$ -30 115 -1 176 127 -19 1 44 57 138 -35 -95 65 18 -60 -43 -50 -40 133 -140 -5 46 3 -88 37 56 -19
6269a9J88k56J41j8k27L20l40J78L6j30K00k07R0p9K04j27K22o1j51K12j35k3
$$ -19 169 -87 54 36 -191 129 -211 -33 3 -127 73 -134 -44 -123 81 -46 176 115 -36 176 41 18
6291A8l0m1K3l9j0N5j8R7q9N0j02J36JM1lo8j12%K54j92P5n1j5m0n5%J81R1j53
$$ 18 -12 -53 -30 -69 -79 -24 -42 55 -34 16 -86 50 51 92 89 21 -91 -91 163 -29 46 -5 -20 -60 -115 -115 66 157 4
6320DN0n9L0L1n3r3K41k17L5o9O8p0K2J45l3J8k31O5j28L30J32l01P5o0KJJ42
$$ 4 54 -5 25 56 3 -90 151 -66 -31 -100 -32 -102 -80 65 32 50 -181 -116 -244 86 218 -83 -8 -68 -66 -65 77
6347G7m3j23J29k04K54rM8m4j41N9k39K17m3O7k0L8L9l6J29k13K12k01j38K33
$$ 77 34 -89 40 -164 90 81 129 85 -56 3 -236 -19 -62 5 -15 23 62 26 155 -58 154 -47 -185 48
6371D8n1P5q4M4j52J4J50N7j27n9J12o3p3J75J6j52R1J30j14q4O2k06J19K17j45
$$ 48 -3 72 -12 32 -120 -106 44 101 -26 -85 27 -36 -109 66 82 -70 21 151 37 -47 15 -191 -72 145 0
6396@l5J18o0j01q3J67L4J15j42J30k23J90n3J9M2q6p3K0j28q8K81j29N2P4n4
$$ 0 -35 83 23 -78 -161 6 40 155 13 143 -80 110 57 76 118 32 -41 -21 -149 -237 44 -85 -33 41 -13
6421a3K4k0j07J03o0J67oL1j43k9P3p0j7M5J12p3j31J25m2J08M6j29M9p2J08j33
$$ -13 11 -9 -116 -13 -73 94 88 119 -24 -53 20 -50 -67 -22 90 17 -114 11 -31 77 123 -6 43 -29 79 -54
6447e4O1J5J45J7j60q4QM4J1J7o3M6K4pr7J19oq5Q6j76N1J9oK2j7P8l2r3J03N3
$$ -54 7 22 167 184 24 -60 -52 -8 3 20 -43 3 27 20 -77 42 36 -49 37 -139 -88 -69 -75 -53 -70 8 -24 -117 -14 39
6477C9Q3nm5j2MQ1k61O7q5J54J9r0J60k80K44r5R2J30k19L3p6J97j76nJ50l8j32
$$ 39 122 117 72 60 64 145 -116 -49 -134 20 39 -51 109 -171 73 -22 70 200 -19 14 -62 135 -41 -46 104 66 -66
6504f6J85j23J6O3%M8q3n4J77j54o9J01j8q7j8J47r6j18J34j15O6K2K3K01k88
$$ -66 119 -4 12 75 75 123 40 -14 163 9 -60 41 23 -64 -82 65 -31 -149 -15 -130 -64 -42 -19 182 -106
6529a06K99l08J86q6Q0j24N0J52m2j77Q4n6j2R0M3mj60j8J11k2M7j18J57k11J66
$$ -106 193 -115 71 -15 65 -59 -9 143 101 -76 8 -48 -60 30 73 69 -91 -109 2 -20 27 -91 66 -145 21
6554B1m9O3O3l4j20P3n3J24J3j01r7k0K2O0Q6N6m3O3j26l8J7lJ32j18m6Q5j67
$$ 21 -28 35 98 64 -56 17 -36 88 101 0 -97 -117 -95 -35 51 107 64 127 1 -37 -20 -23 109 -9 -55 30 -137
6581a37K79r7N5pl8N7m2k19N6Q5q8M2P7q4J54j57P0J8R3j95l8J28J54j10p2k0
$$ -137 142 45 100 93 55 112 70 -149 -93 -8 -96 -54 23 -61 93 -64 6 24 117 -78 -116 12 166 56 -16 -36
6607c6J43J00j62j60J41j1P8j30P4L0J32r6j14J52q1m3l8P8j42K06P7l1j46J4
$$ -36 107 207 45 -115 26 15 93 -37 37 67 199 103 -11 141 60 17 -21 57 -85 121 198 167 21 35
6631C5M0o7J53j57j9N6l04K52m3m5Q3J41k31K3j6J01L1M8j0j12l3J95k05J49o9
$$ 35 75 8 161 4 -15 41 -263 -11 -54 -99 -16 125 -106 -83 -99 2 33 81 71 -41 -74 121 -84 65 -4
6656dK1o1L6o9rR2j2J41j84J18k08K20J4j6n5k2M3j23J01Q6j08N2N6r5j15Q3m1
$$ -4 17 -44 -8 -77 -86 6 -6 135 -49 69 -139 81 95 79 24 2 45 -78 23 109 1 53 109 14 -101 -18 -59
6683e9l8J72o7pJ9Rq3R6j6m6L9j01LJ15K03j23k12J88q3k4P1q6O3o7L1n1J39m9
$$ -59 -97 75 8 1 20 29 -54 42 26 -20 19 -82 -79 36 239 116 -96 92 9 -15 56 -30 33 -34 -3 -54 85 36
6711C6j6J09n4k7o6L6RK3J1j35O4j4J33o8k3q1mJ18k15K25j60p0J81j16Q7K8P8
$$ 36 20 129 75 48 -18 18 27 50 61 -74 -10 -24 109 41 18 -63 -67 51 -164 61 -99 -169 12 -104 -17 11 89
6738H9pJ7j83J00J9j48m5J15O1k06K97j45j9J71j60Po5k7K26k07j7J45O6j8p8
$$ 89 82 99 -84 16 35 -113 -158 -43 18 -188 109 -36 -55 116 -44 -37 -102 -129 97 -110 -127 18 84 66 -12
6763a2q3J31l7K5j20L7n4J81o3p0K30j13k8P1o0R3n3k9r3J10Jl3J8j43Q6J02j49
$$ -12 -95 36 -1 24 -96 -59 -113 68 5 -65 165 52 24 95 35 128 75 46 -47 63 64 31 49 -94 -8 94 -55
6790e5J32k8O0n1K6l9rJ35l23M0O9J33j85P6Q7P0j11k02J26l7J55n5j29O2m2M9
$$ -55 77 49 109 58 84 45 36 171 -152 -112 -43 90 -95 -19 68 138 27 -175 -49 -86 69 14 -115 -53 -95 -46
6816d6L3q1o5k4Q0K23rk9r9j7J4K0K2L9J03p9p7R9j73J36r9Kj0L3J08k1j86j8
$$ -46 -13 -94 -159 -183 -103 120 111 82 -17 -34 -20 0 22 61 164 85 8 107 -66 70 -29 -27 -37 -4 104 83 -103 -121
6844a21J12q6R4o9J22r0L0KQ7j67j4j17J56o4K95k01J95j40l6k0M0O0q8J20r4
$$ -121 -9 -95 -1 -70 52 -38 -8 -6 81 -86 -100 -217 -61 -125 170 -31 164 24 -12 -32 8 68 -20 100 6
6869Fj8N9Q6j22p4L3O7K8N9j02N8j7j34j6m8M6K58j79lj71O5J48k4Jo2M7p4J78
$$ 6 -12 47 133 11 -63 -30 37 65 124 22 80 63 -71 -87 -135 -89 169 -10 -13 -184 -119 29 5 6 -56 -9 -83 95
6897I5k20j11L29p6l4N7kn7O1p0J02r0j10M2J36O7j22qP5j95O9m4j06R1J84j39
$$ 95 -125 -236 93 17 -17 40 38 -19 42 -28 74 -16 -126 -84 52 119 -3 -11 64 -131 -62 -106 -212 -121 63 -76
6923g6J99m3p1m4O2j67J48K1q9J06J04k05J80j95J0J26o7l9L8k1K04j73o6O9J00
$$ -76 123 80 9 -35 27 -140 8 29 -60 46 150 -55 125 -70 -60 66 -1 -40 -2 -23 181 8 -58 11 111
6948A11j25J06j86R6k3J23j35L8M8j34J80j97kJ39J40k75J18Q1j62mR5j37J32
$$ 111 -14 92 -94 2 -21 102 -33 5 53 -81 99 -98 -100 39 179 -96 22 103 -59 -63 32 -105 27
6971B7K8j28J85k9J1O4j41mK6o5J28o7J8j73J11J25j07K5j03N8j78J11P5J89j01
$$ 27 55 -73 112 83 94 158 17 13 39 -26 102 35 53 -120 -9 116 9 34 -69 -11 -189 -78 -3 186 85
6996H5k1r3O5m1J03j8j7j46P1j8M5K2j08J42J48l06j5J62J6j24j8J4K8lR1j07
$$ 85 64 -29 36 -5 98 80 63 -83 -12 -30 15 37 -71 71 219 -87 -102 60 76 -48 -66 -52 -24 -27 64 -43
7022d3r8J40l2J30j51RQ7q1L6j82L50q2j81J15J29j10K0q1Q7K16k57l5k3J71j75
$$ -43 -141 -1 -33 97 -54 -45 42 -39 -3 -185 165 83 -98 17 146 36 56 -25 62 278 21 -14 -37 134 -41
7047d1J57p7k1j83N3J08J10k04J53p2O0L2j25J46k09J33j36Ko9K77ll9j44L61
$$ -41 116 39 18 -165 -112 -4 106 -98 55 -17 43 75 -50 96 -113 20 -116 -114 -183 94 91 52 -92 269
7071B69l35Q8L5o2Q8o2j45J69P1p2j10p1J80j58J38N9p5m4J04j27J03j8m5j4Q9
$$ 269 -66 22 57 -5 83 21 -124 45 116 44 -66 -137 43 -115 23 82 7 -37 67 -60 43 25 -20 -34 55
7096E5m6nM2p5L8pm2lR4O8q8OJ13j70J6k8R9l1j47P0J17j74K25m4k31R1jK03j54
$$ 55 9 4 46 -29 9 2 -40 -43 51 119 31 37 150 -20 -4 -32 67 36 -111 -41 76 -98 127 83 -148 -57 -58 145 -9
7125il2L9P2N5k97J77J60k54rl2K54q9j8l1o3K6j30P0Q2L8M4q4l0J05r6L7p7J98
$$ -9 -41 -2 70 125 -172 5 165 -89 -98 -130 124 35 17 -14 -77 -51 -181 -111 -29 9 53 -31 -61 44 -52 -15 -92 106
7153A06L3J7j46k20K45j96R6R3j46K71j64K8J0j01JJ11J89k49n6k1M1j02J00L6
$$ 106 139 156 10 -210 35 -161 -65 28 -118 153 -11 17 27 -74 -73 38 227 -22 -78 -99 -58 -160 -60 -24
7177b4m5J54o9j7N8o7O4N6k2p1J48o0j64J73l5j74Q5p2J31m2kM2J31k26R2p6L3
$$ -24 -69 85 16 -1 57 -10 54 110 88 17 165 105 -59 114 79 -95 -10 -82 49 7 5 47 178 -48 44 -32 1
7204AQ3p7r1R6r2l5L0q6J25K21j69Q8j07O4MK2j43J08o2N6l0Qj59R5M7j2rJ58
$$ 1 84 7 -84 12 -80 -115 -85 -171 -46 175 6 94 -13 51 55 77 -66 42 -20 36 6 14 -145 -50 -3 -15 -24 134
7232A34j93J2j48O1O5K6Oj51K22o1J67J4R7k58O8j66J80n9J80j33m8K09k52M1
$$ 134 -59 -47 -195 -134 -69 -43 -37 -188 34 -27 140 154 251 -7 61 -105 75 16 196 63 15 224 -28 13
7256A3j17K46k11J42N2r1r5K38j55q3J03J10k22P5O0j39J8J45J02j10j9r1J51
$$ 13 -104 142 -69 73 125 34 -61 177 22 -61 42 152 -70 5 65 -74 -56 89 191 81 62 -29 122
7279A22r4ql9lM7q5Q8P3J19j85l9L9Q9j60J40j05J60j33p5O2pok4R0l5K0J2r6
$$ 122 28 20 -19 -22 25 -60 28 101 220 35 -4 35 124 -36 104 -1 159 26 -49 13 6 0 -24 66 31 51 63 -33
7307c3J07j86K69n7j91P7N7M5p4n3J58k02J4J30M7k16O4N1J05j58k1p0J39Q5K0
$$ -33 74 -112 157 100 -91 -14 43 88 14 -39 119 -83 -69 61 108 -108 -44 7 112 -46 -67 -137 2 87 107
7332A07N4j67N4L4l6j19J33j18K26k11M1OJ03k59J40n3M8j2J29j80N4j34K08n7
$$ 107 161 -6 48 82 46 -73 60 -58 168 -43 -2 4 107 -152 -12 -65 -17 -29 100 -80 -26 -160 48 -9
7356im0R2j38J84k07J20L6l8k10M2J88Jm9J24m3l8P5j94J45j04O3j22K13p9K3
$$ -9 -49 43 -95 89 -118 2 38 0 -210 -168 20 21 -28 96 53 15 90 -104 41 -63 0 -122 91 12 35
7381C5j14J22q7m0Q7j46J79J3o0J35k78J76R2j40m0oN8P5j7j30j0J20%q5j7L29
$$ 35 -79 43 -44 -84 3 -143 36 49 -11 124 -154 22 114 -26 -66 -72 -14 61 44 -86 -96 24 24 -61 -78 251
7407B51k77jM2n7O7J27p8R6J6m0k70J84j28K04Kl39K91o0q2l5J12Q3j82R3o4j1
$$ 251 -26 -27 15 -42 25 152 74 170 186 146 -124 60 -68 136 138 -201 90 30 -52 -87 25 108 -74 19 -45 -56
7433e6n5K3J04k18K53p4p2k5O5J22l0M2k5J43l35K9N7o4P0J04J6J56k72J1K0M9
$$ -56 -111 -88 16 -202 51 -23 -95 -120 -55 67 37 79 54 197 -138 -109 -52 -116 -46 58 74 230 -42 -31 -11 38
7459C8m6m5K14p3J7l09N4N7P8k4j18J65O2r6L9j35J72m0o9Q1R0j67O1j04J67P2
$$ 38 -8 -53 161 88 105 -204 -150 -93 -15 -39 -157 8 70 -26 13 -122 50 10 -59 22 112 -55 6 -98 69 141
7485A41j73j06K26k19J70l8l07M24j09j00N1M1M7j51K40j34O7j60Q0K8K0J12j93
$$ 141 -32 -138 88 -131 39 1 -306 118 9 -91 -40 1 48 -103 137 3 70 -90 -10 18 38 150 -43
7508d3m0j6O3j17K52m0k6m8J1n3J79n7j56K80l31J17K42k64l0K7J8J06K20k72
$$ -43 -83 -99 -36 -153 99 59 33 -15 -4 -57 122 65 -91 189 -142 -25 217 -47 -77 -50 -32 74 294 22
7532B2rn3P6r3J03j10Q7j9M9p2J4K9J7m8N8k5J15k8m0m8r4K50k27O4P2MN6j55
$$ 22 13 -40 36 -57 46 -64 23 4 53 -19 -5 24 41 -7 51 26 141 113 73 25 -69 181 -46 18 90 94 150 -5
7560en5J2J94n4k19L0J74k07j03J41J28j04P1j52J55J87j84NL7n7j19K10k04J20
$$ -5 -60 -48 146 92 -127 -97 77 -130 -233 -92 36 -68 3 -149 6 193 9 14 51 -6 -125 85 -119 1
7584Al5o7J14k2l7j57K14m2J63k6k19j1J22l1J39n0j73N6R1O2j07J02j21M0j5
$$ 1 -34 -101 13 -9 -46 -203 11 -31 132 106 -113 -124 -2 -33 106 56 -117 -61 30 92 -15 87 -34 6 -9
7609iNO7m2q7J05j25Q6O3m5rK8j16J05l6l5j3Q6N8L2k0o8l1M7L1j70Q1j33K18
$$ -9 -4 63 21 -66 39 -86 0 63 18 9 37 -79 26 -10 -45 -58 28 86 118 98 30 -1 46 77 -93 -12 -145 73
7637G3K7P0j71k9KL3K9j15J85k8Qj00j9J43j80J26j19N0RJ38j14Pj67M7J14j92
$$ 73 100 170 -1 -30 -28 5 34 -81 104 76 84 -16 -35 108 -72 54 -65 -15 -6 132 18 25 -142 -95 19 -173
7663a73K62q6m6L1l3n4L5R2j96K63n4j36K32l31K96L4j44m7J47q1q0JK00j84J24
$$ -173 89 3 -43 -12 -45 -99 -64 28 -168 95 41 -95 137 -194 102 136 -8 -55 92 11 -69 -68 132 -52 72
7688G2j91J62j48o2L35j84J0p2J72K0k17J58p4lJ01l8M7j43J03j03J11k30L36
$$ 72 -119 43 -105 -167 168 -16 -6 -78 94 114 -103 55 -19 -22 79 41 88 -55 48 -55 56 -174 162
7711A62p6l9Jr2M0q3K18j17J1p6p7J62n6j95K44m3r5N9n1J09L1N6j93J4J69k21
$$ 162 86 47 48 -44 -4 -87 131 14 25 -51 -128 34 -22 -217 27 -16 -111 -52 -103 6 37 93 -100 -86 83 -138
7737a38K23j41N3K14k00K0r0N0k22J13O9J5M9l9L5n8l4M6N4pR9j84L3O3o4J03
$$ -138 85 -56 -3 211 11 31 -59 -9 -231 -118 -49 -34 15 -24 11 -47 -81 -35 19 12 111 -73 -40 23 -41 62
7763F2k0J36j57J8M7j95K11j10NK2J31k41K25j08q2J34j01r1p5J74N9k5J45j56
$$ 62 42 178 21 39 86 -109 102 -8 -3 19 150 -91 134 26 -56 78 -23 -114 -189 -15 44 19 164 8
7787Hk5J33j46P8J44k76P0j54J71J35p3j59J8P9k1P9L1M6o1j81K75p8k7k9j27
$$ 8 -17 116 -30 48 192 -84 -14 -168 3 138 65 -94 -76 3 -18 61 92 138 77 -104 171 93 66 37 -90
7812i0m2J29j94K0J26nQ8o9j3lP3M1m0P9l5j13L0J93j73Jk7O2l7O8K9N8l02M1
$$ -90 -132 -3 -197 -177 -51 -56 32 -37 -50 -53 20 61 21 100 65 -48 -18 175 2 3 -24 38 1 69 98 156 -146 -105
7840a05R3M4K3o0j68K5K02pj92J67J52j77J1j66R0k1J01j38J79j72J20O8r7J07
$$ -105 -12 32 55 -5 -173 -148 54 47 -145 22 174 -3 8 -158 -68 -89 12 -126 53 -119 1 69 -28 79
7864G9Lj97K06k67%J36J23r1P1J27j55p5K6mJ06k38Q6j1n1N3R5J9J0j83K12J11
$$ 79 82 -115 91 -176 -176 -40 83 -8 63 190 35 -40 -14 -18 88 -150 -64 -75 -126 -73 22 41 51 -132 80 191
7890A91j70n6o7J17jJ34j08k8M1r2q7L1Q0r0K25l0p7L6J22k41M6J14m3o3m0J53
$$ 191 21 -35 -102 15 14 148 40 12 53 -39 -126 -95 -15 -105 120 90 13 49 171 -70 -24 90 47 -16 -56 97
7916I7j41J66j82N3M9k9j57K47j5j1j25J5n4R4l3J26j09J08o6p4N7L8n1k0J2N1
$$ 97 -44 122 -60 -7 42 13 -144 103 88 77 -48 -33 -87 7 -26 100 -9 99 33 -41 16 54 3 -17 -5 46
7942D6pj08J53q6j7j48J60r2J03J2q2J7p6J18K20k24J38k1q4mj3L3N4L7l14J56
$$ 46 39 -69 84 -2 -19 -167 -7 -99 4 16 -66 -49 -125 -7 213 -11 127 106 22 18 5 38 92 129 -185 -29
7968b9j25K61j17P7k78L50j47O0n6j26K9N8P0kk02O5N8k4k3P3M1m8R2m3nk7j30
$$ -29 -154 107 -10 67 -211 139 -8 52 -4 -130 -101 -43 27 25 -177 -112 -54 -78 -101 -28 13 -35 57 14 9 -18 -148
7995a48K63l8p6Q3q4n9qR1M7JR1j79nJ63j64J74j37J6j17j14K40n0L3k4J68k10
$$ -148 115 77 1 84 0 -59 -67 24 71 72 163 -16 -21 142 -22 152 15 31 -86 -200 40 -10 23 -1 167 -43
8021d3J8o2O6J0l4K6Ln5lK3J58j38m9K36j24Mj07J20r6j96J59J35k4m5L2J14k3
$$ -43 -25 -87 -21 -11 -45 -19 -16 -71 -74 -51 107 -31 -80 156 32 36 -71 49 -47 -243 -84 51 27 -18 14 128 105
8048A05k18R3m4k1J23o0j09l8L9Q3jj5m4J94j6J6m8L8kJ83j62m0J72q8m1j80j9
$$ 105 -113 -20 -64 -85 38 -22 -131 -169 -130 -47 -48 -63 -107 87 71 87 39 77 75 258 96 56 228 140 99 -81 -100
8075a00R9j06kL00j71rR2p0j43K43j68Q9o3N7K2N0j04o1l1N4p6r4K48j84J15k
$$ -100 -1 -107 -109 191 20 11 103 33 -110 133 -35 54 -9 48 70 120 16 -45 -76 -22 -98 -192 56 -128 -13 -15
8101a5pk9L3J10L6r5j08J07mr9K02j43n3J8P7%K6J01p5j08qJ48o4r4R7l5j83K38
$$ -15 -22 -51 -18 92 128 33 -75 32 28 -71 131 -12 -65 -47 30 30 56 157 82 -26 -34 114 50 -44 53 18 -165 73
8129G3r9J27k02J40kl5J30k33J48KM6mr2N1k7j9j2R8M4j14j56K52k16M2n6M9J61
$$ 73 -26 101 -101 39 37 2 132 -101 47 49 95 91 -1 50 23 4 -8 90 134 20 -136 116 -100 -58 -114 -65 96
8156I6k1j19M1k8Q1kr6q7MJ56oJ09q4J24k77J61N0j81l9M0J67j44R9L6R4j1k66
$$ 96 75 -44 -3 -31 50 48 -48 -135 -131 25 19 128 44 168 -109 52 102 -79 -118 -78 89 -55 44 80 174 163 -103
8183a03J45p6j0J8Q3l4k4n7
$$ -103 42 -34 -44 -26 57 23 -1 -58
8191e8
$$ Imaginary data points
##PAGE= N=2
##DATA TABLE= (X++(I..I)), XYDATA
0@%%%%%%%%%%%qJ6j6J6k4L2m0M8n6P1p9Q8j11J35j53J77k08K40k78L18l60M13
$$ 0 0 0 0 0 0 0 0 0 0 0 0 -8 8 -8 8 -16 16 -24 24 -32 39 -40 48 -63 72 -81 96 -112 128 -150 168 -192 221
33B21m69N28n98O75p56Q45r45J054j172J301j440J592j761J946k147K367k608
$$ 221 -248 280 -318 357 -399 446 -499 555 -617 684 -756 836 -925 1021 -1126 1241 -1367
50a367K873l165L488l847M248m698N208n790O463p251Q189r325J0735j2547J4967
$$ -1367 1506 -1659 1829 -2018 2230 -2468 2740 -3050 3413 -3838 4351 -4974 5761 -6786 8181
65H181j8385K3615l2713N3057j83376L3982K11767j88774K7571J24855p039n6918
$$ 8181 -10204 13411 -19302 33755 -149621 -115639 96128 -92646 -65075 59780 52741 -4177
77d177Q0434p440o8910j1880L6195k2278j0141K303L460m104R862n954J082P27
$$ -4177 76257 68817 -93 -11973 24222 1944 -8197 -5894 -2434 -6538 3324 -2630 -1548 -821
91h21k00o114K693k279K095L913M065k695J013k73J047r84r2j587J387n5l12j351
$$ -821 -1021 -7135 -4442 -6721 -4626 -713 3352 657 1670 1397 2444 1460 1368 -219 1168 1113 801 -550
109e50n17j086J558J369j889k710K574L048j49k74J421j041j728n0N46j033j309
$$ -550 -1067 -2153 -595 774 -1115 -3825 -1251 1797 1648 1374 2795 1754 26 -24 522 -511 -1820
126a820L38R09K39N50M10K16o42j015j44L90l2J88N65L58n33Q09Q52J15p67r58
$$ -1820 -1482 -573 -334 216 626 842 200 -815 -959 -569 -601 -413 152 510 -23 786 1638 1753 986 28
146B8n70k14q7L2L41J48M78K00L71j21m35n12k10O0M3L6K86N5K9J20L54pj09N9
$$ 28 -542 -756 -843 -811 -470 -322 156 356 727 606 171 -341 -551 -491 -448 -412 -126 -71 -42 78 432 425 316 375
170C75o1k68Om8l02J17J16J4j04R1J19j66J04J87n0n4L4j43O5J6J00k46J00O3
$$ 375 314 46 52 4 -298 -181 -65 -51 -155 -64 55 -111 -7 180 130 76 110 -33 32 48 148 -98 2 65
194F5p1J35p8j27K90k75n2J11j21l8J52m4m0R1K59j28j79k1QJ38o7q0O7J83j66
$$ 65 -6 129 51 -76 214 -61 -113 -2 -123 -161 -9 -53 -93 -2 257 129 -50 -71 -63 75 8 -72 -5 178 12
219A2n1p5P3J06p0Mm0J33j68MN0J72p7J7p6k7m1L9K85j90M0kq0m9L0j31K56j56
$$ 12 -39 -114 -41 65 -5 -1 -41 92 -76 -72 -22 150 73 90 14 -13 -54 -15 270 80 120 118 38 -11 19 -112 144 -12
247a2R9j5O1N1j06j2m7L1k24K77Pj81J91q7r4J55j90J53K7j00j5j42K31Kj7j5
$$ -12 87 72 133 184 78 66 19 50 -174 103 110 -71 120 33 -61 94 -96 57 84 -16 -31 -173 58 60 43 28
273B8q2J7r0K3J89j4Q0j76j43J31J02K8q5l3q8nRL2J08k2J43J9j11q5l4mj02J95
$$ 28 -54 -37 -127 -104 85 71 151 -25 -168 -37 65 93 8 -25 -113 -118 -109 -77 31 9 152 171 60 -25 -59 -63 -165 30
301C0j27J36J39K2j85QM4j88J44m0O5j88O5M3L0q9K09j33j5Q6rk79K65lK7k9j09
$$ 30 -97 39 178 200 15 23 67 -121 23 -17 48 -140 -75 -32 -2 -91 118 -15 -30 56 47 -232 33 30 57 28 -81
328h1Q6N2j26J05j97Q7M5L0o6K7Q1j37J44M9N5j76j1L1j30K10r8J10k52J21Q2
$$ -81 5 57 -69 36 -161 -74 -29 1 -65 -38 43 -94 50 99 154 -22 -33 -2 -132 78 -20 90 -162 -41 41
353D1j13J72q9m8K2J16j00o0J09L9j23Lj44K84k34J38j64L14j46O5m4L5j68k5
$$ 41 -72 100 11 -37 -15 101 1 -59 50 89 -34 -31 -175 109 -125 13 -151 163 17 82 38 73 -95 -120
377a20R0k9J1M2j16J29oM6m5R9n4K5n8j22J43pj78N8l2J86j59L3O9R1j51K7j32
$$ -120 -30 -59 -48 -6 -122 7 1 47 2 101 47 72 14 -108 35 28 -150 -92 -124 62 -97 -64 5 96 -55 -28 -160
404a60J42O9j32k2LR1J13j51J8R8l8P5k29K4P8L30l25Q6o8P5l7j36J28k5k2J98
$$ -160 -18 51 -81 -103 -100 -9 104 -47 -29 69 31 106 -123 -99 -21 309 -16 70 2 77 40 -96 32 7 -15 183
430A83j07L1O1k12N1J11k91J04J90n8o3O3R2k36rJ07Q4r5k42J85K04o0m6j51j5
$$ 183 76 107 168 -44 7 118 -173 -69 121 63 0 63 155 -81 -90 17 101 6 -236 -51 153 93 47 -104 -119
455a19n9J71J37m4O4k17J7L9J18p6q9P9j63K38o2R8k7q2L9j18L3O8j58N5J06k15
$$ -119 -178 -7 130 86 150 -67 -50 -11 107 31 -58 21 -142 96 34 132 105 23 62 -56 -23 45 -113 -58 48 -167
481a67J03O7r4J27l08K52j49K57rj60m2J69qK1k7L3k21M1M8j0J71j43K01j5j00
$$ -167 -64 3 -91 36 -272 -20 -169 88 79 -81 -123 46 38 59 32 65 -156 -115 -67 -77 94 -49 152 137 37
506C7Q0l6q4q5O5K7j9J46k12K6J42j59Q0L2o3l9L1L13r3j67q4J86j5k56K65j21
$$ 37 117 81 -3 -88 -23 4 -15 131 -81 -55 87 -72 8 40 -23 -62 -31 282 189 22 -62 124 109 -147 118 -3
532cRL7J02K4r8o4q1Rk6r2pJ09jJ30k4q7rJ67rj90Q8n8j17O4J52J51k42J2j38
$$ -3 6 43 145 169 71 7 -74 -65 -91 -183 -190 -81 -82 48 24 -63 -72 95 86 -104 -16 -74 -191 -127 25 176 -66 -54 -192
561a92J68k0K11l17J31P4oL9j55J11j22R2kj30J14K15j97p8l2J46j34R3r6K01
$$ -192 -24 -44 167 -150 -19 55 49 88 -67 44 -78 14 12 -118 -4 211 14 -64 -96 50 -84 9 -87 114
585A14j04n3K4k8Q1q8P5J06n7K8M0j23J57j43k8j7j55L57J2k49K8M1n4J54k77
$$ 114 10 -43 -19 -47 34 -54 21 127 70 98 138 15 172 29 1 -16 -171 186 198 -51 -23 18 -36 118 -159
610a59J62k1o6M6Ok3j10L63j59K5j48Q7r5J36j47J14o8j4K22p3mq9nj03N3J53
$$ -159 3 -18 -84 -38 -32 -55 -165 198 39 64 -84 3 -92 44 -103 11 -57 -71 151 78 74 -15 -20 -123 -70 83
636H3j43J55k48Q1j1J00J25k06L1p8K59j49R0j13QN7J8j78J65j90J58o4OP0j06
$$ 83 -60 95 -153 -72 -83 17 142 -64 -33 -111 148 -1 89 -24 -16 41 59 -119 46 -144 14 -50 -44 26 -80
661h0K8J14j03k5j00J83j33J17j3L7n9N4l9J2j01J71K0O7k03j39K30j49MK38o5
$$ -80 -52 62 -41 -66 -166 17 -116 1 -12 25 -34 20 -19 -7 -108 63 83 150 -53 -192 38 -111 -107 131 66
686F6p7J46k28K1n3q8M21k87J76k29J23k0p9Q2J94j28J1j10J97o3k58L33k73J44
$$ 66 -11 135 -93 -72 -125 -213 208 -79 97 -132 -9 -29 -108 -26 168 40 51 -59 138 75 -183 150 -123 21
710B1J9N2j59K0N7M1r2j2J9J8k0J22k16K78k77Q6K09j66m5j5P9M3j14j8Q7o4P
$$ 21 40 92 -67 -47 10 51 -41 -53 -34 -16 -36 86 -130 148 -129 -43 166 0 -45 -60 19 62 -52 -70 17 -47 -40
737d0L6K08j69Or6l0J60l6j9j92J51o2N3N2J69j19j89P0J73K2k95K04L2j24l2
$$ -40 -4 204 35 41 -55 -85 75 39 20 -172 -21 -83 -30 22 191 72 -117 -47 126 148 -147 57 89 -35 -67
762f7K24k35J08m5J52j13O4q4m0j3J33L9k5j26K1L9nm4M4j04P0K4K9p4j2O1r6
$$ -67 157 -78 30 -15 137 24 88 4 -36 -49 84 123 98 -28 -7 32 27 -17 27 -77 -7 17 46 -28 -40 21 -75
789g5K25k71J23k42J81o9J68n2o1J28p6m9J07m5l5o3mM3O7L6n4J08j33j28K25
$$ -75 150 -121 2 -240 -59 -128 40 -12 -73 55 -21 -70 37 -8 -43 -106 -110 -67 0 36 -18 90 -43 -171 54
814E4m2K2r0j6r2K12L3o0j47L12j54j18J24j15q2J91p3J25k62K84j51J84j57L8
$$ 54 12 34 -56 -72 -164 48 81 21 -126 186 32 -86 38 -77 -159 32 -41 84 -178 106 -45 139 -18 20
838B0l0J34J5j28J78k36J37K2k3q5J15m4j68P2O2r6o7J02J20M6l92K91m7R0j30
$$ 20 -10 124 139 11 189 -47 90 112 89 4 119 75 -93 -21 41 -55 -122 -20 100 146 -246 45 -2 88 -42
863d2J5j10K02k33J26n8L06j80N1j2l4P0j04j95J12l5J23KJ7jO0o2j27L0M0N3
$$ -42 -27 -137 65 -168 -42 -100 206 26 77 65 31 101 -3 -198 -86 -121 2 4 21 20 80 18 -109 -79 -39 14
889A4kJ2mN4jj97L00k62J71R7j98J1J48q6j63M1N0Q2j66Q0l9R1QM2j30m7J12j00
$$ 14 12 24 20 74 73 -124 176 -86 85 182 -16 -5 143 57 -106 -65 -15 67 -99 -19 -58 33 41 83 -47 -94 18 -82
917h2J11J1j52J51k7K07k14p8R3N6k38J82K6o4R3o3J56k74J89l6qO1j01o8J04
$$ -82 29 40 -112 39 12 219 5 -73 20 76 -162 20 46 -18 75 12 168 -106 83 47 39 100 -1 -69 35
942C5K0j38J19L1k86J12J17J04l8k62J13R0j4J04q4Rj57NP6L1j2O1K3k21Q8p3
$$ 35 55 -83 36 67 -219 -107 10 114 76 -186 -73 17 3 107 23 32 -125 -120 -44 -13 -25 36 59 -162 -74 -147
968a47j47K08K78k19Q1j50J35m4P0L0j50O7J5j00m2J10Nj39J71r0K22p2q2j05
$$ -147 -294 -86 192 -27 54 -96 39 -5 65 95 -55 12 27 -73 -115 -5 0 -139 32 -58 164 92 10 -95
992i5L2J09m7K1l9j24J84Q9j78J26j66J1J6P9p4N5J4J03j00P2o6n7N5Q9Q9j30
$$ -95 -63 46 -1 20 -19 -143 41 130 -48 78 -88 -77 -61 18 -56 -1 13 116 16 88 22 -35 20 109 198 68
1018F8j1p2j5Rr2J74J30j12m0L0o3r9K16j32J1oQ1k40J25J07m8M4l1L9j33K3K2
$$ 68 57 -15 -30 -21 -113 61 191 79 39 69 6 -93 123 -9 2 -4 77 -163 -38 69 21 65 34 73 -60 -37 -15
1045a5J4j31J53q1K54j53o3n3K74m5j70J15j40P7L9m8J1j06J23j49J56p2o5Rk1
$$ -15 -1 -132 21 -60 194 41 -22 -75 199 154 -16 99 -41 36 75 27 38 -68 55 -94 62 -10 -75 -66 -87
1070h7J16Lo8J07k50K26j16J5K8J11k7R9n6j76P0p6K3J00p4J26j31L9nN9Nj42
$$ -87 29 32 -36 71 -179 47 -69 -54 -26 85 58 157 101 -75 -5 -81 -58 42 -32 94 -37 2 -3 56 61 -81
1096h1o5K27Jp5P7j29O0j42J49J28r4q6M0L7n6L0j02J69j12J77%j95Q7j06J16
$$ -81 -146 81 82 7 84 -45 15 -127 22 150 56 -30 10 47 -9 21 -81 88 -24 153 153 -42 45 -61 55
1121E5m0o4K0L5l4M7L7K39l57K2p0N8K54l09JL7J19j33K48j09j41J70m3j3j58
$$ 55 15 -49 -29 6 -28 19 56 295 -62 -40 -110 -52 202 -107 -106 -69 50 -83 165 56 -85 85 42 29 -129
1146a29J29Q4k13R5J04l1k66K13K23k25N3k35J30Q9o8M1O0j3j2k6m7J23j64O8
$$ -129 0 84 -129 -34 70 39 -227 -14 209 -16 37 -198 -68 21 -47 -6 54 41 29 3 -44 79 -85 -17
1170a7R5j34J52k08K59q0n6R5l1o1J7p0L2J27j39R1pKl1J07j33Pj0j19K01j07
$$ -17 78 -56 96 -112 147 67 11 106 75 14 31 -39 -7 120 -19 72 65 67 36 143 10 17 7 -112 89 -18
1196a8o0R6n0Qj7J54o9j42J03J7Ln8R4j72LL4k3PP8K39j01j57l2oJ28J67j30j48
$$ -18 -78 18 -32 -24 -41 113 44 -98 5 22 25 -33 61 -111 -108 -74 -97 -90 -12 227 126 -31 -63 -69 59 226 96 -52
1224e2P1N9J00j38n3j72K50o4l4J61r2J7j95J29J04k3l7L2J2n6j79K56j3j98j79
$$ -52 19 78 178 40 -13 -185 65 1 -33 128 36 53 -142 -13 91 68 31 63 75 19 -160 96 83 -115 -294
1249b94L24m7O7j64J47K8j85N4o3N5K47k08R7M3o2K5j29J35q4N4J19p3j0n6L2
$$ -294 30 -17 50 -114 33 61 -124 -70 -133 -78 169 -39 58 101 39 64 -65 70 -14 40 159 86 76 20 52
1274E2j22l6L1M9K3J19j32J28k42J98jL6k05M1K3l8lr7K50L3j19J79j45j5k9r1
$$ 52 -70 -106 -75 -26 -3 116 -16 112 -130 68 67 103 -102 -61 -38 -76 -79 -176 74 107 -12 167 22 7 -22 -113
1300a13L9O5J24j20n3m0O0N8m3L3L0K5p6r6J82l9j1R7k3Jk50Q4K68k21mQ4j82
$$ -113 -74 -9 115 -5 -58 -98 -38 20 -23 10 40 65 -11 -107 75 36 25 122 99 100 -150 -66 202 -19 -23 61 -121
1327a21K65j17k0M7r0J49j46R2m3J39j19Ll48L99j51J35k6j30L1l0J41r4K3M3
$$ -121 144 27 7 54 -36 113 -33 59 16 155 36 39 -309 90 -61 74 48 -82 -51 -81 60 -34 -11 32
1351C2j02j2P4J4J18J6j56j20J97j19K45j89K13r0j98Q6n6J1J1j9J0J19m0j55
$$ 32 -70 -82 -8 6 124 140 -16 -136 61 -58 187 -2 211 121 -77 9 -47 -36 -25 -44 -34 85 45 -110
1375a10J58j17j01J56p1M7K8K6j4kM9L8j00K9j11J42J53j15j45L3L2P7j06K99
$$ -110 48 -69 -170 -14 -85 -38 -10 16 2 0 49 87 -13 16 -95 47 200 85 -60 -27 5 82 -24 275
1399B75k32Q7k47J26j4n3K60j82n8j27J76LO4n0oqO2j56J96Lk23P4k7O0o1Q4j32
$$ 275 43 130 -117 9 -5 -58 202 20 -38 -165 11 14 78 28 22 14 76 -80 116 119 -104 -30 -57 3 -58 26 -106
1426a06J35O6j36J68p7j6j80J85l1M4j12l9J58j15M4j40L6K06j49l2r5M6K38j23
$$ -106 29 95 -41 127 50 34 -146 39 8 52 -60 -99 59 -56 -12 -152 -116 90 -59 -91 -186 -140 98 -25
1450b5J04j87J9p7L9J54j36J58j03J75j52J6j27K85p9j56M5O7q2j39P8n6J44J7
$$ -25 79 -108 -89 -166 -127 27 -109 49 -54 121 -31 -15 -142 143 64 -92 -47 20 -62 -201 -123 -179 -35 -18
1474a8j3j05Q5L9j03J3R9J52k66jN4J23l1j68J04j03R6J36j26J8J40j91n3P3K16
$$ -18 -31 -136 -51 -12 -115 -102 -3 149 -117 -118 -64 59 28 -140 -36 -139 -43 93 -33 -15 125 -66 -119 -46 170
1499A70k70J11L4j60Q3M7k0N1o7K6j0O3R4j70M8j9M5j58QK34q5R3k28MJ43P7P4
$$ 170 -100 11 45 -115 -32 15 -5 46 -21 5 -5 58 152 -18 30 11 56 -102 -94 140 55 148 -80 -76 67 144 218
1526B18n4l39Q3J19qMm0J26j54o7K03l6k9p8M8j6J18o9j03K16j88J86j83Q8j0
$$ 218 164 -175 -92 27 19 23 -17 109 -45 -112 91 55 26 -52 -4 -20 98 29 -74 142 -46 140 -43 45 35
1551C5j34K55j48J61k58j74L37j15J47n3N8k58J69o9L2j01K77r7j26J46Mj7k26
$$ 35 -99 156 8 169 -89 -263 74 -41 106 53 111 -147 22 -47 -15 -116 161 64 -62 84 88 71 -155
1574a55K89o1q5Oj11J58m9k0J31j28q7K49j63J54k91J20j27K50k52K02j80J62
$$ -155 134 73 -12 -6 -117 41 -8 -28 103 -25 -112 137 -26 128 -163 -43 -170 80 -172 30 -150 12
1596A2Mj91L56k54L6Q2J2j33J64o0k49L27Jl12L51j27j38J39Lm7L3J5J4Qj13r5
$$ 12 16 -175 181 -73 -37 45 57 -76 88 28 -221 106 107 -205 146 19 -119 20 23 -24 9 24 38 46 -67 -162
1622a62N7M5p8K04P8l1l6p7R5j42J32k54O4P0k2j23K60qk07Q6Qj88K30j29J71
$$ -162 -105 -60 -138 66 144 113 77 0 95 -47 85 -169 -105 -35 -57 -180 80 72 -135 -49 -41 -229 1 -128 43
1647D3j1j06r9J19J03K3M6j65J59j04J11j73Q6kQj65J59J9N0j95R5q0K06j7j86
$$ 43 32 -74 -173 -54 49 72 118 -47 112 8 119 -54 32 30 38 -127 32 51 101 -94 1 -79 127 110 -76
1672g6J22j73K32k40k0J4J60L2L8j05l3%r2K74j81P9L5j37M4J06J5q5jJ1n8P0
$$ -76 46 -127 105 -135 -155 -141 19 51 89 -16 -49 -49 -141 133 -48 31 66 -71 -27 79 94 9 8 19 -39 31
1698C1J26j20n0J61n9k65J63J22J3n5n1J80j80N6O2j08N0j36M1r5K4J7p5J72r7
$$ 31 157 37 -13 148 89 -176 -13 109 122 67 16 196 16 72 134 26 76 -60 -19 -114 -90 -73 -148 24 -73
1723g3J08n8J56n4J02r8p5N1n1J15J7j30k49J37Q4p6J5J34j22J01j39J70k19L8
$$ -73 35 -23 133 79 181 83 8 59 8 123 140 10 -239 -102 -18 -94 -79 55 -67 34 -105 65 -154 -116
1747a16R6J8o2Q1j23oL24j87j10j1J26q4l8J02K91l13J02M6j75M0K3l0M0m0J5
$$ -116 -20 -2 -64 17 -106 -112 212 25 -85 -96 30 -54 -92 10 301 -12 90 136 -39 1 24 -6 34 -6 9
1772Io6J30J16r4k01P0J46r5J6R5j57q6L17j80j28J11J26j0j41R7j12O0m4N3k51
$$ 9 -57 73 189 95 -106 -36 110 15 31 126 -31 -117 200 20 -108 3 129 119 -22 75 -37 23 -21 32 -219
1797b19L47p3l4O8O6k95P3J83k10K8q0K43p5M1j39K4P1J0j01J00M3J69m33L09
$$ -219 128 55 21 89 155 -140 -67 116 -94 -66 -146 97 22 63 -76 -52 19 29 -72 28 71 240 -193 116
1821A16pL9j14k7P3r2J30l5j49J8n8J97k81J99N5r4j1j26J93M9j75L45k20o7%
$$ 116 109 148 34 7 80 -12 118 83 -66 -48 -106 91 -190 9 64 -30 -41 -167 26 75 -100 245 25 -42 -42
1846d2J44n2j17J10j97R6l2J93j50r9J61q5l1J99j18j46J68J13q0k3n0J1J38R5
$$ -42 102 50 -67 43 -154 -58 -90 103 -47 -146 15 -70 -101 98 -20 -166 2 115 35 12 -38 -27 111 206
1870B06pj92j20J43j03J34j10o3n4J60Q3p8m3nqJ06o8j06J43oK2J8j09J66o8r4
$$ 206 199 7 -113 30 -73 61 -49 -112 -166 -6 77 -1 -44 -49 -57 49 -19 -125 18 12 34 52 -57 109 41 -53
1896e3Q8j05R0j20L6M3N4j3L9J54q0J0q3M2j74J03K0k03K28L8k21J30k66M10j91
$$ -53 35 -70 20 -100 -64 -21 33 20 59 213 133 143 60 102 -72 31 51 -152 76 114 -107 23 -243 167 -24
1921b4J03n1pK2k87K67J1n6J39j37J7Q2q3J28p9j72J98L9m3j0q7J74Q4j25k4j45
$$ -24 79 28 21 43 -244 23 34 -22 117 -20 -3 79 -4 124 45 -127 71 110 67 57 -30 144 228 103 79 -66
1947f6mJ98j85m9K46n0r6q4O3k0M4K0l0k26K58q9P3j25K40q0n8m7p6J07K8J9k5
$$ -66 -70 128 -57 -106 140 90 -6 -90 -27 -47 -3 17 -13 -239 19 -70 3 -122 118 38 -20 -67 -143 -36 -8 11 -14
1974a4j25J96j22p1mK51k48K05r9r0PJ70j10N7j06JR1J6Kjr3Q2lO8j72J28M4j35
$$ -14 -139 57 -65 -136 -140 111 -137 68 -31 -121 -114 56 -54 3 -103 -102 -11 5 7 6 -87 -5 -8 60 -112 16 60 -75
2002g5J3J4J86k13jLJ15j26L5m4O0n5n9j7J82j89L08j60m9J8M4O7r0r1rK52l26
$$ -75 -62 -48 138 -75 -76 -73 42 -84 -49 -93 -33 -88 -147 -164 18 -171 137 -23 -72 -54 -10 57 -33 -124 -133 119 -207
2029b07J32N0p5J19r7K23k15J22k40J11n1J90k1r7N0nJ69r4l7n8J7J03N5j59J73
$$ -207 -75 -25 -100 19 -78 145 -70 52 -188 -77 -128 62 41 -56 -6 -11 158 64 27 -31 -14 89 144 -15 158
2054A58o6r8P8p6n0L5J77j23j04n6J6K7J26Nq6p2J39L2q8nJ7p2j7M2Q2o9J23O1
$$ 158 92 -6 72 -4 -54 -19 158 35 -69 -125 -109 -82 44 49 -37 -109 30 62 -26 -31 -14 -86 -103 -61 21 -48 75 136
2082A36pl8k45M6J33j04R3q5L0K88l6k74K12o8m1l6O3k32Q2J15Mm1m9j75K68k
$$ 136 129 91 -154 -108 25 -79 14 -71 -41 247 211 -63 149 81 40 4 67 -165 -83 32 36 -5 -54 -229 39 37
2108C7R8Ll58K32R3n8rK7q6K5M1k5l2j48Q2j7K9J43m0j44n9M8Q7RP4j17j9K12
$$ 37 135 138 -220 12 105 47 38 65 -21 4 45 20 -12 -160 -78 -95 -66 77 37 -107 -166 -118 -31 -22 52 -65 -84 128
2136A28j96J4K3r0k5J22K5J5J18o6k04J53n4J06M8n2n3j51K40qj01J28j68J50
$$ 128 -68 -54 -31 -121 -146 -24 1 16 134 68 -136 17 -37 69 117 65 12 -139 101 93 -8 120 -48 102
2160A02p8j0J99l23O8m4J32n4N1J30j47kl6J10j00J02j70P7N1q9N3L6kl3m2L7
$$ 102 24 14 213 -110 -42 -86 46 -8 43 173 26 24 -12 98 -2 100 -70 7 58 -31 22 58 56 23 -19 18
2186A8MOO3j56R9q5L3J03k78L04j35P4K1k02j49L87j05k5j32Q3L5j7j36J55m8
$$ 18 22 28 91 -65 34 -51 -18 85 -193 111 -24 50 71 -131 -280 107 2 -23 -155 -72 -37 -54 -190 -35 -83
2211h3J11r1K4k4j17J49j2l7J81m9P8o2l5J12r8k18R0O6K2pJ12k37K53k05J57
$$ -83 28 -63 -39 -63 -180 -31 -43 -80 101 52 130 68 33 145 47 -171 -81 -15 7 0 112 -125 128 -77 80
2236H0k4o7L4o3P3k53J07J63rj21K39j28%pJr2J56j34J37J2j23M7j17J14K23k99
$$ 80 56 -11 23 -40 33 -220 -113 50 41 -80 159 31 31 24 25 -67 89 -45 92 104 -19 28 -89 25 248 -51
2262e1P1J0o9L8k2K4o7JrJ48o8J9K7J17j71J1L2P7j25l0O5r3R7k9J21r4J11p9
$$ -51 20 30 -39 -1 -23 1 -66 -65 -74 74 6 25 52 169 -2 9 41 118 -7 -37 28 -65 32 3 124 30 141 62
2290F2J67j68k36K97k20J28k6l3K16j27k10K02p3m0L0Q7r4orJ41j09QJ3j5J69
$$ 62 229 61 -175 122 -98 30 4 -29 187 60 -150 52 -21 -61 -31 56 -38 -44 -53 88 -21 -13 0 -15 154
2315A54k24K6m0o5J98%j04p7L02l15j16K88j82K56k34K16j52K8P8N8q1K7n1p3
$$ 154 -70 -44 -84 -149 49 49 -55 -132 170 -145 -261 27 -155 101 -133 83 -69 -41 37 95 14 41 -10 -83
2339h3J30R3mj95P0L7m4p7K46k22R3J40l11J00J9q4K8Qj2l3Q8J67k78K29k00q4
$$ -83 47 140 136 -59 11 48 4 -73 173 -49 44 184 -127 -27 -8 -92 -64 -56 -68 -101 -13 154 -124 105 -95 -179
2365a79K53p5R1k50J84j01J56l9j40J64J2j17K6J26j50J9J37k91K99j87J76o2
$$ -179 74 -1 90 -160 24 -77 79 40 -100 64 76 -41 -15 111 -39 -20 117 -174 125 -62 114 52
2387E2j06P8p6M3m4J30j80J48j39P5mj28K68m7l8m2L7m1P9Mj41J82k55J29J8j12
$$ 52 -54 24 -52 -9 -53 77 -103 45 -94 -19 -23 -151 117 70 32 -10 27 -14 65 69 -72 110 -145 -16 2 -110
2413a10J75r2J5q6M4O6o0N2j77J69k6K5k9K30j64M4q0J08k36P8K13k95K07k0j28
$$ -110 65 -27 -12 -98 -54 12 -48 4 -173 -4 -30 -5 -34 196 32 76 -4 104 -132 -54 159 -136 71 51 -77
2438g7O1J3km2J08j20N9L4p1N0O7k11J24P9j02J70p8k5q9K2L18j27l12K72k44
$$ -77 -16 -3 -5 -47 61 -59 0 34 -37 13 80 -131 -7 72 -30 140 62 37 -52 -30 288 161 -151 121 -123
2463a23J56J01j11p5N8Q2n2n6NJ16j76J45P2r4L0k54J67L1M2n6L9q9J35k77R7
$$ -123 33 134 23 -52 6 88 36 -20 -15 101 -75 70 142 48 78 -176 -9 22 64 8 47 -42 93 -184 -87
2488h7J11n9R5k31J16J19k3j07J46j78J10J34q5r5J32o6k96L60o2j80K07L0L4
$$ -87 24 -35 60 -171 -55 64 41 -66 80 -98 12 146 61 -34 98 32 -264 96 34 -146 61 91 125
2511A25j53R0j41o5K22j93J82p4n1M3J20j58kJ49l3o9K1N5o5l1l4J15J21k54K4
$$ 125 -28 62 -79 -144 78 -115 67 -7 -58 -15 105 -53 -55 94 61 -8 13 68 3 -28 -62 53 174 -80 -56
2536e6n6J61j25J52q0m1K00k2j27o9OPJ78r2K05j69m6k3j14K58o6k89J52J61j07
$$ -56 -112 49 -76 76 -4 -45 155 133 6 -63 -57 -50 128 36 241 72 26 3 -111 147 81 -208 -56 105 -2
2561bq5N4K1R2j82j27P4L69k80KO3J2L1j45J77k00R3lk0O6O8jr6J00l3R8j55J27
$$ -2 -87 -33 -12 80 -102 -229 -155 214 -66 -64 -1 11 42 -103 74 -126 -33 -36 -56 10 78 77 -19 81 48 146 -9 118
2589A18qj95J43qj12l3MQ4pn4J93r0rk7M7n5J05p6j44J92N1q8j06L1m7N9J28k74
$$ 118 110 -85 58 50 -62 -95 -91 -7 -14 -68 125 35 26 -1 46 -9 96 20 -124 68 119 31 -75 -44 -91 -32 96 -178
2617a78q4J79N7J7j7j5R8M8o6l9K5M3M2j12j02K6j1J34k6K12j23K7j34m8J74j32
$$ -178 -262 -83 -26 -9 -26 -41 57 105 39 0 25 68 110 -2 -104 -78 -89 45 19 231 108 135 1 -47 127 -5
2643en5M2l8J48j78L0m8O9J2J01r7J0K17l09O0OJ15M5k8k50J58K1JJ54j15m6J24
$$ -5 -60 -18 -56 92 -86 -56 -104 -35 -23 78 -19 -9 208 -101 -41 -35 80 125 97 -153 5 26 27 181 66 20 144
2670A44j03j10J36n9p2QLLQ4J1L4j52J39n%P3k77J31o0K9j69K45m9n2J42j14J93
$$ 144 41 -69 67 8 -64 -56 -53 -50 34 45 79 -73 66 61 61 134 -143 -12 -72 -43 -212 33 -16 -68 74 -40 153
2697A53k22R4k3j6O6M7j24P4n0q9J45l1Kj56K02j99P8j4M07l15j0o2J47m54M10
$$ 153 -69 25 2 -14 52 99 -25 49 -1 -90 55 24 26 -130 72 -127 -49 -63 344 29 19 -43 104 -350 60
2722F0j38K8N3j39J26nJ34j97n0R3J7L6j0j68J42K6o2lRJ86k24J63l2k2J6k1J28
$$ 60 -78 -50 3 -136 -10 -15 119 -78 -128 -35 -18 18 8 -160 -18 8 -54 -57 -48 138 -86 77 45 23 39 18 146
2749A46p6O8j21l9L7l7NN3M2j92K99k65R5onJ26l5k13K64o6j13k40L32j06k7K6
$$ 146 70 138 17 -22 15 -22 -17 36 78 -114 185 -80 15 9 4 130 95 -118 146 80 -33 -273 59 -47 -74 -48
2775d8o9P2J76j89P7l1L7J0j7J57k56Q4l3N0K1q8j7n7k1K44j17O3%p7J70j81p7
$$ -48 -117 -45 131 -58 19 -12 25 35 18 175 -81 3 -30 20 41 -47 -64 -121 -142 102 -15 48 48 -29 141 -40 -117
2802a17J80L1n3p7J30k90K42J18k01J9j27J50J80k36K05k29R7m4J55o8j62K09
$$ -117 63 94 41 -36 94 -196 46 164 -37 -18 -145 5 185 -51 154 -75 22 -22 133 65 -97 112
2824A12j36J39P9k14R9q5m0Q0Ll5q6p9k1K65j53J89j30K2MPJ34j57j03P3N0j09
$$ 112 -24 115 194 -20 79 -6 -46 34 37 2 -84 -163 -184 81 -72 117 -13 9 13 20 154 -3 -106 -33 17 -92
2850i2J02o1rJ97j43Q8k13J57k9Q6j7j4p6Lo5L4J86n0j98K23n8j27J3k9O1k5J33
$$ -92 10 -51 -60 137 -6 82 -131 26 -3 83 66 52 -24 -21 -86 -52 134 84 -114 109 51 -76 -63 -92 -31 -56 77
2877G7j71K76j68q2J16J99j52j4p7j39J5%O2J99o7j26Q7j65J86r0L0J11j57K9
$$ 77 -94 182 14 -68 48 247 95 81 4 -135 -120 -120 -58 141 74 -52 35 -130 56 -34 -4 107 -50 -21
2901b1N7R2j65Q2r3N5m7O1n6J14j31J9J18R8k45K9J4J46j49K0L2j39K02j90Q0
$$ -21 36 128 -37 45 -48 7 -40 21 -35 79 -52 -33 85 183 -62 -33 -19 127 -22 -2 30 -109 93 -97 -17
2926a7J23j28L4Q3k10N8q0J77j0K43k82M3J25j00Mj12J68n4p6J2J45j61J81j19
$$ -17 106 -22 12 95 -115 -57 -137 40 30 273 -9 34 159 59 63 -49 119 65 -11 1 146 -15 166 47
2950D7r8R0l9J87k49l6k9L1R3J77l65K61r0n6P9J11j71j15J86j07J35k2p9J41
$$ 47 -51 39 0 187 -62 -98 -127 -96 -3 174 -191 70 -20 -76 3 114 -57 -172 14 -93 42 20 -59 82
2974H2j60P6l6P8n3j13Q1J84l1j30p1N7l3K12q7K0j65P7O5r6R8j24J72m8o5J17
$$ 82 -78 -2 -38 40 -13 -126 -45 139 108 -22 -93 -36 -69 143 56 76 -89 -12 53 -43 55 -69 103 55 -10 107
3000A07l9j88O3o3R3nK4R4j62L2K7J09j00J19L9r1o3r4K9K0K32j55k08K19J4j3
$$ 107 68 -120 -57 -120 -27 -32 -8 86 -76 -44 -17 92 -8 111 150 59 -4 -98 -69 -49 183 28 -180 39 53 40
3026D0N4j51j33J95J50p9l1k53K94j73J03m7q6J9j04J41J49p3n8n0J90q8k8J19
$$ 40 94 -57 -190 5 155 76 45 -208 86 -87 16 -31 -117 -98 -202 -61 88 15 -43 -93 97 9 -19 100
3050A00j86K98k23m2j00J89j29K04p1r5k7J15j54J73R0q7o0p9Q9l9N9j85K58j30
$$ 100 -86 212 -11 -53 -153 36 -93 111 40 -55 -82 33 -121 52 142 55 -5 -84 5 -34 25 -160 98 -32
3074c2J58j38j1J22j52n3J45M2o1L5l2Lo5j18J25J32k4q5O5K7k15K06q6O7j75
$$ -32 126 -12 -23 99 -53 -106 39 81 20 55 23 26 -39 -157 -32 100 76 -9 56 83 -132 74 -12 55 -120
3099a20J56m1q5J57j41p1pJ78J22j20j90J42K18p7l0j17r9N8J04p7jJ70j48k4
$$ -120 36 -5 -90 67 -74 -145 -152 26 148 28 -162 -20 198 121 91 -26 -125 -67 37 -40 -41 129 -19 -43
3123d3Q2o2M6q4o7K11k01Q7J63j45J1O8kn0J40j26l7k30J38J98q4mj92J52J56
$$ -43 39 -23 23 -61 -128 83 -118 -31 132 -13 -2 66 64 14 154 28 -9 -239 -101 97 13 9 -183 -31 125
3148A25p1j56J04J38r3n0n2L0N7%j09N8j89J42J03o0m9N3Q8N8j58M1m8jJ28q6
$$ 125 54 -102 2 140 47 -3 -55 -25 32 32 -77 -19 -208 -66 37 -23 -72 -19 69 127 -31 10 -38 -39 89 3
3174CM0j51J26l9l2J16l4j3J35k77K41j59KJ37pj4j96N2Q3r0O9MM7qQ5j06NM8
$$ 3 43 -108 18 -21 -53 63 29 16 151 -126 115 -44 -42 95 88 74 -122 -70 13 -77 -8 -4 43 35 120 14 19 67
3202F7J7k44J94N4o8O9o9j73R9J83j49M3M0j6j34J36q5p3O7J16m5J73k89J36j71
$$ 67 84 -160 34 88 20 89 20 -153 -54 129 -20 23 63 47 -87 49 -36 -109 -42 74 29 202 -87 49 -122
3227a22J21j90K12m1P4J2J21j24j67L21l60Q2L8L2J73q5j39R5j07J49p5L1l4j18
$$ -122 -1 -191 21 -20 54 66 187 63 -104 217 -143 -61 -23 9 182 97 -42 53 -54 95 20 51 17 -101
3251a01l3K7Q2L6J4Q1j15O8Q9Nq9j0J02K3j13Q1l41J83J01r3r7J60N1j86J68l2
$$ -101 -134 -107 -25 11 25 106 -9 59 148 153 64 54 156 179 66 147 -194 -11 90 -3 -100 60 111 -75 93 61
3277F1q9j1j8r6K31n7k7M2q5k5Q8j92L37k1j69K7M3qk7J4r9N4q4J31j38J08K6
$$ 61 -28 -39 -57 -153 78 21 -6 36 -49 -74 14 -178 159 138 -31 -4 39 31 4 18 -81 -27 -111 20 -118 -10 16
3304A6r5NK21r4p2j21K05j00n3k7J08n2K7k4J85k4k8p6rJ8j41K2J14P0o7j37P3
$$ 16 -79 -74 147 53 -19 -140 65 -35 -88 -115 -7 -59 -32 -56 129 105 77 1 -8 10 -131 -109 5 75 8 -129 -56
3331e6r8J08K69k65Q5J9P9k28J66p7m3J80qj76O1j93J71j0j3K07m17K24M9n0L6
$$ -56 -154 -46 223 -42 43 62 141 -87 79 2 -41 139 131 -45 16 -177 -6 -16 -29 178 -239 -15 34 -16 20
3356B0j9K5m5j05J63j34N1p2K02k38J37j30J53o9M2m9n0O4J21N3k2j62M4J36j60
$$ 20 1 26 -19 -124 39 -95 -44 -116 86 -152 -15 -145 8 -61 -19 -68 -118 -54 67 120 98 -64 -20 116 -44
3381d4J67j0j78J70j53q4J68rJ5J7M3j27l0O6m4j04qJ23O4J0p9R3l7j10l1J38
$$ -44 123 113 -65 105 -48 -132 36 27 42 59 102 -25 -55 11 -33 -137 -145 -22 42 52 -27 66 29 -81 -112 26
3407B6q1M8j7J0j88L81r9j78K93j67k01J41J10j68J38j15J36j5p7M8k70L15j0
$$ 26 -55 -7 -24 -14 -202 179 80 -98 195 28 -173 -32 78 -90 48 -67 69 54 -23 25 -245 70 60
3430F0j64M9k1J35M6j47M0j32J76r9rR0m6q7J07L5p1O5j05N2p4J98o0l5K2k00
$$ 60 -104 -55 -76 59 105 -42 -2 -134 42 -57 -66 24 -22 -109 -2 33 -38 27 -78 -26 -100 98 38 3 25 -175
3456a75K55N6k44N8O0Mo6k7J18nj24J93o7J9K8J14j62p3j05J25n9J35j47J47N8
$$ -175 80 136 -108 -50 10 14 -52 -79 39 34 -90 103 36 55 83 197 35 -38 -143 -18 -77 58 -89 58 116
3481A16n0p5j50M0P7n2J92j77J30j54J46L1q2O0j4l1J5M3k22J43R8OO8j29j0R9
$$ 116 66 -9 -159 -119 -42 -94 98 -79 51 -103 43 74 -8 52 38 7 22 65 -157 -14 84 90 158 29 19 118
3507A18r6j52O4J92j11K1j42J6N8j0nj20L4K63p4R3l7j82P9p0OJ04j27MR5j25
$$ 118 22 -130 -66 126 15 36 -106 -90 -32 -42 -47 -167 -133 130 56 149 112 -70 9 -61 -55 49 -78 -74 21 -104
3533a04M3J9Q2q9Q7n4Q8n3j7J6k2n8K47n6k24K5O6M4N2j81L0j04K97j02oj30J38
$$ -104 -61 -42 40 -49 38 -16 72 19 2 18 -4 -62 185 129 -95 -70 -4 40 92 -89 -59 -163 134 32 26 -104 34
3560C4M7o8j60J69j75K47O2j27Lj43K74k9j17OQ9j67J18j2l1j78J13J81q5o8o5
$$ 34 81 13 -147 22 -153 94 156 29 32 -111 163 134 17 23 112 -55 63 51 20 -158 -45 136 51 -17 -82
3585h2J00N2j07J85l00J13O0j7K2j00O9R3j53O3k8n3R2l9J49j70p6P1J13k5k26
$$ -82 18 70 -37 148 -152 -39 21 4 26 -74 -5 88 -65 -2 -30 -83 9 -30 119 -51 -127 -56 57 32 -194
3610a94K81j71K03pj42M2p7J5p2J4K56p0r0p3kN0j17J7K25k51J26LQ2%km9O6n4
$$ -194 87 -84 119 112 -30 12 -65 -50 -122 -108 148 78 -12 -85 -87 -37 -154 -137 88 -163 -37 -34 48 48 46 -3 63 9
3638Ip6Q8r0J42k63J07K7O7p6J43k26J68o8R6L9L7q3j20J09N2k10N5j14L10r8
$$ 9 -67 21 -69 73 -190 -83 -56 11 -65 78 -148 20 -48 48 87 124 41 -79 30 82 -128 -73 -187 123 25
3663B5N4k45K28j17NJ59j80Qk9J44n2k9L2Rn6m5QJ3P9J1m2l6K53j02q8J3l1j63
$$ 25 79 -166 62 -55 -50 109 -71 -63 -92 52 0 -29 3 12 -44 -89 -81 -68 11 22 -20 -56 197 95 7 20 -11 -174
3691a74K46k85J71l2J63j37k2J86j20L3Ko1j1o6M3P0k1J2J17j4j5p6l2J24Lj7
$$ -174 72 -213 -42 -74 89 -48 -70 116 -4 29 31 -30 -41 -107 -64 6 -15 -3 114 100 85 9 -23 101 104 87
3717H7J3p0L9l31J98J96l3j12MK1J1J3j6k05J97l0r5K11m9R6j76J59r5j5j49M0
$$ 87 100 30 69 -262 -64 132 99 -13 -9 12 23 36 20 -185 12 -18 -113 98 49 145 -31 128 33 18 -131 -91
3743i1m1J87o7j7P2K3K7M5j42M7Kqj02N7J15l0r0k30K33j1K6p1N5P3K3q0R1j56
$$ -91 -132 55 -12 -29 43 66 93 138 -4 43 45 37 -65 -8 107 77 -13 -243 -10 -21 5 -66 -11 62 85 5 96 -60
3771f0L4k8m5j8J68j85J48J5l0o7J2j13J41k8R1M2j60Q4k5N7J07l5q7rL4j19L2
$$ -60 -26 -54 -99 -117 51 -134 14 29 -1 -68 -56 -169 -28 -56 35 77 -83 1 -24 33 140 105 18 9 43 -76 -44
3798d4l0K14O9j03j95N5p2Q9J6j6M3j2k7M9N0j67K44p7n5q1K37k20J0M7LLl8J10
$$ -44 -74 140 209 106 -89 -34 -106 -17 -1 -17 26 14 -13 36 86 -81 163 86 31 -50 187 -33 -23 24 27 30 -8 102
3826A02j52J41j02r5Q7n5K2Q6j03O8q2K76k51J43k8j03J09q0K4L8r3n2N0J6Q0
$$ 102 -50 91 -11 -106 -19 -74 -52 34 -69 -1 -83 193 -58 85 57 -46 63 -17 7 45 -48 -100 -50 -34 46
3851D6rj29O8J18j2q6J5j27J27K0J1j80N5K34j19J91k24j52J84oO5j75J26q5m
$$ 46 37 -92 -24 94 82 -4 11 -116 11 31 42 -138 -83 151 32 223 -1 -153 31 25 90 -85 41 -44 -48
3876d8M6N2N6m9J8l7m0j68K08n3or7L3J08j07J04op7K6K6j26J29QK0p3N4Mj62
$$ -48 -2 50 106 57 75 38 -2 -170 38 -15 -21 -118 -85 23 -84 20 14 -63 -37 -11 -137 -8 0 20 -53 1 5 -157
3904a57P1N7j21J75J11j81M1L4J4j0j33J41r9N0j2k11K31o1M8J00o0m3K4pK3o2
$$ -157 -86 -29 -150 25 136 -45 -4 30 44 34 -99 42 -57 -7 -19 -230 1 -60 -12 88 28 -15 9 2 25 -37
3930c7P0m7j28R3R1j9j51O2J26n7j11P1K7k8J13L3K7j94Lk6n3J10k6J07k55J54
$$ -37 33 -14 -142 -49 42 23 -128 -66 60 3 -108 -37 -10 -38 75 108 135 -59 -56 -82 -135 -25 -51 56 -199 -45
3956d5K0P1k26J25L2j52J71k7J6K8P7j39O8m7J5k7PL0J24j65K3J9O5j20pL3J49
$$ -45 -25 46 -180 -55 -23 -175 -4 -31 -15 13 90 -49 19 -28 -13 -40 -33 -3 121 -44 -21 -2 63 -57 -64 -31 118
3983A18j09o0N0P3j36J4J57p1j42J6pn1L45k57K72k54K7R1l8k05O8K1j0k2K59
$$ 118 9 -51 -1 72 -64 -50 107 36 -106 -90 -97 -148 197 -60 212 -42 -15 76 38 -167 -99 -78 -88 -110 149
4008A49k8j92K05j02Ro0J72o5r2M3Oj81N1K71l39N9J22QPp3q5J49M4j37O9k3o2
$$ 149 121 -71 134 32 41 -19 153 88 -4 39 45 -136 -85 186 -153 -94 28 36 43 -30 -115 34 78 -59 10 -13 -75
4035g5K79k06l8J50km2j09K7n1R3%l3R9J47k32J82k30l8J76k80J95o9M0J48j09
$$ -75 204 -2 -40 110 108 66 -43 -16 -67 26 26 -7 92 239 7 189 -41 -79 97 -183 12 -57 -17 131 22
4060B2o7M4J58j83J81j79j30O1R0O8j16J23q6j53N2J1J57p3J23n2j67J09p5J36
$$ 22 -45 -1 157 -26 155 -24 -154 -93 -3 65 -51 72 -14 -167 -115 -104 53 -20 103 51 -116 -7 -82 54
4084E4j39k1J24j3k4L6j03J06N4r2N2m4K07j40o1J27l58J42J87j88L2J4L1J27
$$ 54 -85 -106 18 5 -19 17 -86 20 74 -18 34 -10 197 57 -4 123 -235 -93 94 -94 -62 -48 -17 110
4108A10j30j0p5k2J49p8qO7J04j29J73j31Ok08O9J72jj09J01n3l5J9P3j20J11
$$ 110 -20 -30 -105 -127 22 -56 -64 3 107 -22 151 20 26 -182 -113 59 58 -51 50 -3 -38 -19 54 -66 45
4133D5j4P5o3j36J64Q7j35%n6n1J80q0k3o9L6N4j90nn8J68k6R2l4K4j20J68j19
$$ 45 31 106 43 -93 71 158 23 23 -33 -84 96 16 -7 -76 -40 14 -176 -181 -239 -71 -97 -5 -39 -15 -135 33 -86
4160h6p5J98q2J29p4p6j95L20j10Q9P2j0j61l6J15j00J23j21oJ60l47K94j41J51
$$ -86 -161 37 -45 84 10 -66 -261 59 -51 38 110 100 -61 -97 18 -82 41 -80 -86 74 -273 21 -120 31
4184C1P5j93K94k13N9j94J83k16O6K54l8j69O8o4m6R0j0J64j92qK4m0P6m9J7P0
$$ 31 106 -87 207 -6 53 -141 42 -174 -108 146 108 -61 7 -57 -103 -13 -23 141 -51 -59 -35 -75 1 -48 -31 39
4210C9j0K2j4L1j00R7j95K23j51O5P1j32O9J2M0k12P1J67n9M0k0K1l9N4p7N5q1
$$ 39 29 51 37 68 -32 65 -130 93 -58 7 78 -54 15 27 67 -145 -74 93 34 74 54 75 36 90 13 68 -13
4237a3k3J7N2O6L9J47r7k67J39k32P9J51k25R8J70k12J41j38L2K08r2j00r5nK86
$$ -13 -36 -19 33 99 138 285 188 -79 60 -172 -93 58 -167 -69 101 -111 30 -108 -76 132 40 -60 -155 -160 126
4262A26j01L5q9J32q9n2J38K2j65n0K51n4j47n1K83j44j58L8J30Q6m5j10r1J20
$$ 126 25 60 -29 103 14 -38 100 122 -43 -93 158 104 -43 -94 189 45 -113 -75 55 141 96 -14 -105 15
4286A5l8p7Q0M0j0J52k30J97o3kj22M5J15q8O4j08p2K3J34q5J10q9j65J38J46
$$ 15 -23 -100 -20 20 10 162 -68 129 66 64 -58 -13 102 14 78 -30 -102 -79 55 -30 80 -9 -174 -36 110
4311A10k49K40jq5J00j33j48Q7J49M2jmq8j14P2jL0Pj08J53j68Q2J75r2k37Q9
$$ 110 -139 101 100 15 115 -18 -166 -79 70 112 111 107 19 -95 -23 -24 6 13 -95 58 -110 -28 147 55 -182 -93
4337i3K9j6J01o9m1n3K09k31K37p0k0M5ok1J35j51J40j55J33k77K55p7J24L3k09
$$ -93 -64 -80 21 -48 -89 -142 67 -164 73 3 -17 28 22 1 136 -15 125 -30 103 -174 81 4 128 161 -48
4362d8J18o0J11j9l48P9J20R0m1M3N2j65J80n5J40j86jK2j97J84k6Lj42K9J53
$$ -48 70 10 121 102 -246 -167 -47 43 2 45 97 -68 112 57 197 11 10 32 -165 19 -7 -4 -146 -117 36
4387C6j05J71p0Q3p6j39J04M2j63R1o1K82k30m7P4N8p5p6Q3j8N1R1j83J03M4Q8
$$ 36 -69 102 32 115 39 -100 4 46 -117 -26 -87 195 -35 -82 -8 50 -25 -101 -18 -36 15 106 -77 26 70 158
4413A58j12k96K03K10j99J06L8j83J67k26r1L40k24m6R9O4Q7j36r1J84j89J01
$$ 158 46 -250 -47 163 -36 70 108 -75 92 -134 -225 115 -109 -155 -56 8 95 -41 -132 52 -137 -36
4435c6j4J4Q8r3K1m5j37L39n0o7M9p2j37O3j4J50k04J15J94j15r4j9J88j51J7
$$ -36 -50 -36 52 -41 -20 -65 -202 137 87 20 69 -3 -140 -77 -91 59 -145 -30 164 49 -45 -64 124 -27 -10
4460a0p6K04r8j46K55j32O2l1Oq8M8p5J96j56J5J3p5J90j41J18j57J76q5j3N8
$$ -10 -86 118 20 -126 129 -3 59 28 34 -54 -6 -81 115 -41 -26 -13 -88 102 -39 79 -78 98 13 0 58
4485E8r3k4R9j52J91L6j38J2L7o2Om1K64k74M1jj32P8L1J53k20J20K2mj6J55k08
$$ 58 -35 -59 40 -112 79 115 -23 -11 26 -36 -30 -71 193 -81 -40 -41 -173 -95 -64 89 -131 -11 11 7 -9 146 -62
4512f2Pj5J35Q4k64K45L9j26l3k1j11r6K62qk06P3K32k36P7Q0j63k5K26p2j23
$$ -62 -55 -70 65 149 -115 130 169 43 10 -11 -122 -218 44 36 -170 -97 135 -101 -24 56 -107 -132 94 22 -101
4537a01J93k19K53k9j48J39j57K43l16J34M8Q4k40ON7K7j2LR4k6p2Q6j1m7Oj2
$$ -101 92 -127 126 97 -51 88 -69 174 -142 -8 40 124 -116 -110 -53 -26 -38 -35 59 33 -39 47 36 -11 -5 -17
4563a7k60L27l1O0j57k2J07L6j52J34O5k23nJ77O1j60J21j29J09j9L1p9j2J59
$$ -17 -277 50 19 79 -78 -100 7 43 -109 25 90 -133 -138 39 100 -60 61 -68 41 22 53 -26 -38 121
4587A21j39j0j01J01l0L4P3R5k6j47M7M8J3j04K59l18K9K20n3k04m4K15o5m1j04
$$ 121 -18 -28 -129 -28 -58 -24 49 144 118 -29 18 66 79 -25 234 -84 -55 165 112 -92 -136 79 14 -27 -131
4612a31L10k16M2n3m7O0P9J02q7k8j17J76j91N6N2K7j30J38k24K58j54K1K01j68
$$ -131 179 -37 5 -48 -95 -35 44 146 59 31 -86 90 -101 -45 7 34 -96 42 -182 76 -78 -57 144 -24
4636b4L9r6j18J42J01j49J12l7r2K36k00P2L5p7N8m3J20k52J11L8K21J4l14K43
$$ -24 15 -81 -199 -57 44 -105 7 -30 -122 114 -86 -14 21 -56 2 -41 79 -173 -62 -24 197 211 -103 140
4660A40j02l3j27J66q5J96j94R5j62J55J48k46l0J24m2M6n9J0K5N2NOo8j07N6
$$ 140 38 5 -122 44 -41 155 -39 56 -106 49 197 -49 -79 45 3 49 -10 0 25 77 82 88 20 -87 -31
4685c1j72L29n0m4p8k9K34j34r5Q6mo9J39q6j35J44l1J04MP9k47K42k13m1K21
$$ -31 -203 126 76 32 -46 -75 159 25 -70 16 12 -57 82 -4 -139 5 -26 78 82 161 -86 156 -57 -98 123
4710A23K8j62j09P7K7OO4Q3j33j16J03M4j40O2M5m4J25p6M5o8Q2j2j28P0j12J22
$$ 123 151 -11 -120 -43 -16 -10 54 137 4 -112 -9 35 -105 -43 2 -42 83 7 52 -16 66 54 -74 -4 -116 6
4736Fp3M7j28J94J18k09N1P3O8k49L0n3K30m8j18Q8J6l3R2r8O%j72K52l70K24
$$ 6 -67 -20 -148 46 164 -45 6 79 147 -102 -72 -125 105 57 -61 27 43 10 102 4 10 10 -162 90 -280 -56
4762e6l9l2M32k85R4j35kj12L1J1j98L79q2J1j41K03j41K06j5j46m9J93l09J37
$$ -56 -95 -127 305 20 114 -21 -23 -135 -104 -93 -291 88 6 17 -124 79 -62 144 129 -17 -66 127 -182 -45
4786d5Q8K4j18p1J56R5k7j73m0p8K36ol5J52l50J80j6MK03k79K6Q2l0J13j95J00
$$ -45 43 67 -51 -122 34 129 102 -71 -111 -189 47 41 6 158 -192 -12 -28 -24 179 -100 -74 8 -22 91 -104 -4
4812dKl8J12j81N3K27j88L9r8P4k3Q2j41oP4q4J40r9mR4O4j79P0R0J9p1o4N7K
$$ -4 -2 -40 72 -109 -56 171 -17 22 -76 -2 -25 57 -84 -90 -16 -100 40 -59 -63 31 95 -84 -14 76 95 24 -40 17 19
4841A9L0L8J0mo3l4O7L6k8k7K1o2J07n1nj85J66q5K2n3M9J43p6J69j19J51k91
$$ 19 49 87 97 93 30 -4 63 99 71 44 65 3 110 59 54 -131 35 -50 -28 -81 -32 111 35 204 85 236 -55
4868e5L1l7L04k75L1Ko6P1m2J2j04K0J7J19m8K7j22K48k12o5J21R2L4j12n9Q2
$$ -55 -24 -61 243 -32 -1 1 -65 6 -36 -24 -128 -108 -91 28 -20 7 -115 133 -79 -144 -23 69 103 -9 -68 14
4894A4q9k2J42L6L4j09L2o5R0P8j33J50k02J02j40J77n6j61J83K3j1q3LM6j05
$$ 14 -75 -97 45 81 115 6 38 -27 63 141 8 158 -44 58 -82 95 39 -122 61 84 73 -10 -7 39 -66
4919f6l3J45j40J23l3Qj9J13N0k82J67N9l0M2j1k07J86n3j29M28l76J46k06R9
$$ -66 -99 46 -94 29 -4 4 -15 98 148 -134 33 92 62 104 93 -114 72 19 -110 318 -58 88 -118 -19
4943a9R9q4j14P6o1J49M3o9J10j72j36J28NO7Q4k20J28j17J3J73k45J75o1J00
$$ -19 80 -4 -118 -42 -103 46 89 20 130 -42 -178 -50 -45 22 106 -114 14 -103 -90 83 -162 13 -48 52
4967E2M1k6L0k6j36K63m28L75j14j06m6J03Q5k47L92j68j02J13k5P2j28P7r2J5
$$ 52 93 67 97 71 -65 198 -230 145 31 -75 -121 -18 67 -180 212 44 -58 55 30 102 -26 51 -41 -26
4991b6R1q3J39j29j08N1pl4K20jj03j27J49m2l9M8M1j53O5Q4J13j54m1J69j70
$$ -26 65 -18 121 -8 -116 -65 -72 -106 114 113 10 -117 32 -10 -49 -1 40 -113 -48 36 149 -5 -46 123 -47
5016d7J30j9n4m6N2rR8j07O3p3R7k2r4J26m9j05J45o9k9no9K18o2j51l4J10J90
$$ -47 83 64 10 -36 16 7 105 -2 61 -12 85 63 -31 95 46 -59 86 17 -12 -17 -86 132 70 -81 -115 -5 185
5043A85j89j70O6K11rj26L1PK3J0l0k12J35n1J73m7Q1J4k49M9J21j69J87k4J40
$$ 185 -4 -174 -108 103 94 -32 -1 6 29 39 9 -203 -68 -119 54 7 88 102 -147 -98 23 -146 41 17 157
5068A57j50o9l2K21j08K3j97J77J23j58J53j96M2J32j51l6J3R2Nq0P9o8l4Km2
$$ 157 7 -62 -94 127 19 42 -155 22 145 -13 140 -56 -14 118 -33 -69 -56 36 41 -39 40 -28 -62 -60 -102
5093a02J06J69p7n7Q3j07O6q2k01K21OQQ2j58q0K26j75K18l35P1J42Km5J72j31
$$ -102 4 173 96 39 122 15 81 -1 -202 19 25 33 115 -43 -123 103 -72 146 -189 -118 24 26 -19 153 22
5118B2K9n9n0M8j3O9m8j11J10N7M1j6j43R3J09l17J60J47K2n2j19k5Qj7QJ59j09
$$ 22 51 -8 -58 -10 -23 46 -2 -113 -3 54 95 79 -64 29 138 -179 -19 128 150 98 -21 -46 -38 -55 -47 112 3
5145CR4j47o3J80j06j00J32r7J10j74P6o3J16l5L49k70MQ0q4j09J39r1j0%O4J72
$$ 3 97 -50 -113 67 -39 -139 -7 -104 6 -168 -92 -155 -39 -74 275 5 9 89 5 -104 35 -56 -66 -66 -2 170
5171A70l0k26J12k11J01q3J60O6k07J08J26o7k20J94M4oj30m1J14J69j29j04K8
$$ 170 140 -86 26 -185 -84 -167 -7 59 -148 -40 86 19 -201 -7 37 31 -99 -140 -26 143 14 -90 -62
5194f2R8J79k21N8L5l1n4J99k71J47m2m1k13NJ45k2J09n8L0J09p6J8j29L5J61
$$ -62 36 215 -6 52 87 56 2 201 -70 77 35 -6 -219 -214 -69 -91 18 -40 -10 99 23 41 -88 -53 108
5219A08m8j24J18k5L7j49J85k5r3K7J66j50n2p0K11l7j24J36K7j0R0j34k39J62
$$ 108 60 -64 54 29 66 -83 102 77 -16 11 177 27 -25 -95 116 79 -45 91 118 108 198 64 -175 -13
5243a3M8J24k18N2n2q7K01n1N9m8r9J21l1kL8l4J16P9k20J3p9P8k3J05j04kQ0
$$ -13 35 159 -59 -7 -59 -146 55 4 63 15 -84 37 6 4 42 8 124 203 -17 -4 -83 -5 -28 77 -27 -29 51
5270E1k34J10Q0k28J69J2j05J57l8J0J36l4k9mP8j22j7o5M5l7J68k25r9J99N0
$$ 51 -183 -73 7 -221 -52 -40 -145 12 -26 -16 120 86 57 53 131 9 -8 -73 -28 -65 103 -122 -221 -22 28
5295B8p1%j06K24j27Q9k11N6O5n9K08p8J05j91R9k2j53m1K25j36J48R0j18J46
$$ 28 -43 -43 -149 75 -52 37 -174 -118 -53 -112 96 18 123 -68 31 9 -144 -185 40 -96 52 142 24 170
5319A70k35m8N8j0p5K46p9j47K48nj22p0J95k57J94J55k53K46j91O1j20J82j41
$$ 170 -65 -113 -55 -65 -140 106 27 -120 128 123 1 -69 126 -131 63 218 -35 211 20 81 -39 143 2
5342Bk03K61r9m1Q9k3Kj08J54M8Q2j84Q3L3N8m7r4N6k11Q1J85j35q4N3Q9k2j29
$$ 2 -201 60 -39 -80 9 -14 -12 -120 34 82 164 -20 63 96 154 107 13 69 -142 -61 124 -11 -95 -42 47 25 -104
5369a04K3Q2R7j9r3n5L0p2J23L9j64K2J77m8qRN6j41J59k04M3jo1J9K2J94k01
$$ -104 -81 1 98 79 -14 -69 -39 -111 12 51 -113 -91 86 38 30 39 95 -46 113 -91 -48 -49 -110 -91 -69 125 -76
5396g6O0J55k81J82O3Mj2j05l0O4q1L8N4j21nJ28J26j69K1R7k90L75k80J13j34
$$ -76 -16 139 -142 40 103 107 95 -10 -40 24 -57 -19 35 -86 -91 37 163 -6 15 112 -178 197 -83 30 -104
5421a04q3J60J46j05N9M5q9K5o8j25J11M4MJ02j02k7L1Kj7R4j71j1J07J45q1n8
$$ -104 -187 -27 119 14 73 118 29 54 -14 -139 -28 16 20 122 20 -7 24 26 9 103 -68 -79 28 173 92 34
5447C4n8M2r2J02j63J02j8J05N0j22J13j00J43j45m0K8o6J80q5O4j09l0J27O7
$$ 34 -24 18 -74 28 -135 -33 -51 54 104 -18 95 -5 138 -7 -47 -19 -85 95 10 74 -35 -65 62 129
5471A29j75J25j34R4kn2J7J57k89J77J9j41J51l9RJ15j36j35J28l3R0ok11K3P1
$$ 129 -46 79 -55 39 37 -15 2 159 -130 47 66 -75 76 37 46 161 25 -110 18 -15 75 69 -142 -119 -48
5496d8k8J32l7j55J41J11l5n7o4o6J47j99J48k4%R8j22j40K80qPj16M5K9q2O9
$$ -48 -76 56 19 -136 5 116 81 24 -40 -106 41 -158 -10 -34 -34 64 -58 -198 82 74 81 -35 10 39 -43 26
5522B6n3l6p1J64p7P2M8L4j37o3P6j19K34k3k48J93MP8j82O0o1l6J07J32k17J49
$$ 26 -27 -63 -134 30 -47 25 73 107 -30 -93 -17 -136 98 75 -173 20 24 102 -80 -20 -81 -117 -10 122 -95 54
5548E4j28J13m8j2k0j01J62JK6j9L0j9j6q8K7Q4n4J82j15q7M4j04J56l8l6R0o5
$$ 54 -74 39 -9 -21 -41 -142 20 21 47 28 58 39 23 -65 -38 46 -8 174 59 -28 16 -88 68 30 -6 84 19
5575A9j32K77j67n0k3k0P8l4J40j68N2r1J47O2j94J08n4O4j74P9M2p1O2NL4j7
$$ 19 -113 164 -3 -53 -76 -96 -18 -52 88 -80 -28 -119 28 90 -104 4 -50 14 -160 -81 -39 -110 -48 -43 -9 -26
5601b6r1J19Op5J29J44o0q4r4Q4o6LK90m41K60p5p9K06j44nM3J44L3k77L8l6L6
$$ -26 -117 2 8 -67 62 206 146 62 -32 52 -14 -11 279 -162 98 23 -56 150 6 1 44 188 221 -56 -18 -54 -18
5628a8Q4p7N8l1R3q0J26k01j83K60j15N7j5J50j70M7N0J0q6Q1j11m1R7l8j0L1
$$ -18 66 -11 47 16 109 29 155 -46 -229 31 -84 -27 -42 108 -62 -15 35 45 -41 40 -71 -112 -15 -53 -63 -32
5654c2K10k53J14k07K92j57J0J58k13P4M5K9l0n4J19p2l9m3J01M7r2N6m2K8m6
$$ -32 178 -75 39 -168 124 -33 -23 135 -78 -4 41 70 40 -14 105 33 -6 -49 52 99 7 63 21 49 3
5679Cj91J59q6K11j05J06p5L7Rk03L16k50O7P4n1l3q7J15K3J11l4r5j77L33l34
$$ 3 -188 -29 -115 96 -9 97 22 59 68 -135 181 -69 -2 72 21 -12 -99 16 39 150 116 21 -156 177 -157
5704a57k9J68o6K5J62j64J39j47K4K17j61q1R8o1j47J74J07k24J95N6j24j27K4
$$ -157 -186 -18 -84 -59 103 -61 78 -69 -45 172 11 -70 28 -33 -180 -6 101 -123 72 128 4 -123 -99
5727i9J62R3k10J71m5j47K00j19r2K5J38j02L7P0k2j63N1Q0j5r0J41J44j27k25
$$ -99 63 156 -54 117 72 -75 125 6 -86 -61 77 -25 12 82 60 -103 -52 28 13 -77 64 208 81 -144
5751a44L33j64j3J45k64J66o7l8J40k69P7M8K0JJ3q2J05l1q6J05J24j21Q0o5P0
$$ -144 189 25 12 157 -107 59 -8 -46 94 -175 -98 -50 -30 -29 -16 -98 7 -24 -110 -5 119 -2 78 13 83
$$ [...]
8191d2
##END NTUPLES=NMR FID
##END=
