##TITLE=1H_DE-100k-TFA
 200.13MHz,CDCl3,
 8 sc
 
 7.7.2025
##JCAMPDX= 6.0         $$ Bruker NMR JCAMP-DX V2.0
##DATA TYPE= NMR FID
##DATA CLASS= NTUPLES
##ORIGIN= UXNMR, Bruker Analytische Messtechnik GmbH
##OWNER= pz
$$ XWIN-NMR		Version 3.5
$$ Mon Jul  7 16:24:52 2025 Russian Standard Time (UT+4h)  she@DPX200
##.OBSERVE FREQUENCY= 200.1313
##.OBSERVE NUCLEUS= ^1H
##.DELAY= (6, 6)
##.ACQUISITION MODE= SIMULTANEOUS
##.ACQUISITION SCHEME= undefined
##.AVERAGES= 8
##.DIGITISER RES= 18
##SPECTROMETER/DATA SYSTEM= spect
##.PULSE SEQUENCE= zg30
##.SOLVENT NAME= CDCl3
##.SHIFT REFERENCE= (INTERNAL, CDCl3, 0, 14.3821)
##AUDIT TRAIL= $$ (NUMBER, WHEN, WHO, WHERE, WHAT)
$$ ##TITLE= Audit trail, XWIN-NMR		Version 3.5
$$ ##JCAMPDX= 5.01
$$ ##ORIGIN= Bruker BioSpin GmbH
$$ ##OWNER= she
$$ F:/spectra/data/she/nmr/H-C/1/audita.txt
$$ ##AUDIT TRAIL=  $$ (NUMBER, WHEN, WHO, WHERE, WHAT)
(   1,<2025-07-07 16:21:57.09 +0400>,<she>,<DPX200>,
      <created by zg, POWCHK disabled, PULCHK disabled
       configuration hash MD5:
       00 E9 B6 7A A2 85 ED C7 34 08 36 98 17 FE 4E 26
       data hash MD5: 16K
       A1 F6 7F 8D 84 78 BD AE 9C F2 23 B6 3A 95 F9 A5>)
$$ ##END=
$$ 
$$ hash MD5
$$ 9E 27 16 7D 67 90 6C 29 6C 9E 3D F5 09 7E 26 8B
##$RELAX= 
##$RELAX= 
##$RELAX= 
##$RELAX= 
##$RELAX= 
##$RELAX= 
$$ Bruker specific parameters
$$ --------------------------
##$DU= <F:/spectra>
##$EXPNO= 1
##$NAME= <H-C>
##$PROCNO= 1
##$TYPE= <nmr>
##$USER= <she>
##$AMP= (0..31)
100 100 100 100 100 100 100 100 100 100 100 100 100 100 100 100 100 100 
100 100 100 100 100 100 100 100 100 100 100 100 100 100 
##$AQSEQ= 0
##$AQ_mod= 1
##$AUNM= <au_zg>
##$AUTOPOS= <>
##$BF1= 200.13
##$BF2= 200.13
##$BF3= 200.13
##$BF4= 200.13
##$BF5= 200.13
##$BF6= 200.13
##$BF7= 200.13
##$BF8= 200.13
##$BYTORDA= 1
##$CFDGTYP= 0
##$CFRGTYP= 5
##$CHEMSTR= <none>
##$CNST= (0..31)
1 1 145 1 1 1 1 1 1 1 1 1 1 1 1 1 1 1 1 1 1 1 1 1 1 1 1 1 1 1 1 1 
##$CPDPRG= <>
##$CPDPRG1= <>
##$CPDPRG2= <>
##$CPDPRG3= <>
##$CPDPRG4= <mlev>
##$CPDPRG5= <mlev>
##$CPDPRG6= <mlev>
##$CPDPRG7= <mlev>
##$CPDPRG8= <mlev>
##$CPDPRGB= <>
##$CPDPRGT= <>
##$D= (0..31)
0 0.7 0 0 0 0 0 0 0 0 0 0.03 0 0 0 0 0 0 0 0 0 0 0 0 0 0 0 0 0 0 0 0 
##$DATE= 1751890916
##$DBL= (0..7)
120 120 120 120 120 120 120 120 
##$DBP= (0..7)
150 150 150 150 150 150 150 150 
##$DBP07= 0
##$DBPNAM0= <>
##$DBPNAM1= <>
##$DBPNAM2= <>
##$DBPNAM3= <>
##$DBPNAM4= <>
##$DBPNAM5= <>
##$DBPNAM6= <>
##$DBPNAM7= <>
##$DBPOAL= (0..7)
0.5 0.5 0.5 0.5 0.5 0.5 0.5 0.5 
##$DBPOFFS= (0..7)
0 0 0 0 0 0 0 0 
##$DE= 6
##$DECBNUC= <off>
##$DECIM= 32
##$DECNUC= <off>
##$DECSTAT= 4
##$DIGMOD= 1
##$DIGTYP= 9
##$DL= (0..7)
0 120 120 120 120 120 120 120 
##$DP= (0..7)
150 150 150 150 150 150 150 150 
##$DP07= 0
##$DPNAME0= <>
##$DPNAME1= <>
##$DPNAME2= <>
##$DPNAME3= <>
##$DPNAME4= <>
##$DPNAME5= <>
##$DPNAME6= <>
##$DPNAME7= <>
##$DPOAL= (0..7)
0.5 0.5 0.5 0.5 0.5 0.5 0.5 0.5 
##$DPOFFS= (0..7)
0 0 0 0 0 0 0 0 
##$DQDMODE= 0
##$DR= 18
##$DS= 0
##$DSLIST= <SSSSSSSSSSSSSSS>
$$ [...]
##$SUBNAM0= <"">
##$SUBNAM1= <"">
##$SUBNAM2= <"">
##$SUBNAM3= <"">
##$SUBNAM4= <"">
##$SUBNAM5= <"">
##$SUBNAM6= <"">
##$SUBNAM7= <"">
##$SUBNAM8= <"">
##$SUBNAM9= <"">
##$SW= 18.0517328524113
##$SWIBOX= (0..15)
0 0 2 0 0 0 0 0 0 0 0 0 0 0 0 0 
##$SW_h= 3612.71676300578
##$TD= 16384
##$TD0= 1
##$TE= 0
##$TE2= 300
##$TE3= 300
##$TEG= 300
##$TL= (0..7)
0 120 120 120 120 120 120 120 
##$TP= (0..7)
150 150 150 150 150 150 150 150 
##$TP07= 0
##$TPNAME0= <>
##$TPNAME1= <>
##$TPNAME2= <>
##$TPNAME3= <>
##$TPNAME4= <>
##$TPNAME5= <>
##$TPNAME6= <>
##$TPNAME7= <>
##$TPOAL= (0..7)
0.5 0.5 0.5 0.5 0.5 0.5 0.5 0.5 
##$TPOFFS= (0..7)
0 0 0 0 0 0 0 0 
##$TUNHIN= 0
##$TUNHOUT= 0
##$TUNXOUT= 0
##$USERA1= <user>
##$USERA2= <user>
##$USERA3= <user>
##$USERA4= <user>
##$USERA5= <user>
##$V9= 5
##$VALIST= <valist>
##$VCLIST= <CCCCCCCCCCCCCCC>
##$VD= 0
##$VDLIST= <DDDDDDDDDDDDDDD>
##$VPLIST= <PPPPPPPPPPPPPPP>
##$VTLIST= <TTTTTTTTTTTTTTT>
##$WBST= 1024
##$WBSW= 4
##$XGAIN= (0..3)
0 0 0 0 
##$XL= 0
##$YL= 0
##$YMAX_a= 164256
##$YMIN_a= -129943
##$ZGOPTNS= <>
##$ZL1= 120
##$ZL2= 120
##$ZL3= 120
##$ZL4= 120
##$ABSF1= 10
##$ABSF2= 0
##$ABSG= 5
##$ABSL= 3
##$ALPHA= 0
##$AQORDER= 0
##$ASSFAC= 0
##$ASSFACI= 0
##$ASSFACX= 0
##$ASSWID= 0
##$AUNMP= <proc_1d>
##$AZFE= 0.1
##$AZFW= 0.1
##$BCFW= 1
##$BC_mod= 2
##$BYTORDP= 1
##$COROFFS= 0
##$CY= -3
##$DATMOD= 1
##$DC= 2
##$DFILT= <>
##$DTYPP= 0
##$F1P= 0
##$F2P= 0
##$FCOR= 0.5
##$FTSIZE= 0
##$FT_mod= 4
##$GAMMA= 1
##$GB= 0.15
##$INTBC= 1
##$INTSCL= 1
##$ISEN= 128
##$LB= 0.25
##$LEV0= 0
##$LPBIN= 0
##$MAXI= 10000
##$MC2= 0
##$MEAN= 0
##$ME_mod= 0
##$MI= 1.114404
##$NCOEF= 0
##$NC_proc= 0
##$NLEV= 6
##$NOISF1= 3.799351
##$NOISF2= 2.8
##$NSP= 1
##$NTH_PI= 0
##$NZP= 0
##$OFFSET= 14.38212
##$PC= 1
##$PHC0= -1200.046
##$PHC1= 8.99238
##$PH_mod= 1
##$PKNL= yes
##$PPARMOD= 0
##$PSCAL= 0
##$PSIGN= 0
##$REVERSE= no
##$SF= 200.129724274929
##$SI= 16384
##$SIGF1= 3
##$SIGF2= 2
##$SINO= 400
##$SIOLD= 16384
##$SREGLST= <1H.CDCl3>
##$SSB= 0
##$STSI= 0
##$STSR= 0
##$SW_p= 3205.1282051282
##$SYMM= 0
##$S_DEV= 0
##$TDeff= 0
##$TDoff= 0
##$TI= <>
##$TILT= no
##$TM1= 0
##$TM2= 0
##$TOPLEV= 0
##$USERP1= <user>
##$USERP2= <user>
##$USERP3= <user>
##$USERP4= <user>
##$USERP5= <user>
##$WDW= 1
##$XDIM= 8192
##$YMAX_p= 0
##$YMIN_p= 0
$$ End of Bruker specific parameters
$$ ---------------------------------
##NTUPLES= NMR FID
##VAR_NAME=  TIME,          FID/REAL,        FID/IMAG
##SYMBOL=    X,             R,               I
##VAR_TYPE=  INDEPENDENT,   DEPENDENT,       DEPENDENT
##VAR_FORM=  AFFN,          ASDF,            ASDF
##VAR_DIM=   8192,          8192,            8192
##UNITS=     SECONDS,       ARBITRARY UNITS, ARBITRARY UNITS
##FACTOR=    0.0002768,     1,               1
##FIRST=     0,             0,               0
##LAST=      2.2672688,     0,               0
##MIN=       0,             -129943,         0
##MAX=       2.2672688,     164256,          0
$$ Real data points
##PAGE= N=1
##DATA TABLE= (X++(R..R)), XYDATA
0@%%%%%%%%%%%%%%Nj3J6j6J6k1K9l2L8m6N3o1P1q4R3j04J20j40J61j80K04k31
$$ 0 0 0 0 0 0 0 0 0 0 0 0 0 0 0 5 -8 8 -8 8 -13 16 -16 22 -24 29 -32 39 -45 48 -56 64 -76 85 -95 109 -122
36a22K56k87L24l59L99m44M92n46O04o66P37q14Q93r82J083j195J316j451J603
$$ -122 134 -153 171 -188 211 -233 259 -287 317 -349 388 -426 467 -515 568 -627 689 -762 841
55H41j775J973k198K458k765L135l589M160m905N920p386R703j3909K3856r0192
$$ 841 -934 1039 -1159 1299 -1466 1669 -1920 2240 -2665 3255 -4131 5572 -8337 15519 -74673
70g4673l9826K18479q7194j22166J81825Q7811k01514P084J70707o9099j39485
$$ -74673 -114499 103980 16786 -105380 76445 164256 -37258 -30174 140533 71434 -68051
81f8051P1232M1502p6846k0907P77k7253N9106L4731o1283K7721R7891k8559n6675
$$ -68051 3181 44683 -32163 -53070 -52293 -79546 -20440 14291 -46992 -19271 78620 50061 -6614
94f614M9406M4907m7370m7026J7661K7447l9173p0270J4377P8507k1297q4838
$$ -6614 42792 87699 40329 -6697 10964 38411 -762 -71032 -56655 21852 555 -84283
106h4283M2560Q3473m9373m3905O0212K0992k4549J5849j532j0821L9070n338
$$ -84283 -41723 41750 -7623 -51528 8684 29676 5127 20976 19444 8623 47693 42355
118D2355o1928K8819O2152p1432p2489P5833L2783j01609j5820Q4735k104m5488
$$ 42355 -19573 9246 71398 -34 -72523 3310 36093 -65516 -81336 3399 1295 -44193
130d4193K5896L7603K837M274M106l081J2163O754l5375k2677K8155m979n6791
$$ -44193 -18297 19306 22143 26417 30523 27442 39605 46359 10984 -11693 16462 11483 -45308
143d5308kM8763j0411m0833J9898M4797r750k5362K2428K5493j2929p450N998
$$ -45308 -45310 3453 -6958 -47791 -27893 16904 7154 -18208 4220 29713 16784 9334 15332
156A5332k608L503j980k0559L500J8757j9705k8578J6824K0274k5620j7997L1329
$$ 15332 12724 16227 14247 -6312 -2812 15945 -3760 -32338 -15514 4760 -20860 -38857 -7528
169g528J7158j8943O24K2795J0015l113p431L719J1759j2002k3829l96O541j1731
$$ -7528 9630 -9313 -8689 14106 24121 21008 13577 17296 29055 17053 -6776 -7172 -631 -12362
183a2362j5367J068J1531L430m696L587J6129J3970p593p611K1383Q203k7671
$$ -12362 -27729 -26661 -15130 -11700 -16396 -12809 3320 17290 9697 2086 23469 31672 4001
196D001l946K1007j0985k0232N194K966r057j233l34n558O303Q728j0581k18K5081
$$ 4001 55 21062 10077 -10155 -4961 -1995 -11052 -12285 -12619 -18177 -11874 -3146 -13727 -13945 11136
211A1136N88j8996J8831K0327j8319q828J3894l150j4717m358k872p482r40j107
$$ 11136 11724 -7272 11559 31886 13567 4739 18633 15483 766 -3592 -6464 -13946 -14886 -15993
225a5993p240O584J4792n862k573K2880P070j3618M366J1146n247r531k857q9
$$ -15993 -23233 -16649 -1857 -7719 -10292 12588 19658 6040 10406 21552 16305 6774 3917 3828
239C828l961n845l255l68K006j313n188M957Q268m603j714R017M346N55r4J064
$$ 3828 -133 -5978 -9233 -9601 -7595 -8908 -14096 -9139 -871 -5474 -7188 1829 6175 6730 6636 7700
255G700O836J288q645j638L336n853j0844k231L174o078o236O101N614k49O023
$$ 7700 14536 15824 7179 5541 8877 3024 -7820 -10051 -6877 -12955 -19191 -13090 -7476 -7725 -1702
270a702M509K467R345J044o884K411L452r507q797K440Q04j0344l167R281j127
$$ -1702 2807 5274 14619 15663 8779 11190 14642 5135 -3662 -1222 -418 -10762 -13929 -4648 -5775
285e775m691O668L645j451L384J011j146K728J530j889j266L351J795o270j339
$$ -5775 -10466 -3798 -153 -1604 1780 2791 1645 4373 5903 4014 2748 6099 7894 1624 285
300B85M815l882p591Q33Q21l935k267J968M199J114J861O072K773J205L665j534
$$ 285 5100 1218 -6373 -5540 -4719 -8654 -10921 -8953 -4754 -3640 -1779 4293 7066 8271 11936 10402
316A0402l479J250l270p598l262K89k554m057K252O347j355n6Q557J917k751K766
$$ 10402 6923 8173 4903 -2695 -5957 -5668 -8222 -12279 -10027 -3680 -5035 -5091 3466 5383 2632 5398
332E398K091k092j876r48j467j702kQ53k530k20L035l083k486L894m09l964J162
$$ 5398 7489 5397 3521 2573 1106 -596 -598 255 -2275 -2495 540 -2543 -5029 -1135 -1544 -5508 -4346
349d346L623J636k160J954N446p48j025L162j676m381J81k052m788r72O40j809
$$ -4346 -723 913 -1247 707 6153 5405 4380 7542 5866 1485 1666 -386 -5174 -6146 -5506 -7315
365g315j206M943M342l391K333Q636j290l559L964q24n306m83j21l515j522J605
$$ -7315 -8521 -3578 764 -2627 -294 8342 7052 3493 7457 6633 1327 844 723 -2792 -4314 -2709
381b709k88k069K438K409l571K339M861l283j903M069J24j389J318P92L18p04
$$ -2709 -2997 -5066 -2628 -219 -3790 -1451 3410 127 -1776 2293 2417 1028 2346 3138 3456 2752
397B752k86J80k263j874p01j471n78l44r99J437J512J471L605N31O75L621j112
$$ 2752 2466 2646 383 -1491 -2192 -3663 -4241 -4585 -5584 -4147 -2635 -1164 2441 2972 3647 7268 6156
414F156k381J031j370m297r46O11j875l214J707K556k045J235M163j373m93L951
$$ 6156 3775 4806 3436 -861 -1807 -1196 -3071 -6285 -4578 -2022 -4067 -2832 1331 -42 -535 3416
430C416j385j831K180Q55k457O29K339j538l178K247J243n111l73K896l736j802
$$ 3416 2031 200 2380 3235 778 1407 3746 2208 -970 1277 2520 -2591 -2964 -68 -3804 -5606
446e606L131Q4j436L082K285k65J507K565p79k014J838j004m601N1J033l860o13
$$ -5606 -2475 -2391 -3827 -745 1540 1275 2782 5347 4568 2554 4392 3388 -1213 -1162 -129 -3989 -4602
463d602J745l49N33J676N1J319J124M98j178m1J310j286j613J910m26j370J568
$$ -4602 -2857 -3206 -2673 -997 -946 373 1497 1995 817 776 2086 800 -813 1097 671 -699 869
480H69l38j007J467j348j721J072J06j433k77J651N84n50J491J510j210J203J793
$$ 869 531 -476 991 -357 -2078 -1006 -900 -2333 -2610 -959 -375 -925 566 2076 866 2069 3862
497C862k386j076J575k385k300J609n40j544N51K383K63q75K142J197k140J463
$$ 3862 1476 400 1975 -410 -2710 -1101 -1641 -3185 -2634 -251 12 -863 1279 2476 336 1799
513A799Q95l046m85K357k143j333K291j96j770J861J752k220r03K768j612k549
$$ 1799 2694 -352 -837 1520 -623 -1956 335 139 -1631 230 1982 -238 -1141 1627 15 -2534
529b534L208K80m166L034K648l291O18L026k035j382K897r09l450R66J853l366
$$ -2534 674 954 -3212 -178 2470 -821 -203 2823 788 -594 2303 1394 -2056 -1090 763 -2603
545b603L4L702k249j108M339r21j623K687N6k828J870Pl119K39J807j387j000
$$ -2603 -2569 1133 -1116 -2224 2115 1194 -429 2258 2314 -514 1356 1363 -1756 -1517 290 -1097 -2097
562b097K228R4j568K590P98l535K022J776l822N91L178l579o34M076j004k767
$$ -2097 131 225 -1343 1247 2045 -1490 532 2308 -1514 -923 2255 -1324 -1958 2118 1114 -1653
578a653K527J410m004Q77L159l676k324M849j458l358M092J048l672K492L024
$$ -1653 874 2284 -1720 -843 2316 -1360 -3684 1165 -293 -3651 441 1489 -2183 309 3333
593C333k866o38K708j056k707J583O39l266P74J818j913l75K659n38j016J480
$$ 3333 467 -171 2537 1481 -1226 357 996 -2270 -1496 322 -1591 -1966 693 155 -861 619
609F19L1q30K83J73l58L27n6K71n1NJ45L6k81k61p03N31r34n06Q48j70r40J474
$$ 619 650 -180 103 276 -82 245 189 460 409 414 559 595 314 53 -650 -119 -1053 -1559 -711 -881 -1821 -347
631c47N34l89J005N61k70j12L07k18j034n37R13j248m50R30j88m01O74L69k16
$$ -347 187 -202 803 1364 1094 982 1289 1071 37 -500 413 -835 -1285 -355 -543 -944 -270 99 -117
650a17m36N56P83r84J05R25m72r61K274j59j379Q07L26j491L2O37j580j003Q54
$$ -117 -553 3 786 -198 -93 832 360 -601 1673 1514 135 942 1268 -223 -191 446 -1134 -2137 -1283
669a283Q19j604Q46J970j152P8K678q47j485J898J23j936J61L01q45j163J164
$$ -1283 -464 -2068 -1222 748 -404 -326 2352 1505 20 1918 2041 105 266 567 -278 -1441 -277
686b77L43j482M76J613j123j39J273n68j075J197M90n14o80P98R98q07K8Q34r64
$$ -277 66 -1416 -940 673 -450 -589 684 116 -959 238 728 214 -466 332 1330 523 551 1385 421
705D21l92L97n74o47l64P5K41n58Q05R05r57P97J666q83o02R19j58j160N8O9n31
$$ 421 29 426 -148 -795 -1159 -1084 -843 -1401 -596 309 -648 149 1815 932 330 1249 1091 -69 -11 58 -473
726d73r74P95Q74j339L67J395o79n5J236o08j085O41Q05j187j37Q24R1j191O17
$$ -473 -1447 -652 222 -1117 -750 645 -34 -89 1147 539 -546 95 900 -287 -424 400 491 -700 -83
745h3J099j549j18J217o33p33M36K66n33L11O59M43r96N45J038o87l98Q22q56
$$ -83 1016 -533 -651 566 -67 -800 -364 -98 -631 -320 339 782 -214 331 1369 682 284 1106 250
764B50p86J61o0n51l9O28J77p63J027R72q72M90R14q53p15O41p0q97l99N88n2
$$ 250 -536 -375 -435 -986 -1025 -397 -220 -983 44 1016 144 634 1548 695 -20 621 551 -346 -745 -157 -209
785b09r49O72O95j094O38O35n09k91R01j94m31L08P36j0n13M78j54j078K42L16
$$ -209 -1158 -486 209 -885 -247 388 -121 -412 489 295 -136 172 908 898 385 863 709 -369 -127 189
805A89q33k50M68l17n57O28O52k9P0P56K49l20N81J13j038K30M07j211o21rJ01
$$ 189 -644 -894 -426 -743 -1300 -672 -20 -49 21 777 1026 706 1287 1400 362 592 999 -212 -833 -842 -741
826g41l48j54O46M23j040J118O81l95p8R20k97j13K23n2k51k04M03k66j194L41
$$ -741 -1089 -1243 -597 -174 -1214 -96 585 190 112 1032 735 622 845 793 542 338 741 475 -719 -378
846c78j34p43L09K11l66O4O98M32J88j91Q98M0q1O31l56r30MJ17q90m18P9J00
$$ -378 -512 -1255 -946 -735 -1101 -1037 -339 93 281 90 988 1028 947 1578 1222 292 296 413 -477 -895 -816 -716
868g16k80N4M78k93n6J090M29o59N94O26j039L32L61m19n33m1N96q90n12L65q1
$$ -716 -996 -942 -464 -757 -813 277 706 47 641 1267 228 560 921 502 -31 -72 524 -366 -878 -513 -594
889e94p36Q10J73p23N47Q94k14R5N00L48m82m00P91m21j128O25j84j025M69J96
$$ -594 -1330 -520 -347 -1070 -523 371 157 252 752 1100 618 218 1009 588 -540 85 -99 -1124 -655 -459
909d59m17K38M94K22k24K5J147q09l6M87j09q61N11J78p50J43J92l26k03m5O42
$$ -459 -876 -638 -144 78 -146 -121 1026 217 181 668 559 -302 209 387 -363 -220 -28 -354 -557 -602 40
930D0m78l91R48k16k98P31J74k99K24P9K33n63j27K87m17j017Q81m94l07M27N14
$$ 40 -438 -829 119 -97 -395 336 510 211 435 514 747 184 57 344 -73 -1090 -209 -703 -1010 -583 -69
951f9l75L64N85K41m35j1Q42p11l63N27l59j113N87K1n20Q3O86j70n64O67Q27
$$ -69 -444 -80 505 746 311 300 1142 431 68 595 236 -877 -290 -269 -789 -706 -20 -190 -754 -87 740
972G40r51K13J172j122r1J255o09p57N21L5p65K23M75m83r71N02J62J00l37J175
$$ 740 -211 2 1174 52 -39 1216 607 -150 371 406 -359 -136 339 -144 -1115 -613 -451 -351 -688 487
992D87q13N01P52O3l81j5O8L18n19n05K35p41m72M58j40m56L24L85M11l32P62
$$ 487 -326 175 927 990 609 594 662 980 461 -44 191 -550 -1022 -564 -704 -1160 -836 -451 -40 -372 390
1013C90J47k41K61R61j138l50Q27m72l31j25J4n64J5K4r4k25K19N74l60K11J078
$$ 390 537 296 557 1518 380 30 857 385 54 -71 -57 -621 -606 -582 -676 -901 -682 -108 -468 -257 821
1034H21n79M6O32O8nk45l5n13m02q7J77q96J43N12l37j64L27O23l93N88L78k0
$$ 821 242 288 920 988 983 738 703 190 -212 -299 -122 -1018 -875 -363 -700 -864 -537 86 -307 281 659 639
1056F39m01O78J07q86O8K13p80K52R8k60n59O51p9q4j81N20k75K35O27j06m52
$$ 639 238 916 1023 137 205 418 -362 -110 -12 -272 -831 -180 -259 -343 -524 -4 -279 -44 583 477 25
1077B5N23L91p19j38L23m24l58J19l74L98l47J23L41n14L18O57k7j58J64J65j58
$$ 25 548 939 220 82 405 -19 -377 -258 -632 -234 -581 -458 -117 -631 -313 344 317 159 323 488 330
1098C30k38oK67p79L59L67q00j0N73n39J18M25j34K79n09O00j63k85O19j11j63
$$ 330 92 86 353 -426 -67 300 -500 -510 63 -476 -358 67 -67 212 -297 303 140 -145 474 363 200
1119B00NM00p67o5K92k62k60J46K01r3l07O44o9m28N63M86n96L57J84n57M1m7
$$ 200 205 605 -162 -227 65 -197 -457 -311 -110 -203 -510 134 65 -363 200 686 90 447 631 74 115 68
1141F8l61o9j73k6J88l09M37J30P9J68O10m84K26J7j51R1m36J64J46n47q9J32
$$ 68 -293 -362 -535 -561 -373 -682 -245 -115 -36 132 742 258 484 501 350 441 5 169 315 -232 -321 -189
1163a89j52k64M53k43J7J66L53l81K58L38o3k19O93k03n73K79L33p35k20K18n03
$$ -189 -341 -605 -152 -395 -378 -212 141 -240 18 356 293 74 767 564 -9 270 603 -132 -352 -134 -637
1184f37J79p2L33k43k68R56j16k86O92l7l63P08j54p71L10K13n66j8j3j91j27
$$ -637 -458 -530 -197 -440 -708 248 132 -154 538 501 138 846 692 -79 231 444 -122 -140 -153 -344 -471
1205d71j25J65L52m20N85J50j91J54K21l0j64LK64j48p06N61r8n69R0L52n48J56
$$ -471 -596 -431 -79 -499 86 236 45 199 420 390 226 229 493 345 -361 200 102 -467 -377 -25 -573 -417
1227d17k4j83K23L3L70K39J82N0J41n70M69M1q23N71j20k95J8k55j30J45k87M36
$$ -417 -441 -624 -401 -368 2 241 423 473 614 44 513 554 -269 302 182 -113 -95 -350 -480 -335 -622 -186
1249a86mJ13N31l04k2J16J13n3N1k88K7L0j98j08j53JM2L53k81M5K8J04r0L76
$$ -186 -190 -77 454 150 128 244 357 304 355 67 94 124 -74 -182 -335 -334 -292 61 -220 -175 -147 -43 -133 243
1273B43J66n83M45Q8j57l61L63m80K29O8L8l21O8r6K93j50j35M05k04J47J03j11
$$ 243 409 -174 271 359 202 -159 204 -276 -47 21 59 -262 -194 -290 3 -147 -282 123 -81 66 169 58
1295E8q7M58m40K54l95L6L5j24n2K95j43q7K15N8j28L09J3q4N9k1j13k01o5N43
$$ 58 -29 429 -11 243 -152 -116 -81 -205 -257 38 -105 -192 23 81 -47 262 275 191 250 229 116 -85 -150 393
1319C93l98kK38m74k29L07p2J03P0l06K78J25K37J72n36p9N02j31j88o0j64ro
$$ 393 -5 -7 231 -243 -472 -165 -237 -134 -64 -370 -92 33 270 442 -94 -173 329 198 10 -50 -214 -223 -229
1342b29k12q0J01L02K66m10K49j7J82P4J56j79K52k14J6r7j02J31k86j50m7K2
$$ -229 -441 -521 -420 -118 148 -262 -13 -30 152 226 382 203 455 241 257 160 58 189 -97 -247 -294 -272
1364b72K1J36j9nK22j77M0K92L6N1k2k71K18P8n88J80l13O2j28M62o3l27K04J22
$$ -272 -251 -115 -134 -139 83 -94 -54 238 274 325 303 32 250 328 -260 -80 -393 -331 -459 3 -60 -387 -183 -61
1388f1LJ69k5K24n73L27K01l57L42L5p2l02J02n5j09K6j53M24m00J44M68p15M21
$$ -61 -58 111 86 310 -263 64 265 -92 250 285 213 -89 13 -42 -151 -125 -278 146 -254 -110 358 -357 64
1411F4K27J33m54j50K62O8n0K02j19m18m5L76j99K6K7q9j54K31L63k04k53M09
$$ 64 291 424 -30 -180 82 150 100 302 183 -235 -280 96 -103 -77 -50 -139 -293 -62 301 97 -156 253
1433B53m0j98J95Lk46J15O2l30R7k9k1K54r1Pn5l58M09J39o12M32J04r2J8J90
$$ 253 213 15 210 213 -33 82 144 -186 -89 -118 -139 115 24 31 -24 -382 27 166 -446 -14 90 -2 16 206
1457B06k2r0j3k00L80m43K23Q1pj80k21K35j74J69J18M2Nj62L28n50P3K95j41
$$ 206 184 94 81 -119 261 -182 41 122 115 -65 -286 -51 -225 -56 62 104 109 -53 275 -275 -202 93 -48
1480d8J57j74PQ2kR2j31J10j31k40J24J92J55j17o4k7R3p3J25l90M5J85J3J0j73
$$ -48 109 -65 -58 24 22 114 -17 93 -38 -278 -154 38 193 76 12 -15 78 5 130 -260 -215 -30 -17 -7 -180
1505a80J06n9K18j13J99j37j02M73n20J64k06J62j85J01l7K8l72M26K35k95K21
$$ -180 -74 -133 85 -28 171 34 -68 405 -115 49 -157 5 -180 -79 -116 -88 -460 -34 201 -94 127
1526A27o4J5L5M43n36K04k75M78k79j99J67l6l60J82J81n22Q3M70j16k72O9K23
$$ 127 63 78 113 556 20 224 -51 427 148 -51 116 80 -280 -98 83 -439 -356 114 -2 -274 -205 18
1548A8K43l02L36k92M4Q0n7j55J09J65l30Q5N0J21k38n2N7M4N8J44J80l71K33
$$ 18 261 -41 295 3 47 127 70 -85 24 189 -141 -56 -6 115 -123 -175 -118 -74 -16 128 308 -63 170
1571A70p3k9j79m2M73l25J52j75k04rM4J75j44M2j01Q7J13k21L25k78n9L22o4
$$ 170 97 68 -111 -153 320 -5 147 -28 -232 -241 -197 -22 -166 -124 -225 -138 -25 -246 79 -199 -258 64 0
1594@J58j61l25K05n2K49k72K20k8o7j48K47j44L13j37k5q7n7K06j52n4J0L10
$$ 0 158 -3 -328 -123 -175 74 -198 22 -6 -73 -221 26 -118 195 58 33 -54 -111 95 -57 -111 -101 209
1617B09l5k87J06K59j57k23K5J76J17l58K30j9r6k69L88j03K06k87J19J47j9k04
$$ 209 174 -113 -7 252 95 -128 -103 73 190 -168 62 43 -53 -322 66 -37 169 -118 1 148 129 -75
1639g5P6J53j98j21K28k36M76k44k38K27k40K76J31j68j06K74m16K78J38k21k1
$$ -75 1 154 -44 -165 63 -173 303 59 -179 48 -192 84 215 47 -59 215 -201 77 215 -6 -27
1660b7m7L3J18k5j43J96K12k53J1j60K03r3n2R5j61M8p5P6k05L56k6l23K89k12
$$ -27 -74 -41 77 52 -91 105 317 64 75 -85 118 25 -27 68 -93 -45 -120 -44 -249 107 81 -242 47 -165
1684a65P0j85K50k25K3K44Ol3Q9j79J12M4J69m40j26L08K3k85N00l16L7K08j77
$$ -165 -95 -280 -30 -255 -232 12 18 -15 74 -105 7 51 220 -220 -346 -38 -15 -300 200 -116 -79 129 -48
1707d8n2J95R6r5L4j29J26Q3j49pj7j61k7J91k07k33K22M05k70j40L58m18L28
$$ -48 -100 95 191 96 130 1 127 210 61 54 37 -124 -151 40 -167 -400 -178 227 -43 -183 175 -243 85
1730H5j81M58k65r0P1k3j74L12j07k23L03J44k58j93K51j11L1k15K16p7j49J95
$$ 85 -96 362 97 7 78 55 -119 193 86 -137 166 310 52 -141 110 -1 30 -185 31 -46 -195 0
1752@J60o9p0k44O0K95j78j19K40n8r9L7l4Q1L3J05l46k8R6J44j03J89J65N2k47
$$ 0 160 91 21 -223 -163 132 -46 -165 75 17 -82 -45 -79 2 35 140 -206 -234 -138 6 -97 92 257 309 62
1777F2j78K83m8J33k80q1J69j47j62L02O9k58K82k58O6k42M30j69o3J27j09j81
$$ 62 -116 167 119 252 -28 -109 60 -87 -249 53 122 -136 146 -112 -46 -288 142 -27 -90 37 -72 -253
1799b53r2M43N8m3k07L14j76l7o5J5M7P9k52k02L29j57J33L72j97j31j32L71r7
$$ -253 -345 98 156 113 -94 220 44 7 -58 -43 4 83 -169 -371 -42 -199 -66 306 109 -22 -154 217 120
1822A20k86K81p8r2J11J1Q7j84k67K91m0J79M3j94j06K55l18J45j48K47J69k17
$$ 120 -166 115 37 -55 56 67 154 -30 -297 -6 -46 133 176 -18 -124 131 -187 -42 -190 57 226 9
1844IJ54j25m9Q8j81J83P9k55P6j36J51j13K47rQ2j67J34k91J31K71j84k49K17
$$ 9 163 38 -11 77 -104 79 158 -97 -21 -157 -6 -119 128 119 201 34 168 -123 8 279 95 -154 63
1867F3k81K83k52J64q0K98K52l55j37j60L66j89K59k41J33k64K95M0k24m1L45
$$ 63 -218 65 -187 -23 -103 195 447 92 -45 -205 161 -28 231 -10 123 -141 154 194 -30 -71 274
1888B74l63O7Q0l22K76j61J40n2J24k93J77k2M5Q4j44j5l8N0J13j19N5K07L4r8
$$ 274 -89 -22 58 -264 12 -149 -9 -61 63 -230 -53 -75 -30 54 -90 -105 -143 -93 20 -99 -44 163 197 99
1912I9j20p4J87j94J7J53k16O1N8J41o2K83n71L44r8L2j00K5J44p7j8j86J3N7
$$ 99 -21 -95 92 -102 -85 68 -148 -87 -29 112 50 333 -238 106 8 40 -60 -35 109 32 14 -172 -159 -102
1936a02kJ87j68j15j30M35k20K6J02q7q9O5j31K49kpK28l43k5J61n0N3j94Q8J38
$$ -102 -104 83 -85 -200 -330 105 -115 -89 13 -74 -163 -98 -229 20 18 11 239 -104 -129 32 -18 35 -159 -71 67
1961F7J51j15l54L58j38j67N7k5M3L07j78Pj5l0J29k7k18P7J78k55L30j94K16
$$ 67 218 103 -251 107 -31 -198 -141 -166 -123 184 6 13 -2 -32 97 70 -148 -71 107 -148 182 -12 204
1984B04l26R2j99R5m4J53j65J39R6j29j51L98L0n59M00r6j64L60j38p9R4m2J92
$$ 204 -122 -30 -229 -134 -178 -25 -190 -51 45 -84 -235 163 193 -366 34 -62 -226 134 -4 -83 11 -31 161
2007A61m52K72K37k62Mj52j88L49M56k83k56J77k01r5K41k2J48l09K06j33K73
$$ 161 -291 -19 218 -44 -40 -192 -380 -31 425 142 -114 63 -138 -233 8 -14 134 -175 31 -102 171
2028A71j1n3l1j9m9j11K54j1j04m7k53J61L24j36j44K41m0j97M4K44l10K46j43
$$ 171 160 107 76 57 8 -103 151 140 36 -11 -264 -103 221 85 -59 182 142 -55 -11 233 -77 169 26
2051B6n1J57j08KL7k86N73m82L69l11p2J3j53L52k77R4L14j15P1j50J0J22k57
$$ 26 -25 132 24 26 63 -223 350 -132 237 -74 -146 -133 -286 66 -211 -117 197 82 153 3 13 135 -122
2074a22m4K32p6N3j09l1p2J95K76l71o2J28o4k21K21J45J05l15J14j03M8Q2P3
$$ -122 -166 66 -10 43 -66 -97 -169 26 302 -69 -131 -3 -67 -288 -67 78 183 -132 -18 -121 -73 9 82
2097H2j62l35M45j68P5m0m9J56J42j65L10j55j35K56l69J31o7l6K2K87k74j5q8
$$ 82 -80 -415 30 -138 -63 -103 -152 4 146 -19 291 136 1 257 -112 19 -48 -84 -62 225 -49 -64 -152
2120a52K77M6n32M46j31m2J55j60J4j8J62J05o3L4K6j57KJ01j39q4R1m1K2j62
$$ -152 125 171 -361 85 -46 -88 67 -93 -79 -97 65 170 107 141 167 10 12 113 -26 -110 -19 -60 -38 -200
2144b00L74j66j08p9J51Q0k42L49l51K19lm8r2K00l7n3M46l44j03q8N8L09k58
$$ -200 174 8 -100 -179 -28 52 -190 159 -192 27 24 -24 -116 84 47 -6 440 96 -7 -95 -37 272 14
2167A4QQ2k8J69l60R2j15j3Q1R8j49J40j52N13n91K63q0m6L8J51O1j66n4M8M1
$$ 14 22 104 76 245 -115 -23 -138 -151 -70 28 -121 19 -133 380 -211 52 -28 -74 -36 115 176 10 -44 4 45
2192D5P0j98J43k06J62K07k13O5k10J1K40k05J3K94k38j1J04j83L38p8j58J72
$$ 45 115 -83 60 -146 16 223 10 75 -135 -124 116 -89 -76 218 -20 -31 73 -110 228 150 -8 164
2214A64k18J83j23q0Pj69M5J04j46L29K6J51l94oNJ46j6j2J00J00L7n8j81L2K4
$$ 164 -54 129 6 -74 -67 -236 -191 -87 -233 96 122 273 -121 -127 -122 24 8 -4 96 196 233 175 -6 26 50
2239E0k25K76k30N0L16j59L9j43k23K17J38r2l3J74p4n5Nl45L46l10L24K2m4k93
$$ 50 -175 101 -129 -79 237 78 117 -26 -249 -32 106 14 -19 155 81 26 31 -314 32 -278 46 68 24 -269
2263b69J57P8M20ML8k60j64Lm0P0J0k92J54Q9kN5m12M68k03J41q8Lj56P5P1m1
$$ -269 -112 -34 386 390 428 168 4 7 -33 37 47 -245 -91 -2 -4 51 -361 107 -96 45 -43 -40 -196 -121 -50 -91
2289i1K6N8j77K80J24n9n5j59k04K98k04J86j69L57L1k93l07M22J79k49l9j98
$$ -91 -65 -7 -184 96 220 161 106 -53 -257 41 -163 23 -146 211 242 -51 -358 64 243 -6 -45 -243
2311b43L00j65L1J92j64J17Lk13J08J33l44L3p1L66l71J95J74k71P5J19J08r4
$$ -243 57 -108 -77 115 -49 68 71 -142 -34 99 -245 -212 -283 83 -288 -93 81 -190 -115 4 112 18
2333A8R6q3K9O0j41J57l12J7L6j07K44N8m2j9j90J48Q3N7p7j34PJ25j04Nj09N
$$ 18 114 31 60 120 -21 136 -176 -159 -123 -230 14 72 30 11 -179 -31 52 109 32 -102 -95 30 -74 -69 -178 -173
2359a73K61l3J33l01J51l60L65N6j36k47K56PJ12k74M43n43J89K7K78J27r9l30
$$ -173 88 55 188 -113 38 -322 43 99 -37 -284 -28 -21 91 -183 260 -283 -94 -67 211 338 239 -91
2381i1kK30k71K09K05l73J71j79m2mJ86MJ27k43J01o5K47l6l97K89Rj82o4L21
$$ -91 -93 137 -134 75 280 -93 78 -101 -143 -147 39 43 170 -73 28 -37 210 174 -223 66 75 -107 -171 150
2405A50k3j6j12lk5R9j1K26O3m09J37k65R3k0J14j08l2Q0J29L08l16P6k73K56
$$ 150 127 111 -1 -4 -29 70 59 285 348 -61 76 -189 -96 -116 -2 -110 -142 -62 67 375 59 135 -138 118
2429A18M4r3j30J25O6p4l68J83L03k15K8K56r6j86l7L78l01J9M8j81J79o6r5j27
$$ 118 162 69 -61 64 130 56 -312 -129 174 -41 -13 243 147 -39 -76 302 1 20 68 -113 66 0 -95 -222
2453b22J36M1J26j12L38k76j8j38j0J36J64l25J36J34K44m89q3R1J5J28k13K55
$$ -222 -86 -45 81 -31 307 31 13 -125 -135 1 165 -160 -24 110 354 -135 -218 -127 -112 16 -197 58
2475E8MJ42k88J53k37J61J50l30O6L62k68l6j4P0J74o6k59j66N12pj44k61K79
$$ 58 62 204 -84 69 -168 -7 143 -187 -121 241 -27 -63 -77 -7 167 101 -158 -324 188 181 37 -224 55
2498E5j16r3J70P2Lj76J27k55K77qk6k01J25q6K8J42j53n1J50J05p3K6j73K19
$$ 55 -61 -154 16 88 91 -85 42 -213 64 56 30 -171 -46 -132 -104 38 -115 -166 -16 89 16 42 -131 88
2522H8k75J76q3K1J09%j18j56N27j97L6k65J38o5Nl3J11j63K3P0N1j46L73n18
$$ 88 -187 -11 -94 -73 36 36 -82 -238 289 92 128 -137 1 -64 -59 -92 19 -144 -121 -51 0 -146 227 -291
2546b91J45J94J90l2o5M7k13L1j78j45M28m31N38n4k36m4K00J61k22l1K02l18
$$ -291 -146 48 238 206 141 188 -25 6 -172 -317 111 -320 218 164 -72 -116 84 245 23 -8 194 -124
2568a24L10J12l60P4j51K28j07J00P7l09M1N6Q7k2M5m8J8J27o8Q4Qj09qJ0l00
$$ -124 186 298 -62 12 -139 89 -18 82 159 -150 -109 -53 34 12 57 9 27 154 86 170 178 69 61 71 -229
2593b29M97j39k02K7J28j44j87L27%K13m84J40qj75J70R4j4j10R4k23P2J72J45
$$ -229 268 129 -73 -46 82 -62 -249 78 78 291 -193 -53 -61 -236 -66 28 14 -96 -2 -225 -153 19 164
2616A64N6k64Q6J28j87K10l01J2n8l6K84k0k69K36k5j39K67q7J27l62M04k85K21
$$ 164 220 -44 42 170 -17 193 -108 -96 -154 -190 94 74 -195 41 16 -123 144 57 184 -178 226 -59 162
2639A62k13k19L4L72l51R9J19j54O3L6J68j5l3j61j2J57L4M5j12J08q3J03k44
$$ 162 -51 -270 -236 136 -215 -116 3 -151 -88 -52 116 101 68 -93 -105 52 86 131 19 127 44 147 -97
2662i7M22l10N6%M9j8l03K23l0K6J21J36j44k14J04J25j85O0j9J27j46L48l36
$$ -97 325 15 71 71 120 102 -201 22 -8 18 139 275 131 -83 21 146 -39 21 2 129 -17 331 -5
2685eR1j75J54k22J51k8J47Lj71MK61l3n28K93m8K77j35j24K6J37j66M8n6j5L37
$$ -5 86 -89 65 -157 -6 -34 113 116 -55 -51 210 177 -351 -58 -106 171 36 -88 -62 75 -91 -43 -99 -114 223
2710B23k46K6J03k04J75L1k51K47Q9o6j66n9j49P5l9L70M6j17l2j29O8L4K9Kk36
$$ 223 -23 3 106 -98 77 108 -143 104 193 127 -39 -98 -247 -172 -211 159 205 88 56 -73 -5 29 58 60 -176
2735a76K84j28Np8K50j82Q7j38L13o10L98k0J27o2J04k12l1rJ28M6j63rK1J39
$$ -176 108 -20 -15 -93 157 -25 62 -76 237 -373 25 5 132 70 174 -38 -69 -78 50 96 -67 -76 -55 84
2759H4j44J96k6j53J1L4M0m4l3J5j1O2j10j26N9L3J55j71M2J79o7J38m3l38J48
$$ 84 -60 136 110 -43 -32 2 42 -2 -35 -20 -31 31 -79 -205 -146 -113 42 -129 -87 92 25 163 120 -218 -70
2784g0M3j09K37j09k2K5nj64K75n7K0q6N1N9p8Q3k30K1K48l0k07RK75j82j38L59
$$ -70 -27 -136 101 -8 -30 -5 -10 -174 101 44 64 -22 29 88 10 93 -137 -116 132 102 -105 -96 179 -3 -141 218
2810B18n6qr7k18J40KN9Q4j63j68J64j67K28j08j04M61L4k01J17j86O1k40J25
$$ 218 162 154 57 -161 -21 -19 40 124 -39 -207 -43 -210 18 -90 -194 267 301 100 217 31 92 -148 -23
2833b3j5Q3Ol46L95j12J95k06J59j35J3N8j58J19q5R1k40J77j2mj2j54K62R2O5
$$ -23 -38 45 51 -295 100 -12 183 -23 136 1 14 72 -86 33 -52 39 -201 -24 -36 -40 -52 -206 56 148 213
2858B13j51p8k85L98j71J52n6j38R3qkj4O8J78l10K28j95J99n2n8m8J45j0k10
$$ 213 62 -16 -301 97 -74 78 22 -116 -23 -31 -33 -47 21 199 -111 117 -78 121 69 11 -37 108 98 -112
2882a12J79J59k74K8J56J6l29K44l33K30J37l40K60J46J11l53M5k06K69J02l69
$$ -112 67 226 -48 -20 136 152 -177 67 -266 -36 101 -239 21 167 278 -75 -30 -236 33 135 -234
2903b34L72k33o8N49l99q7K19J22k26J40k53K32l18K18j40R5M11n05p9%J3L05
$$ -234 138 -95 -163 386 -13 -100 119 241 15 155 -98 134 -184 34 -106 -11 400 -105 -184 -184 -171 134
2925A34k20K37l4j63J18J03k6j65J92k56m3j09J62O5l8M76m63J58r7J91k71J23
$$ 134 -86 151 117 -46 72 175 149 -16 176 -80 -123 -232 -70 -5 -43 433 -30 128 31 222 -49 74
2947G4j14N4K12j16m1j43K78l47M62l60J22l04L11k00K65q5q8k57K35J11O0R2
$$ 74 -40 14 226 110 69 -74 204 -143 319 -41 81 -223 88 -112 153 68 -20 -277 -42 69 129 221
2969B21l52r1M92k65J75k62l8L27j68O1j53J24J3j77mLK38j50L34l76P6j83L38
$$ 221 -131 -222 270 5 180 -82 -120 207 39 100 -53 71 84 -93 -97 -94 144 -6 328 -48 28 -155 183
2992A83j55o1r3J14O6l11L76k71M89j67j24J03k82K01o9MJ8j29L30k42N5Kj08
$$ 183 28 -33 -126 -12 54 -257 119 -152 337 170 46 149 -133 68 -1 3 21 -108 222 -20 35 37 -71
3015g1J23R0L4j87j98L13l43L25m9l18K47J32Nj49L05l23J2p9j9J64l87M17p8
$$ -71 52 142 176 -11 -209 104 -239 86 37 -281 -34 98 103 -46 259 -64 -52 -131 -150 14 -373 44 -34
3038c4k19L30J9J1r5j64J49M3j05M1j50K51p5Mj35J86jj39J66Ql9q7M7p0k4J30
$$ -34 -253 77 96 107 12 -152 -3 40 -65 -24 -174 77 2 6 -129 57 56 -83 83 91 52 -35 12 -58 -82 48
3064D8j69J4K49l93K32M0k30R7J15K13j47kkl27K37j1J01j22J73K10k01k49K90
$$ 48 -121 -107 142 -251 -19 21 -209 -112 3 216 69 67 65 -262 -25 -36 65 -57 116 326 125 -124 166
3087A66j68L3J21l92L41R1l40mj51L84J79m10R9J22k61K67j21m4R3J15p8ml9l6
$$ 166 -2 31 152 -240 101 192 -148 -152 -303 81 260 -150 -51 71 -190 77 -44 -88 5 120 42 38 -1 -37
3111c7O3Qj65qJ66k8j76K96l36J72J62j68M7J39j54N8j42J28kj52M5K24j42j83
$$ -37 26 34 -131 -139 27 -1 -177 119 -217 -45 117 -51 -4 135 -19 39 -103 25 23 -129 -84 140 -2 -185
3135a85J66P4m9l7J89n08N68l66J31k6K59r8J17m32K61K0j73q0L50k87M2l1K6
$$ -185 -19 55 6 -31 158 -350 218 -148 -17 -43 216 118 235 -197 64 84 -89 -169 181 -106 -64 -95 -69
3158f9K78m51L27k8k93M36j15J64l78K24k78O1K34l95L68k4n5o2P6p7J54l94J30
$$ -69 209 -242 85 57 -236 200 85 249 -129 95 -183 -122 112 -283 85 61 6 -56 20 -57 97 -297 -167
3181a67j20K41K08k09K53k51J58k53M5kJ61J3M7q2j08m8P3M3L35j08l12K64m65
$$ -167 -287 -46 162 -47 206 -45 113 -140 -95 -97 64 77 124 42 -66 -114 -41 2 337 229 -83 181 -284
3204b84L52Mj01m7K22m8k83K98p5n4J4J6Ok0j16L06k63k9N1j07K2N2J56p5o3P8
$$ -284 68 72 -29 -76 146 98 -185 113 38 -16 -2 14 20 0 -116 190 -73 -102 -51 -158 -136 -84 72 -3 -66 12
3230A2jO0j64L44l78M7n2NK60l97M21n07M15oj54J31K06k16M0j27p6L26j13q4
$$ 12 11 71 -93 251 -127 -80 -132 -127 133 -264 157 -350 65 59 -95 36 242 26 66 -61 -137 189 76 -8
3254hJ55k13J71P1k85K36o6O8j69p6J45k8J90q7j91K1k0J49j10l2K14k06K9K92
$$ -8 147 -66 105 176 -109 127 61 129 -40 -116 29 1 191 104 -87 -66 -86 63 -47 -79 135 -71 -42 250
3278B50k87J04j45K5K50j56r2mJ76j49M3m0k35N05k99J24j84J89j67k7j00J4K20
$$ 250 -37 67 -78 -53 197 41 -51 -55 121 -28 15 -25 -260 245 -54 70 -114 75 -92 -119 -219 -205 15
3301A5J06j59Qj9m2k00j7L27j39P0K02k69r5K89j31L18l36K69j53K4n1J4j44K62
$$ 15 121 -38 -30 -49 -91 -291 -308 19 -120 -50 152 -117 -212 77 -54 264 -72 197 44 68 17 31 -113 149
3325A49l4n7M5p7N8R8J08J14m07K48l33K68m9j55O1J5j23kK72l67MJ79j55oJ01
$$ 149 115 58 103 26 84 182 290 404 -3 245 -88 180 131 -24 37 52 -71 -73 199 -168 -164 15 -140 -146 -45
3350d5p6j6J14K7J31k46J22j4J53J14l5l52j7J48j31N9J56k6k13P2J36p0J08Q6
$$ -45 -121 -137 -23 4 135 -111 11 -3 150 264 229 -123 -140 8 -123 -64 92 66 -147 -75 61 -9 99 185
3374A85r1r6L33k05l59J05k6R9m0%J6n6J31J16m75M03j15k3P6L84k73q4R0K0m7
$$ 185 94 -2 331 126 -233 -128 -154 -55 -95 -95 -79 -135 -4 112 -363 40 -75 -98 -22 362 89 5 95 115 68
3399F8O8j61o5K3L5M8j7M0m9j2j99J93K85j83l0q6K17q4j45q0R0q4J34m6J13j52
$$ 68 136 -25 -90 -67 -32 16 -1 39 -10 -22 -221 -28 257 74 44 -42 175 91 -54 -134 -44 -128 6 -40 73 -79
3425g9J09J07k79K6j3K40l10M51Mj79j9k52J44J56n7q4j15Q1J48k64R8R1J43m81
$$ -79 30 137 -142 -116 -129 111 -199 252 256 77 58 -194 -50 106 49 -35 -150 -69 79 -185 -87 4 147 -334
3449c34M81j57p6J81o0J79k0j68q2K68m4j25l3p3j41J03Q9K09r3j92jK40J0j81
$$ -334 147 -10 -86 95 35 214 194 26 -56 212 168 43 10 -63 -204 -101 -12 197 104 -88 -89 151 161 -20
3473b0n6J57J35m16M15k53N3Q5k18L39l56K83j77j54M14q2P4k05J22j56K6J33
$$ -20 -76 81 216 -200 215 -38 15 100 -118 221 -135 148 -29 -183 231 149 223 18 140 -16 10 143
3495A43l98L18K07k20J0L3q2N2k6mo2K7j74L45j22j36n9K25M6q0j15q1J40j18
$$ 143 -255 63 270 50 60 93 11 63 37 33 -29 -2 -176 169 47 -89 -148 77 123 43 -72 -153 -13 -131
3519a31J03j57M47j37p5k45J94P2N8k88M26k58K42k52L4j06L8J74m42K27J53J0
$$ -131 -28 -185 262 125 50 -195 -1 71 129 -159 267 9 251 -1 33 -73 -35 139 -303 -76 77 87
3541H7q3R7J3j70m7J28j00j4R3J71k25j96L99l01k13L95j20L75k97R2R3j71k23
$$ 87 4 101 114 -56 -103 25 -75 -89 4 175 -50 -246 153 -148 -361 34 -86 289 -8 84 177 6 -217
3564b17K10J83m7J14j91j64J51o9n9K40j61Q7k90R3L6J91k4n0l6J17j16m5qJ32
$$ -217 -7 176 129 243 52 -112 39 -30 -89 151 -10 77 -213 -120 -84 107 83 33 -3 114 -2 -47 -55 77
3588G7Q3j35rNj13k62pN45j76M4JR8r0K20j35l05R8K43j89Pl3k5J0K77j12j31
$$ 77 160 25 16 21 -92 -354 -361 184 8 52 53 151 61 281 146 -159 -61 182 -7 0 -33 -58 -48 229 117 -14
3614a4l1J20L4j07R2Ok77J34J78j40R9l73L47j01Q0n3L4O6j62p0M17m13J3K46
$$ -14 -45 75 109 2 94 100 -177 -43 135 -5 94 -279 68 -33 47 -6 28 94 -68 -138 279 -134 -121 125
3638A25O3k77J71P0k4n73J72N06j79J98k82J51l70M28k08J8N0R1k41J93k57J70
$$ 125 188 -89 82 152 128 -445 -273 233 54 252 -30 121 -249 179 -29 -11 39 130 -111 82 -175 -5
3660el7j27R6r4L29r8r8j5J87L2p4k89J46k00M83k9j19o3j7K1r4j63J94L05l65
$$ -5 -42 -169 -73 -167 162 64 -34 -49 138 170 96 -193 -47 -247 236 207 88 25 8 29 -65 -228 -34 271 -94
3685i4o1K54j98J85n8k34L00o6k88L10J6j24j1K54k23J06J33qm70K54K04k69J90
$$ -94 -155 99 -99 86 28 -206 94 28 -260 50 66 -58 -69 185 -38 68 201 193 -277 -23 181 -88 102
3708A02k23N0J9n3q2K7J95j58L7p6q8l9J17J63J37l52Q2Q7j57L2K94j74J54j52
$$ 102 -121 -71 -52 -105 -187 -160 35 -123 -86 -162 -250 -289 -172 -9 128 -224 -142 -55 -212 -180 114 -60 94 -58
3732e8J98q2J94J70l96O7l61L56K6k37K01k77K99j34j25K24j19K46k06O5l70K67
$$ -58 140 58 252 422 26 93 -268 88 114 -123 78 -199 100 -34 -159 65 -54 192 -14 51 -319 -52
3754e2k4L02k22k1M9N0j20mo6j26K64M0j67L25l06K74k69J58O1J2k12n4j41J26
$$ -52 -76 226 4 -17 32 82 -38 -42 -108 -234 30 70 -97 228 -78 196 -73 85 146 158 -54 -108 -249 -123
3778a23j61J49K66k37J35J27j12K7l78O3L71o0l64K88J28J3l2L8J5j23m9j44K40
$$ -123 -284 -135 131 -106 29 156 44 71 -307 -244 127 67 -297 -9 119 132 100 138 153 30 -19 -163 77
3801G7K27m11J96j09J8J24o7q7K23k52K72r6k17J19K10j81M4p5j93M00l55r5K72
$$ 77 304 -107 89 -20 -2 122 55 -32 191 -61 211 115 -102 17 227 46 90 15 -178 222 -133 -228 44
3824D4j59K04j64n0j38J79k9N24m49j98J32L81J7k40j05R0p9P3J68R4k76k5K12
$$ 44 -115 89 -75 -125 -263 -84 -113 411 -38 -236 -104 277 294 54 -51 39 -40 33 201 295 19 -6 206
3847B06k31j22L04k48K11n38O25j30m3k34o1M35j71r8J08k94J29J82L07k21j30
$$ 206 -25 -147 157 -91 120 -418 207 77 34 -200 -261 174 3 -95 13 -281 -152 30 337 116 -14
3868a4l35M32J20j74J21o5N0k12p1J75l39O25l88o0K75O1j73j15M3L02j93r3J31
$$ -14 -349 83 203 29 150 85 135 -77 -148 27 -312 313 -75 -135 140 201 28 -87 -44 258 65 -28 103
3891A03j92q1J6L03k26j16L95k00m6l48N23j49N40o51L45j68k99K33nL89m70M8
$$ 103 -89 -170 -154 149 -77 -193 202 2 -44 -392 131 -18 522 -129 216 48 -251 -18 -23 366 -104 -56
3913e6K14j91R5K8j62K76k92K87k68L17q8N7l9k32R6j33O7o4P1J10Lj60J7j52
$$ -56 158 -33 62 90 -72 204 -88 199 -69 248 160 217 178 -54 42 -91 -24 -88 -17 93 96 -64 -47 -199
3937a99K02K7m0Jj01j5J36j01J41k24K20k18K93k27Q3J46J7k5k71L27k17j9L1
$$ -199 3 30 -10 -9 -110 -125 11 -90 51 -173 47 -171 122 -105 -22 124 141 116 -155 172 -45 -64 -33
3960c3L0J72k48k06L31r6p2N97o86J81k55N09j54p5M2n5jm0j74L3J51NO9k63M14
$$ -33 -3 169 -79 -285 46 -50 -122 475 -211 -30 -285 224 70 -5 37 -18 -19 -59 -233 -200 -49 -44 25 -238 176
3985A76j39j61J35O9j98K59l4k11p3K81k5l0j51K44j44k03L14q9j51L15j05j09
$$ 176 37 -124 11 80 -118 141 107 -104 -177 104 79 49 -102 142 -2 -205 109 20 -131 184 79 -30
4007c0M7J34l73M08j34r7N3PJ06P3QO2l05k40Q3N7J95j04J61N8j0q8L1j78K78
$$ -30 17 151 -222 186 52 -45 8 15 121 194 202 264 -41 -281 -198 -141 54 -50 111 169 159 71 102 -76 202
4032B02k89J91K8J37l86j51J70K06N5l61J12L00k66j0K65k03p5J52J44m23L36
$$ 202 -87 104 132 269 -117 -268 -98 108 163 -198 -86 214 -52 -62 203 0 -75 77 221 -202 134
4053A34j12O2k05J78J25k79K2j71j08M69m08M44r3j43K21k00j9k9o2J47k6L27
$$ 134 22 84 -121 57 182 -97 -75 -246 -354 115 -293 151 58 -85 136 -64 -83 -112 -174 -27 -53 274
4075B74k53j65K23k51J91o3J41O6N8k94Q0K24k45L3k59K44Q4J33o7J96o11L46
$$ 274 21 -144 79 -172 19 -44 97 163 221 -73 7 231 -14 19 -240 4 88 221 154 350 -261 85
4097H5P1j55r1J34j75K64m7r1J02l04K42k92J97k5M09j96J14j74J8l50N67m13
$$ 85 156 1 -90 44 -131 133 86 -5 97 -207 35 -257 -60 -85 324 128 242 68 86 -264 303 -110
4119a10J01j22L6p4O0K16q7J0k0q8L34l45J89N9l59L19j67j24O6K29k71K95m64
$$ -110 -9 -131 -95 -169 -109 107 20 30 10 -78 256 -89 100 159 -200 119 -48 -172 -106 123 -148 147 -317
4142c17M22k81J74M10k33l49j2K42k29J39Q5k44k9j2J17K55k13J5P1l04J71J07
$$ -317 105 -176 -2 408 175 -174 -186 56 -173 -34 51 -193 -222 -234 -117 138 -75 -60 11 -293 -122 -15
4164a5j75L47j07j1K29l99K75o0k24J76J43j04j0r0ll7L31j42k38o0J28J85k66
$$ -15 -190 157 50 39 268 -131 144 84 -140 36 179 75 65 -25 -28 -65 266 124 -114 -174 -46 139 -127
4187a27J08m2N3r1K59j78K0P2M8q3n4O5m01L16j01J87m6r4L14m22J64Q8m21M25
$$ -127 -19 -61 -8 -99 160 -18 2 74 122 39 -15 50 -351 -35 -136 51 5 -89 225 -197 -33 55 -366 59
4211E9qk6j45K99r1k07L62k12l1j29J01P5j1j89K4j7J57J48n7j69Om0j7M2P9k96
$$ 59 51 25 -120 179 88 -119 243 31 0 -129 -28 47 36 -153 -129 -146 11 159 102 -67 -61 -101 -118 -76 3 -293
4237b93J42J83n5O0L1k61Q5K90k19k1j37J82L8q8J85j12k05K24j63K67l41L30
$$ -293 -151 32 -23 37 68 -193 -108 182 -37 -58 -195 -13 25 -63 122 10 -195 29 -134 133 -208 122
4259A22k8k90L05n2m6j52K33QJ7M5P6m15j40K81P5N4k12J82l7J9q6j11L03n1p1
$$ 122 94 -196 109 57 11 -141 92 100 117 162 238 -177 -317 -36 39 93 -119 63 26 45 -41 -152 151 100 29
4284B9pj82R5j80L35R8j89L24k22j50J7K15J0k21K53k98K78N7l79J54L2RJ5j05
$$ 29 22 -160 -65 -245 90 188 -1 323 101 -49 -32 183 193 -28 225 -73 205 262 -117 37 69 78 93 -12
4308a2J41j88K15j1m2R3j00o0J98j95k60L62j65j33M05l38Q1p9K85k50qL67l23
$$ -12 129 -59 156 145 103 196 96 36 234 39 -221 141 -24 -157 248 -90 -9 -88 197 -53 -61 306 -17
4331a7l9k70N18j13O4j47K8J95l47J84J2j89J36n7J54p5L0J91j23j34Q3Kj42r9
$$ -17 -56 -326 192 79 143 -4 24 219 -128 56 68 -121 15 -42 112 37 67 258 135 1 84 86 -56 -155
4355a55J69j00j02K64j30L11m15K38p7p8L03m44L82n04N49R8k53J2j92J1L59m02
$$ -155 14 -86 -188 76 -54 257 -158 80 3 -75 228 -216 166 -338 211 309 56 68 -124 -113 246 -156
4377a56K42k59lJ28J95l1J13j62j8K62n97N35k13j20J87k16J14P4K1j09j59K37
$$ -156 86 -173 -176 -48 147 116 229 67 49 311 -286 249 36 -84 103 -113 1 75 96 -13 -172 65
4399F5J4k31J87o4p7j39J44k7Q9n9K80n2q6j6o6m6J05k4K34q4k41J42j37J4J36
$$ 65 79 -152 35 -29 -106 -245 -101 -128 -39 -98 182 130 44 28 -38 -84 21 -3 231 147 -94 48 -89 -75 61
4424F1j92K62k75L92j97k8P7l38L89n09M74k08J24MK71k91M0l8J26K4o5q8K9J79
$$ 61 -131 131 -144 248 51 23 100 -238 151 -358 116 -92 32 36 307 16 56 18 144 168 103 15 44 223
4448B23j71j71J07Q9J58k02R2j91K67l39J31J01l56K17J59j53J12Kr3J27k33J9
$$ 223 52 -119 -12 77 235 33 125 -66 201 -138 -7 94 -262 -45 114 -39 73 75 -18 109 -124 -105
4470a05J99l5l6J49j27N9j35%j7J95j42K01k44o7p2K13J10k79J18J77j26N0j68
$$ -105 94 59 23 172 45 104 -31 -31 -48 147 5 206 -38 -105 -177 36 146 -133 -15 162 36 86 -82
4493h2J02j04j20K56l01R7M91j73j26k12M2j8O0j15J50K19J57l51L08k64J0J09
$$ -82 20 -84 -204 52 -249 -152 339 166 40 -172 -130 -148 -88 -203 -53 166 323 -28 280 16 26 135
4515A35j84l6j7K75k73k5O4J27k49L13k04OQK19Mqj94k06J03J88k78K90J22k99
$$ 135 -49 -85 -102 173 -100 -125 -61 66 -183 130 -74 -68 -60 159 163 155 -39 -245 -142 46 -232 58 180 -119
4539a19K52Nl66K62J16l59M28n40Q3J33K52k33J26q8N7K00k11j64%J04n5J86j08
$$ -119 133 138 -228 34 150 -209 219 -321 -238 -105 147 -86 40 -48 9 209 -2 -166 -166 -62 -117 69 -39
4562c9p3p3K19j47J68P9q6j76J17K7J45l99J52p2K25L5J52l87K90j07O9J61l33
$$ -39 -112 -185 34 -113 55 134 48 -128 -11 16 161 -238 -86 -158 67 102 254 -133 157 50 119 280 -53
4585e3J15k56J05J27l9j26K93k03r4L00m63J70K7J47j66K0L32r9J11j33l8L6k00
$$ -53 62 -194 -89 38 -1 -127 166 -37 -131 169 -294 -124 -97 50 -116 -96 236 137 248 115 77 113 -87
4608h7J76k1k72J74k5K5nj5Q3jJ50k91j37L63j85m9K29m9Lj43Q2j90J44J62j86
$$ -87 89 68 -204 -30 -55 -30 -35 -50 33 32 182 -109 -246 117 -68 -117 112 63 66 -77 5 -185 -41 121 -65
4633f5K6j54K11j37J05l1J24m0LQ5j94K2N8m6j04J34K5Kl28M28l9j17K5n4j48
$$ -65 -39 -193 18 -119 -14 -45 79 39 42 127 -67 -45 13 -33 -137 -3 22 24 -304 124 85 -32 -7 -61 -209
4658b09J77j53qK65m3J10j66J7l93L32j74K01J13J2J76r9k77K97j46R2j95K04
$$ -209 -32 -185 -193 72 29 139 -27 -10 -403 -71 -245 -44 69 81 257 158 -119 178 32 124 -71 133
4680A33j34k61K74L01m70K22k25K88k01J90l17j00J13Q0L4J15j07J70N9k99Q5
$$ 133 -1 -262 12 313 -157 65 -160 128 -73 117 -200 -300 -187 -107 -73 42 -65 105 164 -135 -50
4701e0j29N7l1R1K7K53r4q2j32K66k3j74K14m41J56J71J15l00N2K42j87R0n5j92
$$ -50 -179 -122 -153 -62 -35 218 124 42 -90 176 153 -21 193 -248 -92 79 194 -106 -54 188 1 91 36 -156
4725a56K57r0N3k7j77K31o2j54P2R9LQJ63j77j14J83j21j53n7N6K37m5q1k71L98
$$ -156 101 11 64 37 -140 91 29 -125 -53 46 49 57 220 43 -71 112 -9 -162 -219 -163 74 29 -52 -323 75
4750G5J16j65J12j43P2l0k49J69k6P2j53K81j50k47J95K20j56j90K71R3l31J61
$$ 75 191 26 138 -5 67 37 -212 -43 -69 3 -150 131 -19 -266 -71 149 -7 -197 74 167 -164 -3
4772cJ22M4k16O7j0K8L6j08L5p5L8j16P9m8RJ22j00J02n9J29J64l26K46l19L6
$$ -3 119 163 -53 14 4 32 68 -40 -5 -80 -42 -158 -79 -127 -118 4 -96 6 -53 76 240 -86 160 -159 -123
4797a23m8M7L2J23p5j59r5M48n5j05o1j38J13J07K45j22k50k71L33P4q7J98j18
$$ -123 -171 -124 -92 31 -44 -203 -298 150 95 -10 -71 -209 -96 11 256 134 -116 -387 -54 20 -67 131 13
4820A3j19j53J79J13k0K10k51J91m14J43O3j9M08m46k05N54l38J08J62o3j38n8
$$ 13 -106 -259 -80 33 13 223 -28 163 -251 -108 -45 -64 344 -102 -307 247 -91 17 179 116 -22 -80
4842h0O3K2L02k93k16j04L50K12l08p0J18R1j41j1q5J38J07j38J11K22k85k71
$$ -80 -17 5 307 14 -202 -306 44 256 -52 -122 -4 87 -54 -65 -150 -12 95 -43 68 290 5 -266
4864b66M32j89J31K29n23L87l35j35N1J92l0J49%j59r2K79j39j64Q0K71k49R3
$$ -266 166 -23 108 337 -186 201 -134 -269 -218 -26 -56 93 93 -66 -158 121 -18 -182 -102 169 -80 13
4886A3j4JO3n2j69K48j67oR0j73Q5r4J88j69J65J56k08J38m1O0M8j64K10k65j27
$$ 13 -1 0 63 11 -158 90 -77 -83 7 -166 -81 -175 13 -156 9 165 -43 95 54 114 162 -2 208 -57 -184
4911a84M19n95J49J59L1J66n4o4p2J65k15J5K7r9L9m7K6K61K8J61m24K65j72j51
$$ -184 235 -360 -211 -52 -21 145 91 27 -45 120 -95 -80 -53 -152 -113 -160 -134 127 155 316 -108 157 -15 -166
4935a66L81l27J94k91K23r3K15l90K72N3p9L15l69KOL2R6j44m31L92r5J59k33
$$ -166 215 -112 82 -209 14 -79 136 -254 18 71 -8 307 -62 -60 -54 -22 74 -70 -501 -109 -204 -45 -278
4958b78M06q3m7p4J17L2r0J13j15j83K36O2kM5j7J53j9ml8j51l4J93m80M23p2
$$ -278 128 45 -2 -76 41 73 -17 96 -19 -202 34 96 94 139 122 275 256 252 214 63 29 222 -258 165 93
4983I3J0q6m3L4J5j06l1J51j17J7Q1l5n5l6K63lk50K76k15J95p0l28J12J87l89
$$ 93 103 17 -26 8 23 -83 -114 37 -80 -63 18 -17 -72 -108 155 152 -98 178 -37 158 88 -240 -128 59 -330
5008c30N14k15J24j81K11l19K33J34k06m01M41K80k71j06j10K72m1L7l61N11k15
$$ -330 184 -31 93 -88 123 -196 37 171 -35 -436 5 285 14 -92 -202 70 29 66 -295 216 1
5029AR5M8l04J67j75j2K57J5r7n3R2k86K06R5N4J62k42P2L8k5O1m05K55K29j59
$$ 1 96 144 -160 7 -168 -180 77 92 -5 -58 34 -252 -46 49 103 265 23 95 133 108 169 -236 19 248 89
5054H9N2j73N0j12K15r0p8J92N5k59o4k4M6J86r6l52K44J15rJ03J2j99m8L69l16
$$ 89 141 -32 18 -94 121 31 -47 145 200 -59 -123 -147 -101 85 -11 -363 -119 -4 -13 90 102 -97 -145 224 -92
5079i2J33p6J83l75K63n2J97m45J20K33k81J61O7L4J08m38L25p9L12J1p22L59
$$ -92 41 -35 148 -227 36 -16 181 -264 -144 89 -192 -31 36 70 178 -260 65 -14 298 309 -413 -54
5101e4J9j53L77k06k4r2j77K50M3N6j38J00j47Q9J08R5j79j88K54j18J05o8O4
$$ -54 -35 -188 189 -17 -41 -133 -310 -60 -17 39 -99 1 -146 -57 51 146 -33 -221 33 -85 20 -48 16
5124A6K9j69L45jk50o3J66j25n2J61L0Q8K7l79R3L63k80j07O9N5L7j13j3J16L8
$$ 16 45 -124 221 220 -30 -93 73 -52 -104 57 87 175 202 -177 -84 279 -1 -108 -39 16 53 -60 -73 43 81
5149H1j31J35l2k68J6J70m7m9J05K86k66k14K14j3p2N2q6L67j72k26J4J59J38
$$ 81 -50 85 53 -215 -199 -29 -76 -125 -20 266 0 -214 0 -13 -85 -33 -119 248 76 -150 -136 23 161
5172A61J67k11Q6J09o61K41K48k12L45j02l69L48k49j07K00K53m8k83J60j11J92
$$ 161 328 117 203 312 -349 -108 140 -72 273 171 -198 150 -99 -206 -6 247 199 -84 76 -35 157
5193A57k42J14N7p3l5nJ52J80l63J05j9j32K27L6r5j89L03k99L0J56k07J77j81
$$ 157 -85 29 86 13 -22 -27 125 305 -58 47 28 -104 123 159 64 -125 178 -121 -91 65 -142 35 -146
5216a46L68k94J9J10j40K37j64o7J60j17J02j54P4j62O1J55k10j73L19j45J57
$$ -146 222 -72 -53 57 -83 154 -10 -77 83 -34 68 -86 -12 -174 -113 42 -168 -341 -22 -167 -10
5237a0M7j99j40L27J89l05J80j17j00p2L30j90R9j89L35j27O6k71K63j75O2K53
$$ -10 37 -162 -302 25 214 -91 89 -28 -128 -200 130 -60 39 -150 185 58 124 -147 116 -59 3 256
5259B56n9Q5l56J03P6j51Mj84M18J25m40J63Q0r8m8P1q4J02k15N9n5L8P0K11j59
$$ 256 197 282 -74 29 105 -46 -42 -226 192 317 -123 40 120 22 -26 45 -39 63 -152 -93 -148 -110 -40 171 12
5284A2J25j39l24O5L63m22P9L33o4K69l08k4m4J62N9J46l97K16l7l46N19k80j44
$$ 12 137 -2 -326 -261 102 -320 -241 92 28 297 -11 -35 -79 83 142 288 -109 107 70 -276 243 -37 -181
5307a81L22Q6j00j81K99j60m8pj30rL36l39K46r2r0J18p9q0J01Rr4J56J5o0L6
$$ -181 141 227 127 -54 245 85 37 30 -100 -109 227 -112 134 42 -48 70 -9 -89 12 21 -73 83 98 38 74
5332G4K1l59J43J40j37J74j91K96L4j13j50J08k2J70k89Q3q3J67k8j01J0Q7Q7
$$ 74 95 -264 -121 19 -118 56 -135 161 195 82 -68 40 18 188 -101 -18 -101 66 38 -63 -53 34 121
5355A21k32j96L99l62L96k21k2M29k36O0k67j9j31N86j01j75ln9j43J65j63r5
$$ 121 -111 -307 92 -270 126 -95 -117 312 76 136 -131 -150 -281 305 204 29 26 -33 -176 -11 -174 -269
5377b69L80l87J47K26o1l6O6k15P5K10l11J18O4P2k49J25J49k5j6L85m67j65J16
$$ -269 111 -276 -129 97 36 0 66 -149 -74 136 -175 -57 7 79 -170 -45 104 79 63 448 -19 -184 -68
5400f8J01k70N5Q3j43K60jl1m0K4K95l50J8J6l21M28J10j22j20K26l28K51L7Q9
$$ -68 33 -237 -182 -99 -242 18 17 -14 -54 -30 265 -85 -67 -51 -372 56 166 44 -76 150 -178 73 110 199
5424A99j1m09J55L44k30k93M37l49P7J5J19O0J27k65J25K0l0p9k32K23M8K16k92
$$ 199 188 -221 -66 278 48 -245 192 -157 -80 -65 54 114 241 -24 101 121 91 12 -220 3 51 267 -25
5447b5L08k36J4m8q6K05l07K4K13j35L00k50j2r3J07O9J78l05J94j20L4k45K11
$$ -25 283 47 61 13 -73 132 -175 -151 62 -73 227 -23 -35 -128 -21 48 226 -79 115 -5 29 -216 -5
5470en7r4K83K30m8l44P2r1r4P2n7K32M9j55l9K93n5kK56k91J5j59PL5J56k51
$$ -5 -62 -156 127 357 309 -35 37 -54 -148 -76 -133 99 148 -7 -46 247 192 190 446 155 170 11 18 53 209 -42
5496d2%p3J29k70J74Oj02J89j06L1L10l8j39k49K80j35L55k76j5j9j34K27o4J85
$$ -42 -42 -115 14 -256 -82 -76 -178 11 -95 -64 246 208 69 -180 100 -35 320 44 29 10 -124 103 39 224
5520B24n34L19J02k18k0N1P2J25k32N3K65l39K42l7n44J34K79M2j5O7J98l09j50
$$ 224 -310 9 111 -107 -127 -76 -4 121 -111 -58 207 -132 110 73 -471 -337 -58 -16 -31 36 234 -75 -225
5543b25k33O48k02l7J17k55K50j87Q7k60K18N2k34L10l00O2L86l36J57q8j78J93
$$ -225 -458 190 -12 -49 68 -187 63 -124 -37 -297 -79 -27 -261 49 -251 -189 197 -139 18 -70 -248 -55
5565e5J25J81j5l59J55J67l73M65j65l2j76l1J94J31l94J8K19k63L13k88K8J58
$$ -55 70 251 236 -123 32 199 -174 291 126 94 -82 -113 81 212 -182 -164 55 -208 105 -183 -155 3
5587Cj25j49L05k03J87q1J16j00J02K69l76J34oj10oj8LJ85j81n5J22qj47K2J11
$$ 3 -122 -271 34 -169 18 -63 53 -47 55 324 -52 82 76 -34 -40 -58 -55 130 -51 -106 16 8 -139 -117 -6
5612fj60K30N7L0k43J10k7N7k17K50j68J96J86l91k05N3L7L54k80J29J05j0l03
$$ -6 -166 64 121 151 -92 18 -9 48 -169 81 -87 109 295 -96 -301 -248 -211 143 -137 -8 97 87 -216
5635b16J17k7J1j37K24j01K55j82J16j61M2q8J83l5M9Q9l72K89q4r7k9J51J40
$$ -216 -99 -126 -115 -252 -28 -129 126 -56 60 -101 -59 -147 36 1 50 139 -233 56 -28 -125 -154 -3 137
5658A37n3j74l3M87l85m1j09J97J59k33O0k69K96l00R5M15l62J01j19L76m1j64
$$ 137 84 -90 -123 364 -21 -62 -171 26 185 -48 12 -257 39 -261 -166 249 -113 -12 -131 245 204 40
5680D0R4j96R4k71L84J35j68j73K08m5j76K21k60J66Kn4K6j12K81j5k37qq2m1
$$ 40 134 -62 32 -239 145 280 112 -61 147 102 -74 147 -113 53 55 1 27 -85 196 181 -56 -64 -146 -187
5704a87L28k86M5K39Lj98L04l69J07k0Q9j59L08M6k81k8j28J88j09j62M01p8M
$$ -187 141 -145 -100 139 142 -56 248 -121 -14 -34 55 -104 204 250 -31 -59 -187 1 -108 -270 131 53 57
5727E7K05k1m9k60J31m6L2n6L2m0K82k94Rn7K66j42k53K73J5l79M24k9q6l44J60
$$ 57 262 241 192 -68 63 17 49 -7 25 -15 267 -27 -18 -75 191 49 -204 69 84 -295 129 100 14 -330 -170
5752a70J73N7k64J45K2L93k56k18o5K50P5k08k8K27l96J38J93l2j67K0K90n22
$$ -170 3 60 -204 -59 -37 356 100 -118 -183 67 142 -66 -94 133 -263 -125 68 36 -131 -111 179 -343
5774c43M86k27L47l15J1l81K80R2pK66j40J15l81K97L5p3j87L04M4j37j75K64
$$ -343 143 -84 263 -52 -41 -422 -142 -50 -57 209 69 184 -197 100 135 62 -125 179 223 86 -89 175
5796A75j47k9JP0j76K83l28J57J33k03k2R8K0O4j77m6J61k72L08K48k95j07RK63
$$ 175 28 -1 0 70 -106 177 -151 6 139 -64 -86 12 32 96 -81 -127 34 -238 70 318 23 -84 -75 188
5820A88m86M95k50J92m45M35l6j29Q5r1p7Rj8kJ20L8k83L73R4k7l38L04j65K0
$$ 188 -298 197 -53 139 -306 129 93 -36 49 -42 -119 -110 -128 -130 -10 28 -255 118 212 185 -153 151 -14 6
5844FJ5j15K0m3m7L5K53K3Ok52J60p0j69k93L92q3N58o15m9P0N7j5J21L1K21o6
$$ 6 21 -94 -74 -117 -164 -129 124 147 153 -99 61 -9 -178 -471 -79 -162 396 -219 -268 -198 -141 -156 -35 -4 217 151
5870A51k03N9O3R0J7q0j40j79j2M16p7Q7k03Q4j10J37j67k06J63K05j4n5K11l03
$$ 151 -52 7 70 160 177 97 -43 -222 -234 182 105 192 -11 73 -37 100 -67 -273 -110 95 81 26 237 -66
5894f6k34N63p6j09l60K44J54j4J2j2j12k0j31L1l6J68j56M1J64J06j89m4Q5J84
$$ -66 -300 263 187 78 -282 -38 116 102 114 102 -10 -30 -161 -130 -166 2 -154 -113 51 157 -32 -76 9 193
5918A93k54L26k14r4J0j85K37j01o0L35j26k54L99J08j87j94J0k10L10J36j45
$$ 193 -61 265 51 -43 -33 -218 19 -82 -142 193 67 -187 212 320 133 -61 -51 -261 49 185 40
5939D0o2J56k72J98K3j06J40L27n17N8n4J42q1J52p9mJr4K36m24L96j36j03O3
$$ 40 -22 134 -138 60 83 -23 117 444 -73 -15 -69 73 -8 144 65 61 62 -32 204 -220 176 40 -63 0
5963@K07k64J75mj23P0K9k34m2K74o3m8K96o26J59J57K16k1k64L58k41j64L3J11
$$ 0 207 -57 118 114 -9 61 90 -144 -186 88 25 -23 273 -353 -194 -37 179 158 -106 252 11 -153 -120 -9
5987iK34k22J10k47p7K62p4o7J05J53j58l7K7k21N6L00l91L63n4J32j38L8rj46
$$ -9 225 3 113 -134 -211 51 -23 -90 15 168 10 -27 0 -221 -165 135 -256 107 53 185 47 85 76 -70
6011g0j35J87j47K52j28j88K56k43kJ02J75L9l1k9l5p9J94r0k83L16qL27o4l01
$$ -70 -205 -18 -165 87 -41 -229 27 -216 -218 -116 59 98 67 38 3 -76 118 28 -255 61 53 380 316 15
6035A5j3k5qn4j99J91n1p0J09L03l60J32O1j07J52k18l6J8J55j67M56o19M40j70
$$ 15 2 -23 -31 -85 -284 -93 -144 -214 -105 198 -162 -30 31 -76 76 -142 -178 -160 -5 -172 284 -335 105 -65
6059f5J85l5l44N80l24O4j13K02k61K08j06K38j85P6k40K26k56N8lJ20p3J80j29
$$ -65 120 85 -259 321 -3 61 -52 150 -111 97 -9 229 44 120 -120 106 -150 -92 -95 25 -48 132 3
6082Cl63M37j47Q1J05l81J01j14L80n4k96J13r9L56l31L08n9qJ24o5L6J03p6j78
$$ 3 -360 77 -70 11 116 -265 -164 -278 102 48 -248 -135 -234 122 -209 99 40 32 156 91 127 230 154 -24
6106b4N%k9L2K63m51K71j14J38m32M07o9j15j2J96J60k61J30r6j8r9o3L85k50
$$ -24 -19 -19 -48 -16 247 -204 67 -47 91 -341 66 -3 -118 -130 66 226 -35 95 -1 -19 -118 -181 204 -46
6130d6m8L99m72k36L99j68K84J2k8K4J13l88K37j12J38J23j37lk24L09j27j29
$$ -46 -94 305 -167 -403 -4 -172 112 124 96 120 233 -155 82 -30 108 231 94 91 -133 176 49 -80
6152h0J2K36n13M18j67L1j25Q1l1K01j2n9j73Q7n4J05k64L41J13l38J16K04j65
$$ -80 -68 168 -345 73 -94 -63 -188 -107 -138 63 51 -8 -181 -94 -148 -43 -307 34 147 -191 -75 129 -36
6175c6Q4J07k22J64k88J50kJ46j22j01J98P5j42J13Oj26M4l82M24m5l7q1J51j19
$$ -36 48 155 -67 97 -191 -41 -43 103 -19 -120 78 153 11 124 130 4 48 -334 90 45 8 -73 78 -41
6199d1lQJ98j87K80k38J22j39P0j47Q4j36J17J68j36O7k16m9J17K3j09K36j78
$$ -41 -44 -36 162 -25 255 17 139 0 70 -77 7 -129 -12 156 20 87 -129 -178 -61 -38 -147 89 -89
6222h9R4RJ09Nk53j8J54ml5l4J79j80j14J45j99M55k42l6J1K1l1J90K70m74N5
$$ -89 5 14 123 128 -125 -143 11 7 -28 -62 117 -63 -177 -32 -231 224 -18 -54 -43 -22 -53 137 407 -67 -12
6247a2n7K53j80K05l19O0K86k03l9J1J0j43K36r3K2j24L7j3j93K35K07j5l77K67
$$ -12 -69 184 4 209 -110 -50 236 33 -6 5 15 -128 108 15 37 -87 -50 -63 -256 -21 186 171 -206 61
6271F1q1l4PK27l13L20j1l22N01o1l20M0J08k18k79O15m42K91k04P6Lj15M5J72
$$ 61 -20 -54 -47 180 -133 187 176 -146 355 294 -26 14 122 -96 -375 240 -202 89 -115 -39 -36 -151 -106 66
6295F6j37j80R3J44O4O2m37L98j00j11K86j4P5k41J48j80K16k47LL7L05k78j3
$$ 66 -71 -251 -158 -14 50 112 -325 73 -27 -138 148 134 209 -32 116 -64 152 -95 -92 -55 250 -28 -41
6318d1J16J9j62J7L1l7K54j94n7J16j87j68K13N1O3j25J83J09k59K32q5l6k8j01
$$ -41 75 94 -68 -51 -20 -57 197 3 -54 62 -125 -293 -80 -29 34 -91 92 201 -58 174 89 53 25 -76
6342g6J12K94l29o7JR2q0J21j71J35N1J50j24j31j16M4J17J45j46J61k24J84o2
$$ -76 36 330 1 -66 -65 27 -53 68 -103 32 83 233 109 -22 -138 -94 23 168 22 183 -41 143 81
6365H1r1j44L58j26J1k50J87j55k5M3j73L68l5j75K82k5k4o9l34M76r7m0k95K58
$$ 81 -10 -154 204 78 89 -161 26 -129 -154 -111 -284 84 49 -126 156 131 107 38 -296 180 83 43 -252 6
6389FK11J35m74J19J30l56L92L1l58n8j6M07R1m22M74k14%j76J96l01L54j51m2
$$ 6 217 352 -122 -3 127 -229 163 194 -164 -222 -238 169 260 -162 312 98 98 -78 118 -183 171 20 -22
6412b2J14j6o5K8k24K38J37l05K59l33K18p0K0j0r5j57J27Q7M1n2K59j39o2N9
$$ -22 92 76 11 39 -185 53 190 -115 144 -189 29 -41 -21 -31 -126 -283 -156 -69 -28 -80 179 40 -22 37
6436C7j0ql10L46M7O8k23K57k50L74j39k99k1J41J07o2J24k26K97m60L14j7j65
$$ 37 27 19 -291 55 102 170 -53 204 -46 328 189 -110 -131 10 117 55 179 -47 250 -210 104 87 -78
6459g8P7j22J94j46J55k02q2L48j9l16L33j39l02J13J61N5p6m6j35K35j23K02
$$ -78 -1 -123 71 -75 80 -122 -204 144 125 -191 142 3 -299 -186 -25 30 -46 -92 -227 8 -115 87
6481H7l6J32l23Q3K23k17P7K7o0L89k11k45N5R2J97l13o2J9N2j00K53k02M3K86
$$ 87 51 183 -140 -57 166 -51 26 53 -7 382 171 -74 -19 73 270 -43 -105 -86 -34 -134 119 -83 -40 246
6505B46l52J05q5J49j31K33j39M4r0j16K56j19L34l17J78k41J04n5K7K48j61l53
$$ 246 -106 -1 -86 63 -68 165 26 70 -20 -136 120 1 335 18 196 -45 59 4 31 279 118 -235
6527b35J55K39j71J38k76J33N5j74M2K36M4j80m4P0r2K5o4J70j51j20L22k14J85
$$ -235 -80 159 -12 126 -150 -17 38 -136 -94 142 186 6 -38 32 -60 -35 -99 71 -80 -200 122 -92 93
6550I3k00M51m16K6p9P7J94Ln10O24j57m1j44o8J55K79k64K9n8Mj42J32k7J9o
$$ 93 -107 344 -72 -46 -125 -48 146 149 -361 263 106 65 -79 -147 8 287 23 52 -6 -2 -144 -12 -39 -20 -26
6575b6k72J82N0J80q7j14P1J24j55l53L26n3o0M71l30l6J93j47q5N5J13j57J51
$$ -26 -298 -116 -66 114 27 -87 -16 108 -47 -400 -74 -127 -187 284 -46 -82 111 -36 -121 -66 47 -110 41
6598D1J49k21L3k8J58k84L20N1l36J53J1j94J60j64N0J37l89L22K04k96N6K25
$$ 41 190 -31 2 -26 132 -152 168 219 -117 36 47 -147 13 -151 -101 36 -353 -31 173 -123 -67 158
6620A58n2j9j87NR8q3J40J5l4k46J05K32Jq3L7j34K10k7q5j07L21j48o5j03N7
$$ 158 106 87 -100 -95 3 -80 60 75 41 -205 -100 132 133 50 87 -47 163 136 51 -56 265 117 52 -51 6
6645Fj40K22j99K79n8l03K37M2K96m62J09j61M06k38l5k55M09j43l4oL0l02M82
$$ 6 -134 88 -111 168 110 -193 44 86 382 -80 29 -132 274 36 1 -254 155 12 -22 -28 2 -300 182
6668A82r1l51J95L2J40r4j26oJ67r5j30KJ41K52m75K49oJ20J17k86k07M4L49L2
$$ 182 91 -260 -65 -33 107 13 -113 -119 48 -47 -177 -175 -34 218 -257 -8 -14 106 223 -63 -270 -226 123 155
6692A55r8o8j12P8j76j1J66J67J8k99R3M04m37k9j31L45l36K53J60j30q8K49j44
$$ 155 57 -11 -123 -45 -221 -232 -66 101 119 -180 -87 317 -120 -149 -280 65 -271 -18 142 12 -76 173 29
6715B9m0j49Pj43L95j52O8J27m69L52L43m24k35J41J40k6R8p6j77L8J86k5p9Q9
$$ 29 -11 -160 -153 -296 99 -53 15 142 -327 25 368 -56 -291 -150 -10 -36 62 -14 -191 -153 33 8 -71 18
6739A8M6RQ3L7j55J06j45j38J31L38k92j01L03q8m49J40K21j79j8K48n1K02l59
$$ 18 64 73 156 193 38 144 -1 -139 -8 330 38 -63 240 152 -297 -157 64 -115 -133 115 64 266 -93
6762i3J17k33K90r9MJ2k1J81N0k38j24j9K35pL68l31k62K37j78J14j31K55k13
$$ -93 24 -209 81 -18 -14 -2 -23 158 208 -30 -154 -173 62 55 423 92 -170 67 -111 3 -128 127 -86
6785h6P5J36P5j14p8J75o8J24k1l36Q7J26M8L0k83J31m8j69J60N3q1K52J2l99
$$ -86 -11 125 200 86 8 183 115 239 218 -118 -31 95 143 173 -110 21 -27 -196 -36 17 -64 188 200 -199
6809a99J12M9R9L8k19L3R0k54K23j37K96m3O8m12J03K48k45J39n9J7J10k18K41
$$ -199 -87 -38 61 99 -120 -87 3 -251 -28 -165 131 88 156 -256 -153 95 -150 -11 -70 -53 57 -161 80
6832H0K26l09j80N98l99m2J39o6j47M2J29j07J94j29J56k57j74K86n6n8K39k10
$$ 80 306 -3 -183 415 16 -26 113 47 -100 -58 71 -36 158 29 185 -72 -246 40 -16 -74 165 -45
6854d5K22n12J66K48j41R7J60j13J08l63K36j41j29K05P8k05M7n5o3R0K8p4J32
$$ -45 177 -335 -169 79 -62 35 195 82 190 -173 63 -78 -207 -2 76 -129 -82 -137 -200 -110 -82 -156 -24
6877b4q4J48j03j8j21K63J84l07n2j22K92Q7k09N2j3L3K07J42k62j20K27j35M0
$$ -24 -108 40 -63 -81 -202 61 245 -62 -114 -236 56 143 -66 -14 -27 6 213 355 93 -27 200 65 105
6900A05k82K9J7J77J91k16J9j50P7J41k27k17L82k70l0J14K90j05r0l61L03j3
$$ 105 -177 -148 -131 46 237 21 40 -110 -33 108 -119 -336 46 -224 -254 -140 150 45 -45 -406 -103 -116
6922a16r5M56k49J9k94J68k27L74k7n8P2J24o5J1q3j9j01j9K67k31K38m64K91
$$ -116 -211 245 -4 15 -279 -111 -338 36 9 -49 23 147 82 93 10 -9 -110 -129 138 -93 145 -319 -28
6945b8P4M4m12M09J8l72K91J47j67n1J38K33l98o3K22j11K09J20k18j65J62k8
$$ -28 46 90 -322 87 105 -267 24 171 4 -47 91 324 -74 -137 85 -26 183 303 85 -80 82 54
6967E4l70L50k19R1L65k37J81j83K3L4J33k98K9L7O5Q5k43L3R2j71R4L04Rm52
$$ 54 -316 34 -185 -94 271 34 215 32 55 89 222 -76 -47 -10 55 140 -103 -70 22 -149 -55 249 258 -194
6991a94J82NJ38M0k21M9l9k07J03K19Q4L2j7R7l17K19j4k85J8R0j58J25J00O0
$$ -194 -12 -7 131 171 -50 -1 -40 -247 -144 75 159 191 174 271 -46 173 159 -126 -108 -18 -176 -51 49 109
7015A09J91k29m08O22j34Q6j73J52k82N1Q2k37J85k28N25l55O0M28m84J33k25
$$ 109 300 71 -337 285 151 237 64 216 -66 -15 67 -170 15 -213 312 -43 17 445 -39 94 -131
7036a31K15lll18M04j72K8j10O6l38N30m5j49k01K64J65j91k04K34n3J2K5Q1j74
$$ -131 84 81 78 -240 164 -8 20 -90 -24 -362 168 123 -26 -227 37 202 11 -193 41 -12 0 25 106 -68
7060f8O4N8k4L4l7J23j9L7k06J44r9n9M5N6r4K61pm0l04m4L08J9R4l07m8K20j34
$$ -68 -4 54 30 64 27 150 131 168 -38 106 7 -52 -7 49 -45 216 209 169 -135 -179 129 148 242 -65 -113 107 -27
7087b7l0J15Q8p8k07k5J50R0r9k89M30j4j33j7J01r6j01K64J4k21L20k43k21J73
$$ -27 -57 58 146 68 -139 -164 -14 76 -23 -312 118 104 -29 -46 55 -41 -142 122 136 -85 235 -8 -229 -56
7111e6j91N95l08n6J22j90L01r8j01K81l24j2rQ3j23r6J01L07k68j13J84J41j84
$$ -56 -247 348 40 -16 106 -84 217 119 18 299 -25 -37 -46 37 -86 -182 -81 226 -42 -155 29 170 -14
7134a4J29k0j68O9l49M98k09Q5J46k10J3M5j99M44J18l79J39j81J13J7P1j25m20
$$ -14 115 95 -73 -4 -353 145 -64 21 167 -43 -30 15 -184 260 378 -1 138 -43 70 87 158 33 -387
7157c87M33o1J48J33n6k6m09K79m7K25l70K31M3r4k3l06L32J63q8k18K73o7k98
$$ -387 46 -15 133 266 210 184 -225 54 7 232 -138 93 136 42 19 -287 45 208 120 -98 175 108 -190
7180a90K18K7p2L5K13k75J02K7j63l9J57k4j84k09K60L20j01J1k8k65K53j43J22
$$ -190 28 55 -17 18 231 -44 58 85 -78 -117 40 16 -168 -377 -117 203 102 113 85 -180 73 -70 52
7203E2J02j27J50l78J94r0mQ1m8j09j08L76k93K80k06J92J9p8J70k36K73r1k28
$$ 52 154 27 177 -201 -7 -97 -101 -20 -68 -177 -285 91 -202 78 -128 64 83 5 175 -61 212 121 -107
7226a07K35j4l4J74k63P6k10O1L7J96K9j55K34R5j69k72MLp8M11k31K2l29L32
$$ -107 128 114 80 254 -9 67 -143 -82 -45 151 180 25 259 354 185 -87 -83 -80 -158 253 22 44 -285 47
7250D7lq2L0l3J67l08N4O5P0j35O8J27P1Pq1l7J46k55K08J64j93n1OJ66k20p9
$$ 47 44 -38 -8 -41 126 -182 -128 -63 7 -128 -60 67 138 145 64 27 173 -82 126 290 97 46 52 218 -2 -81
7276h1j11J98R2j65J47m2j53M4L6M8j06l3K38r5j48J40q0O6L12l70m2K99k61l4
$$ -81 -192 6 98 -67 80 38 -115 -71 -35 13 -93 -126 112 17 -131 9 -71 -5 307 -63 -105 194 -67 -101
7300a01K00j23JN6k86M56J4r6Qk70M82m52K73k66K47p1k72K31K19k32k18K00K06
$$ -101 99 -24 -23 33 -253 203 217 121 129 -141 341 -111 162 -104 143 72 -200 31 250 18 -200 0 206
7323B06q0l0q9P1j94K2K27j60O8q1kK23p8n4j77J01q1m3K15K0l11K18L3P1Q8l00
$$ 206 126 96 7 78 -116 -94 133 -27 41 -40 -42 181 103 49 -128 -27 -108 -151 64 84 -227 -9 24 95 183 -117
7349a17M97l67K5M9o8Q5k67K5K02m06K88J78k65o3k8J54j02J35J11O2j23qJJ20
$$ -117 380 13 38 87 19 104 -163 -138 64 -342 -54 124 -141 -204 -232 -78 -180 -45 66 128 5 -3 -2 118
7373A18l22K56j16M6l29M41k60J55l40L91o0M34j86k91K04m6R7j57r3J33l5j80
$$ 118 -204 52 -64 -18 -347 94 -166 -11 -351 40 -20 414 228 -63 141 95 192 35 -58 75 40 -140
7395a40K8M89l39q5J34j78r8K71j34k70J61k21K14K31K0KOk48J47n8K61K2k46
$$ -140 -112 377 38 -47 87 -91 -189 82 -52 -322 -161 -382 -168 63 83 85 91 -157 -10 -68 193 215 -31
7418c1Q9J33l54K96j78N3l3m7J03j45K47p8K4K77j99M2l38K90m38M70j77k6qk41
$$ -31 58 191 -163 133 -45 8 -25 -72 31 -114 133 55 79 356 157 199 -139 151 -287 183 6 -20 -28 -269
7442b69J77J9K78k83l2R5K70l84L87j88M4j31O4k76K10p5J34q2j14K57K34l21
$$ -269 -92 -73 205 -78 -110 -15 255 -129 258 70 114 -17 47 -229 -19 -94 40 -42 -156 101 335 14
7464A4o7J17K9k78K0K56j28j4L7q9k77M20Q6k12K8K70n56Q2K46J13r8J0m7J43
$$ 14 -53 64 93 -185 -165 91 -37 -51 -14 -103 -380 40 126 -86 -58 212 -344 -262 -16 97 -1 9 -38 105
7488A05Q6j91j2J15k70J49k9p5k9K01j36L0J38j49o8K54p6J15n6r5j01J22Mj20
$$ 105 191 0 -12 103 -167 -18 -47 -122 -151 50 -86 -56 82 -67 -135 119 43 158 102 7 -94 28 32 -88
7512h8PJ35q1J15l16L56j06j20r2K35k15j6J79P5j27J75j63OJ1Q%j25L0J17n5
$$ -88 -81 54 -27 88 -228 128 22 -98 -190 45 -170 -186 -7 68 -59 116 -47 -41 -30 -22 -22 -147 -117 0 -55
7537e5j48N46m71M7J19j12J48j21J7P7o4n5J5M8k9J8P2j98j2J90j0k13K8J51K9
$$ -55 -203 343 -128 -81 38 -74 74 -47 -30 47 -17 -72 -57 -9 -38 -20 52 -146 -158 32 22 -191 -163 -12 17
7562A7R9j24K22j68J1p6K08n8k29R3r0L25j69j28l5M4Q4l8j01J84kj33J51l23
$$ 17 116 -8 214 46 57 -19 189 131 -98 -5 -95 230 61 -67 -102 -58 26 -12 -113 71 69 -64 87 -236
7586b36K79j07J57j97L06j60p2j02Q2K06m85K90J88k90J48o0q1L07M6j93q9q1
$$ -236 43 -64 93 -104 202 42 -30 -132 -50 156 -329 -39 149 -141 7 -53 -134 173 219 26 -63 -144
7608a44K47p4O2j21J76m2k47M11m44J69l7Pj61L8L72k83L03k90N7j5j91J78k00
$$ -144 103 29 91 -30 146 104 -143 268 -176 -7 -44 -37 -198 -160 212 -71 232 -58 -1 -16 -207 -29 -229
7631b29J07L0K66j40j91L51k64J28qj67K9J24R0K5j52k4J11j09Q8q0j65J41M0
$$ -229 -122 -92 174 34 -157 194 -70 58 50 -117 -88 36 126 151 -1 -25 86 -23 65 -15 -180 -39 1
7654AO8j62K12j83nj31K01j01M29m90L00j48j7K22j92j21K29k59k26L23J84o4
$$ 1 69 -93 119 -64 -69 -200 1 -100 329 -161 139 -9 -26 196 4 -117 112 -147 -373 -50 134 70
7676G0lk85J60j68J6j85K22J48J05J82k02m0j41M51m70K56K47l36J02J29l27O6
$$ 70 67 -218 -58 -226 -210 -395 -173 -25 80 262 60 20 -121 330 -140 116 363 27 129 258 -69 -3
7698cM3rk1L12l50l1P1O9Qj02j77r8j52J06K06m8N5K89j14k11L09k39O6K84l05
$$ -3 40 31 10 322 -28 -59 12 81 89 -13 -190 -288 -440 -334 -128 -176 -121 168 54 -157 152 -87 -21 263 -42
7723d2Jq7K03l3J9j73K02j92Q9J41l06K24K34k24M2k69p8L77N8k18j20J43j47
$$ -42 -41 -128 75 42 61 -112 90 -102 -13 128 -178 46 280 56 98 -171 -249 128 186 -32 -152 -9 -156
7746a56K46J00r3p3K85l42J44j02j07K20N1k87R4J57l01J4j13L44j85K53r2p9
$$ -156 90 190 97 24 309 -33 111 9 -98 122 173 -114 -20 137 -164 -150 -263 81 -104 149 57 -22
7768b2o0Q6n4J32q4K36p5o7j95J76j66L08k2j97L4J53n6l00L01k31L02l08K41
$$ -22 -82 4 -50 82 -2 234 159 92 -103 73 -93 215 193 -4 30 183 127 -173 128 -103 199 -109 132
7791A32k40J70J15n1j52q3m6n3J81q4K08j37K16p7j10j96K83p0Nj08M0J76m38
$$ 132 -108 62 177 126 -26 -109 -155 -208 -27 -111 97 -40 176 99 -11 -207 76 6 11 -97 -57 119 -319
7814c19L94j31j5K45l01K81o7j07J90j33P7r5j10m4K55k58P1m0o7J8L8J54m7p4
$$ -319 75 -56 -71 174 -127 154 87 -20 170 37 114 19 -91 -135 120 -138 -67 -107 -174 -156 -118 36 -11 -85
7838h5J46r6j01J38m5p5N2J5p3J11K28n06M75l27K46k24L10j34k29K98l6k50r7
$$ -85 61 -35 -136 2 -43 -118 -66 -51 -124 -13 215 -291 184 -143 103 -121 189 55 -174 124 88 -162 -259
7861b59L14M9k63J74J38R6j53j49J72k64J50K87n35M66k27K2j39K98k97K33j67
$$ -259 55 104 -159 15 153 249 96 -53 119 -145 5 292 -243 223 -4 18 -121 177 -120 113 -54
7882e4J62k69J53N9k15P1K06j06l26J67L53r3l24j36J59M3K22j46Q4P7j80P7n1
$$ -54 108 -161 -8 51 -164 -93 113 7 -319 -152 201 108 -216 -352 -193 -150 72 -74 10 87 -93 -16 -67
7905f7J51j38K35l7l3j63J42p6K18m7j96r4K40j4p6j68K06L1r8k99MJ71J16M6
$$ -67 84 -54 181 144 111 -52 90 14 232 185 -11 -105 135 121 45 -123 83 114 16 -283 -279 -108 8 54
7929E4m6J5j16K07k24M9j70K43K8J20n10N32j48kK2LQj11j13L31l62K1L56l75
$$ 54 8 23 -93 114 -110 -61 -231 12 40 160 -350 182 34 32 54 57 65 -46 -159 172 -190 -169 187 -188
7953a88K44k24Q1J56l34K82J45k9n6k86J52K21j39p2j7K77l12J17K13j91p1j27
$$ -188 56 -168 -87 69 -265 17 162 133 77 -209 -57 164 25 -47 -64 213 -99 18 231 40 -31 -158
7975a58K84L3r5k0j28K32j05k45K26O8l4J05k74K05k81L82J03l49N4K58j95q7
$$ -158 126 159 64 44 -84 148 43 -202 24 92 58 163 -111 94 -187 195 298 -51 3 261 66 -21
7997b1J18l13Q2k9Q1J45J2K46k70NJ23l91L81l65K43J76k62J33r6N1J12j74J86
$$ -21 97 -216 -134 -163 -82 63 75 321 51 56 179 -212 169 -196 47 223 -39 94 -2 49 161 -13 173
8020A73j00J92j62j58K9J37O1J60j61j45K00l48Q5j29L85j27Rk28N2J7K7j57K43
$$ 173 73 265 103 -55 -26 111 172 332 171 26 226 -122 -37 -166 219 92 101 -127 -75 -58 -31 -188 55
8043E5j68J49j63K1J21j8J50k03k79K34K75k02KJ72p6j29j42PL47k61R0L33k39
$$ 55 -113 36 -127 -106 15 -3 147 -56 -335 -101 174 -28 -26 146 70 -59 -201 -194 153 -108 -18 315 76
8066G6j8Rj80L26k22L6N1J13k04O8J74j77q4O5j04K4J3l8J07j02J84k03Q0j11
$$ 76 58 67 -113 213 -9 27 78 191 -13 55 229 52 -32 33 -71 -47 -34 -72 35 -67 117 -86 -6 -117
8090a17M2j5kK29j85K51n6j32J24O6k49L21l45j19J87j21k4J31r1M68j91k70O6
$$ -117 -75 -90 -92 137 -48 203 147 15 139 205 -44 277 -68 -187 0 -121 -145 -14 -105 363 172 -98 -32
8113c2k58L17L9l15o7M07j68M1J8J38m8j38R4j17J01n4j45K26Q7l07J47pj50M87
$$ -32 -290 27 66 -249 -316 91 -77 -36 -18 120 72 -66 28 -89 12 -42 -187 39 126 -181 -34 -41 -191 296
8137B96m44J93J39L0k75k1J27P5j70R1J92l33Q0L07l37M3j58J87r5K80j38k3j88
$$ 296 -148 45 184 214 -61 -82 45 120 -50 41 233 -100 -20 287 -50 -7 -165 22 -73 207 69 46 -142
8160a42L9m5Q0p9J03M4mQ9L4k37R5K5q2J25k4j6Q9j67J55o6R7l31J92j0J7O0n
$$ -142 -103 -148 -68 -147 -44 0 -4 85 119 -118 -23 2 -80 45 21 5 94 -73 82 16 113 -218 -26 -36 -19 41 36
8187C6J23P9m3l04
$$ 36 159 238 195 -109
8191a09
$$ Imaginary data points
##PAGE= N=2
##DATA TABLE= (X++(I..I)), XYDATA
0@%%%%%%%%%%%qJ6j6J6j8K6l2M0m8N6p2Q8j04J20j36J60j88K14k48K86l27L71
$$ 0 0 0 0 0 0 0 0 0 0 0 0 -8 8 -8 8 -10 16 -16 24 -24 32 -40 48 -56 64 -72 88 -100 114 -134 152 -175 196
33A96m19M73n32O01o75P56q43R39j048J161j283J420j572J739j916K109k326K566
$$ 196 -223 250 -282 319 -356 400 -443 496 -552 609 -674 746 -826 913 -1003 1106 -1220 1346
51A346k827L112l433L791m192M647n163N764o469P303q313R572j1185J3336j6372
$$ 1346 -1481 1631 -1802 1989 -2203 2444 -2719 3045 -3424 3879 -4434 5138 -6047 7289 -9083
66i083K1008k9047M6877j59698N6155J84956k25846R858J34240n27l7574N8241
$$ -9083 11925 -17122 29755 -129943 -73788 111168 -114678 -104820 29420 28893 -8681 49560
78D9560m3335J0199R0116n5296j24778J03360O5420j49401l6937J49837j7278
$$ 49560 6225 16424 106540 51244 -73534 29826 95246 -54155 -91092 58745 41467
89D1467j24250Q664P5775l178m3248j8948N0949N3174k7117m0400M8225M8419
$$ 41467 -82783 -74119 1656 -1522 -44770 -63718 -12769 40405 13288 -27112 21113 69532
101F9532k6737j9879K2291m105k2019k3025l4186J2099K8746o3236l1925R4294
$$ 69532 42795 22916 45207 41102 19083 -3942 -38128 -26029 2717 -60519 -92444 1850
113A850J8844q9131L2427J02839k8910n4140N2534K5703n1292m285J7255l4855
$$ 1850 20694 -68437 -36010 66829 37919 -16221 36313 62016 10724 6439 23694 -11161
125a1161k802K3376l8631j3727N2773j2361n2889L6853N2616l8668l4931N0792
$$ -11161 -13963 9413 -29218 -42945 9828 -2533 -55422 -18569 34047 -4621 -39552 11240
137A1240L2976m1367j3779L9226O817k1946k442L596l364p185j6884j4157Q674
$$ 11240 44216 2849 -10930 28296 35113 13167 10725 14321 10957 3772 -13112 -27269 -18595
150a8595R536k1062j4755L6811K3687l3250J495N4441N450l4209P055K3666j3701
$$ -18595 -9059 -30121 -44876 -8065 15622 -17628 -16133 38308 43758 9549 16604 40270 26569
163B6569k5713l459K150p264r464r391K37J6786j45j6482J6486K5904r638j1048
$$ 26569 856 -2603 -453 -7717 -17181 -26572 -26335 -9549 -9694 -26176 -9690 16214 6576 -4472
177d472J4266J3306n409j2688K983J4657p320k1034K4J3146q988k2029L436J4469
$$ -4472 9794 23100 17691 5003 7986 22643 15323 -5711 -5687 7459 -1529 -23558 -20122 -5653
191e653q567q370J1387O089O239R196m064N779J9635r477j9408J3018Q878k7931
$$ -5653 -14220 -22590 -11203 -5114 1125 10321 6257 12036 31671 22194 2786 15804 24682 -3249
205c249j6768J6812o05k3891L160J5431m715K991J1576k845P430J3511r491m882
$$ -3249 -20017 -3205 -3810 -27701 -24541 -9110 -13825 -10834 742 -2103 5327 18838 9347 4465
219D465J6402q52k0681J553J4733j1590j7570Q165N081j2597j623L848l187M523
$$ 4465 20867 20015 -666 887 15620 4030 -13540 -5375 -294 -12891 -14514 -10666 -13853 -9330
233i330L541l297Q378J1452k861j464J0507N815r654p277M229k723j1963o380
$$ -9330 -5789 -9086 -708 10744 7883 6419 16926 22741 13087 5810 10039 7316 -4647 -11027
247a1027j715n96q94m717M415J1209O7O6J0695N406j419r55M06O66k867n326m589
$$ -11027 -12742 -13338 -14232 -18949 -14534 -3325 -3258 -3192 7503 12909 11490 10535 10941 11607 8740 3414 -1175
264a175p33J919n155o679O597L131j0064K243R333l635l114O924M363J6K457L187
$$ -1175 -1908 11 -5144 -11823 -5226 -2095 -12159 -9916 -583 -4218 -7332 -408 3955 3971 6428 9615
280I615M2J221K554o296o720L841m058j2591M32M475n310k892P261O445J016K039
$$ 9615 9657 10878 13432 7136 416 4257 199 -12392 -11960 -7485 -12795 -15687 -8426 -1981 -965 1074
296A074P349L351j724J412j319m223q86m248n642k18P36k825j044L071M273j735
$$ 1074 8423 11774 10050 11462 10143 5920 5034 786 -4856 -5074 -4338 -7163 -8207 -5136 -863 -2598
312b598k094O392K492n931J713M760j704k396J558K981o88j862Q13j651l123J102
$$ -2598 -4692 1700 4192 -1739 -26 4734 3030 634 2192 5173 4485 2623 3436 1785 -1338 -236
328b36l234n394L305J702m323J766O110K056l26L409N938j486m264J481r63n678
$$ -236 -3470 -8864 -5559 -3857 -8180 -6414 -304 1752 1426 4835 10773 9287 5023 6504 5541 -137
344a37k319j602l651j04J216K88O91K954M063P29J74M744q94m989K531J877n619
$$ -137 -2456 -4058 -7709 -7813 -6597 -6309 -5618 -2664 1399 2128 2302 7046 6152 1163 3694 5571 -48
361d8j595K586m58l604O04K920l164k332M889j067m142L825R78k846L881M165
$$ -48 -1643 943 485 -3119 -2515 405 -2759 -5091 -202 -1269 -5411 -1586 -608 -3454 427 4592
377D592k094J7M289O71m484m27J332m986l543K160k735l934K930J011Q03L336
$$ 4592 2498 2515 6804 7475 2991 2564 3896 -1090 -4633 -2473 -5208 -9142 -6212 -5201 -4398 -1062
393a062K274R82K064J773O3j803j399R88k613k365j6j114n86m24N3K345r19j844
$$ -1062 1212 2194 4258 6031 6094 4291 2892 3880 1267 -1098 -1114 -2228 -2814 -3238 -3185 -840 -1759 -3603
411c603K767J211k708K191J470p69J669J888m68j337J371J070l066j822J925l662
$$ -3603 -836 375 -2333 -142 1328 559 2228 4116 3648 2311 3682 4752 1686 -136 1789 -1873
427a873l993L017k51l692K714L296k65R20L752R79j305J257J581m309j725K716
$$ -1873 -5866 -2849 -3100 -6792 -4078 -782 -1047 -127 3625 4604 3299 4556 6137 1828 103 2819
443B819l741l271K967p4l386K276K263j306k18K210M93k191J682J675k653Q80
$$ 2819 -922 -4193 -1226 -1300 -4686 -2410 -147 -1453 -1671 539 1032 -1159 523 2198 -455 425
459D25L004k358q89K920q87j669N34j217j574k09m87j243j17J650P56k64K369
$$ 425 3429 1071 182 3102 2215 546 1080 -137 -1711 -1920 -2407 -3650 -3767 -2117 -1361 -1625 744
476G44J445o32K148K81j966O84m80k915k63L99k039o25R75Q65j25M70J729p26
$$ 744 2189 1557 3705 3986 2020 2704 2224 -691 -954 -555 -2594 -3219 -2244 -1379 -1504 -1034 695 -31
494c1K98K141k284j261K710q48k055J711R43j802K08J804l23j716N23L67k333
$$ -31 267 2408 124 -1137 1573 725 -1330 381 1324 -478 -270 1534 1211 -505 18 385 -1948
511a948OK009k596o2L463m86j313K729Q00j866P50J471k312k320K120n74l215
$$ -1948 -1942 67 -2529 -2591 872 386 -927 1802 2602 736 1486 2957 645 -1675 445 -129 -3344
528c344K529J134l535K031L916k820n84L513j415k347K164K98l514P13K515k238
$$ -3344 -815 319 -3216 -1185 2731 -89 -673 2840 1425 -922 1242 1540 -1974 -1261 1254 -984
544i84j316L662r32k510L519L00l650J854J142k912J035J892k107l45K847m8k026
$$ -984 -2300 1362 430 -2080 1439 1739 -1911 -57 1085 -1827 -792 1100 -1007 -1352 1495 1447 -579
561e79K029M76k848J511R20l605M7K977l296m07L854j592j461M157J94k996J762
$$ -579 1450 1926 -922 589 1509 -2096 -2049 928 -2368 -2775 1079 -513 -1974 2183 2377 -619 1143
578A143K048l439n36L274k823l124M338J79m588L058K608m043R29L314k664j603
$$ 1143 3191 -248 -784 2490 -333 -3457 881 1060 -3528 -470 2138 -1905 -976 2338 -326 -1929
594a929K956j92k256J303J761k059m0K728j320j637K403n23k517J101m9j526L85
$$ -1929 1027 835 -1421 -118 1643 -416 -456 2272 952 -685 1718 1195 -1322 -221 -270 -1796 -1411
611a411M18j64M06J41O33N47J3O97L51n26k94m20j36n19n23O12K90j376R52M04
$$ -1411 -993 -1157 -751 -610 23 570 583 1280 1631 1105 811 391 255 -264 -787 -175 115 -1261 -309 95
631I5r22O00L19j008J94Q96l34k71K48P67J00l79R98q4n60L09m68q83m76l84L07
$$ 95 -827 -227 92 -916 -722 174 -160 -431 -183 584 684 305 1303 1219 659 968 500 -383 -859 -1243 -936
652i36n00j33Q88J74o01K011K87j353J160P72j593q6J105r43j187P63J124j870
$$ -936 -1436 -1569 -681 -507 -1108 903 1190 -163 997 1769 176 90 1195 252 -935 -172 952 -918
670i18o9J939j148j263J869l18j879J437Q49j296L23J282m73l46J132Q99j718
$$ -918 -987 952 -196 -1459 410 92 -1787 -350 499 -797 -474 808 335 -11 1121 2020 302
687C02j99J380j260j320J073q68j145J132K2j81K78L56J424k99j04Q03l87r44
$$ 302 103 1483 223 -1097 -24 -892 -2037 -905 -883 -1064 -786 -430 994 695 591 1394 1007 63
705F3O36J23j233M0L1J61o29P8Q81m58m95J600m30j350Q66M85j098M96R77j64
$$ 63 699 822 -411 -371 -340 -179 -808 -730 151 -307 -802 798 368 -982 -116 369 -729 -233 744 580
725E80n68Q23P94j290n88J652j519q41J034p92j162P26J086l53l40J164J053j416
$$ 580 12 835 1629 339 -249 1403 -116 -957 77 -715 -1877 -1151 -65 -418 -758 406 1459 43
743D3L58J596j602n40R29l34j567N88K90p08J17J016k25p28O27J036o91n00J318
$$ 43 401 1997 395 -145 784 450 -1117 -529 -239 -947 -830 186 -39 -767 -140 896 205 -295 1023
762A023p61o31N33L20o55qP19k69j022N01P11j094l17J238m50n47N64O89m06J7
$$ 1023 262 -369 164 484 -171 -179 540 271 -751 -250 461 -633 -950 288 -162 -709 -145 544 138 155
782A55N24O41j184L20N50j102k30M70j088n98Q29j11m56O82N85L64m1N64K15l15
$$ 155 679 1320 136 456 1006 -96 -326 144 -944 -1542 -713 -824 -1280 -598 -13 351 310 874 1089 774
802G74j27O02p54q91O44m99n23Q8N03m54k64M6P98n68P6Q23l77P7Q95l34j34M32
$$ 774 647 1249 495 -396 248 -251 -774 -686 -183 -637 -901 -855 -57 -625 -549 274 -103 -26 869 535 401 833
824H33K58J23j210N26j38j354M80K84r26n80R94o4q1O73L60J26L05Q91mp73J30
$$ 833 1091 1214 4 530 392 -962 -482 -198 -1124 -1704 -710 -774 -855 -182 178 304 609 1500 1496 723 853
845H53N83j127l99M22j028k48J73J1l39r7Q21K56j43L50N56n35j6J065k29l82
$$ 853 1436 309 -90 332 -696 -944 -771 -760 -1099 -1196 -375 -119 -262 88 644 109 93 1158 929 547
865E47M35m31j51k61j26m31r53O34L48q70K44N82l02M00Q22K64k90N60M76o18
$$ 547 982 551 400 139 13 -418 -1371 -737 -389 -1259 -1015 -433 -735 -335 487 751 461 1021 1497 879
885H79o94P36l14j135L80K43j184p3O41p4j52M90K05j57K82O58O8r12O19O44q20
$$ 879 185 921 607 -528 -148 95 -1089 -1162 -521 -595 -747 -257 -52 -209 73 731 799 -113 506 1150 330
906C30J01N33o45l90J8j39l55m18O64j39q13R16M33k87K28J037p35K75M80n81
$$ 330 431 964 319 -71 -53 -192 -547 -965 -301 -440 -1253 -337 96 -191 37 1074 339 614 1094 513
926E13k89k70K87m35n64L00j8p39J117J27m62O71K71k82K13r3J0J76k76K10l31
$$ 513 224 -46 241 -194 -758 -458 -476 -1215 -98 29 -433 238 509 227 440 347 357 533 257 467 136
947A36q14O31J25n15O1P0Q0l77J69O76m24k43J041J30p65O28N43j149K48L49k74
$$ 136 -678 -47 78 -437 -376 -306 -226 -603 -434 242 -182 -425 616 746 -19 609 1152 3 251 600 326
968C26r02J33K35p42k8R41n48m62J304L45q34J184L77o52p8J66k81p04J20J01
$$ 326 -576 -443 -208 -950 -978 -37 -585 -1047 257 602 -232 952 1329 677 599 765 484 -220 -100 1
988Am62j94J57k3j66M20j94K84K81RM72j0k82L18K45n74N08j80q77Q1K71o93l86
$$ 1 -461 -655 -498 -521 -687 -267 -461 -177 104 113 585 575 293 611 856 282 790 610 -267 -186 85 -608 -994
1011i94M30L20o39J0Q27l31k29J285K23n35N01k56p1k00j0m17r2j32l5o71j26
$$ -994 -564 -244 -883 -873 -46 -377 -606 679 902 367 868 612 541 341 331 -86 -178 -310 -345 -1016 -1142
1032a142Q79l11j06O04J58q8J82L82J08k62P2M44m88l86L69j7j252O07m3p52M86
$$ -1142 -263 -574 -680 -76 82 -6 176 558 666 404 476 920 432 46 415 398 -854 -247 -290 -1042 -556
1053e56J5j47K54L01K88k90L37Q60o63r5P10n18o13N04M3q31j81L20l16k03J38
$$ -556 -541 -688 -434 -133 155 -135 202 1062 399 304 1014 496 -117 387 430 -401 -582 -262 -578 -781 -643
1074f43O15k37K23K63J2J64K59m2j93K31n17K29l45j69M91m53m59K50L7n5J55
$$ -643 -28 -265 -42 221 233 397 656 614 421 652 135 364 19 -150 341 -112 -571 -321 -284 -339 -184
1095a84l1J79j14o3N88k22o4O86l25m27K15k7o56K87n2k68L8N43j62m56K95P48
$$ -184 -215 -36 -150 -213 375 153 89 775 450 23 238 211 -445 -158 -210 -478 -440 103 -59 -515 -220 528
1117E28n25N4N24l03l53P08l76k74J31j68p2k28J34l01j02J46Q40p70M19L21l14
$$ 528 3 57 581 278 -75 633 257 -17 114 -54 -126 -354 -220 -521 -623 -477 363 -407 12 333 19
1138A9j3N19l08K3n9J49k75l5N8j10m25L65r4k14L1L61m4J40M9j77M77j19L89
$$ 19 6 525 217 240 181 330 55 20 78 -32 -457 -92 -186 -400 -369 -8 -52 88 137 -40 437 318 707
1161G07k2l60k24J00l17l74J87J01j91k13M96K2n21L78Q26n66K40M99n53j61M20
$$ 707 685 325 101 201 -116 -490 -303 -202 -393 -606 -110 -88 -609 -231 595 29 269 768 215 54 474
1182D74j09j7K5jm14l70K38k34K8m8J36j45J66M16j61K71L82j97l11L67k95J77
$$ 474 365 348 373 372 -42 -412 -174 -408 -380 -428 -292 -437 -271 145 -16 255 637 440 129 496 201 378
1204C78l28k9L92q08K0J73k17k87L37J6K89q1J40K13kL60M67o52O6j49j26k57
$$ 378 50 21 413 -395 -375 -202 -419 -706 -369 -353 -64 -145 -5 208 206 566 1033 381 447 298 172 -85
1226h5j08J25n26K06k3rJ1L65K05n00O22j24j98J63M68k52N6j33k6R0l30j11L39
$$ -85 -193 -68 -594 -388 -411 -420 -409 -44 161 -339 283 159 -39 124 592 340 396 263 237 327 -3 -114 225
1249B25q19N3M20m97K25J87J68K1Q1L21M0l58M66j94m36K25J70n94J60l02N7J8
$$ 225 -594 -541 -121 -618 -393 -206 -38 -17 64 385 425 67 533 339 -97 128 298 -296 -136 -438 -381 -363
1271c63J09J83j26K04L32j95l74K23L75k98O4K92j97l26L57n35N71m69K40m06
$$ -363 -254 -71 -197 7 339 144 -230 -7 368 70 134 426 229 -97 260 -275 296 -173 67 -339
1291c39K44K59k95N1J62O0k20L8N8L74l26J08k5q6m40L05J52l57J05M4j68M05
$$ -339 -95 164 -131 -80 82 142 -78 -40 18 392 66 174 149 63 -377 -72 80 -277 -172 -128 -296 109
1313A09o1K92k31j58Q22n60k22J78J38j98n3K6n34K22j57K05k5J12J14l0J6J65
$$ 109 48 340 109 -49 773 213 -9 169 307 109 56 82 -452 -230 -387 -182 -207 -95 19 -11 5 170
1335A70j37R5L60qj88k00K28j96k74J18J4k09k20J50r5J22P4Q6J34OL09q2k57
$$ 170 33 128 488 480 292 92 320 124 -150 -32 -18 -227 -447 -297 -392 -270 -196 -110 24 30 339 257 0
1358@K6K56j30j11L52m11l10J79Q2m8j94J60j57J42k15M89Q2q2N6p4n4Q3J44k89
$$ 0 26 282 152 41 393 -18 -328 -149 -67 -115 -309 -149 -306 -164 -379 110 192 110 166 92 38 121 265 -24
1382b4K92r9n40L46j85Rp4K71j44K4j31J46j71L94J32k07j05K41K90l26Qk83M82
$$ -24 268 169 -371 -25 -210 -201 -275 -4 -148 -124 -255 -109 -280 114 246 39 -66 175 465 139 147 -136 346
1405C46l22l83J68k25L5L03k8M1rKJ97jqj48J37KK39k54j30J94l09J57j45m1j6
$$ 346 24 -359 -191 -416 -381 -78 -106 -65 -74 -72 125 124 116 -32 105 107 346 92 -38 156 -153 4 -141 -182 -198
1430a98O9O0n0m6J56O8o5l2L24k77n4K89p5j74J21k09J20k16P2K27l0l87L32m43
$$ -198 -129 -69 -119 -165 -9 59 -6 -38 286 9 -45 244 169 -5 116 -93 27 -189 -117 110 80 -307 25 -418
1454d18N23Q1n44L95k4j35K52k2J0m5j46N1j61K64l99N21P8l14Q8j36K61m46K74
$$ -418 105 186 -358 37 13 -122 130 108 118 73 -73 -22 -183 81 -318 203 281 -33 55 -81 180 -266 8
1477HK39o87N12Q1m84L8N70j3k97M4q5MK5q6J41O0J17q9Q7k20L2K08l52L34l88
$$ 8 247 -440 72 153 -331 -293 277 264 -33 11 -74 -70 -45 -131 10 70 187 98 185 -35 -3 205 -147 187 -201
1502b01pj03K09k22J59n0l2J42K16j68R2L05J76o12J68q4K0Pj21L5Q2j94o2J09
$$ -201 -208 -311 -102 -324 -165 -215 -247 -105 111 -57 35 340 516 -96 72 -12 8 15 -106 -71 11 -183 -245 -136
1526a36j46Q2L19m8j52k50N00K3k79K27K85l38J07J37n71K19K93m87k9R3k0m1
$$ -136 -282 -200 119 71 -81 -331 169 192 -87 140 425 87 194 331 -240 -21 272 -215 -244 -151 -171 -212
1548b12k8J79n2k7J31K36k50q3L16q8k14j26M17k30J05l11K54j19K63K0m66n4
$$ -212 -240 -61 -113 -140 -9 227 -23 -106 210 122 -92 -218 199 -31 74 -237 17 -102 161 181 -285 -339
1570c39J76M69n04K22J55N6n09L41j43K36j9K08j58k19K07r7k84QN53l76J48j56
$$ -339 -163 306 -198 24 179 235 -274 67 -76 160 141 349 191 -28 179 82 -202 -194 359 -17 131 -25
1592b5r9q5Q8r2j23L25J9J5k83K48K92k21j30Q2J17j24k31L49k25Q3K88k95j42
$$ -25 -124 -209 -121 -213 -336 -11 8 23 -260 -12 280 59 -71 11 128 4 -227 122 -103 -20 268 -27 -169
1615a69Q1J51p0r7L63m16K84J1j5l26K05J57j05P6o8q4k1j0J92k3k67J20L0N3
$$ -169 -88 63 -7 -104 259 -157 127 138 123 -203 2 159 54 130 62 -22 -43 -53 139 116 -151 -31 -1 52
1639E2J17j98oJ2J58k45O5o4R7p9R7J20k24rP0K96l19J1J25J01j78r2J11P8p8
$$ 52 169 -29 -35 -23 135 -110 -45 -109 -12 -91 6 126 -98 -107 -37 259 -60 -49 76 177 -1 -93 18 96 18
1664A8J19J07k55q3M1O5J47L0m81O34m51J05j5N3J61k08k43L15j48Kj23J79l1
$$ 18 137 244 -11 -94 -53 12 159 189 -292 342 -109 -4 -19 34 195 -13 -256 59 -89 -87 -210 -31 -62
1687f2J67m74O09l62J57N3n3k10K80k02N7j00Q7k15J57K49J6k78O8PK28k01L10
$$ -62 105 -369 240 -122 35 88 35 -175 105 -97 -40 -140 -53 -268 -111 138 154 -124 -56 -49 179 -22 288
1710B88m40J21P3q6J23L2j80P6j3p4J40j55R5j44K55l34L56k52NJ53k5k23Q8J93
$$ 288 -152 -31 42 -44 79 111 -69 7 -6 -80 60 -95 0 -144 111 -223 133 -119 -114 39 14 -209 -121 72
1734G2J22j46K50k51l26M10j12J05j04j06o3j6j02K31Q9r0p1L69k47n8m3j79J52
$$ 72 194 48 298 47 -279 131 19 124 20 -86 -149 -165 -267 -36 53 -37 -108 261 14 -44 -87 -266 -114
1757a14J58Kk52K20LP5p6P8j75l94J69N01l74J27J22p6M8j12P5r8j65K87k25n3
$$ -114 44 46 -206 14 17 92 16 94 -81 -475 -306 195 -179 -52 70 -6 42 -70 5 -93 -258 29 -196 -249
1781b49J38L17k25J71j14j37J21R5j84K51l13K11q9j44J38p8J89n6n4j40L99j28
$$ -249 -111 206 -19 152 38 -99 22 117 -67 184 -129 82 -7 -151 -13 -91 98 42 -12 -152 247 119
1803A19k52K36k18J09j0R7l81M49J49m23j29K21J09J64o5k22RK3j10M6J95j41
$$ 119 -133 103 -115 -6 -16 81 -300 149 298 -125 -254 -33 76 240 175 -47 -38 -15 -125 -79 116 -25
1825b5M5j30Q0L1K36k18l9R3o5L5j14n1r8K9L39K5j46n1J41j20K36k76J80j62
$$ -25 20 -110 -30 1 237 19 -20 73 8 43 -71 -122 -220 -191 148 173 27 -24 117 -3 233 -43 137 -25
1849b5j59J50j19L85l80L40O5l05O1m7p5J17J38j59J25k23L3J11Jk4J95k88L9
$$ -25 -184 -34 -153 232 -148 192 257 -48 13 -34 -109 8 146 -13 112 -111 -78 33 34 10 205 -83 -44
1872d4P4j6q4K06k81J89j7k4L3m05M81o8j49K22l10J00J17o2L38k65k33L05k42
$$ -44 30 14 -70 136 -145 44 27 3 36 -369 112 44 -105 117 -193 -93 24 -38 300 35 -198 107 -135
1895a35N3K7K98k92k0o6J99r5J8n5Q3l7o9k74J33L29j64Q0j48M33k16j53K1Q6
$$ -135 -82 -55 243 -49 -69 -135 64 -31 -13 -68 15 -22 -91 -365 -232 97 -67 13 -135 298 82 -71 -50 36
1919C6J86n08J56K08p3p3J53k16j80K25M3J8M9k05J36l8J48k25O3K54K0k51J53
$$ 36 222 -286 -130 78 5 -68 85 -131 -311 -86 -43 -25 24 -181 -45 -83 65 -160 -97 157 177 -74 79
1942G9j36O3j8j11K83P5o35L66j60J25K40J17k62k34J74j74M34J15m02k38L75
$$ 79 -57 6 -12 -123 160 235 -400 -34 -194 -69 171 288 26 -208 -34 -208 226 341 -61 -299 76
1963G6J00j99m3l1R4ll09L07j3k11k3L13k04M7q0K10j53J24O08p80L15M3k91J71
$$ 76 176 -23 -66 -97 -3 -6 -315 -8 -21 -232 -255 58 -146 -99 -179 31 -122 2 610 -170 145 188 -103 68
1987F8l00J35J56j73j6K13l65J67N2p2J96l75K20J06K05o5o9m6J51j95N6J63l57
$$ 68 -232 -97 59 -114 -130 83 -282 -115 -63 -135 61 -314 -94 12 217 152 83 37 188 -7 49 212 -145
2010a45j9ML39q5j67r0L24l19L1J97m2R8%j53o6K54k1Jj28P5o3J9p2J07j14j55
$$ -145 -164 -160 179 94 -73 -163 161 -158 -127 70 28 126 126 -27 -93 161 140 141 13 88 25 44 -28 79 -35 -190
2036a90J55J47J38k43r2r8K42j75M22l97K32k30M7O7J77j50Q4K07j77ql99K06
$$ -190 -35 112 250 7 -85 -183 59 -116 306 -91 141 -89 -42 25 202 52 136 343 166 158 -241 -35
2058c5j16l0N0J90p2l50J72l3M17k0k02o4K56l28J58q5K47J37l54KJ60Q5j37r2
$$ -35 -151 -181 -131 59 -13 -363 -191 -224 193 173 -29 -93 163 -165 -7 -92 155 292 -62 -60 100 185 48 -44
2082d4O7K3mj47p3K10j01J0l3kJ88k82K41J66m54M90J4m09mK09j06N9j41J14o2
$$ -44 23 46 42 -105 -178 32 -69 -59 -92 -94 94 -188 53 219 -235 255 269 -140 -144 65 -41 18 -123 -9 -71
2107g1J45k66K00R4n6j40K2J42k33J50pK2j9J80j14j19j38J38qJ47N3j07O5k60
$$ -71 74 -192 8 102 46 -94 -72 70 -163 -13 -20 2 -17 163 49 -70 -208 -70 -78 69 122 15 80 -180
2131a80L14n9k01J40k05K94k46J33q7r4K20J35l89L09p4J25k36K52K3m81J96J88
$$ -180 134 75 -126 14 -191 103 -143 -10 -97 -191 29 164 -225 84 10 135 -101 151 174 -307 -111 77
2153G7J52n3k25K19Q1k56K81j54K02j91l14K45n8n0J17j63M5m6K31j08%rj12k15
$$ 77 229 176 -49 170 251 -5 276 122 324 133 -181 64 6 -44 73 -90 -45 -91 140 32 32 23 -89 -304
2177c04L33O3M9l27R5J51j00L98k73o5N9k5m5p4J51O9j8r7l8k50J38O2P4p4lR2
$$ -304 29 92 141 -186 -91 60 -40 358 85 20 79 54 9 -65 86 155 137 40 2 -248 -110 -48 26 -48 -51 41
2203D1j37K10j25J34r0j22j6J28k40M85l30l9K22P7l29L6j04N3K04m4N2j23MJ07
$$ 41 -96 114 -11 123 33 -89 -105 23 -217 268 -62 -101 121 198 -131 -95 -199 -146 58 14 66 -57 -53 54
2227E4Jk88K41J93j67l5R5k01J60j43R4L0l0rm5J62l47K64j49J59m1J13J11j24
$$ 54 55 -233 8 201 34 -1 94 -107 53 -90 4 34 4 -5 -50 112 -235 29 -120 39 -2 111 222 98
2251I8m3j21L32k48k47K3K66r0N6J7Rp5J01L8m90N32k10p6K15j61O9%J08J05k90
$$ 98 55 -66 266 18 -229 -206 60 -30 26 43 52 -23 78 116 -374 158 -52 -128 87 -74 -5 -5 103 208 -82
2276h2Q3K0j13K00k13M3P5J35l4j20L9p9L25j04j02j89K4p7K03J46l56R8K47k0
$$ -82 1 21 -92 108 -105 -62 13 148 114 -6 33 -46 279 175 73 -116 -92 -169 34 180 -176 -78 169 149
2300A49j85K60j51l0j12k1pJ97j63j79M38k4k7j23J63k40M3K5J82m11j0L64m72
$$ 149 -36 224 73 43 -69 -90 -97 100 -63 -242 196 172 145 22 185 -55 -12 13 195 -216 -226 138 -334
2323c34L39J28l81K61N6r2p0J04q1m2J13j08J34j08o5J24J35J37k56O6J62j22
$$ -334 5 133 -248 13 69 -23 -93 11 -70 -112 1 -107 27 -81 -146 -22 113 250 -6 60 222 100
2345A00N2j35j21M0K2J66o0N4j91J85k04J34K3P2J0p8j32r7p9K21L43k72k78j7
$$ 100 152 17 -104 -64 -42 124 64 118 -73 112 -92 42 65 137 147 69 -63 -160 -239 -18 325 53 -225 -242
2369b42r8L41j71K15K5k79L69j24n9J5J14n1O1m01K80p1J5O5J12R9k17O3j01k2
$$ -242 -340 1 -170 45 70 -209 160 36 -23 -8 106 55 116 -285 -5 -76 -61 4 116 215 -2 61 -40 -62
2393f2J65J56l25l19K69J81j07R2K1p3K0j9Q5q7q0k6q5M50l65K81k34M2K39J1
$$ -62 103 259 -66 -385 -116 65 -42 50 71 -2 18 -1 84 -3 -83 -109 -194 256 -109 172 -62 -20 219 230
2417B30j72k74K21r4J8J0j89J03J30J10%j88K61j01O8r8j91N84n39J69k60J38
$$ 230 58 -216 5 -89 -71 -61 -250 -147 -17 93 93 -95 166 65 133 35 -156 428 -111 58 -202 -64
2439f4J55Nk32p8K09q2pN5P3po7J32l19J25J11K7j25K86k38J71k36J26j63n4J19
$$ -64 91 96 -136 -214 -5 -87 -94 -39 34 27 -40 92 -227 -102 9 36 -89 197 -41 130 -106 20 -143 -197 -78
2464g8o2M1J84J06j1o0jj38k63J88K16k9k79j2L27P4l81K57j34k3o3L66l8l14
$$ -78 -140 -99 85 191 180 120 119 -19 -282 -94 122 93 -186 -198 129 203 -178 79 -55 -78 -141 225 187 -127
2488a27JK66k25K56j66j3o3K00k41O4j3J13J26l32M11j14j43j85K29q8k9J58j60
$$ -127 -126 140 -85 171 5 -8 -71 129 -112 -48 -61 52 178 -154 257 143 0 -185 44 -44 -73 85 -75
2511g5P5M5n0K05l12l8J9Q7J89j11k61K05o2O1o7J82K53m76J24J58j10J5l5N2
$$ -75 0 45 -5 200 -112 -150 -131 -44 145 34 -227 -22 -84 -23 -90 92 345 -131 -7 151 41 56 21 73
2535G3j97n5J55J08j18J01Rm5r5j18J53O0K2k20J54p4J77pP7k93L7N6J52n7j10
$$ 73 -124 -179 -24 84 -34 67 76 31 -64 -182 -29 31 53 -167 -13 -87 90 83 160 -133 -96 -40 112 55 -55
2560e5JK42j99l6K8QK89l20j47K6J67M5l88L55J88k39j52K51j31l8K80m06L39
$$ -55 -54 188 -11 -47 -19 -11 278 -42 -189 -163 4 49 -339 16 204 -35 -187 64 -67 -105 175 -231 108
2583A08J33j73o8k48K26l5%N0r6JR0P1j62L54p9j38k72K38k82M16J01k92K21L8
$$ 108 241 68 0 -248 -22 -57 -57 -7 -103 -102 -12 59 -103 251 172 34 -238 0 -282 134 235 -57 164 202
2607B02m13M45j79J29l65J50K83m44J81o1M79l76o4l3J44l6J31r5j62L13j25j03
$$ 202 -211 234 55 184 -181 -31 252 -192 -11 -72 407 31 -33 -66 78 42 173 78 -84 229 104 1
2629Ar8J79L0j47L24k09k59K20K2k04K94j50j24O9J13k07N9J7k88L58j63K37q8
$$ 1 -97 82 112 -35 289 80 -179 41 63 -141 153 3 -121 -52 61 -146 -87 -70 -358 0 -163 74 -14
2652a4J22l46K09Lr0J2J56N1PJ7j31j8n9kR7J14j98QJ00l5k23K55R1j65rn2j9
$$ -14 108 -238 -29 -26 -116 -104 52 103 110 127 -4 -22 -81 -83 14 128 -70 -62 38 3 -220 35 126 -39 -48 -100 -119
2679a19k9J75j3Q2j69m5J95k31K14o3J14l3j19Qj86K1K34j42J03J13l33J66K84
$$ -119 -148 27 14 96 -73 -118 77 -154 60 -3 111 78 -41 -33 -219 -198 36 -106 -3 110 -223 -57 227
2702B27j77k02l7j08L02l0j04%J52r1M4n1K81k25O4P8j46J01j12j47N2R4L31k95
$$ 227 50 -152 -189 -297 5 -25 -129 -129 23 -68 -24 -75 206 -19 45 123 -23 78 -34 -181 -129 -35 296 1
2726Am6q4K91j43m8m6Lnp5K49k5qj06J05j95J20j1k10N6K35J17R5j98o2j1l27
$$ 1 -45 -129 162 19 -29 -75 -72 -77 -152 97 72 64 -42 63 -132 -12 -23 -233 -177 58 175 270 72 10 -1 -328
2752c28L86M2j34J12j10o9J19M9q3J07l58K33lq5J59J53k63L0M03l01K2M9J16
$$ -328 58 100 -34 78 -32 -101 18 67 -16 91 -267 -34 -37 -122 37 190 -73 -43 360 59 81 130 246
2775B46k19J37q8k38Q6J05j31J74j07K48m43J35l1J30Mk4j4L0j16J94j73K01P5
$$ 246 27 164 76 -162 -76 29 -102 72 -35 213 -230 -95 -126 4 8 -16 -30 0 -116 78 -95 106 181
2798A81m0J2j30J25O1m5j57L15m33L13j52J40p5k10r4J27l5R5j46J16j5k93M57
$$ 181 141 153 23 148 209 164 7 322 -111 202 50 190 115 -95 -189 -62 -97 -2 -148 -32 -47 -340 117
2821A17M3o2l53K55J49j95K2j07J11j81j45L8N25l26J67j92J77Pj19K80n13K76
$$ 117 160 98 -255 0 149 -46 -24 -131 -20 -201 -346 -308 217 -109 58 -134 43 50 -69 211 -302 -26
2843b6k2r5J95q5K3j43K79k12j69M00j22K1n6k6J0mK2K10q5k55J59j36R2q3r1
$$ -26 -48 -143 52 -33 -10 -153 126 -86 -255 145 23 44 -12 -38 -28 -32 -10 200 115 -140 19 -117 -25 -108 -199
2868a99Q1K83k58J23j3n4L6j15J15q3pM6K45k41j36K81kp1j91J00K14j26j3J04
$$ -199 -118 165 -93 30 17 -37 -1 -116 -1 -84 -91 -45 200 -41 -177 104 102 31 -160 -60 154 28 15 119
2892A19J0k30Q7J64k13J94o3J5k58j5J90L78j96m76M00p7K4O1J78m74K95R1k59
$$ 119 129 -101 -14 150 -63 131 68 83 -175 -190 0 378 182 -294 106 29 53 114 292 -182 113 204 -55
2915e5j44L7M19l04J61k91O7J57J19j77l1P9K16k79%J8m7j07M17j56p1n5J51j48
$$ -55 -199 -162 257 -47 114 -177 -110 47 166 -11 -42 37 253 -26 -26 -8 -55 -162 255 99 28 -27 124 -24
2939b4J03M0j29p4j8N1K0M0J18Jj21k58L4M1N6L31l11k74N60k28L1J77m63J71
$$ -24 79 119 -10 -84 -102 -51 -31 9 127 128 7 -251 -217 -176 -120 211 -100 -374 186 -42 -11 166 -297 -126
2963a26n3L83k46J61j56l3L3l3J4M29j67l31pk02L13m2O0Qj22r1K4J3L08l82J02
$$ -126 -179 204 -42 119 -37 -70 -37 -70 -56 373 206 -125 -132 -334 -21 -63 -3 5 -117 -208 -184 -171 137 -245 -143
2988a43J18k17L71l68M61j94j66L4J68K5J01j15l37K22K46J69n40L30m70J65L6
$$ -143 -25 -242 129 -239 222 28 -138 -104 64 89 190 75 -262 -40 206 375 -165 165 -305 -140 -104
3009a04K37j36OJ04l16J44J50l4m5j7M2J34k06P1k36L07j72k4J4K64k71J57n4
$$ -104 133 -3 3 107 -209 -65 85 51 6 -11 31 165 -41 30 -206 101 -71 -95 -81 183 -88 69 15
3032A5k18R9J13J81j82K5m5r5np9K84k87jJ57K55l35j0M9o3J58N7j18m2q6L14
$$ 15 -203 -104 9 190 8 33 -12 -107 -112 -191 93 -194 -195 -38 217 -118 -128 -79 -142 16 73 -45 -87 -173 141
3057A41k60K12k08K23p1j4K01l41Q2j5l9J92L1q5Q8l36P8L6m9J83Q6j57Q4l59
$$ 141 -119 93 -115 108 37 23 224 -117 -35 -50 -89 103 134 49 137 -199 -121 -85 -134 49 135 -22 62 -297
3081b97K18M9J09J64r3l29L43k48o2K50j0Q2j22j89R0j42K42j59Q9J53l00K08
$$ -297 -79 -30 79 243 150 -179 164 -84 -146 104 94 176 54 -135 -45 -187 55 -104 -15 138 -162 46
3103D6q3k04L32j84K43k20J8J88n9j98Q4K8j40Q1O3J47k06r2L03q1J16k21J06
$$ 46 -37 -241 91 -93 150 -70 -52 136 77 -121 -37 -9 -149 -68 -5 142 -64 -156 147 66 182 -39 67
3126F7P2j18L1N1j24o1J09J50l01K98j59k28L15j68K67j54j1R6K2k61J78k36L28
$$ 67 139 21 52 103 -21 -82 27 177 -124 174 15 -213 102 -66 201 47 36 132 154 -107 71 -165 163
3149A63j72J04k64Q4O4L9K7k34kK84j07n7Q4j90J16J8J34l66L02K7l1J02r1r8
$$ 163 -9 95 -169 -85 -21 18 45 -189 -191 93 -14 -71 13 -177 -61 -43 91 -275 27 54 23 125 34 -64
3173f4p0M07l43L36p0j51RK9l34L56j39j13L61k92K87k23p9J42J20lk86J11k0
$$ -64 -134 273 -70 266 196 45 54 83 -251 105 -34 -147 214 -78 209 -14 -93 49 169 166 -120 -9 -29
3196b9P0k51J45j54K54l0l0j91K06K67k85J09n5q8J42K76l69J37j68J78p8K19
$$ -29 41 -210 -65 -219 35 5 -25 -216 -10 257 -28 81 26 -62 80 356 -13 124 -44 134 56 275
3218B75j69j25p7J65n5j51J89L2qJ51j76j64K03r9R8l24M15l14m8K07m8j25J84
$$ 275 106 -19 -96 69 14 -137 52 84 76 227 51 -113 90 -9 89 -235 180 -134 -182 25 -23 -148 36
3241C6k97L25k76R5M22l48J28k64L6O6K73p6L2m18K14J5J12K4j12K77j97K14m2
$$ 36 -261 64 -212 -117 305 -43 85 -179 -143 -77 196 120 152 -266 -52 -37 75 99 -13 264 67 281 239
3264B39j67p3p8J76j70K69n85M06j14j4L48l47R2J8J28j81R6j27J9P6j04J70n0
$$ 239 72 -1 -79 97 -73 196 -389 17 -97 -111 237 -110 -18 0 128 -53 43 -84 -65 11 -93 77 27
3287B7m8O4Lnj16q2K70l8p6N5k27K31o3Rm4j79N12l43l10K82Q2O7J10j86o3K18
$$ 27 -21 43 46 41 -75 -157 113 75 -1 54 -173 58 -5 4 -40 -219 293 -50 -360 -78 4 71 181 -5 -68 150
3313A50j87J33J9n5J9k06O0N18l66K0q0J59k69J12k05L04p4R5j27PJ9j02P6l7
$$ 150 -37 96 115 60 79 -127 -67 451 85 105 25 184 -85 27 -178 126 52 147 20 27 46 -56 20 -17
3337a7k8K28k22l6K64l26K98p3k50J33M8N7RJ12k42Pm5J19N2l2k0k43J94J38j70
$$ -17 -45 183 -39 -75 189 -137 161 88 -162 -29 19 76 85 197 -45 -38 -83 36 88 56 36 -207 -13 125 -45
3362d5L2J4K9J24J01l73K9OK08K6pj01j55j5q1M2K25j28l3J77j37o8J95k50L3
$$ -45 -13 1 30 154 255 -118 -89 -83 125 151 144 43 -112 -127 -208 -166 59 -69 -102 75 -62 -130 65 -185 -152
3387a52k3J01J54k3n22N38n0p9K53m54L08j14L2l3j95J01J25j07M0L5j96L17J8
$$ -152 -175 -74 80 57 -465 73 23 -56 197 -257 51 -63 -31 -64 -259 -158 -33 -140 -100 -65 -261 56 74
3410G4R2k0j20k16L17N8m57K35q3n0K88J47k81k2O9j12k06L2K56J10J48l76L5
$$ 74 166 146 26 -190 127 185 -272 -37 -120 -170 118 265 -16 -38 31 -81 -287 -255 1 111 259 -117 -82
3433h2N8K2J78n07L22J57j28l75L69n8O8J24q2r8%j53K64j3o5r4j40m0M39l54
$$ -82 -24 -2 176 -331 -9 148 20 -355 14 -44 24 148 66 -32 -32 -185 79 66 1 -93 -233 -273 166 -188
3457a88M81k31Oj95K6j60K05J14n7J94j49j10N5j16j58M02k02K08k20R9P3k82
$$ -188 293 62 68 -127 -101 -261 -56 58 1 195 46 -64 -9 -125 -283 119 -83 125 -95 4 77 -205
3479b05K95j81K8J43l02J69j62J85J83M6j83N1n3r2L37k37j72J05J8j10K13j3
$$ -205 90 -91 -63 80 -222 -53 -215 -30 153 199 16 67 14 -78 259 22 -150 -45 -27 -137 76 63
3501F3n3pQ8N4k24n3K7L99m60K08l20K71J78n34L32j04j46L3J08l5K60L2k78K43
$$ 63 10 3 91 145 -79 -132 -105 294 -166 42 -278 -7 171 -363 -31 -135 -281 -248 -140 -175 85 117 -161 82
3525H2k72J01N9L3m1o4K74m6O0l42k9R1J63j27L0k09J7M67j42O3l43M22l07O9
$$ 82 -190 -89 -30 3 -38 -102 172 126 186 -156 -185 -94 69 -58 -28 -237 -220 247 105 168 -175 247 -60 9
3549IN8J78l45J8M8J35j39K89k42j28P6o2qK8N8Kj30L64q8j42N9N7j01J30R0j78
$$ 9 67 245 -100 -82 -34 101 -38 251 9 -119 -43 -105 -113 -85 -27 -25 -155 209 121 -21 38 95 -6 124 214 36
3575C6p9K32j18L5L2j43l6k20K84J18P3k59m3M3j18K46oL2N5j14J83j97j01K91
$$ 36 -43 189 71 106 138 -5 -41 -261 23 141 214 -45 -88 -45 -163 83 77 109 164 50 233 36 -65 226
3599B26k31M9Q1j08J7J16l41N6K90j07J1O6Mn7m4M7r3J%l7j4J21R2j78J85l4j11
$$ 226 -5 44 125 17 34 150 -191 -135 155 48 59 125 129 72 28 75 -18 -17 -17 -54 -68 53 145 -33 152 118 7
3626GJ14k3L7m62L16K44m28K75k35J16K41l78J99J29k93L73r5k42L94n90L09L7
$$ 7 121 98 135 -327 -11 233 -195 80 -155 -39 202 -176 23 152 -141 232 137 -105 289 -301 8 45
3648D5P3k18J71Q6q9J27l24J22l3j35R7j29K02j04P4J51j0l2m31N12l5k44J58
$$ 45 118 -100 71 157 68 195 -129 -7 -40 -175 -78 -207 -5 -109 -35 116 106 74 -357 155 120 -124 34
3671C4P3P6q9l14RJ11K49k43m6K79k90J35K46J8j61J89m33K93k03j56R4P9lJ03
$$ 34 107 183 94 -220 -211 -100 149 -94 -140 139 -151 -16 230 248 87 276 -157 136 -67 -223 -129 -50 -53 50
3695E0O2k33J87j6K49K6j70k26K71j66P6J29k83O6K02k86l9L75j29m6j68P0L05
$$ 50 112 -121 66 50 299 325 155 -71 200 34 110 239 -44 22 224 -62 -101 274 145 99 -69 1 306
3718C06j52k24M3j99N1J30pp6p0L07R5m72J13L21k53M9j32J37J26j76KJ50M1p4
$$ 306 154 -70 -27 -226 -175 -45 -52 -128 -198 109 204 -268 -155 166 -87 -38 -170 -33 93 -83 -81 69 110 36
3742C6J89m1q1k57J83J83k26J74Q3k69Q7k09l2LK95k28M29l05l8J13j27J40M7
$$ 36 225 184 103 -154 29 212 -14 160 243 -26 61 -148 -180 -177 118 -110 319 14 -24 89 -38 102 149
3765A49n9j25k19l2J53L46j33L8j80l3K6l7J16k7j84J08O6J9j64J31K71j10J8
$$ 149 90 -35 -254 -286 -133 213 80 118 -62 -95 -69 -106 10 -17 -201 -93 -27 -8 -172 -41 230 120 138
3788A38k25N6J44M2j79K59p3j20K9j78J53J3J18l38K29l04L25j00k8p8N6rj29
$$ 138 -87 -31 113 155 -24 235 162 42 71 -107 46 59 177 -161 68 -236 89 -11 -39 -117 -61 -70 -199
3811a99M5K69o3P4l0m07N71l09j8J42k9L2J04k06k40K97rm16N65k96J61k42L06
$$ -199 -154 115 52 126 96 -311 260 -49 -67 75 46 78 182 -24 -264 33 24 -392 173 -123 38 -204 102
3834A02M6j37k43j12N03J57m88P8j37L02N7p8l3N9j30l06M84O4m4K8k18j23K62
$$ 102 148 11 -232 -344 159 316 -172 -94 -231 71 128 50 17 76 -54 -360 124 188 144 172 -46 -169 93
3857I3J95l04l7K25j11j65J78j1k04L92m13L13j39k87K46J71k67J85J99n3p8k82
$$ 93 288 -16 -53 172 61 -104 74 63 -141 251 -162 151 12 -275 -29 142 -125 60 259 206 128 -154
3879a54M05m21Q0n4K96l51J25M6k1K96k95j4J80K5k58n5J41K43k73K30j20o9N8
$$ -154 251 -170 -90 -144 152 -199 -74 -28 -49 247 -48 -62 118 143 -115 -170 -29 214 -59 171 51 -18 40
3902D0j04L50j97n4j31J94j91J68Rj06j88J14J3K22q9j20j01n0J14m6J42l23K63
$$ 40 -64 286 89 35 -96 98 -93 75 84 -22 -210 -96 -83 139 50 -70 -171 -221 -107 -153 -11 -334 -71
3925g1K8P6K3p4p0K44j21k74J36J03j48J56j45J26j56J80j48k5J94j17J08m0m0
$$ -71 -43 33 56 -18 -88 156 35 -239 -103 0 -148 8 -137 -11 -167 13 -135 -160 34 -83 25 -15 -55
3948e5k3q8J49j74J69j73K72j39J14j0q0r5L47l53J8P4J2J72l7j67J34j28K35
$$ -55 -78 -166 -17 -191 -22 -195 77 -62 52 42 -38 -133 214 -139 -121 -47 -35 137 100 -67 67 -61 174
3971A74j35M8j55R8J11l85K08k0RJ82k73J64Mj36L13l38K9J50j96R6q2o1Qj53
$$ 174 39 87 -68 30 141 -244 -36 -56 -47 135 -138 26 30 -106 207 -131 -102 48 -148 -52 -134 -195 -187 -340
3995c40K24J89l02OL81k87J74j76O0l3J04k%r3J53J88l64R3K52k95J77nj23J68
$$ -340 -116 73 -229 -223 158 -129 45 -131 -71 -104 0 -2 -2 -95 58 246 -118 -25 227 -68 109 104 -19 149
4019A49j54J98k43L2j9o3J04j30J30K11j46o0Oj47r8K11q9L05j9q4j00J17j84
$$ 149 -5 193 -50 -18 -37 -100 4 -126 4 215 69 9 15 -132 -230 -19 -108 197 178 94 -6 111 -73
4042g3M5M2m8j4RM9j80L33l14M7J91j42j37R0K41p6L1J15l63L53m01L82m70M09
$$ -73 -28 14 -34 -48 -39 10 -170 163 -151 -104 87 -55 -192 -102 139 63 94 209 -154 199 -202 180 -290 119
4066A19l18J56N2J7l15M81k5l80K25n3j26K71L5m7K8r5r6k64K85K33k67LO8m2
$$ 119 -199 -43 9 26 -289 192 167 -213 12 -41 -167 104 139 92 120 25 -71 -335 -50 183 -84 -81 -13 -55
4090e5J31Q2m9j23J57j22O0l19M19l9j80o2k2L8J91j78j64M21k30L02l11P6lJ12
$$ -55 76 158 109 -14 143 21 81 -238 181 142 -38 -100 -122 -84 107 -71 -235 186 -44 258 -53 23 20 132
$$ [...]
8191A01
##END NTUPLES=NMR FID
##END=
