##TITLE=1H_DE-100_oil
 200.13MHz,CDCl3,
 8 sc
 
 3.7.2025
##JCAMPDX= 6.0         $$ Bruker NMR JCAMP-DX V2.0
##DATA TYPE= NMR FID
##DATA CLASS= NTUPLES
##ORIGIN= UXNMR, Bruker Analytische Messtechnik GmbH
##OWNER= pz
$$ XWIN-NMR		Version 3.5
$$ Thu Jul  3 14:06:44 2025 Russian Standard Time (UT+4h)  she@DPX200
##.OBSERVE FREQUENCY= 200.1313
##.OBSERVE NUCLEUS= ^1H
##.DELAY= (6, 6)
##.ACQUISITION MODE= SIMULTANEOUS
##.ACQUISITION SCHEME= undefined
##.AVERAGES= 8
##.DIGITISER RES= 18
##SPECTROMETER/DATA SYSTEM= spect
##.PULSE SEQUENCE= zg30
##.SOLVENT NAME= CDCl3
##.SHIFT REFERENCE= (INTERNAL, CDCl3, 0, 14.3821)
##AUDIT TRAIL= $$ (NUMBER, WHEN, WHO, WHERE, WHAT)
$$ ##TITLE= Audit trail, XWIN-NMR		Version 3.5
$$ ##JCAMPDX= 5.01
$$ ##ORIGIN= Bruker BioSpin GmbH
$$ ##OWNER= she
$$ F:/spectra/data/she/nmr/H-C/1/audita.txt
$$ ##AUDIT TRAIL=  $$ (NUMBER, WHEN, WHO, WHERE, WHAT)
(   1,<2025-07-03 14:04:45.35 +0400>,<she>,<DPX200>,
      <created by zg, POWCHK disabled, PULCHK disabled
       configuration hash MD5:
       00 E9 B6 7A A2 85 ED C7 34 08 36 98 17 FE 4E 26
       data hash MD5: 16K
       52 43 1D 03 08 59 98 EA 10 21 5C BC 6C 86 77 96>)
$$ ##END=
$$ 
$$ hash MD5
$$ 6C DB 67 BD 2A 65 20 C8 6A 86 C2 ED F8 7E 0D 6F
##$RELAX= 
##$RELAX= 
##$RELAX= 
##$RELAX= 
##$RELAX= 
##$RELAX= 
$$ Bruker specific parameters
$$ --------------------------
##$DU= <F:/spectra>
##$EXPNO= 1
##$NAME= <H-C>
##$PROCNO= 1
##$TYPE= <nmr>
##$USER= <she>
##$AMP= (0..31)
100 100 100 100 100 100 100 100 100 100 100 100 100 100 100 100 100 100 
100 100 100 100 100 100 100 100 100 100 100 100 100 100 
##$AQSEQ= 0
##$AQ_mod= 1
##$AUNM= <au_zg>
##$AUTOPOS= <>
##$BF1= 200.13
##$BF2= 200.13
##$BF3= 200.13
##$BF4= 200.13
##$BF5= 200.13
##$BF6= 200.13
##$BF7= 200.13
##$BF8= 200.13
##$BYTORDA= 1
##$CFDGTYP= 0
##$CFRGTYP= 5
##$CHEMSTR= <none>
##$CNST= (0..31)
1 1 145 1 1 1 1 1 1 1 1 1 1 1 1 1 1 1 1 1 1 1 1 1 1 1 1 1 1 1 1 1 
##$CPDPRG= <>
##$CPDPRG1= <>
##$CPDPRG2= <>
##$CPDPRG3= <>
##$CPDPRG4= <mlev>
##$CPDPRG5= <mlev>
##$CPDPRG6= <mlev>
##$CPDPRG7= <mlev>
##$CPDPRG8= <mlev>
##$CPDPRGB= <>
##$CPDPRGT= <>
##$D= (0..31)
0 0.7 0 0 0 0 0 0 0 0 0 0.03 0 0 0 0 0 0 0 0 0 0 0 0 0 0 0 0 0 0 0 0 
##$DATE= 1751537084
##$DBL= (0..7)
120 120 120 120 120 120 120 120 
##$DBP= (0..7)
150 150 150 150 150 150 150 150 
##$DBP07= 0
##$DBPNAM0= <>
##$DBPNAM1= <>
##$DBPNAM2= <>
##$DBPNAM3= <>
##$DBPNAM4= <>
##$DBPNAM5= <>
##$DBPNAM6= <>
##$DBPNAM7= <>
##$DBPOAL= (0..7)
0.5 0.5 0.5 0.5 0.5 0.5 0.5 0.5 
##$DBPOFFS= (0..7)
0 0 0 0 0 0 0 0 
##$DE= 6
##$DECBNUC= <off>
##$DECIM= 32
##$DECNUC= <off>
##$DECSTAT= 4
##$DIGMOD= 1
##$DIGTYP= 9
##$DL= (0..7)
0 120 120 120 120 120 120 120 
##$DP= (0..7)
150 150 150 150 150 150 150 150 
##$DP07= 0
##$DPNAME0= <>
##$DPNAME1= <>
##$DPNAME2= <>
##$DPNAME3= <>
##$DPNAME4= <>
##$DPNAME5= <>
##$DPNAME6= <>
##$DPNAME7= <>
##$DPOAL= (0..7)
0.5 0.5 0.5 0.5 0.5 0.5 0.5 0.5 
##$DPOFFS= (0..7)
0 0 0 0 0 0 0 0 
##$DQDMODE= 0
##$DR= 18
##$DS= 0
##$DSLIST= <SSSSSSSSSSSSSSS>
$$ [...]
##$SUBNAM0= <"">
##$SUBNAM1= <"">
##$SUBNAM2= <"">
##$SUBNAM3= <"">
##$SUBNAM4= <"">
##$SUBNAM5= <"">
##$SUBNAM6= <"">
##$SUBNAM7= <"">
##$SUBNAM8= <"">
##$SUBNAM9= <"">
##$SW= 18.0517328524113
##$SWIBOX= (0..15)
0 0 2 0 0 0 0 0 0 0 0 0 0 0 0 0 
##$SW_h= 3612.71676300578
##$TD= 16384
##$TD0= 1
##$TE= 0
##$TE2= 300
##$TE3= 300
##$TEG= 300
##$TL= (0..7)
0 120 120 120 120 120 120 120 
##$TP= (0..7)
150 150 150 150 150 150 150 150 
##$TP07= 0
##$TPNAME0= <>
##$TPNAME1= <>
##$TPNAME2= <>
##$TPNAME3= <>
##$TPNAME4= <>
##$TPNAME5= <>
##$TPNAME6= <>
##$TPNAME7= <>
##$TPOAL= (0..7)
0.5 0.5 0.5 0.5 0.5 0.5 0.5 0.5 
##$TPOFFS= (0..7)
0 0 0 0 0 0 0 0 
##$TUNHIN= 0
##$TUNHOUT= 0
##$TUNXOUT= 0
##$USERA1= <user>
##$USERA2= <user>
##$USERA3= <user>
##$USERA4= <user>
##$USERA5= <user>
##$V9= 5
##$VALIST= <valist>
##$VCLIST= <CCCCCCCCCCCCCCC>
##$VD= 0
##$VDLIST= <DDDDDDDDDDDDDDD>
##$VPLIST= <PPPPPPPPPPPPPPP>
##$VTLIST= <TTTTTTTTTTTTTTT>
##$WBST= 1024
##$WBSW= 4
##$XGAIN= (0..3)
0 0 0 0 
##$XL= 0
##$YL= 0
##$YMAX_a= 73060
##$YMIN_a= -107705
##$ZGOPTNS= <>
##$ZL1= 120
##$ZL2= 120
##$ZL3= 120
##$ZL4= 120
##$ABSF1= 10
##$ABSF2= 0
##$ABSG= 5
##$ABSL= 3
##$ALPHA= 0
##$AQORDER= 0
##$ASSFAC= 0
##$ASSFACI= 0
##$ASSFACX= 0
##$ASSWID= 0
##$AUNMP= <proc_1d>
##$AZFE= 0.1
##$AZFW= 0.1
##$BCFW= 1
##$BC_mod= 2
##$BYTORDP= 1
##$COROFFS= 0
##$CY= -3
##$DATMOD= 1
##$DC= 2
##$DFILT= <>
##$DTYPP= 0
##$F1P= 0
##$F2P= 0
##$FCOR= 0.5
##$FTSIZE= 0
##$FT_mod= 4
##$GAMMA= 1
##$GB= 0.15
##$INTBC= 1
##$INTSCL= 1
##$ISEN= 128
##$LB= 0.25
##$LEV0= 0
##$LPBIN= 0
##$MAXI= 10000
##$MC2= 0
##$MEAN= 0
##$ME_mod= 0
##$MI= 1.114404
##$NCOEF= 0
##$NC_proc= 0
##$NLEV= 6
##$NOISF1= 3.799351
##$NOISF2= 2.8
##$NSP= 1
##$NTH_PI= 0
##$NZP= 0
##$OFFSET= 14.38212
##$PC= 1
##$PHC0= -1185.696
##$PHC1= 2.192226
##$PH_mod= 1
##$PKNL= yes
##$PPARMOD= 0
##$PSCAL= 0
##$PSIGN= 0
##$REVERSE= no
##$SF= 200.129724274929
##$SI= 16384
##$SIGF1= 3
##$SIGF2= 2
##$SINO= 400
##$SIOLD= 16384
##$SREGLST= <1H.CDCl3>
##$SSB= 0
##$STSI= 0
##$STSR= 0
##$SW_p= 3205.1282051282
##$SYMM= 0
##$S_DEV= 0
##$TDeff= 0
##$TDoff= 0
##$TI= <>
##$TILT= no
##$TM1= 0
##$TM2= 0
##$TOPLEV= 0
##$USERP1= <user>
##$USERP2= <user>
##$USERP3= <user>
##$USERP4= <user>
##$USERP5= <user>
##$WDW= 1
##$XDIM= 8192
##$YMAX_p= 0
##$YMIN_p= 0
$$ End of Bruker specific parameters
$$ ---------------------------------
##NTUPLES= NMR FID
##VAR_NAME=  TIME,          FID/REAL,        FID/IMAG
##SYMBOL=    X,             R,               I
##VAR_TYPE=  INDEPENDENT,   DEPENDENT,       DEPENDENT
##VAR_FORM=  AFFN,          ASDF,            ASDF
##VAR_DIM=   8192,          8192,            8192
##UNITS=     SECONDS,       ARBITRARY UNITS, ARBITRARY UNITS
##FACTOR=    0.0002768,     1,               1
##FIRST=     0,             0,               0
##LAST=      2.2672688,     0,               0
##MIN=       0,             -107705,         0
##MAX=       2.2672688,     73060,           0
$$ Real data points
##PAGE= N=1
##DATA TABLE= (X++(R..R)), XYDATA
0 0 0 0 0 0 0 0 0 0 0 0 0 0 0 0 0 0 0 -8 8 -8 8 -8 9 -16 16 -16 24 -24 30 -32 40 -42 48 -56 64 -70 78 -88 99
39 99 -109 123 -135 150 -166 184 -202 225 -247 273 -299 331 -364 401 -443 490 -543 603 -672 755
59 755 -851 966 -1110 1295 -1537 1874 -2376 3207 -4818 9117 -47875 -107705 4341 73060
73 73060 38333 -14549 -2159 -504 -24884 -28065 581 2876 -10663 -6090 10527 6153 2659
86 2659 12295 14161 -2559 -8816 -2718 -6 -3627 -986 631 -1094 -306 3947 3806 44 -2250 -2883
102 -2883 -3482 -1971 173 -532 -1727 -488 1635 2425 3279 3239 338 -958 640 1036 -1840 -2971 -2056
119 -2056 -2240 -2173 673 2474 1292 221 1441 1823 2 -350 -30 -1618 -2696 -689 1411 968 112
136 112 692 749 607 212 845 -665 -2270 -2367 -1265 -190 162 685 778 821 1369 1624 533 -170 -890 -950
156 -950 -332 -306 -48 -105 133 112 283 363 413 -130 -448 -533 -419 -510 -273 -75 -199 91 446 953 599 369 317
179 317 -268 -230 -606 -532 -348 -187 180 236 594 196 152 416 31 129 -206 -158 -78 48 -59 -237 449 521 391
202 391 129 359 -225 -486 -445 -180 -172 -8 119 209 -54 383 285 344 74 -77 -269 -183 -127 -62 -91 -303 -93 82
226 82 416 349 251 -166 -288 -282 107 -47 -207 -430 86 317 402 312 77 -163 -388 -43 5 -12 -181 -181 -328 27
250 27 381 40 171 126 146 51 4 189 59 -459 -221 19 215 392 226 174 160 -100 178 173 83 -93 -239 -135
274 -135 309 309 166 21 -202 -7 208 271 0 51 -147 -44 -78 27 66 26 -213 -3 18 -18 -65 -2 -192 41
298 41 98 19 -147 129 -50 -74 148 -214 137 288 -66 -50 -57 -43 10 -105 141 -215 -167 -137 -43 292 -428 -42
322 -42 151 248 166 79 70 32 -61 65 199 -32 159 163 177 -31 67 -159 118 -84 261 152 -139 89 336 82
346 82 -82 139 -127 -147 134 -76 -129 -56 -53 -263 -33 230 127 2 134 -284 75 56 315 -126 -85 289 -154
369 -154 102 -99 -25 -172 113 17 -97 23 11 -146 52 -79 -22 287 23 145 -53 256 -76 95 222 9
391 9 -268 -69 83 73 106 -358 31 -230 -53 80 50 84 64 266 -84 -84 -80 -82 147 -368 -20 42 76 -74 91
416 91 467 -274 -21 134 51 181 268 -45 32 -92 144 -122 93 209 -140 6 146 -1 -146 -188 297 32
438 32 24 -335 18 -194 175 -76 11 -54 -69 -80 -64 150 -73 105 140 295 -101 -28 85 -80 193 139 -6 -45
462 -45 68 112 -243 -54 -21 -100 214 130 110 61 46 -13 -70 171 -276 -191 88 -103 45 19 -143 189 113 -100 -28
487 -28 -19 -28 -7 -174 286 -76 -231 -39 -167 -107 108 -96 137 -20 -35 -183 41 3 -63 -108 -265 -42 155 -83
511 -83 -106 410 91 -139 -47 38 -98 -2 -186 -200 -86 106 172 63 -103 150 144 -135 95 9 141 14 80 -28
535 -28 151 137 -92 -126 -295 214 -5 36 -114 -119 157 -177 -79 -214 69 -30 25 -109 159 -57 314 103 -250
558 -250 -121 111 49 108 -181 55 17 41 36 -164 -133 -141 -170 56 291 -240 77 -8 146 -172 245 -47 -103 90
582 90 -85 229 146 28 188 -231 278 -110 34 185 -201 -85 26 106 -95 -119 -56 -46 -80 21 20 216 -123
605 -123 -128 -8 -98 -15 84 -118 -188 -228 -134 74 52 -36 95 -30 117 -293 240 150 64 51 -174 46 -53 -100 -62 -98
631 -98 -4 -28 294 111 216 -198 51 -32 61 107 -200 169 53 178 173 -11 -87 -83 153 -41 86 -85 -149 -168 -44
656 -44 162 -176 -304 98 -23 -23 38 13 93 -291 -86 271 -171 39 -268 -100 200 -64 -55 77 174 -132 123
679 123 233 100 171 35 -25 14 29 39 -8 286 59 96 34 130 -48 -105 -90 -1 -18 268 4 -119 239 81 -36
704 -36 48 158 -103 52 143 192 94 -155 360 -5 -158 28 51 -328 -26 65 -57 -228 190 -160 -62 -41 -179
727 -179 -137 178 -100 132 -251 25 -83 -166 -248 1 21 62 207 113 193 -145 -128 -170 52 -264 116 24 -78 -209
751 -209 -220 250 -37 89 -12 231 82 127 17 24 -140 -28 209 -95 22 30 -383 -362 108 -110 48 90 27
774 27 -90 -205 81 128 -1 -171 -243 56 -383 -85 115 -78 -115 -133 -5 -13 -87 -11 -74 242 241 35 240 -8
798 -8 134 82 -165 -289 85 2 53 -191 242 217 82 162 6 -28 -104 -63 220 -119 -77 -331 -73 52 18 112 -139
823 -139 7 -106 34 36 -22 176 -9 262 20 170 -199 138 -126 216 -139 -2 308 111 84 95 -9 -320
845 -320 -111 -140 124 -232 176 78 -23 -69 119 170 71 65 -182 -164 -81 99 25 -20 170 83 -159 -65 -201 6 44
870 44 55 -97 186 -199 45 -108 29 -169 5 -213 28 185 61 238 -85 110 -120 -154 -101 53 -86 -62
892 -62 -16 -35 23 33 -298 -51 -127 77 -44 244 -77 -20 -132 94 196 144 195 -215 126 36 235 -67 49 -115
916 -115 89 124 -2 -32 -261 8 -215 131 31 330 -123 -31 -51 -102 120 307 36 128 -58 141 -189 119
938 119 16 69 -98 39 -145 -209 -154 157 -135 74 -77 -59 76 337 -231 -49 370 115 -10 31 75 -168
960 -168 54 50 2 224 91 -144 19 -130 46 -68 108 229 3 -74 24 -40 -24 -95 4 -145 85 7 122 -46
984 -46 166 -264 -149 112 -290 -166 -46 -199 247 220 -6 -16 89 76 9 -158 15 -26 -1 -124 56 23 -233
1007 -233 16 -157 -195 103 -83 121 127 172 261 -36 161 -160 31 168 -278 -51 -108 34 72 201 -96 -57 295
1030 295 -72 -224 225 -162 -251 132 -142 43 111 112 -46 64 87 -160 115 22 107 -27 -101 -128 66 -112 -97
1053 -97 39 44 -93 225 253 13 82 101 85 -12 -158 -97 -33 -55 89 35 -89 -123 166 127 -121 32 60 14 -276
1078 -276 20 -115 16 101 -60 -40 136 -90 -135 -46 103 63 208 306 -34 260 84 -123 55 271 -71 -172
1100 -172 24 19 48 -44 34 -63 108 -165 197 -21 151 -104 33 185 83 -24 -98 114 -88 -100 -3 137 -124
1123 -124 -72 107 -123 -53 37 -109 -28 -40 36 67 -112 -28 30 -83 116 57 -106 125 95 -14 8 -25 -205 -307
1147 -307 88 233 -49 -64 98 211 -72 -66 -47 -141 168 32 227 -35 -156 -31 -153 -68 -224 96 171 100 -6
1170 -6 -148 -93 -371 -183 -34 -69 27 51 -102 -228 185 -100 157 -488 -97 -16 23 -130 -54 3 69 162 -79 117
1194 117 130 -156 -46 237 -134 -70 66 -144 -84 -141 60 -147 -28 30 -30 267 -58 116 -164 82 -61 313
1216 313 -39 182 142 -79 214 59 -41 57 225 -196 98 -136 189 283 29 90 83 154 37 -130 -69 -123 -33
1239 -33 -61 6 -112 1 -24 241 261 -179 1 26 125 -268 -42 -184 166 16 142 266 333 186 -44 207 157
1262 157 -21 -62 -91 -74 322 312 -41 -14 196 -63 78 81 51 280 12 79 -53 -153 -240 50 -141 -175 85 -366
1286 -366 -85 -105 -39 -24 16 138 -58 -9 -71 237 15 79 107 173 -176 -21 -251 -34 48 -96 85 75 -194 112
1310 112 213 15 -11 40 77 -159 119 -124 50 -337 4 115 94 -116 -160 129 68 -98 -125 -12 -147 -100 224
1333 224 98 67 19 13 190 -260 141 23 175 -254 18 351 72 -110 106 -45 -90 -104 -614 24 43 -79
1355 -79 -86 76 58 218 -79 -43 -46 -174 -118 138 -164 -387 99 226 60 -40 41 192 -4 -52 -5 -134 119 212
1379 212 -42 -196 4 91 33 133 157 -2 -12 82 -71 -206 -22 59 74 -252 -156 -25 87 86 29 -69 96 -76
1403 -76 -99 215 -30 111 191 -52 160 78 -25 81 -217 43 -4 -229 154 8 -16 110 -67 155 -78 -76 -138
1426 -138 -284 190 -24 110 -84 42 -9 -34 389 -106 -152 -254 10 -47 158 -122 137 39 -17 -152 -154 99 -62
1449 -62 73 -272 17 -249 -111 -101 102 191 142 -143 -50 -180 286 -148 155 -207 -20 193 192 125 69 267 48
1472 48 220 130 -124 -124 265 91 -22 33 16 -5 -75 228 -90 -142 48 185 136 -64 -219 -226 172 -159 -240 234
1496 234 16 28 -85 -69 104 118 109 193 330 -39 -126 140 -13 75 -159 -57 164 -101 49 -106 51 64 80
1519 80 174 -51 -185 11 -29 -16 -164 -49 -54 149 8 -150 0 -128 110 30 -67 290 -120 179 -268 68 207
1542 207 -23 244 173 127 118 286 129 104 119 -89 279 -104 211 132 -343 104 157 76 -57 -182 -164 -18 100
1565 100 -192 -174 -33 114 123 271 169 -72 200 164 63 171 -209 249 -98 177 264 16 -191 -9 2 96
1587 96 -19 -107 122 233 146 -28 246 37 114 95 -369 -202 26 -199 -191 -63 -10 -93 -310 12 -111 139 -41
1610 -41 117 62 37 84 32 261 -116 110 82 -29 53 -273 62 -351 -158 281 -28 -183 76 -62 22 113 -11
1633 -11 -178 132 -40 20 -80 135 151 87 -307 71 267 -234 -99 41 -77 -205 132 50 -291 -155 273 -75
1655 -75 -104 107 -48 -11 174 147 271 69 79 9 46 293 -102 116 -36 123 89 -284 -194 -213 11 54 -124 -80
1679 -80 -168 167 60 118 36 -120 130 33 -53 -154 -119 14 32 61 272 -62 -8 -93 -23 -104 33 -138 74 -106
1703 -106 153 32 45 -180 -5 48 27 -196 39 -77 -36 107 -102 -9 -45 45 -41 174 134 -115 -90 37 99 -39
1727 -39 -79 17 -172 -189 -33 177 -190 125 -41 58 -64 -85 -184 -60 36 -38 -49 -67 18 -232 -141 -2 -90 101 -114
1752 -114 188 -36 -35 99 406 139 89 24 -345 -46 98 -51 21 145 -257 -180 -131 -141 108 66 -75 80 -179
1775 -179 -18 116 147 57 109 111 -70 272 49 99 -239 -122 -386 55 -15 149 137 -53 62 -181 -69 9 -126
1798 -126 301 -46 68 58 -49 22 -54 49 -47 -216 129 172 -63 52 189 -243 -29 165 -93 -355 119 57
1820 57 -133 74 27 71 -149 120 -174 -261 -132 -19 252 98 80 -5 -39 49 121 -156 268 -44 149 64 2 106
1844 106 101 413 -75 -10 85 16 214 -67 29 -79 -56 20 -26 190 7 -71 14 -228 -88 -92 312 -53 -101 177 -125
1869 -125 -104 43 -49 -141 -179 -90 -17 97 309 103 -34 70 203 -378 -9 146 -184 -163 242 97 26 -153 91
1892 91 -166 249 -6 -196 125 139 243 11 55 -53 -44 -102 -48 -264 80 276 196 261 10 -65 -48 212 -117 -115
1916 -115 49 -15 170 -3 125 26 86 -102 70 -148 -31 -100 131 187 21 -102 14 171 -34 -239 -8 -135
1938 -135 75 132 315 -7 136 -84 -195 -38 87 82 11 120 -105 24 -75 93 -31 -226 -42 92 -18 135
1960 135 54 -105 -35 -147 -122 75 97 -20 -62 95 -118 -314 39 -57 145 173 3 -63 -151 -29 -60 21 66 15
1984 15 249 143 -31 178 119 168 -77 -144 -76 -183 45 38 -74 -80 -219 9 233 4 14 121 15 -264 -115
2007 -115 235 130 -78 -28 -356 232 83 -145 259 -230 -60 -138 -279 98 139 -39 -7 -256 -33 23 -97 -143
2029 -143 -14 203 150 -192 -37 -55 200 -171 160 32 90 2 -23 125 -295 -399 -216 -19 110 -254 -24 16
2051 16 159 16 -46 117 -45 -77 67 67 55 -123 -118 269 -113 -43 -10 341 3 59 -182 -51 120 22 -197 -8
2075 -8 -72 1 90 58 304 -44 141 -162 68 211 -41 -63 168 174 331 150 150 63 -18 119 -40 14 129 165 -191
2100 -191 181 -142 -190 -67 91 57 205 168 258 -23 -211 -19 202 -123 -129 46 -51 -31 -21 -110 -14 233 5 -158
2124 -158 53 -283 -92 -117 -123 -70 192 214 -93 13 -133 156 61 -101 36 247 -328 -116 -292 -84 61 172
2146 172 366 181 57 182 -76 -19 88 -74 404 -58 -236 -221 87 33 31 203 -219 50 235 52 190 68
2168 68 -118 137 -72 -156 39 -82 13 -139 119 -114 78 -137 -73 -16 -105 -4 -226 -177 -84 -110 -112 296 -113 163
2192 163 -45 -176 443 66 -108 179 -248 33 -36 66 248 -71 -296 6 -77 -231 259 -3 32 -132 52
2213 52 145 -100 -57 -4 -217 106 57 5 -267 69 106 5 -13 122 -120 -200 -120 107 124 175 -160 -93 -12 -27 19
2238 19 -283 -43 -176 -63 -1 148 -78 -212 4 191 -127 238 -234 -109 345 -96 -91 -116 285 12 -81 -33
2260 -33 217 -73 41 52 245 38 51 -8 79 -132 -154 -53 44 -145 -157 -198 4 235 67 -47 79 -88 1
2283 1 -309 94 236 83 -150 63 -215 14 112 203 232 7 -72 95 53 -129 -36 32 171 214 14 77 -138 -192
2307 -192 -31 102 -107 -14 104 52 -74 -18 -140 -45 85 53 67 51 -120 -27 -185 -127 178 187 65 -41 -335 94
2331 94 186 -139 -20 -72 155 104 -52 -181 73 -152 -173 -3 47 111 -121 20 -291 291 244 -207 298 119 150
2354 150 -163 47 -164 -51 -52 -62 -294 123 -189 160 -46 -18 -120 183 51 -144 -95 -47 222 -23 -224 67
2376 67 -51 6 35 -45 -94 -36 44 -54 -34 -123 26 -197 21 47 244 -65 -74 13 119 -32 -206 -262 -19 147 -134
2401 -134 109 117 -391 -131 31 65 -5 72 -38 5 -104 -240 -193 -162 99 283 -23 -53 77 -89 130 -120 155
2424 155 -42 -121 39 -100 68 31 -74 19 6 -83 178 -111 111 -272 -151 228 -10 68 68 202 -189 60 -4
2447 -4 -187 35 -150 5 59 116 173 140 12 -138 330 86 -45 -65 102 102 -42 -31 134 161 335 398 29 134
2471 134 283 -40 -127 -101 47 33 42 131 -75 -52 -138 143 -21 258 114 -171 229 -84 -276 19 126 -73 209
2494 209 184 47 -135 31 -14 121 -136 26 -161 -210 -74 -22 235 33 -50 131 -266 -219 -137 -157 5 -23 77
2517 77 25 214 -3 -70 22 251 176 -10 -126 -9 77 89 41 14 -119 -12 -112 165 14 23 91 269 83 -199
2541 -199 -86 256 40 23 -55 170 154 -24 -25 271 35 -292 -157 51 2 160 57 -26 -249 -76 -230 -39
2563 -39 12 -16 -53 170 266 -80 252 -108 12 138 -167 154 -19 -240 -373 122 53 177 100 103 -115 -209 -149 -34
2587 -34 203 -39 377 -66 3 -77 -36 -336 127 -18 220 376 -40 -267 -14 -51 -104 -142 -133 34 -58 -109 -227 100
2611 100 146 48 -9 223 280 -61 -302 -36 -42 -55 -78 100 3 -188 26 94 -287 -62 57 -125 37 -89 200
2634 200 -68 35 87 139 -79 -228 254 31 -214 270 117 137 -162 179 73 -53 -75 226 -38 70 133 -126
2656 -126 147 111 3 -121 -137 63 -20 42 116 224 198 224 -271 -7 -12 240 -56 -141 -121 117 -29 -116 -30 -125 -127
2681 -127 -233 23 -49 -52 103 -73 128 -233 -144 -88 41 -92 -105 143 61 -236 136 -7 359 5 88 7 110
2704 110 140 -387 -130 148 -139 -19 84 -140 -226 53 -217 64 42 5 -172 -185 -81 16 5 -105 127 -14
2726 -14 119 107 192 166 63 -248 58 93 -267 92 134 -146 120 83 60 102 154 -185 107 3 -163 186 -120
2749 -120 -74 -243 138 -11 -158 -175 110 -76 42 46 409 250 -38 -175 201 91 -49 -5 -52 51 94 325
2771 325 -11 234 180 -90 -210 -76 126 -42 276 -46 -139 338 -103 -87 -189 13 -141 -172 -114 85 31 156
2793 156 -267 49 95 -105 -180 -26 -21 50 6 -133 299 -17 -4 -112 -209 21 5 55 -75 115 -114 92 28 -392
2817 -392 -246 103 174 -101 125 62 -12 56 -292 -93 47 -97 19 270 -196 -82 -63 86 56 4 -238 216
2839 216 121 30 -3 388 -7 -11 360 -54 -97 0 193 -117 -12 4 2 -122 -372 90 128 49 75 -288 286 -89
2863 -89 125 168 -442 -371 164 -196 -33 132 -86 218 -113 150 -48 -384 -69 -152 -143 -181 166 -143 -108 -149 -335
2886 -335 -97 -253 112 -333 -12 14 119 -14 111 27 -338 24 54 202 -95 98 -109 125 -223 203 18
2907 18 -211 -48 247 -101 -110 348 361 -197 -5 3 -143 -30 12 252 3 -110 -88 -60 -116 -51 68 213 -341 -208
2931 -208 -141 -7 -150 -48 126 -130 189 -89 -79 -198 14 252 153 -262 -291 85 -34 -17 -69 73 386 -59
2953 -59 -20 138 161 -89 86 -174 130 -59 14 -162 105 -140 -46 10 -259 -92 87 -61 19 -69 232 -6 -39
2976 -39 172 -68 -41 -90 40 -330 -106 81 -19 -180 6 -49 0 -213 169 -132 -32 282 -39 -176 36 -290
2998 -290 21 -9 110 304 -184 -103 -160 -6 46 31 289 -2 255 -74 194 52 -85 218 109 18 12 -167 -57
3021 -57 -265 -249 -100 -78 155 168 169 -55 200 -58 70 -4 -80 -103 -9 145 140 271 -445 -21 -12 -150 114 -49 -54
3046 -54 72 -68 -151 -241 -149 -121 24 53 199 -10 -39 116 182 33 28 239 -179 -133 148 120 15 274 -154 -197
3070 -197 -318 30 -50 -75 99 -57 36 120 -3 -293 -38 -237 93 188 -22 -54 107 -26 65 52 81 127 -31
3093 -31 -87 0 -46 78 -28 -20 -358 -105 38 -2 -319 186 192 -50 43 197 243 -11 123 -20 -21 146 -310 92
3117 92 -15 64 82 429 -236 137 177 -202 12 -45 49 64 -31 37 25 191 -67 88 -120 -93 -121 -64 21 -239 -79
3142 -79 53 176 -129 81 -49 -292 -68 93 133 -58 -23 226 81 -322 -289 94 -43 -46 123 258 -66 210
3164 210 -127 -144 96 249 154 -37 93 -248 -11 155 207 25 -58 116 -18 -250 -18 -97 -89 16 -112 31
3186 31 -17 -91 72 78 100 -195 -111 156 -115 -84 154 -308 -186 249 158 -129 72 -216 55 -14 -177 298 21
3209 21 -270 268 81 -49 99 122 51 -190 -58 209 112 221 181 -460 104 87 211 -50 -115 -32 -115 162 103
3232 103 129 -200 -202 -14 122 43 -96 77 -23 137 75 -138 156 212 96 81 2 128 192 66 136 -79 -213
3255 -213 -86 244 154 105 18 166 -178 -267 -161 -166 223 97 -151 82 -263 25 33 -239 -145 -83 82 271 -19
3278 -19 -139 233 -169 44 -120 -138 29 -279 -69 43 186 80 156 -267 157 -36 -29 -298 -100 56 39 193
3300 193 256 -156 -305 76 -182 18 -236 79 63 161 89 -199 -74 0 83 13 230 222 4 67 -135 -143 -146 3 -117
3325 -117 -13 -34 -31 209 -130 216 -83 -178 11 3 -92 170 -274 31 184 -56 -99 -203 -171 -259 314 -90 -17 -233
3349 -233 116 -39 27 116 170 9 -130 -7 23 -22 9 -29 98 187 -56 106 -27 2 -69 2 39 -30 -179 -25
3373 -25 -174 -228 18 -104 36 -171 -17 -150 168 128 -191 -203 -262 76 -232 55 91 92 -118 -126 169 8 -177
3396 -177 -141 43 186 19 -16 -165 341 -84 -121 259 6 -67 -87 -62 12 23 -146 -18 57 92 -152 -33 -70 -7
3420 -7 68 198 -127 75 74 66 143 -54 11 -30 -81 0 47 -292 -27 -47 11 314 47 -167 -54 67 109 380 150
3445 150 -76 118 62 22 -29 43 -95 -52 -96 -187 -37 -25 100 254 54 -150 -147 -140 -142 43 90 167 38 -22 253 -31
3471 -31 87 -132 -300 -188 -78 -250 24 138 -43 -138 162 -202 19 -199 -11 69 -81 -16 298 10 -55 -97
3493 -97 -291 -95 -130 -130 -85 209 -201 -311 -55 14 25 -146 141 285 -38 88 -112 -61 -158 -219 -167 0 131 44
3517 44 156 156 153 -257 -58 -87 159 -171 -157 -156 -144 -59 190 -5 188 -126 174 145 -175 -50 -15 73 -54 -277 -9
3542 -9 -80 -341 -336 -22 127 25 106 -5 7 20 135 64 62 159 -20 -174 17 34 240 142 137 -111 13 66 -149 60
3568 60 -22 229 -116 201 -111 -69 47 -231 -22 219 -149 -73 233 -76 5 -100 53 -18 -54 6 56 -65 -113
3591 -113 -35 -329 0 -26 317 47 56 150 -47 268 93 54 56 -143 -49 144 -233 122 -19 -87 0 -162 -177 -38
3615 -38 217 195 65 -26 83 -190 -32 -21 94 100 185 -216 -36 77 -365 -326 27 -20 -64 119 136 -28 181 -134
3639 -134 44 -212 -17 -68 253 125 -58 168 5 -135 -151 -81 280 -98 24 -353 66 73 24 271 -8 66
3661 66 5 -70 -251 -313 -21 0 -144 -287 237 72 -118 33 76 -274 78 38 114 199 -16 -132 -51 144 -21
3684 -21 -157 8 -77 16 56 22 -112 67 98 38 203 -40 -7 -213 -112 -180 -196 -140 126 -121 -200 219 18 -125
3708 -125 165 290 -58 144 -85 -320 -131 69 128 62 108 -253 60 25 -122 -34 48 95 -273 202 -365 346
3730 346 17 -22 61 108 -87 101 -57 186 281 -67 -72 157 -241 185 -35 20 -168 302 -91 -130 47 58 -98
3753 -98 162 87 47 48 35 213 25 22 -213 -228 -145 -96 -99 -104 -168 -188 -56 93 -283 -244 -71 -36 174 -431 -34 -173
3779 -173 48 40 -350 3 -72 419 103 164 -138 111 -113 194 154 6 178 30 -141 -59 -58 -47 61 133 82 -183
3803 -183 95 -123 47 -62 53 -231 59 61 91 272 -51 -171 -129 -151 50 247 37 -70 -145 23 -335 -98
3825 -98 -84 -149 227 51 214 43 127 -124 129 201 139 -61 -9 -70 -179 196 293 -84 -160 -247 -204 -55 343 207
3849 207 -126 -66 90 -155 -56 63 32 -197 252 303 -256 -104 -188 -7 -176 -165 -114 -179 306 151 66 56 -58
3872 -58 49 -25 379 29 -63 212 203 201 -119 -140 -85 121 156 -38 -44 -71 -111 -122 46 221 -21 -207 339 189 -100
3897 -100 115 -357 10 -116 -8 -22 235 28 132 117 283 227 -161 -95 -154 13 -74 -159 133 306 104 -140
3919 -140 -27 -80 58 -2 -172 -225 -65 -7 29 -166 -31 133 -126 -76 -239 -33 -68 -207 -66 -128 289 1 -113
3942 -113 107 151 -39 -12 115 -111 -256 -4 47 80 169 162 -48 102 -224 13 -84 99 -70 -4 -110 -220 -1
3965 -1 -213 95 88 -51 -35 -48 -1 246 143 -29 84 302 -52 232 50 -14 182 41 37 3 -72 -116 -381 -401 -103
3990 -103 103 64 79 75 293 187 -108 -197 -178 -192 -9 33 -225 -23 19 -44 -125 -77 -82 -199 -91 53 -233 -150 -22
4015 -22 -217 -202 -295 -38 169 -6 -33 -164 97 -110 57 21 -209 -31 97 -276 -69 -31 -94 179 -30 173
4037 173 -89 144 100 -237 23 7 -144 123 312 -40 518 206 -121 131 271 25 -46 -135 -51 124 223 -229
4059 -229 -48 -183 -45 152 -211 75 -116 152 112 74 -105 95 129 -49 -184 -96 -70 45 -81 21 102 -103
4081 -103 -37 128 -25 -138 -269 149 -140 -95 -114 103 -24 77 57 19 -63 40 -26 96 -49 -5 72 139 -54
4104 -54 126 -267 -149 -75 -41 143 -124 115 -54 -136 30 -195 -174 37 -357 167 133 19 87 -134 -163 -54 17
4127 17 31 132 -111 163 46 -55 5 -91 49 -71 -118 -161 -151 86 51 138 138 -171 -135 -39 -146 111 -42 -89 122
4152 122 291 74 -14 -23 70 145 298 29 -82 -100 16 -274 -85 4 245 -167 -51 79 -218 -172 200 217 201
4175 201 2 -36 307 -36 166 58 -41 100 -156 85 -28 -41 160 -27 -42 -91 13 14 -235 187 -93 -147 111
4198 111 -177 148 -239 -80 162 1 -165 -67 83 -65 -126 122 -319 -172 -284 57 121 155 -11 -299 145
4219 145 -153 102 13 41 44 -83 146 -179 15 135 221 59 -40 7 20 48 68 13 -9 -263 -184 -222 -76 -254 103
4244 103 -109 -149 75 -54 9 -53 242 270 250 26 -123 -7 -173 186 -170 -82 232 119 -112 -2 -144 32
4266 32 39 -22 70 41 -228 102 -125 -40 159 -6 43 279 133 -7 -48 58 -53 2 37 -144 27 -50 -5 -79 285
4291 285 91 -27 265 106 105 126 -130 -244 -317 45 -157 -222 -3 29 -32 206 -25 48 128 -66 89 166 50
4314 50 -112 81 -42 -135 -101 31 -356 29 -264 39 -145 76 146 -258 300 31 68 -118 -123 -23 101 -128
4336 -128 -89 -40 -203 135 -211 -260 58 102 -89 -192 126 6 324 -321 -58 42 383 -69 -303 -40 13 -52
4358 -52 -117 13 -127 -225 -36 -332 -30 -369 253 204 30 92 -47 -10 -26 61 -239 146 -278 0 127 -100 137
4381 137 209 -18 -68 0 27 -196 23 -221 -104 -7 69 -65 201 -116 -295 -41 -129 49 18 -68 -1 97 47 -218
4405 -218 -40 -58 15 125 -62 -145 -76 81 246 122 149 -122 -196 -5 221 240 84 39 -169 -11 -123 -54 -63 181
4429 181 -21 102 -237 2 -15 88 -77 -89 244 -136 -444 92 -60 29 89 -178 93 142 -21 126 -73 202
4451 202 8 4 20 156 -24 -142 -1 145 121 -159 115 64 -55 83 40 106 -35 -92 260 293 -8 255 -159
4474 -159 101 -156 116 -183 -96 252 -54 81 226 269 -57 305 218 42 6 -77 19 133 -67 51 118 -13
4496 -13 43 -90 182 132 2 -12 272 63 118 -56 114 268 253 -133 161 69 -86 170 189 225 43 152 72
4519 72 200 12 -180 76 51 -110 -36 47 70 185 -47 -87 181 -74 -10 16 -20 -79 60 178 120 178 -74 -77 -3
4544 -3 -45 -19 -64 74 -14 -184 34 -276 16 -28 243 30 125 -189 -366 57 -163 139 22 151 144 99 -74 44
4568 44 33 52 174 -112 105 136 -144 -423 -162 -54 65 101 232 -62 -229 -209 -88 -78 -84 -134 -21 148 -53
4591 -53 185 102 -29 34 -54 69 84 -16 135 -5 132 251 28 163 129 118 12 99 -256 70 -27 -39 -51 -32
4615 -32 173 15 96 19 -49 205 -9 84 105 -20 -16 -14 204 157 255 116 -117 2 97 89 -3 35 87 72 -129 -264
4641 -264 125 54 -40 -91 -44 -126 -107 -41 267 -112 5 18 -81 -1 293 54 -254 104 -65 142 40 -54 23 -48
4665 -48 138 57 -16 -159 29 27 -54 207 -14 -200 181 131 -204 69 -63 217 217 174 -75 -91 408 -18 57 42
4689 42 -149 188 33 245 206 8 -46 -127 271 23 72 -145 -253 -30 -40 21 -56 -38 356 173 58 150 37
4712 37 113 -52 -166 -62 21 -63 -5 64 -29 -255 249 -21 46 -44 -78 24 214 109 92 -117 -12 148 143 -187
4736 -187 -75 -124 -88 -42 -46 -117 61 -185 97 -140 -3 -77 -152 -33 86 115 -33 220 -277 1 -44 230 -128
4759 -128 -190 -97 146 -159 227 -149 -13 -72 256 -128 22 232 -42 60 -161 -146 -170 51 46 -240 157 180 -99
4782 -99 343 159 10 -104 113 -72 -275 -166 -128 -29 136 -17 -144 -99 -98 -59 -15 -84 -245 -254 -32 41 124 -16
4806 -16 68 117 -81 89 -101 -79 108 -92 322 -101 138 -88 -159 14 -330 -63 -231 96 -17 148 136 -138
4828 -138 -12 -125 59 -71 37 355 -7 41 -45 8 168 -6 114 120 127 -175 120 -107 -165 43 141 247 40
4851 40 126 -133 265 52 -8 331 250 127 227 -439 140 29 37 120 164 198 -66 -179 55 -93 -142 236 137 -98
4875 -98 25 -388 -68 -43 43 -208 195 105 -57 -61 -8 19 -86 18 -61 83 73 -7 83 -49 93 -88 -73 -143 21
4900 21 29 139 -84 176 -209 -35 6 -64 -215 -227 -17 38 57 -158 70 -49 224 117 -122 160 63 -176 146
4923 146 -124 -122 -185 -28 -33 242 -76 -158 46 120 52 146 -190 -191 72 46 19 42 63 -100 -241 396 -16 212 25
4948 25 16 -242 -12 105 22 -184 183 135 65 198 143 -243 40 -168 144 -118 -52 12 379 241 125 -129 -135 -108
4972 -108 1 207 -26 -156 -194 94 256 25 -29 -238 -95 9 -246 56 37 151 82 97 -13 215 -85 7
4994 7 197 107 -198 -240 130 58 -123 23 -4 -15 21 135 21 245 -72 -6 -121 73 127 31 276 144 279 -59
5018 -59 -107 -91 -130 -5 103 -160 -73 108 -40 -90 145 -97 -122 -47 -27 -18 -165 -8 180 29 -130 -144 -9 -144
5042 -144 -51 23 57 56 171 271 -37 -15 104 1 -183 -457 -194 -122 144 23 -313 -120 134 -141 179 8
5064 8 181 -160 -157 156 -107 78 202 78 104 124 64 185 14 149 -50 197 392 96 334 136 -132 -133 127
5087 127 -22 189 -55 77 -169 -127 23 55 -210 -120 169 198 -110 -54 -87 -71 -14 -206 105 -53 138 -31 123
5110 123 70 -198 27 -69 56 3 -92 113 38 -54 32 -217 -100 236 315 7 64 -188 1 71 -35 29 -34 -46
5134 -46 -28 266 -153 27 -445 -94 188 63 -137 97 -125 -71 57 -22 -112 -76 -3 -4 299 81 251 -153 -365
5157 -365 -10 122 26 44 -39 16 220 47 -158 -57 -132 125 3 188 114 -81 1 56 -198 179 -176 -55 99
5180 99 -337 171 -189 -109 201 236 141 -38 -178 40 50 358 217 -95 82 -8 -51 -314 9 -205 -255 -42 242
5203 242 -182 -87 -295 -8 -31 -166 198 -39 -73 238 -145 74 -60 27 -177 -184 -44 -321 -11 -35 323 268 -167
5226 -167 -45 22 -50 53 166 -35 13 57 74 -149 90 -100 -76 -111 -51 53 172 -59 8 23 -8 -51 -44 -269 105
5251 105 89 -99 -67 45 -3 185 -108 168 -14 -99 121 120 -89 -72 27 30 -174 190 -120 292 140 -88 7 96
5275 96 -121 -171 -101 172 145 106 80 -64 -201 -166 13 -71 218 -150 293 -40 -274 -163 -38 174 151 144 -204 69
5299 69 -10 -42 130 -137 124 -41 227 -57 115 -109 -103 386 -258 325 187 -109 85 10 28 -257 70 -4 142
5322 142 28 -18 32 33 -382 -154 24 110 149 -63 -41 -15 317 153 -162 43 184 6 -165 -48 -277 468 -103
5345 -103 -61 -8 -334 -174 102 196 94 309 -26 103 177 65 -85 -58 -13 237 347 -48 93 -153 40 -161
5367 -161 78 49 -3 47 -24 105 -47 210 -151 150 134 -34 10 -117 -195 -36 177 -62 55 55 -155 -177 231
5390 231 18 -108 13 -96 77 226 -2 8 -189 -4 -51 25 34 -194 -14 32 201 -96 -96 176 -186 56 -197
5413 -197 -285 147 -136 -427 -60 176 174 120 17 -48 -88 156 64 74 -211 -38 19 -228 0 243 91 49 -41 -39
5437 -39 73 17 14 209 243 83 -156 101 152 -237 -183 28 91 -87 163 118 -118 -50 186 15 16 -195 -187 38 440
5462 440 39 -278 -163 64 -6 -255 -88 -328 11 -141 105 165 145 -148 363 26 79 -59 -72 93 142 -119
5484 -119 418 -64 -212 -23 -127 -10 165 -116 -33 -135 6 68 -70 92 -57 92 -44 176 -170 17 182
5505 182 126 -128 79 209 -64 -131 -147 106 48 108 204 28 -394 182 289 -390 45 46 106 246 128 -147 -13
5528 -13 -36 6 -81 11 55 -48 -36 -4 -171 47 -104 -89 125 61 95 93 -211 -414 234 -125 132 -218 88 -47
5552 -47 -18 -133 54 20 0 -168 -53 -146 91 -410 5 -198 -60 -128 -22 0 19 408 286 250 -44 68 277
5575 277 -106 -125 303 -195 283 52 118 117 147 22 1 -230 48 42 -26 -72 -75 78 -225 104 2 -238 49 -46
5599 -46 164 -12 -177 37 -143 -77 146 -127 -21 -108 13 -129 87 168 -22 -57 145 -200 -41 -129 -442 3
5621 3 58 26 -127 121 -123 -94 239 126 174 110 64 -96 -218 -81 60 11 -8 -36 63 29 184 -161 -173 -97 2
5646 2 -128 42 388 41 -30 -69 132 -22 -83 -207 -9 255 62 161 -9 50 -114 -103 -81 -3 236 -29 148
5669 148 42 72 -99 -16 -15 -146 -91 -89 92 -78 110 -86 -39 77 -171 80 118 -223 10 -197 322 126 -40
5692 -40 1 86 -102 25 -102 50 146 -247 152 184 -123 20 -226 10 -339 16 120 164 -221 -171 62 133 -108
5715 -108 -182 -39 -13 81 22 52 117 -10 -24 50 -136 -35 -74 -242 127 -108 -73 -163 134 -22 -148 168 -109 105
5739 105 -245 169 85 -118 -120 177 52 194 -68 234 85 -149 -62 102 129 257 -122 257 -122 59 -75 323
5761 323 -59 -80 -87 -96 95 -94 23 -152 43 -262 83 -206 -145 -143 201 88 185 132 -380 -262 71 98 -94 -379
5785 -379 -38 -86 418 17 -169 86 -55 15 179 111 192 -67 76 40 167 -168 162 90 -24 -48 84 100 166
5808 166 28 26 -137 -114 -10 48 222 56 177 36 104 2 -198 28 -278 214 87 -149 57 233 56 -54
5830 -54 8 -64 69 46 55 83 -49 172 -91 39 44 72 -297 -171 -106 -241 -62 42 -251 125 -44 -63 -140 128
5854 128 304 -228 -13 186 30 -70 20 -136 -168 169 112 86 88 -57 339 64 116 -73 -35 -146 -1 -179 -15
5877 -15 -151 150 -40 -132 103 -11 169 -135 -28 -61 -187 91 -48 52 109 -153 -151 -13 -99 58 -141 -54 -206
5900 -206 22 202 -104 163 59 -62 81 19 188 140 153 -67 -233 -75 -18 -25 83 -227 -275 -117 -16 136
5922 136 -261 365 -67 181 -158 175 -182 -114 207 -96 65 -16 64 -138 11 -97 -88 -23 -12 41 -29 71 79 -11
5946 -11 -92 209 -3 198 158 -6 184 273 181 -61 -186 -128 214 25 -141 -164 -144 -51 68 167 104 -232 24 2
5970 2 -55 -66 0 91 157 -78 304 30 131 83 49 -50 210 26 -260 -35 -14 -28 -65 141 -215 27 244 66
5994 66 11 302 -101 27 -56 46 76 -13 125 30 -32 -126 108 3 120 235 -88 256 -30 -76 -241 303 -285
6017 -285 -93 -108 70 -9 -127 -42 352 -59 -36 41 46 -71 122 190 78 -224 -147 211 129 -65 -382 134 176 -162
6041 -162 37 29 99 -201 94 -40 167 169 124 -19 93 -34 0 50 190 208 -28 49 92 62 42 -265 126 151 -31
6066 -31 -33 160 285 48 93 86 13 83 81 -99 -81 179 110 -33 92 261 -34 248 270 252 -130 -254 316 -193 -14
6091 -14 -49 34 -147 344 13 131 192 -179 -159 -171 -130 -219 -50 -165 -146 1 3 -7 -270 -33 291 169 51 -190
6115 -190 46 -113 211 -36 89 104 161 229 -49 -16 -193 78 258 184 195 255 51 -204 -119 34 179 130 414
6138 414 84 -180 191 308 28 78 176 125 302 -83 66 -409 24 14 -247 -84 3 -148 -100 -14 297 25
6160 25 73 -228 13 -92 -17 -134 44 -167 -256 -137 139 3 36 -61 102 -106 -276 -35 -120 255 -12 255
6182 255 -78 16 -23 124 -79 -13 79 133 52 -106 -35 -68 1 -87 -228 -122 -55 68 37 137 -66 39 161 -179
6206 -179 348 28 -182 -88 -78 0 166 -141 -85 -128 131 145 -286 76 15 6 82 49 -98 -195 233 114 -17 8
6230 8 -274 37 183 94 120 198 -83 36 58 -75 -180 -144 -33 -6 116 -148 -156 -42 111 -76 -76 -61 163 37
6254 37 -145 -36 177 -24 -191 -72 -96 181 -51 117 96 179 -58 31 -38 103 41 88 -139 -27 5 146 55
6277 55 89 -14 -13 16 -76 174 -12 131 -28 -264 203 122 239 -144 121 46 -24 140 -15 113 -26 61 -484
6300 -484 300 81 55 301 -216 59 -132 -321 64 47 -340 -113 -219 -154 183 -35 290 132 -60 17 -73 -31
6322 -31 169 -283 -272 45 -28 31 274 244 26 84 -57 85 144 263 112 -72 114 52 -101 85 75 71 -4 -183
6346 -183 -94 -223 81 -31 -130 59 -30 -117 -165 -152 -162 295 -159 125 -104 300 52 103 -201 23 81 -28 24
6369 24 -101 30 -135 -168 -147 -95 220 -133 -232 131 174 -24 121 -22 -34 -147 -108 -87 -178 151 -179 -5 -198
6392 -198 142 126 -277 -62 -4 -198 40 -14 -18 -51 -56 -146 31 60 -31 53 -93 -155 11 362 213 -16 -36 -163 -76
6417 -76 79 269 -32 -70 -100 -147 -14 -148 -133 236 428 -206 190 92 -72 -23 84 -126 -7 152 -275 -272 55
6440 55 152 111 304 105 128 -99 151 92 -74 1 102 -53 -2 95 58 -51 7 18 180 174 17 80 -217 53 -85
6465 -85 7 220 79 94 -352 42 -44 -136 70 -131 94 79 -91 -57 -110 -199 31 283 275 97 200 93 55 78
6489 78 348 -185 133 36 -169 106 -140 -9 133 -82 -88 -88 -249 84 84 180 -149 26 24 64 -39 -278 176 -3
6513 -3 -15 162 111 182 -47 -83 -117 -45 -243 -146 30 43 141 64 17 -61 159 25 96 58 45 59 -75 346 -70 82
6539 82 -213 -2 -297 -7 61 -31 93 -236 208 76 -87 31 200 -98 -42 105 -154 54 18 187 18 190
6561 190 26 -251 360 11 47 104 -116 -20 212 114 86 57 162 139 -51 -15 -127 -17 -124 -11 80 121 -34
6584 -34 -63 -74 -13 336 -58 38 -51 144 182 72 -42 -142 -32 -81 19 83 45 -185 -122 69 -106 29 -92 -57
6608 -57 7 -120 -116 111 256 -62 169 156 -109 -6 -49 -204 209 154 96 195 107 -115 -43 -166 -251 180 -36 57
6632 57 -53 -48 115 -3 -246 73 117 52 125 259 4 96 40 -141 -43 -13 -213 47 -97 224 85 -221 5
6655 5 -170 -259 -150 111 74 -7 99 57 123 62 -51 -37 237 31 69 -58 -179 9 -123 160 -97 247 63
6678 63 -107 71 -13 -245 -157 59 -65 177 -382 276 -192 176 -120 -176 -336 -56 54 63 -310 238 6 48
6700 48 -180 -16 89 -214 41 -102 -179 -34 -52 78 51 33 -4 -121 12 -177 68 198 -40 -80 230 95
6722 95 -160 89 114 -9 -128 -127 345 131 -84 -18 105 212 -125 -236 151 224 190 86 62 20 66 -21 223 10
6746 10 113 -104 205 17 -8 21 103 -93 4 42 91 -116 205 -69 -277 275 81 -90 127 23 -279 -149
6768 -149 3 -17 -120 49 187 116 68 -101 -83 119 53 -149 -102 -162 -119 116 154 83 163 -119 8 -42 -135 81
6792 81 -88 78 236 4 81 70 42 37 -300 13 22 -134 96 -74 -20 120 40 -376 -110 118 -161 -22 -65 -35
6816 -35 -5 250 148 -168 -197 -33 130 -83 80 -10 124 -282 105 50 182 -127 113 123 -8 486 -47 81
6838 81 165 0 -181 -278 -227 -51 -59 -4 -75 49 -57 -64 118 -154 -213 189 16 139 8 -6 232 1 -112 181
6862 181 -173 220 -273 -150 67 176 -1 47 46 202 344 327 8 6 -158 -98 -61 227 -89 -128 78 37 142
6885 142 -132 -35 218 198 -105 162 41 -45 -32 105 -187 101 -89 92 -2 -64 -35 -54 163 -31 81 -213 -183
6908 -183 -27 48 -87 131 39 137 333 -138 178 182 -51 -10 -202 -172 -132 82 17 -235 -132 -34 20 -10 -120 -240
6932 -240 -21 -106 30 -63 -17 188 -148 30 -49 -22 37 -15 -68 235 16 -59 -295 -66 184 -153 -5 -25 199
6955 199 -134 -73 -112 146 -197 59 -19 -130 135 8 20 -168 -66 92 -71 -317 92 82 40 89 -59 -154 -159
6978 -159 97 271 93 124 262 -48 -17 245 15 47 -57 126 61 -144 307 33 59 117 -270 -349 -5 -147
7000 -147 180 -82 -36 182 236 22 -240 -14 -170 -27 151 6 49 276 -28 -187 34 -130 -148 80 37 -98
7022 -98 389 183 256 -104 -257 -145 -7 -174 -71 32 51 100 -80 -305 80 64 110 222 230 -214 114 332 -10
7045 -10 8 -3 27 -174 -104 -267 109 -83 -203 -16 156 7 -60 -66 129 -245 218 24 47 -62 57 236 -245
7068 -245 2 116 239 70 138 -80 318 -71 282 -173 207 73 -120 -23 -142 -67 -26 -2 -11 0 -334 -88 203
7091 203 -155 74 -238 -86 179 4 -239 73 12 62 -12 -159 -106 -93 -231 -94 120 -124 111 -186 -119 -156
7113 -156 -4 354 -130 -172 -71 -145 -226 -100 24 147 -183 -69 212 136 84 119 205 186 127 7 240 44 36 -118
7137 -118 28 -171 169 -189 200 -173 73 -121 14 -20 -158 -320 -196 174 487 -16 71 12 -91 22 -180
7158 -180 -11 -82 81 162 -149 -19 -82 89 125 32 -28 83 -123 45 121 250 120 -200 51 117 47 -73 -52
7181 -52 122 -4 -324 -167 120 -127 -253 35 200 -171 77 -192 36 3 -189 134 78 -19 106 -93 252
7202 252 -47 17 135 -76 -3 -47 -23 191 87 -117 377 -336 -235 -47 -117 61 -39 -124 -120 13 13 -127 -159 -46
7226 -46 30 89 -231 175 76 93 7 -61 83 -13 -11 27 -3 0 -315 -225 67 115 -118 -102 149 174 100 11 270 -8 -166
7253 -166 -74 -5 -152 0 59 85 29 -64 263 144 -108 3 87 94 -204 230 -273 160 -133 -103 83 30 29 -87
7277 -87 -51 85 174 -161 157 -238 84 112 -21 100 2 78 -68 -139 -395 -178 92 -26 113 14 173 97 305
7300 305 215 230 141 -161 -164 32 202 -241 219 79 110 -136 -149 43 -448 -12 -141 -54 189 -141 86 38 157
7323 157 47 53 -326 138 113 0 -212 100 210 -3 94 -107 4 142 176 -263 -25 -250 -156 -62 45 142 85
7346 85 219 63 231 103 -4 136 -278 -160 42 -153 6 95 333 96 -29 -52 -279 97 126 227 -141
7367 -141 318 -46 -59 -27 149 -105 -60 -115 2 101 39 93 94 88 -115 126 -197 -138 51 -166 10 -135 -138 -6 17
7392 17 20 -22 -198 -42 -153 -26 98 -58 67 149 81 -161 51 37 -240 -8 172 21 14 -29 -188 -5 -86 269
7416 269 41 -166 -20 26 46 -4 -31 -22 -11 25 16 109 86 -19 60 -31 -24 -75 -155 -132 -76 -151 71 210 -93 -93 72 7
7444 7 59 -42 -150 -36 200 -97 -133 118 72 -65 76 118 -231 -46 4 155 -196 -186 -151 -126 74 -24 61 -71
7468 -71 114 43 187 14 -82 149 45 25 -11 119 211 88 378 183 -66 135 88 -18 157 154 -288 -94 -115
7491 -115 20 -59 263 -23 22 -61 -268 258 45 27 66 349 9 39 -82 149 -22 20 -29 -70 15 -24 -123 58
7515 58 -58 117 132 19 -53 -61 -30 -119 103 171 148 197 -180 278 -50 58 140 -248 -229 -94 90 -168 138 186
7539 186 50 -232 39 -91 -54 111 -72 -209 128 144 223 253 -24 316 -86 -74 -9 319 47 73 85 -100 9
7562 9 83 -7 3 -2 -17 126 46 -135 12 -17 -68 -9 24 185 -26 121 -89 -52 124 1 64 -6 -65 -93 100 84
7588 84 74 -189 91 80 -137 -128 -30 237 -107 -113 186 -347 70 150 -53 -131 142 124 137 4 -35 -158 164 -110
7612 -110 93 -130 -192 -34 168 -309 -73 3 165 153 89 -43 -264 22 -2 -197 156 75 186 -56 -242 80
7634 80 265 -176 -56 57 -41 -257 -19 -36 -109 268 -151 50 -29 -140 43 -50 188 196 -114 79 212 190 24
7657 24 37 -211 183 -92 72 35 160 -131 19 -27 83 -117 -71 -44 9 -120 115 -31 -30 -67 -17 56 -184 32
7681 32 305 -279 -18 -178 43 29 49 -24 -154 -30 -85 -23 -137 302 152 -259 290 -150 -238 -185 -309 -2 -110
7704 -110 169 106 46 213 -69 -89 -398 -65 -94 32 -203 0 -206 -80 -104 337 58 112 119 143 42 -1 -206
7727 -206 -5 18 90 119 -3 207 -174 -106 -49 -140 -217 96 120 -307 -86 206 15 -19 181 258 195 103 -60 -148
7751 -148 -33 21 -219 112 80 162 -55 81 -67 -130 -24 46 -38 151 45 75 -52 -109 -24 96 -117 -180 149
7774 149 -117 -5 44 -148 -78 106 -109 -53 -88 65 -117 -112 77 103 181 -70 135 81 102 -14 161 -20 8 -18
7798 -18 -141 -87 162 -9 -92 -22 -33 -136 -50 -36 -202 -235 -113 36 40 -171 -78 -24 -88 34 120 290 153 -179 -31
7823 -31 -59 146 -55 -250 137 3 -220 114 -142 -155 -155 -477 0 90 66 -57 34 9 -94 166 105 117 69 64 23
7848 23 337 251 -323 -174 0 110 -162 70 47 60 4 141 189 -132 -11 208 -186 -102 -225 -268 -93 29 97
7871 97 -103 6 49 135 -122 40 -1 -200 -92 -97 -125 18 -168 -63 233 260 83 84 -207 37 -57 -114 -275 -91
7895 -91 -220 218 -249 -100 91 -327 76 -351 -203 -111 -138 113 -142 -62 115 -199 -64 -2 23 -12 4 -81 73
7918 73 -282 231 -107 -47 31 -39 25 25 21 -251 65 -116 -88 57 149 -132 -73 -51 40 120 246 -138 -49 -115 49 313
7944 313 -112 93 -44 -146 255 49 -14 81 204 -92 -160 -7 124 -64 -71 40 85 77 -22 -58 -46 53 32 -233
7968 -233 161 171 -19 64 -10 64 -274 39 -153 -138 -145 -83 -197 -132 228 66 78 -57 -86 -88 -92 -93 -100 -91 104 -122 -112
7995 -112 -167 -17 -7 54 -66 10 -139 15 143 100 -31 127 -150 -60 -128 -100 174 -120 179 -170 40 -96 3
8018 3 -166 254 68 79 -32 45 -1 123 193 12 105 -58 -7 -18 -90 27 -152 -15 -20 -89 -25 -13 306 131 -300
8043 -300 -7 77 204 -93 12 -324 -85 302 -5 -56 313 -25 73 -109 67 106 91 -16 19 -93 -30 7 34
8066 34 154 96 -108 -229 -69 -222 45 115 69 -160 42 86 -296 -30 177 30 -284 43 45 -63 159 14
8088 14 212 -3 4 -162 -76 24 -250 70 -76 62 76 9 17 12 -315 208 51 -109 230 -170 -71 -108 12 13 39
8113 39 17 -5 -57 26 -56 84 41 22 258 155 1 -56 60 190 122 -106 -191 -297 36 -194 -71 42 27 233
8137 233 -160 -92 -92 57 -117 61 -260 -302 77 -187 102 -21 243 -49 75 -10 -65 140 74 3 12 -213 118
8160 118 165 35 102 -492 -80 -178 30 27 63 227 70 49 3 62 -9 -48 -162 120 144 20 55 102 129 2 137
8185 137 77 209 -75 215 238 83
8191H3
$$ Imaginary data points
##PAGE= N=2
##DATA TABLE= (X++(I..I)), XYDATA
0 0 0 0 0 0 0 0 0 0 0 0 0 0 0 -8 8 -8 8 -8 16 -16 24 -24 32 -32 40 -48 56 -64 72 -82 96 -110 123 -141 158
35 158 -177 200 -224 251 -279 311 -346 383 -424 470 -519 573 -633 697 -769 845 -931 1026
53 1026 -1132 1252 -1386 1538 -1712 1916 -2157 2445 -2796 3241 -3820 4615 -5767 7608 -11035
68 -11035 19623 -93627 -97579 50585 13394 -10348 4547 31952 -655 -2272 13963 15380
80 15380 -15229 -13455 -1246 1158 -5655 8765 12190 1136 -5327 6106 6041 -1055 -5903 -4474
94 -4474 -7680 -5451 -241 2986 466 1165 2871 3668 3009 3160 590 -2526 -2150 -598 -671 -212 2 -1198
112 -1198 -1445 1842 3089 771 -713 429 -270 -1932 -1104 -143 -1442 -2060 720 2848 2044 1961 2282
129 2282 463 -1636 -508 304 -1371 -3074 -2322 -991 73 646 1555 1442 37 323 1227 482 -501
146 -501 -1114 -1041 -701 410 955 1290 922 536 404 67 -384 -813 -1082 -854 -715 -338 257 392 509 421 550
167 550 500 495 186 140 -335 -653 -251 -307 -285 -116 31 302 498 309 196 -309 -473 -653 -230 -174 -245 -118 305
190 305 459 619 218 -27 443 160 -286 -595 -222 -540 -403 -138 235 -46 61 513 580 404 -334 -354 -294
211 -294 -255 -141 211 257 23 109 214 208 359 132 -366 -566 -571 -247 -17 136 -140 52 250 275 558 282 -448
234 -448 -448 -480 224 54 46 98 -286 -38 349 356 416 -79 -210 -185 -143 -2 -12 -6 -290 -87 428 412 456 285 -239 -262
260 -262 -112 252 138 -21 -468 -181 218 179 273 -68 -252 6 118 -50 117 -318 -269 161 35 111 28 6
282 6 10 -176 119 235 107 -172 -249 -67 134 -390 4 58 -11 129 -237 423 -113 18 73 117 87 377 120 -109
306 -109 56 44 206 -65 36 -165 -293 -190 80 237 112 -273 -61 -229 106 8 -92 -35 -241 -176 214 111
328 111 -269 47 -137 -250 141 31 -91 -210 -49 -87 21 12 -28 117 -206 -124 205 64 133 -208 74 -30
350 -30 -197 181 190 -100 -117 -235 154 75 150 -187 60 43 173 67 -136 189 -113 -9 133 -59 224 -52 -155
373 -155 -84 -260 7 -33 -134 17 -37 -145 -2 -203 14 144 158 160 -37 -91 -9 -28 -88 39 -186 -275 -133 173
397 173 -34 -166 301 156 -299 173 275 -90 -219 -183 16 22 186 204 110 -153 254 -133 -24 175 -102 -160
419 -160 12 -75 117 66 -179 125 -69 90 49 169 -39 285 -62 -25 136 34 -130 -171 -8 -119 -275 210
441 210 25 19 -282 34 177 -246 38 91 162 11 -66 -161 4 -49 95 -89 -181 -56 -107 -76 -63 -104 71 -124
465 -124 82 194 -205 -247 -94 23 179 -68 -120 -251 130 -101 -40 39 -4 -147 1 163 -160 -74 -214 7
487 7 -105 138 -76 -294 28 -103 58 -327 -6 109 10 -11 -107 23 62 -35 24 -125 145 -179 -196 75 -70
510 -70 71 -112 -109 -122 112 192 -39 -264 23 -232 64 -60 -102 47 -161 -52 158 -138 195 146 -193 -233 49
533 49 -14 101 12 -20 28 17 88 220 85 -126 -36 -93 178 -126 24 104 -38 -144 -42 -73 -48 -20 55 -127 -279
558 -279 -160 134 65 -223 30 -300 229 -25 158 -110 198 -110 139 -243 -5 -153 -69 264 160 -89 15
579 15 -94 97 190 93 -106 236 -21 -23 32 2 84 -91 -21 -180 61 -272 120 -71 -43 -155 -170 -100 160 -164
603 -164 -243 -234 -124 -1 -7 -41 -66 388 58 177 -81 -208 115 -113 -329 -15 19 118 39 288 -72 -36 -59 -98 -257
628 -257 -135 129 65 -20 -200 52 -107 -122 180 64 49 92 104 210 -65 -169 134 -58 -172 -59 -77 145 68
651 68 100 -177 37 -84 45 91 -80 227 15 -134 -159 84 117 -29 4 -227 -15 -172 82 -54 -69 171 -167
674 -167 -102 -70 -197 230 -17 145 -47 -44 42 -14 65 22 187 205 -155 100 -65 -53 146 -74 -132 33 5 80 389
699 389 -56 -120 -48 305 -189 -21 -116 221 3 29 208 46 21 41 6 11 -129 -47 -109 -190 -171 -246 122 142 85 108
725 108 -139 2 -91 -11 10 144 6 -129 -198 175 -72 90 108 136 -4 72 4 -124 -33 33 130 -105 83 259
749 259 -321 -55 177 208 61 35 63 -54 86 51 1 102 25 -137 167 111 -32 -165 -75 164 128 -173 -63
772 -63 12 19 -77 43 122 -151 10 107 -124 52 -35 11 -54 158 -100 69 -44 -83 91 -43 -243 -10 -82 -114 -163
797 -163 -95 92 6 -60 129 240 16 -308 4 49 -38 54 -318 57 113 199 -22 389 -83 168 72 -55 -235
820 -235 0 -180 -97 65 -11 -127 150 44 -7 218 145 54 56 156 -213 82 -83 115 -82 258 70 11 -136
843 -136 79 184 114 -182 -46 108 -226 7 90 296 -65 182 44 -105 -94 220 179 219 168 -5 0 -252 -13
866 -13 -326 -44 183 105 106 181 210 -82 -120 -61 31 88 -259 -109 285 -31 317 -145 0 -99 -94 -77 -32 -14 198 -273
892 -273 3 207 339 -51 -98 177 -123 190 180 -110 -46 -31 159 3 176 -74 78 134 41 -20 9 -107 -36
915 -36 111 136 157 -72 -83 10 5 42 -107 208 18 -83 -149 -16 95 -169 178 136 -271 -166 205 30 205 117
939 117 206 375 70 112 134 -199 -19 58 -239 -191 -27 94 192 -14 -167 212 122 114 -81 -125 41 156 39 30
963 30 245 102 89 -26 -181 66 -188 -278 -35 220 83 86 -116 128 141 -12 6 155 -116 155 25 -74 -123
986 -123 -129 125 92 272 -182 46 -368 -63 78 4 10 104 -68 28 55 74 154 121 -167 -189 -104 -85 264 -57 93
1011 93 332 101 153 -11 -61 165 -37 -55 -72 -14 247 18 -64 -148 -67 24 -35 21 8 134 -30 -13 -168 33 181
1036 181 -47 48 -64 -40 158 118 147 -74 -5 -105 -105 57 -59 125 -136 252 82 187 -131 -11 120 -124
1058 -124 57 109 -92 80 -90 -26 -233 46 88 -24 -12 -38 91 41 -352 138 222 -24 273 -181 101 -196
1080 -196 379 -133 -150 -110 65 -227 91 86 -303 -296 -146 40 57 -87 194 -161 52 -39 22 -156 28 -75 -333
1103 -333 -53 -133 48 -162 205 48 -143 178 123 226 5 -34 -29 12 158 199 76 -208 -51 109 75 -287 -21
1126 -21 165 -30 130 -48 -196 -226 -115 30 -92 118 -201 -205 -121 -234 -27 46 -144 -36 189 15 18 108 107 -173
1150 -173 24 -251 57 -19 5 85 31 -52 190 60 17 -66 65 92 -71 -188 -32 -108 -36 -85 2 -85 23 144
1174 144 1 199 210 -264 55 49 -96 -79 44 -100 -59 -146 -140 36 -60 70 207 290 12 -58 152 48 -40 -64
1198 -64 99 92 54 190 -115 2 -255 -58 66 109 115 26 -209 305 -36 196 -296 -21 -48 -63 -175 188 41
1221 41 -2 32 -90 -51 -38 340 137 -68 -234 225 -195 35 -72 21 -178 -294 -70 175 22 -98 272 -14
1243 -14 111 -87 157 282 49 -108 52 -35 117 48 40 -152 63 132 157 116 30 -178 129 128 -24 -10 50 -118
1267 -118 30 -141 -215 -162 -12 -62 16 20 -172 255 197 42 -317 94 203 -116 -5 -152 177 149 33 -22 -50
1290 -50 -65 252 -122 -94 -336 133 -102 61 -188 180 -201 -81 -23 84 -40 -9 66 33 276 -45 64 -315
1312 -315 141 -126 -254 209 -178 216 -221 -1 152 105 187 98 49 -118 192 -209 -136 44 265 96 16 266
1334 266 76 -19 192 181 81 -185 -86 -116 135 160 85 -225 245 -96 66 194 -206 155 17 253 -89 146
1356 146 19 -309 56 60 2 -201 -82 77 109 113 -116 181 68 304 -221 -211 -84 145 -107 -54 10 -96 345
1379 345 -6 -229 -143 -26 -189 -181 -148 -56 -223 -93 -5 -52 168 -126 -273 31 -211 -115 205 224 -58 215 -257
1402 -257 488 402 190 61 -85 221 17 40 62 99 23 130 -17 196 119 -275 -49 248 194 -74 -205 -210 -35
1425 -35 -61 117 -53 20 119 59 5 -466 28 162 83 132 170 15 7 -145 135 107 -95 85 -101 93 222 -12
1449 -12 -115 -19 309 138 -181 -138 259 65 133 -26 36 67 135 -178 373 59 -154 43 117 -7 -226 -168 -277
1472 -277 127 267 57 192 -165 -188 110 -260 136 -57 21 112 -215 -294 -94 6 -30 -99 19 -53 -70 -93 -8
1495 -8 -70 81 -56 -52 -54 347 -27 46 -13 -76 117 -82 1 43 146 -92 -216 -285 1 172 -34 -41 -91 -45 404 25
1521 25 1 -38 -17 109 -137 35 -52 105 -126 7 208 -198 87 45 20 87 102 -163 61 49 288 119 -175
1544 -175 -52 -123 43 -398 38 90 114 -141 324 -30 -106 135 155 -106 -99 -291 -167 230 98 217 -292 -112
1566 -112 173 -18 143 194 -63 -126 64 278 44 -170 -10 -18 50 -82 199 44 25 -201 -49 238 122 -86
1588 -86 -194 63 171 78 63 -1 118 -196 94 -189 -115 258 143 -247 -18 -72 -327 -76 116 -52 15 -12 135
1611 135 -17 -91 49 -165 31 30 -94 36 265 -38 -218 135 -29 10 104 107 -158 16 -70 25 -178 -114 -147 149
1635 149 152 -81 142 -18 40 -49 43 255 -66 35 -348 -286 2 119 58 -3 50 -349 46 260 43 61 38 -84
1659 -84 36 129 -91 220 83 -191 23 -267 33 126 -44 -154 43 -60 -90 -69 -69 -81 -189 100 274 -43 -53
1682 -53 223 144 -24 -49 104 -27 204 34 211 -117 38 128 32 -242 273 -23 27 50 -40 58 221 129 -11
1705 -11 -171 244 29 64 -62 283 133 55 -193 54 -146 181 27 -93 23 -23 298 -122 121 121 -148 29
1727 29 -198 -104 151 -526 38 -26 65 104 -14 -45 127 23 -45 -36 56 39 27 -214 -13 -6 97 -19 60 12 72 -145
1753 -145 -3 186 148 -120 -12 285 20 264 97 258 -227 -48 221 -301 -218 2 180 145 12 -54 46
1774 46 91 -399 -78 129 96 5 -54 -143 50 66 -65 81 188 93 73 -39 102 252 -5 -134 -37 166 223 -204
1798 -204 -76 -101 -42 -209 156 -78 195 99 18 -2 -216 28 19 19 82 -179 -144 -35 -61 -3 194 317 113 261
1822 261 -82 56 -48 -89 52 -33 65 199 -53 -105 5 -35 -54 -131 -16 -289 197 106 105 98 -49 103 54 -78
1846 -78 -1 -22 -116 -113 -144 143 -41 60 -155 114 22 -4 26 -243 -53 165 24 55 -77 -92 -168 -28 54 -206 319
1871 319 157 111 -104 96 210 32 -52 111 39 217 -214 -278 206 -93 -152 -87 -58 -49 49 114 -82 -125 35 -178
1895 -178 -174 -107 100 143 189 101 -33 -44 72 -142 140 26 -94 -9 -40 19 -65 -29 34 302 43 154 172 153 -136
1920 -136 221 31 -84 -60 -7 42 -39 -218 57 -11 -22 -33 -506 -74 -57 -10 -8 19 -36 48 -193 56 -56 209 -20
1945 -20 -296 -79 -168 -177 114 104 -48 68 -202 105 -126 53 247 -68 -108 -273 -210 -97 -39 101 226 53 216
1968 216 34 56 56 -188 -25 -79 -44 -59 48 177 -168 204 75 257 -140 -227 238 -32 -172 -232 -50 -124 6
1991 6 -118 -5 50 8 203 -64 63 291 124 -188 -57 148 -199 -28 370 -49 87 -147 -227 43 -95 342
2013 342 -16 -89 83 -48 94 48 -136 -102 113 126 -70 220 14 -64 -198 233 152 -197 139 -48 155 34
2035 34 -93 113 169 23 251 -247 -140 186 -1 -82 117 98 181 -78 -98 151 -118 -250 -137 -23 134 137 25
2058 25 -25 113 304 -120 -40 239 8 -338 -153 -77 -41 95 370 72 182 11 9 123 -154 172 -153 267
2080 267 -11 -224 -124 -75 -260 -35 91 18 86 114 266 -77 91 -60 -85 -123 86 217 -223 -34 36 -93
2102 -93 106 -107 171 210 78 -23 -11 -121 105 162 -134 -167 10 343 -129 142 -34 81 -329 -85 -11 -101
2124 -101 276 47 103 -196 135 -55 -31 170 -133 27 212 -70 109 -1 -425 -233 20 -3 123 -86 -5
2145 -5 -103 -52 187 -87 57 73 116 -69 -69 62 85 -6 -130 -31 -49 -196 50 256 96 53 -64 -25 -144 -174 133
2170 133 269 -46 219 144 274 162 -5 -375 -258 -79 343 126 -222 2 162 13 -104 -46 -3 -8 -280 103
2192 103 173 -24 43 0 -275 93 154 -129 -55 177 -286 -38 96 159 -51 3 -154 -5 -204 -232 -166 -75 258
2215 258 -99 60 128 -192 -133 239 -18 -25 14 -95 -71 -190 353 -63 -227 -74 -62 102 120 84 -129 -7 -101
2238 -101 99 45 -214 -149 -420 -41 64 141 -76 214 -123 43 -88 8 -92 63 87 142 -114 -152 237 69
2260 69 -284 -118 66 -209 -23 -164 47 -144 -48 -82 -207 -35 -38 70 -11 -198 -130 -132 126 -59 4 -7 -63 88
2284 88 -336 166 71 125 58 18 -104 -63 -51 65 -46 110 -143 -203 -88 142 233 147 112 104 -149 -113 -104 9 48 -266
2310 -266 -296 24 -127 -211 91 89 397 57 219 94 -51 -56 183 -20 138 -91 27 -207 138 3 -262 2
2332 2 293 221 -43 60 -100 183 -87 86 18 113 169 324 -12 168 66 -210 -163 -58 -17 88 27 72 -9 100
2356 100 -79 175 138 -189 252 26 84 -13 -159 48 -101 -52 -71 -49 -201 -81 -13 190 -59 89 75 101 0
2379 0 -48 -121 201 -36 -3 50 -289 268 27 -134 118 -27 278 -8 8 344 -182 86 -171 -31 -113 138 43
2402 43 -105 185 -131 -30 -84 -96 -71 0 104 -83 86 -103 328 -98 -61 -323 119 178 -401 210 -155 -60 -182
2425 -182 -88 53 125 -130 -80 301 207 14 143 -146 44 137 -8 -301 -71 93 -50 119 -147 181 -2 -139
2447 -139 -15 176 267 94 -114 -37 -150 337 -26 141 34 -17 -57 -199 163 271 -19 206 -74 86 -164
2468 -164 -143 56 -88 64 16 -28 -214 -227 -2 13 46 107 -39 269 196 28 53 -45 78 201 -122 -36 -61 95
2492 95 132 55 154 138 -125 315 -39 19 -205 329 -23 -34 -171 218 48 -130 -210 -107 24 -11 70 165 189 -49
2516 -49 -21 -212 285 -175 40 -39 -53 25 331 -93 167 83 43 167 31 20 -99 210 90 48 -132 -125 -184 -186 -14
2541 -14 22 19 129 46 -83 -80 58 136 63 -26 9 -97 -35 -27 16 -122 -139 118 4 -21 -191 -86 -55 -17 -125 -186 153
2568 153 -68 181 236 -84 -73 26 -18 149 66 134 0 158 -183 26 -129 -55 -77 -127 -20 24 103 -100 204 16
2592 16 -214 -149 26 -56 -92 -47 -71 -42 -208 -446 -112 -268 -168 -38 17 270 50 122 208 82 -243 165 134 -238
2616 -238 0 75 -225 -170 -7 -4 46 -2 149 224 81 84 3 55 105 284 126 94 197 0 -42 -104 -15 -11 -10 129 111
2643 111 44 250 77 -34 102 -31 -291 37 149 -18 69 -115 -164 76 166 -31 89 120 -121 -55 12 -247
2665 -247 6 -56 223 133 -275 -45 -230 -54 105 -87 -163 -23 -66 165 200 -94 218 -224 110 -19 54 2
2687 2 21 9 -77 -94 -18 212 41 62 -2 -8 -122 -152 35 107 26 -12 69 157 -35 -106 352 -211 -130 6 131 218 -117
2714 -117 92 71 76 98 -44 180 210 32 -159 -85 -111 85 -219 -167 119 185 63 20 -168 -54 -60 -53 -11 -141 -104
2739 -104 -58 1 -285 174 272 46 224 74 -73 -9 -96 176 -21 147 58 127 34 7 2 14 -17 192 310 -43
2763 -43 11 84 238 -146 -94 -9 -212 153 13 -167 -175 77 -117 -237 29 62 105 408 -38 1 208 -336 148
2786 148 59 222 173 22 -76 59 356 -78 -68 -240 -163 51 -61 156 -113 152 -32 96 -4 -49 281 188
2808 188 -173 -123 42 -221 -105 -51 -30 89 129 -140 48 138 69 -37 -71 163 -247 107 -56 52 -117 -19 168
2831 168 -48 -108 48 62 52 -54 318 -179 129 -143 113 -148 -2 -213 -68 211 10 -275 -77 55 -111
2852 -111 117 -189 -53 -55 -141 -317 -171 -15 -33 -52 195 -14 361 65 16 -67 -349 44 3 78 -152 -119 0
2875 0 -6 1 390 282 -28 19 224 24 -236 -18 74 -68 -119 200 -8 -142 -176 -36 -68 71 -25 -75 63 136 158
2900 158 90 67 154 -104 168 -296 -1 -69 -227 -87 90 194 -300 -288 353 -42 -110 -120 -88 -136 -31 189 -180
2923 -180 34 156 94 -242 -4 0 -26 169 -113 -147 81 -125 38 203 139 87 -107 56 -88 -112 257 -208 58
2946 58 -349 102 -49 -144 48 -367 206 71 303 -102 -102 -91 110 -184 -59 153 -70 60 -9 178 174 208 22
2969 22 290 -267 176 -95 90 -138 68 -108 -101 -119 -194 -154 -12 93 186 -196 157 -95 93 -169 25 39 -6
2992 -6 174 -68 15 -167 -56 189 140 22 -189 -173 -59 -303 68 105 -36 168 -171 54 -264 -46 -26 -15 -253
3015 -253 -103 136 -53 -106 -196 -137 -27 201 154 -61 -98 -82 102 165 52 10 -88 372 152 205 79 -93 -70 -255
3039 -255 129 -5 79 -143 -81 37 -84 -14 2 130 -30 -72 203 47 -92 130 -77 -30 34 58 -150 -49 -111
3062 -111 14 -160 409 208 -102 -85 -124 -33 8 -236 210 -2 -141 -178 -10 -163 32 280 132 25 -174 -170
3084 -170 -149 16 -205 198 416 89 -107 -243 278 54 -237 -87 237 291 10 -163 -241 -124 -159 -204 -113 142
3106 142 119 -93 -6 4 -122 74 -190 204 207 -46 129 -111 72 47 -10 -142 128 -59 -45 186 101 -7 89
3129 89 94 230 251 -7 215 -95 -56 -78 121 -145 242 73 -2 -81 5 83 -4 150 58 -139 -94 269 3 -210
3153 -210 -119 -103 180 -144 -276 -64 141 -37 53 -265 -157 162 -107 82 35 -137 45 68 -43 -61 251 304
3175 304 193 -126 168 -25 -71 50 -89 104 88 49 11 104 258 -46 -35 149 123 -267 -128 -37 -190 25 133
3198 133 123 119 57 -154 -293 -28 -150 194 24 -70 -75 95 33 22 18 214 -374 -99 -90 -35 147 119 76 -77 -26 -67
3224 -67 1 -111 192 87 -293 -182 80 81 7 -87 -87 -59 127 -48 182 -269 74 66 24 140 -51 140 -421 -60
3248 -60 69 12 89 -38 -17 -11 -160 42 186 -25 -225 35 -21 -122 284 60 229 47 -72 307 108 -178
3270 -178 -109 91 329 -128 -238 -133 403 5 46 30 -71 60 -211 -1 -73 64 -201 96 77 -216 -6 238
3292 238 243 -170 295 -72 131 -42 -237 164 73 -123 119 79 -70 -76 -112 -58 -17 -52 -185 163 164 -163 -4 236
3316 236 -179 -115 61 188 -7 22 -19 -314 218 -123 -22 -272 -143 -189 145 -4 119 -16 22 -54 126 -84
3338 -84 191 -67 -189 9 -56 -32 -93 -78 21 -5 149 229 64 23 -49 14 -129 252 19 137 -56 -286 171 -122
3362 -122 123 -58 52 121 193 100 -24 -71 81 -31 -71 -79 -72 -4 -117 13 178 -117 -18 -49 35 11 -267 -57 -43
3387 -43 75 -1 59 83 108 113 -426 -218 32 328 188 286 154 -153 163 115 -129 46 -114 -211 236 -74 -69 -136
3411 -136 -151 10 219 -146 -37 -17 84 158 4 -44 59 53 59 -120 -183 99 -224 -18 -18 127 -81 131 -48 173
3435 173 -48 113 36 -222 -64 -163 45 65 -44 -74 142 -50 283 164 -69 -100 76 126 238 -13 156 -46
3457 -46 -50 -161 173 -128 76 268 -238 -39 42 221 54 2 133 87 -43 144 -34 -134 -302 59 112 -31
3479 -31 -63 242 -16 77 -61 92 119 -1 39 28 171 -43 -96 -98 105 -210 -17 -130 137 -67 26 104 190 41
3503 41 193 -226 -114 189 -49 -48 145 2 -122 -200 -28 -44 129 -13 20 -53 -298 -17 83 -41 93 -98
3525 -98 85 -295 -105 265 123 -31 108 -118 -199 148 -144 362 -29 -90 31 -102 166 34 -153 -207 260
3546 260 -235 -89 -78 -190 114 -30 39 31 -19 22 -47 -1 183 171 48 260 51 31 121 5 79 36 -8 155 224
3571 224 22 283 -64 140 20 -36 -134 -87 -23 -16 -40 -173 142 244 -89 76 -142 97 19 -159 -21 140 -153
3594 -153 -72 58 3 178 -184 -58 81 10 83 14 -64 -1 47 3 2 78 194 250 -245 8 -66 171 -63 -45 -40 17
3620 17 111 91 106 -1 -154 -153 176 -71 151 149 245 -317 63 -63 -251 50 -89 145 -132 177 -269 -136 181
3643 181 -217 -11 -158 -34 -203 230 43 0 13 -23 212 280 -65 177 -2 -62 -158 101 46 310 -113 95
3665 95 30 116 133 43 207 111 -106 55 10 -120 126 -94 94 -296 -27 7 -103 -183 -91 64 116 67 142 -291
3689 -291 -59 148 140 71 -133 -15 -4 -254 -40 -283 -290 32 174 -438 -260 71 -82 -57 135 178 35 224 -41
3712 -41 -125 27 31 -116 75 -34 15 290 -57 121 -64 264 103 -172 -130 134 -162 -98 -14 -65 -126 36 -283
3735 -283 104 -41 249 -186 -177 -9 -134 223 -44 -245 -179 -60 -3 163 -120 0 -37 127 -20 -165 36 200
3757 200 2 -84 15 199 186 -138 -5 162 -180 24 106 -152 -7 85 -67 159 135 129 -33 -81 -42 -153 102
3780 102 -29 -59 42 120 -61 41 118 -184 -63 64 37 -314 -59 -69 -184 -80 -25 82 -158 -17 -62 75
3802 75 56 -136 -182 195 180 163 -50 31 -2 -180 167 179 160 -45 -139 16 -115 23 -105 -312 22 -193 41
3825 41 60 -81 -80 -143 50 72 27 20 -154 -177 -209 178 -133 -144 -33 -39 14 -88 -221 44 113 -280 -61 48 -146
3850 -146 -16 57 -8 -136 3 95 -230 187 -56 -277 15 376 90 238 26 -239 -206 -160 186 10 74 -55
3872 -55 197 82 70 156 94 -99 -124 -98 242 -89 -185 -190 -246 39 -29 266 -58 -61 -66 121 -153 140 14 31 205
3897 205 -53 -106 9 -56 -89 62 -100 69 132 41 -135 -200 -113 -65 22 -67 -6 -178 25 -23 -111 -13 69 -158 -8
3922 -8 -224 -89 -187 217 60 149 43 134 33 -14 -262 -90 -147 19 134 -58 20 111 164 142 87 298 14 -79
3946 -79 15 250 29 155 -54 -124 -252 -4 -74 -148 61 -89 54 114 -33 54 193 -87 99 50 -100 37 237
3969 237 -164 -81 157 -175 -74 -25 20 -248 -205 252 -159 -294 97 105 1 -184 -68 -60 69 262 131 153 247
3992 247 -269 -22 -130 -203 -18 120 16 0 -59 -185 -206 39 -230 -282 -36 -195 276 -65 -111 -244 -46 -77
4014 -77 20 80 -151 -329 -127 90 201 96 31 48 134 322 -179 -38 -223 268 19 -250 279 152 261 -185
4036 -185 -94 -149 -141 80 170 -204 -153 76 -144 -166 311 134 -147 -93 -183 205 -345 -73 -117 -22 177 197 -188 -142
4060 -142 47 291 123 -307 109 14 -174 -9 -191 -221 -167 76 -78 -298 110 -66 -65 -63 150 -27 -59 79 -335
4083 -335 -233 -140 -153 88 -47 227 30 158 111 60 -65 -38 -13 -55 -21 -139 5 13 152 -155 -72 -393 24 138
4107 138 46 -152 -75 -261 0 -36 -101 353 -21 -326 -174 -115 -72 7 16 102 -157 5 -54 82 42 -56 -79 -182 142
4132 142 279 -209 79 18 -17 123 114 -42 -38 -132 17 -14 -60 105 237 -247 97 -91 287 65 -56 28 118 -103
4156 -103 333 217 92 29 45 91 123 44 95 111 -2 -93 199 20 -174 -54 -97 -206 -124 59 -159 189 -104
4179 -104 99 67 -28 -77 141 87 116 -218 6 305 153 -21 358 -99 -224 11 -107 110 158 -1 51 95 -112
4202 -112 9 77 2 120 136 17 -274 -94 -76 -174 -56 -31 -159 88 24 106 -6 91 177 139 -37 -179 -165 131
4226 131 149 27 23 -31 166 108 -123 -27 -158 -167 136 115 152 -25 -330 57 116 254 35 -129 -180 -256 -299 -133 28
4251 28 123 115 -86 -111 -357 23 -49 94 323 22 -243 67 -164 152 -154 -96 111 -93 -8 -10 244 264 -51 -1
4275 -1 12 -61 101 -28 -2 -123 -28 -61 -19 113 -42 118 423 -76 -10 -21 69 108 43 -141 -37 70 86 -156 -56
4300 -56 -215 -101 -189 3 12 -217 198 -93 245 -208 -12 -255 -7 50 3 46 -217 -94 3 -39 95 -93 54
4323 54 -13 37 91 -161 -17 -37 -45 -1 156 -72 -216 110 53 -82 10 -56 207 131 57 89 -225 57 166 -225 179
4348 179 -136 -78 134 18 270 101 29 113 -1 88 127 -514 -247 -217 16 185 106 206 153 279 -145 75 180
4371 180 109 2 286 -4 8 99 -3 148 199 -209 -17 -328 -54 346 124 30 -31 -300 20 -152 32 19
4393 19 40 -43 109 197 -105 201 14 -30 75 294 -26 93 -149 115 -139 53 -96 -85 13 61 -46 -6 -108
4416 -108 -15 36 -105 51 -42 -64 100 -15 59 -126 -157 420 49 171 65 -22 87 -176 44 -36 50 -171 -31
4439 -31 104 -95 131 90 -129 -249 -77 -121 65 192 -223 116 221 -295 -157 90 -99 -136 20 160 -102
4460 -102 215 129 98 -3 9 -207 -220 -43 54 -79 346 -33 3 -40 19 -177 -272 137 106 -145 117 1 50 -110
4484 -110 -13 -231 41 -88 -236 -210 12 -55 68 95 149 59 377 -186 96 76 212 207 86 -159 -75 -158 -87 -31
4508 -31 21 161 -129 66 54 52 -208 101 37 -9 -147 -42 6 -23 -11 -261 -105 44 -41 -4 101 -151 -94 29
4532 29 -30 318 -218 8 218 58 -59 95 62 -22 68 -6 100 179 184 -25 -116 -154 43 -47 -188 5 -152 64
4556 64 -66 180 -37 -81 -88 -127 -180 -428 101 20 202 135 -64 -150 75 -87 -272 -64 20 145 -1 -88 23 97
4580 97 307 44 121 51 237 -40 -184 69 -183 2 -46 16 345 4 166 279 25 128 93 -132 -219 -184 -353
4603 -353 126 60 -84 33 47 48 106 -33 -2 268 88 22 37 -88 181 44 81 -29 7 -18 -87 88 -70 292
4627 292 201 17 -174 -76 82 -239 69 113 -46 58 -144 -52 291 3 -10 -28 5 -110 -95 -21 -2 92 -266 48
4651 48 -135 -59 -5 -161 -226 -74 136 -199 574 38 156 -45 -37 214 57 56 124 -252 -56 107 -164 38 224
4674 224 208 101 4 -118 -105 131 45 -23 -7 10 -65 45 56 73 5 17 -135 20 99 -30 -60 -127 -129 58 115 -71
4700 -71 314 171 -85 -188 274 118 76 -32 -45 -269 -12 -34 53 90 -132 145 -8 14 -124 -182 -27 -110 341
4723 341 -102 -14 -97 -336 117 18 96 93 20 91 159 -88 -106 60 36 116 17 91 -70 -14 83 187 24 18 -29 -340
4749 -340 -79 50 -97 -18 64 -3 274 -29 429 -26 -179 177 118 -272 152 -87 -270 110 -79 -102 237 85
4771 85 3 243 251 66 4 -27 -62 118 64 -149 -28 278 186 -140 -22 -206 -85 -163 42 -4 -39 -236 -22 -41
4795 -41 193 69 18 118 35 -180 -29 45 -25 52 -23 46 52 -16 -134 -81 86 -291 80 -202 -88 29 127 -213
4819 -213 -6 -17 33 232 -112 66 225 -198 -42 -176 -148 -167 53 184 36 -75 -136 -94 29 -109 -33 100
4841 100 69 39 -285 -70 194 75 -186 36 43 99 7 -24 87 121 171 0 -234 -45 42 39 179 -81 -130 -118 30
4866 30 -188 -26 -179 19 72 -256 -302 -44 -243 185 -96 -133 144 -178 -51 -132 -200 -37 -51 259 2 -124
4888 -124 -76 -100 -12 33 -6 -205 -176 -237 28 133 -83 -94 59 300 -146 -27 -106 -172 -30 292 49 -311 -91
4911 -91 -376 43 -1 180 -201 151 -210 117 131 -319 -130 49 -26 194 184 214 129 87 40 29 -24 229 74 -98
4935 -98 237 112 203 -150 -97 44 107 81 -52 152 45 -157 -89 -14 72 -120 -126 -127 125 -8 -34 -38 76 4 -1 8 -107
4962 -107 -47 119 -118 -19 200 103 -21 144 6 -12 86 -227 47 150 208 -188 -109 -49 157 5 -26 38 103 -223
4986 -223 -167 -96 -154 72 -147 62 -88 65 7 -245 -61 86 135 -86 143 -105 43 -161 -161 120 109 115 -86
5009 -86 -203 113 -243 41 9 -15 128 -276 37 21 27 -125 170 201 -267 157 52 139 6 -25 170 190 -101
5032 -101 -79 107 220 -104 -42 11 84 337 -193 8 -38 -85 89 -150 147 -111 50 124 -302 133 -91 243
5054 243 -43 98 43 -1 -62 114 145 -181 -9 -56 -127 99 -73 107 56 -42 -11 157 157 158 -163 178 -263 -105
5078 -105 -63 -58 -186 -46 437 -183 38 363 -117 -39 54 242 -111 -17 17 99 -297 -48 17 -19 -313 -79 -108 -155
5102 -155 -62 154 -197 -201 55 -114 54 -69 40 104 56 -43 -92 26 171 211 66 154 191 178 108 191 77 -9 -2
5127 -2 85 96 75 141 58 0 -115 -13 116 -62 37 225 -12 -30 100 157 -207 -158 -77 -97 -147 37 9 -53 182 -124
5153 -124 174 88 -186 169 191 -125 56 12 81 174 -96 -271 21 -47 -117 -248 -20 -55 -42 -3 -613 228 141 24
5177 24 -53 -68 -187 -18 -54 0 -28 -16 -38 64 -9 -48 2 15 -145 153 29 66 237 93 160 -5 51 -116 3
5202 3 251 -13 109 -188 10 -224 110 -205 -131 37 294 156 -92 24 -39 13 82 22 -65 -171 -28 -104 96
5225 96 111 41 134 -123 5 79 -125 48 137 -207 -93 -89 8 50 -63 289 -116 48 -29 4 -28 77 -167 54
5249 54 124 -42 -251 -219 -93 -144 -82 72 61 56 -47 -153 -51 -166 43 -248 105 110 -154 -12 73 -74 28 -128
5273 -128 -3 68 201 -78 -183 32 5 -30 -66 105 -195 26 80 29 -216 143 -104 234 -28 101 -97 -80
5295 -80 111 226 172 148 119 128 105 94 151 -161 82 -118 22 -121 267 119 -15 28 21 -86 80 -172 -63 -34
5319 -34 16 59 27 -111 189 -184 -114 -19 -50 -7 -231 61 127 27 -67 20 34 -80 -126 -50 151 155 112 -83 -40 -52
5345 -52 -61 223 -166 36 336 -60 -103 40 -466 33 -40 38 18 190 -48 44 0 187 -114 -63 239 -13 -81 -52
5369 -52 9 25 -69 260 -221 248 -124 176 -130 -65 -84 -65 0 -26 95 7 -122 57 72 -165 93 -179 40 86
5393 86 71 106 20 -32 -239 21 39 -110 109 -52 -38 -122 62 -69 -242 -14 -136 102 38 117 30 291 75 278
5417 278 -61 124 54 27 -108 154 229 150 -108 133 -248 -291 13 -152 -15 14 -291 -6 56 37 -53 -136 83
5440 83 79 -63 -209 -54 230 -123 294 201 96 -18 -330 96 -134 -45 -66 -173 176 106 -160 -324 -15 41 -11
5463 -11 146 13 -154 63 -258 27 -87 289 37 277 -4 104 220 -128 152 9 -96 134 -262 60
5483 60 3 -73 52 64 -247 31 51 -64 46 -193 -65 1 0 -17 142 -232 -69 59 -150 -36 -312 35 49
5506 49 -23 43 -58 26 75 -155 -51 177 -54 -6 15 29 -123 113 -9 -110 -271 -13 -91 -50 189 53 -217
5529 -217 -2 -171 125 -222 -142 8 46 72 -68 36 310 63 -242 44 172 -125 -14 42 -193 216 -9
5550 -9 159 -33 72 172 154 251 226 58 274 -113 8 -77 -119 30 19 81 92 215 -1 164 140 -155 41 -114
5574 -114 -468 55 218 -74 84 30 -248 -124 5 130 144 -179 -42 116 -96 -91 -89 -16 40 141 124 89 167 -126
5598 -126 97 -54 44 8 58 -40 73 173 44 84 -249 94 94 166 -59 -1 31 -36 63 -86 -13 49 269 -252 -203
5623 -203 -3 -176 -237 80 2 79 -221 -207 123 130 195 40 53 77 -48 -40 99 9 2 -13 -87 -267 22 67 228 67
5649 67 -118 -88 4 81 80 -353 -20 182 128 -57 15 -200 -96 55 -125 24 123 184 110 107 191 -109 -76 291 -10
5674 -10 -61 11 -68 33 269 41 140 19 100 7 67 69 -170 205 -13 76 31 -160 -116 48 99 -118 -161 155 92
5699 92 297 39 -110 15 -158 88 -85 44 268 78 62 -46 -135 -182 53 86 39 -139 173 46 246 68
5721 68 66 -24 -127 122 86 -159 247 142 -138 123 -210 -90 53 62 -38 -319 -73 -132 1 -228 39 -364 32
5744 32 18 2 305 -75 -56 -2 33 166 208 263 88 125 210 -70 192 19 -19 29 -115 -63 -74 -159 140 118 -324
5769 -324 172 -29 -48 -68 -104 24 34 -92 25 -3 87 56 -184 184 14 -207 -15 -45 51 -221 -149 -174 -163 90
5793 90 -167 99 114 278 158 -145 61 93 -186 92 187 95 202 94 15 8 84 36 -125 -321 232 -220 -119
5816 -119 -283 -167 -68 238 -160 91 -83 -309 178 40 264 13 -96 -315 -46 -254 109 -64 122 -44
5836 -44 -294 23 232 282 189 247 -23 59 189 27 177 74 -135 132 181 147 -110 -199 254 -137 161 67 -96
5859 -96 -70 136 -280 -247 -68 -166 62 223 241 -174 -94 7 -65 -37 83 -134 226 86 117 53 160 241 277 -20
5883 -20 5 -16 -8 82 -13 144 -46 -10 33 121 -24 -36 150 -132 27 -214 -7 46 150 68 -151 39 480 -102
5907 -102 126 208 -329 -151 52 -209 303 15 -159 22 -191 -126 80 71 184 222 165 152 68 -136 141 25 105
5930 105 -140 -13 84 -84 128 61 14 -134 122 315 259 -48 222 73 172 -188 51 109 22 12 51 -69 2
5953 2 178 -212 70 -91 142 -24 237 -107 -117 -61 -72 131 -29 0 -55 -182 72 188 401 8 -63 -154 251
5976 251 -271 165 12 -98 9 161 102 175 -19 -7 62 -38 -89 88 53 -186 136 -45 -87 -222 -73 -181
5998 -181 5 -113 -261 41 127 161 -63 -101 -37 -41 -45 41 277 -209 84 -154 -133 -84 85 12 -60 23 237 -71 152
6023 152 116 -78 145 -240 -108 44 -45 -23 49 109 280 -270 -8 -297 -293 34 169 191 9 99 -105 424 -143
6046 -143 21 -6 70 128 197 19 -260 -138 193 290 -12 -181 -169 181 -78 -130 243 107 -58 255 39 -260
6068 -260 -61 -102 92 87 33 -211 -66 -115 69 206 -83 134 -46 -104 34 -26 211 -50 -55 238 -101 77 18
6091 18 -34 15 320 -286 -6 33 10 -177 104 107 -240 99 17 -190 237 153 4 232 -99 -116 -244 -369 -232
6114 -232 149 -114 83 1 -348 -72 -139 33 120 -141 2 -54 51 -89 67 -271 131 75 -23 8 216 148 63
6137 63 -166 -107 -66 85 -1 -107 -386 -75 -49 -188 -101 64 -149 -11 194 73 -22 60 131 -198 -9 -24 53 -251
6161 -251 146 -244 55 -68 210 -88 -166 109 -127 5 -358 -73 -231 192 -253 258 258 89 -1 162 -207
6182 -207 -245 44 -92 -134 -61 62 16 38 -102 -219 143 1 -111 -156 126 58 -203 -115 28 40 87 -20 282
6205 282 125 -271 -78 -116 45 -164 -235 -46 -65 -50 60 107 181 -76 -52 -212 -229 -33 -3 -348 147 -22 -100
6228 -100 422 140 -313 26 -200 263 -41 -193 104 111 -40 24 -178 45 45 23 -258 -246 38 84 76 -303 -63
6251 -63 71 178 125 157 101 33 18 264 -101 -27 -119 -124 -93 125 -84 -122 410 -88 211 108 -119 242 -258 230
6275 230 160 -170 24 -23 0 84 -102 195 76 -6 2 -125 -179 -105 67 182 139 256 -44 159 2 5 -38 50 41
6300 41 37 -149 17 -81 -15 -88 -32 196 125 247 -33 -168 253 -64 -285 55 68 73 130 42 21 26 69 18 6 42 112
6327 112 145 80 -29 -24 -115 22 -163 -112 46 -259 46 -93 -111 105 -119 60 240 -15 -213 -77 239 290 291
6350 291 152 -58 17 78 27 86 217 -133 -177 -137 67 171 18 -82 -86 -46 110 52 -284 -34 52 -69 115 65
6374 65 107 -45 86 84 203 -103 -300 96 -130 112 8 -208 78 91 82 45 -196 -25 -23 -143 -150 262 -18 86
6398 86 141 143 -172 93 -350 -173 -10 -33 -54 -106 9 -5 -231 -15 -42 -253 48 85 29 -34 118 100 -7 49 19
6423 19 -132 189 -29 -164 34 -80 104 -3 -300 53 -193 -86 -49 -392 69 -48 67 -142 -27 -19 -169
6444 -169 368 -123 -108 183 -14 -121 132 45 62 82 -44 -131 -1 121 136 107 -239 -73 46 -2 65 9 232
6467 232 326 -126 -212 -50 -81 502 162 -116 35 -26 -55 -88 35 80 -281 147 138 99 182 366 111 -137 161 -159
6491 -159 -179 213 140 -218 -78 61 109 -32 0 -51 93 -27 -128 69 -256 50 186 -224 -95 142 182 197
6513 197 -87 89 37 126 -259 -14 186 77 134 -112 -30 145 215 -28 4 140 -221 -77 -199 -67 83 84 -165
6536 -165 16 108 252 138 -116 25 -4 116 -5 -238 -441 86 32 -91 21 -130 -253 -92 210 -9 293
6557 293 285 -137 133 211 -61 -102 -9 216 -54 201 74 -174 47 67 -11 69 -72 -58 128 250 2 -91 276
6580 276 -83 152 -45 158 -70 54 52 -117 228 89 -285 185 -153 -158 347 -145 70 63 29 123 -137 138 -88
6603 -88 86 19 128 111 -124 151 -331 -194 -117 105 56 154 -161 10 -73 -47 -36 -2 -78 44 -74 92 47 73
6627 73 18 -33 -111 78 -175 111 200 -244 150 42 -54 48 190 -160 -97 206 271 -253 -119 57 62 -21 48 167
6651 167 -179 213 66 -77 240 -15 173 72 -119 164 -127 -136 167 138 61 130 -116 179 -7 -32 45 225
6673 225 -115 164 -45 123 195 167 -10 -36 207 -38 -61 -92 87 33 17 151 -238 176 -119 -8 195 85
6695 85 229 72 -128 195 210 73 231 -121 -130 46 52 19 -148 149 -195 -183 -65 -53 70 -140 61 -24 64 -140
6719 -140 92 21 -135 61 -206 -242 -91 221 54 -164 342 -139 -146 64 -146 120 -10 -121 -129 -63 85 217
6741 217 -85 28 227 68 -56 -122 219 -45 -7 29 27 -38 -174 -51 -209 65 -208 -149 15 206 -160 9
6763 9 13 123 126 219 -8 -129 -23 77 -143 30 -72 -287 -32 53 133 -292 -47 -150 206 53 -219 -190 -2
6786 -2 -187 -173 -27 -22 -51 225 -97 132 19 -116 126 0 54 -89 -69 -47 -134 -155 -203 11 -127 -21 -29 -177 -354
6811 -354 -1 36 42 -77 -145 237 58 179 -31 -193 -46 185 -162 2 -41 -170 -127 203 13 -110 53 -203
6833 -203 93 -285 88 -125 104 -236 -315 55 48 -183 67 41 -221 34 233 262 -176 -49 -114 125 223 11
6855 11 -231 8 26 -50 174 146 -286 -206 -152 60 67 22 61 -165 129 -45 -84 -300 -57 204 150 -193 328 223
6879 223 6 7 67 -1 -208 -51 -106 -100 -363 -75 12 199 47 92 -15 50 47 162 83 -53 52 101 -71 314 143
6904 143 129 14 -70 262 -1 -160 -25 -110 88 -80 -18 -59 41 -213 -236 -201 -151 -145 123 162 -7 77 96 18 -2
6929 -2 95 -40 -16 -38 75 125 -47 98 -158 -199 -137 -96 48 129 38 17 128 20 155 -69 276 -33 -123 -86 -139
6954 -139 -207 -87 -312 -168 -14 -367 -102 193 59 91 113 29 227 -207 -10 128 -42 -19 8 5 -124 208 -121
6977 -121 -279 120 113 59 310 -147 149 309 62 -53 -73 -132 30 117 58 92 48 143 197 219 142 -35 -124 -191 -161
7002 -161 -134 -287 -45 -15 38 190 169 72 -356 -28 128 77 -130 -185 304 193 274 128 109 61 156 191 27 375
7026 375 400 178 74 -6 54 -133 154 72 -130 -18 -106 -15 -92 -134 -215 52 -62 82 131 55 -211 7 29 -186
7050 -186 139 40 -152 95 42 206 -130 -19 110 -105 -82 71 46 -409 64 -27 -7 -10 117 -121 4 92 -138
7073 -138 -2 7 -90 -2 64 -33 -68 -76 -243 87 300 -98 126 -32 -113 9 -156 25 -14 -10 -443 -14 -266 -34
7097 -34 51 -245 -29 73 42 5 -12 -69 240 -548 130 -205 7 -144 122 -155 34 -116 203 25 40 61 411
7120 411 104 -71 -144 262 178 114 127 58 -96 3 143 99 166 20 18 252 93 252 82 -24 47 119 -112 -44
7144 -44 -39 -70 109 170 12 236 89 -88 74 -74 154 161 -51 44 -118 92 148 -146 -96 -46 0 47 -9 272 -102
7169 -102 2 -137 96 -287 -264 181 153 0 33 90 37 86 -164 -228 63 41 115 -85 -150 -40 -293 0 134
7192 134 87 24 117 139 185 54 -139 98 -59 184 91 -130 -81 209 -8 49 52 14 179 123 206 -43 163 108 -142
7217 -142 59 229 79 -108 -159 73 -96 68 148 -48 -53 -62 -45 44 -132 22 -123 20 -38 175 71 -166 -61
7240 -61 106 -82 41 -68 -2 -25 -194 121 109 -58 -16 -59 -73 -281 -258 -79 108 276 -134 -147 43 25 195
7263 195 -165 -176 2 247 42 -89 111 -267 237 52 -46 -41 240 182 86 23 -140 -114 67 65 178 -3 11 139
7287 139 47 43 -117 -58 -170 -95 92 104 -16 -279 93 201 -11 -289 120 90 -221 103 -189 1 297 -133
7309 -133 -58 -28 40 -60 -167 29 -7 -203 52 171 113 -133 69 -102 -3 57 22 240 149 -39 8 -182 -198 -142
7333 -142 43 39 75 119 4 28 14 -6 -239 -104 -130 -35 130 239 213 -48 60 71 -29 134 157 -130 -36 89
7357 89 -13 14 -143 21 39 99 -22 -180 184 63 51 -147 24 -175 -4 -216 -4 254 103 70 -33 113
7379 113 23 7 43 15 -205 205 -79 15 -233 -19 146 -4 175 -199 76 -57 57 -81 45 178 69 -174
7401 -174 113 363 339 13 109 -24 -30 -14 161 -12 -280 7 -110 -175 20 -187 13 185 -170 38 81 131 -33
7424 -33 173 -20 -56 -30 238 -384 13 -209 187 -116 -55 -76 -36 -140 -139 -38 -29 -16 -143 245 -3 -157 -54 25
7448 25 -86 286 81 -150 136 50 225 66 50 -87 93 138 1 20 62 3 -103 -18 -11 -4 11 87 0 138 15
7473 15 19 46 99 109 61 -76 104 -118 -136 -312 37 -161 24 2 -124 -68 -68 197 -109 -214 27 184 -271 -156
7497 -156 -19 86 237 84 -181 -23 -49 -95 -209 -270 -182 81 29 25 -15 42 59 152 -215 -44 247 97 11 -2
7521 -2 236 -6 -58 -267 -34 -51 -5 -16 -71 -89 95 -106 96 -175 42 186 185 64 -169 -59 -133 -87 116 -141
7545 -141 176 -200 -112 -76 -108 -31 171 -170 -216 176 -308 -66 -25 16 -166 -135 -136 -70 -167 -81 -169 -312 -74 16 -233
7570 -233 -136 -405 -56 192 10 -26 105 358 -162 211 140 -89 68 277 7 -124 121 133 88 -108 -5 -54
7592 -54 -297 111 59 80 105 -285 -204 -252 62 21 97 -13 -46 62 22 -443 14 -8 -57 129 -10 -94 30 17 -95
7617 -95 45 -26 -73 48 226 82 67 98 -4 81 201 -82 27 -69 -81 -119 66 109 25 65 58 223 102 -18 17
7642 17 159 -129 274 481 -152 -12 -92 75 139 22 20 41 93 -18 -143 14 104 126 35 -109 40 -152 -182 -86
7666 -86 -287 -23 52 96 -60 38 -61 95 -98 -178 54 -29 -382 -1 -227 -179 -28 247 -221 -28 57 5 48 54
7690 54 357 175 236 22 218 -10 -155 -50 -176 163 48 -71 -237 81 -97 224 -13 -30 -14 124 66 -115
7712 -115 54 58 -28 -78 -106 -39 48 -55 -45 -46 2 -107 -78 -28 79 -146 241 -13 -138 -30 -220 178 -86 -52 120
7737 120 118 269 130 -18 -29 -44 102 105 184 -172 34 205 -131 132 30 204 54 259 -11 -140 97 -282
7759 -282 105 -35 -56 114 -202 -95 -92 -108 -56 -205 -37 -29 16 -149 -159 -69 -35 410 -242 -156 247 -72 -244 52
7783 52 -124 5 -116 -83 -134 -236 -7 34 14 195 105 -120 -89 -182 43 -153 -27 214 -151 105 -20 201 77
7806 77 -87 150 -235 166 65 16 134 -116 -43 -107 176 92 -61 73 208 146 14 253 57 195 45 -328
7828 -328 32 -36 252 120 63 -99 100 -83 -87 94 -138 -97 142 105 -111 245 258 -10 -130 -154 -22 17 59
7851 59 280 -349 213 73 119 -142 -165 -77 144 -68 -16 350 -224 -119 -105 30 -67 -94 -72 66 70 -15 -246 100
7875 100 -41 -221 -21 175 272 75 214 -15 97 -154 -54 -29 208 -114 11 -93 17 -176 68 -8 104
7896 104 -84 -85 -119 -209 38 -3 -39 -94 -209 80 245 153 114 14 218 -29 298 -88 171 -261 -416 -21 -16 108
7920 108 -106 3 34 111 51 14 204 -171 -259 -51 112 305 -126 244 -151 -19 43 20 -234 72 32 -164 -87
7943 -87 7 332 -40 57 -198 31 96 312 -121 -163 -378 -32 66 -118 -278 -105 -107 -249 -229 1 -82 -21 -99 -183
7967 -183 -6 -6 98 -108 229 -12 -270 -11 -108 18 9 -26 107 -61 -264 74 -123 -50 -87 172 -53 157 47
7990 47 -45 55 -134 -62 -28 -69 -176 -336 330 -133 120 -40 -131 45 -4 -15 -220 -127 -1 -91 -121 96 32 37 2
8015 2 -66 -40 227 -169 67 4 -60 -93 16 61 -93 11 135 38 71 -173 227 -162 -113 -53 20 14 159 -84 83
8040 83 19 -82 -6 -127 128 183 261 -11 -287 -76 143 -37 -190 51 -23 -199 152 -153 -312 113 148 -262
8062 -262 54 58 44 -96 -12 -81 -114 22 -86 -156 -97 -32 -37 -134 176 292 18 47 -131 96 -17 -166 93 137 270
8087 270 -261 83 -350 -30 146 49 169 -196 -104 62 -149 -55 -15 -230 -32 114 96 -9 -15 266 -89 68
8109 68 172 -111 206 316 -107 -195 365 20 -250 -92 125 208 92 43 236 -89 214 66 22 179 72 79
8131 79 52 -89 -119 34 177 38 -159 -29 133 -261 -237 30 97 -264 -380 -229 -42 79 -265 -97 73 44
8153 44 105 116 -137 113 -38 -67 -4 90 271 24 -121 146 70 -197 304 -223 83 65 145 -120 2 -65 -12 31
8177 31 211 2 91 80 -133 74 -211 15 -80 66 -49 -132 -75 76
8191G6
##END NTUPLES=NMR FID
##END=
