##TITLE=1H_DE-1
 CDCl3
 8 sc, 
 11.5.2023
##JCAMPDX= 6.0         $$ Bruker NMR JCAMP-DX V2.0
##DATA TYPE= NMR FID
##DATA CLASS= NTUPLES
##ORIGIN= UXNMR, Bruker Analytische Messtechnik GmbH
##OWNER= root
$$ XWIN-NMR		Version 3.5
$$ Thu May 11 14:53:53 2023 Russian Standard Time (UT+4h)  she@DPX200
##.OBSERVE FREQUENCY= 200.13135
##.OBSERVE NUCLEUS= ^1H
##.DELAY= (6, 6)
##.ACQUISITION MODE= SIMULTANEOUS
##.ACQUISITION SCHEME= undefined
##.AVERAGES= 16
##.DIGITISER RES= 18
##SPECTROMETER/DATA SYSTEM= spect
##.PULSE SEQUENCE= zg30
##.SOLVENT NAME= CDCl3
##.SHIFT REFERENCE= (INTERNAL, CDCl3, 0, 15.7039)
##AUDIT TRAIL= $$ (NUMBER, WHEN, WHO, WHERE, WHAT)
$$ ##TITLE= Audit trail, XWIN-NMR		Version 3.5
$$ ##JCAMPDX= 5.01
$$ ##ORIGIN= Bruker BioSpin GmbH
$$ ##OWNER= she
$$ F:/spectra/data/she/nmr/H-F/1/audita.txt
$$ ##AUDIT TRAIL=  $$ (NUMBER, WHEN, WHO, WHERE, WHAT)
(   1,<2023-05-11 14:52:50.79 +0400>,<she>,<DPX200>,
      <created by zg, POWCHK disabled, PULCHK disabled
       configuration hash MD5:
       00 E9 B6 7A A2 85 ED C7 34 08 36 98 17 FE 4E 26
       data hash MD5: 16K
       DA 73 3B 51 48 41 42 CA A0 61 62 09 8C 97 B9 3C>)
$$ ##END=
$$ 
$$ hash MD5
$$ AC A4 40 CD E9 34 CB AD C8 91 6E FA B4 75 7C 37
##$RELAX= 
##$RELAX= 
##$RELAX= 
##$RELAX= 
##$RELAX= 
##$RELAX= 
$$ Bruker specific parameters
$$ --------------------------
##$DU= <F:/spectra>
##$EXPNO= 1
##$NAME= <H-F>
##$PROCNO= 1
##$TYPE= <nmr>
##$USER= <she>
##$AMP= (0..31)
100 100 100 100 100 100 100 100 100 100 100 100 100 100 100 100 100 100 
100 100 100 100 100 100 100 100 100 100 100 100 100 100 
##$AQSEQ= 0
##$AQ_mod= 1
##$AUNM= <au_zg>
##$AUTOPOS= <>
##$BF1= 200.13
##$BF2= 200.13
##$BF3= 200.13
##$BF4= 200.13
##$BF5= 200.13
##$BF6= 200.13
##$BF7= 200.13
##$BF8= 200.13
##$BYTORDA= 1
##$CFDGTYP= 0
##$CFRGTYP= 5
##$CHEMSTR= <none>
##$CNST= (0..31)
1 1 145 1 1 1 1 1 1 1 1 1 1 1 1 1 1 1 1 1 1 1 1 1 1 1 1 1 1 1 1 1 
##$CPDPRG= <>
##$CPDPRG1= <>
##$CPDPRG2= <>
##$CPDPRG3= <>
##$CPDPRG4= <mlev>
##$CPDPRG5= <mlev>
##$CPDPRG6= <mlev>
##$CPDPRG7= <mlev>
##$CPDPRG8= <mlev>
##$CPDPRGB= <>
##$CPDPRGT= <>
##$D= (0..31)
0 1.2 0 0 0 0 0 0 0 0.06 0 0.03 0 0 0 0 0.0002 0 0 0 0 0 0 0 0 0 0 0 0 
0 0 0 
##$DATE= 1683802370
##$DBL= (0..7)
120 120 120 120 120 120 120 120 
##$DBP= (0..7)
150 150 150 150 150 150 150 150 
##$DBP07= 0
##$DBPNAM0= <>
##$DBPNAM1= <>
##$DBPNAM2= <>
##$DBPNAM3= <>
##$DBPNAM4= <>
##$DBPNAM5= <>
##$DBPNAM6= <>
##$DBPNAM7= <>
##$DBPOAL= (0..7)
0.5 0.5 0.5 0.5 0.5 0.5 0.5 0.5 
##$DBPOFFS= (0..7)
0 0 0 0 0 0 0 0 
##$DE= 6
##$DECBNUC= <off>
##$DECIM= 32
##$DECNUC= <off>
##$DECSTAT= 4
##$DIGMOD= 1
##$DIGTYP= 9
##$DL= (0..7)
0 120 120 120 120 120 120 120 
##$DP= (0..7)
150 150 150 150 150 150 150 150 
##$DP07= 0
##$DPNAME0= <>
##$DPNAME1= <>
##$DPNAME2= <>
##$DPNAME3= <>
##$DPNAME4= <>
##$DPNAME5= <>
##$DPNAME6= <>
##$DPNAME7= <>
##$DPOAL= (0..7)
0.5 0.5 0.5 0.5 0.5 0.5 0.5 0.5 
##$DPOFFS= (0..7)
0 0 0 0 0 0 0 0 
##$DQDMODE= 0
##$DR= 18
##$DS= 0
##$DSLIST= <SSSSSSSSSSSSSSS>
$$ [...]
##$SUBNAM1= <"">
##$SUBNAM2= <"">
##$SUBNAM3= <"">
##$SUBNAM4= <"">
##$SUBNAM5= <"">
##$SUBNAM6= <"">
##$SUBNAM7= <"">
##$SUBNAM8= <"">
##$SUBNAM9= <"">
##$SW= 18.05172834244
##$SWIBOX= (0..15)
0 0 2 0 0 0 0 0 0 0 0 0 0 0 0 0 
##$SW_h= 3612.71676300578
##$TD= 16384
##$TD0= 1
##$TE= 0
##$TE2= 300
##$TE3= 300
##$TEG= 300
##$TL= (0..7)
0 120 120 120 120 120 120 120 
##$TP= (0..7)
150 150 150 150 150 150 150 150 
##$TP07= 0
##$TPNAME0= <>
##$TPNAME1= <>
##$TPNAME2= <>
##$TPNAME3= <>
##$TPNAME4= <>
##$TPNAME5= <>
##$TPNAME6= <>
##$TPNAME7= <>
##$TPOAL= (0..7)
0.5 0.5 0.5 0.5 0.5 0.5 0.5 0.5 
##$TPOFFS= (0..7)
0 0 0 0 0 0 0 0 
##$TUNHIN= 0
##$TUNHOUT= 0
##$TUNXOUT= 0
##$USERA1= <user>
##$USERA2= <user>
##$USERA3= <user>
##$USERA4= <user>
##$USERA5= <user>
##$V9= 5
##$VALIST= <valist>
##$VCLIST= <CCCCCCCCCCCCCCC>
##$VD= 0
##$VDLIST= <DDDDDDDDDDDDDDD>
##$VPLIST= <PPPPPPPPPPPPPPP>
##$VTLIST= <TTTTTTTTTTTTTTT>
##$WBST= 1024
##$WBSW= 4
##$XGAIN= (0..3)
0 0 0 0 
##$XL= 0
##$YL= 0
##$YMAX_a= 62015
##$YMIN_a= -86571
##$ZGOPTNS= <>
##$ZL1= 120
##$ZL2= 120
##$ZL3= 120
##$ZL4= 120
##$ABSF1= 10
##$ABSF2= 0
##$ABSG= 5
##$ABSL= 3
##$ALPHA= 0
##$AQORDER= 0
##$ASSFAC= 0
##$ASSFACI= 0
##$ASSFACX= 0
##$ASSWID= 0
##$AUNMP= <proc_1d>
##$AZFE= 0.1
##$AZFW= 0.1
##$BCFW= 1
##$BC_mod= 2
##$BYTORDP= 1
##$COROFFS= 0
##$CY= 11.3945322036743
##$DATMOD= 1
##$DC= 2
##$DFILT= <>
##$DTYPP= 0
##$F1P= 15.7292609196834
##$F2P= 12.9074282941183
##$FCOR= 0.5
##$FTSIZE= 0
##$FT_mod= 4
##$GAMMA= 1
##$GB= 0.15
##$INTBC= 1
##$INTSCL= 1
##$ISEN= 128
##$LB= 0.24
##$LEV0= 0
##$LPBIN= 0
##$MAXI= 10000
##$MC2= 0
##$MEAN= 0
##$ME_mod= 0
##$MI= 1.114404
##$NCOEF= 0
##$NC_proc= 0
##$NLEV= 6
##$NOISF1= 3.799351
##$NOISF2= 2.8
##$NSP= 1
##$NTH_PI= 0
##$NZP= 0
##$OFFSET= 15.70392
##$PC= 1
##$PHC0= -19830.8
##$PHC1= 21.4008
##$PH_mod= 1
##$PKNL= yes
##$PPARMOD= 0
##$PSCAL= 0
##$PSIGN= 0
##$REVERSE= no
##$SF= 200.130013532006
##$SI= 16384
##$SIGF1= 3
##$SIGF2= 2
##$SINO= 400
##$SIOLD= 16384
##$SREGLST= <1H.CDCl3>
##$SSB= 0
##$STSI= 0
##$STSR= 0
##$SW_p= 3612.71676300578
##$SYMM= 0
##$S_DEV= 0
##$TDeff= 0
##$TDoff= 0
##$TI= <>
##$TILT= no
##$TM1= 0
##$TM2= 0
##$TOPLEV= 0
##$USERP1= <user>
##$USERP2= <user>
##$USERP3= <user>
##$USERP4= <user>
##$USERP5= <user>
##$WDW= 1
##$XDIM= 8192
##$YMAX_p= 0
##$YMIN_p= 0
$$ End of Bruker specific parameters
$$ ---------------------------------
##NTUPLES= NMR FID
##VAR_NAME=  TIME,          FID/REAL,        FID/IMAG
##SYMBOL=    X,             R,               I
##VAR_TYPE=  INDEPENDENT,   DEPENDENT,       DEPENDENT
##VAR_FORM=  AFFN,          ASDF,            ASDF
##VAR_DIM=   8192,          8192,            8192
##UNITS=     SECONDS,       ARBITRARY UNITS, ARBITRARY UNITS
##FACTOR=    0.0002768,     1,               1
##FIRST=     0,             0,               0
##LAST=      2.2672688,     0,               0
##MIN=       0,             -86571,          0
##MAX=       2.2672688,     62015,           0
$$ Real data points
##PAGE= N=1
##DATA TABLE= (X++(R..R)), XYDATA
0 0 0 0 0 0 0 0 0 0 0 0 0 0 0 0 0 0 0 12 -16 16 -16 16 -16 27 -32 32 -34 48 -49 63 -65 80 -87 98 -113 128 -141
37 -141 159 -178 200 -221 246 -272 302 -334 372 -405 450 -495 544 -601 660 -728 806 -889 982
56 982 -1093 1215 -1359 1528 -1730 1981 -2293 2700 -3252 4050 -5310 7624 -13265 62015 27031
71 27031 -45138 34227 3826 -21113 32297 33728 -33944 -314 24159 -18798 -17250 11424 -33631
84 -33631 -36417 17265 3067 -43084 -17039 -2456 -21025 5650 33159 -6744 -20949 17879
96 17879 17494 -3960 18552 18166 -16954 5973 48098 17182 -10535 8973 -1155 -17836 14183
109 14183 12361 -29463 -14697 8468 -18049 -11920 14902 -18467 -32102 12408 8910 -22465 -2617
122 -2617 2964 -17831 12114 35979 -540 -9676 14827 3166 -1163 23634 9185 -18155 1298
135 1298 15785 44 1633 5931 -14362 -12947 9484 1378 -16532 -7928 -2930 -10384 1578 12224
149 12224 -6528 -13615 4726 6744 -2080 6708 2669 -12850 2387 20058 3904 -3237 7176
162 7176 -3452 -7422 11770 5846 -14716 -2974 5203 -6605 2490 10529 -10003 -10294 9623 2010
176 2010 -8082 3171 -657 -10161 6099 12142 -3114 -2771 4327 -2734 -1415 8126 -1975 -10789
190 -10789 -588 3566 -1844 800 2009 -5944 -4382 5122 1844 -4935 -682 924 -1293 4266 9035
205 9035 323 -2066 5580 3462 -582 3772 369 -6724 914 5650 -2633 -2630 1295 -5458 -5367 2132
221 2132 -3066 -8703 -2198 -961 -3941 2005 3366 -3545 -69 5518 1054 992 4971 1116 86 6376
237 6376 5606 1504 3004 3081 -692 647 1103 -3249 -4582 -2415 -2518 -3960 -2252 -2144 -4474 -3448 -1814
254 -1814 -3091 -3567 -1513 -975 -1120 2324 3870 2012 3120 5126 3945 3109 4262 2280 1233 2917
270 2917 2488 764 1491 793 -1489 -1697 -1375 -4131 -4875 -3809 -4000 -4270 -2633 -2391 -2400 -1056 -794 -1344 -20
289 -20 282 188 1569 2568 2689 3872 4050 3590 3327 2975 2120 758 736 342 -567 -438 -891 -1269 -1490 -1734
309 -1734 -2698 -3143 -3086 -2757 -3411 -2422 -1547 -1793 -810 167 315 586 1336 927 867 1853 1926 1667 2150 2814 2376
330 2376 2543 2302 1066 -10 -13 -705 -1069 -1086 -809 -1273 -1095 -828 -1724 -1849 -1362 -1970 -2562 -2087 -1020 -1023 -738
351 -738 533 1105 668 1148 1407 495 1134 1507 574 756 2423 2194 1055 1972 1579 -90 194 388 -1143
370 -1143 -1381 -169 -1026 -1725 -46 -870 -2153 -1028 -922 -2340 -1693 -435 -1797 -1579 567 1112 -131
387 -131 1606 1775 -294 928 2729 950 93 2027 1594 479 2870 2297 -883 238 1814 -845
403 -845 -1333 854 -2161 -2723 608 -42 -3313 -1090 -834 -3506 -1351 696 -2454 -2826 1143 606 -640
420 -640 2843 1999 -1282 1690 4271 575 253 2677 -46 -313 4223 2424 -2182 -113 1534 -1981
436 -1981 -361 2174 -3465 -4975 1063 105 -3483 -336 -534 -5060 -309 3450 -2418 -3537 1729 -879
452 -879 -1575 5190 3242 -3225 988 5167 -219 1632 4327 -2529 -2443 6167 3072 -3071 1072 585
468 585 -4991 726 4328 -4984 -5598 1441 -1522 -3181 2840 -1344 -7719 52 4758 -2230 -1508 2658
484 2658 -3112 -1801 7882 3660 -3996 1560 3568 -1443 3768 6358 -4194 -4279 5915 2731 -2046
499 -2046 2935 -933 -7818 1810 6371 -4893 -5069 760 -4254 -3096 6814 -170 -9255 74 4143
514 4143 -2346 1915 4503 -6422 -3916 9502 3957 -2980 3308 891 -4513 6281 9022 -4395
528 -4395 -4758 4022 -622 -831 6662 -1922 -9999 697 5456 -3669 -2074 806 -8271 -3867 8266
543 8266 1107 -7703 136 1405 -3723 5446 6653 -7430 -4816 8113 2752 -493 6116 -359 -7453
558 -7453 5954 9380 -4175 -2960 2726 -4768 -685 9760 -1316 -11095 362 2865 -4323 2263
572 2263 2136 -11345 -4766 8127 1012 -4441 2151 -2519 -5415 7355 8044 -5534 -3638 4718 -46
587 -46 2141 9001 -1205 -8127 3768 6996 -1538 1103 1800 -7954 -2519 8784 65 -7622 -294
602 -294 -1003 -5160 4784 4292 -9619 -5316 5193 -543 -1860 5520 -2266 -7508 6070 7642 -3303
617 -3303 -453 3240 -3849 1046 10111 -677 -6601 3509 2924 -2470 4738 2611 -9109 -2582 6113
632 6113 -1176 -3730 1265 -4075 -5286 4962 3534 -6162 -3082 1923 -2588 1088 5671 -2541 -5977
647 -5977 4081 5204 -919 2833 2373 -4988 366 8483 925 -3749 2056 -341 -2850 4890 3228
662 3228 -7039 -2963 3093 -2256 -1159 3164 -4476 -6616 3542 2913 -4064 -513 459 -4554 888
677 888 6343 -1670 -3159 2950 1286 -431 5351 2245 -4087 934 4765 612 -156 2384 -1635 -2315
693 -2315 3460 1685 -4147 -1637 253 -2933 -582 2149 -2751 -4559 1209 1011 -2222 1126 372 -3530
709 -3530 518 4013 -550 -1477 2894 228 -294 4588 2600 -2565 599 2808 -660 801 2642 -1580
725 -1580 -2165 2363 588 -2460 -22 -1087 -3428 -463 953 -2417 -2276 380 -1011 -844 1461 339
741 339 -1818 459 1905 447 566 2107 315 114 2554 2059 -293 695 1349 -107 38 1269 -1079
758 -1079 -1967 505 -158 -1938 -368 -503 -2653 -918 -65 -1891 -1477 390 -368 -898 1202 402 -722
775 -722 752 1396 -37 862 1601 502 932 2132 1178 589 947 315 -702 110 254 -809 -760 -312 -571
794 -571 -984 -629 -1339 -1435 -1146 -692 -811 -967 -100 15 -221 128 430 953 501 786 311 860 1037 1246 997
815 997 1295 739 433 900 405 -171 -156 -639 -920 -840 -510 -690 -787 -590 -939 -915 -922 -558 -1042 -769 -130 -120 122
838 122 38 434 353 636 658 1087 787 553 1044 727 774 847 238 494 576 474 54 -476 -786 -588 -573 -671 -809
861 -809 -737 -797 -965 -673 -618 -870 -549 -598 -377 287 412 302 558 1084 620 848 633 1057 564 769 616 484
883 484 286 310 66 -438 322 -438 -733 -440 -619 -1522 -699 -587 -1243 -981 -117 -885 -636 -48 -455 -751 470
904 470 493 175 662 1350 770 993 1589 917 178 618 1157 63 603 339 -772 -349 996 -371 -1549
923 -1549 -1026 -1127 -1691 -676 -173 -1814 -896 227 -923 -731 958 42 -1273 951 1954 -329 1104
940 1104 1393 21 687 2560 759 -920 1189 1245 -614 906 979 -1928 -1435 1094 -589 -1763 -235
957 -235 -1649 -2276 462 436 -2610 -1084 516 -1604 -208 2058 -427 -1538 1171 1559 -28 1288
973 1288 1755 -1301 583 3464 698 -1321 1161 -135 -1783 1623 1355 -2964 -1166 1023 -1193 -208
989 -208 1289 -2610 -3729 1278 1442 -2285 -200 399 -2556 209 3818 -580 -2226 1793 891 -628
1005 -628 3200 1678 -2720 -84 3679 198 -289 1786 -1867 -2154 2853 1848 -2754 -897 709 -1842
1021 -1842 -55 2784 -2484 -4183 987 1067 -1613 1365 525 -4292 -142 4007 401 -1423 1772 -766
1037 -766 -1567 4549 3087 -3273 -297 2633 -711 876 3312 -2633 -3792 2815 1814 -2310 306
1052 306 -259 -4391 222 4229 -2205 -3285 840 -820 -1767 3376 885 -4894 -159 3380 -571 276
1068 276 2519 -1920 -2357 4513 2993 -2625 328 1282 -1706 1823 4634 -2689 -3773 1925 1112 -1761
1084 -1761 1744 -424 -5407 -589 3895 -1564 -2476 765 -2315 -2255 4266 1602 -4299 -374 2235 -823
1100 -823 1862 3883 -2905 -2744 4266 2321 -1281 2055 74 -3694 1800 4717 -1584 -2399 926 -1584
1116 -1584 -1414 3124 -297 -5461 -1025 2118 -1453 312 1609 -3236 -2540 3877 1671 -2285 478
1131 478 757 -2043 2685 4252 -1896 -2021 2763 515 -659 2871 -251 -3951 917 3164 -1216 -1277
1147 -1277 532 -2861 -1531 3112 -292 -4143 -440 333 -1513 1002 2297 -3221 -2080 3022 988
1162 988 -615 1609 -228 -2262 2367 4062 -921 -378 1515 -1022 56 3579 -100 -3227 467
1177 467 1390 -1224 229 815 -3395 -1665 2606 -92 -2153 -37 -453 -2140 1309 1871 -1945 -1315
1193 -1315 1754 34 348 2476 138 -1758 1269 2300 -427 319 1022 -1511 -24 2672 24 -1767
1209 -1767 881 223 -1387 877 369 -2352 -1190 539 -713 -1428 245 -1020 -1787 936 857 -607
1225 -607 -214 616 -673 446 2172 283 -1031 1206 1145 -146 1343 1373 -1029 -170 1747 -27 -1105
1242 -1105 386 -223 -1461 640 664 -1715 -1035 201 -865 -936 530 -807 -1456 115 411 -650 82
1259 82 603 -702 167 1361 196 -37 1131 433 109 1288 693 -744 -248 394 -28 -600 -59 -748
1277 -748 -992 -519 -305 -1101 -882 -500 -702 -740 100 -158 -908 69 89 -271 524 770 262 605 1138 470 424
1298 424 819 391 440 581 593 -236 495 294 -503 -703 -12 -754 -894 -586 -719 -1388 -371 -428 -926 -319 -242
1319 -242 -660 -136 356 -141 199 369 469 490 648 775 633 760 410 590 125 -37 141 -248 -191 8 -462
1340 -462 -308 -620 -594 -495 -697 -484 -607 -338 -29 -86 -526 112 143 -8 165 118 50 426 752 373 349 641
1362 641 691 336 248 437 338 -29 -116 -198 175 25 -635 -71 -175 -574 -456 -814 73 -814 -604 38 -150 -184
1384 -184 230 30 -263 94 375 105 531 93 340 340 452 339 629 349 -232 176 -12 -266 -12 9 -70
1405 -70 -134 -150 88 -444 -562 -119 -631 -354 28 -1040 -352 74 -341 -312 118 259 33 433 261 152 505
1426 505 1051 408 148 749 362 -350 370 853 126 -823 106 -726 -301 -67 -306 -1110 -424 4 -985 -355
1446 -355 141 -402 -763 616 388 -325 633 379 -218 357 1062 142 -185 869 176 -79 1155 500 -832
1465 -832 426 662 -507 -424 272 -1204 -1069 323 -12 -1472 -521 -189 -874 158 837 -1339 -838 1007
1483 1007 -19 -250 790 81 -1073 834 1542 -331 -26 999 -325 145 2099 202 -1650 99
1499 99 452 -771 -112 277 -1447 -992 815 -87 -1563 124 -600 -1501 455 1379 -1057 -785 776 -145
1517 -145 -252 2009 -110 -1279 908 1355 -437 311 858 -1078 -286 2177 435 -1338 343 0 -862
1534 -862 1311 981 -2544 -1488 1151 -202 -770 750 -959 -2095 1145 1583 -978 -827 566 -1342
1550 -1342 290 2172 -39 -1666 841 811 -135 1617 1145 -1983 -317 2718 318 -816 718 -813
1566 -813 -2017 1554 1463 -2019 -1472 568 -1096 -268 1462 -912 -2828 1143 1600 -912 264 671 -1828
1583 -1828 72 2814 148 -1014 908 555 -584 2259 1680 -1782 -1033 1688 -61 -429 1454 -1315
1599 -1315 -2130 1189 1280 -1781 -719 -321 -2281 -3 2447 -1142 -2577 216 262 -903 1352 816 -2498
1616 -2498 -30 2092 243 -545 1086 -399 -1372 2174 1688 -1691 -606 867 -893 565 1967 -1228
1632 -1228 -2515 1022 901 -1185 591 32 -2824 -631 1977 -946 -1084 703 -476 -882 2426 1067
1648 1067 -1989 -233 1751 122 607 1741 -1242 -1397 1700 1258 -926 139 254 -1830 -2 1973
1664 1973 -1143 -1843 564 -553 -632 1104 -85 -2498 -740 1340 -417 -436 1075 -1020 -933 1941 1212
1681 1212 -1056 -57 972 -165 813 1936 -438 -1432 1227 776 -898 798 12 -2049 -96 1213
1697 1213 -1023 -1059 155 -1005 -984 1070 -365 -1639 -236 645 -544 299 1178 -1192 -1032 1592 753
1714 753 -188 389 67 -836 736 1747 -428 -821 723 223 58 817 -2 -1242 -332 683 -748 -435
1732 -435 276 -927 -1132 698 -23 -783 -228 59 -611 197 823 -408 -87 1031 263 -189 819 313
1750 313 -494 740 897 -50 -202 119 -461 -142 582 -84 -899 -145 55 -770 -136 -42 -938 -465 -133 -388
1770 -388 -84 -276 -463 -531 23 787 140 105 553 249 188 717 457 -202 388 763 399 249 253 -460 2 108
1792 108 -430 -660 -317 -459 -1017 -296 85 -673 -948 -183 -639 -207 259 432 -218 370 207 210 186 161 624
1813 624 468 461 420 281 214 147 310 322 81 -85 -171 -208 -348 -205 -575 -493 -495 -306 -86 -71 -523 -24 -157 286
1837 286 21 -339 116 68 242 367 177 744 372 214 62 252 104 192 62 -260 -298 216 77 -168 -170 -295
1859 -295 -54 -416 -371 -334 -198 -260 -281 -173 -426 52 270 184 189 99 79 87 23 139 328 333 497 193 -102 281 175
1884 175 -161 -352 -171 258 -271 -316 -194 -93 -339 -21 -492 -417 -264 -655 33 -115 133 -287 153 296 22
1905 22 149 135 236 -12 192 502 200 229 444 237 177 292 -203 -258 188 352 -525 89 -95 -280 -123 -370
1927 -370 -185 -451 -59 51 -449 -12 -13 77 183 173 -6 -27 378 361 187 434 281 239 430 448 283 -77 214
1950 214 -291 243 153 -184 -815 80 -420 -417 24 -230 -458 -71 -21 -152 -305 -224 -3 -401 620 289 -223
1971 -223 662 769 409 556 945 149 -221 398 470 -342 -100 -129 -484 161 398 -152 -504 172 43 -640 115
1992 115 0 -777 -620 366 -72 -134 103 -61 -214 376 526 -80 63 408 -197 671 946 49 -831 563
2012 563 331 -41 419 225 -972 -135 733 -540 -756 -290 -290 -443 601 -112 -714 -481 114 -78 81 794
2032 794 -331 -677 1000 614 -376 885 548 -265 374 1292 -271 -728 759 -146 -427 525 159 -1260
2050 -1260 -385 1153 -256 -312 243 -982 -706 543 31 -955 37 25 -372 599 1273 -924 -798 974
2068 974 492 -75 993 114 -1185 126 1324 -25 -155 282 -629 -219 1406 518 -1469 -76 352
2085 352 -556 386 810 -1293 -862 841 418 -475 655 73 -1386 787 1259 -138 -657 400 -247 340
2103 340 1318 338 -1106 -6 1001 -347 61 828 -1087 -680 1243 401 -876 -328 129 -1194 581
2120 581 988 -1436 -1219 473 -405 -327 785 38 -1451 640 1578 -112 -145 353 -768 -338 1354 559
2138 559 -1069 596 461 -87 958 919 -844 -820 780 -239 -599 539 -389 -1569 362 869 -624
2155 -624 -877 154 -670 -77 1079 -107 -1085 418 614 -258 251 884 -970 -199 1426 252 -644 359
2173 359 -120 -678 768 1162 -793 -664 470 0 -160 786 -429 -987 22 875 -470 -110 506 -1105
2191 -1105 -247 1197 150 -672 170 87 -665 760 765 -584 -568 1255 -27 -114 354 -341 -722 796 855
2210 855 -257 -162 274 -598 -504 537 -384 -858 337 -320 -167 380 370 -328 -438 861 246 -412 433 -39
2230 -39 -400 380 677 -209 -83 671 -383 -172 1097 -5 -545 69 232 -144 7 -377 -472 76 405 -411
2250 -411 -614 -156 -120 -554 284 356 -713 -43 357 168 -208 725 124 -286 454 520 -28 142 247 -421 -276
2271 -276 321 -17 -413 11 258 -476 -58 88 -587 -119 -37 -170 -661 246 -17 -293 534 41 -188 23
2291 23 84 -51 154 489 57 -158 292 490 116 393 174 78 15 526 -158 133 -231 -138 -555 -224 104 -550
2313 -550 -286 -28 -200 -149 -34 -44 -281 -398 159 -271 280 267 206 62 381 55 20 250 -330 20 216 351
2335 351 52 -37 201 257 -331 -126 -290 -168 -190 21 -61 -414 -113 54 -260 -286 -310 -203 44 -51 -245 149
2357 149 79 113 -118 193 -98 -162 40 254 507 335 393 184 355 24 -338 -241 -42 -525 -96 -334 -16 -99
2379 -99 -140 -227 -239 -74 -18 -115 -251 -268 176 126 409 128 318 179 382 -48 246 120 400 -8 -52 190 -34
2402 -34 -113 -229 -254 -18 -61 -205 7 -105 14 -444 -343 -267 101 217 78 360 -14 36 216 178 364 -50
2424 -50 358 115 547 -209 -216 329 -179 240 -140 -158 44 164 -284 -57 -278 25 -44 -165 77 -341 181 -152
2446 -152 123 -248 -225 201 60 77 122 101 -22 103 -296 228 115 297 102 111 -14 174 140 208 -238 41 -42
2469 -42 192 -105 53 -16 90 131 266 -254 -364 -44 -392 121 -88 42 -214 163 277 174 14 288 -20
2490 -20 21 -8 397 42 241 466 -80 521 84 -239 -10 -289 38 -30 -86 -237 -429 232 -56 -291 54 -229
2512 -229 -435 -134 188 349 -330 -142 436 -213 121 563 -117 79 40 -134 76 97 -40 -51 336 39 -365
2533 -365 -331 138 -643 -312 591 -111 -754 31 122 -422 -204 149 -635 -441 886 305 -181 396 140 -41
2553 -41 618 404 -763 -164 326 -135 155 561 -34 -642 221 12 -275 -343 -90 -424 -98 448 -190 -615
2573 -615 -352 -4 -385 383 253 -805 -396 575 246 132 538 32 -514 277 397 -14 255 263 -532 1
2593 1 693 -93 -483 -156 35 -258 233 90 -791 -763 384 -437 116 -26 -228 -560 749 319 -310 -214 211
2614 211 -359 341 931 -283 -438 611 275 12 334 311 -683 -238 1087 -67 -477 -5 -41 -449 548
2633 548 498 -652 -429 440 -76 -270 223 -480 -178 71 440 -355 -51 82 -132 40 613 3 -547 542
2653 542 229 -108 560 224 -821 -409 79 151 -103 555 -357 -446 46 -53 -281 -92 -82 -244 118 759 -372
2674 -372 -792 -4 95 -7 486 167 -114 243 458 37 -78 278 36 -81 603 424 -405 -77 -13 -365 100
2695 100 537 -252 -541 420 222 -493 -30 82 -337 -25 513 52 -205 97 -244 -66 648 266 -337 245
2715 245 388 -143 23 85 -416 -496 173 -1 -673 -22 106 -270 58 454 -247 -313 -129 -39 -186 361 49
2736 49 -803 111 776 258 68 124 -141 -255 561 475 -355 -32 190 -104 127 408 -412 -329 163 -33 -186
2757 -186 -32 -224 -160 182 279 -92 -131 -195 -459 -562 -2 189 -70 -303 263 176 -4 249 -36 367 160 195
2779 195 -39 53 142 103 343 266 -68 -296 176 -163 -63 -73 -160 -405 -225 72 -65 -223 -29 129 -329 30
2801 30 459 10 360 133 -288 255 235 -79 -278 -113 170 203 188 -58 3 -47 198 164 38 -282 -58 -30 407
2824 407 79 -152 -219 60 -145 -185 173 56 -422 -43 71 114 97 181 58 -195 10 -433 46 -26 -237 -99
2846 -99 333 146 186 -177 79 -116 -28 -189 229 -236 -108 49 57 5 -54 -104 14 154 -226 75 -5 327 -155
2869 -155 -92 23 217 30 124 -101 165 85 -9 -146 87 -336 -286 -260 12 -62 97 204 -192 -210 100 43 -420
2892 -420 -52 -328 -175 23 96 -121 -162 129 -173 -52 260 -34 -6 211 92 103 161 127 147 51 -55 177 7
2915 7 -557 29 78 96 -166 209 91 -128 -321 -102 -255 33 -226 322 -56 -80 -179 36 122 -72 86 5 122
2938 122 409 -173 233 -149 323 93 -44 238 -56 149 92 -106 -221 174 -13 -449 -50 -102 -181 -116 80
2959 80 -284 -354 -245 -105 216 57 115 -383 -158 -129 2 64 516 275 27 472 9 4 194 97 90 -112 -37 -61
2983 -61 75 -91 230 -102 -42 -41 64 -467 -301 0 -54 386 -187 -246 -219 442 -155 37 21 -177 -6 169 -289
3006 -289 -149 -146 -230 -10 278 64 92 -2 -121 -338 148 0 -164 -185 -183 514 -151 -307 247 -354 -225 381 249
3029 249 185 48 -82 -64 475 -78 -157 116 132 0 -199 126 -14 46 324 207 -78 -211 235 -220 -300 140
3051 140 -99 -282 -296 36 -365 93 104 -725 -226 490 -202 -76 267 141 -468 -139 -19 -127 -6 -83 -37
3072 -37 -44 413 -358 -450 131 232 -171 203 93 -268 -151 293 -220 -238 -203 -76 -176 7 15 -299 72 -59 -191
3095 -191 121 274 -503 -89 265 270 -100 -170 -310 152 86 166 -89 -313 219 -26 -102 312 56 -610 -367 -170
3117 -170 6 -415 401 -472 -373 -98 105 -383 9 219 -464 481 143 1 -77 412 164 -52 510 2 -453
3138 -453 414 381 42 7 14 -93 163 229 -118 -734 51 52 -52 148 109 -106 9 -63 249 -79 405 -357 -221
3161 -221 -167 144 -226 66 -34 -15 -74 365 97 -589 -144 374 -247 -25 64 -308 -3 272 140 -357 -116
3182 -116 -142 -247 120 327 -328 -185 384 -332 98 108 293 -188 200 440 51 -37 166 249 -177 359 508
3203 508 -199 82 377 -327 -139 446 -108 -189 666 4 -20 -176 -269 -242 144 624 51 -194 282 -396 203
3224 203 377 296 -359 -77 307 3 -195 255 -624 -55 78 169 -18 -74 -164 26 132 -37 145 -171 -163 225
3246 225 352 -75 121 -288 199 -140 -368 -469 -224 -287 -269 -117 180 10 180 97 75 297 383 -63 104 359
3268 359 -31 -159 -7 68 -91 437 129 -379 213 -235 26 -47 285 203 -128 243 42 160 128 98 228 -361
3290 -361 193 17 -166 -93 -181 183 68 448 278 137 63 81 254 161 120 378 -58 6 -305 13 443 69
3312 69 -446 258 25 -263 94 42 92 -5 56 -302 49 196 126 244 8 8 338 64 299 142 -144 125 34
3335 34 -11 -265 -169 92 -171 -155 -369 -30 -25 -408 -188 18 95 -157 -83 203 -186 186 -100 77 209 -62 58
3358 58 274 -84 76 -258 142 -34 -17 347 -43 -133 -7 47 -95 -155 215 -350 -211 -61 -55 226 133 -122 140
3381 140 20 -85 15 -105 324 -243 274 101 48 151 -29 -285 59 -68 349 41 61 -144 -47 247 79
3402 79 -1 33 -35 -168 -126 -389 -164 -15 44 -46 324 -38 -355 -59 108 307 114 220 186 315 366 -267 -47
3425 -47 257 -66 266 -136 -12 -245 -95 258 403 177 131 324 115 -46 -240 67 -495 118 -266 -52 234
3446 234 25 17 -210 7 94 -49 -187 92 60 273 72 322 157 18 -27 -150 -262 80 -80 72 -147 -113
3468 -113 -98 -278 -156 -372 -450 -227 30 -12 146 -15 -124 48 -40 -152 151 102 17 136 201 -202 -337 -14
3490 -14 29 -35 -541 -5 29 166 80 -4 -132 -179 38 396 113 -104 -244 62 -91 220 67 -489 -260 -39
3512 -39 262 -397 72 -599 -175 278 -89 -205 -207 343 -289 -143 -126 -221 -162 65 -203 5 497 138 66 -160
3534 -160 -109 209 55 196 -117 -39 -52 20 32 24 -47 235 131 -122 -132 104 291 241 -224 -85 -222 189 6
3557 6 374 -215 5 147 -394 78 240 -130 -357 -231 55 -5 179 -61 -27 -124 -299 -68 107 89 456 155
3579 155 65 218 -11 289 320 -329 42 65 5 272 -101 149 100 -102 305 -467 -398 51 -142 -106 -287 -380 44
3602 44 208 281 -446 -79 131 343 -289 47 -406 -421 31 -55 -228 -38 256 119 -115 227 168 -40 64 -145
3624 -145 -214 102 19 -180 87 48 -62 -87 63 8 -87 111 62 -556 34 -23 6 132 164 215 -22 -83 234 152
3648 152 -70 -113 -339 119 418 -121 -16 220 12 -197 284 -65 -521 85 299 374 -4 527 33 -237 -82
3669 -82 -50 -475 231 144 10 -197 209 -161 -258 211 59 -62 104 -83 -248 81 68 36 109 65 -423 51 258
3692 258 58 -187 -27 213 -100 -8 209 -305 -367 328 93 59 251 -150 -147 -196 81 25 -79 141 22 7 -36
3715 -36 55 -220 -71 350 -180 -12 -35 50 28 90 253 -36 418 185 -272 84 132 -11 -196 -250 -120 -83 160
3738 160 -15 -551 44 382 196 143 -1 -92 223 68 4 -53 -353 -104 -150 -37 585 -284 -135 252 -84 -122
3760 -122 16 -254 -348 -4 -96 35 -218 -202 -77 219 288 -275 -82 198 113 -110 -248 0 75 -115 341 -98
3782 -98 284 -82 11 -383 172 503 -249 -230 -132 175 -291 224 -27 -100 234 177 218 199 262 211 -72 80 -214
3805 -214 132 -11 300 62 177 -189 -179 46 -49 -232 -61 217 -135 -327 -56 36 -367 -227 -158 -166 -204 -147 184
3828 184 163 149 112 -265 -392 -249 -510 96 -21 231 -228 186 -198 -179 78 -4 14 -35 333 -257 -112 11
3850 11 120 -395 207 266 93 104 -18 157 -206 15 -4 -77 -2 288 3 8 346 147 -356 -314 -210 26 137
3873 137 48 98 174 210 159 -166 -109 3 228 118 160 2 -283 -92 191 6 266 250 191 274 -97 -215 130
3896 130 151 -132 153 -184 -85 -73 41 -62 -184 343 34 19 34 66 -43 398 -86 -258 -133 52 152 -167
3918 -167 264 -36 -208 -25 -102 -62 -85 71 -61 -432 -138 5 -144 -113 65 -200 -77 -17 79 230 227 -355 208
3941 208 60 277 -79 -143 -166 -5 256 -135 -438 93 191 -68 -352 283 -119 -273 60 118 -1 254 -67
3962 -67 165 -408 20 261 71 224 -129 229 299 27 260 -28 -124 -153 -330 -228 9 293 -78 64 -185
3983 -185 -67 115 -156 64 211 -249 -63 -66 -335 162 122 48 56 -93 -182 46 -37 342 299 -132 -47 27 -80 201
4007 201 112 -68 54 29 28 45 -94 57 -162 -259 -177 125 -93 -2 52 76 -7 255 37 -62 -107 320 12 -171
4031 -171 279 -51 475 -253 -99 399 -13 -77 -415 -403 -219 86 -111 -110 135 469 257 -23 -59 74 50 -220
4053 -220 -78 25 -219 -110 -99 -293 -63 244 8 417 -74 -5 -176 -247 -47 79 -57 -35 -129 -351 100 93
4075 93 -383 16 196 -119 -160 27 304 201 76 -287 141 428 -116 184 496 230 -21 -156 31 101 176
4096 176 310 37 105 457 39 84 -6 155 -110 -128 -29 -418 -217 446 116 -265 -250 78 197 189 135 -307 -327
4119 -327 181 113 -37 -99 -38 -262 -331 -26 23 164 -34 66 248 278 137 -221 -474 102 -116 -97 438 225
4141 225 292 126 -56 -24 151 -46 24 449 -64 170 170 -202 -294 165 264 -148 -257 -149 166 -107 337 -276
4163 -276 -236 267 321 -72 170 88 -68 126 114 82 -76 -6 -35 108 -374 -111 -248 -191 13 -85 9 257 -13
4186 -13 43 75 103 -342 31 106 308 -25 -29 167 -260 217 -103 57 36 -177 -354 307 133 122 222 58 -319
4209 -319 -285 -196 48 -254 -232 69 87 -106 -142 -3 -90 127 259 6 149 461 143 380 -63 -493 -104 -100 47
4232 47 -174 398 106 -316 6 236 -23 -298 -23 239 277 306 173 -16 -188 -130 -61 43 -81 87 -104 -84
4254 -84 90 -143 -4 350 -197 298 498 135 352 -166 235 -103 167 114 -53 -9 -116 159 -240 12 150
4275 150 -340 367 -203 -15 1 -36 -94 100 11 29 13 55 314 304 482 158 -153 -73 242 -181 -105 27 -25 -234
4299 -234 10 34 242 38 -586 -9 28 345 -52 -311 -178 -148 -136 -194 308 190 165 48 -282 48 33 80 21
4322 21 36 418 -246 75 236 -116 -137 222 -102 -257 389 260 -30 -267 491 1 -418 -153 255 -254 -187
4343 -187 -107 -84 77 145 -250 203 141 192 -40 68 -58 -349 -63 -45 -59 319 498 -57 18 -81 93 -152 97
4366 97 125 -282 -120 -50 117 -103 -30 232 50 -43 11 -68 -193 202 -74 4 73 279 110 -92 9 233 -105
4389 -105 184 -367 -276 159 -12 210 -59 -104 -72 52 -17 -332 -190 -123 -248 -71 -56 239 166 -214 452 -118
4411 -118 -93 13 149 -49 -129 171 257 53 41 81 126 530 -8 -357 -287 90 -24 255 -14 -219 52 104 -95
4434 -95 -170 0 252 -58 -64 -466 -123 21 19 97 -339 39 14 359 -16 393 10 -86 -14 -30 70 -2 -259 -135
4458 -135 -22 -407 -93 76 319 -93 -80 -224 220 110 -140 232 165 -139 -16 -46 -423 -86 29 66 302
4479 302 177 34 -225 -352 -176 81 459 -4 350 112 -68 70 254 328 -96 390 -475 -263 69 135 36
4500 36 -131 -196 52 -28 -65 -324 -16 -479 -191 17 52 122 -92 105 55 270 -181 -331 -275 -46 259 10 348
4523 348 -244 -461 133 -83 27 168 255 -98 -109 106 -64 328 -195 -199 -171 29 556 234 308 -110 56 -111
4545 -111 236 72 166 -325 290 -22 384 43 17 -48 -242 -185 -222 -443 -11 102 -223 -55 -170 117 48 60
4567 60 -45 110 31 -342 -119 44 -66 -77 -106 122 -30 59 40 -3 -35 129 -12 84 -69 299 329 -78 9 212
4591 212 35 6 -52 -275 -174 -197 225 -432 296 372 297 215 329 -79 -46 -200 64 352 -109 49 -70 -170
4613 -170 219 -1 549 56 -91 317 81 230 40 121 -27 -52 -128 -84 -235 -63 -230 -219 -340 -40 -268 161
4635 161 39 123 33 258 -99 -34 -327 25 111 137 343 240 201 174 137 -63 87 148 -49 -384 77 35 195
4658 195 -34 -525 -319 -184 -14 -119 -336 74 352 -61 -248 41 19 -26 200 336 -95 -101 -375 395 260
4679 260 10 -9 -7 -173 -92 102 88 -44 -36 -69 -121 65 141 312 -108 7 -289 -272 84 -331 -28 208 26 162
4703 162 -238 -38 116 -169 17 215 -103 -74 -77 30 268 190 112 71 -123 207 228 -63 -17 -81 271 -53 -248
4726 -248 -83 94 -508 100 -2 -45 -322 30 8 185 -1 -130 295 64 325 168 164 137 97 -216 77 243
4748 243 92 215 115 -82 -11 12 237 114 -9 1 -29 211 157 -220 -158 201 61 -99 59 391 -153 136
4770 136 -697 -89 251 26 44 -430 197 -78 -323 -174 319 249 -306 215 114 159 195 -206 -138 102 -4 -253
4792 -253 314 -313 11 54 256 176 -75 -107 -189 17 517 122 -368 -167 338 54 -116 28 -26 -282 -153 58
4814 58 28 -49 -23 -229 384 156 -335 -163 271 -162 -166 -312 -201 62 -145 -29 -257 153 354 -106 -136 -184 -47
4837 -47 99 127 367 152 7 -161 103 294 155 -17 55 17 -198 -194 24 -112 109 -160 -20 117 -184 56
4859 56 -75 264 -163 124 227 3 -19 -16 -113 -297 -12 200 79 44 -212 34 193 -241 231 13 155 102
4881 102 250 264 71 -250 -386 -135 -279 -152 244 147 -256 -259 -223 327 121 79 79 -162 -72 79 25 101 3 -12
4905 -12 -236 298 -21 0 -24 -5 326 -119 -144 -48 400 7 -29 306 74 12 -4 338 201 -87 340 -32 300
4928 300 -226 157 43 3 -37 181 -63 -49 -25 -296 -105 96 24 -18 130 -175 138 80 218 1 154 -371
4950 -371 -343 21 -285 -132 9 164 126 30 160 49 127 20 -107 -32 162 220 27 25 -220 206 105 13 132
4973 132 473 278 59 45 1 -89 -83 192 -103 -137 121 -125 85 -2 107 -293 233 1 189 -10 270 155
4995 155 223 160 -250 223 145 -247 172 -156 316 8 -31 245 -43 50 -384 -188 -449 -148 7 -5 249 -188
5017 -188 48 -338 112 -178 -234 99 352 -62 -102 224 0 288 109 195 276 36 23 -245 130 201 10 121
5039 121 120 123 403 279 -133 204 64 195 -158 -134 -312 -442 327 37 -297 -39 -17 -30 -69 -268 397 -108 -328
5062 -328 -23 343 84 -76 256 134 83 -254 -149 -268 113 -48 0 -72 -142 -303 155 -116 -389 -47 -160
5083 -160 12 180 346 4 -191 312 17 217 -82 329 -423 330 154 208 29 56 -180 -75 528 375 263
5104 263 101 -73 40 82 530 -147 59 33 -100 5 -215 -21 135 -377 137 260 -123 223 374 249 163
5125 163 118 529 -231 184 130 374 157 212 -319 -40 185 -165 -437 -331 -70 -128 171 11 37 -61 144 185
5147 185 -481 -440 -255 -175 175 14 -33 -96 -10 69 33 -121 62 -13 241 62 -121 389 -409 79 -44 307 -93
5170 -93 90 43 -521 57 185 52 -236 80 -255 149 310 15 299 -175 -252 218 -189 207 -146 -42 128
5191 128 -111 113 -344 68 -349 122 -20 -163 94 283 40 -422 -83 -215 -213 -53 172 -61 -293 172 -468
5212 -468 -352 351 552 179 31 185 -171 -224 157 284 447 289 -74 130 255 -89 -157 492 204 116 -48
5233 -48 577 82 146 179 155 -366 121 152 -34 -109 -195 6 -345 -54 -158 82 -133 115 -4 72 -97 -130 21
5256 21 136 117 22 -123 -2 -119 -96 -130 -421 43 372 216 64 -32 130 -17 67 -31 117 -142 38 114 -45
5279 -45 -51 -269 -193 103 35 -147 253 264 98 -18 -152 64 94 -93 -211 185 -77 56 -2 22 -61 -76 132 -407
5303 -407 120 279 126 -275 275 -39 -182 -160 -73 -59 -65 -25 236 -220 79 217 39 87 -195 19 -167 -210 427
5326 427 -14 33 301 49 92 183 154 169 -8 44 -140 3 -341 6 86 -157 -119 53 -52 56 69 333 88
5349 88 -159 196 8 230 148 158 94 -56 -74 106 -207 29 161 -252 -89 186 161 -172 168 99 340 66
5371 66 -39 20 -223 -87 51 182 -99 -138 12 -193 -86 310 -15 -33 634 17 -25 157 343 -149 -39 -35
5393 -35 264 214 -107 444 363 289 -379 16 357 130 28 0 86 183 298 118 36 -87 45 -430 279 326 -372
5416 -372 19 57 -54 -337 103 -159 272 13 -278 -429 478 172 -129 -26 -110 70 20 -166 191 94 -306
5437 -306 -136 -7 101 17 -99 -269 180 184 -496 -1 -307 13 -214 -168 -185 53 140 462 -239 200 544 50
5459 50 -13 214 251 190 236 -69 -62 5 161 -205 -47 7 281 182 -651 -26 -70 96 -151 81 -214 -262 39 -235
5483 -235 -19 -10 -179 -173 369 23 -75 -157 49 -127 225 282 -22 35 -1 266 65 -245 -458 399 -167 -123 66
5506 66 99 13 31 -162 -143 -286 187 267 -215 -263 -265 151 122 241 -84 -140 -264 89 60 -47 98 -49 -125 104
5530 104 -11 -122 95 -125 37 -392 45 80 143 -315 -264 133 -159 3 -277 11 93 244 -90 46 223
5551 223 -35 101 -199 210 -102 518 386 157 278 -126 198 -376 -196 225 -4 -177 -117 -86 146 237 177
5572 177 -263 58 -24 264 30 -77 131 -207 89 171 -65 204 101 431 125 331 -228 -229 62 9 40 -87
5594 -87 96 -155 38 -104 8 -149 226 290 -1 326 -88 322 286 -35 114 63 -49 337 40 -200 186
5615 186 -166 -202 393 -2 16 104 174 141 16 -121 -48 84 -26 -118 31 -194 392 -412 98 -208 294 -96
5637 -96 517 18 85 22 117 121 166 153 531 227 -142 153 373 142 131 5 119 66 137 -261 -132 -142 -433 14
5661 14 71 -242 -192 264 -303 9 64 -59 -130 161 -227 -75 63 -288 229 107 37 -182 -205 30 -49 -254 13
5684 13 -173 19 -6 -89 -265 -388 -247 -65 137 -17 190 -298 180 130 209 139 307 -516 336 37 -241 -9
5706 -9 2 117 271 88 153 -64 -99 -339 -256 33 61 56 -226 322 224 73 -57 277 -20 72 123 86 -43 161
5730 161 -102 -166 1 298 -282 -4 161 285 130 168 -214 -44 -32 94 129 179 81 -457 -24 -133 -240 -291
5752 -291 49 85 337 -85 92 88 283 -2 -21 104 -41 114 271 154 15 31 90 -139 -245 130 -112 -200
5774 -200 -259 15 121 -97 56 249 -128 0 194 -302 -80 -225 30 155 245 163 -182 1 51 -303 344
5795 344 -154 -171 121 -189 425 287 9 -242 -17 -138 352 -372 -178 -76 274 258 -17 478 149 -245 0
5816 0 -115 -84 249 -542 -48 32 -36 -197 92 230 -112 72 20 -144 116 -33 90 160 131 -11 135 387 65
5839 65 -6 -325 -146 30 51 -16 253 95 300 -161 -203 -167 491 -422 -69 265 -129 -441 207 386 105 36
5861 36 -65 10 176 331 -228 164 260 413 -116 -186 253 60 -120 122 43 153 -208 104 2 190 95 73
5883 73 275 50 -295 45 -28 -134 150 -35 -300 182 -89 -394 -19 158 64 -5 -196 -81 163 108 138 -247
5905 -247 31 -65 30 -177 -59 -119 -87 -342 -121 -251 271 -396 155 -62 163 230 -109 232 -332 87 1 -315
5927 -315 419 -122 238 -189 -93 -203 -144 202 162 -33 60 -191 178 189 -134 -160 -220 57 -115 69 -123 -44 -298
5950 -298 338 -10 -108 4 -386 -142 -241 195 -4 -50 95 -304 -233 -183 -197 -81 172 -44 3 -63 498 227 388
5973 388 438 75 56 -21 110 199 92 -3 -377 -149 -174 -176 97 56 -330 49 339 290 57 -56 149 -246 -136
5996 -136 -269 -72 -62 37 3 -216 -228 60 48 53 -274 197 87 -97 -308 178 166 -459 319 345 172 125 -81
6019 -81 190 -145 -3 -44 -333 186 131 -60 63 69 1 -222 -184 -114 -188 11 -530 -211 -60 -292 40 -228 68
6042 68 -12 388 -94 427 70 -166 23 37 -202 52 -162 -141 256 44 -107 -112 178 -140 313 101 -15 -270
6064 -270 -338 170 -104 93 137 71 -188 -316 -53 4 228 -1 -283 -127 -31 -48 377 35 -36 148 166 324 -2
6087 -2 80 87 -233 -62 207 60 362 69 -132 442 164 -188 -201 258 327 70 113 -469 -6 -15 -124 -73 260 137
6111 137 90 264 133 130 259 -207 101 -73 67 66 -1 -266 84 335 279 360 371 225 -1 -25 156 10 356
6134 356 55 119 -208 10 105 -257 -55 -115 -196 21 -49 -125 -28 -260 -307 184 383 -199 -90 33 -330 -231 -124
6157 -124 -105 -10 202 145 271 196 -277 21 -105 260 -3 89 -151 -145 507 3 97 -206 -545 -40 -273 -83 115
6180 115 85 247 -221 297 99 -625 149 -18 39 80 147 -158 -96 12 130 -239 252 -81 -80 117 223 71
6202 71 75 -252 -31 -112 -51 -88 -38 -155 66 -70 0 88 -418 44 -340 146 334 27 125 -274 484 -15 -23 -33
6226 -33 21 -100 4 76 91 284 161 227 -78 18 -280 42 -112 -255 72 -304 -72 45 155 10 327 -103
6248 -103 -90 -94 483 -160 -273 -17 -195 222 327 -64 515 22 202 126 265 46 50 -183 130 103 -58 23 -32
6271 -32 21 -69 194 -362 -179 -346 216 -125 -271 -475 138 -20 -36 41 95 -74 -123 128 98 -90 -87 8 508 246
6295 246 -34 -128 256 191 -235 -281 224 -148 9 -204 -151 -108 -261 -18 132 331 406 214 -266 -83 -156 373
6317 373 80 50 67 -66 2 270 -21 -15 308 -117 270 164 -62 -152 -97 -465 -338 72 -189 -17 85 -153
6339 -153 129 -196 236 -30 -354 -18 -112 -303 136 -198 178 493 -127 -162 -272 -100 97 -85 274 -178 -296
6360 -296 -128 -38 -160 -33 -352 -28 334 188 -18 -253 -174 -237 105 123 255 -178 381 -79 -10 -101 123 329
6382 329 185 40 7 44 75 -312 -238 226 86 265 2 334 -44 -77 -368 170 -52 -67 -31 147 260 65
6404 65 -202 -81 522 -7 -266 -230 61 -366 -313 114 -60 -289 231 70 214 416 -161 15 -120 -9 -60
6425 -60 -152 -183 73 41 -102 -83 -449 235 1 -72 269 1 -230 -66 -125 -133 217 -85 -7 138 26 -163 -99 -219
6449 -219 -213 -425 116 -60 104 146 -151 272 144 219 90 101 -51 90 -505 134 -21 -195 -96 -209 168 -85
6471 -85 122 36 590 -81 11 222 -242 277 -174 117 -268 100 -330 -210 91 69 -81 -163 230 -112 -113 -389
6493 -389 -173 -139 234 -32 96 -13 -340 -252 -56 25 -66 -203 -88 36 41 294 200 -196 41 102 -12 -164 13
6516 13 -455 -138 -406 -143 110 -181 240 72 170 -93 310 575 -315 112 -106 55 168 -297 194 217 9
6537 9 -45 152 -256 -201 -237 271 157 203 -124 17 271 -46 -175 12 299 78 -78 197 -132 -226 -43 178
6559 178 256 -19 185 -37 -218 65 6 -51 559 375 100 -54 313 -227 -128 302 171 -25 -160 -82 26 95
6581 95 115 5 123 -367 169 422 149 63 -144 273 298 -237 108 62 -31 -201 -574 183 -43 116 -92 259
6603 259 49 42 341 -31 87 333 -98 313 -244 -124 -54 -371 111 47 -109 186 245 -9 177 27 331 -250
6625 -250 -79 82 230 -199 -353 -11 -11 -469 -20 249 -6 99 55 -72 259 431 21 32 47 224 203 -155
6647 -155 -25 112 134 -69 -29 -205 8 -425 -120 310 203 -204 -245 -106 -79 -58 10 75 -83 180 -147 -110 -295
6670 -295 -4 57 131 316 -126 -64 225 19 128 154 297 -126 -435 -200 91 166 200 98 154 85 74 -77 95
6693 95 232 -237 -2 -121 181 109 50 -312 -17 -94 15 89 31 100 211 -22 -461 -326 -182 226 96 233
6715 233 355 40 -35 -82 -156 -267 -11 142 45 -48 -302 -32 317 -32 381 58 171 -43 -111 -27 -90 -120 279
6738 279 95 120 -56 -363 -236 -270 -236 -156 -324 34 -319 4 -71 82 -43 -314 315 -142 106 -39 190 -255
6760 -255 -2 -54 145 20 -29 -267 0 210 119 -198 19 45 -205 -247 349 -370 -269 170 171 61 -30 57 265
6783 265 -152 -124 112 -15 187 -236 -78 -248 17 166 -63 -211 -9 -312 -10 -284 132 113 116 138 -19 148
6805 148 227 81 -53 28 -124 97 435 -132 74 337 94 238 184 12 82 -67 -158 -367 146 -216 52 -469
6827 -469 -42 -77 -110 -194 -192 333 284 64 181 419 -117 33 -94 1 64 196 37 -36 99 68 228 323 29 -111
6851 -111 -49 -41 248 -187 84 -146 258 -48 -183 32 -18 -125 -21 -18 81 -274 -58 -38 -13 -158 -133 -57 5 -149
6875 -149 -197 127 475 184 -26 -179 336 288 91 70 -259 14 -154 127 -163 -138 1 107 330 -90 -365
6896 -365 113 243 -72 -263 49 -159 335 16 158 139 174 -294 199 -310 -524 -87 -27 239 -240 269 -212
6917 -212 -221 80 -168 -499 -59 105 77 481 -167 -25 -341 -85 235 -247 47 109 -155 66 -47 279 224 -143
6939 -143 122 -209 295 -33 323 279 56 181 444 76 -383 14 134 -63 -184 -104 48 29 233 158 -157
6960 -157 145 260 -40 154 185 -5 -162 240 349 149 156 24 126 145 -146 -101 63 106 127 225 28 -440 -86
6983 -86 37 266 -282 45 397 -443 138 -77 113 -16 -45 344 436 68 256 67 -36 198 471 302 109
7004 109 -29 -2 -47 -27 -146 -166 -64 123 -104 63 -272 -430 148 -47 79 265 -32 87 -128 -138 148 -83
7026 -83 180 75 16 268 73 -328 -142 204 77 0 -202 -343 -440 189 -127 21 261 -154 -142 303 -201 -156
7048 -156 -316 -380 -33 -412 -93 -198 -50 53 196 -54 407 148 158 39 -55 134 65 184 -63 325 129
7069 129 127 233 -57 -25 -21 -334 55 -32 168 -229 -372 22 31 -22 -92 -261 267 -392 -194 -325 -20 -203 -122 -144
7093 -144 274 -146 80 10 -128 102 136 13 294 31 -57 -116 -176 77 -270 141 -280 397 327 33 -71 62
7115 62 -7 -187 -102 -116 54 -93 -49 195 -131 159 206 -119 69 -113 -326 -122 -173 -137 226 -134 -57 -3 -40 -320
7139 -320 -217 -144 -68 25 -79 -56 -260 261 -61 240 -196 -443 48 -115 -74 130 -91 -40 76 171 179 193 -6
7162 -6 190 257 -213 382 39 -265 74 101 117 231 -257 -298 1 -134 -158 164 -109 57 -49 241 41 -109
7184 -109 -138 -65 108 -184 54 -537 13 197 12 -107 149 -34 242 -6 44 195 78 -108 173 112 -1
7205 -1 58 161 -76 -119 -38 248 -238 -110 -66 -202 55 -247 -129 -92 288 -73 12 118 219 130 103 193 72 261
7229 261 -118 -95 -138 460 -132 106 132 196 141 -77 -379 69 58 37 -108 -164 318 -116 43 -215 -72 85 259
7252 259 -201 -111 -55 189 -184 148 -323 251 23 -113 -79 175 209 169 -105 -28 219 -179 -147 -12 -495 -96
7274 -96 6 -212 81 -118 8 51 -324 387 -44 -120 76 88 -26 138 34 -74 105 -145 -93 -122 120 -286
7296 -286 -220 -77 -75 -158 189 -40 -394 -52 -232 14 -195 -137 215 -271 331 156 9 -32 16 108 -149 208 -266
7319 -266 -70 401 81 -35 232 233 59 215 312 18 -17 -12 130 -72 113 -39 24 333 93 275 119 157 -291
7342 -291 159 -13 -56 1 -155 -175 -254 34 -223 -244 -181 49 -48 -7 -149 255 346 53 -39 -30 -264 -506 61 -303
7366 -303 30 158 -222 345 -212 -144 -276 222 -64 -260 -200 -405 -204 21 -272 202 25 -162 -71 48 -57
7387 -57 -143 288 178 43 -61 190 173 -376 99 92 -63 362 279 -11 -175 -62 -68 196 -442 -78 -170 41 178
7410 178 -90 -112 -303 266 409 291 -76 215 -111 166 0 -407 -290 161 -123 461 200 24 51 22 431
7431 431 -378 -546 -118 -86 8 487 236 98 -281 -193 -74 243 -62 -209 -274 -81 172 -51 -291 -324 95 37
7453 37 38 213 -65 215 -34 -461 186 -315 37 183 -335 298 -60 -8 57 37 263 270 88 212 274 129 54
7476 54 10 -470 390 -138 -251 -133 161 96 155 301 236 -190 -356 -180 19 -193 -99 254 104 625 -166 56
7498 56 -47 -265 -15 127 128 164 294 -154 211 -235 43 -146 135 -242 -110 -283 85 -128 119 -179 342
7519 342 -183 274 -267 45 103 -212 36 -62 89 32 -61 -166 -238 42 142 -123 117 -154 73 276 165 61
7541 61 245 126 11 -85 -120 45 197 272 104 333 174 47 53 303 -85 178 137 50 167 -153 -295 113 -261
7564 -261 227 199 -544 -342 -131 -56 327 -127 -294 -182 164 -48 292 -243 44 174 457 -55 395 134 157
7585 157 180 -158 191 175 103 1 -140 -442 -45 135 -185 -194 -72 -210 -369 -172 -148 75 98 105 31 -62 149 -59
7609 -59 147 76 106 169 224 -310 151 90 223 -83 248 285 28 3 198 281 -95 176 -113 48 -198 359 -16
7632 -16 -96 -34 -71 -15 -215 27 -11 -174 -271 227 -181 317 88 -191 -29 -29 -164 142 -25 110 140 -239 290
7655 290 194 -384 271 -124 57 46 -30 157 -100 -293 20 -213 -148 367 288 33 -67 78 -102 47 -58 -42
7677 -42 358 -109 0 -106 -251 130 243 152 127 86 -197 -197 -69 191 -295 50 -68 -229 -30 -198 -173 -59
7699 -59 -126 30 -397 -51 -225 -122 -8 -112 429 238 179 -387 -150 -149 -36 -35 -292 -4 -157 -118 73 68 317
7722 317 -67 -131 291 -146 259 152 -235 244 162 110 415 -41 -8 -116 200 -40 80 35 236 41 164 285
7744 285 -453 -142 113 -77 46 64 578 -288 -231 101 73 275 4 494 -110 -142 -170 -73 253 23 56 68 -131
7767 -131 247 221 138 -145 -5 -384 -156 -112 216 -9 228 55 -454 -492 -149 151 285 -192 -23 357 247
7788 247 -303 291 -40 -186 61 -33 -150 -217 278 16 -79 91 -246 -8 -68 117 -160 38 -86 13 110 38
7810 38 -148 280 46 256 -205 57 127 -274 -350 -161 -72 136 165 -23 157 -138 -85 133 -85 -280 -13 -201
7832 -201 72 239 98 -249 32 333 -130 -75 130 2 41 -250 307 171 238 -7 -45 161 -145 322 -42
7853 -42 -93 -261 142 16 64 -137 142 182 -85 45 -53 -311 -30 359 -24 235 65 -31 -91 192 389 -259
7875 -259 181 -143 -144 76 -22 80 -98 -156 225 0 483 357 -50 73 -52 178 92 146 -40 -19 119 39 160
7898 160 19 302 -84 -192 -56 -335 -311 56 327 6 -234 -222 -86 98 20 -157 170 -352 159 346 -66
7919 -66 48 -220 157 185 204 -194 -208 122 170 -11 30 62 52 269 -118 -236 -166 243 33 -189 93 154 56 -87
7943 -87 86 -280 -173 -135 160 171 -110 7 -137 5 -216 151 303 -219 144 -111 -192 -226 286 -34 -4 -176
7965 -176 169 118 -368 213 57 100 198 632 -120 -140 79 3 21 43 0 412 27 8 -257 106 323 -400 -81
7988 -81 -110 -102 241 -197 66 139 617 333 161 381 26 248 142 300 -227 -89 -257 -176 104 376 -23 14
8010 14 118 -1 -121 -48 521 -49 -61 11 77 204 47 -230 137 147 165 -26 143 -261 100 70 -124 -106 -326
8033 -326 -80 -133 -23 30 51 228 189 -231 52 61 173 -103 105 -146 324 -172 -112 195 -33 265 62 -225
8055 -225 -86 214 137 54 -91 -197 210 -191 286 -395 -155 -46 127 -38 -64 302 -36 135 -48 98 -33
8076 -33 9 -181 243 -339 -15 45 36 -42 58 -124 -165 -27 -139 295 38 415 246 -30 -7 -265 81 -261 -2
8099 -2 -91 -251 -16 383 249 -49 -111 371 401 105 -91 -203 -168 -104 -416 -18 57 -232 165 -83 173 411 -136
8122 -136 254 -181 -3 9 82 -49 -270 -241 144 187 -100 83 -146 225 -228 235 9 -12 52 -2 173 197 -155
8145 -155 -95 -32 -379 -86 21 30 77 79 -157 -471 -83 -25 -174 49 175 -339 109 -23 314 -33 243 -284 10
8168 10 226 110 17 -23 117 -121 -252 -12 -82 3 90 -151 -21 -281 173 234 -263 33 -132 -146 3 103 26
8191B6
$$ Imaginary data points
##PAGE= N=2
##DATA TABLE= (X++(I..I)), XYDATA
0 0 0 0 0 0 0 0 0 0 0 0 0 0 0 0 0 0 0 0 0 0 0 0 0 0 6 -11 15 -16 16 -16 16 -16 22 -26 31 -31 35 -41 43 -50 56 -59 69
43 69 -72 82 -90 99 -110 119 -133 146 -163 178 -198 218 -241 268 -300 337 -384 439 -510 604 -728
64 -728 904 -1177 1642 -2590 5218 -23108 -86571 6301 24181 -18031 30125 48189 -17099 2527
78 2527 48931 7470 -7131 29276 855 -17557 30682 20390 -36585 -17675 11686 -12862
90 -12862 -7732 14506 -23488 -45872 -3841 5785 -23125 -8645 6129 -19390 -3089 39990 13391
103 13391 -22677 4632 16090 -1822 21602 29234 -11225 -3976 29467 5053 -6442 18793
115 18793 -5728 -29594 9380 12889 -28926 -16668 3367 -17191 -2929 21269 -13796 -30870
127 -30870 3350 3755 -8864 12784 9197 -17505 2583 26079 7668 648 10288 -2616 -4237
140 -4237 16902 10816 -11788 -4400 6934 -2308 547 8983 -8410 -19155 -156 5310 -8267
153 -8267 -4726 -991 -12498 -977 17924 1726 -11520 3207 1469 -6092 10772 9937 -11701
166 -11701 -2104 12886 365 328 10104 -6714 -12374 9464 5023 -11468 -743 2521 -8083 3593
180 3593 11647 -4834 -7861 4581 85 -2378 6633 337 -8808 2216 9090 454 -621 1635
194 1635 -4438 -4972 4064 850 -7596 -4024 1292 -1995 481 4466 -3327 -6318 2814 3780 -2461 1687
210 1687 2945 -2647 3376 10201 1808 -1070 4826 142 -2292 4739 1267 -6839 -1052 2336 -3325
225 -3325 -1008 802 -6875 -5852 764 -2789 -5807 -74 -1433 -3224 3227 4211 -115 1461 3798
240 3798 1997 2864 4996 2153 1138 4199 4662 2541 2289 1501 -1344 -1922 -752 -2918 -4841 -3477
256 -3477 -3419 -4100 -2816 -1697 -3987 -3759 -1036 -1762 -2440 352 751 451 3136 4397 3050 4118 4707
273 4707 3092 2684 4051 2079 788 2162 1989 478 531 -769 -2576 -2517 -2757 -4157 -4505 -3427 -3904
290 -3904 -3041 -2107 -1347 -969 -524 -666 123 976 774 1517 2052 2741 3364 3359 3979 3390 2363 2206 1150 309
310 309 21 -259 -1067 -612 -675 -1891 -1634 -2180 -2229 -3178 -2870 -3000 -2807 -2038 -927 -832 -49 1556 348 595
330 595 1447 976 836 1563 1712 1935 2375 2807 2502 1717 2042 418 -406 51 -393 -1322 -1173 -761 -1209 -1359
350 -1359 -925 -1592 -2003 -1628 -1907 -2357 -1531 -757 -712 -550 1215 876 176 1126 1441 -17 969 1815 1084 1415
370 1415 2149 1798 1152 2340 1537 -347 -34 315 -1078 -1158 -452 -895 -2017 -304 -507 -2036 -1086 -979
388 -979 -2604 -1757 435 -1047 -1794 1074 1579 -337 1459 2220 -615 939 3099 1103 335 2563 1241
405 1241 -106 3184 2893 -1301 -331 1497 -1729 -1527 829 -2164 -3644 283 -324 -3007 -654 -505
421 -505 -4151 -1817 2168 -1043 -2387 1270 266 -770 3348 3073 -1918 750 4157 851 909 3661
437 3661 -84 -1856 3765 3637 -1736 -92 785 -3454 -980 3210 -2340 -5399 93 -369 -3580 1425
453 1425 110 -6299 -2157 3876 -1435 -1973 2810 -1388 -2432 6140 4689 -3193 659 3776 -1034
468 -1034 2080 6086 -2157 -4351 4177 2720 -1983 2206 441 -6836 -741 5101 -2884 -5239 327
483 327 -2629 -4130 4244 1181 -7644 -2181 3499 -1613 326 4650 -3490 -4335 7032 5814 -2099
498 -2099 2163 2423 -3814 3170 8771 -2469 -5609 3357 482 -2329 5362 740 -10052 -1545 5994
513 5994 -3005 -3165 1398 -6410 -6001 6912 3191 -7090 -784 1201 -3818 3304 7997 -4371 -5673
528 -5673 6257 3979 -511 5908 893 -7318 3149 9359 -1631 -3307 2624 -3358 -3094 7911
542 7911 1645 -9798 -2427 2870 -3940 -63 3653 -8214 -7722 6479 3405 -5187 1578 298 -6900
557 -6900 4201 10318 -3900 -4843 5084 634 -129 9462 1568 -9447 1818 8393 -2443 224
571 224 3020 -7677 -4332 9316 1999 -8153 -1089 -681 -5821 3794 5694 -8447 -7376 4433
585 4433 1277 -1350 5091 -1198 -7975 3728 9608 -1708 -1560 3065 -3076 -480 10459 3079 -7720
600 -7720 577 4333 -2291 3221 4710 -8141 -6632 6775 1935 -4981 1402 -2253 -8503 3172
614 3172 6694 -6851 -5303 2983 -2575 -716 8326 -609 -8194 3559 6815 -1087 2233 3967 -6371
629 -6371 -800 9608 1812 -4304 1821 -99 -3414 5055 4572 -6729 -4907 3125 -859 -1725 3066
644 3066 -3356 -7947 2543 5205 -3552 -2535 1098 -3747 -920 7702 1249 -5548 1989 3467 -875
659 -875 3959 4626 -5431 -2068 6932 1866 -1883 3210 -1370 -4849 3991 4264 -5265 -2743 1110 -3736
675 -3736 -828 4183 -2731 -6217 1295 1627 -2615 1203 1096 -4944 -719 4975 718 -1804 2642 741
691 741 -1281 4456 3501 -2695 -665 2976 -98 -81 3160 -1645 -3408 1868 2169 -2558 -1218 -326 -3893
708 -3893 -1332 2791 -1996 -4411 437 93 -2385 2186 1312 -3428 -649 3680 -178 -168 3142 -70
724 -70 -872 3914 2974 -864 819 1684 -745 732 2597 -1197 -2230 474 -406 -1568 -385 -1085 -3319
741 -3319 -1187 688 -1264 -1420 574 -826 -1171 1243 1115 -939 -204 1833 709 915 2341 709
757 709 -99 1908 2050 -328 493 1489 -937 -113 1408 -929 -1890 282 -881 -2047 -315 -753 -2531
774 -2531 -1089 -696 -1783 -482 333 -577 -273 1023 457 122 987 739 645 1350 1361 908 803 1225 1126 245
794 245 367 -230 22 -433 -332 -814 -736 -546 -484 -708 -967 -711 -1185 -1073 -686 -405 -508 -5 94 -100 856
815 856 299 463 798 920 925 615 1388 816 747 1019 930 316 307 277 -575 -171 -322 -741 -927 -615 -776 -513 -962
838 -962 -953 -783 -767 -783 -762 -563 -345 -92 278 460 721 604 782 445 784 888 1098 872 796 355 662 219
860 219 570 253 -254 -79 -714 -894 -806 -757 -986 -945 -858 -1269 -889 -932 -510 -763 -390 -281 31 448 568 334
882 334 1036 1240 720 790 1345 1012 197 903 935 234 347 549 187 -563 -45 -698 -1550 -341 -790 -1175 -844
903 -844 -504 -1486 -1092 43 -583 -828 151 -156 -349 421 1245 135 640 1374 859 614 1911 1188 90
922 90 839 1009 -237 236 1101 -928 -1076 309 -913 -1680 -350 -948 -2032 -684 252 -1384 -1282 524
940 524 -756 -744 1664 33 -1115 739 1619 -196 1399 2027 -222 272 2790 922 -577 1083 10
957 10 -922 949 1266 -2250 -1511 322 -899 -1272 637 -1340 -2872 -94 1097 -1394 -594 575 -1529
974 -1529 -664 2855 612 -1915 1185 1390 -478 2133 2488 -1528 -841 3101 511 -794 1377 -431
990 -431 -2446 1532 2522 -2248 -1793 487 -2306 -1206 2361 -1007 -3563 343 931 -1470 705 988
1006 988 -3093 -714 3664 637 -1300 1463 216 -1224 3288 3394 -2008 -1058 2208 -204 153 2974
1022 2974 -1216 -4008 1864 2336 -1825 -361 11 -3695 -1330 3776 -680 -3950 16 -605 -2157 2778
1038 2778 1854 -3795 -1552 3549 445 190 2466 -1171 -3235 3667 3562 -2060 158 1495 -2152 570
1054 570 4580 -1412 -4338 1355 1056 -1803 949 194 -4735 -1325 3376 -825 -2576 546 -1870 -3141
1070 -3141 3629 2800 -3519 -1156 2173 -264 1071 4367 -1252 -3428 3131 3378 -1142 1125 890 -3268
1086 -3268 428 4876 -570 -3419 491 -754 -1869 3327 904 -5782 -2037 2810 -1183 -795 1813
1101 1813 -2822 -3621 3389 2728 -2315 249 835 -2505 2152 5332 -908 -3199 2114 1611 -537 3163
1117 3163 939 -4263 -332 4115 -547 -1347 820 -2935 -2845 3155 1128 -4597 -1086 890 -1784 66
1133 66 2884 -2439 -3194 2363 1742 -658 1806 633 -2827 1738 4770 -265 -1581 1286 -183 -767
1149 -767 3528 1083 -4162 -543 2162 -1371 -223 1138 -3571 -3033 2285 570 -2753 -414 -53 -2334
1165 -2334 1143 2942 -2033 -2000 1543 203 -204 2872 149 -2864 1128 3480 14 339 1721 -1674
1181 -1674 -829 3091 1025 -2157 -35 557 -1469 688 1720 -2567 -2531 1156 196 -1664 1159 -357
1197 -357 -2796 484 2353 -1068 -849 1303 -455 -310 2672 483 -1854 938 1652 -671 959 1925
1213 1925 -1289 -772 2064 230 -1572 185 -131 -2010 338 1433 -1313 -1253 542 -1114 -772 942
1229 942 -545 -1855 242 1284 -322 -199 971 -523 -183 1934 577 -643 899 979 -264 978
1245 978 1773 -706 -522 1141 -156 -533 518 -549 -1411 236 557 -1234 -839 242 -1321 -476 692
1262 692 -480 -1098 329 50 -249 687 710 -349 591 1128 437 187 704 630 388 855 821 -325 23 -1
1282 -1 -200 -164 -324 -711 -1049 -318 -208 -961 -452 -237 -952 -529 270 -77 -379 50 352 -168 708 900 -199
1303 -199 687 864 674 382 637 560 270 675 738 -134 389 104 -613 -559 -296 -831 -814 -528 -486 -459 -613 -387
1325 -387 -368 -386 -561 -279 81 389 318 417 593 513 623 472 598 485 303 268 213 -210 -117 248 35 100 -124
1348 -124 -116 -264 -479 -354 -481 -769 -631 -198 -99 -92 -608 -422 -6 127 -137 411 150 396 561 467 599 165
1370 165 649 478 341 321 -20 264 -171 7 122 -355 -104 -249 -107 -211 -442 -494 -646 -392 -678 -365 -263
1391 -263 -84 73 419 -176 117 381 38 371 541 436 -32 861 404 76 530 473 -78 -70 351 16 111
1412 111 137 75 -726 -42 -143 -823 -469 -351 -509 -845 -38 -681 -487 188 201 -496 269 311 -222 262 683
1433 683 240 42 763 566 79 609 475 -770 174 612 -174 -434 204 -558 -685 50 -19 -995 -381 -76
1453 -76 -857 -772 372 -460 -930 557 229 -458 876 707 -56 538 1394 362 -252 1123 263 166 1788
1472 1788 512 -884 116 834 -918 -279 225 -1177 -1466 159 248 -1365 -18 -322 -1532 228 1122
1489 1122 -819 -468 706 -128 61 1543 578 -1295 808 1538 -222 651 950 -500 -208 1601 636
1506 636 -1400 -296 130 -770 21 731 -1483 -1816 407 239 -1157 646 -412 -1930 -67 1764 -787
1523 -787 -590 814 -464 -217 2133 511 -1778 324 1418 -505 639 1541 -1264 -873 2189 688
1539 688 -675 528 23 -1695 618 1573 -1569 -1537 543 -940 -523 1533 -482 -2634 124 1447
1555 1447 -304 427 749 -1577 -682 2610 797 -1188 885 618 -937 1415 2100 -1814 -1120 1804
1571 1804 72 -388 1554 -628 -2744 321 1664 -1400 -954 179 -1960 -585 2232 -329 -2362
1586 -2362 250 1092 -704 786 1331 -1748 -652 2555 735 -323 1387 -242 -1515 1643 2150 -1385
1602 -1385 -1205 806 -1206 -189 1997 -895 -2853 304 1338 -820 -3 605 -2850 -1096 2161 154
1618 154 -1599 639 103 -1031 1526 1713 -1905 -874 1900 664 410 2446 -553 -2038 1371 1891
1634 1891 -577 -435 711 -1683 -429 2187 -504 -2279 81 -365 -987 833 240 -2456 -879 1507
1650 1507 -22 -880 1058 -688 -1446 2018 1559 -1194 -215 1062 -526 614 2002 -322 -1418 869
1666 869 1114 -274 735 368 -1901 -815 1681 -536 -1635 301 -731 -1269 1391 766 -2068 -851
1682 -851 624 -759 52 1521 -615 -1671 1375 1563 -423 602 364 -1001 640 2280 126 -996
1698 -996 679 197 -437 1130 548 -1765 -693 540 -591 -476 152 -831 -1441 591 506 -1311 -415 183
1716 183 -705 650 1414 -379 -1002 750 580 58 872 748 -970 139 1232 364 -311 364 -239 -644
1734 -644 818 129 -1051 -267 450 -698 -438 339 -798 -762 309 -40 -709 298 -380 -759 72 894
1752 894 203 -184 997 106 215 728 383 -725 583 831 254 687 272 -219 -446 653 186 -992
1770 -992 -165 -270 -980 -557 238 -514 -933 -87 377 -385 153 393 -196 181 662 355 358 789 526 72 1056
1791 1056 34 109 456 314 -57 26 376 -535 -389 238 -197 -733 -113 -666 -536 -135 8 -349 -323 -45
1811 -45 -242 51 590 -70 -411 -182 593 156 155 381 416 220 413 329 23 -19 -13 301 -65 174 -223 -362 -218
1834 -218 -140 -494 -481 -330 -351 -191 78 -519 -128 328 193 -245 349 201 -110 334 428 -23 170 485 184
1855 184 601 482 -93 177 38 -124 -167 4 -228 -457 -259 -300 45 -351 -392 -216 -946 -257 -94 -250 -295
1876 -295 -44 -167 237 -60 54 336 502 111 536 386 84 226 100 185 254 41 111 10 -271 158 11
1897 11 -501 -167 -643 -348 -370 -346 -384 -578 -304 -463 -273 -10 74 26 195 288 328 653 463 389 62 288 381
1920 381 254 553 130 276 306 342 131 -124 -16 -22 -427 -201 -30 -608 -375 -30 -403 -398 45 -184 -477 215
1942 215 190 -320 369 190 2 268 615 297 310 695 461 309 549 502 84 92 36 -455 -156 215 -46 -211
1964 -211 -469 -344 -431 -395 -96 -618 -132 92 -20 -426 254 6 -370 356 601 -84 -125 496 221 126 861
1985 861 419 -246 492 374 83 156 624 -832 -374 613 25 -614 73 -308 -705 -165 163 -550 -493 392
2005 392 -558 91 684 -128 -703 518 859 -122 266 771 -251 198 883 482 -738 100 -129 -405 270
2024 270 137 -682 -735 417 -198 -285 26 -539 -1237 580 454 -949 -438 290 -272 429 1045 -318 -759
2043 -759 392 591 -393 498 504 -980 -322 1194 22 -49 244 -395 -422 1046 644 -1234 -797 152 -610
2062 -610 -2 512 -809 -939 346 964 -876 365 94 -966 178 1383 -324 -676 891 -26 -347
2079 -347 1317 957 -1196 -356 1097 -155 -191 824 -737 -995 888 378 -865 -79 -81 -822 -149 767
2097 767 -433 -1047 327 -116 -2 561 85 -1581 255 1563 -144 -401 466 -27 -668 1740 800 -1124
2115 -1124 164 365 -445 737 999 -961 -1134 340 394 -522 163 -158 -1199 -65 1082 -708 -692 227
2133 227 -419 195 1503 -29 -1165 -66 831 166 697 994 -489 -737 1274 515 -367 435 443 -735
2151 -735 396 966 -536 -855 184 -214 -428 1044 55 -1490 -258 864 -462 11 317 -879 -550
2168 -550 926 565 -866 -87 607 -345 514 681 -675 -718 1076 328 -74 583 227 -795 546 800
2186 800 -512 -532 330 -564 -418 754 121 -1449 33 236 -841 406 649 -581 -384 1190 -54
2203 -54 84 470 -177 -323 372 1196 -563 41 524 110 -76 660 199 -439 309 533 -247 -245 10 -1263
2223 -1263 -688 807 -216 -834 -2 322 -168 293 174 -904 -506 404 -204 -143 497 213 -345 464 786
2242 786 120 -172 164 -190 112 606 -295 -839 -49 350 -281 45 387 -702 -827 -34 -168 -699 -229 52
2262 52 -618 -124 93 -399 -119 302 -391 -207 502 91 -12 76 377 144 147 59 -711 191 544 -355 -560 376
2284 376 -212 -323 -97 151 -457 -223 -146 -406 301 -110 -243 40 83 20 -99 -111 233 -30 77 6 37 -180
2306 -180 81 99 341 242 77 -258 -31 395 -445 12 -79 -105 -376 -224 -125 -281 -48 -214 -468 -347 144 -278
2328 -278 18 214 -273 192 221 376 -76 431 432 -68 253 481 190 232 251 322 43 -191 313 -92 -200 62
2350 62 -346 -51 -86 -281 9 -85 57 -71 -143 56 95 139 172 -150 340 80 111 307 313 493 2 257 598
2373 598 231 37 548 136 -103 36 29 336 -530 -514 -108 -332 -469 -172 -193 -321 82 89 193 28 173 152
2395 152 43 -15 208 298 106 18 101 -157 19 -190 -4 -59 -254 157 -256 -5 5 36 9 -539 27 -97 138
2418 138 -236 -306 -33 -149 367 -286 -19 -67 124 150 384 135 237 421 128 226 207 308 196 -174 277 -80
2440 -80 -185 322 -475 355 -192 107 130 -238 -191 -145 -136 -262 -430 -452 -71 -216 -189 -359 456 -293 -122 395 1
2463 1 174 563 -444 114 377 245 10 -114 -37 220 92 170 -134 -460 137 -137 75 -341 185 -247 -294
2484 -294 115 -512 -62 -7 -283 -262 256 524 -669 198 192 -228 245 359 -72 -375 362 123 227 876 106
2505 106 -165 161 257 -292 -139 114 46 -210 245 -104 -525 -286 265 -254 -115 558 -301 -190 121 -37 153
2526 153 -140 394 -53 151 470 -172 43 466 3 0 255 33 -534 -7 149 12 -256 -16 -641 -174 500
2547 500 3 -312 -132 -216 -515 193 -80 -470 -365 720 -142 129 764 91 -595 217 567 178 10 286
2567 286 19 -170 448 406 -770 -210 122 -322 131 415 -366 -814 378 -357 -121 130 -198 -565 406 651
2587 651 -290 -249 -118 465 -47 896 231 -918 292 733 -261 187 100 -490 -479 890 441 -587 287 -526
2607 -526 -156 458 581 -549 -528 588 -239 -55 379 -255 -392 585 649 -298 -200 4 -354 135 645 96
2627 96 -571 107 285 57 602 510 -477 -238 94 119 -117 -55 -340 -809 501 591 -176 -425 -116 -303 38
2648 38 171 -148 -751 -47 171 -334 241 85 -715 -113 687 180 -414 93 290 -93 604 932 -385 -251
2668 -251 348 -173 -85 558 -72 -680 250 181 -881 -55 139 -600 -175 590 308 -710 94 153 -221 618
2688 618 411 -751 -263 488 352 224 581 -324 -437 433 587 201 55 9 -333 173 558 -416 -571 -19
2708 -19 -30 32 336 125 -399 -192 470 -73 -6 376 -178 -642 500 342 -256 56 216 -160 114 951 128
2729 128 -507 268 468 -399 65 292 -527 169 366 -226 -489 103 -311 -213 521 138 -558 -170 189 -136
2749 -136 239 -139 -257 -177 210 293 86 206 2 -228 147 230 101 -188 82 -15 -68 -118 126 -215 263 155
2771 155 -543 -18 272 -31 -188 497 152 -164 290 192 -31 150 234 58 26 102 -170 254 158 29 -73 222
2793 222 527 8 236 360 -295 -162 -175 150 -386 25 238 -530 -254 -68 -319 -173 206 116 -206 246 -117
2814 -117 446 165 -39 31 179 369 598 -329 316 92 173 -46 24 524 -339 -136 -185 -78 106 -92 -114 19
2836 19 -107 -13 -133 71 -370 58 -94 -50 -298 -102 -95 120 304 97 -12 292 -264 0 137 440 155 19
2858 19 356 36 11 -103 197 -98 -284 -81 -22 -297 37 -212 -32 -70 57 -177 -179 -135 -93 83 35 60 316
2881 316 134 152 83 -249 280 139 250 176 -406 169 72 -24 -114 -91 436 -28 -45 219 -4 -61 139 -24 -341
2904 -341 -89 128 160 105 -330 60 232 53 -126 -581 433 172 -333 -127 -20 118 -47 190 -286 -11
2924 -11 137 110 -362 -295 -259 -115 -50 -153 -202 77 -136 -153 -193 -298 -98 138 -6 189 -100 -56 -77 194 136 -195
2948 -195 151 101 95 -121 -117 -30 0 349 373 85 279 -116 -201 29 -23 -269 -129 -257 -376 312 -399 -192 282
2971 282 94 -89 -27 -137 11 -269 -63 107 38 125 104 240 323 473 202 167 318 -146 -129 260 -71 -284
2993 -284 41 -99 90 190 -60 10 11 -196 -420 312 51 239 -155 -139 -24 129 55 473 -317 397 117 -207
3015 -207 323 8 -4 3 -236 219 -255 -365 20 -39 -235 -120 322 -158 -207 -119 -208 84 286 -50 99 81 218
3038 218 -54 167 288 73 -213 358 -54 266 155 3 -26 347 -161 -363 37 419 103 42 45 -161 168
3059 168 -302 127 -297 -274 -73 -109 -175 311 0 -309 269 -471 156 90 6 -250 206 573 20 99 246 114
3081 114 -32 -75 173 -299 460 -303 -202 20 440 -331 -10 333 -57 136 -2 -204 -105 223 380 211 98
3102 98 320 -372 -98 320 -69 -374 276 198 158 296 273 -196 127 307 -141 -630 -317 -360 -397 219 89 -341
3124 -341 -359 37 -352 -317 119 20 -398 139 138 -4 147 427 130 -60 343 217 121 183 420 -272 188 76
3146 76 -278 -120 336 261 -298 22 -89 -84 322 -132 -560 -38 -191 -396 -78 323 -151 -403 168 178 186 51
3168 51 35 -432 -139 416 -160 -187 313 18 259 36 41 91 158 114 254 -351 82 -167 -822 -72 130 155 -140
3191 -140 191 -221 126 -26 -17 -190 74 -73 -120 269 182 58 -341 150 25 -13 392 181 -245 20 204 -338
3213 -338 -141 25 338 -38 392 213 40 55 333 67 -274 -38 -294 79 423 -295 -179 -78 -262 74
3233 74 180 503 14 42 139 44 119 267 -137 -63 44 -39 -35 -93 201 -144 -79 39 31 -505 24 -63 -146 51 -223
3258 -223 -385 253 95 -247 22 -8 220 -9 259 -206 32 -16 -15 -3 -58 10 154 -404 503 -227 -166 244 -49
3281 -49 -97 502 0 -582 -161 -89 24 -244 313 170 -93 -15 97 -74 427 107 -168 15 -200 364 98
3302 98 -72 146 71 -149 -172 -331 -94 216 207 3 -160 -47 25 143 -245 201 -251 -61 -49 -119 -51 10 16 255
3326 255 483 -267 217 48 -43 -278 295 -105 47 -226 38 326 245 -111 71 -131 282 70 -118 244 -11
3347 -11 -401 -81 25 -87 -308 156 133 276 67 -159 128 57 -90 -195 -11 -20 68 175 197 206 190 -38 -277
3370 -277 278 32 -138 -239 -62 64 98 84 70 -19 -157 -93 192 -386 274 -103 15 161 -130 168 101 24
3392 24 68 61 41 12 -21 -350 62 116 -209 302 -102 257 -107 63 -353 -216 -160 -155 115 3 -211 -337 -146 -27
3416 -27 -364 583 242 -47 -381 18 340 155 142 206 173 119 262 -96 -54 127 -96 -60 38 442 194 -113 18
3439 18 -156 -341 -61 -69 -53 31 -36 -205 -101 -52 -386 338 -300 -55 -386 -24 228 -100 224 -112 32 468
3461 468 -17 145 29 139 340 110 -198 -39 117 -48 -7 89 280 3 -163 -376 61 278 -251 67 -160
3482 -160 -349 187 54 158 -194 26 174 -124 77 343 200 110 -204 -73 217 162 -61 -55 155 74 -353 354
3504 354 -24 -24 -186 -90 184 55 -20 -131 199 -37 -45 141 72 -313 -283 -39 114 86 41 -213 -403 -71 219
3527 219 294 -11 72 -11 -261 60 129 -119 -70 -265 -28 -132 37 115 -23 -109 120 -402 380 196 -615 -292
3549 -292 135 -163 -18 46 -212 -190 384 4 -193 -172 327 -164 422 300 -209 -53 33 374 -213 -135 295 -154
3571 -154 157 -32 318 -327 -167 64 130 -31 151 -79 41 174 265 -305 5 354 -194 -99 313 -377 215
3592 215 372 -329 -5 10 7 -227 -175 -37 57 86 159 1 56 35 -286 143 118 26 -333 171 -160 140 -140 227
3616 227 -49 -93 42 51 41 181 26 -217 -5 40 -30 -78 239 -322 -202 -305 -61 -146 220 105 -143 -165 184
3639 184 310 -306 -128 135 -394 178 -87 -313 485 6 -143 167 47 97 -233 -166 148 -294 267 -81 -100
3660 -100 -136 176 -234 -344 -31 194 201 -66 19 -137 -50 -333 -187 -21 401 -31 8 -150 408 72 29 42 -353
3683 -353 7 59 -39 -136 143 -264 273 339 101 -75 -432 -164 265 459 131 -273 -49 -108 431 -36 65 -227
3705 -227 -317 -106 164 -174 -487 -53 -14 -116 191 -98 -61 -187 -398 172 -43 288 -17 -286 237 215 -402
3726 -402 535 -232 -330 140 393 -216 -530 14 319 -235 -389 145 -299 174 420 -287 -86 224 284 -146 5
3747 5 13 -120 -164 -166 215 273 111 116 65 380 284 169 96 130 352 -250 573 48 -370 -19 77 13 -126 2 -146
3772 -146 -99 52 49 126 -86 42 134 401 201 119 -239 292 59 -227 -158 -29 219 7 109 -3 -504 -108
3794 -108 -173 4 147 -69 -8 14 -169 -169 377 178 -52 -9 -113 -381 240 -135 65 322 -28 68 92 -97 -30
3817 -30 -105 -5 -42 -90 274 356 -47 -413 -326 -32 -226 -19 172 176 -121 221 -156 21 258 112 158 -381 -5
3840 -5 -78 244 110 -96 120 -233 -91 15 172 63 -283 19 253 127 61 64 -153 -253 -43 -173 31 49
3862 49 8 -405 -12 189 -310 -388 35 -33 -90 323 -138 -166 17 -106 -190 121 378 -125 -105 47 257 196 -439
3885 -439 297 333 123 -182 -76 -153 -257 -367 -48 -51 -213 146 -31 5 5 -71 90 -227 -85 128 23 191 -28
3908 -28 -100 -267 -418 3 141 87 -200 -8 148 -124 33 -25 -232 -203 311 -34 -103 -100 10 38 -28 254 161 -358
3932 -358 153 -109 -108 179 -80 -173 258 -122 290 -213 90 -65 -131 -15 -37 -68 -76 57 36 -16 -43 48 -277 95
3956 95 -120 -56 -321 10 17 151 -99 -60 -349 -126 -104 19 117 -68 191 36 -337 -1 290 -220 170 200 96
3979 96 281 -68 242 -21 -94 -79 -202 255 256 -16 -44 143 -241 100 -96 -41 -134 148 303 300 451 -387 245
4002 245 7 -136 269 377 -208 -100 36 228 -172 -40 232 72 138 -135 -162 50 -107 -43 46 -167 -186 231
4024 231 41 115 158 -164 175 -251 -19 -167 161 -36 -137 -111 58 115 -130 102 96 -124 89 -395 161 93
4046 93 242 99 194 -62 -61 270 -147 -61 -249 -212 49 -2 261 -94 -88 187 123 132 142 -34 -274 -210 -46 159 -208
4071 -208 95 13 203 16 -312 -154 -47 175 202 -36 -168 -89 -181 -389 -69 212 -49 -56 92 -48 -95 -175 121
4094 121 -277 235 -165 -219 206 182 71 280 339 208 24 -229 -7 -31 584 61 -277 40 209 89 67 98
4116 98 8 -243 18 -105 -244 91 -196 -423 -18 64 -79 78 119 -5 -41 195 -96 -34 199 16 54 70 -78
4139 -78 199 84 135 146 123 -28 242 -302 -211 242 -91 148 215 -32 -46 -121 39 -199 183 454 14 119 70
4162 70 -150 -435 235 -317 -238 23 332 134 58 66 -81 48 -115 122 -228 -195 -13 110 23 69 -171 33 265
4185 265 -98 -169 270 -76 -101 -72 54 -119 63 255 -11 116 0 83 -113 86 -455 162 -9 -51 -445 489
4207 489 76 47 430 40 -197 -312 136 -2 -154 -43 109 -274 460 -94 -142 -246 -269 -426 -58 179 -24
4228 -24 -430 -75 227 248 -10 190 -273 -201 48 -50 -136 -70 -262 63 229 69 118 -127 -98 -160 -81 -247 -343 -384
4252 -384 -247 48 -151 -89 -6 -31 86 121 120 138 -125 -2 129 256 141 -315 -160 176 328 64 -69 214
4274 214 -157 279 239 104 -131 -242 18 22 35 -461 -279 -295 63 517 0 -245 -171 -3 -13 138 -14 289
4296 289 130 86 3 33 -8 51 174 -79 -272 -289 69 39 26 -47 440 -24 -174 -246 4 -286 487 -104 -151 -193
4320 -193 259 186 85 -58 207 -26 -126 114 -107 -277 -114 28 30 47 190 -117 -191 303 -69 159 -156 -488
4342 -488 -200 86 -138 -235 152 -109 298 131 292 56 272 97 194 125 -115 94 -327 -36 65 -262 119
4363 119 -258 299 -394 59 239 -203 -278 236 -115 -373 -24 -304 -495 34 19 -179 66 93 -36 -96 -215
4384 -215 -122 -184 274 -124 93 32 78 -38 -41 351 -96 4 208 218 124 -77 -31 68 -296 -73 117 -19 -114 103
4408 103 -129 288 -165 -168 377 -350 21 47 152 170 -261 -255 -206 -78 -164 136 -85 -94 -276 42 77 0 -209 87
4432 87 -211 16 175 -79 256 -377 -121 -366 91 -201 -233 52 -88 -365 -350 -22 198 -95 -84 25 -390
4453 -390 234 32 -349 228 236 -189 304 -60 -80 -7 194 -1 -145 99 -225 -267 36 67 37 -95 -27 -368 252
4476 252 100 -91 428 327 -95 106 -116 -311 -49 474 -348 7 111 308 8 20 -352 108 62 -196 40
4497 40 147 127 213 165 -58 394 -240 -223 -31 -194 120 -95 -104 -32 39 131 105 23 -195 -423 -262 8 208 154
4521 154 434 130 -164 157 165 178 -12 1 -53 32 -20 17 -272 -66 29 -280 -503 -124 -83 -10 -52 72 87 -144
4545 -144 108 348 -23 -14 97 -335 -227 -12 -205 289 422 -331 -186 -111 -157 111 -184 74 -62 11 309 173
4567 173 -45 -383 -16 26 -174 85 -231 -125 -10 42 148 -283 156 -50 -326 53 -63 10 81 94 28 103
4589 103 -111 69 -34 -331 221 237 -188 140 -245 -201 -40 -369 104 129 126 7 -261 -206 -5 73 -102 62
4611 62 156 176 213 -419 339 -70 148 -24 135 -18 -86 -11 -316 -232 46 62 -21 302 -190 -336 2 -35 11 54
4635 54 -206 104 -85 -151 -117 -275 41 -133 -36 -221 -39 -42 15 409 287 29 91 156 207 150 -57 132 322 -97
4659 -97 -126 448 38 31 -390 46 108 18 22 -183 -101 288 -109 56 -162 -313 -199 -237 86 -111 322 327 -75 425
4683 425 152 68 57 107 387 256 145 -95 -110 71 -342 -310 -366 -202 -23 -156 403 -333 51 236 230 180 -232
4706 -232 150 -182 155 190 455 -138 56 33 -59 345 306 -69 -264 -88 235 -76 332 37 -81 -80 -387 -96
4728 -96 73 161 238 -125 53 -27 -206 -255 -168 -141 4 241 144 63 -17 145 -91 9 -132 61 -112 14 19 -311
4752 -311 230 28 -280 188 -20 -11 34 265 100 119 -61 296 49 125 -86 227 -246 19 -322 392 4 98
4774 98 138 117 258 17 89 327 164 -461 49 63 -289 82 437 -230 67 -43 -219 -112 104 119 -18 192
4796 192 -45 28 -80 -256 -116 318 95 98 -119 35 -98 295 -126 212 -9 17 -220 -160 281 34 -146 115
4818 115 25 -228 -110 -151 -20 -86 -279 -20 428 342 93 -88 33 60 146 -179 58 351 -71 133 -22 -48
4840 -48 357 60 -64 78 -42 104 -149 267 191 -129 -148 216 212 -302 182 249 146 130 70 -308 -210 109 -138
4863 -138 -211 -76 -123 -38 95 -347 137 -44 -103 164 -76 -59 -70 -93 36 -22 -113 83 393 -71 -95 -10 -357 -175
4887 -175 -186 31 -34 150 -499 -143 -59 -201 46 -42 71 488 -180 295 194 18 -3 -99 56 84 -165 -183 -228
4910 -228 297 -286 -130 142 236 170 187 359 170 224 146 -118 -228 195 144 66 0 -254 -29 -368 -195 -295 -104
4933 -104 -283 243 -252 -193 -225 -450 76 -108 166 71 98 119 -536 -313 205 110 -242 -207 -149 -242 -301 -109 106
4956 106 -172 7 -50 -148 130 10 6 160 169 78 -116 -199 -132 248 144 33 202 358 116 176 328 -124 514
4979 514 -23 -156 62 -26 56 42 17 -61 13 -31 80 27 110 -20 36 -253 177 130 60 200 -166 -354 225 -110
5003 -110 -227 -68 90 92 -294 221 -86 20 29 532 -298 -223 329 77 -157 -34 108 -222 204 38 135 -177
5025 -177 -440 223 -220 -79 -216 39 232 -259 24 42 78 231 121 137 -173 86 -382 70 -189 -128 -143 -220
5047 -220 158 -320 -12 60 22 -139 33 136 -186 -59 56 -119 29 132 61 -121 32 -65 -2 52 -39 173
5069 173 -348 -167 -36 -12 -79 -150 180 -140 312 -130 -44 -206 -162 76 -4 149 -392 -50 196 -141 -69 -330
5091 -330 17 85 90 -70 51 -190 117 -80 264 -160 108 -52 102 73 -92 205 -369 263 -383 100 125 48
5113 48 111 238 139 69 65 -235 31 -137 -116 -65 -95 -187 -177 486 156 -108 371 -48 123 -128 -340 -242 155 350
5137 350 -173 -140 -280 -69 238 20 -186 339 -13 -11 -36 4 52 32 -6 241 193 30 -108 -52 -39 -328 -70 319
5161 319 97 -101 -52 -81 374 88 290 134 247 23 -14 107 370 -40 92 101 480 -482 176 168 39 -124
5183 -124 108 3 -18 99 -63 76 -27 37 -457 86 65 130 167 92 -78 -124 -249 114 233 -58 165 45
5205 45 371 147 -80 230 -343 -611 -56 -17 74 -536 87 56 -195 94 -243 -30 210 138 -337 -153 -225 -118
5227 -118 -59 48 29 29 -3 356 -38 -172 79 190 -201 81 221 -390 -432 304 -18 -89 -15 230 -270 224 73
5250 73 -157 -8 40 -4 24 91 -42 199 -60 81 -58 262 71 -146 45 -16 83 159 221 105 -385 -12 47
5273 47 -339 29 -121 -269 -54 115 -163 -105 -191 -58 224 -3 -70 133 103 201 -38 338 110 -228 -185 -158 210
5296 210 -150 51 14 147 24 105 217 12 -139 17 293 -115 108 3 -171 240 -48 -64 79 130 -85
5317 -85 -91 95 158 176 109 -235 -149 129 -84 -554 -271 102 140 -79 -24 -269 97 100 142 99 -204 142 92 -268 22
5342 22 -58 -271 131 -396 142 -272 53 -120 -180 303 38 -83 -40 293 -277 306 110 -171 440 170 5
5363 5 232 202 -83 13 -159 89 -174 -59 -42 -512 -283 73 -106 177 -258 -2 -204 -295 114 -26 84 160
5385 160 355 -115 57 85 -195 -141 269 231 172 219 -97 539 228 239 -60 274 2 109 49 -454 268 69
5407 69 -199 85 -152 -57 148 -81 -221 178 -150 -3 192 -113 -139 45 -149 165 304 -9 -107 -31 183 -202
5429 -202 115 300 139 145 -149 -74 70 -169 141 -70 188 -239 -243 323 -113 6 54 -27 -190 252 25 -50 124
5452 124 -9 9 -9 -168 -166 -180 -7 230 -65 -99 -1 379 -379 205 -104 97 -58 -247 -43 160 -34 232
5474 232 152 200 -459 100 83 -57 -170 33 474 32 -111 -99 185 190 -75 144 -199 -106 -147 -22 -170 37 -94
5497 -94 -340 -436 48 -121 201 -503 -29 -33 -105 40 -285 -86 278 25 152 47 189 -29 -163 147 174 158
5519 158 -52 87 62 257 65 -171 -43 69 -544 287 202 99 -110 -300 -10 109 -53 271 223 119 -115
5540 -115 114 32 -108 -190 144 -86 -103 -319 -212 -147 -8 -164 329 -179 -131 21 -226 219 -97 147 233 128
5562 128 -266 -212 342 -180 126 -15 -51 -240 -340 -460 -233 -447 -234 33 -234 456 91 73 -146 202 -173
5583 -173 -105 90 30 -130 -49 93 207 174 48 -137 26 35 29 -342 151 149 82 22 47 -167 -82 -167 -70 -20 -81 -616
5609 -616 -126 -118 94 -77 -75 128 126 -140 -226 137 -118 38 179 87 -23 145 -130 -104 560 -289 255 -108 188
5632 188 -148 -340 191 -248 105 -52 -1 138 298 -284 -221 -51 -70 318 212 348 -274 -348 -66 -93 -47 -51 -210
5655 -210 -30 -71 -295 115 79 146 99 -335 10 -72 -27 261 -92 79 -45 -124 -132 -30 38 254 196 -237 -168 -386
5679 -386 98 181 -222 71 -83 -90 406 501 15 -57 -46 -616 -57 174 -254 85 153 199 293 19 117 -14 -16 93
5703 93 -44 207 -207 100 -230 193 -168 -154 -380 -254 -135 -142 39 310 113 -72 161 -3 46 381 -204 38
5725 38 210 99 -46 83 198 105 -273 -240 110 -179 267 331 -129 -100 -10 -1 43 74 -120 -216 447 195 262 646
5749 646 121 18 -12 -172 -289 43 -268 81 153 44 1 313 -26 -188 6 -17 186 -47 241 56 -149
5770 -149 19 170 150 94 110 -15 -128 283 313 194 -653 95 373 -305 -185 -59 -535 -371 221 -114 292
5791 292 80 -291 -255 -248 138 193 255 -152 84 -166 -257 146 -213 -129 -142 -151 75 -268 72 17 110 77 94 119 -170
5816 -170 -147 103 -150 54 -170 145 1 37 174 -153 -37 67 -281 -13 0 -11 48 -384 -354 53 9 -53 -188
5839 -188 257 488 98 -69 35 195 226 59 -259 60 263 142 149 -144 315 -277 -69 474 -228 151 -181
5860 -181 -54 177 -178 216 -317 144 -102 313 -36 82 13 -202 165 83 81 43 47 -43 -10 -26 -13 185 -332 34
5884 34 -192 -235 7 176 -117 -131 -264 171 -131 -116 -346 -385 306 170 40 -236 34 -2 -269 54 43 266
5906 266 -107 155 -19 63 116 -60 64 -332 248 144 257 155 438 172 109 188 115 44 3 -116 -158 -25 -48
5929 -48 -197 -102 -132 -118 12 21 54 -122 248 -244 -162 -24 268 -71 149 169 122 -152 1 -166 268 -337 -11
5952 -11 -172 -6 -32 348 177 -3 44 204 -164 251 -1 -293 -75 -74 -85 111 108 -3 -309 -188 -401 13 150
5975 150 -311 177 -206 -180 76 325 307 -335 -74 -23 167 70 -190 55 -121 -115 -89 -23 -70 -61 -316 -18 -195 63
5999 63 106 225 246 -418 -170 39 60 -335 206 225 297 -56 243 -132 -89 48 68 -154 131 -25 60 28 -162
6022 -162 65 327 -76 2 -170 10 209 -50 -25 -241 86 -198 528 86 -479 -188 -97 -383 -100 424 38
6043 38 90 103 -475 83 -276 219 303 -13 281 69 9 243 52 -63 -210 12 140 -125 -73 -296 63 -10
6065 -10 -145 264 -204 -210 -120 -148 -19 -239 -45 247 -26 159 104 34 206 -331 -311 -198 155 189 -270 -90 -206
6088 -206 20 -304 114 17 -126 71 -136 -55 -325 16 -196 -55 -15 207 278 -126 -272 0 19 47 51 8 -26
6111 -26 -26 263 -121 -164 -262 -38 -111 -292 -126 238 -34 -55 79 274 97 -203 -64 -191 -108 -476 -126 120 107
6134 107 -287 -15 261 29 -416 -2 354 108 104 -3 -230 -22 -377 -46 -16 6 -265 64 -332 -110 -24 180
6156 180 -11 377 91 178 -212 -48 431 205 365 17 276 45 319 118 -196 414 -161 10 100 193 -23
6177 -23 -30 6 -37 143 -98 149 -66 -207 -145 531 -290 -287 48 89 295 144 364 -104 -144 117 -157 134 -110
6200 -110 46 -191 -65 237 19 124 138 -220 91 143 -111 -95 480 -151 -103 44 -376 12 431 12 -122
6221 -122 -188 131 -296 37 -71 28 -182 314 -40 86 -7 142 111 90 -115 237 254 -121 39 123 98 112 -88
6244 -88 -385 145 -2 38 -58 308 -84 -103 102 144 204 144 -44 18 37 26 530 46 -79 -344 -28 -56 69 -13
6268 -13 -288 83 359 92 160 32 19 117 -236 6 -63 99 -257 -249 -48 -28 -237 -104 -217 273 30 -54 -198
6291 -198 68 -11 39 96 -42 22 159 -28 118 46 -179 -104 -71 241 -225 191 240 96 283 -126 337 -368 178
6314 178 -152 160 87 115 -91 172 283 -122 276 -318 61 -297 -164 87 104 -343 -117 -45 70 305 12
6335 12 66 251 -258 -53 124 166 152 -286 153 116 -111 -51 87 86 174 84 -130 -219 52 -65 -8 -45 64 171
6359 171 428 6 -55 -93 -272 -132 -128 -80 -10 -192 -447 -102 116 -193 95 -118 -3 157 -332 -373 -292 -186 -225
6382 -225 248 53 -27 -286 -352 -169 139 428 -235 110 -281 -20 -278 -130 -371 -193 -288 -148 -131 -293 -62
6403 -62 -25 -297 90 261 -221 -132 356 221 -283 -261 -67 -14 -344 -258 122 139 -197 430 -62 261 79 -80
6425 -80 187 123 147 -109 -302 -146 191 169 -103 106 -205 -87 -52 52 195 149 251 -12 -87 -27 -389 -228 71
6448 71 51 -85 -88 67 79 -209 -316 -7 -59 1 -128 -4 -44 24 -277 -51 -39 217 -148 265 162 122 34 -26
6472 -26 364 136 -143 -88 -1 -237 -99 -199 228 -122 85 -87 134 -18 -158 -36 88 17 140 186 -29 214
6494 214 6 210 -420 402 60 -267 55 108 -7 -24 134 55 -135 88 -240 -132 -300 4 -100 -91 -12 355
6516 355 -71 -120 -460 60 204 -217 54 36 -84 397 35 -285 -62 -60 15 314 17 155 -170 -239 260 245
6538 245 -166 -183 168 10 -194 -233 78 75 -163 -129 60 -288 -3 -140 -100 50 -294 -225 -227 -201 68 110 403 -90
6562 -90 71 -219 -172 -135 13 -94 -234 -38 -208 -257 -382 -19 -63 -162 -315 -157 181 194 460 -62 -141 283 12
6585 12 -87 -44 -216 -58 -159 -322 -58 -133 -62 -42 -20 -65 89 203 14 -309 -285 15 143 -296 130 26 70
6608 70 -12 -20 -126 -17 51 48 25 94 91 -201 47 -42 -353 -277 -21 58 -61 -99 259 395 -19 64 -32 -323 164 -53
6634 -53 -173 251 -10 151 50 -99 141 -495 128 -94 -95 -121 79 -199 465 -11 -50 -402 -274 118 285 179
6656 179 239 41 -338 225 -259 -109 231 139 -23 -88 -198 -9 167 -390 -252 238 -357 -121 -40 27 65 -105
6678 -105 152 -41 -103 125 -104 85 -394 -495 54 -95 212 102 -32 -133 -30 -208 86 -96 110 -244
6698 -244 255 75 -111 396 -87 -83 -134 -84 -129 30 -34 -118 151 -143 220 -116 -226 148 139 -82 282 65 222
6721 222 -294 -285 362 -359 81 172 284 118 118 -63 -210 7 -31 -249 15 20 -157 -30 248 -219 271 116 154
6744 154 -113 -187 -3 242 48 -111 -29 56 146 20 166 75 305 211 -26 -227 -604 -197 -67 -14 -190 -214 -86
6767 -86 245 -154 -107 -204 22 44 -322 83 -209 0 -114 -1 358 -202 -51 -273 122 55 -203 333 42 34
6789 34 297 341 -302 -162 314 120 -134 54 190 -95 -221 186 318 249 651 -69 -51 150 -132 108 129 90
6811 90 -26 -7 149 18 -479 8 -69 -131 437 -205 -3 96 -46 190 -56 90 6 -170 -131 -348 -228 5
6833 5 -128 212 -112 -64 -41 509 157 -171 89 213 136 -437 74 67 25 -210 -119 9 59 32 537 -47 -147 204
6857 204 -143 -292 -179 -147 -27 150 -155 -211 -238 178 -181 72 -213 13 -440 -25 -201 158 -78 152 -267
6878 -267 185 56 215 292 221 205 24 433 154 33 39 -331 -18 -157 386 14 277 -47 -114 -331 208 -91
6900 -91 248 218 -185 -124 34 -19 128 -21 63 60 -252 -239 -209 -333 92 -69 -461 -258 82 14 -208 15 -135
6923 -135 73 -162 -7 46 -48 334 -226 -30 -84 59 -19 -98 340 212 -164 -95 134 -89 120 217 130 187 189 191
6947 191 34 -144 -27 248 317 -37 112 -264 157 33 -274 204 206 -74 195 -274 -56 11 200 -27 36 165
6969 165 157 54 351 -72 145 -236 -20 55 180 195 -70 -46 47 221 -7 35 149 -493 -140 -122 -136 261 -164
6992 -164 -265 -160 -92 52 -196 -245 578 56 -50 202 -56 316 413 41 -82 -115 288 68 106 -58 -277 -36
7014 -36 -164 72 -381 -188 30 -53 -70 -27 77 -46 -39 -308 116 -143 -111 14 36 -241 -112 -100 71 203 182
7037 182 -131 -104 -74 -31 -144 -57 241 -316 -43 -17 7 -70 -150 -29 171 -178 16 -350 -285 -65 214 41 -205
7060 -205 190 394 -206 -32 -19 -436 -282 245 355 55 134 294 72 -36 95 116 -70 154 176 -2 128
7081 128 213 -87 -164 392 313 -140 244 24 -105 -78 -210 -20 -264 248 -145 -408 -41 -77 -31 -123 400 75
7103 75 80 -65 81 3 29 -118 10 -300 -52 15 9 7 -158 37 -116 473 -111 530 -281 -26 -316 -397 190 -75
7127 -75 -80 -163 206 -169 23 191 244 -275 57 -99 -287 -82 -73 57 -141 192 -424 54 165 283 30 125 290
7150 290 111 47 426 -219 -54 228 73 144 81 -259 347 56 -156 16 266 327 349 282 -332 -300 182 167 38
7173 38 -190 -151 161 156 101 98 -220 -230 -126 -42 13 -176 21 -247 195 -248 -286 -219 241 2 -87 -162 -28 120 -426
7198 -426 2 -104 25 -267 91 -95 197 136 34 153 190 147 103 249 124 -217 -50 -22 181 199 13 303
7220 303 429 247 61 36 -48 -205 -301 91 -24 20 -462 -166 -15 116 -87 -194 -122 -126 -41 -295 108 -167 -130
7243 -130 83 6 -28 418 -109 154 65 -89 -108 101 169 -236 -43 -10 36 258 531 20 2 230 -11 126 -141
7266 -141 52 -17 4 12 337 -121 -190 207 194 92 49 -257 151 290 290 -276 -164 -139 -29 8 190 -5 -222 -254
7290 -254 -131 -160 -118 -62 -446 264 16 563 190 321 245 -70 -263 155 -132 -292 -25 0 -190 -110 116 -84
7312 -84 -49 -208 -57 74 -221 72 106 -29 -29 54 277 119 -75 -6 -50 -566 -182 26 -74 -42 89 -162 -247
7335 -247 -122 -86 -113 -293 33 171 -347 116 -118 94 12 161 217 72 -31 37 -15 -319 263 -262 -100 4
7357 4 441 -140 73 -114 35 -161 -102 126 -38 -304 -236 24 66 223 -103 -98 -240 -66 -97 -192 265 18 -252
7380 -252 -171 -104 -1 123 -132 410 -190 -175 98 -90 277 -61 -123 -255 232 -149 -362 -25 -111 176 -103 -191
7402 -191 268 184 274 -63 237 -7 227 -490 -16 32 -413 -111 -351 12 -304 289 -13 97 341 -304 299
7423 299 15 121 120 278 -337 305 5 -59 27 -195 -128 94 210 145 44 261 282 98 -50 -121 -61 144 -51
7446 -51 214 -133 -275 -113 171 275 148 -91 -240 122 235 126 147 35 50 94 -200 -43 -191 -72 -76 326
7468 326 -216 3 112 15 12 160 155 -96 11 -35 -307 -297 244 40 -101 126 91 40 218 137 63 186 -114 169
7492 169 33 174 71 -169 199 -86 144 294 -61 -191 -285 115 -111 -167 -291 -121 38 -11 -121 77 -97
7513 -97 -97 133 -64 -97 23 308 192 -249 -10 -310 -223 263 -268 -306 -51 83 -160 -146 -92 -197 119 -121 -232
7536 -232 53 54 -87 -85 -158 14 -91 20 -82 234 -77 -263 229 -115 -69 -176 -365 -117 28 301 -60 -7
7558 -7 -70 35 28 140 23 -234 191 295 378 385 157 64 -41 170 175 165 16 128 -299 -70 198 -87 -229 140
7582 140 -265 162 265 149 -440 -150 -3 -35 -104 236 112 42 65 -341 -327 -171 70 191 -10 160 101 -162
7604 -162 182 -8 -189 7 -324 -392 -148 87 -263 51 182 -165 -32 145 -168 -334 34 34 82 -31 -424
7625 -424 -41 415 -55 -225 -1 62 26 1 -176 262 -39 -64 -51 -13 -125 -185 -61 -262 -146 -327 94 263
7647 263 105 163 -71 62 -52 126 2 -602 -76 227 175 27 116 5 -329 -75 -389 36 -180 255 -117
7668 -117 69 82 75 67 -61 483 -308 13 -351 -171 -63 268 -147 -59 35 -119 266 -6 28 -163 -222 152 -74
7691 -74 -52 -158 -106 265 286 215 226 333 183 -134 -18 316 6 -102 -99 -151 -191 273 -25 263 53 -408 36
7714 36 50 89 -126 -150 48 -114 290 -125 -141 216 130 54 14 38 246 210 146 -455 -61 122 103 124 342 -78
7738 -78 -90 38 249 -4 -242 236 -160 -263 -31 -323 -155 -217 -7 -253 50 5 -137 -331 -23 396 116
7759 116 -238 106 322 103 -62 -182 44 -13 -121 225 -35 52 -23 214 -44 49 102 -58 -144 -141 -25 160 63
7782 63 -32 16 391 -122 -46 -219 -112 -28 -90 108 19 -129 74 38 -64 438 52 33 56 413 23 5 35 -321
7806 -321 181 -38 325 -9 -271 -12 -140 439 -198 172 307 167 96 357 -120 -59 86 -7 -205 -3 -117
7827 -117 176 -78 443 -430 128 -227 90 507 -66 158 -15 58 -293 217 138 -59 -242 83 333 -147 216
7848 216 213 129 -252 -109 -15 -195 -52 -16 -221 577 283 -168 -302 -16 -224 -160 102 -253 -82 -365 44 -322
7870 -322 -221 -458 -193 242 159 8 157 147 -36 -135 192 -201 -128 46 -193 -163 74 161 -263 54 -17 20 91
7893 91 -192 -116 -349 91 257 157 -88 -113 -24 -234 -103 -335 175 81 22 204 -21 -75 -2 146 -149 44 -214
7916 -214 -159 43 15 24 180 -53 -50 66 -125 -64 257 -129 27 -184 -342 3 -291 -183 176 -177 -24 -224
7938 -224 175 -41 30 -70 21 -165 297 -412 -60 153 -441 77 -268 -180 297 -39 363 128 -23 80 -183
7959 -183 3 -22 -16 17 -363 -65 10 -109 214 123 29 -348 156 -173 -443 -245 199 -221 305 395 89 -46 -59
7982 -59 -61 -207 -176 -63 148 135 149 -88 232 170 298 61 1 60 -253 32 -34 132 -236 174 -203 210 -85
8005 -85 -66 -208 62 -20 228 383 -117 -320 13 315 -74 24 -209 109 120 -28 -124 156 243 160 94 -11 52
8028 52 99 -422 -162 -8 30 154 46 151 -252 368 -73 -200 301 322 27 -234 -188 93 -123 -254 -69 -184
8050 -184 -5 -147 129 324 -7 237 316 -465 -83 -453 -106 -159 171 80 -187 -147 -168 -25 140 -396 348 99
8072 99 102 130 293 37 153 -139 -341 -180 -271 201 -65 29 303 -167 136 272 -81 -289 -112 -9 -69 130
8094 130 118 -6 -129 -46 -16 11 196 58 192 95 41 117 317 20 -195 376 144 -65 -78 -341 -48 278 54
8117 54 -185 326 -309 -75 -85 139 31 90 -255 -180 -115 -50 201 -93 -381 195 77 -84 -204 -181 90 -124
8139 -124 41 -266 -21 -38 146 129 65 -439 -92 -12 58 129 -188 60 336 183 -11 31 -156 80 339 382 189
8162 189 -246 161 183 68 -15 103 90 -51 38 -44 -133 -67 -3 380 18 16 164 -245 112 -204 -110 101 -71 84
8186 84 -90 -384 256 112 -129
8191a29
##END NTUPLES=NMR FID
##END=
