##TITLE=1H_DBB1811
 CDCl3, 8 sc, 
 19.11.2019
##JCAMPDX= 6.0         $$ Bruker NMR JCAMP-DX V2.0
##DATA TYPE= NMR FID
##DATA CLASS= NTUPLES
##ORIGIN= UXNMR, Bruker Analytische Messtechnik GmbH
##OWNER= root
$$ XWIN-NMR		Version 3.5
$$ Tue Nov 19 13:58:03 2019 Russian Standard Time (UT+4h)  she@DPX200
##.OBSERVE FREQUENCY= 200.1315
##.OBSERVE NUCLEUS= ^1H
##.DELAY= (6, 6)
##.ACQUISITION MODE= SIMULTANEOUS
##.ACQUISITION SCHEME= undefined
##.AVERAGES= 8
##.DIGITISER RES= 18
##SPECTROMETER/DATA SYSTEM= spect
##.PULSE SEQUENCE= zg30
##.SOLVENT NAME= D2O
##.SHIFT REFERENCE= (INTERNAL, D2O, 0, 15.7039)
##AUDIT TRAIL= $$ (NUMBER, WHEN, WHO, WHERE, WHAT)
$$ ##TITLE= Audit trail, XWIN-NMR		Version 3.5
$$ ##JCAMPDX= 5.01
$$ ##ORIGIN= Bruker BioSpin GmbH
$$ ##OWNER= she
$$ F:/spectra/data/she/nmr/H-F/1/audita.txt
$$ ##AUDIT TRAIL=  $$ (NUMBER, WHEN, WHO, WHERE, WHAT)
(   1,<2019-11-19 13:56:51.10 +0400>,<she>,<DPX200>,
      <created by zg, POWCHK disabled, PULCHK disabled
       configuration hash MD5:
       00 E9 B6 7A A2 85 ED C7 34 08 36 98 17 FE 4E 26
       data hash MD5: 16K
       F0 C8 97 3D B7 AA DB 1D DA 35 0B 64 7B 90 BD 81>)
$$ ##END=
$$ 
$$ hash MD5
$$ 15 88 AD 1F EB F5 65 65 84 EA 0D 67 09 2B 28 9A
##$RELAX= 
##$RELAX= 
##$RELAX= 
##$RELAX= 
##$RELAX= 
##$RELAX= 
$$ Bruker specific parameters
$$ --------------------------
##$DU= <F:/spectra>
##$EXPNO= 1
##$NAME= <H-F>
##$PROCNO= 1
##$TYPE= <nmr>
##$USER= <she>
##$AMP= (0..31)
100 100 100 100 100 100 100 100 100 100 100 100 100 100 100 100 100 100 
100 100 100 100 100 100 100 100 100 100 100 100 100 100 
##$AQSEQ= 0
##$AQ_mod= 1
##$AUNM= <au_zg>
##$AUTOPOS= <>
##$BF1= 200.13
##$BF2= 200.13
##$BF3= 200.13
##$BF4= 200.13
##$BF5= 200.13
##$BF6= 200.13
##$BF7= 200.13
##$BF8= 200.13
##$BYTORDA= 1
##$CFDGTYP= 0
##$CFRGTYP= 5
##$CHEMSTR= <none>
##$CNST= (0..31)
1 1 145 1 1 1 1 1 1 1 1 1 1 1 1 1 1 1 1 1 1 1 1 1 1 1 1 1 1 1 1 1 
##$CPDPRG= <>
##$CPDPRG1= <>
##$CPDPRG2= <>
##$CPDPRG3= <>
##$CPDPRG4= <mlev>
##$CPDPRG5= <mlev>
##$CPDPRG6= <mlev>
##$CPDPRG7= <mlev>
##$CPDPRG8= <mlev>
##$CPDPRGB= <>
##$CPDPRGT= <>
##$D= (0..31)
0 1.2 0 0 0 0 0 0 0 0.06 0 0.03 0 0 0 0 0.0002 0 0 0 0 0 0 0 0 0 0 0 0 
0 0 0 
##$DATE= 1574157410
##$DBL= (0..7)
120 120 120 120 120 120 120 120 
##$DBP= (0..7)
150 150 150 150 150 150 150 150 
##$DBP07= 0
##$DBPNAM0= <>
##$DBPNAM1= <>
##$DBPNAM2= <>
##$DBPNAM3= <>
##$DBPNAM4= <>
##$DBPNAM5= <>
##$DBPNAM6= <>
##$DBPNAM7= <>
##$DBPOAL= (0..7)
0.5 0.5 0.5 0.5 0.5 0.5 0.5 0.5 
##$DBPOFFS= (0..7)
0 0 0 0 0 0 0 0 
##$DE= 6
##$DECBNUC= <off>
##$DECIM= 24
##$DECNUC= <off>
##$DECSTAT= 4
##$DIGMOD= 1
##$DIGTYP= 9
##$DL= (0..7)
0 120 120 120 120 120 120 120 
##$DP= (0..7)
150 150 150 150 150 150 150 150 
##$DP07= 0
##$DPNAME0= <>
##$DPNAME1= <>
##$DPNAME2= <>
##$DPNAME3= <>
##$DPNAME4= <>
##$DPNAME5= <>
##$DPNAME6= <>
##$DPNAME7= <>
##$DPOAL= (0..7)
0.5 0.5 0.5 0.5 0.5 0.5 0.5 0.5 
##$DPOFFS= (0..7)
0 0 0 0 0 0 0 0 
##$DQDMODE= 0
##$DR= 18
##$DS= 0
##$DSLIST= <SSSSSSSSSSSSSSS>
##$DSPFIRM= 0
$$ [...]
##$SUBNAM2= <"">
##$SUBNAM3= <"">
##$SUBNAM4= <"">
##$SUBNAM5= <"">
##$SUBNAM6= <"">
##$SUBNAM7= <"">
##$SUBNAM8= <"">
##$SUBNAM9= <"">
##$SW= 24.9337058887773
##$SWIBOX= (0..15)
0 0 2 0 0 0 0 0 0 0 0 0 0 0 0 0 
##$SW_h= 4990.01996007984
##$TD= 16384
##$TD0= 1
##$TE= 0
##$TE2= 300
##$TE3= 300
##$TEG= 300
##$TL= (0..7)
0 120 120 120 120 120 120 120 
##$TP= (0..7)
150 150 150 150 150 150 150 150 
##$TP07= 0
##$TPNAME0= <>
##$TPNAME1= <>
##$TPNAME2= <>
##$TPNAME3= <>
##$TPNAME4= <>
##$TPNAME5= <>
##$TPNAME6= <>
##$TPNAME7= <>
##$TPOAL= (0..7)
0.5 0.5 0.5 0.5 0.5 0.5 0.5 0.5 
##$TPOFFS= (0..7)
0 0 0 0 0 0 0 0 
##$TUNHIN= 0
##$TUNHOUT= 0
##$TUNXOUT= 0
##$USERA1= <user>
##$USERA2= <user>
##$USERA3= <user>
##$USERA4= <user>
##$USERA5= <user>
##$V9= 5
##$VALIST= <valist>
##$VCLIST= <CCCCCCCCCCCCCCC>
##$VD= 0
##$VDLIST= <DDDDDDDDDDDDDDD>
##$VPLIST= <PPPPPPPPPPPPPPP>
##$VTLIST= <TTTTTTTTTTTTTTT>
##$WBST= 1024
##$WBSW= 4
##$XGAIN= (0..3)
0 0 0 0 
##$XL= 0
##$YL= 0
##$YMAX_a= 382656
##$YMIN_a= -404721
##$ZGOPTNS= <>
##$ZL1= 120
##$ZL2= 120
##$ZL3= 120
##$ZL4= 120
##$ABSF1= 10
##$ABSF2= 0
##$ABSG= 5
##$ABSL= 3
##$ALPHA= 0
##$AQORDER= 0
##$ASSFAC= 0
##$ASSFACI= 0
##$ASSFACX= 0
##$ASSWID= 0
##$AUNMP= <proc_1d>
##$AZFE= 0.1
##$AZFW= 0.1
##$BCFW= 1
##$BC_mod= 2
##$BYTORDP= 1
##$COROFFS= 0
##$CY= 11.3945322036743
##$DATMOD= 1
##$DC= 2
##$DFILT= <>
##$DTYPP= 0
##$F1P= 16.9975609425685
##$F2P= -3.02152046262296
##$FCOR= 0.5
##$FTSIZE= 0
##$FT_mod= 4
##$GAMMA= 1
##$GB= 0.15
##$INTBC= 1
##$INTSCL= 1
##$ISEN= 128
##$LB= 0.24
##$LEV0= 0
##$LPBIN= 0
##$MAXI= 10000
##$MC2= 0
##$MEAN= 0
##$ME_mod= 0
##$MI= 1.114404
##$NCOEF= 0
##$NC_proc= 0
##$NLEV= 6
##$NOISF1= 3.799351
##$NOISF2= 2.8
##$NSP= 1
##$NTH_PI= 0
##$NZP= 0
##$OFFSET= 15.70392
##$PC= 1
##$PHC0= -9942.164
##$PHC1= 12.60087
##$PH_mod= 1
##$PKNL= yes
##$PPARMOD= 0
##$PSCAL= 0
##$PSIGN= 0
##$REVERSE= no
##$SF= 200.130013532006
##$SI= 16384
##$SIGF1= 3
##$SIGF2= 2
##$SINO= 400
##$SIOLD= 16384
##$SREGLST= <1H.CDCl3>
##$SSB= 0
##$STSI= 0
##$STSR= 0
##$SW_p= 3612.71676300578
##$SYMM= 0
##$S_DEV= 0
##$TDeff= 0
##$TDoff= 0
##$TI= <>
##$TILT= no
##$TM1= 0
##$TM2= 0
##$TOPLEV= 0
##$USERP1= <user>
##$USERP2= <user>
##$USERP3= <user>
##$USERP4= <user>
##$USERP5= <user>
##$WDW= 1
##$XDIM= 8192
##$YMAX_p= 0
##$YMIN_p= 0
$$ End of Bruker specific parameters
$$ ---------------------------------
##NTUPLES= NMR FID
##VAR_NAME=  TIME,          FID/REAL,        FID/IMAG
##SYMBOL=    X,             R,               I
##VAR_TYPE=  INDEPENDENT,   DEPENDENT,       DEPENDENT
##VAR_FORM=  AFFN,          ASDF,            ASDF
##VAR_DIM=   8192,          8192,            8192
##UNITS=     SECONDS,       ARBITRARY UNITS, ARBITRARY UNITS
##FACTOR=    0.0002004,     1,               1
##FIRST=     0,             0,               0
##LAST=      1.6414764,     0,               0
##MIN=       0,             -404721,         0
##MAX=       1.6414764,     382656,          0
$$ Real data points
##PAGE= N=1
##DATA TABLE= (X++(R..R)), XYDATA
$$ [...]
666 55676 6379 -42195 -74378 -77994 -45594 12971 69391 90336 63981 8652 -44233 -72265
678 -72265 -69387 -38773 11074 62468 89738 73205 19172 -41788 -76121 -69854 -32660 16670
690 16670 60340 83789 73538 28117 -33871 -77725 -77609 -36435 20383 64173 80560 66956
702 66956 26929 -28019 -73281 -82671 -46745 14650 66854 84174 63779 19879 -29803 -68299
714 -68299 -79511 -52571 4423 62616 88332 68630 18135 -34742 -68632 -74042 -49260 -26
726 -26 54560 86415 74957 25001 -34810 -72942 -74060 -43453 3583 50627 79892 74920 32420
739 32420 -28865 -74762 -80002 -45010 7506 53052 75892 68558 31402 -23743 -71721 -84868
751 -84868 -53820 3888 55885 77392 63556 23854 -25872 -68424 -84092 -60252 -4846 53134
763 53134 80959 65477 19159 -32762 -69825 -80091 -58379 -9737 46390 80022 70615 22962
775 22962 -35686 -74691 -79488 -52690 -6615 41964 73948 70952 29088 -31121 -76804 -83604 -52077
788 -52077 -2465 42990 68287 64329 29251 -25061 -72854 -86603 -58198 -4466 44884 67480
800 67480 57641 22525 -24788 -67220 -84401 -63625 -12393 41701 68905 57202 17254 -30170
812 -30170 -66721 -79905 -62518 -18310 34327 67451 61370 19564 -33144 -70572 -78374 -57321
824 -57321 -16508 29797 62543 62881 26493 -28627 -71951 -81080 -55588 -11508 31797 59151 59749
837 59749 29970 -20650 -67023 -82966 -59539 -11071 35651 60277 56244 27181 -16822 -59445
849 -59445 -79666 -63332 -16542 35122 63834 57948 25209 -17851 -55146 -72672 -60911 -20825
861 -20825 30091 64775 64280 29905 -17619 -54911 -68060 -54393 -18870 26540 62510 68534 38416
874 38416 -11711 -54085 -68227 -50695 -13166 29169 60873 67908 43699 -3304 -49626 -69549
886 -69549 -52579 -10317 35073 63620 66559 43243 1076 -43155 -67377 -55501 -12428 38047
898 38047 69527 69632 41968 577 -39040 -61062 -52902 -14522 36904 73911 76919 46303 943
911 943 -37709 -54587 -44706 -10713 35966 74098 82776 54947 6617 -35541 -51641 -37758 -2863
924 -2863 39404 73086 82785 60901 15348 -29998 -50899 -37108 1719 44597 73866 79673 59612
937 59612 19523 -24294 -49079 -39948 -1522 45034 75730 78227 54986 16546 -22592 -46196
949 -46196 -41392 -7404 39875 74928 79293 52981 11667 -25705 -44929 -39401 -9687 33717 70125
962 70125 79392 55126 11158 -29029 -47171 -38194 -8357 30703 63934 75060 55991 14061
974 14061 -29234 -51180 -41768 -9173 29620 58720 67515 51600 14614 -27663 -53783 -48946 -16316
987 -16316 25241 54786 60958 43597 9476 -28541 -54561 -54742 -26811 15602 49337 57348 37789
1000 37789 2319 -33501 -56412 -57545 -34336 5192 41468 54235 36246 -1545 -39768 -61453
1012 -61453 -60006 -37026 -930 33586 49413 36288 -1228 -43027 -68217 -65453 -39188 -3010
1024 -3010 28578 43146 32574 -1285 -43637 -73067 -73091 -45454 -6018 26377 38344 26300 -5316
1037 -5316 -44851 -74540 -78897 -53982 -12406 23593 36454 22087 -11020 -48159 -75179 -80237
1049 -80237 -58804 -18990 19492 36050 22518 -12415 -51052 -76134 -78582 -57717 -21092 15934
1061 15934 35353 25626 -8754 -50121 -76902 -77692 -54305 -18092 16380 34742 27513 -4110 -45822
1074 -45822 -75731 -77983 -53086 -14316 19803 35576 27122 -2545 -41821 -72364 -77800 -54052
1086 -54052 -13094 23662 38749 27562 -3207 -40161 -68298 -74298 -53139 -13340 25542 43250
1098 43250 31467 -1462 -39128 -64930 -68534 -48111 -10874 26593 46558 37848 4770 -34813
1110 -34813 -61072 -62591 -40541 -4837 29839 49124 43046 12938 -26502 -55028 -57708 -34715
1122 -34715 1917 35271 51987 45641 18639 -18095 -47052 -53027 -31818 5789 40514 56328
1134 56328 48075 21171 -12990 -39956 -47145 -28955 7280 43266 60911 52584 23983 -10450
1146 -10450 -35478 -40943 -23960 9281 44390 64231 58175 29292 -6944 -32416 -36259 -18174
1158 -18174 13562 46102 65582 61767 35090 -1276 -28709 -33713 -14993 17424 48563 65710
1170 65710 61986 37951 3795 -24723 -32629 -15854 17091 48760 65210 60370 37155 5137
1182 5137 -22166 -32029 -18301 12707 45407 63549 58914 34874 3264 -22531 -31943 -20425 7667
1195 7667 39936 60273 58014 34259 1613 -24449 -33141 -21643 4886 35568 56597 56823 35062
1208 35062 1836 -26147 -35961 -23723 3481 33513 53483 54421 34791 2599 -27192 -39359
1220 -39359 -27878 705 31974 51435 51389 32297 1446 -27970 -42005 -32825 -4498 28380 49457
1233 49457 49421 28999 -1765 -30029 -43857 -36393 -10062 22973 46435 48124 27561 -4548 -32941
1246 -32941 -45816 -37968 -13181 18687 42787 46765 27893 -4744 -34759 -48182 -39412 -13911
1258 -13911 17225 40107 44816 27829 -3704 -35021 -50026 -41676 -14768 17040 39506 43198
1270 43198 26392 -4193 -34734 -51094 -44172 -17296 16055 39534 42490 24450 -6268 -35739
1282 -35739 -51266 -45133 -19499 14190 39087 42808 23931 -7676 -37006 -51235 -44582 -19441
1294 -19441 13312 38387 43240 25289 -6566 -36638 -50689 -42593 -17372 14014 37793 43437
1306 43437 27217 -3524 -33905 -49030 -41275 -15403 15681 38564 43353 28064 -869 -30447
1318 -30447 -46523 -40642 -15724 15851 39005 43232 27616 -323 -28657 -44416 -40177 -16993
1330 -16993 14226 38037 43163 27185 -1180 -28723 -43585 -39463 -17750 12368 36387 42692
1342 42692 27830 -772 -29048 -43888 -38973 -17140 11765 35249 42087 28829 1161 -27748
1354 -27748 -43508 -38845 -16723 12370 35201 41957 29582 3023 -25049 -42053 -38839 -17336
1366 -17336 12140 35534 42152 29631 4073 -23253 -40209 -38700 -18730 10537 34728 42302
1378 42302 30177 4544 -22596 -39333 -38190 -19517 8624 33180 42292 31421 5914 -21902
1390 -21902 -38890 -37747 -19295 8204 32450 42437 33003 8127 -20138 -38106 -37288 -18603 9118
1403 9118 33534 43389 34499 10265 -17879 -36662 -36856 -18216 10137 34876 44578 35354 11231
1416 11231 -16621 -35466 -36495 -18353 9956 35359 45425 35675 11531 -16288 -35043 -36074
1428 -36074 -18687 9156 34426 45328 36322 11868 -16196 -34804 -35661 -18550 8453 33370
1440 33370 44737 36880 13272 -14815 -33656 -34947 -18054 8850 33338 44478 37416 15011
1452 15011 -12172 -31647 -33750 -17351 9600 34074 45100 37904 16097 -10398 -29672 -32586
1464 -32586 -17174 9229 34078 45408 38280 15907 -10601 -29463 -32317 -17777 7705 32274
1476 32274 44181 37490 15308 -11715 -30798 -33558 -18985 5870 29990 41837 35884 14377
1488 14377 -12513 -32093 -35171 -20945 4012 27732 39442 33979 13552 -12639 -32330 -36407
1500 -36407 -23020 1771 25708 37663 32325 12608 -12707 -32410 -37320 -25105 -1278 22603
1512 22603 35494 30857 11430 -13781 -33423 -38692 -27617 -4961 18787 32222 29007 10003
1524 10003 -15578 -35634 -41285 -30313 -8166 15370 29215 26905 8899 -16657 -37269 -43511
1536 -43511 -32783 -10107 13639 27585 25481 8253 -16716 -37538 -44638 -33769 -10827 13429
1548 13429 27893 25889 8823 -15605 -36403 -43701 -33895 -11096 13678 28974 27510 10274 -14562
1561 -14562 -35136 -42790 -33624 -11572 13126 29128 28534 11509 -13621 -34725 -42444 -33449 -12043
1574 -12043 12223 28361 28600 12468 -12482 -34476 -42804 -33784 -11989 12131 28146 28541 13390
1587 13390 -10806 -32993 -41997 -33521 -11358 13695 29740 30189 14779 -9095 -30756 -40060 -31945
1600 -31945 -10000 15545 32705 32877 16913 -7286 -28768 -37477 -29675 -8140 17242 34703 35247
1613 35247 19037 -5937 -27711 -36161 -27603 -6342 18260 35121 36131 20379 -4684 -26797
1625 -26797 -35781 -27092 -5435 18905 35000 35647 20663 -3495 -25836 -35289 -26959 -5546 19017
1638 19017 34994 35449 20514 -2763 -24085 -33670 -26574 -6011 18469 35007 35667 20760 -2487
1651 -2487 -23136 -32309 -25906 -6415 17280 33826 35197 20398 -3096 -23847 -32644 -26139 -7302
1664 -7302 15339 31449 33148 19432 -3916 -25263 -34602 -27823 -8797 13297 28469 30373 17356
1677 17356 -4811 -26099 -36146 -29912 -10828 11555 26631 28079 15587 -5445 -25658 -36062
1689 -36062 -31071 -12793 9655 25745 27540 15008 -5632 -24755 -34727 -30710 -14034 7873 24513
1702 24513 27785 15757 -5037 -24489 -34214 -30315 -14767 5988 22486 26848 16449 -3921 -24351
1715 -24351 -34899 -31080 -15312 4763 20549 25203 16405 -3096 -23768 -35581 -32701 -16905 3850
1728 3850 19918 24627 15768 -2760 -22791 -35217 -33511 -18159 3600 20854 25669 16518 -2100
1741 -2100 -21787 -33888 -32801 -18117 3510 21845 27673 18711 -723 -20714 -32703 -31264 -17064
1754 -17064 3823 22283 29436 21125 1702 -19577 -32118 -30529 -15862 4598 22573 29922 22797
1767 22797 4138 -17591 -31370 -30183 -15339 5769 23926 30964 24014 6362 -14743 -29182
1779 -29182 -29290 -14628 7536 26405 33446 25928 8322 -11912 -25704 -26368 -12683 9518 29359
1792 29359 37076 29277 10631 -9999 -23005 -23099 -9618 11565 31244 39759 32456 13206 -8455
1805 -8455 -21572 -20816 -7008 13431 32018 40289 33737 14970 -6982 -21141 -20542 -6164 14722
1818 14722 32647 39851 33245 15683 -5483 -19984 -20646 -6725 14852 33087 39804 32801 15545
1831 15545 -4353 -18334 -19808 -7057 13775 32763 40218 33103 15428 -4070 -17204 -18338 -6866
1844 -6866 12688 31346 39984 33849 15977 -4169 -17664 -18255 -6877 11684 29245 37885 32754
1857 32754 15662 -5053 -19396 -20376 -8390 10149 27004 34714 29900 13947 -6345 -21406 -23382
1870 -23382 -11581 7674 24925 32095 26683 11244 -7959 -22472 -25517 -14900 4453 22597
1882 22597 30493 24914 8896 -9815 -23598 -26531 -16968 1032 19437 28644 24146 7846 -11628
1895 -11628 -25227 -27652 -18626 -1530 15918 25860 22548 7224 -12787 -27576 -30439 -20704 -3682
1908 -3682 13006 22191 19699 5704 -13711 -29733 -33613 -23902 -6180 10937 19585 16778 3519
1921 3519 -15029 -30676 -35476 -26872 -8665 9430 19092 15677 1701 -16321 -30759 -35422 -27746
1934 -27746 -10377 8498 19262 16462 1760 -16842 -31033 -34720 -26870 -10421 7628 18885
1946 18885 17242 3176 -16250 -31340 -34851 -26205 -9782 7258 17878 16963 4169 -14908 -30902
1959 -30902 -35714 -26924 -9933 7286 17211 15849 3831 -13973 -29771 -35585 -28094 -10799 7278
1972 7278 17735 15860 3653 -13357 -28166 -34021 -27699 -11389 7430 19067 17716 4868 -12589
1985 -12589 -26780 -31598 -25429 -10013 8130 20240 20071 7493 -10862 -25624 -30160 -22892 -7367
1998 -7367 9489 21024 21491 10151 -8034 -23843 -29038 -21179 -5092 11679 22109 22379 11637
2011 11637 -5374 -21052 -27340 -20464 -4062 13571 24183 23529 12714 -3101 -17651 -24172 -18906
2024 -18906 -3331 14861 26670 26375 15192 -1150 -14841 -20736 -15877 -1740 15744 28326 29501
2037 29501 18745 1815 -12413 -17980 -12766 774 17027 29140 31523 22059 5143 -10370 -16852
2050 -16852 -11368 2807 18790 30107 32005 23586 7716 -8282 -16054 -11350 3157 20049 31387
2063 31387 32407 23624 8463 -6598 -14764 -11345 2433 20183 32443 33582 24083 8552 -5689
2076 -5689 -13258 -10418 2231 19345 32734 35079 25608 9005 -5872 -13069 -9695 2440 18546
2089 18546 31616 35311 26804 10145 -6132 -14072 -10436 1954 17597 30141 33578 26098 10287
2102 10287 -6525 -15760 -13085 -2 16423 28537 31291 23700 8842 -7340 -17430 -15840 -3019
2115 -3019 14405 27431 29914 21443 6231 -9075 -18581 -17258 -5345 11875 25857 29076 20184
2128 20184 3925 -11712 -20026 -18160 -6658 9680 23401 27654 19205 2644 -14084 -22707 -19685
2141 -19685 -7597 8026 20688 24589 17284 1404 -15770 -25513 -23010 -10273 6012 17990 20979
2154 20979 13734 -905 -17131 -27306 -25976 -13651 3124 15682 18515 10626 -3762 -18655 -28241
2167 -28241 -27595 -16371 102 13587 17240 9367 -5436 -20135 -28598 -27446 -17131 -1948 11689
2180 11689 16539 9395 -5445 -20669 -29081 -27380 -16677 -2347 10098 14912 9215 -4958 -20841
2193 -20841 -30057 -28273 -16876 -2374 9328 13200 7863 -5093 -20126 -29911 -29360 -18411 -2960
2206 -2960 8933 12396 6531 -5698 -19427 -28958 -29250 -19755 -4532 8541 13039 7032 -5469 -18827
2220 -18827 -27514 -27850 -19332 -5294 8141 14004 9282 -3461 -17456 -26088 -25893 -17485 -4266 8345
2234 8345 14932 11763 -268 -14857 -24568 -24684 -15696 -2491 9697 15708 13156 2423 -11955 -22730
2248 -22730 -24046 -15127 -988 11663 17254 14038 3675 -9752 -20608 -22913 -15073 -569 13279
2261 13279 19417 15659 4504 -8727 -18759 -20942 -14113 -134 13905 21437 18257 6359 -7781
2274 -7781 -17554 -19232 -12092 797 14429 22507 20486 8913 -6017 -16960 -18548 -10796 2166
2287 2166 15172 22574 21217 10621 -4319 -16279 -19038 -11268 2363 15457 22340 20497 10491
2300 10491 -3659 -15613 -19585 -12845 1330 15343 22715 19857 9244 -4395 -15840 -19486 -13656
2313 -13656 -252 14379 22457 19917 8478 -5734 -16472 -19609 -13492 -930 13050 21702 20231
2326 20231 8824 -6250 -17539 -20004 -13113 -523 12505 20422 19536 9259 -5933 -17976 -20924
2339 -20924 -13769 -579 12209 19488 17988 8381 -5546 -17625 -21726 -15407 -1895 11789 18927
2352 18927 16909 7192 -6293 -17260 -21711 -16433 -3572 10469 18617 16794 6567 -6845 -17415
2365 -17415 -20957 -16033 -4375 9260 17975 17336 7360 -6671 -17685 -20699 -15012 -3515 9018
2378 9018 17392 17436 8437 -5520 -17270 -20741 -14709 -2682 9670 17152 17015 8611 -4428 -16212
2392 -16212 -20705 -15179 -2756 10245 17521 16680 8284 -3931 -15036 -19728 -15296 -3297 10107
2405 10107 18260 17371 8542 -3642 -14030 -18339 -14399 -3708 9457 18704 18830 10168 -2802 -13290
2419 -13290 -17023 -12907 -2796 9418 18650 20063 12357 -546 -12170 -16415 -12076 -1576 10429
2432 10429 18674 20177 13483 1326 -10533 -16176 -12251 -1180 11250 19468 20116 13304 1970 -9368
2446 -9368 -15469 -12734 -2163 11134 19977 20479 13195 1580 -9304 -14800 -12517 -2740 10244 19928
2460 19928 21361 13718 1402 -9399 -14428 -11774 -2529 9785 19471 21767 14911 2536 -9371
2473 -9371 -14664 -11507 -1806 9920 19015 21558 15520 3710 -8567 -14796 -12086 -1934 10295 18889
2487 18889 20818 15145 4052 -7877 -14860 -13177 -3241 9607 18847 20533 14215 3128 -7988
2500 -7988 -14659 -13591 -4740 8262 18139 20199 13902 2106 -8966 -15009 -13389 -4989 7055 17029
2514 17029 19885 13787 1912 -9692 -15652 -13460 -4813 6581 15939 18753 13542 2080 -10096
2527 -10096 -16576 -14519 -5280 6335 15082 17255 12288 1711 -9940 -17234 -16153 -6938 5131 14025
2541 14025 16120 10730 452 -10494 -17488 -17233 -9027 2935 12701 15286 9703 -747 -11387 -17854
2555 -17854 -17481 -10286 1101 11057 14623 9785 -755 -12086 -18341 -17519 -10255 413 9824 14032
2569 14032 10268 -97 -11811 -18679 -17897 -9928 689 9921 13529 10144 595 -10851 -18580 -18382
2583 -18382 -10457 733 10126 13407 9635 432 -10257 -18113 -18661 -11576 47 10163 13848 9619
2597 9619 77 -10451 -17682 -18363 -12157 -1000 9580 13962 10290 360 -10614 -17823 -18162 -11673
2611 -11673 -1287 9006 14166 11355 1742 -9990 -17793 -18099 -11208 -642 9263 14026 11940 2938
2625 2938 -8620 -17274 -18214 -11198 -6 10032 14668 11996 3325 -7758 -16335 -17986 -11362 240
2639 240 10731 15406 12057 2991 -7766 -15636 -17337 -11234 -77 10769 15915 12713 3160 -7956
2653 -7956 -15434 -16381 -10357 184 10653 16308 13635 4135 -7547 -15191 -15888 -9220 1221 11189
2667 11189 16190 14105 5385 -6068 -14508 -15511 -8652 2169 11905 16433 14203 5995 -4852 -13237
2681 -13237 -14938 -8782 2240 12479 17015 14368 6135 -4157 -12066 -14098 -8574 1843 12290
2694 12290 17584 14894 6307 -4083 -11608 -12978 -7848 1821 11911 17565 15632 7086 -3610 -11239
2708 -11239 -12408 -6871 2579 12100 17448 16088 8124 -2474 -10624 -11865 -6166 3376 12730 17568
2722 17568 16076 8899 -1145 -9363 -11551 -6363 3545 13125 17821 16068 9143 -506 -8336 -10905
2736 -10905 -6546 2919 12700 18037 16519 8924 -448 -8018 -10629 -6794 1684 11436 17466 16660 9361
2751 9361 -591 -8442 -10744 -6965 1180 10388 16534 16397 9654 -408 -8891 -11668 -7646 867 9865
2766 9865 15424 15359 9294 -435 -9241 -12784 -9053 -175 9157 14656 14234 8148 -1211 -9921 -13739 -10750
2782 -10750 -2045 7674 13737 13168 6697 -2940 -11047 -14716 -12012 -3975 5952 12619 12455 5796 -4196
2797 -4196 -12523 -15791 -12936 -5237 4312 11148 11658 5601 -4499 -13415 -16914 -13748 -5744 3564 10039
2812 10039 11040 5368 -4185 -13536 -17768 -14712 -6235 3369 9717 10532 4934 -4180 -13472 -17984 -15545
2827 -15545 -7175 3049 9808 10175 4332 -5040 -13610 -17978 -15974 -7901 2297 9516 10286 4085 -5568
2842 -5568 -14179 -18064 -15589 -8008 1851 9125 10329 4468 -5316 -14370 -18151 -15342 -7212 2067 9168
2857 9168 10510 5048 -4293 -13579 -17644 -14718 -6381 3190 9735 10796 5772 -3213 -12167 -16728 -14366
2872 -14366 -6001 3876 10694 11482 6232 -2526 -11087 -15432 -13740 -6021 4014 11239 12205 6831 -2199
2887 -2199 -10522 -14470 -12774 -5613 3984 11322 12892 7759 -1421 -10019 -13947 -11815 -4603 4455 11368
2902 11368 13246 8637 -260 -9129 -13446 -11089 -3641 5315 11928 13307 9194 750 -7834 -12443 -10692
2917 -10692 -3249 5972 12629 13785 9404 1416 -6908 -11592 -10402 -3448 5716 12729 14228 9615 1331
2932 1331 -6519 -11099 -10042 -3848 5029 12256 14392 10097 1690 -6576 -11062 -9956 -4055 4485 11719
2947 11719 14089 10478 2536 -6312 -11131 -9948 -3786 4585 11383 14125 10918 3104 -5520 -10828 -10133
2962 -10133 -3836 4914 11871 14285 10935 3586 -4769 -10325 -10198 -4165 4813 12147 14401 10941 3453
2977 3453 -4855 -10143 -10131 -4508 4142 11765 14630 11181 3255 -5260 -10309 -10221 -4854 3415 11089 14321
2993 14321 11337 3509 -5347 -10746 -10484 -4824 3321 10781 13898 11189 3653 -5115 -10910 -10888 -5241
3008 -5241 3380 10623 13542 10850 3805 -4798 -10752 -11425 -5830 2989 10459 13422 10566 3376 -5045
3023 -5045 -10915 -11538 -6558 2027 9820 13145 10114 2641 -5852 -11397 -11811 -6769 1237 8854 12542
3038 12542 9871 2274 -6354 -11794 -12107 -6911 1011 8284 11728 9301 2395 -6293 -12190 -12318 -7118
3053 -7118 967 8136 11079 8963 2289 -5998 -11861 -12612 -7674 493 7779 10861 8603 1966 -6043
3068 -6043 -11809 -12787 -8480 -500 7054 10545 8333 1494 -6374 -12133 -13177 -9220 -1616 5964 9903
3083 9903 8049 1305 -6814 -12720 -13667 -9457 -2214 5226 9147 7813 1464 -6726 -12952 -14056 -9672
3098 -9672 -2223 5078 8824 7704 1610 -6404 -12744 -14228 -9978 -2367 5183 8789 7417 1693 -6076
3113 -6076 -12278 -13984 -10266 -2574 5057 9172 7726 1575 -6100 -12029 -13834 -10384 -2927 4760 9257
3128 9257 8152 1971 -5931 -12049 -13679 -10132 -2909 4605 9354 8604 2849 -5202 -11676 -13481 -9771
3143 -9771 -2474 5034 9625 9359 4005 -4087 -10881 -12856 -9076 -1653 5941 10646 10098 4555 -3134
3158 -3134 -9721 -12051 -8567 -1125 6919 11474 10707 5084 -2523 -8905 -11052 -7964 -539 7312 12056
3173 12056 11426 5622 -2094 -8290 -10278 -7189 -114 7566 12406 12175 6499 -1361 -7778 -9764 -6362
3188 -6362 677 8044 12901 12654 7674 -121 -6813 -9073 -5679 1463 8859 13504 13270 8458 1036
3203 1036 -5621 -8090 -5175 1779 9504 14255 13812 8910 1687 -4667 -7207 -4821 2060 9589 14449
3218 14449 14237 9250 1950 -4352 -6855 -4406 1853 9231 14226 14346 9492 1833 -4555 -6905 -4311
3233 -4311 1869 8873 13593 13790 9364 1924 -4659 -7003 -4660 1646 8646 13278 13383 9042 2048
3248 2048 -4569 -7410 -5133 1004 8136 12858 12878 8627 1882 -4602 -7570 -5752 -33 7286 12105
3263 12105 12463 7958 1122 -5110 -8100 -6632 -1165 5797 11029 11663 7497 568 -6034 -9006 -7550
3278 -7550 -2223 4475 9602 10684 6803 1 -6765 -10091 -8453 -3112 3614 8782 9710 6095 -472
3293 -472 -7236 -10829 -9465 -3904 2995 8072 8895 5524 -947 -7541 -11190 -10142 -4768 2176 7530
3308 7530 8621 4887 -1466 -7950 -11623 -10825 -5556 1361 6909 8181 4600 -2004 -8621 -12105 -11246
3323 -11246 -6236 541 6219 7866 4418 -2096 -9030 -12655 -11722 -6630 246 5816 7593 4523 -1761
3338 -1761 -8765 -12818 -11862 -6713 513 6002 7791 4861 -1376 -8212 -12491 -11765 -6459 814 6495
3353 6495 8153 5218 -1047 -7811 -11777 -11258 -6200 912 6895 8745 5623 -796 -7501 -11170 -10695
3368 -10695 -5771 1350 7233 9097 6194 -279 -7111 -10944 -10130 -5077 1766 7543 9399 6414 272
3383 272 -6311 -10402 -9712 -4629 2375 7927 9799 7187 1186 -5555 -9736 -9148 -4349 2737 8512 10393
3399 10393 7553 1686 -4971 -9073 -8758 -3950 2776 8630 10672 7889 1943 -4565 -8490 -8336 -3981
3414 -3981 2604 8459 10609 8030 1978 -4520 -8425 -8189 -3695 2620 8055 10348 7957 2283 -4300
3429 -4300 -8436 -8219 -3837 2494 8122 10092 7964 2497 -3971 -8020 -8060 -3781 2597 8200 10152 7963
3445 7963 2619 -3430 -7721 -7893 -4061 2373 7878 10109 8068 2783 -3403 -7482 -7781 -4156 1802
3460 1802 7478 10136 8170 2810 -3464 -7597 -8037 -4593 1396 6913 9685 8239 2931 -3452 -7923
3475 -7923 -8503 -4892 1026 6601 9375 8048 3057 -3326 -8023 -8598 -5093 907 6569 9259 7896
3490 7896 3053 -3139 -7782 -8841 -5356 633 6656 9348 7898 2914 -3262 -7672 -8706 -5475 344
3505 344 6239 9272 7875 2908 -3365 -8034 -8812 -5652 81 5752 8832 7749 2847 -3510 -8270
3520 -8270 -9150 -5993 -329 5441 8432 7639 2826 -3520 -8290 -9526 -6396 -581 5217 8255 7457 2732
3536 2732 -3373 -8348 -9767 -6637 -818 5022 8171 7220 2594 -3470 -8369 -9609 -6933 -1295 4814
3551 4814 8068 6997 2369 -3726 -8494 -9789 -7132 -1664 4157 7616 6698 2134 -4098 -8898 -10126
3566 -10126 -7451 -1978 3660 6963 6326 1937 -4242 -9024 -10548 -7717 -2243 3323 6538 6012 1875
3581 1875 -4118 -9015 -10534 -7966 -2561 3037 6270 5873 1921 -4002 -8859 -10465 -8234 -2820 2957
3596 2957 6480 6107 2028 -3789 -8583 -10363 -8198 -2967 2794 6468 6149 2322 -3492 -8449 -10211
3611 -10211 -8056 -2998 2649 6350 6167 2501 -3322 -8294 -10181 -7955 -2862 2749 6278 6325 2681
3626 2681 -2944 -7988 -9932 -7810 -2605 3027 6550 6750 3078 -2368 -7453 -9476 -7569 -2511 3301
3641 3301 7081 7094 3606 -1755 -6720 -8882 -7250 -2293 3365 7375 7641 4287 -1499 -6519 -8417 -6992
3657 -6992 -2184 3635 7579 7999 4763 -832 -6046 -8278 -6648 -2022 3753 7804 8398 5162 -353
3672 -353 -5611 -7955 -6332 -1534 4135 8223 8910 5717 245 -4914 -7534 -5894 -1048 4587 8719
3687 8719 9151 5900 677 -4436 -6793 -5403 -759 4930 8992 9659 6366 1017 -4164 -6591 -5069
3702 -5069 -622 5111 9154 9710 6639 1121 -4070 -6370 -5104 -599 4866 8802 9694 6736 1248
3717 1248 -3957 -6396 -5210 -670 4634 8746 9456 6557 1323 -3721 -6374 -5379 -977 4598 8682
3732 8682 9395 6402 1474 -3659 -6374 -5316 -1123 4386 8556 9243 6430 1224 -3732 -6284 -5451 -1357
3748 -1357 3922 7964 8984 6317 977 -3994 -6543 -5613 -1648 3457 7535 8472 5885 910 -4184
3763 -4184 -6884 -5872 -2011 3044 6965 8046 5544 740 -4218 -7023 -6186 -2362 2832 6801 7679
3778 7679 5477 761 -4161 -7024 -6405 -2668 2316 6484 7594 5412 863 -4048 -7068 -6580 -3023
3793 -3023 2048 6190 7610 5372 738 -4111 -7108 -6689 -3289 1622 5781 7383 5496 878 -4201
3808 -4201 -7124 -6957 -3449 1492 5585 7088 5324 1039 -4127 -7162 -7065 -3526 1374 5494 7250 5367
3824 5367 1093 -3839 -7093 -6973 -3642 1435 5690 7328 5569 1428 -3448 -6692 -6812 -3622 1455
3839 1455 5826 7718 5930 1712 -3344 -6509 -6555 -3556 1330 5774 7839 6305 1879 -3136 -6513
3854 -6513 -6704 -3718 1380 5789 7873 6392 2139 -2953 -6555 -6859 -3633 1308 5867 7966 6419
3869 6419 2297 -2743 -6495 -6661 -3710 1486 5939 7985 6620 2338 -2723 -6189 -6629 -3641 1342
3884 1342 5851 7949 6464 2119 -2711 -6197 -6607 -3665 1079 5717 7763 6288 2138 -2920 -6288
3899 -6288 -6660 -3798 937 5384 7543 6002 1999 -3115 -6622 -6922 -4167 714 5079 7117 5894
3914 5894 1900 -3160 -6746 -7201 -4363 216 4824 6812 5601 1678 -3132 -6710 -7287 -4748 153
3929 153 4607 6547 5403 1517 -3197 -6619 -7312 -4718 -364 4220 6294 5321 1518 -3260 -6693 -7456
3945 -7456 -4769 -552 3878 6012 5116 1397 -3397 -6900 -7523 -5068 -812 3403 5640 4811 1313 -3432
3961 -3432 -6915 -7739 -5256 -920 3288 5348 4659 1443 -3162 -6687 -7698 -5420 -1057 3262 5582
3976 5582 4853 1611 -2921 -6352 -7589 -5448 -1347 3189 5695 5108 1876 -2628 -6097 -7300 -5274
3991 -5274 -1136 3184 5861 5402 2305 -2258 -6012 -7126 -5217 -1028 3299 5894 5682 2578 -1993
4006 -1993 -5807 -7020 -5112 -938 3407 5984 5695 2803 -1620 -5383 -6758 -4961 -767 3548 6303
4021 6303 6040 3019 -1274 -4956 -6318 -4725 -745 3655 6577 6334 3245 -1097 -4790 -6216 -4570
4036 -4570 -708 3805 6610 6573 3584 -946 -4778 -6093 -4642 -794 3542 6353 6647 3597 -826 -4663
4052 -4663 -6149 -4793 -992 3421 6261 6359 3786 -612 -4580 -6264 -4800 -1020 3374 6274 6282 3576
4068 3576 -544 -4388 -6287 -4969 -1087 3357 6182 6382 3554 -630 -4484 -6032 -4820 -1207 3215
4083 3215 6108 6246 3609 -703 -4428 -6104 -4829 -1352 2840 5716 6104 3574 -705 -4526 -6240
4098 -6240 -5074 -1567 2708 5580 5940 3329 -671 -4613 -6388 -5292 -1852 2442 5408 5876 3624
4113 3624 -598 -4490 -6423 -5480 -2130 2251 5366 5866 3433 -550 -4252 -6330 -5281 -2039 2140
4128 2140 5412 5897 3636 -407 -4358 -6244 -5438 -2126 2065 5133 5797 3730 -330 -4257 -6250 -5490
4144 -5490 -2084 1945 5126 5617 3778 -293 -4164 -6172 -5420 -2138 1930 4880 5673 3530 -15 -3918
4160 -3918 -6048 -5452 -2313 1857 5017 5789 3818 49 -3669 -5912 -5389 -2249 1714 5083 6015 4044
4176 4044 153 -3643 -5846 -5231 -2371 1678 5017 5953 4138 230 -3637 -5847 -5204 -2460 1644 4813
4192 4813 5959 4210 240 -3729 -5916 -5540 -2709 1521 4715 5763 3839 280 -3592 -6130 -5753
4207 -5753 -2758 1263 4572 5641 3882 313 -3583 -5943 -5722 -2951 1247 4523 5591 3841 203
4222 203 -3717 -5919 -5651 -2936 1040 4490 5608 4068 286 -3550 -5731 -5577 -2870 1086 4350 5718
4238 5718 4164 327 -3286 -5939 -5566 -2781 1037 4292 5611 4126 610 -3127 -5802 -5557 -2916
4253 -2916 1108 4414 5575 4224 782 -2996 -5546 -5494 -2805 1164 4616 5776 4313 888 -2810
4268 -2810 -5083 -5035 -2699 1144 4637 5824 4553 1263 -2582 -4859 -4980 -2454 1153 4486 5807 4650
4284 4650 1427 -2450 -4807 -4731 -2614 1260 4454 5576 4737 1560 -2193 -4719 -4845 -2705 1151 4414
4300 4414 5786 4630 1715 -1904 -4577 -4828 -2673 875 4240 5808 4683 1810 -1870 -4328 -4894
4315 -4894 -2835 839 4226 5740 4897 1895 -1799 -4394 -4851 -2834 533 3915 5663 4753 1872 -1762
4331 -1762 -4495 -4946 -3016 414 3669 5407 4716 1771 -1853 -4598 -5239 -3276 76 3344 5111 4428
4347 4428 1788 -2024 -4862 -5327 -3565 -159 3337 4996 4292 1562 -2060 -4936 -5529 -3843 -397 3090
4363 3090 5027 4316 1581 -2069 -4880 -5704 -4055 -596 2956 4924 4387 1517 -2103 -5070 -5837 -4074
4379 -4074 -857 2803 4582 4279 1694 -2171 -5261 -6012 -4265 -853 2681 4531 4085 1494 -2250 -5087
4395 -5087 -5911 -4350 -942 2621 4498 4073 1475 -2076 -5120 -5912 -4412 -952 2548 4604 4205 1573
4411 1573 -2088 -4906 -5684 -4108 -861 2550 4597 4449 1816 -1850 -4621 -5481 -3959 -752 2729 4702
4427 4702 4488 2005 -1539 -4554 -5457 -3870 -792 2749 4754 4485 2071 -1458 -4495 -5344 -3835 -655
4443 -655 2744 4879 4659 2377 -1149 -4065 -5072 -3855 -519 2860 4975 4831 2469 -1057 -3812 -4816
4459 -4816 -3575 -438 2952 5220 5096 2753 -555 -3453 -4439 -3283 -233 3129 5230 5230 2979 -230
4475 -230 -3285 -4142 -2991 -118 3185 5256 5320 3242 -40 -3060 -4129 -3004 24 3254 5363 5413
4491 5413 3365 141 -2752 -4157 -3013 -145 3371 5443 5493 3407 203 -2745 -3965 -2938 -209
4506 -209 3281 5420 5628 3659 406 -2591 -3766 -2997 -273 3041 5426 5536 3724 483 -2622 -3976
4522 -3976 -3001 -398 2775 5214 5585 3679 476 -2735 -4192 -3276 -716 2685 4825 5217 3434 347
4538 347 -2879 -4279 -3522 -858 2412 4746 5049 3294 298 -2916 -4331 -3644 -1066 2250 4675 4950
4554 4950 3134 110 -2950 -4452 -3786 -1354 1961 4468 4983 3192 3 -2972 -4489 -3927 -1474 1758
4570 1758 4222 4915 3174 205 -3060 -4639 -4058 -1482 1664 4159 4651 3083 96 -3187 -4836 -4220
4586 -4220 -1715 1523 3920 4478 3013 -81 -3136 -4755 -4243 -1773 1485 3916 4527 2924 -8 -2861
4602 -2861 -4576 -4127 -1823 1403 3814 4608 2950 1 -2961 -4483 -4054 -1754 1304 3929 4513 3274
4618 3274 258 -2807 -4381 -4132 -1725 1442 3857 4602 3153 347 -2813 -4400 -4091 -1826 1425 3927
4634 3927 4566 3310 439 -2613 -4339 -4166 -1882 1293 3778 4479 3372 511 -2517 -4337 -4099 -1968
4650 -1968 1267 3883 4723 3467 663 -2468 -4198 -3995 -1937 1130 3799 4594 3393 605 -2424 -4098
4666 -4098 -4031 -1886 950 3584 4431 3268 608 -2433 -4145 -4231 -2292 820 3305 4339 3135 492
4682 492 -2458 -4291 -4442 -2415 454 3170 4084 3013 400 -2517 -4398 -4658 -2873 288 2902 3878
4698 3878 2928 332 -2723 -4656 -4639 -2857 35 2788 3812 3000 193 -2777 -4770 -4817 -2926 -148
4714 -148 2541 3675 2880 286 -2801 -4814 -4924 -3125 -133 2538 3609 2836 301 -2776 -4894 -4961
4730 -4961 -3209 -143 2364 3427 2626 130 -2700 -4851 -5047 -3387 -373 2296 3623 2695 315 -2714
4746 -2714 -4666 -4947 -3289 -396 2262 3721 2930 442 -2611 -4549 -4818 -3196 -285 2361 3667 3005
4762 3005 544 -2404 -4502 -4755 -2960 -191 2329 3734 2982 794 -2085 -4286 -4709 -2837 -79 2546
4778 2546 3816 3192 939 -2014 -4150 -4445 -2857 -69 2606 3884 3245 1007 -1884 -3878 -4173 -2728
4794 -2728 21 2572 4040 3464 1169 -1532 -3606 -3832 -2471 73 2683 4173 3623 1604 -1267 -3297
4810 -3297 -3843 -2361 186 2793 4257 3851 1844 -913 -3133 -3810 -2227 265 2846 4266 3931 1908
4826 1908 -858 -3111 -3559 -2350 241 2975 4440 3884 1994 -687 -2816 -3660 -2265 110 2889 4430
4842 4430 3978 2047 -620 -2785 -3556 -2488 95 2848 4392 4130 2282 -482 -2778 -3461 -2293 313
4858 313 2894 4327 4110 2338 -365 -2821 -3558 -2415 153 2758 4158 3991 2327 -400 -2803 -3637
4874 -3637 -2662 -128 2617 4275 3982 2054 -517 -2676 -3540 -2548 -211 2426 4161 3916 2184 -593
4890 -593 -2777 -3764 -2842 -389 2255 4047 4013 2181 -629 -2884 -3848 -2839 -517 2204 4015 3855 2117
4907 2117 -654 -3073 -3848 -2857 -518 1972 3950 3800 2082 -582 -3073 -3908 -3102 -753 1958 3713
4923 3713 3702 1897 -812 -2976 -4114 -3179 -739 1713 3653 3429 1783 -709 -3123 -3992 -3298 -1068
4939 -1068 1522 3397 3548 1765 -864 -3145 -4099 -3320 -1148 1584 3329 3508 1854 -810 -3202 -4271
4955 -4271 -3374 -1154 1458 3241 3401 1849 -896 -3177 -4274 -3517 -1317 1397 3116 3302 1753 -738
4971 -738 -3180 -4300 -3652 -1521 1194 3081 3250 1564 -931 -3181 -4246 -3552 -1602 1034 3035 3155
4987 3155 1591 -890 -3167 -4375 -3660 -1620 922 2806 3049 1651 -882 -3171 -4240 -3601 -1694 855
5003 855 2650 2933 1645 -692 -3058 -4293 -3696 -1682 753 2702 3036 1677 -579 -3054 -4212 -3659
5019 -3659 -1728 811 2666 3029 1703 -567 -2931 -4127 -3637 -1622 729 2703 3141 1952 -476 -2924
5035 -2924 -3970 -3636 -1800 854 2891 3361 2319 -197 -2603 -3744 -3351 -1616 997 2872 3426 2329
5051 2329 168 -2414 -3540 -3336 -1203 1113 3092 3556 2448 366 -2031 -3363 -3066 -1202 1333 3288
5067 3288 3780 2778 588 -1790 -3235 -3057 -1209 1432 3411 3998 2990 805 -1581 -2780 -2653 -980
5083 -980 1639 3515 4255 3337 1097 -1357 -2817 -2587 -748 1704 3665 4498 3587 1298 -1028 -2427
5099 -2427 -2314 -651 1784 3792 4635 3647 1580 -867 -2358 -2171 -521 1928 4073 4684 3721 1741
5115 1741 -762 -2292 -2164 -451 1949 4063 4652 3822 1780 -682 -2129 -2034 -446 1940 3963 4736
5131 4736 3800 1760 -631 -2026 -2122 -522 1785 3862 4630 3851 1772 -593 -2185 -2100 -717 1703 3632
5148 3632 4445 3868 1695 -722 -2349 -2339 -842 1436 3625 4412 3702 1586 -810 -2368 -2427 -1012 1351
5165 1351 3326 4206 3575 1350 -958 -2601 -2575 -1265 1082 3103 4009 3360 1332 -1119 -2771 -2855 -1532
5182 -1532 690 2775 3718 3087 1057 -1225 -2839 -3074 -1813 391 2438 3329 2821 968 -1448 -2988
5198 -2988 -3438 -2053 215 2155 3167 2734 789 -1512 -3234 -3417 -2270 -175 2015 2987 2436 502
5214 502 -1712 -3421 -3700 -2561 -447 1721 2758 2247 409 -1923 -3506 -3769 -2846 -643 1581 2596
5230 2596 2370 375 -1915 -3624 -4000 -2890 -785 1488 2559 2162 428 -1991 -3578 -4160 -2970 -783
5246 -783 1289 2514 2027 419 -1706 -3593 -4174 -3024 -628 1334 2500 2082 486 -1816 -3538 -4062
5262 -4062 -2842 -761 1386 2511 2162 636 -1686 -3315 -3943 -2850 -803 1355 2735 2414 662 -1651
5278 -1651 -3409 -3716 -2681 -760 1501 2689 2508 789 -1421 -3216 -3664 -2592 -663 1537 2646 2582
5294 2582 1205 -1325 -3096 -3592 -2576 -468 1662 2712 2519 1020 -1200 -2937 -3536 -2436 -524 1502
5310 1502 2839 2678 1127 -1037 -2882 -3389 -2514 -527 1655 2698 2698 1053 -945 -2815 -3365 -2502 -785
5327 -785 1371 2800 2699 1188 -951 -2829 -3272 -2485 -754 1389 2742 2766 1167 -883 -2731 -3454 -2697
5344 -2697 -837 1326 2658 2584 1144 -839 -2868 -3564 -2765 -887 1207 2553 2447 1184 -935 -2753
5360 -2753 -3607 -2841 -1075 1061 2466 2486 1272 -892 -2873 -3477 -2881 -1197 969 2387 2411 1122 -874
5377 -874 -2706 -3618 -2836 -1095 1091 2374 2450 1257 -856 -2707 -3465 -2993 -1150 1088 2506 2564 1308
5394 1308 -645 -2642 -3490 -2800 -1089 967 2580 2711 1396 -595 -2363 -3384 -2670 -1106 1178 2666
5410 2666 2744 1538 -474 -2337 -3066 -2677 -1022 1209 2757 3020 1893 -279 -2218 -2998 -2476 -714 1382
5427 1382 2900 3182 1992 -133 -2045 -2784 -2276 -667 1441 2872 3174 2042 251 -1794 -2662 -2124
5443 -2124 -471 1589 3030 3293 2276 379 -1490 -2607 -2137 -494 1704 3168 3506 2352 373 -1650
5459 -1650 -2389 -2003 -559 1682 3121 3468 2486 594 -1442 -2361 -1940 -343 1570 3210 3480 2549 556
5476 556 -1304 -2483 -2054 -444 1561 3187 3509 2375 670 -1395 -2384 -2006 -457 1550 3041 3406
5492 3406 2359 562 -1355 -2423 -2151 -632 1434 2936 3251 2400 537 -1261 -2423 -2154 -783 1423
5508 1423 3027 3243 2319 471 -1353 -2374 -2284 -730 1182 2602 3083 2199 451 -1393 -2648 -2256 -870
5525 -870 1037 2620 2956 2233 240 -1495 -2603 -2428 -1029 864 2422 2884 2194 222 -1522 -2737
5541 -2737 -2647 -1266 762 2432 3042 1959 266 -1629 -2669 -2618 -1204 678 2193 2767 2063 246 -1706
5558 -1706 -2749 -2683 -1374 527 2173 2782 2024 301 -1597 -2815 -2764 -1408 516 2071 2651 1923 345
5575 345 -1672 -2697 -2822 -1598 216 1948 2669 1973 221 -1761 -2861 -2863 -1537 111 1872 2564 1798
5592 1798 263 -1656 -2924 -2945 -1726 91 1732 2551 1803 231 -1700 -2914 -2948 -1855 -105 1746
5608 1746 2470 1841 235 -1696 -2956 -3093 -1847 25 1881 2449 1802 111 -1613 -3038 -2984 -1851 -92
5625 -92 1718 2389 1846 418 -1597 -2894 -3006 -1831 -191 1697 2402 1929 348 -1577 -2945 -2895 -1893
5642 -1893 -82 1664 2397 1941 335 -1524 -2857 -2840 -1692 -14 1626 2355 2020 473 -1505 -2755
5658 -2755 -2902 -1875 -166 1677 2434 1929 571 -1359 -2606 -2851 -1753 -31 1825 2448 2219 745
5674 745 -1179 -2571 -2692 -1638 59 1842 2650 2219 706 -1161 -2462 -2720 -1563 89 1946 2773
5690 2773 2380 937 -866 -2227 -2398 -1495 201 1910 2871 2485 1030 -793 -2085 -2390 -1371 262
5706 262 2014 2884 2502 1201 -638 -1988 -2433 -1412 264 2061 2876 2874 1360 -460 -1755 -2256 -1268
5723 -1268 375 2056 3061 2801 1354 -320 -1791 -2206 -1275 372 2121 3141 2910 1544 -178 -1584
5739 -1584 -2134 -1311 371 2221 3107 2978 1586 -160 -1665 -2008 -1203 362 2154 3049 2924 1618 -163
5756 -163 -1635 -2032 -1267 427 2031 3009 3155 1797 -125 -1615 -2019 -1405 225 2019 2953 2724 1558
5773 1558 -68 -1674 -2138 -1491 139 1972 2805 2775 1585 -288 -1753 -2202 -1523 109 1773 2776 2601
5790 2601 1520 -390 -1721 -2242 -1688 -56 1432 2731 2677 1366 -417 -1812 -2337 -1672 -281 1413
5806 1413 2619 2527 1298 -435 -1977 -2482 -1858 -275 1418 2328 2259 1342 -468 -1947 -2560 -2017 -501
5823 -501 1165 2238 2384 1099 -534 -1962 -2732 -2127 -636 1123 2134 2155 1141 -556 -2168 -2583 -2202
5840 -2202 -774 965 2168 2053 1010 -716 -2246 -2911 -2300 -870 907 1966 2094 1000 -749 -2072
5856 -2072 -2840 -2242 -898 665 1827 1977 940 -803 -2054 -2789 -2446 -1048 712 1799 1946 1015 -694
5873 -694 -2115 -2866 -2466 -1057 587 1855 2120 1059 -578 -2101 -2885 -2428 -1106 661 1790 2054 1046
5890 1046 -569 -2015 -2815 -2353 -1016 702 1970 2092 1120 -452 -1950 -2714 -2338 -965 684 1829
5906 1829 2101 1314 -418 -1838 -2649 -2399 -953 563 1858 2185 1299 -293 -1813 -2497 -2317 -944 750
5923 750 1996 2049 1527 -100 -1666 -2570 -2171 -909 707 2028 2275 1543 -66 -1632 -2441 -2068 -858
5940 -858 783 2044 2275 1525 133 -1537 -2319 -2036 -782 936 2080 2508 1664 30 -1594 -2436 -2050
5957 -2050 -842 865 2071 2367 1606 139 -1238 -2327 -2119 -689 780 2134 2522 1690 263 -1282
5973 -1282 -2141 -2098 -874 768 2201 2492 1819 255 -1292 -2138 -1988 -806 848 2071 2578 1885 394
5990 394 -1195 -2047 -1777 -816 774 2079 2602 1879 428 -1226 -2188 -1889 -648 755 2064 2424 1846
6007 1846 385 -1226 -2082 -1950 -849 703 2138 2449 1891 440 -1041 -2009 -1979 -741 786 2188 2452
6024 2452 1845 424 -1077 -2019 -1816 -850 749 2099 2741 1882 451 -959 -1957 -1800 -854 692 1933
6041 1933 2515 1865 681 -1111 -1978 -1841 -797 630 1895 2491 1869 487 -1157 -1995 -2058 -976 602
6058 602 1829 2332 1774 499 -1075 -1916 -2070 -1052 497 1761 2321 1722 490 -1158 -2011 -2014 -1192 369
6076 369 1801 2271 1697 423 -1177 -2152 -2227 -1285 122 1621 2170 1576 278 -1278 -2321 -2414 -1315 99
6094 99 1441 2076 1598 293 -1253 -2227 -2387 -1538 -224 1306 1823 1389 316 -1329 -2436 -2485 -1598 -173
6112 -173 1061 1845 1419 41 -1456 -2299 -2571 -1709 -264 1083 1745 1412 138 -1406 -2580 -2671 -1765 -325
6130 -325 1079 1855 1343 142 -1424 -2474 -2782 -1879 -456 1021 1567 1240 134 -1478 -2550 -2774 -1783
6147 -1783 -402 943 1720 1309 141 -1418 -2460 -2657 -1842 -520 902 1639 1373 156 -1222 -2380
6163 -2380 -2658 -1914 -555 967 1680 1447 299 -1222 -2391 -2478 -1839 -417 957 1742 1550 584 -1112
6180 -1112 -2180 -2309 -1749 -338 1122 1901 1792 439 -957 -1981 -2399 -1566 -145 1181 1938 1803 600
6197 600 -756 -1885 -2158 -1608 -257 1276 2146 1887 930 -502 -1699 -1959 -1373 -81 1434 2164 2035
6214 2035 1119 -484 -1719 -2014 -1361 145 1567 2418 2052 1203 -348 -1462 -1923 -1223 115 1539 2392
6231 2392 2242 1203 -253 -1398 -1792 -1147 95 1625 2409 2371 1269 -84 -1309 -1762 -1096 244 1441
6248 1441 2400 2361 1323 -89 -1229 -1724 -1114 109 1579 2372 2335 1429 70 -1328 -1648 -1108 -36 1518
6266 1518 2380 2375 1402 -65 -1239 -1691 -1239 92 1504 2356 2354 1366 -119 -1258 -1858 -1466 -48 1399
6284 1399 2305 2251 1311 -75 -1144 -1786 -1259 -71 1249 2288 2073 1221 89 -1351 -1845 -1487 -198
6301 -198 1267 2198 2164 1392 -113 -1260 -1837 -1466 -94 1103 2110 2216 1281 -84 -1399 -1871 -1392 -369
6319 -369 1085 2099 2127 1100 -187 -1412 -1802 -1529 -364 939 2038 2104 1300 -39 -1515 -1912 -1611
6336 -1611 -305 1009 2000 2076 1217 -153 -1282 -1926 -1508 -324 1005 1924 2122 1402 -156 -1370 -1952
6353 -1952 -1608 -378 960 1895 2039 1319 58 -1174 -1761 -1465 -379 862 1964 2125 1232 -32 -1166
6370 -1166 -1735 -1567 -472 949 1893 1971 1287 144 -1219 -1838 -1554 -465 923 1891 2000 1330 55 -1052
6388 -1052 -1880 -1571 -418 749 1893 2074 1363 182 -1089 -1748 -1550 -515 816 1892 2133 1347 213
6405 213 -1107 -1759 -1580 -518 669 1866 2071 1546 98 -1137 -1674 -1613 -667 814 1756 2072 1462 197
6423 197 -1083 -1813 -1518 -564 604 1716 2040 1275 328 -1077 -1780 -1752 -736 580 1595 1917 1358 168
6441 168 -1097 -1975 -1745 -897 636 1611 1834 1273 121 -1125 -1993 -1823 -1070 334 1495 1831 1248 -10
6459 -10 -1298 -2052 -1890 -936 282 1442 1711 1248 -68 -1286 -2045 -2006 -1132 196 1336 1809 1150 -60
6477 -60 -1393 -2189 -2072 -1124 154 1223 1596 1097 -129 -1431 -2160 -2104 -1342 19 1111 1440 1072 -120
6495 -120 -1457 -2283 -2169 -1307 -70 1201 1552 1168 -146 -1514 -2189 -2227 -1189 -96 965 1467 1042 -135
6513 -135 -1408 -2226 -2209 -1280 -145 1112 1517 1153 -215 -1241 -2171 -2330 -1298 -12 1070 1669 1197 -29
6531 -29 -1188 -1942 -2230 -1277 144 1082 1541 1095 25 -1136 -1976 -2106 -1411 -15 1188 1735 1225 187
6549 187 -1125 -1995 -1942 -1191 23 1153 1696 1259 204 -967 -1886 -1954 -1192 86 1273 1787 1488 415
6567 415 -770 -1875 -1859 -1226 28 1348 1762 1553 502 -748 -1579 -1774 -1061 176 1433 1959 1727 469
6585 469 -649 -1568 -1744 -998 277 1378 2004 1678 734 -506 -1330 -1553 -934 129 1472 2069 1764 803
6603 803 -487 -1326 -1573 -875 254 1555 2180 1907 867 -394 -1334 -1471 -790 353 1416 2147 1866 947
6621 947 -278 -1314 -1430 -814 264 1475 1999 1843 956 -212 -1364 -1527 -953 207 1520 2091 1930
6638 1930 814 -216 -1214 -1595 -967 257 1418 2022 1900 968 -314 -1316 -1558 -888 164 1336 2040
6655 2040 1907 1015 -358 -1242 -1588 -1033 72 1429 2025 1895 853 -317 -1322 -1735 -1009 53 1207
6672 1207 1884 1777 879 -323 -1373 -1644 -1255 -85 1145 1845 1660 844 -320 -1385 -1743 -1171 -134
6689 -134 1132 1807 1698 872 -360 -1338 -1747 -1384 -259 851 1581 1684 753 -393 -1491 -1886 -1350 -274
6707 -274 880 1568 1596 677 -644 -1543 -1825 -1539 -374 606 1565 1532 760 -555 -1657 -1988 -1661 -523 531
6726 531 1265 1263 616 -651 -1735 -2041 -1730 -563 515 1298 1324 501 -619 -1795 -2276 -1842 -730 402
6744 402 1213 1302 345 -802 -1807 -2225 -1858 -1013 165 1234 1197 428 -800 -1911 -2239 -1984 -1018 263
6762 263 1099 1185 398 -681 -1888 -2416 -1999 -1059 90 1014 1034 312 -747 -1926 -2501 -2161 -1130 111
6780 111 1034 929 449 -864 -1966 -2335 -2078 -1149 161 1027 1087 424 -635 -1712 -2265 -1927 -1091 79
6798 79 1036 1181 530 -653 -1705 -2097 -1978 -980 286 1257 1347 862 -322 -1460 -1966 -1723 -976 343 1422
6817 1422 1484 913 -95 -1224 -1741 -1565 -571 447 1578 1707 1194 145 -927 -1550 -1353 -374 790 1676
6835 1676 1942 1413 340 -780 -1341 -1065 -249 907 2007 2126 1574 609 -625 -1198 -936 -13 1048 2095
6853 2095 2321 1844 758 -409 -948 -859 181 1282 2158 2440 1936 989 -270 -797 -747 94 1424 2228
6871 2228 2504 2035 969 -110 -701 -575 324 1445 2275 2588 2138 1094 -91 -585 -710 269 1356 2296
6889 2296 2574 2093 1126 29 -713 -702 157 1284 2182 2490 2036 1006 -169 -762 -736 24 1176 2058 2395
6908 2395 1941 927 -223 -902 -805 -167 1100 1976 2268 1908 826 -167 -954 -1095 -342 902 1742 2029
6926 2029 1658 715 -299 -1033 -1065 -530 599 1548 1913 1656 520 -519 -1228 -1249 -624 264 1237 1832 1525
6945 1525 509 -708 -1461 -1533 -794 284 1138 1556 1208 338 -821 -1581 -1727 -1000 94 1012 1356 1082
6963 1082 144 -942 -1711 -1869 -1182 -185 778 1268 948 -51 -1113 -1966 -1856 -1446 -232 736 1187 844 -234
6982 -234 -1281 -2073 -2126 -1533 -412 548 913 760 -122 -1339 -2034 -2264 -1629 -569 381 836 642 -211 -1364
7001 -1364 -2091 -2210 -1728 -664 368 925 565 -212 -1437 -2157 -2282 -1754 -598 295 763 607 -212 -1315
7019 -1315 -2104 -2164 -1746 -746 340 705 665 -201 -1174 -2097 -2293 -1859 -580 371 875 684 -71 -1255 -1956
7038 -1956 -2073 -1537 -554 379 935 718 68 -1065 -1930 -1994 -1379 -457 437 1129 958 61 -846 -1728 -1951 -1410
7058 -1410 -440 652 1301 1173 233 -827 -1495 -1798 -1274 -285 822 1350 1230 453 -524 -1309 -1543 -1033 -90
7077 -90 888 1522 1432 540 -384 -1155 -1423 -996 -73 1113 1768 1606 917 -129 -1010 -1235 -819 147 1198 1762
7097 1762 1877 1056 -85 -772 -1227 -775 150 1319 1811 1903 1163 107 -808 -1111 -676 320 1338 1933 1944
7116 1944 1258 255 -623 -1014 -599 326 1351 1973 2029 1330 280 -634 -944 -614 358 1374 2114 1976 1399
7135 1399 293 -641 -828 -647 311 1428 2036 2022 1376 271 -654 -974 -569 198 1383 1963 2049 1443 391
7154 391 -764 -1014 -623 259 1159 1939 1931 1140 179 -715 -989 -782 101 1085 1865 1845 1308 138 -815 -1161
7174 -1161 -813 -98 1027 1761 1802 1230 152 -697 -1200 -825 -34 960 1566 1722 1071 97 -899 -1276 -1074
7193 -1074 -175 730 1475 1559 947 -96 -905 -1428 -1158 -224 592 1434 1499 866 -91 -1059 -1608 -1215 -581 496
7213 496 1146 1392 716 -264 -1172 -1672 -1510 -699 312 1090 1210 764 -277 -1246 -1690 -1522 -759 313 1041
7232 1041 1132 692 -287 -1269 -1836 -1659 -749 194 1004 1152 658 -317 -1273 -1781 -1561 -911 18 946 990 557
7252 557 -449 -1295 -1958 -1708 -912 40 870 974 523 -454 -1370 -1809 -1593 -962 135 821 1119 572 -344
7271 -344 -1341 -1856 -1635 -990 63 825 973 629 -406 -1314 -1773 -1606 -784 156 920 1110 714 -175 -1100
7290 -1100 -1677 -1640 -810 55 817 1178 732 -87 -1047 -1631 -1525 -903 102 934 1266 824 -29 -979 -1581 -1507
7310 -1507 -874 220 986 1204 904 32 -964 -1443 -1431 -796 106 1033 1322 994 13 -959 -1397 -1359 -699 270
7330 270 1074 1454 1006 280 -845 -1418 -1270 -728 180 1059 1443 1057 102 -823 -1258 -1329 -787 252 1124 1402
7350 1402 1044 334 -622 -1301 -1244 -641 83 1047 1199 989 136 -728 -1242 -1409 -789 133 1075 1361 977 361
7370 361 -680 -1390 -1440 -789 131 939 1243 1020 129 -687 -1316 -1475 -829 164 923 1235 961 340 -706 -1453
7390 -1453 -1395 -790 15 876 1273 1014 202 -781 -1301 -1491 -894 -45 858 1184 934 147 -795 -1306 -1466 -920
7410 -920 -34 796 1121 832 166 -893 -1403 -1454 -925 -10 634 1060 1049 324 -709 -1378 -1573 -1040 -19 790
7430 790 1154 1025 232 -738 -1365 -1467 -1024 -18 912 1151 956 387 -697 -1231 -1519 -974 -85 955 1246
7449 1246 976 438 -542 -1309 -1372 -886 -69 796 1271 1151 475 -497 -1140 -1214 -882 85 879 1460 1253 568
7469 568 -275 -964 -1270 -741 171 996 1479 1366 823 -190 -936 -1252 -667 170 1067 1599 1477 737 49 -747
7489 -747 -1043 -520 271 1131 1765 1601 857 81 -783 -905 -482 324 1239 1723 1636 990 -38 -665 -883 -448
7509 -448 349 1123 1819 1583 900 136 -653 -738 -351 465 1271 1722 1704 1065 323 -548 -720 -442 401 1207 1786
7530 1786 1595 1187 266 -530 -828 -469 300 1131 1705 1676 1091 312 -420 -750 -469 184 1131 1747 1567 1037
7550 1037 247 -588 -823 -534 213 989 1674 1748 906 102 -629 -957 -749 91 929 1497 1529 1000 143 -626
7570 -626 -1075 -736 8 729 1375 1378 780 -57 -823 -1011 -812 -203 784 1343 1342 794 16 -796 -1226 -985 -262
7591 -262 501 1192 1199 599 -228 -939 -1333 -1093 -434 504 880 972 517 -188 -1118 -1455 -1219 -694 457 924 887
7612 887 384 -296 -1155 -1449 -1342 -587 159 880 962 436 -549 -1205 -1621 -1354 -824 71 821 709 284 -518
7632 -518 -1263 -1793 -1510 -819 21 526 763 286 -496 -1185 -1614 -1603 -889 -36 645 733 250 -532 -1253 -1683 -1537
7653 -1537 -933 20 534 687 203 -488 -1433 -1639 -1517 -886 -115 671 907 229 -436 -1227 -1736 -1572 -946 -55
7673 -55 626 817 548 -349 -1247 -1528 -1423 -834 61 524 853 414 -400 -1088 -1626 -1403 -795 119 769 862 588
7694 588 -216 -1016 -1490 -1197 -791 85 830 1058 588 -155 -685 -1302 -1218 -581 275 973 1165 767 23 -866
7714 -866 -1195 -1065 -601 272 1028 1211 830 123 -675 -1075 -1044 -389 419 1085 1270 1039 337 -515 -1008 -935 -322
7735 -322 504 1113 1398 1087 344 -330 -955 -804 -320 590 1133 1537 1174 412 -438 -871 -711 -53 603 1340
7755 1340 1628 1271 493 -277 -778 -680 -158 678 1264 1514 1220 562 -251 -759 -721 -192 594 1282 1556 1188
7775 1188 557 -207 -666 -704 -29 603 1331 1512 1254 583 -138 -662 -718 -193 661 1253 1568 1321 659 -39
7795 -39 -798 -643 -281 565 1188 1407 1299 589 -198 -730 -760 -333 527 1208 1451 1108 481 -282 -853 -912 -499
7816 -499 399 1075 1366 1143 497 -332 -967 -1069 -397 301 968 1259 972 315 -400 -1009 -1108 -608 232 862
7836 862 1258 1000 355 -597 -1092 -1171 -825 74 708 978 882 310 -636 -1041 -1240 -780 -83 729 1101 816 55
7857 55 -544 -1214 -1268 -873 -124 534 975 850 80 -787 -1263 -1330 -1033 -314 460 894 655 179 -720 -1352 -1598
7878 -1598 -1094 -296 474 826 562 -39 -813 -1330 -1611 -1156 -397 344 746 501 -93 -788 -1433 -1568 -1186 -446
7898 -446 265 624 522 -144 -871 -1360 -1463 -1281 -470 225 648 572 -7 -800 -1411 -1547 -1228 -530 288 535
7918 535 642 145 -830 -1310 -1645 -1206 -485 276 776 659 2 -696 -1303 -1437 -1074 -433 289 801 646 150
7938 150 -607 -1152 -1552 -1099 -310 367 797 789 288 -698 -1187 -1363 -1033 -232 545 967 948 358 -490 -955 -1249
7959 -1249 -919 -219 499 1141 1109 433 -286 -883 -1104 -919 -48 641 1112 1065 730 -176 -788 -1074 -743 -52
7979 -52 689 1320 1149 700 -76 -766 -937 -578 90 842 1351 1373 760 88 -489 -780 -528 27 931 1391 1391
8000 1391 919 185 -450 -701 -451 116 972 1384 1377 952 328 -452 -686 -490 275 958 1321 1430 931 348
8020 348 -436 -666 -409 213 895 1437 1456 803 237 -401 -585 -647 30 790 1322 1323 932 263 -474 -767 -554
8041 -554 89 800 1300 1279 1000 72 -497 -686 -623 -37 702 1275 1363 927 240 -590 -898 -595 -25 578 1204
8062 1204 1156 763 198 -708 -924 -878 -142 540 1127 1111 711 -22 -708 -1037 -985 -217 479 952 1053 647 30
8083 30 -714 -1082 -993 -373 394 974 1185 666 -89 -852 -1099 -1032 -363 306 795 950 655 -163 -787 -1121 -993
8104 -993 -439 237 755 906 556 -244 -853 -1261 -1170 -626 274 716 865 564 -248 -1011 -1259 -1168 -646 39 770
8125 770 753 514 -156 -977 -1311 -1279 -590 36 672 836 429 -113 -898 -1493 -1279 -678 -38 672 775 435 -281
8146 -281 -839 -1260 -1210 -824 -2 621 721 394 -313 -806 -1455 -1180 -727 -37 621 756 610 -242 -956 -1278
8166 -1278 -1093 -751 -86 628 888 574 -120 -762 -1227 -1114 -736 13 677 858 607 -87 -883 -1277 -1146 -753
8186 -753 19 611 832 603 -95
8191i5
$$ Imaginary data points
##PAGE= N=2
##DATA TABLE= (X++(I..I)), XYDATA
0 0 0 0 0 0 0 0 -8 5 -8 8 -8 16 -16 24 -25 32 -40 44 -55 64 -73 86 -99 113 -133 149 -173 196 -221 249
30 249 -280 315 -354 394 -443 489 -546 607 -671 744 -825 913 -1014 1119 -1242 1377 -1530
47 -1530 1706 -1908 2143 -2423 2753 -3170 3692 -4383 5337 -6749 9067 -13551 25547 -126911
61 -126911 -398070 -344363 -244898 -91865 -3256 46714 6071 -101321 -268241 -389103 -404721
72 -404721 -287893 -126648 -2816 20220 -36086 -147223 -271803 -378309 -403510 -320703 -158706
83 -158706 -17463 25894 -43920 -170818 -294159 -370588 -381333 -313143 -183198 -45070 21050
94 21050 -27473 -163497 -304927 -380477 -367236 -287722 -174944 -63608 3701 -17595 -132731
105 -132731 -283876 -379718 -367215 -267661 -144195 -47389 -529 -17507 -105236 -236872 -344155
116 -344155 -356157 -260089 -115623 -4720 28635 -8202 -88636 -191360 -284626 -315913 -245864
127 -245864 -101385 31068 76826 28165 -68572 -165437 -235573 -257509 -208690 -91657 41073
138 41073 112152 78688 -31572 -147284 -212611 -213684 -161141 -67909 42406 120092 113202 16078
150 16078 -114068 -198966 -198650 -129002 -30882 60969 121261 123245 52455 -66578 -168701 -190554
162 -190554 -119377 -1751 99002 144693 131463 69509 -26303 -121685 -163320 -112960 9169
173 9169 131847 187398 160923 83407 -7408 -84190 -120681 -89251 13133 140764 219777 203423
185 203423 109552 -52 -72705 -90281 -55808 26015 135971 222801 228715 141322 14849
196 14849 -75072 -88887 -37482 47274 138284 208506 222609 158050 38058 -70183 -102059 -45332
208 -45332 57298 150822 202643 203267 150066 51433 -53019 -103752 -63675 44920 156166 212005
220 212005 197982 132928 44250 -41086 -89501 -68326 24375 143161 219048 209814 129390 27775
232 27775 -48920 -79700 -57875 16490 121886 207384 217164 139482 21748 -67760 -91090 -52921
244 -52921 22731 111389 184080 203053 144557 29769 -77737 -114808 -67910 25066 113827 168632
256 168632 176933 130390 34329 -72135 -126884 -92430 8704 113029 168254 160659 104987 21311
268 21311 -66197 -120718 -105717 -18137 95183 166951 159953 89065 -1903 -76306 -114451 -102473
280 -102473 -35005 66715 148963 159075 89521 -15712 -98287 -126109 -100143 -35568 47770
291 47770 120255 142729 91430 -13157 -112188 -149888 -113811 -34808 46210 102409 118126 80516
303 80516 -7417 -108118 -162668 -135970 -46716 49237 104793 106280 62330 -12763 -97277 -154198
315 -154198 -145541 -65514 42072 113896 114539 55926 -24269 -95543 -138762 -135040 -73044 27029
327 27029 110931 127018 67563 -26264 -103055 -135290 -119838 -64005 17933 95488 125383 82450
339 82450 -13490 -106001 -144644 -118992 -53170 21841 83627 110505 82978 1485 -95257 -150363
351 -150363 -131832 -56114 30180 87658 101107 70841 3797 -79728 -140899 -139978 -70285 29066
363 29066 99879 109539 65157 -4834 -75300 -125772 -131867 -78273 17350 102305 125111 76384
375 76384 -8488 -83555 -122193 -117526 -70399 9243 90791 128158 92471 1800 -89614 -132153
387 -132153 -115151 -58091 13821 79937 115388 94106 15384 -81487 -139189 -125979 -57722 23535
399 23535 82745 103784 81748 18303 -66382 -130343 -132835 -68048 25188 93697 108304 73914
411 73914 11634 -58103 -112280 -122567 -72645 17884 98524 122959 83546 9721 -60051 -101512
423 -101512 -103544 -62520 12994 92198 130402 101104 20734 -61914 -104099 -94686 -47406 18703
435 18703 84601 123066 107279 35784 -54442 -109777 -101911 -43688 28976 85977 111767 97424
447 97424 40547 -40525 -104846 -111066 -53879 30516 94039 111511 86708 33609 -32593 -89801
459 -89801 -106193 -63477 20060 95737 121286 90364 28207 -34867 -78679 -90262 -59684 9049
471 9049 85539 125710 103686 34898 -38056 -80329 -81564 -48490 8292 72812 116257 109042 48114
484 48114 -33166 -87540 -89474 -46803 13780 69350 102811 99929 52937 -22870 -88012 -102986
496 -102986 -59651 12804 73924 100096 88829 46130 -17700 -79614 -105480 -73763 1624 75979
508 75979 109148 91171 39277 -21692 -72629 -95512 -74333 -9644 69285 116229 103650 43102
520 43102 -27630 -75808 -88474 -65320 -10874 58734 110299 110350 53945 -26288 -84730 -95191 -62138
533 -62138 -5328 54081 96656 101739 57953 -19409 -88486 -108956 -72476 -5367 56303 89860
545 89860 87771 49240 -16778 -83782 -114290 -86462 -14991 58256 95203 84449 38584 -22425
557 -22425 -78406 -106807 -88566 -24488 54604 103226 94751 39509 -28874 -79545 -97490 -77705
569 -77705 -22778 49321 103138 104919 51035 -26725 -84954 -98154 -68262 -12436 49306 95251
581 95251 102373 59059 -17992 -85776 -106008 -71259 -6848 53987 89524 90434 53386 -12228 -78815
594 -78815 -108238 -80884 -12710 56345 91794 83565 42069 -15581 -70453 -99520 -83222 -22387
606 -22387 51316 95892 88223 39089 -21674 -69123 -88965 -73749 -23824 43186 93348 95696
618 95696 47749 -20968 -73179 -87219 -64186 -16477 39963 84498 94004 56250 -12733 -74147
630 -74147 -93658 -65797 -11315 43049 78497 84067 53850 -5910 -68082 -97537 -75695 -16745
642 -16745 45031 79678 77396 44453 -7329 -60606 -92244 -81002 -27428 40175 82884 80500
654 80500 40851 -12249 -58209 -83057 -75192 -32045 30796 80323 87353 48400 -11323 -60308
666 -60308 -79093 -65989 -27359 25361 72075 87644 58136 -2573 -60114 -83110 -65397 -21797
678 -21797 27240 65734 80083 58757 5916 -54353 -87382 -74105 -25281 30368 67180 74023
690 74023 51673 6154 -47527 -84631 -81375 -35360 27688 71975 77365 47883 837 -46601
702 -46601 -78492 -79057 -41722 19367 71680 84641 53458 -1338 -51257 -77235 -72764 -39536 13262
715 13262 64306 85610 61361 3851 -54079 -82513 -72822 -35334 13579 57184 77882 61475
727 61475 10227 -50751 -87490 -80783 -37972 15676 56213 70398 53957 10527 -45159 -86074
739 -86074 -87515 -46266 13694 59484 71126 48860 5492 -43615 -80088 -85447 -51493 7933
751 7933 60989 78378 53289 3210 -46342 -76598 -77771 -47942 4821 58066 82709 62104
763 62104 7996 -48523 -79261 -74599 -40998 7634 54215 78646 64789 14627 -45879 -83810
775 -83810 -79699 -40249 11789 53944 71668 58241 15524 -41123 -83342 -86033 -46841 10794
787 10794 55837 69712 51258 10314 -38658 -76819 -83923 -51893 5135 56177 74127 52929
799 52929 7591 -39257 -70237 -74568 -48085 2077 53509 78273 61140 13070 -38425 -68314
811 -68314 -67151 -38843 6046 51524 77080 66974 22538 -32878 -68717 -67472 -34058 12669
823 12669 53215 73475 65121 27416 -25266 -66090 -71230 -37749 14096 56744 73350 60594
835 60594 24976 -21677 -60254 -70741 -43513 8746 57395 77197 61258 21856 -22270 -54786
847 -54786 -63910 -42770 3480 53794 80307 68067 25850 -21846 -52967 -57955 -36054 4813
859 4813 50166 78901 73773 35321 -16175 -52633 -57007 -31332 10039 50326 75479 73514 41359
872 41359 -8513 -49995 -59926 -34019 11622 53318 74668 69706 39826 -4810 -45622 -60987
884 -60987 -39924 6946 54417 77930 69087 35745 -6970 -43115 -58006 -41883 1640 51753
896 51753 80726 73370 35850 -10509 -44717 -55084 -38281 744 47332 79047 77017 40785
908 40785 -9928 -48192 -56665 -35432 3643 45158 73344 74199 43533 -6579 -49236 -61639 -38942
921 -38942 3525 44633 68229 66163 38438 -5991 -47996 -65339 -47254 -3501 41488 65243
933 65243 59115 29168 -11688 -48708 -66290 -53429 -13507 33657 61750 56567 23323 -19509
945 -19509 -53945 -67281 -54616 -19448 24405 55347 55016 22954 -23492 -60240 -71038 -54836
957 -54836 -20211 18897 47589 50696 23185 -22757 -63198 -76864 -58905 -21504 17003 41688
969 41688 43154 19210 -22228 -62563 -80703 -66272 -27386 14414 38643 36996 12584 -24750
981 -24750 -61255 -80584 -71408 -35667 8317 36325 35483 9177 -28771 -61915 -78410 -70952 -40347
994 -40347 1071 32776 37121 11694 -28673 -63343 -77620 -68049 -39441 -1927 28984 37635 16833
1007 16833 -23531 -61974 -78687 -67377 -36231 272 28245 36359 19381 -17736 -57452 -78881
1019 -78881 -69855 -36195 3712 31465 36843 19044 -15053 -52514 -75757 -70953 -38647 4430
1031 4430 35814 41198 20759 -14327 -49397 -70379 -67066 -38503 3841 38836 48061 27507 -10609
1044 -10609 -46502 -65040 -59703 -32723 6631 41167 53724 36734 -1686 -40747 -60295 -53356
1056 -53356 -24243 13476 45314 57761 43641 8051 -32092 -55496 -49896 -18894 20932 51274
1068 51274 61031 46799 13890 -24545 -49795 -47409 -17289 24734 57302 65849 49040 15314
1080 15314 -20784 -44140 -43409 -16093 25489 60932 71536 53291 16802 -19573 -40324 -37534
1092 -37534 -11926 27208 62622 75747 59228 21484 -17160 -38042 -32986 -5675 31784 64275
1104 64275 77187 63460 28024 -11840 -35472 -30814 -1872 36378 66712 77061 63827 31329
1116 31329 -6673 -31763 -30288 -2598 36661 67849 77008 61776 29961 -5101 -28772 -29432 -5348
1129 -5348 32809 65796 76504 60651 27286 -7100 -28401 -28399 -6495 28817 61578 74544 60553
1142 60553 26633 -9534 -30719 -28862 -6389 27309 57469 70607 59233 27284 -10177 -33610
1154 -33610 -32060 -7922 25934 54388 65562 54780 25379 -10663 -35673 -36793 -13607 21214
1166 21214 50179 60419 48383 19794 -13617 -37754 -41221 -21192 12920 43321 54913 42443
1178 42443 13363 -19080 -41095 -44625 -27205 4286 35137 49173 39108 10178 -22876 -45099
1190 -45099 -47501 -29987 -435 28629 44105 37309 10607 -23465 -47279 -50072 -31827 -2222
1202 -2222 25848 40768 35580 11223 -21822 -47363 -52543 -34867 -3916 25007 39488 33558 9908
1215 9908 -21457 -47115 -54554 -39064 -7698 23314 38954 32264 7575 -23409 -48042 -55626 -42082
1228 -42082 -12100 19960 37986 32693 7418 -25038 -49691 -56253 -42533 -13901 17266 36722
1240 36722 34289 10275 -23398 -49756 -56290 -41394 -12622 17540 36491 35465 13607 -19254
1252 -19254 -46977 -55596 -40805 -10869 20103 38103 36377 15303 -16039 -43688 -54104 -41144
1264 -41144 -10875 21652 40424 37548 15505 -15553 -42298 -52711 -40988 -11738 21313 41572
1276 41572 39473 16309 -16003 -42548 -51527 -39295 -11029 21261 42423 41705 18729 -14593 -41805
1289 -41805 -50324 -36754 -8075 23074 43668 43359 21848 -10962 -38981 -48422 -34755 -5248 25911
1302 25911 45036 43935 23507 -7777 -35567 -46238 -33889 -4912 26837 45541 43784 23094
1314 23094 -7082 -33575 -44484 -34244 -6623 24718 44490 43282 22320 -8091 -33775 -43878
1326 -43878 -34169 -8472 21638 41965 42533 22444 -8209 -34234 -43923 -33612 -8517 20374 40486
1339 40486 42044 23487 -6379 -33112 -43652 -33292 -7328 21582 40867 41959 24648 -3954
1351 -3954 -30725 -42613 -33228 -7431 22182 41652 42356 24882 -2938 -29006 -41169 -33515 -9014
1364 -9014 20718 41119 42649 25084 -2923 -28601 -40524 -33606 -10868 17952 39276 42515 25871
1377 25871 -2311 -28238 -40328 -33534 -11206 16699 37871 42278 27391 46 -26513 -39705
1389 -39705 -33336 -10797 17212 37985 42765 28910 2449 -24334 -38746 -33317 -10946 17493
1401 17493 38948 43427 29431 3188 -23415 -38202 -33920 -12309 16432 38572 43380 28829
1413 28829 2228 -24400 -39046 -35181 -14196 14409 36875 42458 28083 914 -26063 -40551
1425 -40551 -36231 -15299 12727 35096 41167 27834 1182 -26038 -41078 -36735 -15660 12385
1437 12385 34218 40448 28045 2574 -24398 -40025 -36730 -15833 12043 33998 40130 27869
1449 27869 3094 -23264 -39065 -36535 -17052 10539 32885 39271 27114 1907 -23976 -39425
1461 -39425 -37598 -19159 7595 29927 37012 25142 164 -26182 -41855 -39809 -21431 4682
1473 4682 26623 33950 23029 -1380 -28006 -43982 -41923 -23285 2764 24454 31684 21349 -2103
1486 -2103 -28145 -44531 -43089 -24763 1442 23519 30944 20540 -2317 -27564 -43637 -43201 -26075
1499 -26075 -253 22180 30382 20648 -2053 -27175 -42978 -43086 -26885 -2055 20178 29275 20752
1512 20752 -1287 -26436 -42883 -43167 -27615 -3414 18516 28231 21167 169 -24869 -42123 -43039
1525 -43039 -27525 -3221 18865 28838 22482 2341 -22337 -39880 -41527 -26572 -1762 20954
1537 20954 31359 24970 5118 -19190 -36792 -39306 -24768 -85 23370 34395 28044 7715
1549 7715 -16786 -34225 -36911 -23131 890 24423 36274 30452 10118 -14976 -33122 -35980 -22398
1562 -22398 1250 24384 36507 31777 12112 -13430 -32321 -35643 -22073 1577 24778 36908
1574 36908 32740 13814 -11058 -30332 -34688 -21651 2453 26072 38371 34173 15459 -8665
1586 -8665 -27859 -32927 -20705 3260 27584 40446 36174 17030 -7552 -26454 -31274 -19535 3834
1599 3834 27923 41328 37369 18051 -7580 -26848 -31388 -19328 3807 27246 40670 36967 17802
1612 17802 -8135 -28163 -32817 -20180 3134 26457 38952 35269 16584 -8829 -28962 -34209
1624 -34209 -21650 2181 25718 38125 33865 15238 -9203 -28707 -34221 -22775 666 24590
1636 24590 37283 33128 14439 -9692 -28568 -33897 -23032 -983 22290 35606 32353 13799
1648 13799 -10664 -29737 -34567 -23721 -2544 19756 32858 30398 12563 -11764 -31029 -36243
1660 -36243 -25358 -4140 17688 30185 27783 11299 -12187 -31495 -37319 -26760 -5111 16915
1672 16915 29289 26532 10448 -11618 -30336 -36572 -26751 -5551 16983 29808 27215 11351 -10425
1685 -10425 -28334 -34070 -25319 -5481 16734 30408 28906 13205 -8856 -26359 -32035 -23469 -4845
1698 -4845 16061 29895 29724 15158 -6558 -24932 -31128 -22904 -4557 15657 28922 29428 16513
1711 16513 -4289 -23325 -30952 -23507 -4835 15768 29123 29509 17327 -2571 -21087 -29698 -23505
1724 -23505 -5283 16101 30604 31224 18708 -759 -18885 -27324 -21952 -4757 16872 32362 34138
1737 34138 21395 996 -17294 -25569 -20179 -3408 17679 33631 36466 24209 3263 -16220
1749 -16220 -24898 -19264 -2167 18498 34018 37181 26004 5435 -14947 -24986 -19574 -2014 19324
1762 19324 34600 37395 26963 7173 -12969 -24058 -19936 -2274 19718 35658 38585 27670
1774 27670 8030 -11500 -22273 -19232 -2700 19519 36739 40276 28707 8398 -11011 -21403
1786 -21403 -18113 -2478 18930 36395 40624 29513 8352 -12200 -22561 -18445 -2618 18026
1798 18026 34607 38885 28637 7639 -13828 -25122 -20985 -4143 16968 32455 35881 25698
1810 25698 5639 -15347 -27358 -23859 -7022 14851 30825 33439 22449 2952 -16802 -28269
1822 -28269 -25882 -9993 11892 28509 31820 20579 804 -18454 -29045 -26414 -11980 8685
1834 8685 25485 30060 19439 -575 -20185 -30663 -27627 -13457 6042 21968 26999 17960 -1390
1847 -1390 -21870 -33327 -30274 -15577 3667 18671 23335 15001 -3125 -23050 -35433 -33340 -18525
1860 -18525 1431 16711 20825 11969 -5460 -24292 -36042 -35220 -21038 -822 15568 19975 10773
1873 10773 -6830 -25072 -36057 -35240 -22188 -2607 14249 19968 11278 -6851 -25474 -36215 -34820
1886 -34820 -22026 -3608 12537 19246 12103 -5524 -24916 -36548 -35124 -22047 -3762 11679
1898 11679 18181 12304 -3836 -23287 -36128 -35727 -22573 -3564 12236 18327 12265 -3045 -21139
1911 -21139 -34064 -35054 -22877 -3234 13805 20229 13638 -1849 -19416 -31395 -32676 -21535 -2562
1924 -2562 15208 22887 16760 420 -17636 -29156 -29569 -18695 -713 16430 24752 19912 3516
1937 3516 -15643 -28050 -27962 -16045 1539 17808 25878 21538 6314 -12971 -26346 -27199 -15130
1950 -15130 3385 19379 26677 21995 7695 -10350 -24138 -26133 -15136 3974 21030 28323 23336
1963 23336 8890 -8313 -21143 -23601 -13743 4469 22285 30764 26114 11095 -6532 -18704 -20545
1976 -20545 -11174 5769 23035 32467 28877 13822 -4643 -17326 -18572 -8745 7873 24062 33149
1989 33149 30142 16182 -2539 -16271 -18150 -7751 9482 25317 33275 29956 16844 -775 -14883
2002 -14883 -17825 -7973 9785 26441 34127 30151 16951 -26 -13158 -16718 -8050 9378 26675
2015 26675 35388 31250 17423 342 -11963 -14807 -6926 8926 25759 35585 32751 18779 1021
2028 1021 -11747 -14156 -6217 8643 24441 34057 32459 19613 1771 -12426 -15795 -7342 7824
2041 7824 22846 31556 30092 18571 1432 -13337 -18127 -10474 5385 21132 29457 27316 15750
2054 15750 -280 -14428 -19940 -13600 1868 18612 28129 25512 13345 -2761 -15975 -20877 -15336
2067 -15336 -1149 15668 26292 25023 12412 -4716 -18055 -22534 -16471 -2728 12973 23718
2079 23718 23708 11972 -5842 -20415 -25114 -18562 -4469 10684 20549 20804 10421 -6555 -22232
2092 -22232 -28471 -22026 -7402 8350 18150 17624 7553 -8205 -23533 -30785 -25967 -11070 5847
2105 5847 16354 15751 4894 -10888 -25068 -31850 -27908 -14140 3132 15042 15257 3899 -12727
2118 -12727 -26997 -32850 -28263 -14790 1467 13582 14942 4198 -13178 -28557 -34129 -28492 -14516
2131 -14516 1315 12313 13758 4012 -12899 -28901 -35546 -29566 -14603 1435 11997 12511 2968
2144 2968 -12988 -28156 -35439 -30445 -15545 1483 12386 12398 2331 -13082 -27213 -33953 -29937
2157 -29937 -16064 1196 13064 13708 3223 -12503 -25998 -31852 -27621 -14934 1458 13563 15281
2170 15281 5722 -10304 -24601 -30171 -25213 -12439 2687 14020 16297 8019 -7517 -22429 -28910
2183 -28910 -23868 -10488 4715 15024 16650 9015 -5285 -19589 -26997 -22923 -9440 6366 16948
2196 16948 17850 9724 -3845 -16891 -24052 -21149 -8823 7222 18738 20057 11526 -2164 -14714
2209 -14714 -20987 -18267 -7222 7770 19749 22435 14741 566 -12608 -18751 -15528 -4863 8914
2222 8914 20394 24096 17715 3876 -10168 -17277 -14238 -3380 10363 21047 24561 18918 6483
2235 6483 -7509 -16116 -14422 -3334 10966 22049 24985 19138 7238 -5951 -14653 -14363 -4379 10719
2249 10719 22723 25968 19557 7285 -5672 -13920 -13589 -4535 9736 22578 27074 20885 7439
2262 7439 -6163 -13863 -13063 -4170 9355 21777 27013 21876 8401 -6222 -15042 -13981 -4321 9064
2276 9064 20592 25500 21165 8629 -6433 -16301 -16238 -6256 7887 19620 23898 19151 7391 -6814
2290 -6814 -17227 -18294 -9071 5774 18452 22785 17540 5522 -8142 -17868 -19063 -10927 3382
2303 3382 16878 22639 17372 4491 -9583 -18629 -19096 -11144 2391 15597 21916 17867 4854 -10167
2317 -10167 -19550 -19462 -10599 2631 15103 20986 17454 5330 -9705 -20075 -20416 -10817 3155 15275
2331 15275 20166 16331 5003 -9109 -19811 -21141 -12014 2574 15227 20039 15508 4083 -9324
2344 -9324 -19103 -20693 -12706 1238 14819 20576 16046 4001 -9297 -18329 -19544 -12062 916 13989
2358 13989 20779 17272 5431 -8716 -17829 -18333 -10688 1899 14128 20731 18255 7195 -7015
2371 -7015 -17085 -18062 -9709 3302 15014 20599 18083 8121 -5549 -15905 -17900 -9857 3539 15744
2385 15744 21112 17844 7660 -4989 -14778 -17217 -10327 2898 15871 21736 18187 7421 -4953
2398 -4953 -14078 -16037 -9804 2355 15132 21955 19204 8575 -4677 -13860 -15223 -8790 2613 14530
2412 14530 21526 20101 10055 -3498 -13460 -15238 -8562 2953 14494 20867 19779 10912 -2033
2425 -2033 -12863 -15821 -9555 2516 14271 20448 18792 10177 -1960 -12312 -16365 -11323 786
2438 786 13208 20202 18124 8969 -3076 -12765 -16592 -12018 -972 11625 19425 18114 8602 -4108
2452 -4108 -13816 -16866 -12019 -1614 10253 18251 18071 9036 -4026 -14638 -17746 -12233 -1434 9933
2466 9933 17309 17237 9274 -3360 -14598 -18703 -13343 -1899 9825 16662 16150 8585 -3423 -14476
2480 -14476 -19196 -14952 -3743 8808 16353 15282 7160 -4216 -14797 -19655 -16070 -5646 7178
2493 7178 15406 15174 6569 -5469 -15711 -19999 -16368 -6538 5495 14170 14947 6809 -5865 -16678
2507 -16678 -20565 -16302 -6444 5110 13205 14172 6859 -5403 -17012 -21320 -17040 -6203 5194 12690
2521 12690 13122 6143 -5376 -16437 -21558 -17886 -7153 5068 12625 12439 5215 -5823 -16168 -21241
2535 -21241 -18256 -8137 4174 12509 12494 5019 -6111 -16029 -20551 -17759 -8573 3038 11935 13317
2549 13317 6198 -5369 -15572 -19973 -16705 -7804 3129 11830 13769 7890 -3298 -14499 -19393
2562 -19393 -16131 -6634 4242 12274 14121 8723 -1728 -12694 -18560 -15987 -6427 5142 13250 14535
2576 14535 8832 -1159 -11507 -17421 -15739 -6771 4992 13964 15339 9366 -1065 -10967 -16383 -14885
2590 -14885 -6761 4694 14221 16461 10444 -379 -10780 -15979 -14061 -6119 4819 14006 16996 12017
2604 12017 1095 -9895 -15685 -13707 -5221 5699 14336 17254 12876 2752 -8435 -15174 -13765
2617 -13765 -5059 6329 14994 17542 12911 3487 -7396 -14609 -14021 -5638 6068 15563 18120 13013
2631 13013 3189 -7312 -13839 -13519 -6021 5643 15612 18762 13584 3001 -7526 -13709 -12812 -5307
2645 -5307 5730 15536 19237 14463 3783 -7327 -13648 -12223 -4278 6611 15714 19085 15007 4763
2659 4763 -6615 -13359 -12202 -3880 7302 16141 18869 14662 5004 -5971 -13042 -12543 -4523 6981
2673 6981 16119 18648 14012 4253 -5912 -12640 -12745 -5511 5589 15176 18432 13595 3695 -6621
2687 -6621 -12668 -12484 -5643 4649 14151 17997 13980 4024 -6839 -13162 -12281 -5363 4632 13551 17383
2702 17383 13867 4601 -6166 -13180 -12483 -5263 4910 13355 16555 13274 4612 -5688 -12917 -12972 -6035
2717 -6035 4438 13166 15958 12296 3740 -5912 -12759 -13422 -7321 2800 11868 15135 11330 2521 -7136
2732 -7136 -13456 -14073 -8492 829 9923 13872 10882 2090 -7941 -14573 -14943 -9581 -508 8033 12573
2747 12573 10371 2100 -8178 -15307 -16117 -10363 -1155 7199 11456 9473 2020 -8024 -15687 -17034
2761 -17034 -11598 -2096 6695 10677 8454 1223 -8350 -15996 -17845 -13086 -3456 5837 10247 7937 342
2776 342 -9286 -16197 -18238 -13662 -4608 4873 10056 7978 -21 -9780 -16721 -18323 -13674 -4824 4414
2791 4414 9695 8501 701 -9269 -16892 -18297 -13294 -4268 4712 9913 9010 2126 -7983 -15987 -18002
2806 -18002 -12992 -3594 5545 10644 9450 2775 -6533 -14716 -17384 -12915 -3322 6476 11692 10458 3506
2821 3506 -5919 -13585 -16296 -12423 -3157 6755 12599 11581 4272 -5574 -13163 -15328 -11359 -2584 7106
2836 7106 13231 12745 5450 -4551 -12586 -14591 -10130 -1258 8118 13843 13477 6834 -3168 -11487 -13859
2851 -13859 -9212 119 9290 14776 14025 7664 -1841 -9992 -12876 -8635 610 10312 15595 14647 7928
2866 7928 -1247 -9059 -11909 -8267 508 10310 16214 15347 8352 -1157 -8750 -11252 -7874 518 9973
2881 9973 16099 15894 9053 -794 -8665 -11162 -7345 814 9907 15764 15715 9579 10 -8290 -11028 -7079
2897 -7079 1254 10160 15548 15362 9534 349 -7858 -11004 -7346 999 10029 15326 14876 8809 97
2912 97 -7649 -10907 -7883 14 9123 14944 14412 8329 -650 -7834 -10941 -8290 -956 7939 14019 14168
2928 14168 7967 -825 -8393 -11413 -8484 -1454 7095 13059 13615 8395 -444 -8573 -11832 -9037 -1678
2943 -1678 6649 12586 13291 8539 139 -8117 -11864 -9507 -2197 6592 12499 13119 8380 324 -7717
2958 -7717 -11965 -10109 -2826 5953 12365 12968 7872 -238 -8004 -12029 -10543 -3872 5065 11682 12682
2973 12682 7624 -973 -8738 -12524 -10875 -4393 4196 10826 12298 7666 -997 -9272 -13157 -11194 -4455
2988 -4455 3897 10180 11865 7544 -493 -9101 -13531 -11794 -4830 3728 10232 11428 7396 -551 -8824
3003 -8824 -13586 -12392 -5557 3474 9976 11346 7020 -923 -9006 -13532 -12683 -6333 2506 9631 11152
3018 11152 6800 -1348 -9273 -13679 -12679 -6527 1968 8961 10886 6863 -1384 -9674 -14207 -12722 -6371
3033 -6371 1811 8573 10562 6814 -1028 -9483 -14230 -12705 -6321 2158 8559 10367 6859 -781 -8753
3048 -8753 -13603 -12630 -6279 2285 8868 10482 6733 -590 -8332 -13086 -12421 -6620 1919 8842 10758
3063 10758 6900 -611 -8246 -12790 -12100 -6708 1297 8370 10670 7232 -244 -8189 -12682 -12037 -6613
3078 -6613 1179 7932 10722 7813 483 -7573 -12463 -11808 -6166 1637 8377 10829 8226 1394 -6553
3093 -6553 -11637 -11487 -5962 2197 8952 11437 8775 2035 -5586 -10613 -10882 -5573 2598 9645 12331
3108 12331 9437 2562 -5024 -10074 -10173 -5153 2589 9738 12891 10192 3193 -4512 -9489 -9542 -4759 3026
3124 3026 9941 13391 11054 4275 -3788 -9075 -9217 -4196 3414 10511 13758 11724 5332 -2650 -8413
3139 -8413 -8871 -3839 4076 11241 14340 12380 6175 -1803 -7533 -8413 -3636 4418 11834 15101 12808
3154 12808 6321 -1424 -7042 -7832 -3508 4162 11721 15315 13073 6326 -1695 -7119 -7745 -3399 4056
3169 4056 11496 15014 13080 6493 -1714 -7269 -7953 -3340 4080 11159 14593 12809 6560 -1445 -7279
3184 -7279 -8216 -3520 4045 11060 14407 12473 6496 -1333 -7221 -8352 -4035 3515 10799 14047 12109
3199 12109 6016 -1619 -7335 -8565 -4744 2477 9861 13451 11671 5279 -2386 -7958 -9174 -5505 1343
3214 1343 8450 12351 10939 4667 -3132 -8920 -10115 -6320 494 7183 10809 9673 3870 -3835 -9686
3229 -9686 -10881 -7131 -430 6240 9782 8609 3194 -4303 -10061 -11728 -8270 -1258 5596 8783 7679
3244 7679 2215 -4802 -10577 -12268 -9143 -2417 4470 8160 7001 1566 -5503 -11047 -12738 -9859 -3477
3259 -3477 3388 7291 6499 1120 -5999 -11707 -13320 -10559 -4313 2398 6522 6112 1152 -5928 -11968
3274 -11968 -13770 -10855 -4696 2141 6210 5880 1307 -5599 -11634 -13853 -10987 -4652 2167 6339 6061
3289 6061 1519 -5156 -11047 -13447 -10929 -4739 2146 6585 6372 1764 -4920 -10618 -12955 -10822 -4720
3304 -4720 2231 6889 6985 2378 -4616 -10544 -12593 -10282 -4587 2362 7089 7365 3159 -3889 -9923 -12397
3320 -12397 -10124 -4008 2720 7424 7967 3971 -2864 -9185 -11688 -9514 -3376 3437 8245 8874 4932
3335 4932 -1601 -7979 -10785 -8919 -2775 4357 9299 9916 5747 -840 -6939 -10109 -8285 -2363 4955
3350 4955 10059 10746 6508 -418 -6570 -9369 -7670 -1958 5139 10416 11179 6899 -148 -6548 -9225
3365 -9225 -7260 -1471 5383 10443 11170 7191 263 -6054 -9025 -7113 -1191 5759 10572 11224 7356
3380 7356 597 -5752 -8698 -6849 -1152 5845 10810 11317 7326 842 -5383 -8516 -6869 -1313 5614
3395 5614 10596 11245 7328 687 -5489 -8571 -7035 -1863 4963 10084 10902 7173 412 -5779 -8943
3410 -8943 -7519 -2275 4360 9299 10247 6716 190 -6078 -9279 -7770 -2549 4003 8748 9792 6495
3425 6495 218 -6075 -9209 -7995 -2672 3725 8579 9599 6068 135 -5712 -9159 -8131 -3056 3356
3440 3356 8297 9282 6034 52 -5920 -8971 -8201 -3667 2859 7767 9151 5965 -23 -6011 -9199
3455 -9199 -8354 -4004 2093 7301 8676 5950 52 -6075 -9542 -8931 -4391 1751 6852 8402 5928
3470 5928 181 -5944 -9723 -9130 -4744 1564 6669 8399 5810 354 -5697 -9582 -9249 -4940 1596
3485 1596 6706 8402 5865 263 -5658 -9446 -9149 -5036 1261 6539 8485 5882 222 -5875 -9621
3500 -9621 -9242 -5279 817 6040 8258 5791 308 -6082 -9856 -9523 -5388 815 5886 7974 5839
3515 5839 383 -5902 -9825 -9777 -5515 668 5927 7903 5882 668 -5489 -9625 -9761 -5832 513 5891
3531 5891 8076 5999 856 -5405 -9407 -9650 -5818 340 5874 8203 6164 717 -5361 -9289 -9583
3546 -9583 -6022 -29 5575 8028 6097 802 -5270 -9448 -9597 -5786 22 5407 7889 6174 1033
3561 1033 -5193 -9339 -9410 -5619 268 5466 7839 6176 1266 -4621 -8787 -9147 -5376 496 5844 8225
3577 8225 6514 1788 -4140 -8093 -8586 -5104 712 6133 8617 6987 2231 -3599 -7513 -8236 -4971
3592 -4971 728 6303 8974 7592 2773 -3036 -7118 -7813 -4747 946 6287 9031 7964 3357 -2600
3607 -2600 -6903 -7440 -4379 1145 6502 9274 8274 3884 -2002 -6375 -7135 -4126 1508 6878 9704
3622 9704 8648 4225 -1383 -5844 -6794 -3945 1630 7130 10032 9024 4583 -956 -5328 -6339 -3684
3637 -3684 1722 7066 10306 9349 5010 -740 -5186 -6204 -3591 1555 6933 10050 9607 5202 -655
3652 -655 -5140 -6280 -3636 1525 7046 10110 9494 5479 -246 -5054 -6422 -3853 1550 6901 10136
3667 10136 9515 5564 -43 -4860 -6385 -3883 1326 7038 10187 9651 5447 -76 -4676 -6207 -4071
3682 -4071 1135 6726 10028 9401 5410 -278 -4995 -6492 -4176 836 6144 9586 9164 5019 -646
3697 -646 -5330 -6991 -4528 280 5731 8918 8487 4634 -942 -5872 -7422 -5214 -150 5193 8286
3712 8286 7985 4197 -1203 -5997 -7846 -5582 -580 4810 8070 7737 3964 -1364 -6124 -7922 -5965
3727 -5965 -1190 4434 7699 7569 3691 -1718 -6327 -8069 -6223 -1565 3905 7373 7191 3494 -1916
3742 -1916 -6623 -8421 -6431 -1891 3441 6793 6712 3390 -2122 -6973 -8630 -6600 -2119 3030 6321
3757 6321 6404 3209 -2106 -6643 -8586 -6811 -2159 2950 6290 6277 3047 -1916 -6443 -8332 -6812 -2329
3773 -2329 2873 6177 6420 3327 -1699 -6152 -8163 -6545 -2488 2690 6319 6479 3485 -1495 -6077
3788 -6077 -8003 -6823 -2530 2490 6023 6693 3772 -1276 -5895 -8005 -6740 -2598 2259 5995 6545
3803 6545 4073 -890 -5689 -7890 -6784 -2596 2403 6131 6676 4088 -531 -5171 -7566 -6624 -2498
3818 -2498 2563 6281 6877 4370 -324 -4762 -7279 -6374 -2509 2559 6495 7256 4600 16 -4634 -7109
3834 -7109 -6305 -2553 2400 6419 7314 4860 50 -4686 -7144 -6428 -2704 2180 6353 7272 4985 179
3850 179 -4613 -7386 -6728 -2893 2173 6141 7233 4914 310 -4666 -7496 -7018 -3130 1967 6111 7219
3866 7219 4867 289 -4722 -7451 -7071 -3275 1743 5934 7048 4788 173 -4810 -7626 -7133 -3472
3881 -3472 1535 5774 6846 4573 -228 -4949 -7711 -7230 -3593 1314 5297 6538 4361 -331 -5200
3896 -5200 -7914 -7318 -3877 1203 5011 6264 4172 -364 -5150 -7934 -7665 -3907 1034 5053 6194
3911 6194 4265 -120 -4895 -7611 -7543 -3902 909 5076 6239 4287 -73 -4865 -7665 -7205 -4139 849
3927 849 4893 6340 4393 -135 -4597 -7634 -7283 -3910 724 4745 6187 4407 216 -4619 -7349
3942 -7349 -7125 -3793 593 4649 6109 4451 369 -4244 -7110 -6940 -3917 783 4683 6207 4678
3957 4678 707 -3775 -6670 -6750 -3634 985 4989 6532 4977 1101 -3298 -6328 -6228 -3455 1002 5079
3973 5079 6823 5410 1526 -2949 -5787 -6073 -3407 1114 5143 7010 5772 2042 -2640 -5690 -5933
3988 -5933 -3177 1117 5147 7157 5843 2225 -2314 -5510 -5843 -3214 1179 5262 7142 5940 2431
4003 2431 -2008 -5286 -5782 -3273 1158 5242 7134 6141 2607 -2057 -5190 -5677 -3415 1091 5216 7233
4019 7233 6176 2507 -1843 -5129 -5582 -3378 810 4962 7171 6170 2485 -1958 -5232 -5730 -3514
4034 -3514 656 4636 6790 5954 2585 -1986 -5431 -6228 -3898 298 4541 6518 5772 2652 -2144 -5532
4050 -5532 -6438 -4271 40 4187 6314 5679 2440 -2033 -5537 -6455 -4455 -130 4091 6358 5568 2407
4066 2407 -2050 -5495 -6412 -4357 -362 3886 6210 5538 2264 -2159 -5553 -6551 -4425 -567 3638 5907
4082 5907 5520 2245 -2156 -5596 -6446 -4506 -626 3536 5814 5240 2298 -2113 -5565 -6566 -4720 -568
4098 -568 3521 5633 5272 2244 -1884 -5384 -6507 -4773 -853 3477 5814 5486 2452 -1742 -5256 -6275
4114 -6275 -4674 -839 3266 5935 5681 2664 -1608 -5086 -6207 -4490 -858 3161 6042 5712 2858
4129 2858 -1292 -4961 -6202 -4537 -890 3213 5721 5744 2919 -1201 -4729 -6151 -4447 -868 3136
4144 3136 5663 5525 2966 -1064 -4708 -5959 -4607 -997 3125 5787 5702 2990 -979 -4459 -5821 -4511
4160 -4511 -1121 3083 5713 5909 3172 -836 -4526 -5868 -4619 -1271 2825 5639 5939 3308 -758
4175 -758 -4491 -5887 -4768 -1241 2686 5590 5689 3244 -635 -4439 -6069 -4888 -1517 2592 5420 5481
4191 5481 3271 -601 -4427 -6080 -5068 -1799 2465 5321 5643 3307 -566 -4206 -6001 -4875 -1642
4206 -1642 2511 5406 5625 3424 -493 -4114 -5637 -4791 -1428 2512 5510 5842 3600 -484 -3953 -5547
4222 -5547 -4723 -1388 2483 5481 5866 3682 -236 -4018 -5645 -4744 -1419 2507 5296 5939 3664 -105
4238 -105 -3800 -5647 -4683 -1473 2597 5338 5925 3618 65 -3550 -5425 -4633 -1457 2603 5406 6084
4254 6084 3898 284 -3495 -5160 -4520 -1481 2497 5395 6112 3978 282 -3280 -5124 -4289 -1404 2375
4270 2375 5276 6050 4071 465 -3246 -5113 -4438 -1675 2240 5115 5765 3910 375 -3203 -5138 -4383
4286 -4383 -1632 2096 4856 5525 3799 403 -3134 -5210 -4733 -2042 1733 4697 5447 3795 432 -3241
4302 -3241 -5140 -4632 -2352 1430 4610 5304 3783 355 -3170 -5273 -4998 -2499 1329 4255 5221 3916
4318 3916 424 -3301 -5258 -5132 -2650 1011 3982 4987 3747 429 -3198 -5551 -5317 -2883 838
4333 838 3795 4945 3541 375 -3168 -5581 -5485 -3118 494 3800 4707 3417 424 -3141 -5454 -5545
4349 -5545 -3198 619 3698 4870 3528 412 -3128 -5379 -5456 -3184 461 3644 5004 3982 687
4364 687 -2917 -5232 -5207 -3132 471 3753 5218 3975 880 -2846 -5328 -5307 -3156 481 3907 5160
4380 5160 4153 1092 -2580 -5183 -5263 -3130 720 3967 5327 4367 1267 -2378 -4809 -5108 -2911 859
4396 859 4101 5507 4402 1356 -2287 -4564 -4813 -2751 881 4374 5843 4689 1716 -1905 -4396
4411 -4396 -4605 -2473 960 4385 5762 4891 1860 -1812 -4285 -4408 -2399 1118 4352 5803 5009 2136
4427 2136 -1590 -4090 -4440 -2323 1125 4384 5821 4830 2196 -1470 -3899 -4244 -2473 1024 4507 6005
4443 6005 4975 2275 -1222 -3660 -4097 -2389 1077 4356 5866 5165 2309 -1195 -3634 -4146 -2206 1092
4459 1092 4256 5878 5281 2347 -1008 -3647 -4096 -2135 880 4168 5567 5018 2433 -1141 -3696 -4331
4475 -4331 -2443 827 3838 5361 4760 2284 -1108 -3576 -4287 -2663 580 3605 5178 4582 2075 -1231
4491 -1231 -3898 -4396 -2867 70 3433 5066 4593 2069 -1240 -3889 -4518 -3029 -139 3011 4906 4417
4507 4417 2011 -1491 -4156 -4862 -3372 -464 2809 4638 4294 1928 -1431 -4328 -4975 -3715 -685 2460
4523 2460 4319 4018 1722 -1570 -4407 -5242 -3956 -864 2287 4174 3878 1632 -1709 -4243 -5329 -4123
4539 -4123 -1074 2185 4082 3689 1437 -1760 -4420 -5343 -4149 -1274 1965 3958 3816 1617 -1671 -4410
4555 -4410 -5322 -4127 -1341 1883 3895 3955 1715 -1527 -4283 -5382 -4157 -1303 1916 3880 3902 1765
4571 1765 -1320 -4279 -5416 -4177 -1289 1856 3813 3980 1886 -1346 -4095 -5195 -4168 -1360 1774
4586 1774 3897 3938 1899 -1189 -3955 -5093 -4057 -1364 2002 4063 4247 2185 -1125 -3887 -4768 -3960
4602 -3960 -1192 1893 3969 4274 2224 -1026 -3771 -4807 -3769 -1157 2029 4004 4235 2411 -897
4617 -897 -3693 -4795 -3886 -1245 1879 3958 4144 2394 -709 -3651 -4875 -4087 -1332 1829 3917 4102
4633 4102 2264 -878 -3515 -4760 -3895 -1456 1813 3962 4060 2197 -707 -3453 -4804 -3928 -1554 1471
4649 1471 3858 4146 2442 -684 -3534 -4865 -4047 -1650 1506 3523 3821 2278 -698 -3481 -4871 -4154
4665 -4154 -1781 1164 3326 3695 2100 -630 -3522 -4961 -4340 -1876 1140 3411 3591 2115 -704 -3428
4681 -3428 -4899 -4412 -2251 1035 3263 3712 2278 -562 -3366 -4936 -4410 -2264 891 3239 3915 2315
4697 2315 -559 -3424 -4869 -4324 -2120 1034 3230 3873 2411 -315 -3136 -4740 -4333 -2018 1026 3481
4713 3481 3904 2613 -88 -3113 -4645 -4224 -2038 1156 3489 4191 2656 -76 -2846 -4433 -4179 -2023
4729 -2023 1087 3621 4273 2935 60 -2648 -4225 -3827 -1792 1177 3690 4484 3213 381 -2385 -3908
4745 -3908 -3682 -1510 1369 3825 4680 3393 571 -2275 -3859 -3606 -1457 1523 3939 4609 3522 814
4761 814 -1943 -3683 -3523 -1378 1601 3920 4665 3547 1023 -1833 -3543 -3294 -1281 1694 4019 4831
4777 4831 3749 1195 -1747 -3436 -3274 -1247 1615 4100 4890 3897 1205 -1621 -3372 -3106 -1222 1573
4793 1573 4102 4941 3975 1381 -1422 -3191 -2972 -1036 1493 3867 4729 3814 1517 -1311 -3065 -3090 -1279
4810 -1279 1431 3760 4652 3787 1365 -1412 -3167 -3163 -1625 1199 3669 4564 3673 1292 -1474 -3138 -3422
4827 -3422 -1630 970 3412 4507 3508 1422 -1430 -3331 -3482 -1830 623 3349 4376 3442 1267 -1449
4843 -1449 -3489 -3563 -1993 781 3030 4174 3469 1266 -1600 -3578 -3819 -2118 458 2935 3990 3365
4859 3365 1093 -1696 -3437 -3930 -2279 255 2715 3856 3217 956 -1699 -3711 -4078 -2734 106 2630
4875 2630 3731 3054 1056 -1716 -3772 -4090 -2707 -119 2533 3839 3198 841 -1730 -3837 -4174 -2718
4891 -2718 -171 2470 3714 3088 1068 -1744 -3869 -4252 -2765 -212 2250 3656 3019 1152 -1763 -3905
4907 -3905 -4303 -3083 -384 2333 3538 3016 909 -1772 -3838 -4288 -3038 -408 2235 3417 3016 942
4923 942 -1760 -3765 -4278 -3099 -506 2127 3434 3082 947 -1710 -3746 -4303 -3062 -463 1995 3527
4939 3527 3088 1173 -1583 -3638 -4128 -2924 -433 1991 3447 3211 1255 -1394 -3549 -4067 -2792 -363
4955 -363 2048 3608 3154 1293 -1282 -3532 -4089 -2975 -508 2123 3551 3127 1392 -1271 -3324 -4028
4971 -4028 -2943 -451 2050 3622 3427 1369 -1240 -3223 -3919 -2863 -557 1951 3747 3395 1682 -941
4987 -941 -3130 -3715 -2572 -294 2189 3619 3398 1930 -863 -3024 -3587 -2474 -247 2247 3707 3547
5003 3547 1895 -588 -2669 -3565 -2439 -141 2337 3905 3771 1973 -392 -2527 -3246 -2308 -42 2355
5019 2355 3940 3871 2228 -284 -2347 -3035 -2230 -129 2498 4041 4078 2527 -4 -2178 -2940 -2084 125
5036 125 2556 4187 4166 2744 263 -1860 -2883 -2028 211 2591 4245 4338 2956 411 -1767 -2688 -1891
5053 -1891 180 2643 4285 4510 2899 541 -1488 -2433 -1951 69 2685 4382 4355 2898 526 -1651
5069 -1651 -2430 -1839 152 2521 4251 4434 3168 535 -1565 -2586 -1981 32 2436 4198 4323 3043
5085 3043 613 -1679 -2730 -2030 -229 2251 4117 4086 3063 585 -1729 -2973 -2470 -367 2173 3774
5101 3774 4073 2630 341 -1991 -3148 -2668 -640 1780 3506 3885 2578 282 -2143 -3213 -2813 -861
5117 -861 1461 3377 3663 2421 -64 -2363 -3463 -2977 -1097 1144 3083 3356 2113 -128 -2524 -3629
5133 -3629 -3083 -1309 967 2836 3125 1847 -345 -2684 -3803 -3511 -1670 755 2364 2932 1646 -580
5149 -580 -2820 -4003 -3750 -1957 431 2372 2753 1424 -694 -2995 -4206 -4000 -2141 108 1969 2479
5165 2479 1265 -774 -3149 -4273 -4132 -2538 -23 1764 2387 1262 -940 -3212 -4372 -4144 -2454 -159
5181 -159 1721 2269 1240 -718 -3246 -4458 -4144 -2545 -185 1550 2175 1297 -785 -3124 -4360 -4195
5197 -4195 -2610 -281 1656 2156 1340 -811 -2911 -4341 -4312 -2595 -362 1629 2264 1411 -773 -2718
5213 -2718 -4168 -4164 -2611 -246 1661 2365 1567 -528 -2735 -4048 -4015 -2470 -68 1820 2591 1810 -221
5230 -221 -2473 -3907 -3718 -2079 -55 1996 2793 2052 57 -2266 -3672 -3673 -2169 242 2237 2818 2126
5247 2126 329 -1978 -3446 -3332 -1909 215 2369 2995 2425 440 -1842 -3216 -3285 -1968 353 2431
5263 2431 3301 2484 550 -1580 -3018 -3093 -1755 450 2483 3392 2597 741 -1368 -2909 -2979 -1591 576
5280 576 2534 3356 2856 917 -1313 -3038 -2972 -1561 633 2622 3422 2730 908 -1201 -2849 -3102 -1715
5297 -1715 563 2494 3311 2780 913 -1133 -2750 -2914 -1773 460 2307 3325 2623 957 -1298 -2722
5313 -2722 -2900 -1733 342 2191 3176 2685 1090 -1251 -2782 -3099 -1816 326 2255 3008 2666 1013
5329 1013 -1162 -2814 -3067 -1795 228 2160 3045 2634 973 -1062 -2664 -3135 -2003 93 1986 3055
5345 3055 2768 1000 -1114 -2560 -3135 -1975 32 2047 3051 2758 1024 -992 -2569 -3030 -1955 -91
5361 -91 2117 3225 2905 1238 -880 -2545 -2962 -2031 227 2121 3185 3074 1415 -728 -2295 -2852 -1714
5378 -1714 131 2242 3341 2932 1581 -540 -2138 -2729 -1589 355 2344 3497 3291 1633 -476 -2092
5394 -2092 -2627 -1590 244 2491 3551 3330 1726 -254 -1901 -2369 -1767 357 2360 3520 3488 1731
5410 1731 -210 -1962 -2409 -1554 504 2399 3597 3467 2137 -58 -1874 -2470 -1602 401 2423 3663
5426 3663 3430 2054 -89 -1894 -2364 -1655 333 2382 3570 3514 2038 28 -1839 -2517 -1633 191 2200
5443 2200 3436 3356 1887 -141 -2066 -2538 -1870 69 2026 3425 3142 1912 -265 -1965 -2665 -1857 -102
5460 -102 1801 3025 3129 1696 -387 -2132 -2802 -2106 -214 1864 3086 2973 1666 -376 -2170 -2942
5476 -2942 -2216 -354 1623 2908 2808 1421 -438 -2305 -3092 -2376 -625 1414 2801 2680 1307 -539
5492 -539 -2211 -3109 -2417 -726 1189 2613 2676 1426 -575 -2505 -3262 -2486 -863 1122 2516 2483 1169
5509 1169 -649 -2472 -3267 -2631 -994 902 2203 2516 1354 -605 -2314 -3321 -2747 -1016 990 2234
5525 2234 2372 1305 -479 -2465 -3250 -2707 -1129 925 2208 2324 1272 -564 -2403 -3181 -2707 -1151
5541 -1151 935 2209 2363 1435 -549 -2277 -3161 -2861 -1103 771 2224 2481 1345 -530 -2276 -3203
5557 -3203 -2781 -1190 843 2302 2410 1444 -515 -2140 -3225 -2635 -1194 696 2109 2437 1392 -370
5573 -370 -2098 -3136 -2687 -1150 705 2181 2592 1568 -255 -2108 -3120 -2671 -1200 763 2133 2541
5589 2541 1483 -164 -1956 -2966 -2574 -1244 818 2322 2619 1704 -22 -1975 -2878 -2686 -1141 853
5605 853 2283 2854 1785 -77 -1877 -2794 -2649 -1042 849 2325 2874 1982 239 -1688 -2781 -2443 -1052
5622 -1052 973 2398 2720 1977 297 -1658 -2649 -2466 -995 957 2537 2982 1949 312 -1483 -2621
5638 -2621 -2257 -907 990 2419 2885 2142 442 -1209 -2459 -2251 -834 1102 2640 2967 2228 603
5654 603 -1211 -2245 -2023 -787 1076 2424 2904 2381 674 -1112 -2314 -2127 -700 1063 2641 3220
5670 3220 2401 809 -1105 -2060 -2005 -791 1185 2658 3130 2413 804 -1030 -2076 -2019 -636 1125 2665
5687 2665 3164 2474 804 -1038 -1985 -2013 -647 1055 2465 3292 2503 822 -992 -1986 -2016 -789 863
5704 863 2426 3034 2390 907 -997 -2081 -1991 -919 888 2379 3054 2498 948 -855 -1998 -2139 -1076
5721 -1076 830 2317 2977 2427 835 -995 -2151 -2207 -1135 494 2298 2927 2331 697 -1003 -2300
5737 -2300 -2486 -1209 429 1977 2722 2248 635 -1135 -2305 -2509 -1523 315 1955 2606 2028 636 -1247
5754 -1247 -2556 -2633 -1706 76 1796 2453 1915 536 -1273 -2551 -2732 -1707 -3 1557 2356 1885 452
5771 452 -1367 -2546 -2854 -1873 -242 1473 2143 1731 458 -1354 -2619 -2843 -1968 -362 1471 2116 1850
5788 1850 350 -1435 -2919 -2916 -1895 -417 1287 2080 1671 269 -1445 -2854 -3026 -2022 -426 1215
5804 1215 1889 1717 321 -1364 -2851 -3089 -2151 -418 1198 2036 1676 263 -1432 -2705 -3005 -2091 -405
5821 -405 1155 1940 1677 276 -1418 -2616 -3022 -2178 -519 1238 2145 1825 399 -1402 -2652 -2889 -2003
5838 -2003 -473 1081 2061 1786 506 -1187 -2432 -2759 -1921 -359 1232 2108 1947 564 -1178 -2365
5854 -2365 -2893 -2001 -347 1214 2097 1901 774 -865 -2126 -2576 -1883 -252 1361 2374 2073 819 -703
5871 -703 -2072 -2571 -1888 -304 1330 2360 2215 1059 -701 -2092 -2461 -1762 -336 1404 2322 2234 1118
5888 1118 -700 -1913 -2376 -1744 -253 1381 2475 2537 1143 -434 -1900 -2287 -1652 -26 1452 2566
5904 2566 2420 1236 -228 -1756 -2318 -1508 -77 1537 2493 2547 1440 -257 -1709 -2168 -1596 -272 1441
5921 1441 2478 2505 1399 -203 -1593 -2160 -1564 -130 1460 2573 2532 1467 -176 -1533 -2101 -1540 -256
5938 -256 1424 2467 2545 1458 -217 -1672 -2326 -1617 -181 1424 2557 2374 1416 -170 -1515 -2232 -1643
5955 -1643 -178 1230 2387 2497 1514 -181 -1638 -2143 -1671 -245 1312 2320 2545 1451 -37 -1623
5971 -1623 -2226 -1610 -413 1239 2375 2445 1357 -331 -1595 -2202 -1717 -394 1129 2392 2354 1425 -143
5988 -143 -1611 -2272 -1866 -506 1098 2251 2291 1479 -210 -1646 -2310 -1921 -496 1144 2237 2174 1471 -289
6006 -289 -1731 -2365 -1898 -557 1145 2184 2208 1369 -134 -1586 -2243 -1901 -823 924 2098 2035 1401 -154
6024 -154 -1638 -2301 -1967 -762 911 2098 2169 1384 -279 -1726 -2387 -1952 -782 724 1798 2115 1226
6041 1226 -296 -1739 -2404 -1999 -816 614 1690 2047 1230 -296 -1611 -2475 -2236 -1086 472 1746
6057 1746 1984 1121 -362 -1746 -2498 -2293 -1112 375 1565 1944 1122 -349 -1780 -2565 -2319 -1173 368
6074 368 1664 1984 1267 -303 -1785 -2554 -2321 -1310 328 1494 1885 1076 -278 -1750 -2540 -2357 -1273
6091 -1273 273 1564 1783 1120 -206 -1690 -2546 -2332 -1303 315 1531 1939 1272 -134 -1679 -2565 -2316
6108 -2316 -1079 252 1564 1946 1220 -143 -1545 -2272 -2226 -1187 318 1551 2006 1443 65 -1531 -2434
6125 -2434 -2167 -1060 441 1721 2066 1479 247 -1380 -2208 -2131 -928 587 1779 2234 1605 229 -1084
6142 -1084 -2122 -2004 -947 594 1869 2367 1648 364 -1098 -1893 -1809 -946 666 2047 2444 1908 547
6159 547 -778 -1603 -1760 -861 629 2000 2497 2112 710 -703 -1622 -1549 -618 855 2152 2614 2085 878
6177 878 -650 -1621 -1626 -647 792 2183 2564 2121 952 -384 -1480 -1541 -693 821 2145 2749 2213 963
6195 963 -439 -1346 -1563 -522 791 2075 2719 2250 1104 -444 -1378 -1416 -738 808 2105 2603 2209 1010
6213 1010 -364 -1466 -1522 -686 653 2068 2624 2066 946 -467 -1414 -1614 -798 715 1957 2520 2107
6230 2107 981 -452 -1528 -1715 -1039 538 1808 2337 2004 855 -558 -1618 -1876 -946 380 1656
6246 1656 2201 1902 852 -700 -1685 -1951 -1204 276 1593 2227 1890 736 -752 -1835 -1905 -1288 269
6263 269 1485 2303 1968 774 -797 -1830 -2157 -1256 43 1283 2100 1750 734 -812 -1913 -2140 -1385
6280 -1385 94 1268 2003 1657 738 -754 -1956 -2071 -1335 -91 1291 1915 1614 684 -819 -1732 -2163
6297 -2163 -1483 -15 1131 1956 1754 566 -691 -1897 -2056 -1426 -102 1060 1885 1717 672 -809 -1977
6314 -1977 -2186 -1506 -170 1150 1916 1680 534 -673 -1844 -2136 -1525 -325 1087 1847 1656 760 -651
6331 -651 -1792 -2239 -1500 -239 1238 1878 1740 811 -738 -1732 -2129 -1631 -328 1080 1959 1779 733 -523
6349 -523 -1680 -2105 -1511 -392 927 1893 1794 738 -487 -1706 -1978 -1567 -317 1055 1779 1874 913 -552
6367 -552 -1725 -2030 -1449 -342 984 1864 1836 974 -569 -1690 -2127 -1661 -328 1027 1790 1726 843 -519
6385 -519 -1651 -2110 -1634 -346 832 1931 1742 739 -528 -1608 -2075 -1667 -498 784 1680 1689 780 -496
6403 -496 -1715 -2227 -1682 -602 803 1631 1656 798 -604 -1679 -2182 -1728 -641 743 1565 1733 825 -473
6421 -473 -1678 -2253 -1888 -692 676 1473 1569 678 -571 -1696 -2239 -1882 -804 598 1538 1511 728 -491
6439 -491 -1746 -2303 -1907 -861 566 1382 1588 738 -526 -1749 -2258 -1896 -923 347 1462 1539 805 -487
6457 -487 -1784 -2194 -2004 -872 395 1485 1713 781 -487 -1734 -2313 -1911 -879 576 1377 1609 759
6474 759 -513 -1606 -2314 -1974 -843 521 1494 1585 872 -360 -1601 -2245 -1852 -667 592 1603 1822
6491 1822 1064 -246 -1488 -1968 -1872 -772 620 1560 1807 1141 -173 -1344 -2000 -1666 -601 658 1803
6508 1803 1904 1181 115 -1224 -1939 -1653 -485 770 1741 1965 1319 125 -1194 -1880 -1534 -577 735
6525 735 1711 2063 1389 239 -1062 -1628 -1470 -581 770 1962 2138 1527 247 -895 -1528 -1459 -500 811
6543 811 1765 2186 1548 240 -882 -1572 -1391 -321 835 1821 2259 1670 438 -808 -1389 -1389 -337 866
6561 866 1906 2330 1696 553 -820 -1392 -1243 -417 906 1960 2138 1658 579 -735 -1342 -1399 -499 680
6579 680 1781 2163 1696 490 -709 -1418 -1398 -421 822 1882 2181 1615 518 -722 -1482 -1236 -465 586
6597 586 1832 2016 1780 482 -821 -1542 -1521 -659 594 1613 2091 1613 487 -814 -1582 -1623 -740 401
6615 401 1470 1959 1553 373 -850 -1689 -1843 -939 436 1450 1806 1567 365 -873 -1807 -1635 -899 229
6633 229 1471 1773 1358 209 -930 -1652 -1827 -990 149 1273 1702 1383 160 -994 -1861 -1912 -1045 -30
6651 -30 1221 1701 1326 200 -1058 -1860 -1879 -1116 -31 1117 1539 1164 239 -1076 -1914 -1958 -1307 -104 1060
6670 1060 1447 1118 190 -1176 -1910 -1961 -1207 -141 993 1474 1269 149 -1218 -1865 -2080 -1417 -240 939
6688 939 1427 1178 89 -1095 -2005 -2074 -1424 -324 843 1392 1230 119 -974 -2000 -2105 -1479 -299 862
6706 862 1332 1218 209 -1027 -1854 -2219 -1433 -412 735 1336 1247 237 -1038 -1993 -2117 -1551 -413 754
6724 754 1526 1159 255 -934 -1999 -2046 -1448 -375 851 1415 1239 275 -921 -1832 -2041 -1358 -354 899
6742 899 1494 1321 458 -810 -1621 -1960 -1355 -214 867 1521 1515 558 -601 -1530 -1811 -1302 -230 1004 1571
6761 1571 1591 753 -490 -1340 -1682 -1232 -160 1082 1839 1641 919 -227 -1290 -1590 -1137 113 1158 2015
6779 2015 1765 947 -152 -1110 -1400 -779 102 1439 2207 2078 1163 80 -909 -1325 -707 326 1502 2285
6797 2285 2306 1428 258 -700 -1127 -579 519 1598 2418 2408 1560 305 -583 -952 -659 551 1707 2492
6815 2492 2352 1686 463 -406 -766 -451 596 1823 2541 2578 1792 518 -449 -898 -363 532 1560 2446
6833 2446 2619 1736 516 -456 -927 -461 506 1689 2407 2469 1693 479 -497 -975 -657 492 1611 2218
6851 2218 2315 1582 550 -590 -1021 -773 399 1420 2087 2076 1588 338 -759 -1276 -953 94 1150 1913
6869 1913 2042 1198 8 -989 -1443 -1002 -100 1078 1653 1827 1161 -64 -1066 -1582 -1285 -381 694 1561
6887 1561 1589 884 -288 -1311 -1796 -1517 -563 502 1340 1320 805 -398 -1403 -1982 -1756 -794 264 1007
6905 1007 1217 544 -572 -1510 -2010 -2049 -1148 155 935 1028 327 -692 -1846 -2306 -2123 -1241 -47 701 965
6924 965 319 -676 -1812 -2366 -2140 -1302 -284 683 910 343 -719 -1874 -2400 -2155 -1309 -255 612 801
6942 801 262 -660 -1837 -2450 -2271 -1539 -298 575 690 288 -758 -1740 -2369 -2354 -1526 -313 634 873 267
6961 267 -742 -1766 -2360 -2119 -1296 -262 514 932 435 -520 -1779 -2277 -2072 -1285 -193 695 1111 550
6979 550 -523 -1591 -2070 -2069 -1272 -124 850 1120 698 -355 -1423 -1914 -1820 -1065 -13 958 1334 731 -219
6998 -219 -1170 -1813 -1871 -987 234 1035 1322 871 42 -1012 -1626 -1529 -800 301 1227 1497 1159 182 -870
7017 -870 -1491 -1480 -666 437 1362 1763 1327 408 -677 -1212 -1372 -665 394 1481 1898 1558 592 -488 -1127
7036 -1127 -1132 -303 597 1713 2010 1599 746 -324 -972 -1018 -247 760 1574 2115 1819 876 -228 -885 -1027
7055 -1027 -255 837 1781 2267 1758 949 -210 -801 -927 -234 764 1879 2281 1984 995 31 -834 -809 -247
7074 -247 773 1824 2235 1916 1128 -12 -776 -795 -120 639 1634 2200 2001 1090 42 -758 -976 -292 717
7093 717 1574 2090 1793 882 -2 -796 -1040 -434 629 1639 2153 1697 841 -172 -903 -1108 -495 514 1406
7112 1406 1883 1696 749 -354 -1112 -1200 -773 392 1347 1784 1499 692 -357 -1243 -1251 -876 306 1183 1729
7131 1729 1343 453 -525 -1260 -1333 -922 -101 967 1433 1280 453 -536 -1402 -1535 -1106 85 767 1327 1094
7150 1094 270 -799 -1638 -1677 -1203 -206 703 1079 1015 285 -801 -1487 -1690 -1329 -423 503 1116 998 225 -788
7170 -788 -1729 -1886 -1405 -437 589 1113 1006 138 -826 -1722 -2045 -1516 -559 465 966 883 110 -927 -1829
7189 -1829 -1959 -1660 -600 353 923 906 116 -767 -1750 -2039 -1630 -605 277 896 743 -10 -827 -1829 -1987
7208 -1987 -1594 -746 292 921 840 16 -858 -1592 -2006 -1594 -793 264 1046 867 342 -729 -1543 -1878 -1580
7227 -1580 -594 391 856 934 393 -699 -1544 -1824 -1452 -516 434 967 1029 440 -627 -1437 -1748 -1455 -554 447
7247 447 1140 1256 495 -517 -1326 -1762 -1363 -480 625 1175 1241 589 -364 -1203 -1604 -1334 -410 615 1399
7266 1399 1295 706 -224 -1051 -1432 -1188 -253 769 1311 1388 695 -95 -1028 -1397 -1127 -273 650 1395 1511 829
7286 829 -28 -901 -1268 -932 -79 727 1545 1478 977 19 -903 -1303 -1006 -240 606 1480 1501 1039 -15 -892
7306 -892 -1216 -929 -215 827 1425 1370 1194 47 -702 -1283 -989 -179 609 1352 1545 1183 198 -815 -1167
7325 -1167 -907 -191 763 1490 1429 1025 11 -854 -1272 -940 -288 641 1426 1455 1061 53 -746 -1238 -1069 -245
7345 -245 612 1393 1484 989 12 -938 -1304 -1181 -486 578 1265 1457 1018 2 -830 -1320 -1125 -391 440 1019
7365 1019 1362 973 54 -772 -1324 -1279 -546 451 1174 1265 963 91 -809 -1301 -1150 -625 503 1096 1402 843
$$ [...]
8191g86
##END NTUPLES=NMR FID
##END=
