##TITLE=1H_DB 1712
 CDCl3, 8 sc, 
 14.1.2019
##JCAMPDX= 6.0         $$ Bruker NMR JCAMP-DX V2.0
##DATA TYPE= NMR FID
##DATA CLASS= NTUPLES
##ORIGIN= UXNMR, Bruker Analytische Messtechnik GmbH
##OWNER= root
$$ XWIN-NMR		Version 3.5
$$ Mon Jan 14 16:41:34 2019 Russian Standard Time (UT+4h)  she@DPX200
##.OBSERVE FREQUENCY= 200.1313
##.OBSERVE NUCLEUS= ^1H
##.DELAY= (6, 6)
##.ACQUISITION MODE= SIMULTANEOUS
##.ACQUISITION SCHEME= undefined
##.AVERAGES= 8
##.DIGITISER RES= 18
##SPECTROMETER/DATA SYSTEM= spect
##.PULSE SEQUENCE= zg30
##.SOLVENT NAME= CDCl3
##.SHIFT REFERENCE= (INTERNAL, CDCl3, 0, 15.7039)
##AUDIT TRAIL= $$ (NUMBER, WHEN, WHO, WHERE, WHAT)
$$ ##TITLE= Audit trail, XWIN-NMR		Version 3.5
$$ ##JCAMPDX= 5.01
$$ ##ORIGIN= Bruker BioSpin GmbH
$$ ##OWNER= she
$$ F:/spectra/data/she/nmr/H-F/1/audita.txt
$$ ##AUDIT TRAIL=  $$ (NUMBER, WHEN, WHO, WHERE, WHAT)
(   1,<2019-01-14 16:40:39.26 +0400>,<she>,<DPX200>,
      <created by zg, POWCHK disabled, PULCHK disabled
       configuration hash MD5:
       00 E9 B6 7A A2 85 ED C7 34 08 36 98 17 FE 4E 26
       data hash MD5: 16K
       EA 5B 9D 6B 2C B2 BE D5 17 A0 0D 85 40 CB 85 34>)
$$ ##END=
$$ 
$$ hash MD5
$$ 13 BF 34 D5 1F 90 3D DE C5 50 91 33 57 E5 7C 03
##$RELAX= 
##$RELAX= 
##$RELAX= 
##$RELAX= 
##$RELAX= 
##$RELAX= 
$$ Bruker specific parameters
$$ --------------------------
##$DU= <F:/spectra>
##$EXPNO= 1
##$NAME= <H-F>
##$PROCNO= 1
##$TYPE= <nmr>
##$USER= <she>
##$AMP= (0..31)
100 100 100 100 100 100 100 100 100 100 100 100 100 100 100 100 100 100 
100 100 100 100 100 100 100 100 100 100 100 100 100 100 
##$AQSEQ= 0
##$AQ_mod= 1
##$AUNM= <au_zg>
##$AUTOPOS= <>
##$BF1= 200.13
##$BF2= 200.13
##$BF3= 200.13
##$BF4= 200.13
##$BF5= 200.13
##$BF6= 200.13
##$BF7= 200.13
##$BF8= 200.13
##$BYTORDA= 1
##$CFDGTYP= 0
##$CFRGTYP= 5
##$CHEMSTR= <none>
##$CNST= (0..31)
1 1 145 1 1 1 1 1 1 1 1 1 1 1 1 1 1 1 1 1 1 1 1 1 1 1 1 1 1 1 1 1 
##$CPDPRG= <>
##$CPDPRG1= <>
##$CPDPRG2= <>
##$CPDPRG3= <>
##$CPDPRG4= <mlev>
##$CPDPRG5= <mlev>
##$CPDPRG6= <mlev>
##$CPDPRG7= <mlev>
##$CPDPRG8= <mlev>
##$CPDPRGB= <>
##$CPDPRGT= <>
##$D= (0..31)
0 1.2 0 0 0 0 0 0 0 0 0 0.03 0 0 0 0 0 0 0 0 0 0 0 0 0 0 0 0 0 0 0 0 
##$DATE= 1547469638
##$DBL= (0..7)
120 120 120 120 120 120 120 120 
##$DBP= (0..7)
150 150 150 150 150 150 150 150 
##$DBP07= 0
##$DBPNAM0= <>
##$DBPNAM1= <>
##$DBPNAM2= <>
##$DBPNAM3= <>
##$DBPNAM4= <>
##$DBPNAM5= <>
##$DBPNAM6= <>
##$DBPNAM7= <>
##$DBPOAL= (0..7)
0.5 0.5 0.5 0.5 0.5 0.5 0.5 0.5 
##$DBPOFFS= (0..7)
0 0 0 0 0 0 0 0 
##$DE= 6
##$DECBNUC= <off>
##$DECIM= 24
##$DECNUC= <off>
##$DECSTAT= 4
##$DIGMOD= 1
##$DIGTYP= 9
##$DL= (0..7)
0 120 120 120 120 120 120 120 
##$DP= (0..7)
150 150 150 150 150 150 150 150 
##$DP07= 0
##$DPNAME0= <>
##$DPNAME1= <>
##$DPNAME2= <>
##$DPNAME3= <>
##$DPNAME4= <>
##$DPNAME5= <>
##$DPNAME6= <>
##$DPNAME7= <>
##$DPOAL= (0..7)
0.5 0.5 0.5 0.5 0.5 0.5 0.5 0.5 
##$DPOFFS= (0..7)
0 0 0 0 0 0 0 0 
##$DQDMODE= 0
##$DR= 18
##$DS= 0
##$DSLIST= <SSSSSSSSSSSSSSS>
##$DSPFIRM= 0
$$ [...]
##$SUBNAM2= <"">
##$SUBNAM3= <"">
##$SUBNAM4= <"">
##$SUBNAM5= <"">
##$SUBNAM6= <"">
##$SUBNAM7= <"">
##$SUBNAM8= <"">
##$SUBNAM9= <"">
##$SW= 24.933730806125
##$SWIBOX= (0..15)
0 0 2 0 0 0 0 0 0 0 0 0 0 0 0 0 
##$SW_h= 4990.01996007984
##$TD= 16384
##$TD0= 1
##$TE= 0
##$TE2= 300
##$TE3= 300
##$TEG= 300
##$TL= (0..7)
0 120 120 120 120 120 120 120 
##$TP= (0..7)
150 150 150 150 150 150 150 150 
##$TP07= 0
##$TPNAME0= <>
##$TPNAME1= <>
##$TPNAME2= <>
##$TPNAME3= <>
##$TPNAME4= <>
##$TPNAME5= <>
##$TPNAME6= <>
##$TPNAME7= <>
##$TPOAL= (0..7)
0.5 0.5 0.5 0.5 0.5 0.5 0.5 0.5 
##$TPOFFS= (0..7)
0 0 0 0 0 0 0 0 
##$TUNHIN= 0
##$TUNHOUT= 0
##$TUNXOUT= 0
##$USERA1= <user>
##$USERA2= <user>
##$USERA3= <user>
##$USERA4= <user>
##$USERA5= <user>
##$V9= 5
##$VALIST= <valist>
##$VCLIST= <CCCCCCCCCCCCCCC>
##$VD= 0
##$VDLIST= <DDDDDDDDDDDDDDD>
##$VPLIST= <PPPPPPPPPPPPPPP>
##$VTLIST= <TTTTTTTTTTTTTTT>
##$WBST= 1024
##$WBSW= 4
##$XGAIN= (0..3)
0 0 0 0 
##$XL= 0
##$YL= 0
##$YMAX_a= 59945
##$YMIN_a= -75691
##$ZGOPTNS= <>
##$ZL1= 120
##$ZL2= 120
##$ZL3= 120
##$ZL4= 120
##$ABSF1= 10
##$ABSF2= 0
##$ABSG= 5
##$ABSL= 3
##$ALPHA= 0
##$AQORDER= 0
##$ASSFAC= 0
##$ASSFACI= 0
##$ASSFACX= 0
##$ASSWID= 0
##$AUNMP= <proc_1d>
##$AZFE= 0.1
##$AZFW= 0.1
##$BCFW= 1
##$BC_mod= 2
##$BYTORDP= 1
##$COROFFS= 0
##$CY= 11.3945322036743
##$DATMOD= 1
##$DC= 2
##$DFILT= <>
##$DTYPP= 0
##$F1P= 18.9103706918063
##$F2P= -1.10871071338519
##$FCOR= 0.5
##$FTSIZE= 0
##$FT_mod= 4
##$GAMMA= 1
##$GB= 0.15
##$INTBC= 1
##$INTSCL= 1
##$ISEN= 128
##$LB= 0.24
##$LEV0= 0
##$LPBIN= 0
##$MAXI= 10000
##$MC2= 0
##$MEAN= 0
##$ME_mod= 0
##$MI= 1.114404
##$NCOEF= 0
##$NC_proc= 0
##$NLEV= 6
##$NOISF1= 3.799351
##$NOISF2= 2.8
##$NSP= 1
##$NTH_PI= 0
##$NZP= 0
##$OFFSET= 15.70392
##$PC= 1
##$PHC0= -8950.797
##$PHC1= 12.40006
##$PH_mod= 1
##$PKNL= yes
##$PPARMOD= 0
##$PSCAL= 0
##$PSIGN= 0
##$REVERSE= no
##$SF= 200.130013532006
##$SI= 16384
##$SIGF1= 3
##$SIGF2= 2
##$SINO= 400
##$SIOLD= 16384
##$SREGLST= <1H.CDCl3>
##$SSB= 0
##$STSI= 0
##$STSR= 0
##$SW_p= 3612.71676300578
##$SYMM= 0
##$S_DEV= 0
##$TDeff= 0
##$TDoff= 0
##$TI= <>
##$TILT= no
##$TM1= 0
##$TM2= 0
##$TOPLEV= 0
##$USERP1= <user>
##$USERP2= <user>
##$USERP3= <user>
##$USERP4= <user>
##$USERP5= <user>
##$WDW= 1
##$XDIM= 8192
##$YMAX_p= 0
##$YMIN_p= 0
$$ End of Bruker specific parameters
$$ ---------------------------------
##NTUPLES= NMR FID
##VAR_NAME=  TIME,          FID/REAL,        FID/IMAG
##SYMBOL=    X,             R,               I
##VAR_TYPE=  INDEPENDENT,   DEPENDENT,       DEPENDENT
##VAR_FORM=  AFFN,          ASDF,            ASDF
##VAR_DIM=   8192,          8192,            8192
##UNITS=     SECONDS,       ARBITRARY UNITS, ARBITRARY UNITS
##FACTOR=    0.0002004,     1,               1
##FIRST=     0,             0,               0
##LAST=      1.6414764,     0,               0
##MIN=       0,             -75691,          0
##MAX=       1.6414764,     59945,           0
$$ Real data points
##PAGE= N=1
##DATA TABLE= (X++(R..R)), XYDATA
0@%%%%%%%%%%%%%%qJ6j6J6j6J6k4L2l2L2m0M8n6O4p2Q0q8J03j13J22j36J53j73
37i2J95k15K37k63K91l22L57l96M37m86N43o07O82p68Q72j002J166j377J665k091
57a174K771m032P154k8590n1820O0690O7774m286o3447k2647L9492L8193j9949
70B0129l6518N646L9642Q314l7744l2759J6677L8076Q682k8187k5837O92J6409
83f778J1058K190m903j0869r483O574J9197P861j5549j5106J1190K3009k216k6965
97a0790r347K8108K5958j8725m0648l091M1203K5369k9684m2915N815M4796J7032
110C3081l4883l4197J5828L9838N213l2804j8630K1777K6136q214k5709j275K4181
123A0342J1401j7956j9025O952J9429L169j3600q142M345L051l906Q10R358K136
$$ y = [0, 0, 0, 0, 0, 0, 0, 0, 0, 0, 0, 0, 0, 0, 0, -8, 8, -8, 8, -8, 8, -16, 16, -16, 16, -24, 24, -32, 32, -40, 40, -48, 55, -58, 64, -72, 81, -92, 103, -112, 125, -138, 153, -169, 188, -208, 229, -257, 286, -321, 361, -407, 465, -537, 629, -748, 917, -1174, 1597, -2435, 4719, -23871, -75691, -15001, 52773, 48487, -14960, -37607, 1885, 40078, 20129, -16389, -10743, 28899, 37213, -531, -33290, -16613, 21463, 30145, 1958, -23879, -23187, -6778, 4280, 6470, 1567, -9302, -18785, -12211, 6986, 14847, -702, -15808, -4618, 18391, 16175, -10790, -20137, 7971, 33929, 15204, -25444, -28535, 12668, 38037, 8353, -34562, -28747, 16049, 33081, -1802, -35999, -20171, 19667, 24880, -7924, -26554, -4777, 21359, 13145, -12564, -13839, 10342, 21743, 3787, -15238, -8286, 11143, 14312, 712, -7430, -3085, -34, -3940, -3130, 6228, 8364]
137H364j3876j1758J0051J9861J372j8375r619J3208J3993p662j5758L648J8898
150A2347L145k0939j5000J4074K2880k208k3943j0988J5651J6474o400j6151L92
163a0666J4819M579j2048p664J0374J2873l892j3118j188J1921N886q312p661
176d097N083P755l852r715L69R382J458j0969o915Q356J0378m960j3814j404J3786
191H41Q481q888j1622M043J3433K707j0374n170R051R082n526j1547N87J2001
205G099M936r904j0516K803R524J074p831m123M210L401l683l765L691O106j102
220A920o301q52O679M600l305m318K413M982j126n494m37O028K554o232o645K478
236c056P149L41p456m158M683N399k723o214N16O745K568n493m580L969P097M9
$$ y = [8364, -5512, -17270, -7219, 12642, 14014, -4361, -13980, -772, 13221, 5559, -10199, -6551, 12347, 15492, -5447, -20447, -6373, 16507, 14299, -9644, -20632, -4981, 11493, 5093, -11058, -10666, 4153, 8732, -3316, -10980, -606, 12267, 8375, -4743, -5931, 5990, 11876, 3564, -4097, 986, 8741, 4889, -4826, -4457, 4925, 6383, -4586, -11501, -3145, 7233, 2273, -11541, -12945, 841, 9322, 434, -11188, -7145, 6288, 8995, -1379, -6549, 2502, 11584, 6058, -5489, -4902, 7099, 12035, 2131, -8385, -5582, 3942, 5016, -2815, -6938, -2728, 673, -3010, -6775, -3084, 3022, 1920, -4381, -5233, 1446, 6046, 2741, -1577, 836, 5818, 4692, -802, -1239, 4789, 7343, 1111, -5534, -3056, 4093, 4434, -3022, -7180, -2497, 2902, 179, -6035, -5519, 1226, 3794, -1699, -6279, -2310, 4787, 4836]
252D836o371k781M911N052j923n286p08M072J924k982k944J248K480p91k765k36
268b264K458R81k045j566J506K262k38j682J14J784M17j548n00J815J200j864
284H30k581N17K777N14k991k362J405K701l31k724q12K373J953j251k097P42K842
301A505R71j910j606J291K233q6k090j001J217J112r62j766k81J130M83j006j112
318a878J87R68M36k86k65K31L89L79M48M31j4l76j4O35N48l35q78l39M16K78o11
339C50r40k78L29K3n97n50J42N02R6l37l7N81O44J31j76K37P56N27j87m55M9N69
361A379L00n11q73l73K59K32m00p66m55R5K10m6j44Q5K18O8l2K38N86M87m6l67
383A44n4M56N26K0m20m25j37J25J73J3k55m31l18R3L78J76k60l45M4L35J92j37
$$ y = [4836, -1535, -4316, 595, 5647, 3724, -1562, -2270, 1802, 3726, 744, -2200, -952, 1528, 737, -2028, -2264, 194, 1175, -870, -2436, -930, 1332, 1094, -588, -474, 1310, 1727, 179, -321, 1494, 2694, 830, -1751, -1234, 1543, 2057, -934, -3296, -1891, 810, 479, -2245, -3057, -684, 1269, 18, -2079, -1337, 1505, 2476, 566, -1040, 251, 2484, 2398, 308, -693, 524, 1636, 674, -1092, -1373, -243, 240, -766, -1878, -1691, -723, -287, -573, -838, -607, -218, 161, 609, 1040, 1026, 650, 636, 1271, 1819, 1484, 606, 267, 683, 961, 350, -590, -868, -539, -516, -1113, -1663, -1521, -1019, -923, -1260, -1297, -716, -72, 59, -117, 120, 876, 1403, 1216, 761, 810, 1379, 1679, 1168, 295, -78, 181, 413, 13, -753, -1208, -1113, -903, -949, -1093, -1008, -790, -722, -754, -516, 70, 557, 511, 144, 90, 546, 1072, 1092, 672, 247, 110, 235, 408, 421, 166, -265, -583, -490, -112, 64, -196, -541, -497, -162, 30, -107]
405a07o5K52K92j56l90K0M77L43k85n36j15L40J75k23k28O9O2k78l51J95O07K09
427C07n58o17K21R04M93l98o02J8N62L46j69k82l0M5j55j63N0J61j55m54j75K82
449c69L58p6l24k1L47K92qp5J74K09n6j73Q8K94Nn12m02J82L84j21o42m08K57
472e97L95j29m35m9M03K26k43j61M05N51m7m61K1O49M44l61n45J71O38R7o60m90
494a78L58N51k79q19k48N26L25m56n63J56N44K9m84n8O21L78m14m37M67Q01p1
515G49q84l21Q22O73o15j145j08R49L58q24q02L54P53j75p11J34J045L71r29p05
535a011R34J553N0j405p35R95J132l32j084j29P17m0j110m19J072Q99r36j666
553a515r9J615R71r04j155L06J021j3p92J70J215K93j397j136R66J786oj752r10
$$ y = [-107, -172, 80, 372, 216, -174, -154, 323, 666, 381, -155, -270, 70, 245, 22, -206, -137, -75, -353, -704, -509, 98, 307, -251, -868, -647, 257, 750, 352, -250, -232, 330, 676, 507, 225, 195, 240, 85, -78, -28, 133, -22, -476, -651, -369, -11, -87, -411, -432, -85, 207, 199, 124, 298, 507, 451, 278, 366, 660, 665, 153, -249, -67, 317, 196, -446, -854, -597, -202, -331, -766, -815, -412, -186, -429, -590, -185, 366, 319, -142, -121, 528, 972, 611, 66, 237, 875, 972, 312, -178, 180, 731, 452, -367, -615, -89, 236, -220, -783, -627, -83, -54, -538, -596, 25, 403, -11, -448, 19, 820, 749, -135, -456, 366, 1039, 424, -721, -829, 120, 478, -346, -1148, -794, -41, -216, -927, -793, 252, 623, -306, -1011, -77, 1476, 1526, 121, -614, 381, 1513, 1181, 97, -32, 685, 645, -465, -884, 188, 1087, 151, -1515, -1614, 1, 972, 68, -1087, -781, 240, 227, -565, -395, 820, 1113, -284, -1420, -454, 1332, 1326, -426, -1336]
572a336J036J046o63j124M43J353j85j748o19J721J746p63k001k10J816J055j029
589E38j064Q18J242n74j609O2J853O65j880j830R04K108q0k271j038J608J606
606A058r47j853K71J967M99j587q32J604J640r90k087K02K402J014j914k000O85
623h68J919L2j658n60J234M53j488j051J431K042n38k393o43K104J770q83j567
640f64N49J586k95j823k5K445J279k312k906O93L217R11k748k297J218K226o30
657D24k415j00K540J011k534k357J644L544M65l002j843J911K637k33j992k07
673e07J620L74j592p48J632J395j413k418R6K322Q52j858j580R45J511n60j450
690a379N85K031P2k413j096K430K704j022l273o55K796J865j774k375P69K307
$$ y = [-1336, -300, 746, 83, -1041, -598, 755, 570, -1178, -1797, -76, 1670, 907, -1094, -1304, 512, 1567, 538, -526, 292, 1534, 960, -649, -587, 1266, 1931, 51, -1779, -875, 1233, 1153, -1118, -2156, -548, 1058, 111, -1742, -1471, 496, 995, -592, -1424, 180, 1820, 830, -1257, -1055, 1347, 2361, 447, -1553, -868, 1051, 1083, -575, -1135, 99, 552, -936, -1987, -556, 1486, 948, -1445, -2088, 16, 1786, 903, -664, -115, 1471, 1176, -647, -672, 1773, 3052, 740, -2166, -1473, 1744, 2655, -93, -2390, -1172, 1054, 424, -1991, -2091, 449, 1460, -1074, -3431, -1787, 1757, 2222, -780, -2623, -712, 1925, 1692, -300, -507, 1113, 1487, -105, -853, 779, 2174, 761, -1657, -1561, 761, 1613, -245, -1825, -880, 631, 71, -1379, -794, 1237, 1309, -1104, -2200, 230, 2934, 1912, -1361, -2016, 780, 2645, 871, -1504, -735, 1572]
706A572l31k806p64K745K095k087l429K16L487J626k263k359R63K357q0j911q0
723a049K207Q57k139j926J427K822O8k657j417J585J679p72j603L85J533l10j982
740a292m28K169J604j474k379L07K450Q89j708j316J143J455q23j743L81K031
756A266K76k313j517J599K226o38k541n45K161J351j497j709J024K232j05k234
772i64o10K231J812j341k384K69K412P82j943j561J064J649o40j924j62J799O79
789A168j706j505J013J932q0j785n93J478J153q13j108O36J380j41j432k46J486
806H37Q67j210j487M93J564J7j683p82J182J056r43j525L45J667L43j558r14J314
824d17J648m58j635j14J734R72j127j312O01J475Rj477o21J063Q28q85j312K62
$$ y = [1572, 1241, -1565, -2329, 416, 2511, 424, -3005, -2789, 698, 2324, 61, -2298, -1335, 1022, 942, -969, -1049, 1158, 2015, -124, -2050, -623, 2199, 2267, -390, -1807, -222, 1457, 685, -918, -533, 1000, 690, -1292, -1720, 449, 2053, 579, -1800, -1493, 957, 1846, 138, -1178, -35, 1420, 597, -1146, -765, 1266, 1542, -771, -2288, -689, 1537, 899, -1642, -2187, -26, 1325, -172, -1881, -857, 1375, 1270, -964, -1574, 657, 2469, 1128, -1256, -987, 1425, 2207, 264, -1297, -233, 1416, 776, -1148, -1310, 489, 1168, -538, -2043, -1030, 902, 822, -963, -1556, -78, 1075, 262, -846, -210, 1170, 1029, -403, -649, 837, 1704, 494, -993, -500, 1064, 1081, -602, -1384, -202, 854, -89, -1614, -1269, 398, 741, -817, -1731, -417, 1231, 773, -862, -976, 758, 1730, 603, -709, -108, 1367, 1376, -101, -722, 341, 1169, 284, -1028, -766]
842g66J236J19j283o90R45J012m85j083J57J189L46r57n84Q64J020m13j134k1
860e28J102M72r16q37N35R20k77j090j63J000N31q59r20M45J154P9j029m90Q11
879f0Q14l69q42J03Q86J96p65m90N77O98l51q59o7P53K85o52n52L80O35j46o95
900e21n0P09L74n09n16L87P26k2p01j95O20M21m71o56J15O25O4o57m08L63M87
921A85k45n18J8N35K09l91k81M15N56j05m60k3M96K99l07l68J26L37m4m27j20
942a13K33J08l45l52J32L21n6l95j35L16K55j52k28J46L77Q1k58o7L49L26j16
963D27l31j3L07J40k35k50K3R9j33k13k8J61k1l04j91J85L01L4k37r4K03K20K6
986G6k3J00J26q3j56O3K74J19k42l43n0J92J45j10j82q7k2k3K8J26J38o8k36n5
$$ y = [-766, 470, 589, -694, -1384, -439, 573, 88, -995, -838, 351, 697, -260, -844, 20, 1040, 627, -507, -528, 574, 1046, 130, -707, -172, 748, 471, -619, -782, 218, 749, -110, -1030, -585, 569, 648, -381, -871, -60, 754, 385, -457, -354, 532, 728, -37, -527, 50, 748, 397, -462, -529, 224, 509, -143, -695, -315, 320, 174, -521, -571, 138, 512, 3, -513, -126, 600, 578, -123, -318, 302, 723, 252, -404, -289, 336, 400, -257, -665, -302, 185, -60, -578, -560, -25, 184, -207, -488, -73, 483, 378, -82, -105, 391, 690, 383, 15, 141, 478, 434, 7, -113, 120, 228, -117, -469, -337, -16, -72, -467, -602, -286, -31, -183, -411, -265, 112, 193, -65, -132, 217, 543, 427, 96, 83, 390, 530, 295, 45, 68, 167, 34, -179, -207, -46, -67, -371, -562, -377, -76, -42, -279, -373, -170, 50, 76, 53, 153, 279, 196, 40, 103, 377, 496, 254, -89, -139, 53, 198, 88, -94, -181, -203, -226, -198, -72, 66, -2, -238, -293]
1010b93K07K84L0j58j25K7Q4N4N3Qm9j56j27Q1J58N8j40j75l4O2R5M7N1l0j08
1035i6r1Q4K28J43j06k09p2J50J74J4j26r4n0k6K9O1N9o7j57j01O9J87J10p9j29
1060i5j9Q7J36R9K0n9j06l7Q7J03Lj09j44o2J6J3mk6n7p6p6N4J37Q7n1j11JJ62
1088b7J27L0m3%L8L4LOL0Jq1r4rN3J4q0p3m4jJ2K1L2j2m7m1O5J19N0n3p4N8R9
1120A13O3o1p2J1M4l4m8pK6l2r4p2N3P6j5j00m2O8R2K4l3J0N3K8OJ6K9L8m3l9
1150E8K0M1kp2m8J0L5k0o7J5J3j9l7J6O4N8q5p0L6J10M4q9q8K0R3Lq0m2O8L7p7
1181e5q7L4J13K4q0p0L3J05K2m7%P1J7n1k1P1R4m8j01j5P0L9n9q3J1N1l0r0k6
1210a08Q1K8p3p1O1J01Qj15l0J20J36n1j58k9J39R4o5j18JP9k9r5rJ01N5q7j21
$$ y = [-293, -86, 198, 228, 70, -55, -28, 56, 110, 163, 171, 122, -34, -161, -80, 78, 136, -4, -179, -213, -151, -56, -9, 42, 12, -96, -187, -103, 125, 268, 162, -47, -119, 31, 205, 219, 93, -1, -51, -77, -48, 13, 72, 5, -152, -253, -184, 3, 113, 34, -95, -114, -27, 109, 208, 228, 169, 63, 26, 113, 216, 219, 110, -34, -96, -80, -67, -71, -97, -154, -230, -306, -252, -115, -28, -79, -190, -189, -27, 100, 130, 87, 87, 125, 159, 162, 168, 198, 199, 118, 24, 15, 68, 82, 2, -71, -115, -116, -104, -83, -51, -63, -110, -151, -86, 33, 83, 30, -44, 14, 113, 176, 115, 43, 54, 98, 64, 16, 9, 35, 3, -91, -163, -110, -34, -49, -149, -191, -123, -31, -7, -40, -30, 23, 51, 57, 73, 102, 140, 97, 58, 78, 119, 117, 45, -3, 7, 42, 22, -45, -30, -17, -36, -73, -57, 7, 65, -20, -90, -54, 56, 100, 11, -77, -57, 36, 39, -41, -83, -15, 22, -55, -142, -108, 5, 29, -51, -121, -88, 17, 39, -8, -8, 63, 80, 29, 8, 79, 173, 125, 24, 9, 79, 118, 59, -24, -13, 38, 8, -82, -108, -27, 1, -72, -143, -82, 19, 27, -88, -118, 2, 138, 87, -71, -100, 39, 133, 68, -50, -49, 30, 1, -94, -103, -2, 53, -34, -155]
1237a55L0J50P3n9o9L2Q0j5k0O2P5m5j31l4J25R0r4j63j7J08K4j23p5P5R6o2j55
1264a97RJ66R4j22j26Q5J58N1j16o7R8J25n5j11RJ17Kj18r6J10Q8p0j59l7J34
1289b8O0q2q1N3Q1l3o0P2J45K9j64q9J32J97lj92j06J18J02o8j33RJ06l7j73o3
1315b08J61J52r7k08k5J75J21p7j17L7J14k1q2L0J45L8j56j12J03J72l3j41n4
1338h3J02R0p4j02O9J17l8j60m0J85J24j18j91J8J78R3j29j18N2J08n2j26J7J44
1362F6K9j74j40R3J93L6j68r3Q1J19k6n3M3R8l0j32mJ66J13j34j69j1J65N5j42
1387a9r2O1P5n4j36M1J66N3j45j26R6J88K5j17p5J14P8l9q0L4J04j5j44o1J12
1412D4Q0p4j39j6Q6K5r6m5N5O4n3r2K8J47L9r6p6J09J22j8r8j5J15P0r7p8M0J10
$$ y = [-155, -125, 25, 98, 39, -30, 2, 82, 67, 47, 109, 184, 139, 8, -26, 99, 189, 95, -68, -85, 23, 47, -76, -151, -76, 20, -42, -197, -188, -22, 72, -50, -176, -91, 67, 118, 2, -65, 33, 158, 103, -8, 1, 118, 120, 2, -94, 16, 104, 34, -125, -162, -28, 32, -50, -131, -78, 3, -30, -90, -18, 127, 156, -8, -97, 35, 232, 229, 37, -69, 49, 151, 83, -50, -41, 65, 28, -145, -208, -47, 105, 8, -200, -225, -50, 71, -6, -123, -86, 28, 7, -75, -45, 100, 138, -18, -130, -27, 145, 112, -29, -83, 19, 109, 35, -67, 2, 119, 81, -79, -119, 66, 190, 72, -119, -101, 77, 170, 41, -77, -25, 83, 31, -95, -78, 66, 95, -79, -219, -126, 67, 103, -65, -158, -77, 42, 16, -37, 6, 104, 74, -58, -62, 104, 217, 83, -86, -97, 68, 123, -19, -111, -50, 25, -29, -165, -124, 42, 95, -50, -176, -80, 108, 133, 16, -59, 55, 133, 94, 14, 48, 152, 137, -7, -68, 44, 124, 50, -89, -105, -19, 6, -90, -135, -80, -16, -69, -161, -133, 14, 53, -43, -119, -10, 112, 94, -4, -19, 96, 166, 69, -9, 31, 141]
1440A41m3j38k9J04O7j12j23L2J26K2j19p2O8J24j9r6jJ15L6q3n1O3J07l2j13
1465b6l2Q9N2o6p2J9O8Pr1j8P1L6m7o5M1P4No6l3O0L8l4m2K3O1pp9l3Q7N3l6r1
1497e4NP1K5n8n8O7N6k3q7%Q6M9p0o9J9Q4K5q0m0M0N2j3p5LM8J5n0l1L5M1ln3
1529d3NM8J9k7k2M5N2k6n1J9N0nn4k1J7L6k8p5rO5J0n0o0K3O2L0m9k3K6M8%k9
1561a7qP4Ml8qL0J5Jl0l%Lj1oMqk4l2J6K0Lm0k3K3N9j6k5JM8L2l2j3L9L3J1m8
1597C4l3L3L3ro1j6J4Qk1j4MNj1k1J0K1Moj0j0M2RKkj0K%J8K7J2m6k1J7L0J9m7
1633Fk3J0J9Kj5kQlk2l4L2L5Nl1k3J0J4K9j0roNRLJ2nj8j3kJ7K1Jj6j0Lj2QJ5
1671A0K3k2k9rL5Oj3k0l1J7J0MlmLj6k2K9L0J0Jk7KL7J6J1k4Kj1MONrj4j6%PM
$$ y = [141, 98, -40, -69, 35, 102, -10, -133, -101, 25, 47, -72, -144, -76, 48, 29, -67, -68, 47, 83, 0, -51, 12, 119, 87, -26, -58, 31, 83, 17, -55, -36, 32, 39, -52, -70, 1, 37, -10, -75, -34, 40, 45, -21, -54, 6, 44, 10, -32, -9, 52, 45, -34, -67, 20, 73, 37, -54, -49, 22, 47, -11, -69, -2, 54, 31, -56, -56, 30, 79, 9, -60, -41, 43, 68, -12, -52, -12, 40, 27, -48, -45, 3, 18, -32, -63, -28, 13, 10, -43, -38, 10, 29, 2, -20, 25, 77, 51, 0, 19, 69, 64, 10, -11, 6, 42, 14, -61, -70, -5, 5, -45, -105, -82, -20, 10, -39, -62, -36, 12, 12, -17, -25, 49, 53, 15, 7, 37, 52, 53, 23, 20, 20, 23, 12, 6, 10, 2, -22, -54, -38, -18, -15, -55, -78, -55, 4, -12, -37, -36, 12, 44, 12, -1, 38, 71, 82, 34, 1, 34, 67, 58, -3, -19, -5, 3, -18, -32, -28, -23, -34, -55, -45, -24, -20, -26, -36, -46, -4, 5, 7, 5, -5, -3, -3, 15, 42, 54, 8, -13, 4, 34, 53, 6, -17, -7, 12, 14, -1, -3, 5, 2, -20, -54, -22, 13, 18, -13, -36, -26, -12, 17, 7, -2, -8, -3, 6, 9, 21, 16, -2, -15, -17, 0, 21, 22, 6, -4, -1, -13, -5, 10, 33, 11, -18, -27, 8, 14, 1, -19, -50, -33, -23, -19, -22, -26, -23, -39, -61, -32, -2, 8, 9, -18, -16, 21, 37, 48, 24, 26, 15, 19, 25, 30, 21, 7, -9, -9, -2, 2]
1709BLl8QMjJJJ7lJj5J9K1Onk2QQJ5mJj1mmJ0j0mqk5KkmJ4j3n%Q%J5J0KlJ5J5
1753B5J7pj1%jJ7nj4j2J2Jj5mq%JJ0k1PJ0j3oNkJ6nj0%NKrJ5Lj5%J5onJ6k2J6
1794B%kpk1K0J6qj8K3j0J0Lk3K0QplmnJ6Qk2jLNqjOPlj3KJ5mJ3j4J4%poOMj2q
1838fj5J4Pkl2QJ3KomJK8LpnJ4QmoJ4j0J0jpo%mk%lj1lJJ4rlqlJ1kOOJ2np%OR
1886A6Pj7RKnJ2j6%lqmkJ0pjj2RpJ4JMj2RjnPjKPj7PJ1nj4%J7lmj3NJ5%j4qK2
1931Gj7J4kJJoJ6k6J8mRnj1NNjJ2Pj0kj5RJ2Pj1qqJ6Mmj1j4PK%jM%orJ3mQj1q
1976a7QJ4j7PQJj2JOJ4mJqnJ0KP%Mk3NPqJ6oj9%J8nJ0joklLNJ0j0Oj3LKKnj0j
2022eNmjj0%m%%J7qJRqJmKmJ5qRnMoJ3j1pLPjlKnRnKj1J9j2njJ3J3j5jLMMj0%
$$ y = [2, 5, -33, -25, -21, -22, -21, -20, -3, -6, -5, -20, -1, 20, 26, 21, -1, 7, 15, 30, 26, 27, 16, 12, 8, 18, 8, 4, -4, -29, -27, -29, -33, -19, -32, -37, -37, -29, -29, -14, -4, -2, -5, 10, 25, 42, 35, 24, 24, 23, 40, 35, 21, 9, 21, 22, 7, 3, -5, -5, -4, 6, -15, -8, 2, -11, -17, -12, -14, 2, -3, -13, -13, -8, -6, -15, 0, 3, -12, -12, 3, -3, -8, 8, -14, 2, 2, 0, -7, -28, -8, 8, 0, -18, 5, -5, 5, 8, -15, 5, 13, 6, 3, -1, -6, 10, 18, -4, -5, -2, 3, -5, -6, 0, 7, 4, -9, -7, 8, 4, 17, 3, 17, 17, 10, 4, 10, 14, 2, -6, -21, -7, 0, -2, -34, -26, -13, -11, -17, -21, -20, 8, 11, 4, -1, 13, 21, 17, 11, 25, 15, 25, 24, 17, 11, 11, 7, 5, 5, 2, -9, -12, -11, 3, -6, -9, -17, -20, -9, -11, -5, 1, 13, 8, 1, 1, 7, 16, 23, 6, 15, 17, 12, 24, 8, 8, 5, -3, -7, -9, 1, -6, -7, -19, -10, -17, -3, -2, 2, -10, -1, -2, -7, 0, -1, 1, 8, -9, -2, 9, 4, -10, -10, 7, 4, 0, -13, -8, 7, 7, -7, -15, 7, -10, 4, 2, 3, 4, -2, 14, -12, 6, 2, 11, 6, -5, 0, 5, 4, 16, 23, 13, 11, -4, 5, 17, 24, 13, 5, -3, 13, 17, 13, 2, -12, -5, -3, -3, -4, 0, 0, -6, -15, -2, -6, 2, -9, -17, -9, 5, -12, -5, 3, 4, -8, -7, -1, 13, 9, 10, 2, -3, 7, 9, 16, 16, 20, -3, 2, 9, 1, 17, 11, -8, -8, 10, 5, 15, 14, 8, 6, 3, 6, 11, 21, 11, 17, 4, 7, 9, 11, 6, -4, -5, 0, -4, -5, -15, -15, -19, -19, -19, -2, -10, -9, 0, -8, -7, -11, -9, -13, 2, -6, 3, -2, 2, -4, 9, -2, -9, -6, 1, 0, -3, -1, -6, 3, -2, 0, -11, 8, -4, -9, -10, 3, 16, 1, 0, 3, 7, 11, 1, 1]
2071AM%j2J2k9J5J7jrknoRkjKJj6K1pJ8j9NPjlpoMQj0MlJ4mrlJ3Oj7J6rJ0mJn
2117bK3j3Ro%pJkJ2ojpJ5Mk2lJ6j7J4JokJ4j0%j7J4JJ5j8nN%Olj9J1Rj7jQLQj2
2161goJ1J1pj7J7LjlJ0KlJmoOJnj0RqQlj3J2Qo%jJ3Kj3mNJ4j6JqJ9lpJ0k6J1K
2206anQlj4mJ0kQj1MlK6j3pJLOQj1KN%Ok0K6km%j4J2klQnnlKkoJ8j0Oj8ORNkj6
2254gOkJ0jkrKQKomMj4KMJPrkJ2koNjj%MkJOj1jkLmJ5qQJj3mK2nKj1OllJMjJn
2307bNkKQj5%J3nrL%MnjnJ4ojj0J4jPj5rJ8j1jKJLJj2J0Mj1j2PRjRMj6OJ2lpJ2
2354HoKKJlJLKj4MRqNrOmmJ5j%j4kJ3kLj3KlJ4pljQnKLo%mONlNk3K0nLqRnJ4k1
2406iK2j3mRKRj8NqJ1Oj2MPoKlJNJj4RoPNNj2pJ3lpklMmNJpqj8K1MlKjN%LOj3
$$ y = [1, 5, 5, -7, 5, -24, -9, 8, 7, -2, -4, -9, -15, -6, -8, -9, -7, -6, -22, -1, -8, 10, -9, -4, 3, 2, -1, -8, -14, -10, -2, -12, -8, -11, 3, -1, -10, -13, 0, 6, -11, 5, -4, 6, 2, 3, -2, 21, 8, 17, 11, 11, 4, 5, 3, 15, 9, 8, 1, 16, 20, -2, -5, 11, -6, 8, 9, 3, 1, 15, 5, 5, -12, 2, 3, 18, 0, -5, 0, 0, 6, 3, -16, -5, 4, -13, -14, -6, -3, 5, -7, -13, -2, 9, 2, -15, 2, 5, 4, 1, 11, 13, 10, 11, 7, 1, 7, 8, 3, -7, 2, -6, 2, -1, -14, -2, 6, 0, 0, -1, 12, 14, 1, -3, 2, 16, 0, 1, -7, 12, 9, 2, 12, -14, -3, -1, -6, 2, -1, -15, -19, -9, -11, -3, -14, -10, -13, 13, 0, -7, -6, -3, 3, 11, 0, 2, 7, 7, 13, -7, 19, 17, 13, 13, -1, 11, 9, 6, 14, 9, 4, 1, 3, 1, -5, 13, 3, 9, -9, -3, 6, 11, 9, -7, -1, -3, 7, 6, 4, -5, -3, 5, 7, 1, -3, 1, -13, -11, -7, -6, 1, -8, -10, 2, 0, -6, -1, -2, -3, -3, 1, -1, 0, 6, -5, -6, -8, -5, -9, 6, -2, 6, 7, -6, -10, 12, 7, 9, -2, 4, 1, -2, -1, 3, 2, 3, -2, 3, 1, 3, 11, -4, -4, 9, 4, -5, -2, -2, 2, -3, -4, -9, 5, -1, -2, -12, 2, 1, 8, -7, -16, 2, -9, -10, -8, -7, -4, -3, -15, -5, -1, -12, -24, -17, -8, -9, 0, 4, -12, -6, 6, 3, -4, 8, 2, 4, 6, 7, 4, 5, 8, 10, -4, 0, 9, 1, 6, -3, 3, -1, -5, 10, 9, 9, -5, -7, 6, 4, 7, -6, -4, -7, 7, 0, -3, -4, 4, -1, 1, 4, -2, -2, -6, 0, 5, 2, 7, -16, 4, -1, 2, -6, 3, -2, 12, -9, 13, 0, -4, 5, 7, 16, -2, 3, -5, 6, 12, 0, 4, 11, 5, 7, 4, 5, 10, 11, -3, 6, 0, 7, 12, 17, 5, -2, 11, 8, 1, -1, -4, 0, -4, 1, 2, -5, -13, -31, -10, -6, -9, -7, -8, -3, -3, 0, 6, -7]
2456gPmNPj1MplJ7Jk%OloMJNjmpnPkRllollJ6rRLj2J2olNj0jOomJ1j1jKJ0j0Q
2507BpKkmJ1nPj0LP%kjOk3J7NJj0J0oPNrKmMN%mmlJLMQj4J0j1j1R%mJ0NJkj1k
2556dMkLk%%mkPkQmJnPKqOJ1k2J0Lqj6J6KMoOoJN%LmmJ8roMMJj1mJ4j1QqJMnN
2608Ej2ONj%knMmRppRpkMnK0k3J5mmLmJ7j2MmJpPJ8j9Onj1PNnJ3noJ2OJrJ2j9
2656@J1mpJ4j1nJ3pJ6j8jKmJQQj4JKl%K%oOpjjj0J5NLj6J2lnOlKnLnJ0oMj0JR
2704Bj5J6oJ2ljpjJ1pLKpJ6j4NpMNj7K0qJ9rpKJ0k2J3%LPk2PpOj4%KK%J1nkLn
2750eMkPmLnmlOl%QKqkMLL%kmnMJ6qMrJ0Nj0oOLMnpJOkJ2kk7J9nOmj3K0moqJ2
2802Ej4NnoOlRnM%jP%LrQMmj5RNJ2rnJ2j2j%LJ1pOJJj2MknJ3Jj1jLJKJ2j4Mj%
$$ y = [-7, 0, -4, 1, 8, -3, 1, -6, -9, 8, 9, 7, 7, 13, 10, 4, 8, 9, 14, 13, 9, 2, -3, 4, 2, 11, 8, 5, -1, -4, -7, 9, 0, 9, 12, 0, 12, 6, 3, 8, -2, -3, 3, -3, -7, 4, -7, -8, -6, 4, -6, 2, -5, -3, -5, -9, 2, -3, 4, -6, -3, 4, 4, 2, 1, 7, -16, 1, 6, 7, -3, 7, 1, 8, 13, 4, 6, 2, 6, 11, 11, 7, 3, 0, 1, 4, 8, 16, 2, 12, 1, -10, -1, -1, -5, 5, 10, 11, 9, -2, -4, 0, -2, 1, -1, -1, -1, -5, -7, 0, -2, 6, 2, 3, -2, 5, 7, -1, 5, 16, -6, 4, 7, -1, -17, -1, 1, 5, -1, 5, -1, 0, 5, 5, 8, 4, 0, 18, 9, 3, 7, 11, 12, 1, -3, 11, 0, 8, 0, 1, 5, 0, 5, -7, -1, 4, 3, 3, 1, -4, 0, -4, 5, -2, -9, 0, -7, -9, -5, -10, 10, -13, 2, -2, -6, -3, -7, 10, -2, 2, -2, -1, -8, -1, 17, -2, 4, -1, -12, -5, 0, -5, 8, 3, -3, 9, 15, 16, 7, 19, 0, 11, 7, 0, 14, 3, -2, 11, 4, 20, 2, 1, 3, -1, 0, 8, 16, 2, 3, 5, 2, 2, 4, 4, -2, 4, -3, -4, -5, -15, 0, 5, 8, -8, 4, 1, -4, 2, -1, 1, -4, -1, -6, 4, -2, 2, -8, -7, 2, -13, 3, -3, 9, 6, 5, -2, -3, 8, 1, 4, 6, -1, 15, 1, 6, -1, 3, 8, -9, 11, 3, 22, 13, 6, 8, 18, -4, 9, 9, 12, 19, -3, 4, -3, 3, -11, -11, -9, -7, -7, 4, -1, -3, 0, -5, -1, -3, 4, 0, 3, -2, -6, -9, -3, -6, -6, 2, 4, -4, -6, -2, 1, 4, 4, 2, -2, -7, -3, 13, 5, 9, 0, 10, 15, 5, -1, 5, 8, 12, 7, 0, 1, 7, 5, 17, 15, -12, 7, 2, 8, 4, -9, 11, 7, 1, -7, 5, -9, -4, -9, -15, -9, -12, -3, -8, -4, -4, -5, 2, 2, 5, -4, 4, 8, 4, -11, -2, 3, 15, 6, 1, 13, 1, 0, 0, 3, 14, 7, 13, 14, 15, 3, 7, 5, 0, 13, 14, 3, 2, 5, 6, 8, 20, 6, 10, 9, 9]
2852IkRj5J8k3J1kJ%j5%J3Jj0LjJ1j0Qj1QJp%mPqORqPrqJ5lkJ1pPpPj4J0Pj5K
2898@j2J4MjkPj1OmpNLJ1ojj6J8nlkkNnkNnkPkkMJ1j1oJ2koRnMmj%J4qpJMMj1
2948cJ1qJ8pmqQJ1j4J2k2OQolJ2pjNqKklK0qqlOMj1NJj0nJ0olJ7pKNlj1K1j9N
2994amMMoJnJ2qKQQmnmOj5K1qLkJj1JJ7%j1J1lNrJ2j8J2j9LJ9Oj9KKj0j3J1RK
3039GoJLj2J2nkOloL%jRnoJ4j2OQj3Oj1J9ppJ6krJ2j1Mj0RjKjlmNJj6J0kKmJ1
3086GqQlNlnLj2J2lJkMmj1LllJ9kKJkj2LjJ2kJrMJj3QJ8j4lJNPj8J2J8ppKkKK
3135A2JpNj5mJ9llpJ0KjjrMjKOqkNJlLqlMnK%JrQMkOkjRqkoLnOPmlLJ1oMoJ0p
3190Gj5J2LNok%nQj1Jj%J0klpj1J4PKj1QJj1J2j3KJ2moJ2j9RJKl%Mj1K1j3JPj8
$$ y = [9, 7, 16, 1, 19, -4, 7, 5, 6, 6, -9, -9, 4, 5, -5, -2, -3, 8, -2, 6, -5, 3, 4, -3, -3, -7, 0, -8, -2, 7, -1, 6, -3, -11, 4, 1, -1, 10, 3, 10, 3, 10, -4, 6, 13, -2, 0, -12, 2, 6, 5, 3, 10, -1, 5, 1, -6, -1, 2, 13, 7, 6, -10, 8, 3, 0, -2, -4, 1, -4, -6, -1, -6, -8, -1, -3, -5, -1, 10, -1, -7, 5, 3, -3, 6, 1, 5, 1, 0, 0, 14, 6, -1, 0, 4, 8, -3, 8, 0, 18, 11, 7, -1, 7, 18, 4, 16, -6, 0, 8, 2, -1, 11, 4, 3, 8, 0, 2, 0, -3, 17, 9, 1, -2, 4, 8, -3, 2, 3, -7, -12, -2, -8, -11, 6, -1, 1, 6, 3, -8, 13, -6, -1, -5, -1, 3, -3, -2, -7, 5, -3, -1, 7, 15, 11, 6, 2, 8, -7, 14, 6, 9, 7, 8, -3, -2, 15, 15, 4, 15, 12, 17, 8, 20, 2, 14, -5, -2, 17, 23, 4, 6, 8, -2, -15, -4, 5, 7, 1, 2, 5, -7, 5, 0, -2, 4, 1, -5, -2, -2, -3, 6, 1, -5, 9, -3, 3, 11, -2, 4, -7, 12, 5, -2, 14, 12, 3, 15, 4, 8, -2, 7, 6, 8, 7, 4, 0, 5, 6, -10, 0, -2, 0, -4, 7, -1, 7, 4, 9, 6, 1, 4, -8, 4, 1, 2, 0, 4, 0, -11, -8, -11, -14, 5, 3, 5, 6, 4, -8, -5, -6, 6, 4, 5, -4, 0, 1, -12, -4, 14, 0, -3, -2, 3, 10, -8, 4, 22, 15, 8, 10, 8, 10, 12, 13, 6, 11, -4, -8, 11, 8, 5, -2, 8, 10, 9, 8, -1, 3, 2, 4, 10, 2, 0, 5, 6, 3, 6, -2, -5, -1, -6, -4, -4, -3, -12, -4, 0, -2, 4, 2, 1, 10, 2, 0, -6, -3, -8, -2, 5, 1, -2, 1, 12, 6, 10, 4, 14, 7, -8, 4, 7, 12, 6, 4, 4, -1, 7, -4, -3, -4, -4, 6, 4, 1, -6, -17, -3, 4, 6, -5, 3, 4, -7, 5, -8, -6, 6, 2, -4, 8, -11, -2, -1, 1, -2, -2, 2, -9, 12, -1, 0, 7, -11]
3235a1J5j0QNj5RJJnMJ0%lnkkMRj0JOo%lORj5JlJ2kj3J3j0Npj4K5j6QKpJKpjN
3282emJ3j1MLpJ4omoJ3OJj0%j0J9knokPqJ1KpKLqPjJ1nOnlmLkk%PJ0j0j3J1Nn
3330GKk2P%QjpJ2rO%j0JJ2nLmOj9RKJRj5QJ1k8J4%kNkLLpN%kQj2J4mKqOqM%nQ
3380FpMjjKLpmJ2JpnJ0k%r%%NpOjn%kNJj4K2lnlQj0NjMKjJnjMN%nOMRlj2O%j1
3434aRkkpj%J3j0NoPpnKJNjj0NJj3QJ0qoJ0mjK%jMpJ9j4J1rMOKLonlLKLj2QqM
3485bPjQNj1j0K1j5J3j8QkKmJ1j7jj2J0PPJj8NOPpj5K1%j3MKnkOmJ3mLJrqK7k5
3530hJ2opNMLj7J7%Oj3K%MoJ8Kmj4QMkQoKmkOrKm%j0JQjlJjLkJ4j5lNQopOpMp
3582a1RJrnJ8j1NOnkKOp%MJnJ5j5Q%J0j3Kj3NJ5Prj0K9rrj0J0NrmKj0PMNj%lO
$$ y = [-11, 4, -6, 2, 7, -8, 1, 2, 3, -2, 2, 12, 12, 9, 4, 2, 0, 4, 13, 3, 4, 10, 4, 4, 1, 7, 16, 1, 2, -1, 11, 9, -4, 9, -1, 4, -3, -17, 8, -8, 0, 2, -5, -4, -2, -9, -10, -5, -9, 4, -7, -3, 0, -7, 7, 1, -3, -9, 4, 10, 11, 1, 1, -9, 10, 8, 3, -3, -5, 2, -6, 5, 7, 0, 2, 5, -3, 4, 3, 14, 9, 15, 10, 7, 3, 6, 4, 2, 2, 9, 19, 9, -4, 7, 12, 7, 9, -13, -6, -6, 2, 1, -6, 6, -3, 3, 3, -7, -6, 6, 1, 4, 0, 6, -13, -4, -2, -1, 8, -7, 1, 12, -16, -2, -2, -4, 1, -1, 2, 5, -2, 3, 3, 1, 9, -3, 11, 7, 9, 1, 7, -1, 3, 3, -2, 6, -1, 3, 2, 1, 3, 6, -1, -5, 7, 8, 1, -4, 6, 4, 4, -5, -5, -5, 0, -7, -1, -2, -7, -7, -9, -4, -3, -17, 5, 2, -3, -6, 2, -8, -3, -4, 0, 2, 1, 2, -3, -4, 0, 5, 5, 0, 6, 10, 19, 16, 4, 10, 10, -1, 8, 6, 4, -3, -4, -4, 9, -1, 4, -2, 5, -2, -7, -5, -4, 1, 0, -10, -5, -4, -17, -9, 1, -7, -13, -3, -7, -8, -6, -6, -7, -3, -10, 9, -5, 6, -3, 1, 7, 9, 12, 6, 1, -2, 1, 3, 6, -6, 2, -6, -2, 5, 4, 12, 17, 6, -4, 17, 2, 15, -3, 5, 3, 5, 1, 12, -5, -6, -18, -8, -1, 6, 7, -11, -6, 0, 7, 0, -15, 6, 6, -7, -3, -1, -6, -8, -2, -6, 7, 3, 6, 7, -2, -10, 17, -8, 4, -2, -9, -4, 0, 3, -14, 3, 3, 9, -4, -2, -2, 2, -4, 14, 16, 12, -2, 6, 10, 8, 16, 10, 12, 8, 6, 12, 3, 5, 1, 1, -9, -8, 0, -1, -4, -3, -4, -1, -3, 11, -4, -7, -2, 6, 0, -7, -1, -8, -4, -11, -2, -1, -10, -15, 3, -8, -3, 3, -2, -4, -2, 4, -3, -3, 1, 2, -3, 12, -3, 5, 5, 15, 2, 4, -9, -4, 11, 18, 9, -1, 28, 19, 10, 0, 10, 15, 6, 2, 4, -6, 1, 5, 10, 9, 9, 6, 12]
3629A2pNj4KJ4rlJ3j6j0PqJ8qj%%KQJj0RNjjkrJ2mjqJ4nOj4LjM%LQKj1mR%kj6
3677hRjJ0oOk1K5j5RmLj5MQj%qNmLj7K0rlJ7pKKKjoJ1j9NRqJ7j9P%kKkjNNlJJ
3726H%JKmjLJKq%%nLKmOrQoJmRj2POj2J1mljnLPj0LjMk%%J3j3NqQpkJ3j5J9mP
3778A2j0mmJ0lqJ1K0j0Jj2kQ%Krj1J7j0RooJ0j2KjMMjKMj2NLrkQj6J5KjmNj4N
3823hMOKPj0n%OoJ3lnKplLLJj0QMomJ5Oj0Rj3Rj3J3j4J0kMj1J5j9PmJ3j1kJ9j9
3868fMpJ3llMopPMj5nK1k2J9j2J3olJ9qLk0J7KMmJ0j5J0KpjqK0pKj0QklJoMlJ5
3914A3j4LJ2%j2pMOkJ1k3J6Qj6OlmLkLqPNj3jMKkOj6NJ0RlJkkJ1j3J0j2NMmKK
3960IQk2LRmL%R%j1%j3K1nnOkMlJqQplqJ5kpOoMpJ9j3%nMkMnM%j6J7qJ6j8J1L
$$ y = [12, 5, 10, -4, -2, 12, 3, 0, 13, -3, -13, -6, -14, 4, -4, -5, -5, -5, -3, 5, 6, -4, 5, 10, 9, 8, 6, -3, 9, 5, 4, -4, 10, 5, 11, -3, 0, -1, 3, 3, 6, 14, 16, 5, 1, 10, 10, 8, -8, 1, 0, 10, 4, 10, -11, 14, -1, 8, 4, 7, -8, -4, 4, 3, 3, -5, 0, -4, -1, -18, 2, -7, -10, 7, 0, 2, 4, 6, 5, -1, 10, -9, -4, 5, -3, 14, -5, 2, 2, 0, 2, 0, -1, 4, 9, 6, 7, 8, 8, 9, 11, 7, 6, 9, 10, 12, 4, 4, 4, -1, 2, 4, 0, 6, -3, 5, -1, 0, -4, 5, -7, 0, 6, -6, 5, 1, -2, -3, -8, -5, 2, -8, -5, -6, -2, -4, -4, -4, 9, -4, 1, -7, 1, -6, -8, 5, -10, 9, 5, 12, 2, -2, -6, 4, 1, -7, 4, 24, 14, 15, 3, 1, 9, 9, 11, 2, -9, 8, -2, 7, 1, -5, 5, -7, -5, -6, -2, 2, 1, 3, 7, -5, 0, 3, -6, -8, 0, -16, -1, 1, 0, -4, 1, -13, -8, -4, 2, 4, 11, 1, -4, -4, 2, -4, 9, 6, 1, 3, -4, -7, -4, -1, 0, -10, -2, 2, -4, -8, 7, 13, 3, 12, -1, 8, -5, 8, -6, 4, 2, 6, -5, 10, -9, -2, -6, 7, -4, -6, 13, -6, -2, -9, 4, 1, -2, 2, -4, -11, -4, 0, -15, -20, 1, -21, -2, -14, -1, -7, -10, 9, 1, 4, -16, 1, 3, 7, 3, 13, -2, 8, 10, 3, 2, -6, 14, 7, 9, -1, 7, 5, 2, 3, -3, 1, -2, 13, -1, 2, 14, 14, 2, -5, -1, 5, 3, 14, -9, 7, 15, -1, 5, 2, -2, 1, -1, 2, -6, 1, 6, -7, -8, -4, -2, -4, 2, -14, -9, 1, 10, 7, 8, 6, 4, 15, 2, 12, 0, 5, 9, 5, 7, 9, 17, -5, -2, 7, 3, 6, 6, 15, 15, 4, 4, -9, 12, 7, 2, 8, 6, 10, 7, 8, 0, 8, 1, -2, -10, 5, 3, -4, 2, -4, 0, -7, 12, -1, -1, -6, -2, -4, 0, -5, -1, -1, -17, 0, -8, 8, -10, 1, 4]
4009Dn%RmnjJ0oPmOjrJ2k4J3kK2qnpQnQo%KJN%loj0J5j1Qkj0mL%ONMnJpKQk3R
4060eKJ1qljLKMj3J2jLqJ7rjNj4MMRj9OPlJ4mnLrQOpqjpJ2j0OKnj2RkJ6nj1Mj1
4109a3J1mQO%kj1MnJ1jqLN%kj0K2j9OOj0LjPpKoKO%nPJKkJ0qJ%km%J3j3LoRj4
4158eJ3j7JJ2nmqK5j4nJ0j5J1pJ2kNj8LMm%OjpJ2mkJ0oKRj7J2oQj0QmkJ2jjj0
4202@NLPrj1J1OnkjoJ0L%qJ8qj5LLklJ3mj7J0NJ1k0%olOjJ%J9j9MkLlJ1pkpNo
4250a0K1Rj0jKp%J0k3J2j3J1Oj0JRnJNqKNmPj6RlqJ6mLlkqQJnPRjnl%Pk0nPPK
4299Cj3lJ1jj0J2%J0qJJ4oqqJ1MjQj1NkJoPOj0KKJMJoJM%qpRj0NpJ8k0KPqJ0K
4347H%j1O%kR%j2NrrJ2JMpjQkjpOOJJJ0j8J1j4J3kqJNJ0roJ8j3pNKROLj1jJqr
$$ y = [4, -1, -1, 8, 4, -1, -2, 8, 2, 9, 5, 11, 10, 1, 13, -11, 2, 0, 22, 14, 9, 2, 10, 5, 13, 7, 7, 9, 10, 15, 15, 12, 6, -4, 11, 0, 8, 6, -4, -8, -5, -5, 1, 6, 10, 5, 6, -1, 1, 9, -14, -5, -3, 8, 0, -3, -4, -1, 1, 5, -8, 4, 3, 6, -2, 15, 6, 5, 10, -4, 0, 4, 13, -6, 0, 7, 4, 18, 14, 9, 12, 3, 11, 17, 10, 2, 1, -6, 6, -4, 2, 4, -1, -13, -4, -6, 10, 5, -6, -2, -13, -2, -6, 2, 8, 8, 6, -5, -1, -6, 5, 4, -4, -1, 4, 4, 2, -8, 14, -5, 1, 7, -3, 0, -1, 6, -1, 1, -5, -3, 3, 3, -2, 5, 6, 8, 6, 16, 8, 9, 9, 7, 3, 3, 16, 3, 6, 0, 9, -5, 8, -9, -8, 4, -1, -5, -13, 12, -2, -7, 3, -12, -1, -8, 4, 2, 7, -11, -8, -4, -8, -8, -2, -3, -10, 2, -2, -4, 6, 0, 2, 11, -6, 6, 0, 8, -2, 6, 2, 0, 12, 11, 10, 0, 5, 8, 15, 6, -5, 6, 12, 7, 5, 4, -2, 8, 11, 11, 3, 21, 13, -2, 1, 4, 2, -1, 12, 8, -9, 1, 6, 17, -3, -3, -9, -12, -6, -7, -6, -6, 13, -6, -2, -4, -1, -4, 7, 0, -2, -9, -4, -10, 11, 20, 10, 9, 11, 4, 4, 14, -9, 3, -10, 1, 7, -3, -2, 7, 2, 3, 8, 0, 2, 7, 3, 10, -6, 3, 0, -8, 8, 4, 7, 4, 2, -6, 2, 3, -2, 5, 14, 13, 8, 5, 5, 12, -8, -13, -6, 1, 3, -10, -13, -2, -3, -13, -1, -1, 9, 1, 2, 16, 10, 2, -6, 5, 9, 8, 16, 5, 10, 8, 9, 3, 10, 16, 6, 8, 10, 11, 15, 16, 10, 11, 15, 15, 7, 0, 9, -1, 4, -3, 15, -5, -3, 4, -4, 6, 8, 8, -3, 3, 3, 1, 10, 10, -2, 3, -6, -15, -3, -2, 2, -5, -6, 2, 0, -1, -8, -2, 4, 5, 6, 16, -2, 9, -5, 8, 6, -2, -1, 4, 14, 5, -1, 17, 4, -3, 2, 4, 13, 19, 22, 11, 10, 11, 3, -6]
4396fNoQnLNJrj6J6mJ2rKLLm%njKPoJ3j8J4pKNj%jQj5J6lj3J5j4OJ0kj3PLnNm
4444DK0j3jLkMj1pJ5olNjj1LQJ1j2OrJ0pj0J0qN%LjqkkPkj3J3mj0PJ8j5QLMMr
4490DNmoRj7RNRk3J2RnnkQnMQkqMrJ0j5J1j1K1rk0J8Kj4PjPLj4jjMRj0KKmKoQ
4538@MlpJpK2lmloJ%NMjRj6MjKQk0K0rJ0pNoNnmMOolmmOoQMnPLk0MJ2Lj4OlKL
4591APj5KJ2k2J4nNKj1MJ4j4lMNQknRkpJ3%j0Lkj3RJ6mrLMoRj0QkPj0nPmMojm
4639bNkKOqJ2j3%J1j0%lJ1pPploJ5nj2QJmQmNpLLOmj8NJ3Mj3Pk1K1MOj3MQpOk
4687A0KLrJkKmjJnJ3j3kjL%mPJOqJjJ1pkplJ0j3NOmRpMk%PJOkj5JJ5j6%MOj0N
4738BKnLNmKJ1qLj3QpJ0k0K0qMJj2KjmkJ3rlQJj3J9nomKJ1JpMrMmM%Qjj1QnJ8
$$ y = [-6, -1, -7, 1, -4, -1, 4, 5, -4, -20, -4, -8, 4, -5, -3, 0, 3, -1, -1, -6, -7, -5, 2, -4, 9, -9, 5, -2, 0, 5, 4, 4, 3, 11, -4, 12, 9, -4, 11, -3, 3, 13, 11, -2, 5, 8, 3, 8, 4, 24, 11, 10, 13, 11, 15, 4, -3, 12, 6, 3, 8, 7, -4, -1, 7, 18, 6, 12, 3, 13, 6, -4, 6, -2, 3, 3, 6, 5, -3, -5, -7, 0, -2, -15, -2, -6, -16, -9, 9, -6, 2, 5, 9, 13, 4, 9, 5, -1, 8, -9, 0, 5, 14, -9, 3, 12, 7, 2, 0, 8, 3, 7, 15, 13, 5, 9, 0, 10, -5, 6, -5, 16, 7, -13, 5, 7, -7, 0, -1, 6, 9, -5, -6, -7, -3, 6, -4, -2, 0, -4, -2, -8, 0, 4, 1, -6, -5, -12, 10, 7, 3, 0, -6, -5, -5, 0, 4, 3, 12, -4, 0, -1, 1, 9, -11, 9, 0, 10, 3, 8, 2, 7, 2, -2, 2, 8, 2, -1, -5, -9, -3, -9, -1, 3, -2, 5, 8, -12, -8, 4, 7, -7, -1, -4, -2, 1, 8, -7, -5, 7, -15, -1, -6, -1, 1, -10, -6, 8, -6, -9, -5, 0, 8, 6, 1, 10, 8, 1, 14, 14, 4, 7, 5, -8, 1, 17, 13, 4, 7, 11, 5, 14, 4, 12, 10, 17, 7, 2, 9, 5, 9, 3, 2, -2, 3, 1, 3, 9, 1, 13, 0, 0, 11, 1, 1, -2, 9, 2, 9, 2, -1, -7, 8, 3, -9, -1, 0, -4, 4, 0, 5, -2, 1, 4, 10, 6, -12, -7, 6, 10, -3, 4, -17, 4, 8, 14, 1, 5, 13, 6, 12, 10, 12, 15, 6, 7, 5, 7, 3, 2, 3, -2, 11, -2, -4, -5, -2, -2, -6, 1, 2, 8, 0, 1, 0, 11, 4, 2, -5, -8, 2, -11, -6, 0, -4, 5, -2, 2, 0, 0, 7, 8, 14, 12, -3, -2, 13, -3, -3, 1, 7, -3, 2, 4, -1, 2, 7, 3, 5, 16, 8, 11, -2, 6, -1, 9, -11, 9, 1, 5, 6, -6, -4, -5, -9, -11, 2, -7, -10, -2, -1, -14, 5, 0, -6, -10, -8, 3, 4, -3, 1, -8, -4, -8, -4, -4, 4, 3, -8, 0, -5, 13]
4787A3j5JPpJ6Lj3j3J6Lj0qJ1%KqJ1njO%Nj6OJ0j3RkmLpj0J5llMMJjj2NlNooJ7
4833Gj6Knj0J5LljJJ1rpJ2J8j5lkJNOpjNkokQKMlqJ0mpKJ1j7PMNrkLoMLjmJ4j6
4883cMkjQqO%j0M%lJ3pllj0J5rJKJ2j7J5nQnMoKLJoPK%jklOqOJ2j1LM%q%jjNp
4935CJ0pon%oNQNqJKnMKOj5J5qnJ0jqMNj6RJ5pj5NpRNpQqKPNnNrmnKJ5lJQrPj2
4988BKkLMj6OJj2%J7j4kLPpjLJ0mrJ0mlRp%kj3RJ1oPljPLlmQrLLJ%j6J5jj0K3
5037A8j6KKm%PpkJ0j2L%LjPj6J4Kj2JmkQoMJj3KJ6j2mMQr%kpJ3MoLJ2k6J4j5M
5083a4OK0j3nlJ2Pj0MkJj1J5pMjkjNNKj0kQ%j4%J0Nrn%NlrRkM%mqJ1nJ6j7J6r
5130ajQj3JJ0JOj1rLJLJ1lolJ4KrLj0OjJnNNJNj4NOro%J3n%PqLKPj3onQKpllQ
$$ y = [13, -2, -1, 6, -1, 15, 18, 5, -8, 8, 11, 1, -7, 4, 4, 6, -2, 9, 4, 3, 9, 9, 14, -2, 4, 14, 1, 10, 8, 4, 7, 0, -10, 5, 2, -1, 3, 7, 8, 7, -5, 0, -3, 2, -4, -10, 7, -9, -7, -12, -22, -7, -4, -7, -8, -7, 4, -5, -12, 0, 18, 3, 0, -2, -1, 4, 10, 3, 2, 7, 5, -1, -3, 5, 7, 11, 8, 0, 10, 6, -1, 1, 12, -5, 2, 6, 11, 2, 0, 3, -3, 1, 4, 3, -1, 13, -3, 1, -1, -2, 6, -2, 4, 4, -6, -2, -2, -5, 8, 1, -2, -5, -15, 0, -9, -8, -6, 6, -11, 4, -1, 7, 2, 6, 0, 2, 5, 6, 0, 7, 9, 9, 8, 6, 3, 9, 1, 7, 19, 8, 11, 15, 15, 7, 7, 6, 5, 10, 3, 13, 6, 0, -5, -5, -11, -6, 2, 7, -1, 0, 2, -3, 1, 3, 9, -6, 9, 1, -4, 6, 5, -3, 1, 6, -10, -1, 14, 7, -8, -3, -10, -1, 4, -3, 5, -3, -1, 6, 11, 6, 11, 2, -2, -7, -5, 10, 7, 8, 16, 7, 14, 2, 4, 2, 5, 9, -7, -1, 0, -12, -12, 5, -9, -11, -8, -1, -8, -9, -6, 4, 0, -9, 1, -3, -6, 3, -4, -4, -6, -19, -10, 1, -5, 2, -1, -2, 5, 8, 5, 1, 9, 0, 3, 6, 7, 7, -9, 6, 5, -5, 18, 2, 4, 6, 2, 2, 9, 2, 0, 10, -2, 1, 1, 4, 3, 10, -6, 8, 10, -2, -1, -5, -7, 1, -5, -1, 0, -13, -11, 5, -7, -11, -7, 1, -8, -8, -10, -17, -4, 0, -6, -3, 9, -17, -3, -18, -14, -8, 12, -1, -6, -9, 3, 10, 0, 4, 2, 3, -8, 7, 0, 4, 3, 1, 0, 5, 10, 12, 2, 0, 8, 8, -6, -6, 4, 9, 0, -5, -5, 0, -3, -12, -3, -5, -1, -1, -5, -13, -2, -7, 9, -8, 8, -1, -2, 6, -7, -6, 4, 5, 11, 0, -9, -6, -5, -2, 9, 6, 0, -3, 11, 13, 4, 7, -3, 3, 2, 3, -2, 3, 8, 9, 14, 0, 5, 11, 2, -4, -4, 9, 4, 4, 11, 3, 6, 8, 15, 2, -4, -9, -1, 1, -6, -9, -12, -4]
5182dJ0kMj2Qj%kJj1J2j4J0KrNoJJ1nKKpRkOoNKkj5JNMJLoJKNknMNlj%j0J3jj2
5233dJ3j1lNOj2LLj0J7j1NQkLj6PmlPMqJ2qj%rMMLLLojJ0j6J6j2PQj5%KKjjOm
5281CJ1jLoj3J4J0k4K8j3j7J3j0Pj6J4njNj2%LrJ0OlpLLQj0J0pKmljJORNk1QN
5325DNoMnlJ9rnLNOpJoPk2J0%J2rRmJ6k3OpQj3J3mMlqPoj%J2oqJ2Jj1Qj4%J7k
5373GJj4kmPJkmQJ0j7QMNJmnjJ1KrrJ8j5OjpKOPj0lJ9j1MkmKjjJqJ1qMKj0J0k
5422CQNj1onNqNMo%%KmpPJ1j2KKlLJ3Nj5J6NqK%nKoRKNj4KKjoLj1RkLPqoJ2oM
5474Hmj2J3lj0LPnmRjkKPkpLMnPnpkOpj2J4mJ3Qj9QQj6LJ7JoPk0J0MjqRlJ0%j3
5523CPjmNj3JQJmPLpj1NpOLolQNj8RRjj0MNKoPr%nJ0j5K0NmooJJ5Kk0K3qopJ8
$$ y = [-4, 6, 4, 8, -4, 4, 3, 3, 1, 2, -9, 3, -11, -1, 1, -8, -3, -9, -8, 3, -2, 0, 2, -5, 4, 2, 8, 2, 7, 9, 7, -8, -7, -2, 2, 3, 6, 0, 1, 3, 8, 6, 1, 5, 10, 7, 6, 6, -4, 9, 8, -4, 9, -2, -5, 0, 6, -6, -3, 0, -10, 7, -4, 1, 9, 7, 10, -6, 1, -3, -6, 1, 5, -3, 9, 1, 0, 0, -9, -5, -1, 2, 5, 8, 2, 1, 11, -5, 11, -1, 6, 14, -1, -1, 1, 3, 2, 1, 7, 3, 14, 13, 16, 10, -3, 11, 21, -3, 25, 12, -5, 8, -2, 5, -11, 3, -2, -3, 2, -10, -10, -7, -16, -6, 0, -3, -10, -7, -4, 4, -6, 4, -3, -1, -5, -8, -9, -8, -2, 7, 12, -9, -1, 4, 9, 3, 7, 2, -1, 18, 9, 4, 7, 12, 18, 11, 12, 6, 13, -9, 1, 1, 13, 4, 13, 9, 25, 2, 8, 1, 9, -4, 9, 5, 9, 6, -2, 5, -1, -2, -2, 10, 4, -4, 8, 9, -2, 6, -8, -8, 9, 7, 8, -6, -8, -12, -5, -4, -6, -10, -2, 8, -9, -1, 3, 8, 9, 5, 0, -1, 10, 12, 3, -6, 12, -3, 3, 2, -5, -3, 3, 10, 0, -3, 16, 5, 9, 7, 3, 5, 4, 3, 4, -4, 7, -1, 3, 5, -5, 5, 3, 11, 16, 5, -1, -6, -1, -9, -4, 0, -6, -6, -6, -4, -8, -15, -8, 3, -9, -7, -5, -8, -5, 8, 13, -2, 14, 19, 11, 13, 13, 8, 10, 4, 13, 15, 20, 6, 8, 10, 9, 3, 6, -5, 4, 2, 5, 12, 4, -2, 10, 4, 8, 4, -8, 5, 2, -8, -5, 2, -3, -7, 2, 1, -1, 1, 8, 6, -1, 2, 6, 1, 8, 3, -4, -6, 0, -7, -19, -5, -9, 4, 12, -7, 1, 9, -7, -4, 13, 14, 8, 15, -5, 5, 9, 8, 0, 9, 6, 16, 16, 3, 10, 9, 5, 10, -3, -2, 6, 7, 3, 10, 13, 6, -5, 0, -7, -1, 2, -4, -7, 1, 6, -12, -3, 6, 5, -5, -1, 4, 6, 0, 7, -2, -2, -7, 3, -12, 8, 13, 9, 3, -3, -2, 13, 15, -5, 18, 10, 4, -3, 15]
5573A5j2MjMkoLKJ1nnOj1OJ0j1kJNj0Rj4JlNJqLpJ3j1QJk%pJ4j7J3nrJQJ1rkJ0
5620FPj1NJlJ7j3JqJ4nj0J0qlNkj1MJ3mPrMpPlJ1qKmMMj5J0omkJ0knoPjOJ0j5
5667@Qj0OpQj0KKKLP%j3NJJnPKMqlRnJjjLlj3J5j3MJ2kj5RlLJ3j1qJ4jj4%Plp
5716hRkL%lRj2QJ1rmQj2KJ0mj9RrJ3Jj0MpJ5oJ5oj0PPJLnj0KJ0pj5J2J7j5J4o
5760A1qj2J3mKMmpJMmLLrNrJ5rJ%ROk4J0mJ4kMj2llJ7j6NJ0oqJoJ1joQOj2NQm
5808CpNRj1J2nMJ6k4qK1nJmmNpJ1Jj1%L%joPk%j4J0Pj0oQKmORp%Qj4J6pqLQrJ
5857BMJ2j3Jj5J5kNj0J6l%%qQj4jLqRMMj0mJ2jnMomJ2KrJL%mpOkMQr%j2KL%P%
5907@mJ3rj0PPmj3J2lMnJ7j0pQPr%jLMNj2RmrRoRj0J2rJ6j7K4j8OkqRJ3j1qlp
$$ y = [15, 3, 7, 6, 10, 8, 2, 5, 7, 18, 13, 8, 14, 3, 9, 19, 8, 6, 7, 12, 2, 11, -3, -2, -5, 0, 1, -7, -4, -11, 2, -9, -1, 0, -2, -2, -9, 5, -12, 1, -4, -13, -12, -4, 7, -2, -4, 6, 13, 2, 7, 8, 5, 22, 9, 10, 2, 16, 11, 1, 11, 3, 0, 5, 3, -8, -4, 9, 5, 12, 3, 7, 0, 7, 4, 15, 7, 9, 5, 9, 13, -2, 8, 2, -2, -4, 6, 4, -1, -7, 0, -1, 5, 15, 0, 8, -2, 4, -3, 5, -5, -3, -1, 1, 4, 11, 11, -2, 3, 4, 5, 0, 7, 9, 13, 5, 2, 11, 6, 7, 6, 5, 8, 5, -8, 7, -6, -2, 10, 8, -7, 2, -1, 2, 15, 4, -4, 10, 9, -5, -5, 2, -1, -8, 1, -1, 2, 2, -1, 8, -4, 4, 15, 6, 2, 10, -2, 0, 10, 6, -13, -4, -13, 0, 1, -9, -5, -12, 3, -3, 12, 6, -4, 3, 10, 11, 14, 9, -1, 1, 11, 4, -11, 1, 18, 3, 17, 11, 3, -9, 4, 0, 2, 6, 2, -5, -4, 0, -4, -1, 2, -7, -2, -11, 4, -5, -4, -4, 5, 11, -13, -3, -7, 7, 5, 9, -3, -6, -9, 8, -8, -3, 7, 1, -7, -6, -12, -1, -2, -8, 0, 6, -6, -1, 7, 3, -4, 1, 10, -1, 11, 6, 10, 26, 2, -6, 15, 10, 11, 7, 3, 8, 1, 12, 13, 2, 2, 5, 5, 4, -2, 5, 3, 3, -11, -1, 6, -4, -10, -2, 0, -4, 2, 11, 4, 4, 12, -2, 14, 7, -1, 2, 10, 1, 2, 6, 18, 5, 6, -9, 6, 4, 9, -1, 15, 12, 12, 12, 4, 12, -2, -3, 0, -8, 1, 5, 9, -1, -5, 7, 6, 1, 5, -1, -5, 7, 9, 0, 1, 4, 4, 0, -7, -1, -3, 1, 9, 0, 0, -12, -10, -7, -7, 0, 0, -4, 9, 0, -10, -3, 4, 0, -13, -1, -4, 0, -5, 12, 2, -5, 3, 10, 1, 1, 0, 3, 7, 12, 0, 9, 5, -4, 5, -1, 8, -2, 10, 1, 17, 0, 24, 6, 12, 10, 2, 11, 24, 13, 5, 2, -5]
5953eRlMj4J0j2JJ6mk%KqmJ6k0K3kj4J0Lj4OKj1J2%jJ4j9J3Lj0J1qNmmOLj1KN
5996FNoK4k2jpKKmJ6j3MqOokKj1J7oqJ2qJ3j7R%lOnJqJ0j9J8j0LQomJJ3j0J2j5
6041iJ1okRoMNrJ3o%KoP%pRj5J0KOk%mNj3PmJoj0K3j0mjJ2rk%LJJ5qpLmnQjmK
6092b%lJ1j2NJ1j7J3jJpJ1o%M%Kj3J0jmkMnMlOmJ1j0%jKj1K1j1N%j1J4j2J%Ln
6137bmpK0pRj3nJ5j1KKNNpOj0PrLKqJ5MpL%rJ0j3J3nj1J7rJ5j3NmlJ2j9PPlNj1
6183aJ2lmK1k5KOlol%jPqJQqJNrJ9k0J2pKRlnKmJnPqJ0nJ6Lj0J0%Lnj1NM%j0M
6232Fj1oJ9Ojj0kkJ1JMj8OlJ3j1JnNomjJ5j3J%J4qjnNJL%pJ2j6OLj0LLLpJ1KJ
6279HjMn%mPjj0MMJ2j2rJ7%j3J3j0J3j0ljkJj3J4Rj0NmPnjJj7KPNj0J5pKj1QL
$$ y = [-5, 4, 1, 5, -9, 1, -11, -10, 6, 2, 0, 0, 2, -6, -10, 6, -14, 9, 7, -7, 3, 6, -8, -2, 0, -11, 1, 1, 0, 14, -5, 8, 11, 1, 12, 4, 9, 5, 1, 7, 10, -1, 1, 6, 11, 5, 29, 7, 6, -1, 1, 3, -1, 15, 2, 6, -2, 4, -2, -4, -2, -13, 4, -2, -10, 2, -6, 7, -10, -1, -1, -4, 2, -3, -2, -10, 0, -19, -1, -11, -8, 0, -6, -10, -9, 4, -6, 6, -9, 2, -4, -6, 3, -3, 1, 6, -3, 10, 4, 4, 6, 0, 7, 7, 0, 9, -6, 4, 6, 12, 10, 10, 6, 11, -2, 5, 1, 2, -4, -14, 9, -1, -5, -6, 6, -3, -5, -5, -2, -1, 14, 6, -1, 2, -2, -7, 1, 0, -4, -2, -2, -5, 6, -6, -1, 10, -7, 6, 5, 6, -1, 10, 4, 4, 8, 8, 10, -3, 7, 6, 2, 0, 4, -1, 3, 0, 6, 2, 13, 3, 3, 2, 4, -7, 14, 3, 8, 8, -3, 11, -1, 0, 0, 3, -2, -6, -13, 7, 0, 9, -4, -9, 6, -5, -3, -1, 4, 9, 2, 8, -2, 5, -4, -1, 1, -7, 8, 12, 5, 8, 8, -1, 9, -4, 9, 4, -7, 10, 1, 16, 3, 8, 4, 1, 13, -6, 1, 8, 5, 10, -1, 11, 8, 4, 25, 0, 2, 8, 5, -1, -4, -4, -5, 2, -6, -5, 3, -5, -4, 1, -8, 11, -9, 3, -4, -2, 7, 4, -1, 1, -3, -2, -7, 0, -8, 2, -3, 13, 16, 6, 16, 16, 19, 14, 3, 8, 12, 12, 2, 6, -5, -11, 8, 14, 13, 3, 1, -1, 10, 11, 15, -3, 3, 0, 13, 2, 3, -2, 3, -3, -7, -8, 7, -6, -5, -5, 9, 1, 0, -5, 0, 1, 4, 4, -3, 9, -7, -1, 2, -8, -5, -2, 1, -6, 5, 7, 8, 7, 11, 6, 6, 2, 9, 8, -2, 2, 6, 18, 6, -3, 14, 14, 1, 14, 4, 17, 7, 4, 3, 1, 2, -11, 3, 12, 2, 7, 3, 10, 5, 4, 5, -12, -10, -3, 2, -8, 7, 0, 2, -9, -1, 2]
6324BKrJ3j%j1J1qOj1QjKkM%qJ8j5MJLnQrJ4jj4%QlNPqoKOnKlJj1K3k1%LjNj5
6373a0K0j6MJmlNmJ3j5PMnkRk%j5NkRMKj3%J5mj5K6j3MQ%j6J6nJOoJ1j7NmlKL
6419FMpJ2lqKjmQlOj6kkOMkqLj7J8QjOj4J1ljmJ3rJJ0omj1K4k5J7qj1RnLRkQJ
6467A2loolJ3l%Pk3J8j0PJnRNj0J0j6K0j4Oj0oqJ7lmJpJ6j4J3j2O%kJn%J3rJ0
6510Fljj0NJJPJ%pJJ3j0MMnRmp%lkKJ5j1Jkj6qJ5LQj2J4Qj6kmNNj2J0lkkOrJM
6559bMlRj5QpJRqNjqJJ0llMjoJ8%j3MJ6pj0J2KnMppJJRolnLJ8j9LMLmqJ1j5J0
6608DJnJ2j5Oj1%P%%noK3pQjnnLKj0JJ2nj2J7%j0RkljlKJ4pLljjOJqOj0J1j0k
6656@NJ1j1j0MNrJ0qJ0nMokmKKlj1J1KmNQo%oJ0nKJ3qj1PpMLqRJpJ8j3qJ3nKJ
$$ y = [2, 4, -5, 8, 7, 7, -4, 7, -1, 5, -6, 2, 1, 3, 1, 5, 5, -3, 15, 0, 4, 5, 8, 3, 11, 2, 16, 15, 1, 1, 9, 6, 11, 18, 10, 4, 6, 12, 7, 9, 6, 7, -4, 19, -2, -2, 1, 0, 5, -10, 10, -6, -2, -1, -5, -8, -3, -7, 6, -9, -2, 2, -3, -5, 4, 2, 2, -13, -8, -10, -1, 3, 5, -8, -8, 7, 3, -12, 14, 1, 5, 13, 13, -3, 13, 8, 9, 15, 9, 20, 3, 8, 4, 1, 3, 6, 10, 3, 15, 12, 4, 6, 5, 1, 9, 6, 12, -4, -6, -8, -2, 2, 0, -8, -5, -22, -4, 4, 3, 9, -5, 6, 3, 2, -2, 11, 2, 3, 13, 7, 3, -8, 16, -9, 8, 0, -11, -2, -7, -4, 5, 3, 11, 12, 9, 3, -3, -6, 7, 4, 4, 11, -12, 6, -4, 3, 4, -1, 8, 13, 3, 13, -3, 17, 3, 9, -1, -7, -15, 2, -1, -5, -4, -11, 5, -9, 4, -8, -2, -2, -4, -3, -8, -8, 5, -4, 6, 3, 2, -8, -3, -2, -1, 6, 7, 7, 0, 1, 14, 4, 8, 12, 7, 16, 12, 5, 5, 2, 0, 2, 17, 6, 7, 5, -11, -19, -4, -1, 7, -5, 9, 17, 1, -1, -5, 0, 5, -7, 3, 0, -2, -4, 2, -7, -6, -2, 2, -1, 8, -7, 1, -6, -5, 4, -4, 1, 0, -8, -7, 3, 0, -3, 1, 0, -6, 12, 12, -1, 3, 19, 12, 2, 14, 16, 11, 15, 8, 1, 2, 3, 12, 6, 3, -2, 1, 19, 0, 3, 7, 10, 6, -2, 9, -6, 4, 5, 0, 12, -3, 3, -8, -8, -1, -1, -1, -6, -12, 11, 4, 12, 11, 6, 1, 4, 6, -4, -3, 9, 4, -8, 9, 9, -1, 8, 6, 3, 2, -1, 1, 15, 8, 11, 8, 7, 6, 12, 13, 5, 11, 1, 12, 2, 0, 5, 16, 5, -5, -1, 4, -5, 5, -3, 7, 2, 6, 0, -2, -6, -4, -2, -5, -16, -5, -3, -7, -2, 6, 0, 0, -6, 4, -1, 1, 14, 6, -5, 2, -5, -1, 2, -6, 3, 4, -3, 15, 2, -6, 7, 2, 4, 5]
6704E%Ojj5Qj3J9Rk2j%LPpKPkLoJ4qqjpLJ5qMmlj4J4j3J4OpLPqMKonJoJ3JnnO
6754AmLJ3k3K3kJLmj2RmRlMj6RkOJ2k3MQj3jJ1npRJpNK%j3MmLN%j2J4qMJrMlN
6803bJ3qPKrJ0j7NNLJj2MKlJ5rqQOrJ0r%Rk1J6j6J5ooJ3opQrJ3mn%JONlknLQp
6852Ek%loOMnRjnpQkO%rlJ4j9JJ0LKk0QLJ5j2Rj0RPmJ0j7PKrJ7j5J0j8kRj1PJ2
6899A3j2qJ9ppLloPLOJ0j6K%nrJ0jRj0kjPKMj7RNmLjLj7J2QMrMm%PNnllQkkLq
6950DMLlK%Kj4J0jMmj0RmnLkpJ6j2J6j8KOoOlPj3Rj0J4Mk3J7nOQrmnmJ1JJJj4
6997a0NlJ6nQlJkKJpLj4J7j0KJ3j5%QrlPmQj2LPMk1J2J0qk2J4mJ1qON%j3K0Mj2
7042BLrOjoJ1%j1K0j8J1k1J2J1knqJ7j4Q%J2jj1J2mj7J0j0J9pqRmoNJ0j1kQkO
$$ y = [5, 5, 11, 10, -5, 3, -10, 9, 18, -4, -5, -5, -2, 5, -2, 0, 7, 5, 8, 2, 16, 8, 0, -1, -8, -5, 10, 2, 6, 2, -1, -15, -1, -14, 0, 6, -1, 2, 9, 1, 5, 7, 1, -4, -3, -9, 4, 5, 0, -5, 1, -3, 0, 13, -10, 13, 11, 12, 15, 11, -1, 8, 4, 13, 10, 14, -2, 7, 5, 11, 23, 0, 4, 12, -1, -2, 9, 4, -3, 6, 7, 0, 5, 7, 7, -6, -2, -6, -3, 2, 2, -10, 4, -4, 0, 1, -8, -4, -7, -2, 11, 3, 10, 12, 3, 13, -4, 1, 6, 9, 10, -2, 2, 4, 1, 16, 7, -1, 7, 13, 4, 14, 5, 5, 14, -7, 9, -7, 8, 2, -4, 9, 3, -4, 4, -5, 8, 4, -1, -1, 0, 6, 11, 8, 6, 1, 4, 12, 5, 3, 3, 0, -6, 0, 4, -1, 8, 7, 2, -5, 3, 1, 7, 7, -2, -5, 9, -10, -9, 1, 4, 6, -14, -6, -3, 12, 0, 9, -1, 8, 15, 11, 21, 4, 11, 13, 4, 21, 6, 16, -2, -4, 5, -6, 1, 13, 1, -7, 12, 5, -2, 1, -2, -8, -1, 2, 8, 18, 2, 4, 4, -1, -10, 0, -1, 8, -2, -4, -5, 2, 4, 8, -9, 0, 5, 1, 4, 3, 6, -11, 1, 9, 13, 4, 8, 4, 4, 11, 16, 11, 8, 5, 13, 11, 9, 12, 4, 8, 11, 8, 10, 10, 12, -2, 8, 7, 11, 7, -3, 6, 2, -3, 0, -2, -9, 7, -5, 11, -7, -5, 1, -5, 1, -2, 5, -8, 1, -9, 5, 9, -14, 3, -2, 4, 12, 3, -1, -6, -10, 1, 2, 3, 4, -10, -5, -8, 8, 3, 11, 8, 9, 7, 9, 10, 3, 6, -8, 9, -1, 1, 14, -1, -1, 7, -2, -5, 2, -2, 6, -6, -3, 4, 8, -13, -1, 9, 1, -21, -7, -11, 0, -8, -2, 3, 3, -10, 10, 14, 2, 5, -4, 2, 1, -5, 6, 6, -5, 15, -3, 8, -13, -1, 10, 8, 3, -5, 12, -2, 6, 6, 18, 17, 6, 18, 14, -3, 7, -3, 16, 9, 1, 10, 6, 0, 5, 15, 4, 2, 10, 8, 14]
7084A4p%j%qoOKPnj2NmKnMmK0j%nJPmljLjOojoJ5J2k1RljMJj1Rkj2RkoJ%LNlq
7137dJ0jjQj2Mj7K3j6J3Lj1KlLkQj1J%QokLqLPJlKrJ3kqJ1npJ2%j1QmJ8qmJMK
7185A3Pk7PMjJ3j1KrMrNJJ1kLqLnjkJ6j9R%oNj3J7j0jlJ2%MJKmj0MkPlqLRNoL
7234A0jpmJ0%jkJ0lloNjj2J3oOKqkMQj0J0j9RqjPjrJ1rPQmj2J1j2J6j1JJ0jrj3
7280a7J1oJ7rNnOqJ2j2J0qNlkN%JNonJ3NrMpjJ7j2JqJ2j1Pp%JkOpMOj1NlkJ6j0
7328CqmnPjPlj5J6%nLJ0j7J4L%j0J1nnkjJ3j0Mm%%nMOJ1jOjmj0NlrJKPq%OJ1j1
7377CQKmpnJ8j8NLmJj1R%rPkj1NNJ0nRrmmJ2KLNj7JJ1mklJ1oklLPLkMpOOoj0P
7428A1%j9J1J2j3loJ2jnnRKqJ2j1J2j2MkqMJ1n%r%J2JqJJ4k4J0oJ1moJJ1Jj0%
$$ y = [14, 7, 7, 6, 6, -2, -8, -2, 0, 7, 2, -10, -5, -9, -7, -12, -8, -12, 8, 7, 7, 2, 3, 10, 6, 3, 2, 5, 4, 10, 4, 3, -3, 12, 24, 3, 12, 9, 8, 12, 13, 2, 11, 9, -3, 6, 4, -2, -1, -1, 2, 7, 4, -4, 6, 5, 4, 12, 0, 4, -13, 10, -6, 7, 10, -1, 1, -2, 1, -1, 7, -4, -3, -3, 5, -1, -3, 0, -8, -5, 2, 3, 0, 2, -7, 6, 4, -4, 7, 2, -5, 7, 7, -4, 4, 0, 18, 10, 6, 7, 11, 13, 20, -7, 0, 4, 3, 16, 5, 7, -2, 2, -7, -2, -1, 10, 8, 11, 3, 6, 1, 0, -2, 14, -5, 4, 4, -2, 3, -10, 7, -3, -4, -7, 5, 5, 9, 10, 12, 8, -2, 2, 0, 7, 4, -4, -1, 8, 13, 7, 10, 9, 2, -2, 8, 8, 7, 5, 15, 12, 9, 3, 8, 7, -5, 8, 2, 8, 10, 2, 0, 4, 12, 2, 12, -7, 2, -6, -7, 0, -1, -10, 1, -8, -1, 7, 3, -9, 2, -10, 6, -5, -4, 6, 5, -4, -17, -6, -12, 5, -4, 1, -4, 2, -6, 6, -6, 4, -4, 1, -2, -4, 1, 1, 2, 7, 1, -4, 9, 14, 5, 9, 2, 1, 18, 6, 7, -1, 11, 0, 7, 0, 0, 1, -1, 5, -2, 2, 8, -3, 2, -1, -3, 13, 3, -5, -9, -14, -7, -8, -1, -4, -19, -3, -3, -8, -5, 5, -12, 2, 5, 5, -5, 6, 1, -4, -6, -7, 6, -4, 0, -4, -4, -4, -9, -5, 1, 12, 11, 17, 16, 12, 2, 7, 4, -5, -4, -2, 5, -3, -3, 3, 14, 3, 11, 13, 9, 2, -3, 15, -3, 2, 5, 1, 2, -9, 0, 0, -9, -2, -4, -15, -10, -5, 5, 0, 9, 0, -4, -8, 4, 6, 9, 14, -3, -2, 9, 5, 3, 0, 11, 5, 3, 0, 3, 10, 13, 11, 15, 8, 14, 20, 14, 4, 11, 11, -8, 3, 15, 2, -1, -7, 5, 4, -1, -6, 3, 5, -3, 9, -2, 10, -2, 2, 0, -8, -4, 7, 2, 2, -7, -7, 5, 6, -2, -1, 13, -11, -1, -7, 4, 0, -6, -5, 6, 7, -3, -3]
7471cNnJ7j1JqNOl%JkJJ2k2lK1k5OJ6Mrj5LPjqJ3j7NPQj5mJ6mjj1PPkm%mJNJ0
7518Gk1K0J%r%kQ%%rLKj1J3J3mj3k%OkPkjJ9j1oQLm%j8RjonOKPj0NrJ6mk4J7N
7566CoL%rJ0kpjlKjNJ3oklJ2Nj0kqNNPrOJnkOj4kJ0Oj1J0%kpJ5j3J0mj2J1%Oj0
7614@JkkNJm%RKj5PmnJ2qkJlRj4NLkkJ1jLln%PKkNpLnMMJMljj4J1JJ0mnnkJ2r
7667D%OKj2mmNjjOMqlNKj2K0pKnpqQRk%jkj0J6Kj1JpPNlMK%jjlJ5j3j1J5j0K5
7716A8%nj0qJ4%KpJ0jlKrMj0%J6j4j1J3kOKknJMKr%Pj1P%Kj6J6nNjj0J1onJ0P
7762IqkKlKJ0nnpQKmKkQrLJ0j5J3mlNQpj5J2j0NjkNkJ1mnrLPjjMrOnLJ0j5Om%
7813cMnMNPj3OJ2nQj5jjRrmJj3J3PnMkMj1JQj3%J7mj0K0qLj2lJ3j0PrOjOj1MO
$$ y = [-3, 2, -3, 14, 3, 4, -4, 1, 7, 4, 4, 5, 3, 4, 16, -6, -9, 12, -13, -7, 9, 13, 4, -11, -8, -1, -2, -10, 3, -14, -9, -2, 6, -9, -13, 3, -1, -2, -13, -6, 1, -1, -5, -5, -9, -8, -3, 7, -14, 6, 7, 7, -2, -2, -4, 4, 4, 4, -5, -2, 0, -11, 2, 15, 11, -2, -4, -4, 2, 0, 7, 5, 4, 23, 12, 6, 14, 17, 13, 13, -5, 4, 3, -3, -8, -2, 0, 7, -3, 2, -7, 9, 5, -19, -2, 3, -3, 0, 0, -9, 1, -1, -8, -9, -12, -10, -11, -6, 7, 1, -1, -4, 8, 13, 3, 1, -7, -2, 3, 10, 1, 7, 8, 3, 1, 7, -7, -9, 1, 7, -4, 6, 6, 4, -3, 12, -1, 9, 5, -7, 4, 4, 10, 0, 1, -1, -3, 2, 3, -1, -1, 8, 10, -5, 2, -2, -7, 5, -3, -5, -4, -7, 2, -12, -7, -4, -6, -8, 3, 2, 5, 2, -3, -3, 4, 6, 4, 9, 2, 5, 0, 4, 8, 9, 13, 10, 9, -5, 6, 7, 17, 13, 8, 3, 1, 13, 4, 4, 10, 12, 0, -4, -8, -3, -4, -5, 1, 5, -3, -6, -1, 1, -11, 9, 2, 4, -1, -8, -16, -8, 1, -1, -1, -2, -4, -14, 2, 4, -7, -6, -13, -6, -1, -4, 0, 2, 2, 1, 0, -3, 12, -1, -12, 3, -7, 18, 18, 13, 3, -5, 9, 9, 11, 4, 14, 13, 10, 12, 3, 7, -3, -3, 13, -1, -12, 1, -1, 5, 7, 5, 0, 1, 5, 7, -2, -2, 5, -6, 1, 1, 3, -13, 3, -2, 3, 2, -8, 3, -3, -8, 2, 9, 1, -1, 1, -2, 0, 10, 5, 0, -7, 1, 3, -1, 1, -1, 7, -2, 1, 11, -4, 9, 5, 2, 7, 15, 8, -7, 5, -5, 0, -1, -3, 2, 0, 11, 7, 2, -7, -4, 3, 2, 1, 5, -4, 2, -3, 0, 10, -5, 1, -3, -3, 1, -4, 0, 5, 12, -1, 5, 17, 12, 20, 5, 4, 3, 12, 3, -1, 0, -13, 0, 7, 2, 6, 4, 8, -3, -2, 6, -7, -7, 10, 6, -4, 16, 8, 11, -1, -4, 9, -1, 6, -3, 3, 2, 8, -3, 1, 7]
7860GOkroKkkNlJJKkmQjjjOkJ1pLjmoMnMMLm%%nkJ2Oj5RJj1K0pNppQj2mLLRj5
7914dQo%MmLQnqm%J4j1j2J0RrMKpnJ0JmJ2j3KJ1RrqQlolQkMlKoPPnj0J2mlJJ3
7964A5j5mnRoJJLpRmrNQnJ8j6Pj2LmR%j2JJ1qjJ5lj0J0oj2K0ro%LJ1j4OlQMrM
8011AjKMlOpMNjLMrpJ3j0J5j2Qj0jkOj2nJ2kJKOj1JRJnlJ5k2%ONNj6J2qLlQKj
8060HkqRj1oPQj0QkJPj2LJoQkMQrOpNkkJklMLqlRJj0Qj0NOJ0rnkNj2J2omjJ0j3
8112a0J1RmKmnj1K5oNJkj1J4k9PRMLrLoRJJj3K1jj1J0qOrRp%nOKjlmOmkj3J8k
8160BpmMKPj0JoNOqlJ2%mKjjmOJ3rpOPjoKQj9K1
$$ y = [7, 13, 11, 2, -4, -2, -4, -6, -1, -4, -3, -2, 0, -2, -6, 2, 1, 0, -1, 5, 3, 14, 7, 10, 9, 5, -1, 3, -2, 2, 6, 9, 5, 5, 5, 0, -2, 10, 16, 1, 10, 11, 0, 20, 13, 18, 11, 4, 12, 0, -4, -1, 2, 11, -4, 4, -2, -2, 2, -2, 1, 9, 4, -4, -8, -8, 6, -5, -17, -7, 2, -7, -3, -1, -8, -13, -3, -2, -6, 6, -7, -5, 6, 15, 6, -2, 6, 3, -3, -6, 2, 0, 4, 1, 3, -3, 4, 11, 6, -4, 8, 4, 1, 2, 15, 0, -4, -9, 0, -6, -5, -4, -1, -8, 1, -3, -12, -7, 1, -4, 14, -2, 5, -7, -4, -8, 1, 1, -11, -10, 1, -7, -8, 7, 4, -6, 4, -2, -14, 6, -3, -9, -9, -6, 5, -9, -3, -6, 2, 6, -3, 1, 0, 2, 6, 3, 9, 2, 6, 11, 10, 13, 17, 8, 1, 14, 4, 19, 7, 15, 5, 4, 2, 8, -4, -9, 3, 1, 2, 4, 10, -1, 0, 9, 10, 5, 2, 17, -5, -5, 1, 6, 11, -5, 7, -1, 2, -1, 7, 9, 8, 6, -2, 7, -4, -10, -3, 5, -5, 3, 1, 2, 9, -3, 0, 1, -5, 3, 1, 5, 13, 4, 10, 3, 8, 6, 4, 5, 3, 0, 4, 7, -1, -4, 5, 6, -4, 4, -6, -1, 5, 15, 6, 1, -1, 4, -8, 4, -2, -6, -7, 3, -10, 1, 10, 6, 8, 4, -1, -12, 13, 7, 12, 13, 11, 0, 14, -15, -8, 1, 5, 8, -1, 2, -4, 5, 6, 7, -6, 15, 14, 3, 13, 5, 11, 2, 11, 4, 4, -1, 5, 7, 6, 3, -1, 5, 1, -1, -14, 4, 2, -5, -9, -5, -3, 4, -6, -5, -11, -6, 0, -8, -11, 1, 1, -3, -1, -2, -3, -7, -1, 12, 3, -4, 2, 9, 8, 2, 4, 12, -7, 14]
8191A4
$$ Imaginary data points
##PAGE= N=2
##DATA TABLE= (X++(I..I)), XYDATA
0@%%%%%%%%%%%Qj6J6j6J6j6K4l2L2m0M8n6O4p2Q3r1J04j20J36j53J73j96K20k45
35a29K73l04L39l76M16m62N11n66O27o94P69q53R50j060J187j336J512j723J985
54A066k325K777l413M385o070R807l1980J7542O8156l8379o4844j4268N6371L2457
68C1282k4342l6840J6313L8835L450l9665j8549K9335L9225m504l5626k1385J3771
81h700K1852O620r001j1356j0330l405Q963J5085j00j8407j2192J4050J9661o158
95F582k4322j752K9495J8459k4104l3453R433M3304J4781l7053l5794J8055M5068
108B8699N339m2086k7715K5178L7794n662l8070j3361K7401K3258j4609k6059
120a9893L770K5896P106k0940j4993J3588K0889r77j6931o657Q529O123l306r68
$$ y = [0, 0, 0, 0, 0, 0, 0, 0, 0, 0, 0, 0, 8, -8, 8, -8, 8, -8, 16, -16, 16, -24, 24, -32, 32, -40, 43, -48, 56, -64, 72, -81, 92, -104, 116, -129, 144, -160, 179, -197, 219, -243, 268, -298, 329, -365, 404, -449, 501, -559, 628, -708, 804, -919, 1066, -1259, 1518, -1895, 2490, -3580, 6227, -25753, -8211, 59945, 21566, -43278, -57546, -1175, 31282, 6940, -29900, -13587, 25248, 28698, -10967, -29516, -181, 39044, 34540, -1086, -22471, -8700, 13152, 19772, 10771, -585, -10915, -14320, -5357, 9728, 9628, -8779, -20971, -6921, 12740, 6582, -17740, -19492, 10003, 28462, 4358, -29095, -19662, 23642, 38423, 1370, -34424, -16369, 28699, 34038, -8048, -35763, -10585, 27209, 21547, -16523, -29884, -2483, 20775, 6166, -19893, -16123, 9773, 16879, -4061, -19054, -5466, 15423, 14446, -2485, -9142, -613, 5510, 2204, 1236]
134A236N621j069j2986p131J2698J6308m870k0216o053J6260J2693r692j4249
147a1450O304J7760l79k0123q548J8733J9767q782k4934n378J9892J4067j1513
160E416j7543K308J4853J692j3863o338J1439J0477p121j3025J791J3560M601
173H247r340o163P357Q483l751q198K578R820M29j0538m428R423Q069p774j3230
188i016J108J3424M309j2448j1081O131J2708m90j1866l791J0281P783o677r589
202i214M171J2983K897j0855p686O776J0657o60r209l512N226L128m523m223K984
217a060M173l276o837j23O644L035m804m214L250N283r82m445J242O524J917n910
233D17m381M791P244j170p822k768N727M401m241o411J093O063N52o608l850M760
$$ y = [1236, 6857, 5788, -7198, -14329, -1631, 14677, 9807, -10409, -16462, -202, 12491, 2799, -11450, -5146, 12614, 12235, -7888, -16436, 2297, 22064, 13282, -11652, -17030, 2862, 16929, 5416, -12127, -9819, 5034, 6726, -7137, -13475, -2036, 8441, 1320, -11705, -9914, 3646, 8247, -1093, -7256, 101, 8584, 4833, -3365, -787, 9033, 9462, -1076, -5504, 3919, 11988, 4214, -9016, -7908, 5516, 9825, -2623, -13704, -7573, 5135, 4645, -7221, -11012, -731, 7052, 375, -9214, -5043, 7940, 10837, -18, -7704, -928, 9729, 9069, -140, -3652, 1574, 4702, 179, -4044, -1060, 3113, -163, -7000, -7123, -479, 2556, -2248, -6462, -3212, 2071, 1089, -3356, -2114, 4410, 6327, 417, -3964, 827, 8071, 6901, -921, -3689, 2038, 6439, 2198, -4213, -3120, 2943, 3495, -3113, -6963, -2203]
249b203O006j969o852j268O111M475l108n021Q82N097J697l348k417K106K705
264B893j086k797N1K373L19k583j568J588J817r66k048J67J812L68j373j37J988
281H18J090j649j645J523K903K6l021j628K094K374j149l116o29K243J129k104
297g41k222R23K512J97k328j110J937K319l35j892j98J973J294r34j406L06J403
314A698K33j337j135L08P74j41r66o74J3K17O1L8O2j55k16K83Q59O20k17m34K97
335A88R40N35l78n44J47N69J6o98n95P4K03l91p87m25K05J35l80m75R5N60L20
356f86k28j88M86R31M95k47l31L12P92M31l52o11k04K32J16l36n08k73j25k69
376e63k94l4K62J15l06l53J40O69N42j8l31j14L22M61K72k5k54k96q3J96K88o9
$$ y = [-2203, 3803, 1834, -5018, -6286, -175, 4300, 1192, -3829, -2947, 2150, 3847, 499, -1918, 188, 2893, 1807, -990, -939, 1434, 1753, -830, -2398, -810, 1007, 41, -2007, -1840, -28, 340, -1033, -1170, 818, 1908, 259, -1386, 137, 3040, 3066, 45, -1583, 511, 2885, 1736, -1380, -2009, 234, 1363, -741, -2963, -2040, 472, 669, -1659, -2769, -832, 1487, 1152, -740, -938, 1035, 2329, 1395, -11, 295, 1698, 1931, 594, -541, -233, 541, 400, -566, -1240, -1227, -1010, -949, -911, -849, -1004, -1220, -937, -78, 542, 325, -109, 188, 1128, 1663, 1285, 741, 888, 1457, 1473, 775, 180, 254, 457, 66, -721, -1146, -941, -806, -1186, -1661, -1566, -1006, -686, -914, -1102, -616, 315, 810, 563, 232, 544, 1336, 1767, 1415, 804, 600, 832, 948, 612, 104, -169, -294, -563, -857, -891, -629, -514, -820, -1173, -1033, -364, 178, 160, -171, -285, 37, 498, 770, 745, 491, 195, 112, 308, 596, 527]
398E27m54m01M5K89K6k80j50J86J64j81k95J57N33K20l35m02J45N02K03k21k19
419E9R5J17k44k41K16L92j05p36n01L80P51J31o80n76K48P04K81k47k39J46K51
440B02O0j3J52J63j73l65q3K95J52l19m73q9K52J18j92k00J15K04Ll5K25L91M5
463D35k95p9M48M73j55n84k19L90K98l14n83j24K65pm41k88K76K86k58m95P8O31
485b62L06m02m01M00P31J03n61j70O30N90k77o77J0O49K58n71n69J92M43j94o07
506c79j35M79J57n50l91N00O82k04p48J2J014O03o32q77L23J095K15r67p22M74
526e1O50l88q95%P38k7j089n42R99J201l88j430l01J418J177m51j025K01R86J13
546H96q11j19J082N61j155j455L75J626M64j397j254M89J054j09q78J19J005K9
$$ y = [527, 73, -328, -283, 6, 32, -248, -398, -212, -48, -229, -524, -367, 166, 386, 51, -351, -206, 296, 499, 278, 59, 154, 271, 27, -214, 2, 394, 289, -447, -948, -568, 183, 314, -366, -942, -694, 10, 291, 44, -195, -49, 202, 262, 249, 401, 564, 391, 26, -57, 238, 390, 71, -402, -491, -239, -121, -313, -513, -398, -194, -191, -226, -1, 390, 435, 140, 61, 509, 982, 827, 243, 24, 414, 712, 398, -185, -309, -44, -51, -492, -780, -504, -218, -476, -971, -893, -262, 44, -358, -759, -359, 372, 475, -86, -256, 374, 964, 687, 10, 20, 669, 927, 356, -213, -21, 422, 228, -379, -514, -35, 122, -428, -819, -319, 363, 159, -589, -577, 437, 1040, 408, -469, -146, 949, 1164, 197, -525, -51, 599, 211, -684, -684, 54, 27, -1062, -1604, -605, 596, 208, -1222, -1523, -105, 1072, 621, -404, -203, 783, 896, 85, -34, 1048, 1609, 454, -1001, -626, 1000, 1464, 67, -1187, -698, 356, 247, -631, -512, 493, 522]
564E22j303o42J354J589m58j827m88J436J043q42j110M92J120m48j638k43J762
581C19J136j383k007K25J994P39j358j044R74J255n61j267N12J907L66j848j215
598a256J485K040n34k314o30J877J231j452j919M67J784M1j853p08J611J254j267
615a43j792P54K453N34k126j476J431K124k17j793l99J324L78j441q26J422J393
632A600j227k435j56K297J275j514j709O92J627k91j515M15K331P06k398j973
648b275J753L337K18l057j719J948K276r56k396J24K295K74k800j830K047K943
664B182p57l534j298K515K443r51k258M6J899M76j376l43J788J147j520j899Q50
681e90K457L41k208j426J258J445q17j566M42J627m27k296m85K564K009j769l035
$$ y = [522, -781, -1423, -69, 1520, 1062, -765, -1253, 183, 1226, 384, -726, -234, 886, 438, -1200, -1443, 319, 1455, 72, -1935, -1710, 284, 1023, -335, -1379, -405, 850, 289, -978, -466, 1441, 1807, -41, -1256, 229, 2269, 1735, -579, -1209, 668, 1899, 447, -1472, -1005, 779, 820, -1033, -1741, -130, 1124, -143, -1935, -1181, 1272, 1806, -320, -1796, -365, 1759, 1542, -251, -650, 674, 1052, -389, -1215, 207, 1600, 373, -2062, -2218, 79, 1354, -160, -1869, -1177, 450, 159, -1356, -941, 1390, 2096, -302, -2275, -522, 2815, 3033, -24, -1743, 205, 2481, 1525, -871, -747, 1548, 1822, -978, -2808, -761, 2182, 1425, -2109, -3407, -892, 1551, 600, -1658, -1612, 287, 763, -613, -956, 832, 1979, 459, -1440, -590, 1867, 2208, 0, -1426, -168, 1277, 460, -1106, -664, 963, 536, -1760, -2245, 319, 2328, 559, -2476]
698b476K87L284J491k178k120J295K396n25k518j54K811J310k668k938J126L529
714A952O83l076k248J494K363m60k096qK046M37k177j301J991K558o46k791p70
731b049K231J715j098j656N20J466m25j791k9K095R35j989k115Q96K520L78k092
748d88j128J466J460q66j488P13J953p1k211q97K023J887j254k576o6K266Q76
765A599j943j670J168J922o34k267j97K327J316j762k045R54K609M24k098j139
781a436J605J705q08j789K17J865L12j864j227J287J668o79k032l81J585Q54j160
798b78j151P25J290l30j319P0J596O91j275j122R80J633j82j611m19J410Q77j171
816D14j402N47J483j63j802p25J361J224r63j698J90J784O41j364j060R92J582
$$ y = [-2476, -2189, 1095, 2586, 408, -1712, -417, 1979, 1454, -1064, -1218, 1593, 2903, 235, -2703, -1577, 1952, 2635, -441, -2689, -1195, 1168, 708, -1388, -1396, 650, 1087, -1090, -2391, -400, 2158, 1512, -1279, -2049, 182, 1897, 799, -857, -337, 1129, 704, -1087, -1116, 979, 1914, -75, -2190, -1294, 1226, 1604, -488, -1616, -150, 1310, 444, -1044, -331, 1622, 1551, -660, -1557, 466, 2353, 1099, -1477, -1543, 723, 1599, -344, -2014, -846, 1076, 442, -1825, -2022, 305, 1621, -141, -2186, -1232, 1377, 1801, -297, -1436, 169, 1874, 1066, -723, -506, 1359, 1671, -193, -1420, -133, 1535, 856, -1176, -1557, 28, 882, -278, -1429, -704, 586, 256, -1063, -993, 603, 1294, 19, -1103, -123, 1510, 1328, -283, -702, 708, 1585, 414, -988, -441, 1042, 879, -923, -1648, -287, 937, -26, -1724, -1534, 250, 891, -473, -1533, -541, 1041]
833A041j58j386k05J378Q02r63j072N74J253j46j377n34J035P86q19j171K46J092
851C76P1j086m71R52Q48o13j040K58J220L30r91o05P61R03l79j027L8J036L24
870I05j009p88O39J035k35j165l26R15O77n94q28K59R01P7p85k93P43O33m33p56
890d28J46Q18J99p35m47M62N53l15p37J8O55J76o35m66M55O62j91o60l1P29L87
911F15m78n07L40O96no62k78M72M04l59n79K5M45K9n34k83L72L82k52m80O5N61
933a1K39l20k83L09M42ql08KL69J45l09k53K12K87j60m42j36K83J35l32l13Q9
955c63K68o6l12o9L37K49j87k74J53M11J73j86j50K01K34l5j49L9J61o3l11j46
977h5J64J84j76l78j28J66J50r5j27M8R4l2p2J41L02J04k23j89J31L18J33j61
$$ y = [1041, 883, -503, -708, 670, 1472, 509, -563, 11, 1264, 1118, -259, -793, 242, 1028, 209, -962, -716, 376, 447, -639, -1110, -158, 690, 77, -963, -705, 515, 845, -146, -751, 10, 913, 534, -493, -455, 581, 905, -104, -892, -253, 782, 547, -618, -944, -29, 648, 54, -774, -515, 386, 463, -322, -615, 128, 761, 328, -428, -282, 536, 735, 0, -447, 15, 568, 253, -484, -466, 189, 365, -270, -736, -281, 381, 190, -470, -501, 228, 615, 137, -370, -30, 666, 661, -1, -279, 193, 597, 238, -341, -316, 129, 158, -376, -659, -287, 95, -157, -637, -572, -11, 228, -92, -375, -66, 376, 368, 60, 62, 431, 576, 267, 14, 226, 513, 353, -89, -225, 58, 193, -139, -452, -363, -95, -161, -473, -542, -205, 44, -143, -417, -264, 147, 320, 134, -16, 185, 419, 384, 235, 274, 435, 372, 61, -85, 79, 263, 87, -291, -419, -253, -103, -198, -325, -277, -183, -215, -287, -146, 156, 260, 37, -152, -21, 297, 430, 269]
999B69k10k0L5mJ1M2nj68k29NK17J77q6k19q6J25J56O5Qrm4p7j4J59J60k1j89
1026D8j47L3J04N3k3n0p2j18m5J04J77L7j79j85L7K38J70l7j27p4M0P1O2N0pr4
1052F6j73l7J12J39l7j63j79J1J27J14J5n0p4k8R3J32J22J8j03l8L0J07M8l0m6
1077A76p4q7o3N0N7k6j62j53NJ39P0n6q0nO8O4K9L2O7Qj5j2N9R8J8o3o3j7J9P
1107I0qk1o5o9l7K9P0k3j03o0O2J18K8n5k1N4O8K2pK4L3j3o5j8N4M9o8j14n8O9
1137c5L4m2r3oL1J1llM4L7j6JM8P5nm0oM2L5j8m8j0L4k5n3JO2Lr1o0N4J23Lr5
1171a1p0N8R7Lp9k0O8L7r6o5N3Q3Lj35o9N9Q7k5p1k1M9J6o3RP1P4l8o6K1J14O4
1202A37o1o6N4P3j8q1MN9Mp8p7M6O0m1j17k1J11J00j01j34J1J70Q6r3r7M8R1j2
$$ y = [269, 59, 39, 74, 70, 81, 123, 118, -50, -279, -274, -57, 120, 34, -185, -271, -146, 10, 75, 83, 74, 30, -47, -61, 98, 258, 237, 48, -99, -66, 38, 91, 68, 18, -54, -172, -217, -113, 64, 101, -78, -263, -226, 12, 182, 145, 18, -56, -16, 55, 117, 167, 160, 66, -107, -144, -32, 107, 70, -93, -272, -261, -134, -20, -5, -55, -129, -157, -64, 68, 190, 208, 105, 67, 97, 204, 252, 222, 176, 102, 15, -48, 2, 59, 33, -129, -282, -277, -138, -68, -124, -204, -209, -141, -77, -48, -16, 51, 59, 44, 32, 91, 189, 207, 144, 81, 64, 83, 90, 82, 61, -4, -73, -110, -81, -11, -34, -137, -197, -135, -17, 11, -44, -65, -11, 57, 79, 72, 96, 129, 116, 51, 33, 87, 136, 68, -46, -104, -35, -1, -43, -136, -142, -111, -100, -103, -106, -62, -25, -41, -40, 8, 83, 78, 38, 32, 74, 109, 91, 43, 33, 67, 42, -11, -10, 52, 55, -36, -96, -42, 81, 84, -11, -81, -23, 74, 77, -2, -22, 46, 83, -13, -78, -25, 58, 61, -74, -143, -84, 3, -22, -93, -114, -65, -49, -112, -103, -32, 42, 4, -62, -41, 73, 137, 76, 10, 64, 137, 119, 38, 42, 101, 105, 27, -50, -4, 56, 15, -102, -123, -12, 88, -13, -147, -136, 34, 120, 27, -70, -22, 69, 57]
1230E7q8pJ00K1j12j25M4J34J1j30p1M8Q5k9k3O4P1m3q5L0J54R1r9j16M0J38K9
1257A89j25n3Q2N5q4j47K4J34L8j75j26Q0J47lj57m7J27J03p4q5N3J20Rr4l0J21
1283H2R1r2j37K0J33K9j29r6L5O9o1p3L7R2k8j55l3J71J87o7j78k5J79J31o3j07
1309A2M5J01k9j53jJ61Q2j61j87KJ91P2j33j29L4J06k8p4J8J14Lj43o4J27J63
1334A29n2j71k2J42P0r1q2O8R9n3j50QJ93P1j53j88Q4K04N9j69r4R3J20n3j09
1359d7L2J54j0j76r1J42J60n1k05p4J35R2o1r0L2O8n6q6L9J77P6j43j46P8J87
1384A36L9j46p5Q0R3p1j20L5J27j0j90j03J09J61k4j75n4J35R7o9p2O4J37k1j20
1409c7lJ29J13q7j36K6J22Oj17n6P1M2p7j15M9J01k3j35p6J25R5m4j20K3J23N8
$$ y = [57, -31, -38, 62, 83, -29, -154, -110, 24, 35, -95, -166, -118, -33, -62, -85, -21, 50, 7, -78, -48, 106, 197, 98, -18, 22, 160, 189, 64, 11, 93, 148, 64, -83, -59, 75, 113, -62, -188, -108, 39, 36, -121, -168, -41, 62, -12, -97, -44, 76, 85, -9, -39, 82, 173, 81, -56, -36, 97, 126, -3, -99, -64, 5, -56, -129, -92, 0, -28, -183, -216, -45, 142, 75, -103, -128, 51, 182, 119, 12, 57, 158, 129, -24, -25, 136, 218, 57, -130, -128, 63, 135, 2, -127, -93, 13, -15, -89, -71, 43, 46, -97, -161, -34, 129, 77, -94, -116, 26, 96, 5, -77, -9, 90, 37, -113, -105, 88, 159, 6, -182, -98, 106, 165, -4, -98, -5, 115, 62, -47, -15, 139, 129, -47, -138, 4, 164, 113, -92, -166, -31, 61, 0, -90, -58, 10, -46, -132, -93, 84, 160, 17, -129, -51, 136, 175, 29, -46, 34, 127, 56, -64, -29, 98, 88, -102, -205, -96, 65, 41, -134, -188, -53, 44, -25, -97, -33, 104, 83, -37, -40, 89, 202, 115, -21, 5, 127, 133, 16, -40, 31, 73, -4, -119, -70, 31, 8, -127, -203, -78, 17, -27, -147, -124, -1, 57]
1435E7r4n0P8J26k6j11J8J18N2j08j05P3J13l3j24p3J02O9p1j11MJ10J0q4m7P9
1461b8Q6m2j00K6R0O2p9o9M6R0k4p7j1N0M4o8o7L4P5mp4k8O6M0m4n3L6O4k2n4
1491c5j9Q8M7o7p4K4J05Lq6m7P2N8l9j01L3P3L7q2o9N1Q6j4o2l5P8L4l1m7KN3
1521C6kn3k2L8J9l4m6J2L5Kn2j2M2M2k7m4M1N3J2l2k1M5M7l3m2MO1K6o7o7K5N5
1553D1%o7l5K5L4k5k8qK9K8l3kL1L3Kk8MK7K4qj2K1qj5j5J0K8k0n9j9L3K1l1m7
1587f9qM7Rm4j5M0M1ll9nM5N9k2l1oM0L0j7k2j8QJ0k3lJ1lm3nJ7J8lrpknJ0K0
1624CK3k0k6mL0M6%m4k4K3K1J0k4mPlk1oOL1j9l0k2J0L7J0j4k7LNJ4QlLk0kJ2
1661a1PK1j9rkLRJ7J5Kk6k7J2M8K0k6k5NnL2j1mk2j0Lj7lL3pm2j4K1J8J3%l1q
$$ y = [57, -37, -87, -9, 117, 91, -20, -2, 116, 168, 60, -45, 28, 141, 108, -16, -89, 13, 82, 11, -100, -96, 14, 24, -60, -107, -28, 58, 16, -84, -58, 32, 94, 15, -54, -8, 82, 58, -19, -30, 20, 64, -4, -71, -37, 38, 34, -40, -68, -2, 38, -6, -59, -23, 41, 19, -35, -54, 34, 81, 14, -60, -36, 69, 72, -14, -61, 11, 69, 30, -71, -38, 35, 72, -10, -79, -28, 58, 44, -18, -53, 25, 59, 28, -19, -17, 36, 34, -19, -41, -3, 16, -18, -64, -52, -17, -15, -67, -79, -37, 5, -22, -66, -25, 28, 40, 8, -13, 32, 79, 46, 4, 8, 69, 95, 28, -39, -14, 41, 41, -26, -61, -36, -2, -27, -55, -63, -34, -6, -39, -41, -10, 23, 25, -3, 1, 28, 52, 44, 32, 53, 45, 30, 15, 25, 53, 33, -26, -45, -12, 9, -22, -69, -77, -30, -21, -65, -80, -40, 1, -2, -41, -46, -1, 58, 36, 5, -1, 39, 69, 52, 30, 12, 20, 30, 7, 4, 15, 12, -31, -36, -19, -1, -4, -13, -20, -22, -27, -17, 3, 26, 6, -20, -24, 6, 52, 52, 8, -16, 7, 28, 38, 14, 10, 17, 14, -7, -13, -7, 24, 5, -25, -47, -37, 0, 10, -4, -31, -28, -23, -9, -1, -4, -1, -21, -23, -11, -4, 17, -2, -11, -13, -10, -1, 16, 31, 33, 7, -20, -8, 40, 60, 34, 9, 14, 9, 41, 30, 26, 4, -6, -3, -20, -23, 10, 3, -39, -53, -32, -14, -1, -1, -32, -40]
1698d0J5L5%JRj4pJ1K2Kj7j7rRLoqNok3pJK6Qj9k1K5QJ5Oj7J5OJ5jOQrlKL%j2
1741B0mj3oj3Poj1kolJ0K0j4lmRK0lj2L2nOlj1N%Mj0JMJj1okKqRj0KrQQlJ1j4
1786a3jMK0pj0QPJm%pQJ6j7j1jOMNj2mK1oj4OKoJ5%qqNj0Nj1MkKlJ4r%LjNj0J3
1833aRnJ0j9PJ9Nj7nj4J4N%j5rKqNJ3Mj1Rj6J4RJ4pnOkJ8ll%%jJ0rj4Mj2Jj0J1
1877CqoLJ1k4rJ6OLqj7J3J3lJ1j3J4o%Jj%J1j6m%NMj5POmNQJmrKPLLlmMRokmP
1926A0Lmj9MJ2j3M%%Qj8oJ3KmlKPj1J4j6MK0j9LQjJ4j9JkM%J0qmNO%kJ5j4jj9
1970a4K4JNjj0j2KJ8JJqj3J2oQKoj9J1J5k4J1lRlrNLlJk1kK1nM%j7LjKJ5qJ8j8
2014a1LmK1j1PrqMJ0JRmj4PmPnJ0nj2KJ2pkJnPloK4npKpJ5kj0%PlJJj5J1Pk1J0
$$ y = [-40, -25, 10, 10, 11, 20, 6, -1, 10, 32, 34, 17, 0, -9, 0, 3, -3, -11, -6, -12, -35, -42, -41, -15, -7, -26, -47, -22, -14, 1, 7, -10, 5, 11, 26, 25, 31, 39, 30, 27, 29, 32, 32, 20, 16, 3, -3, -16, -9, -15, -26, -28, -34, -37, -27, -7, -21, -24, -28, -19, 1, -2, -14, 18, 13, 19, 16, 5, 10, 10, 14, 4, 5, 9, 10, -1, -7, -9, -7, -15, -6, -16, -14, -23, -15, -7, -10, 1, -13, -14, -10, 10, 3, -7, 1, 8, 9, 5, 5, -2, 6, 22, 5, -6, -7, -1, 3, 8, -4, -8, 13, 7, -7, -1, 1, -5, 10, 10, 2, -6, -1, -11, -6, -17, -13, -15, -13, -16, -2, -11, -11, -8, -9, -4, -14, -1, 8, 3, 13, -6, 1, 20, 25, 8, 3, -11, 3, 8, 8, -7, -16, -14, -22, -17, -4, 0, -11, -2, -18, -4, 5, 19, 12, 7, 13, 11, 29, 26, 23, 23, 23, 22, 32, 23, 9, 13, 1, 2, -8, 3, -5, -11, -8, 3, -21, -30, -14, -8, -5, -13, -30, -17, -4, -7, 4, -9, 5, -1, -1, 0, -1, -1, 10, -6, -10, -10, -5, -1, -16, -9, -3, -7, -2, 6, 7, 3, -6, -4, 3, 6, 9, 6, 2, 6, 15, 9, 7, 3, 10, 13, 9, -10, -6, 6, -7, -3, -3, -3, 5, -13, -19, -6, -4, -8, -11, -9, -2, -13, 1, -15, -11, 9, -10, -7, 1, 0, 14, -5, -4, -6, -2, -2, 8, 0, -4, 1, 7, 7, 5, 20, 6, 5, -14, 10, 11, 16, 15, 5, -7, -5, 13, 14, 15, 7, -6, 6, 0, 8, 10, 4, -15, -4, 11, -13, -2, -5, 4, 1, -8, -3, 0, -3, -2, -23, -25, -4, -9, -5, -5, -22, -19, -20, -18, -3, -11, 7, -11, -8, -12, 9, -2, 5, -4, -12, -8, 2, 3, 12, 8, -6, 1, -3, 4, -1, 9, 4, -8, -6, 6, -1, -3, -2, -7, 0, -3, -9, 15, 10, 3, 5, -2, 13, 11, 1, 1, 8, 5, 6, 7, -8, 3, 10, -11, -1]
2061ajNLk0KnQO%nJ5jj3QjQj8J5LjmkOrNjnOJ2mj7J3JJLj2J2lPj8O%Oj3LOrNj
2110Aj4J4qlJ3m%nk%oJ7mKj5K0k3POmjjLkJ2j5oJ2KP%NmMNlj0J5nRj7LRkNk1J2
2157HlJ0lllMjr%J2lj3mMJ0LmNqPnLJmj4J5Kj3KmpJRj0KNmNpNQNpj3QPPjj6J0
2207aKJ4lmrMMqKj7K2ookOjMJrJjlJ7j6RjpPLjqJ0lojkjnRLj5OJ1l0J5MKjjRJ
2258bK%olJ4j1%NLjjnkPlQjMjkrJ1Mk3J9p%j1%OMJ2ok5MMPlj1RlQjKmmpJ0J2N
2308Hkj1oKL%K%pK2j6JlLjJ1j4OJkNqJ7KJj1OnlLQlj1OJQQj7JmpJ0j6LrJ2KJk2
2357b5L2mj2PpQpOOlJ%%lkkj1KJ2LlKj0NjJ6j0J7j3JlmJ5rJ0k2J9j0krMJ2j0J2
2401Hj2QnK%JJ0j0loOj1kJ8oLj7LJJ0pnJjPkL%%%J7j3%KK0j7Jj7J9Rpj8J5KnL
$$ y = [-1, -2, 3, 6, -14, -12, -17, -9, -3, -3, -8, 7, 6, -7, 1, 0, 8, -10, 5, 8, 7, 3, 1, 7, -2, 3, 2, -3, 3, 15, 11, -6, 7, 8, 9, 12, 0, 12, 9, 16, -2, 4, 4, 10, -3, 0, 6, -3, 2, 1, -13, 1, -7, -10, 3, -1, -1, -6, -8, -8, -14, 3, -1, 1, -14, 6, -17, -10, -4, -8, -9, -10, -7, -9, 3, -12, -18, -6, -4, 3, 3, 8, 4, 8, 13, 10, 0, 15, 10, 19, 2, 5, 14, 12, 17, -4, 8, 5, 15, 12, 9, 6, 10, 9, 0, 0, 12, 9, -4, -8, -4, 6, 9, 5, 10, 2, 9, 4, 7, 8, 4, -10, 5, 7, -6, -4, -8, -15, -14, -5, -15, -13, -8, -12, -7, -14, -9, -1, 4, -3, -16, -8, -1, 6, 5, -11, -1, 1, 15, 12, 8, -1, 3, 7, -1, 1, -16, 6, 0, -6, -8, -2, -3, 1, 2, -7, -6, -7, -10, 7, -9, 0, -1, -8, -1, 2, 1, -7, 3, 0, -6, -7, -9, -10, -15, -6, -3, -18, -12, -1, -31, -16, -12, -10, -11, -12, -3, -2, 0, 0, -6, -9, 5, -6, -6, -1, 2, 1, 0, -5, -7, 0, -3, 5, 4, 8, 7, 5, -4, 7, 11, -12, 7, 0, 0, -11, -11, -5, -1, 11, 5, -20, -16, -12, -5, -8, -19, -10, -13, -5, -6, -4, -8, -12, -19, -9, 3, 8, 6, -5, -11, -9, -6, -6, -4, -4, -11, 11, -5, -4, -7, -4, -5, 6, -8, -2, -1, -3, 2, -6, 11, 13, 14, 3, 9, 4, 1, 4, 12, 9, -2, 4, 5, 13, 21, 4, 5, 1, -6, 4, -12, -9, -18, -6, -4, -3, -25, 7, 3, -9, -2, -9, -1, -8, -2, 4, 1, 2, 2, 2, -1, -3, -5, -16, -14, -2, 1, -2, 0, -10, -5, -6, 10, 0, 17, 4, 5, 2, -2, 13, 4, 14, -8, 11, 1, -1, -10, -6, 6, -4, 8, -4, 4, -1, 1, 1, 2, 12, 2, -1, -7, -1, -12, -14, 4, -2, 1, -16, -13, -12, -2, -9, -14, -13, -14, -7, -9, -6, -6, -6, -6, 11, -2, -2, 0, 20, 3, 4, -13, 6, 15, 8, -10, 5, 7, 2, 5]
2447EJj4J9Jj2Kj1J7%j6J0KJlRlkrR%MqOkpjkRmkJ2j2njJ4j6PrnJ2qKNJj1PRj
2495@lLkJ3j1KkOj2J0Nj8J7m%nNmKjkJlRj0NJ4j8pRoJ0qLkMOKrOrK%jmPJj0Rj2
2545a2KOJ3k9J6njrjJ1MKLRQj4Lj2J7j1LkJ2mj3PLnJPj3J6j3Nj1J4j5RkJkLj1
2588a0Rj3J3j5QJkPlkj3J4opRJJJOMjpj3N%NlkJ8nrRNj3J2mj4J8mQJj3nJ9jJ0
2634A9j8J0jLqMJ0pojPj0rJ1Kpj5RQqP%%qKJ2j0K%LMpPqj1J2JRj5J3j1K2j8kN
2679BJknKmJJQlNpJ0mqJJ8j5lJMKpPkLj7J0%kj3J5jkJ0rj7NPQj3OoMQMjJj6K0
2728Gj6J2j1RpLNLKmqOLjNoNnLoPpmPnJ6j9J0pJRpJ7k2J2Lj8J8j6jJ5mj2MJpK
2775hNnOj4J5%j2J5j9RQJorJ0oNNp%QLMLj3MnjjN%OLj3NmNonMnQJ3npQqMnoJK
$$ y = [5, 6, -8, 11, 12, 0, 2, -9, 8, 8, -8, 2, 4, 5, 2, 11, 8, 6, -3, 6, 6, 10, 2, 8, 6, -1, -2, -4, 5, 1, -1, 11, -1, -6, -7, 7, -9, -2, -11, -16, -4, -12, -10, -5, -4, -15, -8, 1, 0, -3, 0, -2, 11, 0, 2, 0, 6, -6, 4, 9, -9, 8, 4, 4, -1, 4, 0, 2, 1, -1, 0, -3, 6, -4, 1, 15, -3, -10, -1, -7, 3, -5, -2, -4, 0, 6, 8, -1, 5, -4, -2, -2, -3, -7, 0, 1, -9, 0, -12, -10, -4, 9, -20, -4, -9, -10, -19, -20, -9, -5, -3, 0, 9, 17, 3, 6, -6, 11, 0, 3, 1, 13, 9, -4, 3, 6, 1, 2, 9, -4, 12, -1, 4, -7, 7, -8, 1, -1, 0, -2, 1, -10, -1, -14, -1, -16, -8, -7, -9, -2, -5, -7, -20, -6, -12, -19, -10, -9, -8, -7, -1, 3, 2, -5, -18, -13, -13, -8, -11, -13, 5, 0, -9, 0, 5, -8, 4, 0, -14, 4, 0, 8, 9, -4, -9, 10, 9, 19, 1, 11, 10, 13, 5, 9, 19, 12, 6, 5, 12, 2, -7, 4, 6, -1, -16, -7, 1, -7, 0, 0, 0, -8, -6, 6, -4, -2, -2, 1, 5, -2, 5, -3, -14, -2, -1, 8, -7, 6, -5, 17, -1, -3, 2, 3, 1, -4, -2, -6, -5, -4, 4, 1, 6, -1, 9, 5, -3, -2, 16, 1, -2, -1, 3, 5, -2, 5, 3, 6, -11, -1, -1, -3, -16, -1, -2, -4, 6, -3, -20, -15, -8, 0, -13, -7, -13, -9, -1, 3, 2, 3, -13, 7, -9, 3, -8, 1, -6, -3, 2, 5, 7, 3, -5, 1, 4, 3, 8, 2, 7, 2, 5, -1, 6, -1, -5, 2, -3, 13, -6, 4, -3, -2, 7, 0, 17, -5, 7, 10, -8, 10, -6, -7, 8, 4, -8, -4, -3, -10, -8, -3, -8, -2, -16, -1, -1, -13, 2, -17, -8, 0, 1, -5, -14, -4, -10, -5, 0, -7, -7, 1, 4, 8, 11, -2, 2, -3, -4, -5, 0, 0, 6, 9, -4, 1, -3, 2, -4, -9, -5, -10, -2, 11, 6, -1, 7, -1, 3, -2, -8, -7, -5]
2827eLJ2j3%lJKm%LpJ1qkNmJ1pj3J3KkmLPLj4%qK0qNlQJmKjLOkrNnOoMpJ5mrj1
2879a2PROj0Nnlj0J5MpJlqNMnkN%np%J3%pJ3rrQKj1MJ2Jkj6KJ3PjNokOJpRj2J6
2929A4j3OmnJ6j0O%JpkkJ2j4NnqJ3Kj7J0o%Rj3RjqlNRrJ3Jj5Pj0RoJ0nKJ%Qoj
2976bJ1oJ4j5Rj4J2J0j4KJj1LqJ3jMpkOkJOj0Lj1QkKKnm%J5j4kJj4NQNnmMJPm
3023doQom%nJ6KnLoMOj0JPJnOmk%LKLJMkoJ7qkj0QNmj3NpLKMPnj1LM%j3Rj3J3
3075dlMnLoNKLj3PJ1j1Kj%JOJlPqkJ3mnkQjjkj1J6pMoLNnj0Qkj1J6OkqjkL%pn
3127a4K0j1KJQnMj0nMK%kJqOJpNMj3J4LJpQ%jPnLrKjqJ1%mJJ9j1j1J3%JkkjjO
3177Ij3NlMMkj1KMjkjKLj1J1kj6J0LPj6J0NnrJ8rQqQo%nKkjPpQlJJ1mlJ1j6Mj
$$ y = [-5, -2, 10, -3, -3, -6, -5, -3, -7, -7, -4, -11, 0, -8, -10, -5, -9, 2, -5, -18, -5, -3, -5, -9, -6, 1, 4, -10, -10, -18, 2, -6, -1, -4, 4, 5, 1, 3, 2, 5, 11, 9, 0, 5, 0, 6, 0, 4, -3, 12, 8, -1, -12, -5, 4, 10, 0, 5, 0, -3, -13, 2, 6, -1, 0, -3, -11, -6, -2, -7, -9, -4, -4, -9, -16, -16, -3, -3, -10, 3, -6, -15, -7, -5, -16, -12, 0, 1, -1, -17, -15, -2, 5, 4, 9, 3, 1, 7, 8, 1, 10, -2, 14, 1, 7, 3, -2, 14, 4, 10, 10, 11, 4, 2, 0, 12, -2, 3, -2, -10, 3, 5, -12, -2, -8, -8, 1, -12, -3, -4, -12, -15, -10, -1, -10, 3, 4, -11, -4, -14, -5, -11, -1, -6, -4, -3, -3, 5, -1, -2, 9, 3, 17, 2, 11, -3, 9, 19, 5, 7, 8, -3, 0, -8, 5, 4, 8, 1, -1, 5, 3, 4, 10, 0, 3, -8, 0, -2, 0, 2, -3, -7, -7, 8, -6, -8, -7, -21, -16, -8, -3, -8, -12, -8, -7, 0, -4, -10, -2, -8, -12, -12, -17, -1, 1, -4, -1, -7, -3, 3, -7, -6, 1, 2, -3, 3, -1, -3, -3, 0, 2, 5, 6, 10, 8, 2, 19, 11, 9, -1, 7, 12, 8, -5, 0, -7, -4, -2, 2, 9, 4, -7, -4, 0, 0, -13, -4, -17, -4, -7, -3, -8, -5, -11, -6, -4, -1, -14, -7, 4, -7, -5, -6, -6, -5, 1, 2, -1, 6, -2, -4, 9, 5, 0, -2, 6, 5, 4, 2, -9, 7, 0, 4, -2, 1, 6, 1, -9, -1, -3, -14, 2, 8, 6, -2, -3, -5, -2, -2, -9, -14, 6, -5, -3, -2, 6, 1, 5, -5, -10, -6, -4, -4, -6, -5, -13, -7, -6, -13, -8, -4, -17, -3, 0, 1, -6, 2, 2, 1, 8, 3, 6, -3, -1, -2, -10, 1, 1, -3, -2, 17, 6, -5, 8, 8, 9, 7, 5, 4, 3, 9, -4, 1, -2, 2, 6, 4, -7, -5, -1, -2, -4, -5, -3, 0, -11, 0, -2, -18, -8, -5, 2, -14, -4, 1, -4, -13, 5, -4, 4, -4, 4, -2, -2, -7, -5, -7, -8, -1, -8, 0, -3, -2, 9, 5, 2, 13, -3, 1, 0]
3226@J%Qj4J4Lj0KNqk%J1j2KjQr%Qj3J7j7kL%OmOpnJKMKj1MMNj2K1KojpJjJNk
3276BkRpPkkkmJP%KnkPnkjJ0klJ6j7%OqjkKPk5J1PJj6J0moOj2K1mOk8J4O%Nj8
3325a7K7j6LOmjmOnJ2ml%PNj3lJ0JkjRmKLmj4OJ%M%%lKqkMpQrPkMnRqjJj2J2p
3377a0oJ4j5KOPLJj0OoLkQmROj6LPLj6J5lK%kNj2J1kKj2JJ0Mk0PMmj2PknK4k0
3423i%Oj7J2PmLojJmPOj0rK3r%mJ0oKqLJ4j2rJ3n%mJ8j1J0jkLkmoJ2koPlkKkJ3
3472A4j1mmJ7j7RnLj1NNk3J5NQk1RjMPj9J8rj0J8Nk0jNRlNj3NRoJ0j8%J4kq%O
3516ajPklkJ1j8J9Lj2%Jj0K2j1Ppk%mJ0Lj3pLQpJ1%plkMklnJ8j5J1lnkJRkqLn
3564a1J0j0J3kj1J8r%LllNNrJRMjplLkpJ6Mj0nNmkQnJ0j7Q%Jj9J3nkJ0jljJjk
$$ y = [0, 1, 1, 9, -5, 9, 12, 2, 4, 9, 1, -1, -1, 10, -2, 0, -1, 7, -2, -2, 6, -7, 10, -7, -9, -6, -6, 0, -4, 2, -5, -10, -9, -7, -3, -1, -12, -8, -4, 1, -11, 10, 12, 6, 5, -2, -1, -2, -1, 4, 2, 0, 9, 2, 9, 7, 5, 3, -1, 0, 7, 7, 9, 4, 2, 9, 4, 2, 1, 11, 9, 6, 22, 5, 5, 11, 3, 2, 0, 2, 9, -16, -5, 2, 3, -13, -3, -7, -13, -7, -19, 2, -2, 4, -24, -10, -4, -4, 1, -17, 10, -6, -3, 3, -1, -2, -6, 0, -5, 7, 3, 0, 0, 7, 12, -1, -4, 6, 7, 5, 4, 13, 9, 11, 14, 10, -4, 2, 3, 3, 7, 7, 7, 4, 6, -2, -4, 0, -7, 1, -8, -1, -3, 1, -4, 5, -3, -4, -3, -15, -3, -10, -16, -2, -17, -15, -9, -2, 1, 2, -8, -2, -8, -5, -7, 1, -3, 6, 12, -4, -1, 6, 9, -7, 8, 5, 7, 7, 5, 10, -2, 9, 7, 9, -3, -2, 8, 12, -8, -1, 3, -1, -13, -6, -8, -13, 11, -9, -9, -3, -20, -8, -1, -5, -2, -8, -9, -8, -12, -5, 1, -9, -18, 5, -4, -4, -8, 2, -4, -2, -10, -7, 7, -5, -14, -1, -6, -6, -10, 8, -3, 7, 6, 4, 7, 5, 1, -5, 7, 5, -1, 6, 3, 1, 3, 1, 14, 3, -1, -5, 12, -5, 4, -1, 2, -9, -4, 1, -22, -7, -2, 6, -15, -6, -7, -3, 4, -15, 3, -6, -16, 2, 7, -13, -14, -9, 0, -3, 2, -11, -6, 3, -3, 7, -11, -11, 3, 1, -7, -7, -1, -2, 5, 3, 0, -2, 9, -9, 10, 13, 1, 1, 2, -8, 14, 3, 10, 3, 1, 1, -3, 7, 10, -3, -10, -7, 1, -6, 5, 5, -2, -5, -7, -3, -5, -8, -13, 5, -10, 1, -2, -7, -9, -8, 1, -1, -9, -6, -11, -1, -11, 2, 0, -11, 7, -2, -2, 1, -2, -5, 0, 5, -4, -3, 6, 10, 9, 2, -1, 2, 0, -7, 9, 13, 3, -2, 3, -1, -3, 5, 0, 10, -7, 1, 1, 2, -17, -4, -9, -11, -1, -2, -5, -6, -5, -6, -8]
3612hj%j0LKJ1j2PLQj2JPk3K7mpQoNNJM%j7J1J4j4RrNOKj2J2k1kJJ2noOKNj6m
3658a2J4jmqKPj0J6Nj2j%mMNLj0Rjj0Qj7J0lQlNjOjj9J3OjqJ2qJ3j2JNOJj4Pn
3704AlJ%MJ2mj3J3Mj9J4k1J7j0lJ1joQj2LjlMO%jkj3Q%Jj0J6kj7RRjNj3OKrLJ6
3750Iokj3JLJ4j3J3Mj6J5Oj2OKj4J0M%j7QRk3J0MpPKoNMl%k%oNrjJ1oj3mJ5pm
3796a7J2J0j6M%%nkQJ0rRj4PPj2J0jLoKKQj0rJ9lmLj0Rj2J5pOllqJ1J5j4j3Rl
3840bOnkoKPj2pJ7Oj1MKj1PMj1NQj6QkNpJOKRmnKJ0j4J1j2RoJ4ppkJ4oj2Oj3J5
3887@ll%J4j3pjMJ2nqJJjRj6PlkJR%j4J1j7J0%J%LmMJ0mj2MkNJ1nKkQKmkpQnQ
3937EPj2J1j5OJ1k5K5j9J6qpLRJ0j3rJ0Kj7QJ0j4J4%qLk1J3OppJ1j4RNj2KOJ0
$$ y = [-8, -9, -9, -19, -16, -14, -3, -15, -8, -5, 3, -9, -8, -1, -24, 3, -1, -8, 0, -6, -1, 4, 5, 9, 9, -8, 3, 17, 3, 12, 3, 8, 14, 16, 4, 16, -5, -7, -6, 6, 1, -5, 1, 3, 8, -8, -12, 2, 1, -3, -11, -9, -2, -12, 4, 9, -3, -4, -4, -8, -4, 1, 4, -6, 3, 2, -8, 0, -17, -7, -10, -2, -5, 0, -1, 5, 4, -15, -2, 4, 3, -5, 7, -1, 12, 0, 1, 6, 12, 13, -1, 6, 1, -2, -1, -1, 3, 15, 11, -2, 11, 15, -4, 10, -11, 6, -4, -7, 4, 3, -3, 5, -7, -4, -5, -8, -4, 2, 2, 1, -1, -14, -6, -6, -5, -15, 1, -1, -18, -9, 0, -1, 4, -9, -3, -1, -10, -7, 9, 3, 1, -12, -11, -8, 6, -7, 6, 10, -6, 9, 15, 3, 9, 11, -3, 7, 11, 11, -6, 2, 11, -12, -2, 2, -5, 2, 4, -2, 3, 7, 4, 4, 2, 2, -4, 1, -8, -9, 2, -4, -17, -21, -6, -13, -17, -5, 5, -11, -7, -7, -7, -12, -14, -6, 4, -5, 4, -10, -3, 4, -8, 2, 1, 4, -2, 0, 2, 10, 0, -9, 10, 7, 3, 6, -4, 5, -7, 8, 1, 7, 4, 1, -7, 4, 19, 5, -8, 1, -2, 4, -1, -3, -9, -7, 0, -12, -19, -2, 4, -7, -3, -1, -12, -5, -1, -12, -7, 1, -15, -7, -9, -4, -11, -10, -4, -2, 7, 3, -2, 0, 10, -4, 7, -5, 4, -2, 12, 5, -2, -4, 10, 4, -8, -2, -15, 0, -3, -6, -6, 8, -5, -12, -13, -9, 3, -2, -10, -9, -8, -9, 0, -16, -9, -12, -14, -13, -4, -4, -18, -7, -24, -14, -14, -13, -13, -10, -14, -10, 0, -4, -16, -12, -14, -9, 2, -3, -1, -3, 5, 7, 3, 1, -6, 2, -3, 5, 12, 0, 11, -4, 2, 13, -12, 13, -6, 10, 2, -5, -2, 7, 17, 4, -5, 5, 7, -10, -2, 8, -6, 8, 8, 0, 3, -18, -5, 1, -6, -13, -2, -16, -7, -2, -14, -12, -6, 4]
3977Dkj3jJJ2pJkPqJOKnOkJMlmPJmNq%jJ1nOnnjNklNjKNj3J1nj1RmoQkJj2J6j1
4030iNKoJ1Lj4QLqjqLLNJj1NOn%LK3j4LpQkLJlJLrPloJ1rKqPnqMrJ1J2j2lQmK
4082@KomKjj0LJ5kj2mJ7rMJkmLkKJ0Kj8M%LJ1%kqJ6rnNj3J7jnlJ0j4J2QpkJ4q
4129A0rJj2J1Rnmj0MQoOp%LjklpJ0Kj3NmOKMKr%KJ1lJOj1Poj2J9kj1PL%LqOmL
4179BOj0jNJjj7J4KJKmpJ1j5J2lmJ3j4JrPlJ3pmR%qMPnnPrpJ9rJ3j2J2oj0KPp
4226gKQjjPjNKj0nNL%kJnJ5k0J4rMjrJ5r%mLrMLjNJ2j6N%j6J4JrPr%J3qNrjRj0
4277a0J1qjPkOprRmPMJ1j4mlOLMj1K2jj8jJ1mjKkjnlJ0jn%oNj1J4j1KRjrPpJ1
4325ALrLknNoM%Kj%j2RJ4k2J6MnmlPlkLJ2j8OJ0nKKPlj0KjPoJ5lkmpMj0J2nJm
$$ y = [4, 2, -11, -12, -11, 1, -6, -5, -7, 0, -8, -7, -1, 1, -4, 2, 0, 1, 5, 2, -2, 5, 6, 2, 7, -1, -1, -2, 9, 4, 10, 5, 0, -1, 4, 2, -1, 4, 3, 5, 10, -3, 8, 3, -8, 1, -3, -9, -1, -3, -2, -14, 2, -9, -4, -2, -8, 3, 6, -8, 0, 3, -5, -6, -14, -11, -8, -3, -2, -13, -8, -2, -7, -7, -4, 19, 5, 8, 1, 9, 7, 10, 11, 8, 9, 12, 3, 10, 7, 1, 12, 3, 5, -3, 4, -1, -9, -5, -14, -3, 9, -3, -6, 2, -2, 0, 2, -4, -8, -6, -7, -17, -14, 1, -1, -13, -17, 0, -9, -5, -4, -6, -10, -7, -9, -7, 3, 5, -13, -9, -9, -6, 5, 5, 3, -5, 11, 2, -3, 2, -11, 6, 5, 0, -3, 7, -7, 5, 13, 6, 4, 18, 10, 1, 2, -10, 1, 10, 5, 1, -9, -5, 3, -3, 3, -4, -4, -1, -2, -4, -7, -14, -4, -2, -15, -10, -14, -8, -6, -2, 0, -9, -9, -7, 4, 1, 2, 8, -3, 4, -2, -14, 5, 3, -8, -1, 2, 2, 5, -3, 3, -1, 2, 8, -2, -3, 2, 3, 2, -15, -1, 1, 2, 4, 0, -7, 4, -11, 1, -2, -6, 7, -7, -6, -15, -8, -11, 2, -5, -9, 0, 0, -8, -4, 3, -2, -7, 0, -9, -16, 3, -6, 7, -5, 7, 1, -9, -7, 0, -7, -5, 3, 2, 1, 8, 7, 12, 14, 4, -1, 4, 7, 7, 5, 6, 1, 16, -4, 10, 1, 5, 4, -5, 10, 1, 1, -3, 0, -9, -5, -2, -3, 2, 14, -2, 3, 3, -13, 1, 2, -7, 0, -9, -9, 4, -4, 1, -8, -9, 0, -10, 1, -7, -8, -1, -3, 3, -4, -13, -4, -8, -1, 3, 14, 0, -4, -7, -1, 2, 6, -5, 17, 16, -2, -3, 8, 4, 3, 5, 3, 2, -3, -6, 4, 3, -2, -2, -8, -3, -14, 0, -11, -9, 0, -1, -10, -3, -10, 1, 4, -5, -2, -4, -9, -4, -10, -6, -6, -4, -5, -5, -17, -8, 6, -16, 0, 4, -1, -5, -8, -1, -4, -6, -3, 9, -9, -3, 7, 2, 4, 6, 13, 10, 0, 2, 1, 8, 2, 17, 14, 12, 8, 1, 5, -5, 7, 2, 3, -1]
4375aKj1NPj6J5Mj1KnJnLLOnJ2j3%k%%qJ4J0nooJ3j2LmKOmJ0Lj5OjOlmJlJJM%
4424@nJlJ0mJJomLJ3%oj8J3%lmOjLpJ1kqpJ1mj1PjJ6Pj5jJMPk%Jml%KKJ4j6J1
4473A0j2RrJ0mO%j7N%JoJqJ3jrJ4kJrKPj7KJLlJMOJj2OmJrJ0J3j1rJ1Oj4J7k0
4519a5LOklJ3nmRkJ0jkj8MJ8j4J4plQqLOj6PmlRkKj0J0j3MJpJ0Mj1jJ2%j1Pj3
4564a5K0lMj2nOnnJ0j1QqMJ1mNj2JJ2j0KLPj3QLJ2k1KJ0rLLjQj3LlJ1mmLojQM
4610FqKlm%J0qpJ3lrRkJ5k0LmRPpmmmQJ1j7J1j4J6j6J4OrJj3J2j1J2mNQnKo%J
4656aQoMLnMKLj3NrJ6j7NLoQokJJmj1LKPmkjmpPRJlkQnJ3kj0NLj4J2jjqJ0pRl
4708bJ5j1j8J5kjMqJ2jKrPKoQnkj4J1KpJ6j8J2oj3J5mMNj0J5rj6%J4Nj6MrJ6k
$$ y = [-1, 1, -10, -5, 2, -14, 1, 5, -6, -4, -9, -8, -13, -10, -7, -1, -6, 6, -7, -7, -9, -9, -9, -17, -3, 7, 2, -4, -10, 3, -9, -6, -10, -8, -2, -6, 4, 7, -8, -2, -3, 3, 0, -4, -3, -6, -5, -4, 0, 0, -5, -4, -7, 3, -1, 0, 1, -5, -9, -6, 7, 7, 1, -17, -4, -4, -7, -11, -5, -6, -3, -10, 1, -1, -9, -16, -5, -9, -20, -13, -14, 2, 9, -6, -7, -6, -2, 5, 3, 3, 4, 0, -3, -3, -1, 1, 15, -1, 10, -2, 7, -2, 8, 4, 10, 10, -7, -2, -2, -1, -7, -6, -14, -1, -2, -11, 3, 1, 2, -7, -5, 2, -15, -13, -12, -9, -12, -11, -7, -1, 0, -12, -6, -10, -9, -18, -8, 5, -6, -15, -4, 2, -12, 5, -15, -12, -6, -8, -11, 2, -3, -7, 2, 0, 10, 9, 7, -11, -7, 11, -3, 11, 4, 1, 9, 1, 4, 10, -6, 1, -3, -6, 3, 1, 3, -7, 3, -10, -6, -5, -12, -2, 2, -9, -10, 2, 2, -9, -2, -15, 5, 2, 6, -6, -11, -5, -10, -15, -5, -16, -8, -16, -12, -1, -5, 0, -12, -11, 1, -9, -7, -4, 3, -10, -2, 1, 13, -8, -6, 4, -5, -2, 1, 0, 8, -5, -2, -5, 6, 2, -2, 1, -5, -6, 2, 6, -2, 0, -3, -7, -7, 3, -5, -12, 1, -2, -11, -2, -4, 11, -9, -6, -10, -1, 6, -1, -5, -9, -13, -5, 6, -11, 0, -14, 2, -14, 0, 6, -3, -2, -15, -3, -14, -2, -6, -1, 7, 2, 4, -2, -2, -1, 7, 1, 5, 8, 3, 7, 9, 12, -1, 4, -5, 11, -6, -1, 2, -4, 4, -2, -4, -3, -2, -6, -17, -14, -12, -5, -9, -11, -12, -16, -23, -16, -7, -6, -9, -11, -3, -8, 5, 3, -7, -2, 1, -13, -1, -2, -3, -11, -1, -8, 1, -2, 13, 2, -16, -1, -3, -4, 0, -8, 4, 3, 5, -4, 3, 5, -1, 7, 2, 0, -14, -3, -1, -8, 8, -10, 2, -4, -17, -2, -6, -2, 3, -7, 8, -1, -17, -17, -3, 2, -14, -10, -19, -3, -5]
4751eOjj3J0KPlKJj1LLnJKOkOoJMn%pJ1Jj1PllJ4LrrljMOmRj8Qj4OJ5j1Qj5J3
4800@kq%QjkmkKkKqJ5j1LJjOjJ%kRnmJ6nOlqJ5koRpl%KoJPkj0J3qm%%nkJ1pko
4854a2P%nJ6omMmjQrJ4pj2RpKKpJ2MNppJjJ1nmjOkkLmMPrk%QOj0J8j6nj1K1oK
4904DmOknj3PLJ0j6MMmmOojPlrN%jRJj7QKnJ0jMKlmNpNOnnLPKoOj0JOLOj2JKL
4958EjoOLnlNk%jPj1Omkj0J6j4J0mnlPlMpMNQoj2NKPj3OOrJ4oK%poJj1K2j%On
5009@JN%j3QkMqJ0m%rJ3j0PjoLRmml%J2mj3PMnkJ3j3pNoj1J8nqJ6Jj2RllJPjm
5058hJ0kNpJ1j3J4opRm%j%jj0K1nPj5MjMKpKPrmKJoJ1j1MklQj0kOJ0j7POj2Qo
5106a0QLOl1J7MlOrPrJ1mJPmj0J1pJ9nj0nJ0Mj6J4Lj1PmoQLjjlMoQrQJpj1KJ8
$$ y = [-5, 1, 0, -13, -3, -1, 6, 3, 5, 6, -5, -2, 1, -4, -3, -1, 5, 3, 9, 3, 4, 8, 3, 3, -4, 7, 8, -3, 4, 1, -2, 12, 15, 6, -3, -6, -7, -3, 3, -1, 8, -10, -2, -16, -10, 5, -6, 2, -13, 0, -2, -10, -10, -2, -3, -5, -9, -11, -9, -11, -9, -17, -2, -13, -10, -9, -10, -4, -5, -4, -4, -6, 3, -2, -6, 10, 5, 11, 8, 0, 15, 13, 7, 16, 9, 6, 6, 8, 2, 3, 10, 8, -2, 11, 3, -1, -1, -1, -6, -8, 3, -4, -6, -12, -5, -5, -10, 6, 0, -4, 0, -4, -5, 3, -6, 8, 1, -11, -2, -9, -7, -5, -12, 0, 4, 9, 2, -5, -4, -5, 6, 1, -3, -4, 2, 0, -2, 1, -3, 1, 8, -1, -3, -3, 5, 11, 1, 19, 3, -2, -13, 8, 2, 4, 0, 6, 4, -1, -14, -7, -4, 6, -10, -6, -2, -6, -10, -4, -10, -11, -4, -7, -16, -11, -11, -12, -3, -2, -19, -11, -9, -14, -4, -5, -1, 1, -2, -6, -1, -8, -3, 3, -2, -7, -4, 3, 5, -1, 5, -5, -4, 2, 5, 11, -1, 0, 2, 5, 4, -2, 4, 7, 2, -1, 4, 2, 2, 1, 8, -3, 3, -1, -3, -13, 3, -11, -1, -5, -10, -13, -6, -9, -5, -12, -8, -3, 5, -1, -13, -8, -6, 1, -12, -6, 0, -9, 5, -1, 1, 1, -6, -12, -11, -22, 0, -1, -1, 5, 0, 1, 6, 6, -7, 1, -1, 3, -5, 5, 1, 1, -8, 5, -5, 2, 1, -5, -2, 7, 3, -1, -4, -4, 8, 4, -9, -2, 2, -3, -5, 8, -5, -12, -7, -13, -24, -6, -11, -19, -3, -2, -14, -5, -8, -11, -10, -3, -4, -8, 2, 0, 5, -2, 9, -4, 10, 4, -3, 6, 2, 2, 1, 1, 0, -10, 11, 6, 13, -2, 2, 1, 5, 7, 0, 2, 9, 0, -4, -2, -1, -7, 4, -7, -3, -5, -8, 0, -10, -12, -6, 4, -13, -6, 0, -12, -4, -10, -2, 1, 7, -24, -7, -3, -6, 0, -9, -2, -11, 0, -4, -3, 4, 0, -10, 1, -6, 13, 8, -2, -7, 3, 7, -9, 5, 8, -3, 4, 0, -6, 2, 5, 4, 3, 0, 4, -2, 6, -3, 5, 6, -1, -12, -10, 8]
5153HrKnkJKMMj2QKooOj2OMJNmmjPlPj4LJKjNmJ2r%kNJ1j6J3lKJJKOk6J4jJmj2
5205a0MJRkKmoknQOoL%OKj1jLqNOM%qMqLLNJqmKK1j2pQ%jKMrlJ1KJr%kQj4J2r
5259cNJ1j5Qj2mJ3lnNLorK5j7Kj0J2LrK1k2jJ5j5mkRPmqPNrRomLRrOlJ0oQj1Q
5306GqOoJ5pjlPqkmLQmnMnJ3jj0Qj3J2nkkMjj4LJ9mJrolJ3j0jrK0lMj4rJ0J4%
5354Bj8J2NRRj7Rj6JRkQlOj8J1lMq%Qj1J0jLLkj0O%oJ7k1JLlj1POMoOJnnLmj2
5402a9J8KQj7jNjJKJj1J5lrK1j2oJ3Mj4QQpJLpn%PPnkJ0nKmj0RRk4J5j4PQnJk
5449BKJlj3QKjl%k%PoJJjNJJ0j2%%pJ2Kj1RlMpJ0%j1KNnJlj6J5Lj0J2J0j4J1%
5496HnMkKkOj3Pj4KKJoJ1jnLrQMJkokNNj7PkP%JqPPJj6J2J0j0jpJ3Nm%oLJqMK
$$ y = [8, -1, 1, -4, -6, -5, -3, 1, 5, -7, 1, 3, -3, -9, -3, -15, -9, -5, -4, 1, -3, -7, -8, -1, -4, 3, -11, -8, -7, -5, -6, -1, -5, 7, -2, -2, -4, 1, 12, -4, 9, 6, 8, 9, 10, 12, 18, -8, 6, 5, 6, 2, -10, -6, -5, 4, 2, 4, 0, -6, -8, -13, -5, 1, -5, -2, -2, 4, 6, -5, -6, -3, -11, -6, 0, 4, 4, -4, 0, -8, -5, -2, 3, 4, -4, -8, -6, 15, 3, -4, 4, 4, 3, 5, 9, 0, -3, 8, 10, 11, 2, 2, 0, 8, -6, 6, -3, 2, 13, -2, 6, -6, -10, 3, 0, -5, 0, 3, -3, -12, 13, -4, -2, -12, 0, 3, -6, 15, -7, -8, 7, -8, -12, -14, -5, 2, -2, -10, -3, 2, -7, 2, -4, -8, -5, 4, -5, 1, -2, 8, 2, 10, -1, 7, -1, 5, -1, 14, 7, 6, 3, 10, 2, 0, -4, -1, 7, 3, -2, 2, -3, 10, 9, -1, 7, -6, 6, 1, -1, -3, 1, 0, -14, -11, 8, 4, 5, -4, -10, -13, 0, -10, -11, -20, 0, -3, 1, -13, -22, -12, 2, 2, -16, -4, 1, 10, 19, 2, 11, -5, -4, 5, 3, 11, 8, 14, -4, 7, 4, 8, 0, 0, 8, -3, 7, 6, 9, 12, 10, 0, 6, 6, 0, 17, -4, -3, 0, -3, -14, -7, -1, 3, -3, 3, 4, -1, -6, -3, -7, -19, -1, 1, 9, -8, -9, -4, -5, -4, -2, -1, -12, 3, 0, -9, 12, 0, -6, 7, 11, -3, 5, 13, 6, 7, 10, 3, -2, -2, 5, 12, 7, 5, 15, 10, 12, 8, -2, 7, 16, -8, 7, -7, 0, 8, 3, 4, 2, 4, 5, 2, -11, -3, -1, -2, -5, -5, -7, -7, 0, -6, -5, -4, -5, 0, 1, 11, -1, -1, -1, -8, 4, 6, -5, 4, 1, 5, -2, 8, 8, -3, -1, 4, -1, 0, -3, -19, -4, -1, -11, 1, 11, -3, 8, 8, 3, 7, 5, 7, 5, 11, -2, 5, -9, -7, -5, -4, -10, 1, 0, -5, -2, -11, -3, 1, 2, 0, -6, -8, -3, 2, -15, -8, -10, -3, -3, -2, -10, -3, 4, 5, -11, 1, 11, 1, 0, -7, 6, 11, 7, 7, 1, 4, 5, -3, 1, 3]
5548C%%LmK%Ojj3O%lKJ2q%njRj6J3MnpLJ3j6Nq%NpkNJjQkj4rJ6%%lONj6J1LqR
5599AkJ5kk3J2KJNL%j2Mmj1J5JMp%pQNlmpJ8j5J2j6%MJ3k2NRkOk1J3ONj8MN%j0
5645a0J1j0MMLlkrJ1J1j5ONj0KJ6jJl%nPpRn%Kn%j1J4j7J1mRj2L%jqQj1OJOLo
5692bQoojQrJLj0KQLplnK0j0NOnKMj5NRqkRJjpJ3J0j5J0j3PLjlkPlloMmM%Qj4
5743arJ4Kj1Nj3K0j3%O%ojJ5qKpJOqNrRjmkrJ5%PNno%%mOmlJ6Kmpjj5J6MNj3l
5793fK6j5jnJ0%pkQnnJ2j1NqOJk0PKnkJ5j5J1pJKlJ2mPJmnLOnPlj2MJ3lLqkmJ0
5842EJ0j2j%NlMpLQlmqJ0OqMlQk0OkQqqNMJ1j0j5MO%JpQpJ8j1qQjJnJ0Jj4J6p
5891bOj7K6j0j3J0MKMj4J0lJ4j9J1j0J2njj6J7MpkJQj4J0PkmonJ1j0J0j2J3Kj2
$$ y = [3, 3, 3, 6, 2, 4, 4, 10, 9, -4, 2, 2, -1, 1, 13, 5, 5, 0, -1, 8, -8, 5, 9, 4, -3, 0, 13, -3, 2, -6, -6, -1, -8, -10, -5, -4, -5, 3, 1, -13, -22, -6, -6, -6, -9, -3, 2, -14, -3, 0, -8, 1, -1, 14, 12, -11, 1, 3, 4, 9, 12, 12, 0, 4, 0, -11, 4, 5, 9, 2, 2, -5, 3, 8, 5, 1, -6, 12, -3, 9, -7, -7, -3, 10, -12, -7, 2, 0, 6, -15, -2, 4, 9, -9, -5, 0, 0, -10, 1, -9, -5, -1, 2, -1, -3, -12, -1, 10, -5, 1, 6, -4, -2, 14, 13, 14, 11, 11, 6, 13, 6, 15, 10, 10, 12, 7, 7, -4, 10, -7, 4, 0, 9, -3, 0, 0, -1, -9, -1, -12, -6, -5, 1, 4, -2, 6, 0, -6, -7, 1, -8, -7, -4, -14, -12, -4, -1, -8, -11, -16, 4, -6, -1, 5, 0, 2, 6, -9, -4, 5, -3, -5, 4, 5, 4, -3, 10, 20, 5, 15, 2, 9, 12, 11, 8, 6, 13, 10, 7, 1, 5, 1, 5, 5, 13, -1, -10, 4, 6, -5, 0, -13, 7, -6, -6, 0, 0, -6, -7, 8, 0, 2, -5, -4, 2, -6, -1, -10, -1, -2, -6, -8, -17, -2, -2, 5, 10, 5, -1, -1, -1, -5, 1, -3, -6, 10, 12, 8, 1, 0, -15, 1, 5, 10, -3, -6, 20, 5, 4, -1, 9, 9, 2, 0, 8, 3, -2, 10, -1, 4, -4, 2, 3, -17, -10, -8, -13, -15, 0, -15, -4, -11, -10, -8, -11, 1, -3, 4, 5, 1, -4, -1, 5, 0, 7, 4, -8, -4, 9, 6, 9, 1, -1, -5, 5, 15, 3, 2, 2, 7, 4, 8, 1, 4, 12, 9, 5, -3, 7, 13, 5, 9, 6, 14, -6, 0, -2, 6, -2, -10, -5, -1, 10, 0, -15, -11, -5, -5, -4, -11, -3, -10, 8, -3, -11, -3, -4, -3, -8, 2, 3, -11, 5, -2, 4, -13, 13, 3, -10, 0, 4, 6, 10, -4, 6, 3, 17, -2, 9, -1, 11, 6, 5, -11, 6, 10, 3, 1, 2, 10, -4, 6, 13, 11, 7, 1, -4, 7, -3, 7, -5, 8, 10, -2]
5931bNj0nRrJLMLj1Rj2J3%oMJ0oMj3QNpkNKMJJqJlPPqOj1J7q%jkKqLKJ4k4%JM
5982al%LQj2LLj3OJ7j8QJoKJK%pQlPj5J0njLNnRoMjMoKrJ7Jj5J2lPj2jJ1pJMj2
6032bJ6j2N%jjNnj2J0j0JPmloNMjMlm%%J7j3qJ1jlM%nJ1rQj4ORqOj0Qm%J0j4J3
6080Gj5QLlmPJpJ3jnJ0lLj1Pj2J4j9J2rNLnlOj6J1kJ1nj1Pj3RnJ1ojnNKJ0j2l
6125a1J4j4J1LJj2nRQmmRKJJj3lJ0JkKPj5J0LpJRMqkmMKkLnjNj1mJ3jNojoJLm
6175crjJ5rkNjl%LjqROJqPJ3p%j2J5lj3R%k1J3JLK%j0J0%PpnOJ4j6Kj0qJ4%k%
6223dNlJ0j8PMpKPj3Qk%pJ4j6OK%mJ2k0J7J4j5%KkQj0KNrrJ2M%KmlN%nPpkLPn
6272@J4nqnQ%oPmRk0PoJ1oj9J5j0J1NqQkPnLpjrOKMnJjPnlJ5j7J3j1K%RpjjJ5
$$ y = [-2, 3, -7, -12, -3, -12, -11, -8, -4, -1, -12, -3, -15, -2, -2, -8, -4, 6, 0, 4, -9, -1, 4, -3, -5, 0, 2, 6, 7, 8, 0, 1, -2, 5, 12, 4, 10, -1, 16, 8, 8, 7, 5, 7, -1, 2, 4, 18, -6, -6, -5, -1, -4, -4, -1, 7, -5, -2, 1, -12, -6, 11, -7, 1, 2, -4, -2, -1, 1, 1, -6, 2, -1, 6, -9, 1, -4, -5, -2, 3, -2, 7, 1, 5, 4, 8, 2, 4, -5, 12, 13, -2, 10, 7, 14, 2, 1, 12, 5, 6, 10, -2, 14, 2, 7, 7, 6, 5, 10, 5, -7, 3, -7, -6, 1, -3, -6, -12, -7, -3, -4, 0, -3, -7, -7, -7, 10, -3, -11, 0, -1, -4, 0, 0, -5, 6, -3, 5, -9, -3, 6, -2, 4, -6, 2, -2, -2, 8, -6, 7, -8, 0, 3, 0, -4, 3, 4, -3, 10, 9, 4, 14, 11, 14, 3, 10, -2, 12, -7, 5, -4, 1, 4, -1, -4, 2, -14, -3, -5, 6, 1, -10, -3, -16, -7, -12, -1, -7, -8, -13, -8, -6, 4, -8, -11, 3, -11, 0, 3, 4, -8, -13, -4, 4, 0, -4, 5, 7, 8, 9, -4, -7, 3, 4, 2, 4, 11, -4, 6, 9, 2, 3, 12, 16, 8, 6, 2, 6, 8, 6, 9, 4, 3, 8, -3, -7, 6, 5, 10, 4, 3, -3, -2, 1, -3, -12, -13, 2, -7, -9, -4, -5, -8, -8, -5, -6, -14, -5, 1, 2, -6, 1, 14, 7, 7, -5, 10, 7, -6, 3, 3, -18, -5, -4, -1, 1, 1, -9, 1, 1, 8, 1, -4, 2, 16, 0, 2, -8, -16, -2, -2, -4, -4, 1, -2, 8, -10, -3, 1, -6, -4, 3, -10, -2, -4, -4, -11, 3, -13, -7, -5, -5, -9, 3, -17, 0, 14, -1, -1, 1, -1, 7, -3, -1, 4, -5, -14, -2, 2, 2, 4, 0, -3, 2, 2, -3, 4, -3, -5, -2, 5, 0, 14, 9, 1, -4, 4, 4, -2, 5, 1, 10, -10, -3, -9, 2, -4, -23, -8, -18, -7, -2, -10, -2, -4, 3, -2, 1, -6, -7, -16, -10, -8, -4, -9, -8, -9, -2, -7, -10, 5, -12, 1, -10, -8, -8, 1, -6, -7, -8, 7]
6321GoPj2O%MLjj3JNJPj0O%qJPkj0Qj3J7j7J0Mjmj2QlkJNLQj2LJKJ2k8J3j2J3
6367cjM%OjJj7LJ0lKQj4J6j1rNKM%LLnjOpPnqKPj4J0Nj2mrJ0mMMj0J2%J0m%qJ
6416ejPnmkJ0j1JMoJ8j5Mm%jNqK4j1mRqQqmjJ4jOj2LJ2j5OoOQnopMlJ5nrJjNL
6466EmljjMmNqMkKLnnKJ6k6K5j6Rj0J4j3MMRpmlNqJ9mpmJJ4mj3JlNLjJmO%Rj2
6516bJnOokJ1qJ3j3OKj7J2K%Oj0Qj1Qr%Or%J0KO%lkjOk2K4rMmkJ2lJj1RlPj2K3
6564B1j0Kj1nJ4mkNj5OrJ1mNj1jJ8j1%KrLkKqJ1lPLJj7J6joj0RJnOnLjJ0qj2J6
6610BLj3NjOKKjlQ%qnJ0kjjOnNJj0M%j0MOn%lPnlkJ4j4J3j7OjKPpOrQrMqJ0ml
6662ijPJKrJ6LrMpkoK0j3JoQmjKJ0qPJj0%J2mJ0j3knJ5loPKqoPNj6Rj%oKJooJ6
$$ y = [7, 1, 8, -4, 2, 2, 6, 9, 8, -5, -4, 1, 2, 9, -1, 5, 5, -3, -2, 5, 3, -7, 1, -12, 5, -12, -2, 2, 1, -3, -15, -7, -10, -12, -11, -6, -3, 5, -7, -4, -3, -1, 11, -17, -4, -16, -3, -4, 0, 0, 6, 5, 6, -11, -8, 2, -1, 1, 9, -5, 11, 0, -9, -4, -2, 2, 2, 5, 8, 3, 2, 8, 1, 8, 3, -5, -3, 4, -10, 0, 5, -7, -11, -20, -10, -14, -10, -6, -16, -4, -4, 6, 2, 2, -6, -5, -6, 1, -4, -8, -10, 0, -11, -10, -6, -12, 6, -9, -5, -9, -9, -10, -5, -13, 11, 0, -4, 5, -3, 5, -3, -7, -8, 6, 5, 11, -1, 2, 14, -1, 5, -1, 5, 13, 8, 2, -5, -1, -4, 11, 6, -3, -2, -3, 2, 5, 1, -2, -3, -4, 0, -4, 1, -7, -3, -5, -3, 0, -5, -10, -8, 8, -18, 7, -9, 0, -10, 4, -9, -5, -1, 8, 1, -3, -6, -1, -9, 10, 6, -1, -5, -4, 10, 6, -7, -6, -9, -4, -1, -2, -1, -5, 1, 1, 10, -2, -1, -6, 0, -6, -8, 3, -5, 8, -5, 1, 3, -14, -2, 0, 0, 6, -4, 4, -7, 1, -8, -8, -2, -11, -11, -1, 1, 7, 7, 4, 2, 1, 7, -15, 9, 0, 4, 0, -2, 10, 7, 8, -3, 6, 3, 10, -2, 21, 11, 13, 2, -3, 11, 7, 5, 10, -5, 1, -8, 3, -1, 4, -7, -8, 10, -1, -1, 1, -8, -5, -7, -5, -13, -2, -5, 2, 5, 6, -11, 5, 4, -2, -12, -3, -2, -7, -1, -6, -3, -4, 6, -2, -14, 2, 5, -8, -3, -4, 2, 4, 6, 5, 2, 10, 10, 2, -3, 7, 5, 4, 3, 9, 4, 9, 10, 0, 4, 4, -6, -2, 4, -1, -1, -4, 3, -2, -5, -7, 7, -7, 6, -11, -5, -6, -4, 3, -4, 2, -7, 1, -8, -4, -12, -2, -6, -9, -10, -3, -2, 0, -9, 7, 10, 1, 5, -2, -4, -10, 10, -3, -2, -8, 0, -4, -5, -3, 7, -1, 6, 7, -3, -3, 9, 5, 15, 2, 0, -5, 10, 7, 1, 8, 10, 2, -4, 3, 8, -8, 1, 0, 0, -6, -4, -3, -9, -15, 1]
6713Aj%mj0J5k0K0JlnmjQNjjmNJ3mmqRjLJkNp%oJ3lj1LRj1pJ0nJ2lQrj4J6lJ1
6761A6qj6J6j0j5J9j0QOj0NNj8POj1J5oj5J1%%Rj1JjQJ5j4KjMqJ0MlJqRj1%jm
6804dJ1J0j6mROqrJ7Jj1KJrJ2rQj2kjJ7k2J4Nj4MPLq%mJ0jllpKjJ6ooKkQlLK%
6852EpNMn%P%lkqJ6%j7J5%pJ1j2k%MKj8QjMJrJ3LqrKJnJ0%lj1J1kLlLlMJ0j0j0
6901a3J1rLJ3j0jRj0NJQpljJOpLOKRj7J0Jp%PnmRnKrkJ3p%Loj0QJqL%mLJ3lqq
6952a4%J4JKmKpPkMlNK%rj1K2j6J0pnJ2Qjj3JQoJRj3MO%MnJJ0j8J2jjnqMJ2j0
6999BqlLjl%QLj1OkJj%MMpJ2k6J7JjpJ6rJ3j2mMjJ3j6J2j2QQKj3MNjolKQjoQO
7048A6j0NLorLMQrkOrqLQj2mK5j8pJ5j1J1lqPnOjKpQPk0J6lpNkJ1qJ7j6KLLj0
$$ y = [1, 0, 0, -4, -14, 1, -19, 1, 2, -1, -6, -10, -11, -3, 2, 1, 0, -4, 1, 14, 10, 6, -2, 7, 6, 9, 10, 8, 13, 6, 6, 0, 13, 10, -1, 2, 11, 0, -7, 3, -2, 10, 7, 15, 6, -8, 8, 5, 16, 8, -8, 8, -2, -17, 2, -8, 0, 6, -4, 1, 6, -12, -5, 1, -10, 5, -1, -16, -5, -5, -5, 4, -7, -6, -7, 1, 16, 2, 4, 3, 7, -1, 9, 13, 10, 11, 3, 12, 1, 1, 0, -4, 7, 17, 1, -3, 6, 12, 4, -5, 12, 13, 2, 4, 5, -4, 8, -1, 7, -5, -7, -8, 9, -13, 1, 6, -8, -4, 3, 6, -2, -2, -6, 4, 3, 0, -3, -10, -8, -9, 7, 1, -5, -3, -5, 3, 0, 3, 5, 5, -2, 3, 7, 2, 2, 9, 9, 6, 4, -4, 12, 12, -5, 10, 10, 3, 14, 2, 0, 0, 4, 6, -12, -4, -5, -1, 0, -9, 4, 7, -1, -10, -8, -7, -12, -2, -2, -5, -16, -5, -7, -4, -7, -4, -7, -3, 7, -3, -13, -2, -11, -8, 5, -5, -6, 3, -7, -2, -1, 7, 0, -3, -4, -3, 3, -4, -1, 5, 7, 16, -1, 9, 10, 3, 3, 10, 5, 1, 10, 5, 7, -2, -4, 9, 2, 2, 5, -1, -11, -3, -2, -10, -7, -7, -11, -8, 5, 2, -6, -14, -14, 0, 1, 3, -1, 1, -6, 1, -1, 3, 0, 5, 7, 7, -2, -13, 9, -7, 3, -4, -9, 3, 11, 10, -3, -2, 6, 0, 1, 10, -3, 1, 7, 7, 11, 6, 7, 17, -1, 11, 10, 9, 4, -4, 0, 12, 2, -6, -9, -6, -7, -10, -10, -2, 1, -10, -4, -6, -5, -6, -6, -2, 2, -5, 7, -19, -2, -1, -2, -9, 7, -2, 11, -1, -5, -1, -2, 11, -5, 7, -5, 3, 11, 13, 0, 4, 9, 8, 2, -1, 1, 9, 8, 2, 10, 16, 6, 11, 14, 8, -1, 2, 6, 14, 5, 3, 9, 0, -8, -5, 3, -9, -13, 12, -6, -13, 2, -9, 2, -1, -9, -2, -7, -1, -2, 0, -7, 1, 8, -12, 4, 1, -6, -1, -3, 8, 0, 17, 1, 3, 6, 9, -1]
7095aRoJ0mkrJ%jJPLnj1%O%MnQj7kPKnJPj2K3j2J3j6JJ4nj4J3m%%lLQpjj2LJ4
7143Dpoj0L5j7J4j4KJmLmJ0j1J0jKKMJ2k0nJ2qLoqJ9rJ0j7mOnMKJ2j4%%Pj2KN
7187aMj9J4Rj6J3rjJ0j0PnNj6K3lpJ1qj0jKJ8qjRj1NRlj0oJ6j4J0qJ2nlJ0Jpn
7230ANj1PpLlJ5nj4PKj3KJ0pLmOj3NJ3lLKlj0%RJ0j7JJnjJ0%JmjLJJ2j3LJ3j3
7276AkkRpmKmJ3mJ2j1j1K2j0pJMj4%Pkj%PpOJoPj1NmM%mnMlJ3nLMrjj2K0noQj0
7326a4OPOrOMmOlj3JKRnjLKkQ%j3KjMLpJ5j6jRqkjJ1j1%JRk%qjRKj3OllL%mJ5
7378DpmKQmj1J0mkJJ6j6PqJ2mJqNlOj1RJ%oPnkPmJ0qkJ1j4LJkkLj1KN%lmMJ2j1
7428ilONj1mjJ6qM%mmLjJJ2oJLKKKolLKj5J7Jj9J9j3J2Pj4MnMJJ0j4PnkJoJ6m
$$ y = [-1, 8, 2, 12, 8, 6, -3, -2, -2, -3, -2, 5, 8, 3, -8, -8, -2, -2, 2, -3, 5, -12, -14, -7, -5, -10, -9, -2, -14, 9, -3, 10, -6, -5, 9, 4, -10, 3, -1, -1, -1, -4, -1, 7, 0, -1, -13, -10, 4, -3, -9, -19, 16, -1, 13, -1, 1, 2, -2, 1, -3, 7, -4, 6, 5, 7, 9, 13, 25, 5, 0, 12, 4, 7, 1, -7, 12, 3, 13, -4, -8, -2, -7, -3, -1, 11, -3, -3, -3, 4, -8, -6, -1, 3, -16, -2, 7, -9, 4, -5, -6, 4, -6, 1, -4, 1, -15, 8, 5, -2, 9, 1, -9, -10, -8, 10, 2, 1, 10, -1, 4, 13, 10, 0, -6, 10, -4, 6, -2, 10, 5, 2, 12, 13, 6, 1, 6, -5, 2, -5, -2, -5, 10, 5, -9, -2, 0, -13, -11, -1, -8, -5, -9, -3, -16, -11, 2, -1, 2, 4, 1, -9, -9, 0, 10, -7, -6, -5, -10, -11, -1, -1, 0, -4, -5, -2, -1, 11, -2, 1, 14, 1, -1, -3, 6, -1, -5, -3, -7, 6, 2, 14, 3, -8, 14, 4, -3, -2, 2, -12, -12, -5, -7, -8, -8, -1, -8, -2, -1, -7, 0, -11, -6, -10, -6, -6, -10, -15, -11, -14, -1, -6, -3, 1, -8, -9, -21, -1, -6, -12, -4, -14, -8, -1, 5, -4, 2, 6, 2, 8, 5, -8, -7, -5, 4, -1, -2, 1, 3, 1, 9, 9, -4, -2, -3, 1, 4, -3, 12, -4, -5, 4, -4, -6, -7, 4, -7, -7, -6, 3, 1, 1, -7, -8, 1, 3, -10, -4, -7, -10, -7, -7, -11, 4, -3, -7, -5, 3, -1, -12, -2, -6, -8, -7, 9, -7, 0, -8, 4, 0, 1, -7, -2, -5, 1, -10, -1, 0, 0, -6, 1, -4, -6, 1, -3, 7, -1, -3, 8, -6, -3, -2, -4, -6, -3, -14, -12, -7, -7, -10, -14, -10, 2, -9, -12, -6, -1, -12, -16, -17, -1, -9, -5, -5, -9, -13, -10, -11, -10, 2, -4, -3, 0, 2, 4, 6, 0, -3, 0, 2, -13, 4, 5, -14, 5, -8, 4, 11, -3, 1, -4, 0, 1, 11, -3, 4, -1, -3, -2, -8, 8, 4]
7476DnmkPpLoPooOknMJ3qJ1k3J4ojNnljLJ0%lPlj1L%J2j1MPoOj1J5Ok4J9Pj0K
7524Fj1RkQpLj3OK%J4k1J0j7NKj0K0r%j0J7j0NLj0QmMj0O%KlKjPoMJmJMnNpkj
7572iQPj4NkJ1kQqnnKO%jN%j4MQp%Kj1LlMQmkNj2QKj2JJQLj0NllQnL%nJ4Orjj
7625cJJRKlJoJ2j6J6rMqK%NmoRonlJ3o%kMpJ0lpNMmj5QNkr%QQorJ6j2LpOrMRp
7678iOqkJ8j4nPNmNLnoOJnJNJ2j1kOKj3%J7j3jLMjj2J3jopPPrj1J7rJNlNjlqM
7728ilJ1%j4J5kOoj0MLMnMqJ0KqKjKPloKJ4rKRj5J0nqJ0J0onkRnjkoMKLnj4J0
7777cj%mkQmNJj1J2oOj6jK0j4J0Mj0QpKmmPqkJ8p%j0PPklJ0j0kJ0oJ0Olj9PMM
7824GnJq%jJ%kJ2j3J3kJqmNj2MJ4%j4J4%nrlKRpJ0pJ6j0NOrqPKj0J0nj0J8r%P
$$ y = [4, -1, -5, -7, 0, -7, -4, -10, -3, -9, -15, -9, -11, -16, -12, 1, -7, 4, -19, -5, -11, -12, -7, -12, -15, -16, -13, -3, -3, -6, 1, -2, -13, -10, -10, 2, -9, -5, 2, -4, 2, -9, 6, 12, -12, 7, 14, 4, 6, -5, 4, 2, 10, 3, 6, -7, -1, 1, 1, 15, -6, 4, -13, -8, -6, -16, 4, -5, -5, -15, 2, -8, -3, 0, -10, -2, -6, -2, -12, -6, -6, -4, -7, -5, -6, 1, -5, -1, 0, -4, -3, 1, -4, 1, -6, -8, -9, -1, 6, -8, -3, -5, 6, 4, 12, 4, -1, -6, -4, 2, 2, 1, 6, 6, -8, -4, 4, -3, -3, -1, -12, -9, -12, -8, 0, -4, -6, -1, -13, -5, -3, -15, -14, -13, -5, -2, -12, -7, -10, -13, -5, -10, -7, -7, -12, 2, 8, -1, -2, -3, -2, -1, 8, 10, 7, 8, 2, 14, -2, 14, 5, 9, 1, 3, 3, 8, 4, -2, 7, 1, -4, -7, 6, 0, 0, -2, 2, -5, 5, 2, -5, 0, 4, 0, -15, -7, -2, -4, -13, -13, -5, 3, -3, -12, 4, -8, -5, -12, -6, -15, -11, -2, -9, -3, -11, -13, 5, -9, -14, -7, -2, -6, -1, 2, -3, -9, -3, -2, -7, -6, -1, 11, 0, -2, 4, 6, -7, -7, 10, -3, -4, -1, 3, 2, -10, 3, 2, -4, -11, -4, 3, -6, -17, 0, -9, -8, -3, -6, -1, -2, -5, -13, -9, -12, -1, -1, -15, 0, -2, 4, -2, -12, -8, -5, -1, -6, -2, -10, 0, 2, -6, -4, -5, -3, 4, 1, -5, -3, 11, 2, 4, 13, -2, 8, 3, -5, 5, 15, 9, 4, 2, 11, 6, 5, 3, -3, 1, 3, 6, 1, -13, -3, -4, -4, -8, -10, -2, -6, -1, 0, -11, 1, -5, 1, -15, -16, 4, -10, 0, 4, -6, 2, -5, -3, -7, -11, -4, -12, -14, 4, -3, -3, -13, -6, 1, -1, -4, 6, -4, -6, 4, -2, 8, 14, 11, -8, -1, 3, 7, 2, 3, -5, -5, -6, -5, -5, -7, 5, -8, 5, 3, 4, -4, -8, -3, -15, -11, 3, 3, -11, 3, 3, -2, -11, -14, -12, -3, -10, 0, -7, 9, -1, 4, 10, 1, -7, 0, 2, -8, 2, -3, -13, 5, -4, -4, 3]
7871CJKJnOPj5J8lp%Kj2J0omJ4krQj1O%Kj3K1qmlMmJrL%llMJ2j5MnJ5lj1J7oo
7919fJ7j2Pj0JKRqMK%kkOnrMJ7k0J1mnRj0P%oP%NjpLmrOJ0rNj3LkJ2MoLppJ3o
7969cKJjkJ2j4OLKj2KLMKkj%joJ3MnmqJ9lk%rOqMKqMJ0Mj4l%oQNmjj3J5nKLj4
8020a3OmJ1mJ3nM%Kj3J0j0LOj3QOpqOJLMoMpJlJ3j1J1Mj2Nj5J0JJ0oj2NLJJ1p
8065FjMmj0KjMrMJ2noMkQlj2PMj0KjJQj2J0oKnRPj2Mj2J2JLrJjJ2n%OoPo%%%r
8116gROMj7J2nJ0kj5J9pNjj1Nl%O%j%j8J5qJJ1k1J3Rmj1mJ0jKMkJ1j6JPoJNjj2
8162gRpLRqJ%OkpNLkm%ojRJjLokRQpmMj2
$$ y = [3, 4, 6, 7, 2, 8, 15, 0, 18, 15, 8, 8, 10, -2, 8, 2, -2, 12, 10, 1, 9, -2, 4, 4, 6, -7, 14, 6, 2, -1, 3, -1, 0, -9, -6, -6, -9, -12, -8, 4, -11, -7, -12, 3, 0, -11, 6, 0, -6, 11, -1, 6, -4, -3, -1, 8, 0, 4, 6, 6, 4, 2, 8, 3, -6, -2, 15, -5, 6, 2, -3, 6, -4, 3, 3, -3, 4, 4, 9, 8, 1, 4, 0, -9, -3, 7, -2, 3, -10, -7, -9, 3, 7, 1, 4, -3, -10, 3, -3, -1, 0, -1, -3, 9, -5, 1, 4, 6, -6, -4, -1, 3, 5, 3, 2, 2, 1, -5, 8, 12, 7, 3, -5, 14, 11, 9, 9, 0, 6, -2, 2, 4, -4, 0, 10, 14, 0, -3, -3, -9, -1, 4, 0, -1, -14, 1, -4, -2, 1, -13, -7, -11, 0, -4, 9, 4, 8, 8, 10, -3, 7, -3, 0, 6, -7, 1, 7, 0, -8, -2, -1, 2, 6, 0, 4, -3, -2, -5, 8, -3, 8, 12, 0, 5, -10, 0, 1, 11, 5, -7, -2, 1, 2, 13, 6, 5, 9, 5, -5, -3, -4, 0, -9, -5, 7, 2, -4, 0, -2, 6, 3, -9, -2, 2, -8, -6, -7, -6, 2, -10, 0, -6, -4, -9, 0, 7, -5, -1, -13, -1, 0, 3, -6, -5, -6, 6, 1, 1, 7, 1, 8, 2, 2, 2, 2, -7, 2, 8, 12, -5, 7, 2, 12, 10, -5, 14, 7, 12, 11, 0, 5, 2, 2, 8, 8, 7, 7, -11, 4, -4, -3, 8, -13, 0, 9, 5, -6, -10, 0, -1, 1, 5, 3, 14, -2, -1, 6, 0, 1, 6, 5, -7, 2, -5, -2, 7, -1, 0, 0, 6, 4, -3, 2, 5, 3, -1, -1, -7, -8, 1, 2, 1, 4, -2, -4, 5, 13, 6, 2, 6, -6]
8191f
##END NTUPLES=NMR FID
##END=
