##TITLE=1H_CPAA-3
 CDCl3
 8 sc, 
 13.4.2023
##JCAMPDX= 6.0         $$ Bruker NMR JCAMP-DX V2.0
##DATA TYPE= NMR FID
##DATA CLASS= NTUPLES
##ORIGIN= UXNMR, Bruker Analytische Messtechnik GmbH
##OWNER= root
$$ XWIN-NMR		Version 3.5
$$ Thu Apr 13 13:59:36 2023 Russian Standard Time (UT+4h)  she@DPX200
##.OBSERVE FREQUENCY= 200.13135
##.OBSERVE NUCLEUS= ^1H
##.DELAY= (6, 6)
##.ACQUISITION MODE= SIMULTANEOUS
##.ACQUISITION SCHEME= undefined
##.AVERAGES= 8
##.DIGITISER RES= 18
##SPECTROMETER/DATA SYSTEM= spect
##.PULSE SEQUENCE= zg30
##.SOLVENT NAME= DMSO
##.SHIFT REFERENCE= (INTERNAL, DMSO, 0, 15.7039)
##AUDIT TRAIL= $$ (NUMBER, WHEN, WHO, WHERE, WHAT)
$$ ##TITLE= Audit trail, XWIN-NMR		Version 3.5
$$ ##JCAMPDX= 5.01
$$ ##ORIGIN= Bruker BioSpin GmbH
$$ ##OWNER= she
$$ F:/spectra/data/she/nmr/H-F/1/audita.txt
$$ ##AUDIT TRAIL=  $$ (NUMBER, WHEN, WHO, WHERE, WHAT)
(   1,<2023-04-13 13:58:21.12 +0400>,<she>,<DPX200>,
      <created by zg, POWCHK disabled, PULCHK disabled
       configuration hash MD5:
       00 E9 B6 7A A2 85 ED C7 34 08 36 98 17 FE 4E 26
       data hash MD5: 16K
       45 CB E8 B9 8B 08 86 93 BA 33 01 2A 02 ED 17 8B>)
$$ ##END=
$$ 
$$ hash MD5
$$ 59 43 54 66 56 89 69 6C 8F 25 C9 1A F6 14 5B 72
##$RELAX= 
##$RELAX= 
##$RELAX= 
##$RELAX= 
##$RELAX= 
##$RELAX= 
$$ Bruker specific parameters
$$ --------------------------
##$DU= <F:/spectra>
##$EXPNO= 1
##$NAME= <H-F>
##$PROCNO= 1
##$TYPE= <nmr>
##$USER= <she>
##$AMP= (0..31)
100 100 100 100 100 100 100 100 100 100 100 100 100 100 100 100 100 100 
100 100 100 100 100 100 100 100 100 100 100 100 100 100 
##$AQSEQ= 0
##$AQ_mod= 1
##$AUNM= <au_zg>
##$AUTOPOS= <>
##$BF1= 200.13
##$BF2= 200.13
##$BF3= 200.13
##$BF4= 200.13
##$BF5= 200.13
##$BF6= 200.13
##$BF7= 200.13
##$BF8= 200.13
##$BYTORDA= 1
##$CFDGTYP= 0
##$CFRGTYP= 5
##$CHEMSTR= <none>
##$CNST= (0..31)
1 1 145 1 1 1 1 1 1 1 1 1 1 1 1 1 1 1 1 1 1 1 1 1 1 1 1 1 1 1 1 1 
##$CPDPRG= <>
##$CPDPRG1= <>
##$CPDPRG2= <>
##$CPDPRG3= <>
##$CPDPRG4= <mlev>
##$CPDPRG5= <mlev>
##$CPDPRG6= <mlev>
##$CPDPRG7= <mlev>
##$CPDPRG8= <mlev>
##$CPDPRGB= <>
##$CPDPRGT= <>
##$D= (0..31)
0 1.2 0 0 0 0 0 0 0 0.06 0 0.03 0 0 0 0 0.0002 0 0 0 0 0 0 0 0 0 0 0 0 
0 0 0 
##$DATE= 1681379900
##$DBL= (0..7)
120 120 120 120 120 120 120 120 
##$DBP= (0..7)
150 150 150 150 150 150 150 150 
##$DBP07= 0
##$DBPNAM0= <>
##$DBPNAM1= <>
##$DBPNAM2= <>
##$DBPNAM3= <>
##$DBPNAM4= <>
##$DBPNAM5= <>
##$DBPNAM6= <>
##$DBPNAM7= <>
##$DBPOAL= (0..7)
0.5 0.5 0.5 0.5 0.5 0.5 0.5 0.5 
##$DBPOFFS= (0..7)
0 0 0 0 0 0 0 0 
##$DE= 6
##$DECBNUC= <off>
##$DECIM= 32
##$DECNUC= <off>
##$DECSTAT= 4
##$DIGMOD= 1
##$DIGTYP= 9
##$DL= (0..7)
0 120 120 120 120 120 120 120 
##$DP= (0..7)
150 150 150 150 150 150 150 150 
##$DP07= 0
##$DPNAME0= <>
##$DPNAME1= <>
##$DPNAME2= <>
##$DPNAME3= <>
##$DPNAME4= <>
##$DPNAME5= <>
##$DPNAME6= <>
##$DPNAME7= <>
##$DPOAL= (0..7)
0.5 0.5 0.5 0.5 0.5 0.5 0.5 0.5 
##$DPOFFS= (0..7)
0 0 0 0 0 0 0 0 
##$DQDMODE= 0
##$DR= 18
##$DS= 0
##$DSLIST= <SSSSSSSSSSSSSSS>
$$ [...]
##$SUBNAM2= <"">
##$SUBNAM3= <"">
##$SUBNAM4= <"">
##$SUBNAM5= <"">
##$SUBNAM6= <"">
##$SUBNAM7= <"">
##$SUBNAM8= <"">
##$SUBNAM9= <"">
##$SW= 18.05172834244
##$SWIBOX= (0..15)
0 0 2 0 0 0 0 0 0 0 0 0 0 0 0 0 
##$SW_h= 3612.71676300578
##$TD= 16384
##$TD0= 1
##$TE= 0
##$TE2= 300
##$TE3= 300
##$TEG= 300
##$TL= (0..7)
0 120 120 120 120 120 120 120 
##$TP= (0..7)
150 150 150 150 150 150 150 150 
##$TP07= 0
##$TPNAME0= <>
##$TPNAME1= <>
##$TPNAME2= <>
##$TPNAME3= <>
##$TPNAME4= <>
##$TPNAME5= <>
##$TPNAME6= <>
##$TPNAME7= <>
##$TPOAL= (0..7)
0.5 0.5 0.5 0.5 0.5 0.5 0.5 0.5 
##$TPOFFS= (0..7)
0 0 0 0 0 0 0 0 
##$TUNHIN= 0
##$TUNHOUT= 0
##$TUNXOUT= 0
##$USERA1= <user>
##$USERA2= <user>
##$USERA3= <user>
##$USERA4= <user>
##$USERA5= <user>
##$V9= 5
##$VALIST= <valist>
##$VCLIST= <CCCCCCCCCCCCCCC>
##$VD= 0
##$VDLIST= <DDDDDDDDDDDDDDD>
##$VPLIST= <PPPPPPPPPPPPPPP>
##$VTLIST= <TTTTTTTTTTTTTTT>
##$WBST= 1024
##$WBSW= 4
##$XGAIN= (0..3)
0 0 0 0 
##$XL= 0
##$YL= 0
##$YMAX_a= 255302
##$YMIN_a= -227525
##$ZGOPTNS= <>
##$ZL1= 120
##$ZL2= 120
##$ZL3= 120
##$ZL4= 120
##$ABSF1= 10
##$ABSF2= 0
##$ABSG= 5
##$ABSL= 3
##$ALPHA= 0
##$AQORDER= 0
##$ASSFAC= 0
##$ASSFACI= 0
##$ASSFACX= 0
##$ASSWID= 0
##$AUNMP= <proc_1d>
##$AZFE= 0.1
##$AZFW= 0.1
##$BCFW= 1
##$BC_mod= 2
##$BYTORDP= 1
##$COROFFS= 0
##$CY= 11.3945322036743
##$DATMOD= 1
##$DC= 2
##$DFILT= <>
##$DTYPP= 0
##$F1P= 2.36226072786647
##$F2P= -0.459571619588291
##$FCOR= 0.5
##$FTSIZE= 0
##$FT_mod= 4
##$GAMMA= 1
##$GB= 0.15
##$INTBC= 1
##$INTSCL= 1
##$ISEN= 128
##$LB= 0.24
##$LEV0= 0
##$LPBIN= 0
##$MAXI= 10000
##$MC2= 0
##$MEAN= 0
##$ME_mod= 0
##$MI= 1.114404
##$NCOEF= 0
##$NC_proc= 0
##$NLEV= 6
##$NOISF1= 3.799351
##$NOISF2= 2.8
##$NSP= 1
##$NTH_PI= 0
##$NZP= 0
##$OFFSET= 15.70392
##$PC= 1
##$PHC0= -19628.85
##$PHC1= 10.20081
##$PH_mod= 1
##$PKNL= yes
##$PPARMOD= 0
##$PSCAL= 0
##$PSIGN= 0
##$REVERSE= no
##$SF= 200.130013532006
##$SI= 16384
##$SIGF1= 3
##$SIGF2= 2
##$SINO= 400
##$SIOLD= 16384
##$SREGLST= <1H.CDCl3>
##$SSB= 0
##$STSI= 0
##$STSR= 0
##$SW_p= 3612.71676300578
##$SYMM= 0
##$S_DEV= 0
##$TDeff= 0
##$TDoff= 0
##$TI= <>
##$TILT= no
##$TM1= 0
##$TM2= 0
##$TOPLEV= 0
##$USERP1= <user>
##$USERP2= <user>
##$USERP3= <user>
##$USERP4= <user>
##$USERP5= <user>
##$WDW= 1
##$XDIM= 8192
##$YMAX_p= 0
##$YMIN_p= 0
$$ End of Bruker specific parameters
$$ ---------------------------------
##NTUPLES= NMR FID
##VAR_NAME=  TIME,          FID/REAL,        FID/IMAG
##SYMBOL=    X,             R,               I
##VAR_TYPE=  INDEPENDENT,   DEPENDENT,       DEPENDENT
##VAR_FORM=  AFFN,          ASDF,            ASDF
##VAR_DIM=   8192,          8192,            8192
##UNITS=     SECONDS,       ARBITRARY UNITS, ARBITRARY UNITS
##FACTOR=    0.0002768,     1,               1
##FIRST=     0,             0,               0
##LAST=      2.2672688,     0,               0
##MIN=       0,             -227525,         0
##MAX=       2.2672688,     255302,          0
$$ Real data points
##PAGE= N=1
##DATA TABLE= (X++(R..R)), XYDATA
$$ [...]
716f7o07Q98R2r12N61N65p15j02P86l15n77P97O4q63N82L43n39l2N72n57k14N83
$$ -67 -674 224 316 -596 -35 530 -185 -287 499 184 -393 404 468 -395 187 530 -9 -41 531 -26 -240 343
738C43j36p26N22K34n65J9M54l74j62M42j57k75K85K01l24J08L36k54M4K71k06
$$ 343 207 -519 3 237 -328 -309 145 -229 -391 51 -106 -381 -96 105 -219 -111 225 -29 15 286 80
759H0m6K76p9j99R3J01k18N8Q1j6k09K17K0l09j17K28n4j2J8j33J61o8j52J09
$$ 80 34 310 231 32 125 226 8 66 147 131 -78 139 159 -150 -267 -39 -93 -105 -87 -220 -59 -127 -279 -170
783a70J91j73K3L45k08j15J22K19j44QJ94k23N3J13k50J0L58k03l87M18Q4n07
$$ -170 21 -152 -129 216 8 -107 15 234 90 98 292 69 122 235 -15 -5 353 150 -237 181 265 -242
805b42P2K36l16n9L37p0l05K73L0k32K26J07k10LL19k99kM68p0m09K62K50m87
$$ -242 -170 66 -250 -309 28 -42 -347 -74 -44 -276 -50 57 -153 -150 169 -130 -132 336 266 -143 119 369 -118
828a18K08M25m20k92M97o2m87L09R5m23O4L73m40J5M98l22l03N14j6n09K57N47
$$ -118 90 515 95 -197 300 238 -249 60 155 -268 -204 169 -271 -256 242 -80 -383 131 115 -394 -137 410
850D10n52j44P06l88l86O29O0m65K81K66m13j28N37k62l50M66no19M07K52n56
$$ 410 -142 -286 420 32 -354 275 335 -130 151 417 4 -124 413 151 -199 267 262 -357 50 302 -254
871b54p7M61l11k26N11k4n18L76K20m05JO19l32l51N49k6l64L56K18o13K49M63
$$ -254 -331 130 -181 -407 104 80 -438 -62 158 -247 -246 373 41 -310 239 213 -151 205 423 -190 59 522
893E22m72j44M56j81m20K51K13m74NM98l78j65M23j28l64L49pk28J82K10l99j
$$ 522 50 -94 362 181 -239 12 225 -249 -244 254 -124 -289 134 6 -358 -9 -16 -244 -62 148 -251 -252
915b52M06q2k63L74O4l63L03K53m11p8M70k98j68L02p1m33M01n0k52J37K18l86
$$ -252 154 72 -191 183 247 -116 187 440 29 -49 421 123 -45 257 186 -247 154 104 -148 -11 207 -179
937a79j61M47j57k53K62J02k98P7K81j85l9K54Nk28K79p8j24J21O9k25J02K19
$$ -179 -340 107 -50 -303 -41 61 -237 -160 121 -64 -103 151 156 -72 207 129 5 126 195 -30 72 291
959B91k00j22K81j66k25J46P7k40N8J00r2j05J84m8k57L04o3o4O9P7j60Q6K66
$$ 291 91 -31 250 84 -141 5 82 -158 -100 0 -92 -197 -13 -61 -318 -14 -77 -141 -72 5 -155 -69 197
982A97k27j13J57M0j28K72N9l17J41J64l02N1J28p4k91L59j70j33J84J4k30N9
$$ 197 -30 -143 14 54 -74 198 257 -60 81 245 -57 -6 122 48 -243 116 -54 -187 -3 11 -219 -160
1004a60J82j44m4K10j13q5K56%k25P6K09l53J04K88j24m7J81p6k09L12o7k63J4
$$ -160 22 -122 -166 44 -69 -154 102 102 -123 -47 162 -191 -87 201 77 30 211 135 -74 238 171 -92 -78
1027g8K39j79k05M09k36j87J77J09k95R4K14j82r3L77k41k24L82P8k98J91K50
$$ -78 161 -18 -223 186 -50 -237 -60 49 -246 -152 62 -120 -213 164 -77 -301 81 159 -139 52 302
1048C02k49k3K87j98j73L09r8l16K30J96l18q0L08j35k04K25L0l26J56J95l23
$$ 302 53 30 317 119 -54 255 157 -159 71 267 -51 -131 177 42 -162 63 93 -233 -77 118 -205
1069b05lL52k97q9M63j48k63J81K87l87o8L46n0j39K40j18j37K60j01k17M5K81
$$ -205 -208 144 -153 -242 221 73 -190 -9 278 -109 -177 169 119 -20 220 102 -35 225 124 -93 -48 233
1091B33k18j89L28j22k88L29m5l42L00J02k02j39K79j70n8J40J23k01K74L9k40
$$ 233 15 -174 154 32 -256 73 28 -314 -14 88 -114 -253 26 -144 -202 -62 61 -140 134 173 -67
1112f7J4M02k95j29K63O1j92N8J33k78kK18j78r7J56q1j12K84j88j10J48qj18
$$ -67 -53 349 54 -75 188 249 57 115 248 -30 -32 186 8 -89 67 -14 -126 158 -30 -140 8 0 -118
1135a18L9M9n4j15L17p3r4J64J01k32P8M7l9k5R5j6k09K60l6j12n4J18j98R6P4
$$ -118 -79 -30 -84 -199 118 45 -49 115 216 -16 62 109 70 45 140 124 -85 175 139 27 -27 91 -107 -11 63
1160F3j38j28J22l5l8J00K02k87q0K55j60j9K27o3j79K57J7o0k8J24j68L9J59
$$ 63 -75 -203 -81 -116 -154 -54 148 -139 -219 36 -124 -143 84 21 -158 99 116 56 28 152 -16 23 182
1183A82r8r9J97q2j48J00J11j92j10J23q9N2J16p3j08P2n9k4J26J2l5k2J90j12
$$ 182 84 -15 182 100 -48 52 163 -29 -139 -16 -105 -53 63 -10 -118 -46 -105 -129 -3 9 -26 -48 142 30
1207C0k17K54O8j56J06R9j88M4J07j04j04K16l6k03J95j02j07N6M1k58J13K41
$$ 30 -187 67 135 -21 85 184 -4 40 147 43 -61 155 119 -84 111 9 -98 -42 -1 -259 -146 95
1229I5j88l0L3L5m9L0J43j00k3J39o0p1P6J44j78J24J32l32J86J3j2j55J35M6
$$ 95 -93 -123 -90 -55 -104 -74 69 -31 -54 85 25 -46 30 174 -4 120 252 -80 106 119 107 -48 87 133
1253A33j66J13P4j57o3J60j11r4M2Q2j78J37P5k15K05J3p9j4J84k10K6J26rj42
$$ 133 -33 80 154 -3 -66 94 -17 -111 -69 13 -165 -28 47 -168 37 50 -29 -43 141 -69 -43 83 74 -68
1277f8J60J44k49l7K26j76L9M5p6j66J13J02j98N3J36p9p8O8N2j97R3J79k03Q5
$$ -68 92 236 -13 -50 176 0 39 84 8 -158 -45 57 -141 -88 48 -31 -109 -41 11 -186 -93 86 -117 -32
1301c2J44j02m7J26l9n8O1P7p2nQ4j53J18l9k3j15J95K0k33N7J52k15m4K47k51
$$ -32 112 10 -37 89 50 -8 53 130 58 53 137 -16 102 63 40 -75 120 140 -93 -36 116 -99 -143 104 -147
1326a47j7J25j2k8Q1J5j8o0P7o1m2J87n9JRL8n6OM6j39J04R3q9j06L2O3j80P7
$$ -147 -164 -39 -51 -79 2 17 -1 -61 16 -45 -87 100 41 42 51 89 33 39 85 -54 50 143 54 -52 -20 43 -137 -60
1354f0P5n2K5Q4j16o4J73%j41Q9L3q0P3J5p6j3J90j37n1N5N3j38Q5J90k86P0J26
$$ -60 15 -37 -12 72 -44 -108 65 65 -76 13 46 -34 39 54 -22 -35 155 18 -33 22 75 -63 22 212 -74 -4 122
1381A22k15K9M5M9j12J12K5j69J8M8l0j1m6L9L9J50n9p6O6L1N9j07R7n4k7L6L7
$$ 122 -93 -64 -19 30 -82 30 55 -114 -96 -48 -78 -89 -135 -96 -57 93 34 -42 24 55 114 7 104 50 23 59 96
1408I6j40J88Jj44l9J06r2K7j0Kl8N3N1j93J49n7l6m9J32p1Q0Q5L5j49l1Q4o9
$$ 96 -44 144 145 1 -38 68 -24 3 -7 -5 -43 10 61 -132 17 -40 -76 -125 7 -64 16 101 136 -13 -44 40 -29
1435b9K4R8j79Q9L7l5k0L2J32j65MN4j65RK23j67j26J54K7k6J3j1p1M8Q6n6k9
$$ -29 -5 93 -86 3 40 5 -15 17 149 -16 -12 42 -123 -114 109 -58 -184 -30 -3 -29 -16 -27 -98 -50 36 -20 -49
1462d9R3jj21K09l8k7NO3j94J6J04N2j08N7k0p4m9Q2l0r8J38Kk18J69P0j61N6
$$ -49 44 43 -78 131 93 66 71 134 -60 -44 60 112 4 61 41 -33 -82 0 -30 -128 10 12 -206 -37 33 -128 -72
1489g2M2k2J0P0l3j7J47m1j93JK04j07m9J98o6n2R8r9K0m7N7j46L1J06o8j6O8
$$ -72 -30 -52 -42 28 -5 -22 125 84 -109 -108 96 -11 -60 138 72 20 118 19 39 -8 49 -97 -66 40 -28 -44 24
1516B4j0j47J05L8j91J62o4k1n6J43k8N3PL3j36Q7J44r8o2O6j1l1J00Kj83J25
$$ 24 14 -133 -28 10 -181 -19 -83 -104 -160 -17 -45 8 15 48 -88 -1 143 45 -17 49 38 7 107 109 -74 51
1542E1J6p4l8L8l3Qo7KjJ02J3j32OO7n3pJ68j71J14k2m0O3k6Q4pk3Rk1M6M9k2
$$ 51 67 -7 -45 -7 -40 -32 -99 -97 -98 4 17 -115 -109 -42 -95 -102 66 -105 9 -13 -53 10 -16 68 61 38 47 26 72 121 99
1573I9r9M6Jn8l1Q3j22R5o9J4k0M0K2j42J18M3n7p9N7K9P2NO6j32m0R2L8r1N5
$$ 99 0 46 47 -11 -42 41 -81 14 -55 -41 -61 -21 1 -141 -23 20 -37 -116 -59 -30 42 47 113 -19 -59 33 71 -20 35
1602C5q9M1R1n9q9R5k7m8N5K5q3J07j0k1o2MO5p5K9M1l6NP1n9m7J89j39j0L8P9
$$ 35 -54 -13 78 19 -70 25 -2 -50 5 30 -53 54 44 23 -39 -35 30 -45 -16 25 -11 -6 65 6 -41 148 9 -1 37 116
1632A16j30P5P0n4k4Q6j13N1m6K1r5J8J10j77J1J98k01L5M4M3k23K13N6j45Q5
$$ 116 -14 61 131 77 53 139 26 77 31 52 -43 -25 85 -92 -81 117 -84 -49 -5 38 -185 28 84 -61 24
1657B4N6j87L3J8P6J9N9Q5j83k0J18q2l1R9j31j5J21J6k43P5J39p6k0P7n8n4J15
$$ 24 80 -107 -74 -56 20 39 98 183 0 -20 98 16 -15 84 -47 -62 59 75 -168 -93 46 -30 -50 27 -31 -85 30
1684C0k4r3R2M2o5pM5J6m4pOO1Lj3l5pJ41j95J12k3j2j37J40J51j95ON7p6R4o7
$$ 30 6 -87 5 47 -18 -25 20 36 -8 -15 -9 52 55 42 7 0 141 -54 58 35 23 -114 26 177 -18 -12 45 -31 63 -4
1714dj47L8L9J05r6J26K3j71J1J66q2n7Q6N7j29OR5n1j6M7j07K2P2L0r5K8L4j47
$$ -4 -151 -113 -74 31 -65 61 84 -87 -76 90 8 -49 37 94 -35 -29 66 15 -1 46 -61 -39 33 63 -32 -4 30 -117
1742a17J70j9p3P8O5p9k5J24j44k5N8RlPO1q6K6O9m3o4O9Pm0p3J03j13O8M4j22
$$ -117 53 34 -39 39 104 25 0 124 -20 -45 13 22 19 26 87 1 27 96 53 -11 58 65 25 -48 55 -58 10 54 -68
1771f8j1J23j05p1J37J2qm5J24j5p9Q9l6r5K0k%P8N1j70J81Qq0r0O8P3r9J7p0
$$ -68 -79 44 -61 -132 5 17 9 -36 88 73 -6 83 47 -48 -28 -30 -30 48 99 -71 110 118 38 -52 16 89 -10 7 -63
1800f3J01lP0l9j44N4O7p2J5on2J15j60O6K6n9K02l9q3n4J10k9J04lj19K3R7p5
$$ -63 38 35 105 66 -78 -24 43 -29 -14 -20 -72 43 -117 -51 -25 -84 118 79 -4 -58 52 23 127 124 5 28 125 50
1828E0m4J33qj53J23n2j23O4LJ0l5L7k0qlj11J39Nn4P7l1k8oM0P6r0m6J76j22
$$ 50 6 139 131 -22 101 49 -74 -10 -7 3 -32 5 -15 -23 -26 -137 2 7 -47 30 -1 -29 -35 5 81 -9 -55 121 -1
1857aj6O4L6j8l2l9K8J1K1j7rq9lr0J22m4Q2q5N3m5J2m1K6PJ59r9p3P5M3p0m0
$$ -1 -17 47 83 65 33 -6 22 33 54 37 28 -61 -64 -154 -32 -76 6 -79 -26 -71 -59 -100 -74 -67 92 -7 -80 -5 38 -32 -72
1888g2Q6m5J0J20r5J1o6K0p6J50j32K4N2K8J33k70J00rK5L8k3r4mN5L2r1lN0M0
$$ -72 14 -31 -21 99 4 15 -51 -31 -107 43 -89 -65 -13 15 148 -122 -22 -31 -6 32 9 -85 -89 -34 -2 -93 -96 -46 -6
1917fN0N0j34N1j06N7LK3QJ5o5K7L9JK3k8k3j3PL6l7N4p4P2o8lM2kl6J77j0j09
$$ -6 44 94 -40 11 -95 -38 -35 -12 -4 11 -54 -27 12 13 36 8 -15 -28 -21 15 -22 32 -42 30 -38 -41 1 -1 -37 140 130 21
1949B1k8J1N4N9j28K9j8kR5m0J2n5L1r7ML3L0J6n1J8j04l0J26l0N2j1q8L3n3J55
$$ 21 -7 4 58 117 -11 18 0 -2 93 53 65 10 41 -56 -52 -19 11 27 -24 -6 -110 -140 -14 -44 8 -3 -91 -58 -111 44
1979D4l4R9j19L3M6j68P7O1P1p8k4r7J03O3j26pJ09p4K2m4O0o6m1j6P3j3mP2q1
$$ 44 10 109 -10 23 69 -99 -22 39 110 32 8 -89 14 77 -49 -56 53 -21 1 -43 17 -49 -90 -106 -33 -46 -50 22 -59
2008e9k2J6J62j48j0k4O7P2Lj16J49p8oj23M8N2K8J0l6J50j29M7n8lK2n7O6m6
$$ -59 -81 -65 97 -51 -61 -85 -18 54 57 -59 90 12 6 -117 -69 -17 11 21 -15 135 6 53 -5 -8 14 -43 23 -23
2036b3j8J2r5L1J93j34NL5l7RK4M9j23J04j3L3P8l9p4q3Q9p0J02p9O6J0r7K4J6
$$ -23 -41 -29 -124 -93 100 -34 -29 6 -31 -22 2 51 -72 32 19 52 130 91 17 -66 23 -47 55 -24 42 52 -45 -21 -5
2065eM3r2j1j2K09r4j39L2J78q2j15O4m1J62o0P6j32P8k7k8K0n2RJ6J78k16J1
$$ -5 38 -54 -65 -77 132 38 -101 -69 109 27 -88 -24 -65 97 37 113 -19 59 32 4 24 -28 -19 -3 175 -41 -30
2092c0N9PK3j58K01j62Q0j7m0Q0%k7l4R1q3l0J8M9k3m5N7k4nQ7k9o4K2O0l2K2
$$ -30 29 36 59 -99 102 -60 20 3 -37 43 43 16 -18 73 -10 -40 -22 27 4 -41 16 -8 -13 74 45 -19 3 63 31 53
2122E3j7J3o7R8Qj34j6N1q7P9P9r8J14l3l5r0M1K7m7L0rO4p8M2o2K5N9m9J02L5
$$ 53 36 49 -18 80 88 -46 -62 -11 -98 -19 60 -38 76 43 8 -82 -41 -14 -61 -31 -40 24 -54 -12 -74 -49 10 -39 63 98
2152I8j03J6Q8m9qp9J8M1m2M1o1rJ05p8J2N4m1n2OJ2J14j92J95n8m8L2K3Rp6m8
$$ 98 -5 11 99 50 42 -37 -19 22 -20 21 -40 -49 56 -22 -10 44 3 -49 -43 -31 83 -109 86 28 -20 12 35 44 -32 -80
2182h0J21j48R7N4o3p8O2M4k1N7K9o4k1P4o1r2L1j3n5K00k9p7Q6j6k3j3n7j8J62
$$ -80 41 -107 -10 44 -19 -97 -35 9 -12 45 74 10 -11 63 2 -90 -59 -72 -127 73 44 -33 53 37 14 1 -56 -74 88
2211H8j9m1n3P8l4n1K0M7l7l9M5j8q5j0L6J51j49N5N4p0O2nj30K01j17L4k3M8
$$ 88 69 28 -25 53 19 -32 -12 35 -2 -41 4 -14 -99 -109 -73 78 -71 -16 38 -32 30 25 -105 96 -21 13 -10 38
2239C8j40L2K4L7lJ02r7O5kK3l9j5K0q5L4K3P0n6m8k4K8l4j8PK4P9O1j43N6oN2
$$ 38 -102 -70 -46 -9 -12 90 -7 58 56 79 40 25 45 -40 -6 17 87 31 -17 -41 -13 -47 -65 -58 -34 45 106 -37 19 13 65
2270F5j21M8K0m4O5r3j1J19M6r3J9J7r7J16j09j9J18j02m3O5P0N0m1N8j09k7j3
$$ 65 -56 -8 12 -32 33 -60 -71 48 94 1 20 37 -60 56 -53 -72 46 -56 -99 -34 36 86 45 103 -6 -33 -46
2297d6L2l7O8p3O1k8KJQ7m3L1k2N7j05j5N9qn3J6j0q7J12L9r3kJ46j26k5J23j26
$$ -46 -14 -51 17 -56 5 -23 -21 -20 67 24 55 33 90 -15 -30 29 21 -32 -16 -26 -113 -1 38 -55 -57 89 -37 -62 61 -65
2327f5J56j31P9Ml8l4n5K07m3o1k2l3j3N5lK7j58P1m0N6Q4J4j45J46q1M0Rm1Q1
$$ -65 91 -40 39 43 5 -29 -84 123 80 19 -3 -36 -49 6 3 30 -128 -57 -97 -41 43 57 -88 58 -23 17 26 -15 66
2356F6j29J50j57J24%p2N1m6J05n6n8M6j00n3M6Q4q9Q8n6M4J23j44m6M4R0l1j24
$$ 66 -63 87 -70 54 54 -18 33 -13 92 36 -22 24 -76 -129 -83 1 -88 0 -56 -12 111 -33 -79 -35 55 24 -100
2383a00Q1n0m2O7PO6o2l6J46p1qM3l5o6J02L2j27J23n1K1m8mM8j58K33j40O7o9
$$ -100 -19 -69 -111 -44 -37 29 -33 -69 77 6 -2 41 6 -60 42 74 -53 70 19 40 -8 -12 36 -122 111 -29 38 -31
2411c1J27q3k4k7M3k1o1Q2k4O5Mq9k2nP7QL4j4mp2RK6K3L0n3j5n7J22p1oJ1j3
$$ -31 96 13 -11 -38 5 -16 -77 5 -19 46 50 -39 -61 -66 11 19 53 39 35 -37 -28 -2 21 51 -2 -17 -74 48 -23 -29 -18 -31
2443c1m0PJ23N3j05j2PJ38j93N6P5q1k4K7M0r2P6K7q5J55m5j10J53M1j75J37k0
$$ -31 -71 -64 59 112 7 -5 2 140 -53 3 78 -3 -27 0 40 -52 24 51 -34 121 76 -34 119 160 -15 122 102
2470A02m3Oo1k4K2N8r3j6lp6K4P5J5Pl8M0M8j90K30n7q6N0M0Kj29J27r0J34l1
$$ 102 59 65 4 -20 2 60 -33 -49 -52 -128 -104 -29 -14 -7 -45 -5 43 -147 83 26 -60 -10 30 32 -97 30 -60 74 43
2499D3o8m2J0M4m4P6N5j34N5M9j12N6P9j30L7L8j5R7j54R9j02l1J14o6l2Q7n5
$$ 43 -25 -67 -57 -13 -57 19 74 -60 -5 44 -68 -12 67 -63 -26 12 -3 94 -60 39 -63 -94 20 -46 -78 9 -46
2526d6L5kq8P9J30p1J8o2R3l4j73J72j07J37j19N1M3n3L1p7J09K7p9j6K7k8m3
$$ -46 -11 -13 -101 -22 108 37 55 -7 86 52 -121 51 -56 81 -38 13 56 3 34 -43 66 93 14 -2 25 -3 -46
2553d6k6Q9k7l1JO4J0N3j33J1K22j39o8J1L4m6k7J40j21j8L5qj4P1pj46O6Q4K2
$$ -46 -72 17 -10 -41 -40 24 34 87 -46 -35 187 48 -20 -9 25 -21 -48 92 -29 -47 -12 -20 -34 37 30 -116 -50 34 56
2582E6n9L4j21J11m3K5L8J38k49P0J5m3j6L6L5j88J41p4P7k7M4m7P9m0J52j35
$$ 56 -3 31 -90 21 -22 3 41 179 -70 0 15 -28 -44 -8 27 -161 -20 -94 -17 -44 0 -47 32 -8 144 9
2608Ij5j7J02j14J36m4r0k9J04p7j8J5Q2k8k6k5l6M6mK%Kn1J14j00M5n3M2J05
$$ 9 -6 -23 79 -35 101 57 -33 -62 42 -35 -53 -38 44 16 -10 -35 -71 -25 -29 -27 -27 -25 -76 38 -62 -17 -70 -28 77
2637G7Kj74R6J06q3k9L4k2l1N1o2q2J40j06K2J08k7k0kjM4m0M0K1l8j8L5qM1k9
$$ 77 79 -95 1 107 24 -5 29 7 -24 27 -35 -117 23 -83 -61 47 20 0 -2 -3 41 1 41 62 24 6 41 33 74 45
2667D5q6J18o4j44J29oJ29j96l5J07J02j51K2L4O4j8m8k7J7oJ8j7M6l6J7nPl2
$$ 45 -41 77 13 -131 -2 -8 121 -75 -110 -3 99 -52 -30 4 68 50 2 -25 -8 -14 4 -13 33 -3 14 9 16 -16
2695a6o7J41j10m0J06L3n5kM8l0K2K9m7Ll3L5j48K03j09j6RR0l1rl6l1J86j57
$$ -16 -83 58 -52 -92 14 47 -8 -10 38 8 30 59 12 15 -18 17 -131 72 -37 -53 -44 46 15 6 -30 -61 125 -32
2723c2Q1k0N1r0m5O0p0P7L4j9k5Q5p1j05L2Q4j10J32o9N9pr6K07j73J4R7j19m9
$$ -32 49 29 80 -10 -55 5 -65 12 46 27 2 87 16 -89 -57 27 -83 49 -20 39 32 -64 143 -30 -16 81 -38 -87
2751h7nQ8K3n8M6k5N3L4r2jP8j47N2nK4L8k6N1j19P3q1L6J02p8lJ3nJ09k00J30
$$ -87 -92 -4 19 -39 7 -18 35 69 -23 -24 54 -93 -41 -46 -22 16 -10 41 -78 -5 -86 -50 52 -26 -29 -16 -21 88 -112 18
2781A8Q7j75J0Q5k4M5l3J05j21K0J03r5l0m7K7R2j66J07p9J10k6l8R8r0Nj8l2
$$ 18 105 -70 -60 25 1 46 13 118 -3 17 120 25 -5 -52 -25 67 -99 8 -71 39 13 -25 73 -17 -12 -30 -62
2808f2j3K5K1q%M9L1l1L3kl0n1L6M2m5l9J47mj18Jj8l6J11l1q2J17l7J08j48J05
$$ -62 -75 -50 -29 -37 -37 12 43 12 45 43 13 -38 -2 40 -5 -44 103 99 -19 -18 -36 -72 39 8 -74 43 6 114 -34 71
2838G1q1m2N0O7j25J76j56P1j4k0Llq9J11o4l7Q1M0j04N7m4n5J07j7j9O1L5o0
$$ 71 -10 -52 -2 65 -60 116 -40 31 17 -3 0 -3 -92 19 -45 -82 -1 39 -65 -8 -52 -107 0 -17 -36 25 60 0
2866@R1j40%J5r4J76q3P3l2o6J17l4oO2j20O9o4P7Q4J6j71R6j20J20o2K1k7Q2
$$ 0 91 -49 -49 -34 -128 48 -35 38 6 -60 57 23 17 79 -41 28 -36 41 125 141 -30 66 -54 66 4 25 -2 80
2894H0j39M4R2j85J40j10J29l6L7q4P6p4J6Jl9M3J8J8r1Q1l0J01n6K5p8L3P0Q6
$$ 80 -59 -15 77 -108 32 -78 51 15 52 -32 44 -30 -14 -13 -52 -9 9 27 -64 17 -13 88 32 57 -21 12 82 168
2922A68k00J6Qq1J0J20q3R0jj20J65q8p4J27n4j0oL7k2n5J9r9M9M3Q5J2l3m6K5
$$ 168 -32 -16 -8 -89 -79 41 -42 48 47 -73 92 4 -70 57 3 -7 -13 24 2 -53 -34 -133 -84 -41 44 56 23 -23 2
2951Br1Q4j2n5pJ55r4m3P5K4o6P2M6j09j4P6j07P4m7K8K2m7P1k6j30J17o6N0J09
$$ 2 -89 -5 -17 -72 -79 76 -18 -61 14 38 -28 44 90 -19 -33 43 -64 10 -37 -9 13 -34 37 11 -119 -2 -68 -18 91
2980I1o6J7n3K5L3q7m4O3LJ1p6L6N6n9K5R2k1j10L0M2J0j7j4J6j01Q6P7o0Q2j51
$$ 91 25 42 -11 14 47 -40 -84 -21 -18 -7 -83 -47 9 -50 -25 67 46 -64 -34 8 18 1 -13 3 -98 -12 65 5 87 -64
3010f4L5P2n2%J8j17N2j4P6P9Po1q1K9O2L9j29J9j8N5M6k27J25mJ75j26n6J26
$$ -64 -29 43 -9 -9 9 -108 -56 -70 6 85 92 31 -50 -21 41 80 -49 -30 -48 7 53 -174 -49 -53 122 -4 -60 66
3038F6p8j1J15j83k0N6O0j35P7O0j28J23p9J38j27QJ21p8N0L9k9l8N1p5R3%n7
$$ 66 -12 -23 92 -91 -111 -55 5 -130 -53 7 -121 2 -77 61 -66 -58 63 -15 35 74 45 7 58 -17 76 76 19
3065A9n1j7J8k3M4J5l7L0q8J38ml5j2pN3N1m8l4M8j8j24N5K0P3q0N9L3p0o0P8
$$ 19 -32 -49 -31 -54 -10 5 -32 -2 -90 48 44 9 -3 -10 43 94 46 12 60 42 -82 -27 -7 66 -14 45 78 8 -52 26
3095B6kj95P4K7J61j15M8k7k1R4K2j9qj10J07J1j4m5k0n9J45r2m7N9k4R0o1K4
$$ 26 24 -171 -97 -70 91 -24 24 -3 -24 70 92 73 65 -45 62 73 59 14 -6 -65 80 -12 -59 0 -24 66 5 29
3123B9o4l1J29j10N1K1K8l7jK2n9N7K9r9R3j38J66j64R6J40k53L6J28j31M6J4
$$ 29 -35 -66 63 -47 4 25 53 16 15 37 -22 35 64 -35 58 -80 86 -78 18 158 -95 -59 69 -62 -16 -2
3149bJ21q8j13J23K5j9o3N1J0R4j34q5J37m5MJ1nM6j04N7m7RJ15j31m0J21N4q1
$$ -2 119 31 -82 41 66 47 -16 35 45 139 5 -80 57 12 16 27 22 68 -36 21 -26 -17 98 -33 -73 48 102 21
3177B1j9k3J9P1J8o9o7K3OR9j05k2R1k7N2j63J09J6m6K2o4R6j10J92j88J12l6
$$ 21 2 -21 -2 69 87 18 -49 -26 -20 79 -26 -48 43 16 68 -95 14 30 -16 6 -58 38 -72 120 -68 44 8
3204Hj1KN3Pr2M9m7N4k9L8j65K11k5n6l6j7Pk2J3P9N3n4Pj50J77j88K12r4o2j2
$$ 8 -3 -1 52 59 -33 16 -31 23 -6 32 -133 78 53 -3 -39 -56 -49 -71 -58 21 74 20 27 -123 54 -134 78 -16 -78 -90
3234i0P9o5J21j34J2J02n4m5R6K8K8Mn5o9R7J1j12k0J51Qj17Q3M3j00j6m8P6k1
$$ -90 -11 -76 45 -89 -77 25 -29 -74 22 50 78 82 27 -42 55 66 -46 -66 85 93 -24 59 102 2 -14 -62 14 -7
3262gK4jM2%j41j6J19l0k8pM4m4L9o9J42k2j35J36q8ML0p3N4R4p9L9J5k8K9j0
$$ -7 17 16 58 58 -83 -99 20 -10 -38 -45 -1 -45 -6 -75 67 45 -90 46 -42 -38 -8 -81 -27 67 -12 27 42 14 43 33
3292C3p1j0J35m0o1r3lP8k%N6L9n6J1k7QL7j1o3O1j8k9k3M6Q6o1n9K1L1r3J17
$$ 33 -38 -48 87 47 -14 -107 -110 -32 -34 -34 22 61 5 16 -11 -3 34 23 -40 21 3 -26 -49 -3 83 22 -37 -16 15 -78 39
3323C9j7L6k9M4q6k4Q9n1M3jpj23M4l9J23l5Qmo2R1j67L7P5m5J22q2n1j5J15o
$$ 39 22 58 29 73 -13 -37 52 1 44 43 36 -87 -43 -82 41 6 14 10 -52 39 -128 -91 -16 -61 61 -21 -72 -87 28 22
3353B2l7k7OK0p9J09J4n2J7m6L5k1j6P2K7Qj12L3L2j3rn0MM2J9m7Q3M7j29Q2m3
$$ 22 -15 -42 -36 -16 -95 14 28 -24 -7 -53 -18 -39 -55 17 44 52 -60 -27 5 -8 -17 -67 -63 -21 -2 -49 34 81 -48 34 -9
3384iO2l5n5O5j43J44pn9O2L0n5l2j1J02j05k5J64j63M8O1K2n3K1p6Jm4J45k5
$$ -9 53 18 -37 28 -115 29 22 -37 25 55 0 -32 -43 59 -46 -71 93 -70 -22 39 61 8 29 -47 -46 -90 55 30
3412C0ql5l4J01l2j9K8Ok1O7j11rL5M9m4m1J31j16L2m7J52k05J11m8R3N9j62m0
$$ 30 22 -13 -47 54 22 3 31 37 16 83 -28 -37 -2 47 3 -38 93 -23 9 -38 114 -91 20 -28 65 124 -38 -78
3440g8M2L7Oj4qnj8R0q9JJ12j22oQ4l4N0j09N2J4K3j1m8q0R1r0J18n0O1J4r2R0
$$ -78 -36 1 7 -7 -15 -20 -38 52 -37 -36 76 -46 -52 32 -2 48 -61 -9 5 28 17 -31 -111 -20 -110 8 -42 19 33 -59 31
3471C1p8O3j20L5R2L0j10J4o2Q9J42o9j16J02q8P4n6J4j7o4R8JJ7n1P9j10Q9J2
$$ 31 -47 16 -104 -69 23 53 -57 -43 -105 -16 126 57 -59 43 -45 29 -27 -13 -30 -94 4 5 22 -29 50 -60 29 41
3499D1q8N1rM0M3j19N3m3J14j69R1P8q2L4j03N9M1j74J78ml7M6j28J10K7l6o5
$$ 41 -47 4 -5 35 78 -41 12 -31 83 -86 5 83 1 35 -68 -9 32 -142 36 32 -5 41 -87 23 50 14 -51
3526e1J3N7n4K4LO5om1k9O6j27N1Jq8J42r0J42o8q7J6Q1j1j28K08j36n0J5R4p8
$$ -51 -38 19 -35 -11 -8 57 51 10 -19 47 -80 -29 -28 -116 26 -64 78 10 -77 -61 20 9 -119 89 -47 -97 -82 12 -66
3555f6J62o7o0J8L2o9k1k5J60J1j95%J37nl5J92k34O4QK4p1J10r5P3r4J03p2k8
$$ -66 96 29 -31 -13 19 -50 -71 -96 64 75 -120 -120 17 12 -23 169 -65 -1 7 31 -40 70 -25 48 -46 57 -15 -43
3583d3M4k8J23j63Q3p8J38j03M0M7o1k3o3J76j10m4R0j2k5r2J60r2P5J3o7l3P7
$$ -43 1 -27 96 -67 16 -62 76 -27 13 60 -1 -24 -87 89 -21 -65 25 13 -12 -104 56 -36 39 52 -15 -48 29
3610B9l9m0J6k2R6j16R1K8o8jJ04j20P9L0r5P6j93K12q2P1k7m5m6L7J00j27R1
$$ 29 -10 -50 -34 -56 40 -76 15 43 -25 -26 78 -42 37 67 -28 48 -145 67 -15 56 29 -16 -62 -25 75 -52 39
3637C9K8m9j1o9P1n6l6J16L8q5N9k4k7K4l4k0p5J85k2j02P2Pl3o7J96j67N8O5
$$ 39 67 18 7 -62 9 -47 -83 33 71 -14 45 21 -6 18 -16 -36 -111 74 52 -50 22 29 -4 -71 125 -42 16 81
3665H1j13O9j2Nj3j2J01j55M7R6q9Rp8P2L5q8Q0N8p3N1j08m1O4J5L0nro1n9Q3
$$ 81 -32 37 25 30 17 5 106 -49 -2 94 5 14 -64 8 43 -45 35 93 20 71 -37 -78 -14 1 31 26 17 -44 -103 -20
3695b0M2o4r0J79k6J8l0l4Rj1J03j16N5q2P1K3N1p2O0j1p6J47j66M6M1m4j27J38
$$ -20 22 -42 -132 47 21 39 9 -25 -16 -27 76 -40 15 -67 4 27 78 6 66 55 -21 126 -40 6 47 3 -124 14
3723A4p8R3jK2j3j23J27k0n9J70k18l4J46n4N3q0j3P5j03P6k7O6n9O4m2J0J34
$$ 14 -64 29 28 50 37 -86 41 21 -38 132 -86 -120 26 -28 25 -55 -68 7 -96 -20 -47 19 -40 24 -18 -8 126
3750A26j15m7M5k2L3k4k3M9k6J6q2K6N4KM5j8l8m7Q7r0k7J31j10k1R9q8K9m8N3
$$ 126 11 -36 9 -13 20 -4 -27 22 -4 12 -70 -44 10 12 57 39 1 -46 41 -49 -76 55 -55 -76 23 -65 -36 -84 -31
3779c1kJ21j18N2L1j07J31l2p9m3J56j4k6o9N3N2n6nN2jm2m2n0N6O7J5p3p7J1
$$ -31 -33 88 -30 22 53 -54 77 45 -34 -77 79 65 39 -30 23 75 19 14 66 65 23 -19 -69 -13 54 69 -4 -81 -70
3808g0L3L3p7jJ9j0L1o5L4O6l7p3J04p3K6P6Rk9J2L3m2l4O5l3L2k1q2L6J0O5K7
$$ -70 -37 -4 -81 -82 -63 -73 -42 -107 -73 -7 -44 -117 -13 -86 -60 16 25 -4 8 41 -1 -35 30 -3 29 8 -74 -38 -28 37 64
3839F4j1n7K4K4r8J05kj0m4L2K2K7m2r7J58q8Q4r3r7J02o4J9L3o2J56n5j19J27
$$ 64 53 -4 20 44 -54 51 49 39 -5 27 49 76 34 -63 95 7 91 -2 -99 3 -61 -42 -9 -71 85 30 -89 38
3867C8l0n4O9r0K8O4QJ5o3J23j9j75J41j4m7PK8q1k3M8J00Mn4o1o0N4k3J4N1q
$$ 38 8 -46 23 -67 -39 25 33 48 -15 108 89 -86 55 41 -6 1 29 -52 -75 -27 73 77 23 -38 -98 -44 -67 -53 -2 -10
3897a0P6j2r3lK1R2L0Rq2j61J75m7rm6R2J5M8j02l4j8O9l7K7j09J30J2j7J26j55
$$ -10 66 54 -39 -42 -21 71 101 110 28 -133 42 -5 -14 -60 32 47 95 -7 -41 -59 10 -27 0 -109 21 33 16 142 -13
3926a3k4l3J96q9Pj42J14n8p2K6P1L1N1j23RO1J6O4j40P3m4R8j41R5n0J1m7J11
$$ -13 -37 -70 126 37 44 -98 16 -42 -114 -88 -17 14 65 -58 -49 12 28 92 -48 25 -19 79 -62 33 -17 -6 -53 58
3954E8jn1o0J15j41Q1Jj16O7J53j41P8k1l4J15j10Ll9P9L8p3pPjN0r5O6L3l4M7
$$ 58 57 6 -54 61 -80 1 2 -114 -47 106 -35 43 22 -12 103 -7 -4 -43 36 74 1 -6 1 0 50 -45 21 54 20 67
3984F7j69J38JJ4j2j2q2P1M1k3K4Olj25J0R1pK0Rk2N2q3n8R3r8Ln1J60l0j23R3
$$ 67 -102 36 37 51 39 27 -55 16 57 34 58 64 61 -64 -54 37 30 50 59 37 89 6 -52 41 -57 -54 -105 55 25 -98 -5
4015eP9n7j69J88M1j08l6J21n0J5o9J5qJ33k1n1l6K6lK0p2N7l4pP2K4j47R1k1
$$ -5 74 17 -152 36 77 -31 -67 54 4 19 -50 -35 -43 90 69 18 -18 8 5 25 -47 10 -24 -31 41 65 -82 9 -12
4044a2P2m7p7R9L0r6M9j5p2J03n6Q0j80R7MO0m8qL3p9J43j27J19p7o3M6NO8p9
$$ -12 60 13 -64 35 65 -31 18 3 -69 34 -22 58 -122 -25 -21 39 -9 -17 16 -63 80 -47 72 -5 -68 -22 -17 51 -28
4073b8j8LM6m6Q0l3ln4O7o8R1RM8j67O2m5K1O4m3K9k4m0L9K7j5k2K9OL2k5m1j0
$$ -28 -46 -43 3 -43 37 4 1 -53 14 -54 37 46 94 -73 -11 -56 -35 29 -14 15 -9 -49 -10 17 2 -20 9 15 47 22 -19 -29
4105b9k3k9L8O6o2jJ9K6qL1kj9k9N3M7r2o7J32L7j50kJ5P4K3Jq3l4Q8L5k1L8j19
$$ -29 -52 -81 -43 23 -39 -40 -21 5 -3 28 26 7 -22 31 78 -14 -81 51 88 -62 -64 -49 25 48 49 -34 -68 20 55 34 72 -47
4137d7M8K1p9m9N4N9q6M0l5J60j49O8r7J34m5R6o5p5J71k10J21m5l8O5m4j19K09
$$ -47 1 22 -57 -106 -52 7 -79 -39 -74 86 -63 5 -92 42 -3 93 28 -47 124 -86 35 -10 -48 17 -27 -146 63
4164F3p5Np3J15m9J10p3k2n9Q7N4n3N0o2Q8l5l6m4Jm3lK4J40q0j09K7N0k1P8k1
$$ 63 -12 -7 -80 35 -14 96 23 1 -58 29 83 30 80 18 106 71 35 -9 -8 -51 -54 -30 110 30 -79 -52 -2 -23 55 34
4194C4k2q8R3N0k4j13L8K7Qj9o2O1k4j2K6m1J2rM5P9j52P7L3m1kK3Nm3P6O2q5
$$ 34 12 -76 17 67 43 -70 -32 -5 3 -16 -78 -17 -41 -53 -27 -68 -56 -65 -20 59 -93 -16 17 -24 -26 -3 2 -41 35 97 12
4225A2NJ4p1J3J12j54K8N5P2q5j2QK9k5O4J7j95O7K6J4L2j5m3l6Q7j06R2K0nL2
$$ 12 17 31 -40 -27 85 -69 -41 14 86 1 -11 -3 26 1 65 82 -113 -46 -20 -6 26 11 -32 -68 19 -87 5 25 20 52
4255E2l3n3Ok7Q9r2%J32m3p6m1M8K6L8J4K3m9J12j75q8R1L2kQ5j14L0J9nJ5l5
$$ 52 19 -34 -28 -55 34 -58 -58 74 31 -45 -86 -38 -12 26 40 63 14 126 -49 -137 -46 -14 -16 69 -45 -15 4 -1 14 -21
4285b1RM6m7o0J9M8Nm6L1kj7P2q6M6J8N8l8n6l6Q8J3j36J19l7p8Q4PP9n8PM2j20
$$ -21 -12 34 -13 -73 -54 -6 -1 -47 -16 -18 -35 37 -49 -3 15 73 35 -21 -57 31 44 -92 27 -10 -88 -4 3 82 24 31 73 -47
4317d7NL4O8j54J11r0J05p3J5M1q4J48j76K0N7O3k3n9K6m7N3k0P1m8K7K6j13Q5
$$ -47 -42 -8 60 -94 17 -73 32 -41 -26 15 -69 79 -97 -77 -20 43 20 -39 -13 -60 -7 -27 44 -4 23 49 -64 21
4345B1j6qj6k6j5P9j27M3P5j8r1P1JL9k5O3j12P2KL4kL7j05N4kmo2j1N5J09q9
$$ 21 5 -3 -19 -45 -60 19 -108 -65 10 -8 -99 -28 -27 12 -13 50 -62 10 12 46 44 81 -24 30 28 24 -38 -49 6 115 26
4376B6j01J01q6M7n7J20Q8j35o6Q4q2R7m1O8r0J6l1L2j01K21j09p6J05q8mJ09
$$ 26 -75 26 -60 -13 -70 50 138 3 -63 21 -61 36 -5 63 -27 -11 -42 -10 -111 110 1 -75 30 -58 -62 47
4402D7k2k1k8m3k3J05J7K6j51J57m1n2N8J1o6l1M4n7J51l0j73M8L2L8N6o1n9J12
$$ 47 25 4 -24 -67 -90 15 32 58 -93 64 23 -29 29 40 -26 -57 -13 -70 81 51 -122 -74 -42 -4 52 -9 -68 44
4430D4j0l7Nl0K2L9M6j25N1PP3o8o0J13L0k5m9m9k8R0N4j20J20l6n9l4L1L1m4
$$ 44 34 -3 2 -28 -6 33 79 -46 5 12 85 17 -43 70 100 75 26 -23 -51 39 93 -27 93 57 -2 -36 -5 26 -18
4459a8p4Q8m9%P6n0K2J11n0m8k3L7k7M8m8P8n0QrJ17k21O4K0q4l9J32r2J35L6
$$ -18 -92 -4 -53 -53 23 -27 -5 106 56 8 -15 22 -5 43 -5 73 23 31 22 139 -82 -18 2 -82 -121 11 -81 54 90
4488I0k00J67Qp1nk4m7J00J8o3LKpOP0j22P9L3r8L3P6p9K8K7K2q9J1N5n0m6J31
$$ 90 -110 57 65 -6 -11 -35 -82 18 36 -27 -24 -22 -29 -23 47 -75 4 37 -61 -28 48 -31 -3 24 46 -43 -32 23 -27 -73 58
4519E8j31J5L3J05j29M0k8p5J40N7j56Q8J19jj69J58j07r2J03mj28J43q4k4M6
$$ 58 -73 -58 -25 80 -49 -9 -37 -112 28 85 -71 17 136 135 -34 124 17 -75 28 24 -104 39 -45 -69 -23
4544b3OK6Jo8M8PK4j2j58J45m3J0R7p3J9J7rO2j44J13j11Q9j42J52J4l0J2P8q8
$$ -23 -17 9 10 -58 -10 -3 21 9 -149 -4 -47 -37 60 -13 6 23 14 76 -68 45 -66 23 -119 33 47 17 29 107 19
4573A9M7j05O3j7K4J9rj14J3l5J59q5L7j09N2J01J3o7pN2rp2J2kn3JJ18j41J59
$$ 19 66 -39 24 7 31 50 41 -73 -60 -95 64 -21 16 -93 -41 60 73 6 -1 51 42 -30 -18 -20 -73 -72 46 -95 64
4602F4l2n0J7J6Q2q9o9K6n4O4O9j26J70r5q1L3O9n1Pn3M1n5J06j3J13j77Q2mj25
$$ 64 32 -18 -1 15 97 8 -61 -35 -89 -25 44 -82 88 -7 -88 -55 14 -37 -30 -83 -42 -97 9 -4 109 -68 14 10 -115
4631a15P2nJ21l2j01J31olr3K5R9j32j4M3l2J25j8j32j1J01J9p1N4j14M5K6PN7
$$ -115 -43 -48 73 41 -60 71 65 62 -31 -6 93 -39 -53 -10 -42 83 65 -67 -78 23 42 -29 25 -89 -44 -18 -11 46
4659D6K8k11K26l1j14J73j21Rj57J14N2mN1O2r9nn6j4k5J03rn6Q3l1k7j05J30
$$ 46 74 -137 89 58 -56 117 -4 5 -152 -38 14 10 61 123 24 19 -37 -51 -76 27 18 -38 45 14 -13 -118 12
4686A2L5R5q5j43J65p9l2J74j72J27o3l5q8N4K8n6J11k0m9P2l4k9m4O5L7p9l4
$$ 12 47 142 57 -86 79 0 -32 142 -30 97 34 -1 -89 -35 -7 -63 48 28 -21 51 17 -12 -56 9 46 -33 -67
4713f7K4J49j6m4j04J00o6p7K3M3L5J9o2q2J37k1l2L6M0o3RK7O7j05k8O4m7M9
$$ -67 -43 106 90 46 -58 42 -24 -101 -78 -35 0 19 -43 -125 12 -9 -41 -5 35 -28 -19 8 75 -30 -58 6 -41 8
4741Hr0J04L5m0r6O7J8k1L0J8l7Ol1j0M3N4j99J44K4o7jJ7K1j7l2m6J07m5O8L0
$$ 8 -82 22 57 17 -79 -12 6 -15 15 33 -4 2 -29 -39 4 58 -141 3 27 -40 -41 -24 -3 -20 -52 -98 9 -36 32 62
4771F2o1L2r4R7q3O1k0M7lj39P4N2j06R9K0L0r4R0n0j32J34jP3l0l1n0M7j3J8
$$ 62 1 33 -61 36 -47 14 -6 41 38 -101 -27 25 -81 18 38 68 -26 64 14 -118 16 15 88 58 27 -23 24 11 29
4800B9p5mN0P2j28M2lp0J15J04j83k1J25r3l2L2k8P8j1p8P7N2o1J02o3L6r4m9
$$ 29 -46 -50 0 72 -56 -14 -17 -87 28 132 -51 -72 53 -40 -72 -40 -68 10 -1 -79 -2 50 -11 91 28 64 -30 -79
4828g9L8J1J0o6J09K9m2PL3m7O9J3k5n4m4Q0j30P0kj4Q9j05L2Q1m5n1O6J8Q1o1
$$ -79 -41 -30 -20 -86 23 52 10 17 50 3 72 85 60 6 -38 42 -88 -18 -20 -34 55 -50 -18 63 18 -33 33 51 132 71
4858G1j12O1k0q4Q4J46q2j42N8On4R9k00K24L5j46J15j6n7L6ll7J51j09M2p0O4
$$ 71 -41 20 0 -84 0 146 64 -78 -20 -14 -68 31 -169 55 90 -56 59 43 -14 22 19 -18 133 24 66 -4 60
4885F0M3j03M3j11L4Q5q1Ll5K4L3nj0R8j52P9n1Q7m2k0Q7l7J4k8K5r6K4N7j9m
$$ 60 103 0 43 -68 -34 51 -30 -27 -62 -38 -5 -10 -20 78 -74 5 -46 41 -1 -21 66 29 43 15 40 -56 -32 25 6 2
4915Bj2k7r7J06L3kK6j00K7N8o2Q4K3j79J64m9l7J9n2Q6o2P1j3n9M0j1J6N5k1
$$ 2 -10 -37 -134 -28 5 3 29 -71 -44 14 -48 36 59 -120 44 -5 -42 -23 -75 11 -51 20 7 -52 -12 -23 -7 48 27
4944B7n2J4KjjM0k5K0j9k0oK8m4K4k8L3N4j9n1P2q5J9QQ1j12J17j14N4j9p5K5
$$ 27 -25 -11 -9 -10 -11 29 4 24 5 -15 -21 7 -37 -13 -41 -8 46 27 -24 48 -37 -18 -10 71 -41 76 -38 16 -3 -78 -53
4975e3J46j14J32j60J9J58k3j16on0j4J28j09J3J84j71L1O4j37J40Pj9o1N1q5
$$ -53 93 -21 111 -49 -30 128 105 -11 -17 -67 -81 47 -62 -49 135 -36 -5 59 -78 62 69 50 -11 40 -45
5000d5K3J57j16r0J07O1r4K8M5j79P0M3M9n4J0l8R7j06O3j4Lj1J0P4J6j08P6j0
$$ -45 -22 135 19 -71 36 97 3 31 76 -103 -33 10 59 5 15 -23 74 -32 31 17 20 9 19 93 109 1 77 67
5028F7r4N6J8j02K7J8L2j34J89o6M7j78K00m5r2J37p8o8Q7k2N6L3j54Q8lRj2q5
$$ 67 -27 29 47 -55 -28 -10 22 -112 77 11 58 -120 80 35 -57 80 2 -66 21 -1 55 88 -66 22 19 28 16 -69
5056f9J14l2j12K46r3k7j10Q1k4M1Q3j14m3N2k3K4mJ3ko5KM9J09j08q4J19Nm1
$$ -69 45 13 -99 147 54 27 -83 -2 -26 15 98 -16 -59 -7 -30 -6 -10 3 1 -64 -62 -13 96 -12 -96 23 28 -13
5084a3K4kj07J13l1l6P5k5P4j38L7n0J4J08j07Q4j30J38O8j07M8j20P2R5p2J4
$$ -13 11 9 -98 15 -16 -52 23 -2 72 -66 -29 -79 -65 43 -64 20 -110 28 96 -11 37 -83 -11 84 12 26
5110B6l9J1K1l4O3k3j4n3P3lm6OM5j10J21jJ05j5r0m8M8j0l1m4M4k8R3L3K7j13
$$ 26 -13 -2 19 -15 48 25 11 -42 31 28 -18 -12 33 -77 44 43 148 133 43 -5 43 33 2 -42 2 -26 67 100 127 14
5140A4l7JJ0J3Rp2O7qr5K5n1J17j9p1kJ67n0Q5j59k2J45l0p6R4kp6J46j34J4m8
$$ 14 -23 -22 -12 1 10 -62 5 -3 -98 -73 -124 -7 -26 -97 -99 68 18 103 -56 -78 67 37 -39 55 53 -23 123 -11 3 -45
5170d5L4J08j01mJ31r3kn9J8N2l9o9J5L4K3n8K5N5M4%mj03m3J24k0K9jM1p5j5
$$ -45 -11 97 -4 -8 123 30 28 -31 -13 39 0 -69 -54 -20 3 -55 -30 25 69 69 65 -38 -81 43 23 52 51 92 17 2
5200BJ34p3p9J3O7m0J05j34m5Q5n1m5P4l0OR6j34J15j28K1n6J34K5j11O2m6O0
$$ 2 136 63 -16 -3 64 24 129 -5 -50 35 -16 -61 13 -17 -11 85 -49 66 -62 -41 -97 37 62 -49 13 -33 27
5227B7r0O1j8P0j20ql8Q5J05j57O0P0r8P2j7m6R5r9O2k0J4rM5n4K9Jj07J49J2
$$ 27 -63 -2 -20 50 -70 -78 -116 -31 74 -83 -23 47 -51 21 4 -42 53 -46 16 -4 10 1 46 -8 21 22 -85 64 76
5256G6r7k2P7j9q7J07O6j25L1k9O0m3om1J8O1p7J9K0k3klP3L0j15R2Jj32J2O4
$$ 76 -21 -43 34 15 -72 35 101 -24 7 -22 38 -5 -11 -52 -34 27 -50 -31 -11 -34 -36 -39 34 64 -51 41 42 -90 -78 -14
5286a4R4r5r3J76n5J2n3Mnk0O5L3K8j37Q7K7r9J37j06m4K2JM2OL1j14Q7l7M8j01
$$ -14 80 -15 -108 68 13 25 -28 -24 -29 -49 16 49 77 -60 27 54 -45 92 -14 -58 -36 -35 7 13 44 -70 17 -20 28 -73
5316g3J17N5j31N1pk0J15k2j27L0K6o1NN2M7o2k0m6M1j16K29j36PQk4R4L0o8K8
$$ -73 44 99 -32 19 12 -8 107 85 -42 -12 14 -47 -42 10 57 -5 -25 -71 -30 -146 83 -53 -46 -38 -62 32 62 -6 22
5345B2J08j32M1o9mM6M8k2m2K1n7R7j01K7p3L9J1N7mm1l0M6Q6j38J53J3k15J20
$$ 22 130 -2 39 -30 -34 12 60 38 -4 17 -40 57 -44 -17 -90 -51 -40 17 13 -28 -58 -12 74 -64 89 102 -113 7
5373GL4k8j6m2K7N0m5j0n1J39J3k0j44M0J02J2m8nj7N7j12j7J20%l6M6n7r8J1
$$ 7 41 13 -3 -45 -18 32 -13 -23 -74 65 78 58 -86 -46 56 68 20 15 -2 55 -57 -74 46 46 10 56 -1 -99 -88
5402h8J58l5j7N6l5Mk2O3m9k3N3n4k6M2J1k3R6j11m0lR3l7m2O6o2O3l4J1m4K4
$$ -88 70 35 18 74 39 43 21 84 35 12 65 11 -15 27 38 15 111 0 -40 -43 50 13 -29 37 -25 38 4 15 -29 -5
5432en8O9l6j3m1L1M7lmL7L1oj13P2r0N8K8k0N3n6o9O6rJ2N4j2%oN9j03J9k4o2
$$ -5 -63 6 -30 -43 -84 -53 -6 -9 -13 24 55 49 -64 8 -82 -24 4 -16 37 -19 -88 -22 -31 -19 35 23 23 17 76 -27 -8 -32 -94
5465i4J13k3Oj5J7o9N7O6n7M6m9J0J4j9mMl5kJ04p7N4Nl8Q4q3m7JJ5L2J5K1l5
$$ -94 19 -4 2 -13 4 -65 -8 58 1 47 -2 8 22 3 -1 3 -32 -34 70 -7 47 52 14 98 15 -32 -31 -16 16 31 52 17
5497A7j26R0PLN2m7PO2o8%j02J59J2r1J06q2l5m6J01p2k2M4rO9o7l3J35J7j50
$$ 17 -109 -19 -12 -9 43 -4 3 65 -3 -3 -105 54 66 -25 81 -1 -36 -82 19 -53 -75 -31 -40 29 -38 -71 64 81 -69
5526f9J22nJ6m2O3n8m2Q8k6PNn6p7J22j28J41r7m9P5k1Q6j37J38q8P0j04O1n8
$$ -69 53 48 64 22 85 27 -15 73 47 54 59 3 -74 48 -80 61 -36 -85 -10 -31 55 -82 56 -32 38 -66 -5 -63
5554f3jR2p2M2j1O0j42J18k4lr2Q4JL9k9O4q6pm9M0R7p2o1O2J04j01rQ2j3j61
$$ -63 -64 28 -44 -2 -13 47 -95 23 -1 -4 -96 -12 -11 28 -1 63 -23 -30 -79 -39 58 -14 -75 -13 91 -10 -19 63 50 -111
5584a11R2J1K8Lj10R6k7Jo0R4n3j0P4mj3%L6j33R3j00J94j24J0O9q8P4l3k8P4
$$ -111 -19 -8 20 23 -87 9 -18 -17 -77 17 -36 -46 28 24 11 11 47 -86 7 -93 101 -23 -13 56 -32 42 9 -19 55
5613E5n7l1m5M2R1p1Q0j10pQ2r4j3M8n0J36j05R8l9j17J82q1p6Q7K4k1Mr5KJ11
$$ 55 -2 -33 -78 -36 55 -16 64 -46 -53 29 -65 -78 -30 -80 56 -49 49 10 -107 75 -6 -82 5 29 8 12 -83 -81 30
5642C0P4j38M8O6l2rq2P8o0RN0M4j42J40J7j62O4m3Q5j06J58j24rJ9O3m5o3Q2
$$ 30 104 -34 14 80 48 39 -43 35 -25 -16 34 78 -64 76 93 -69 -5 -48 37 -69 89 -35 -44 -25 38 -7 -70 12
5670A2r4Q9l1M7J0p3R1j23J05J6l6m6j4J12r0L1kK4j07k5K6M6J12j04j8K9n3%
$$ 12 -82 7 -24 23 33 -40 51 -72 33 49 13 -33 -47 65 -25 6 4 28 -79 -104 -78 -32 80 -24 -42 -13 -66 -66
5698f6M1J24j02P1j1q4J42j38J30p2n1M6N8p7j04J31n6o9M3L4R5j54L3j6L1Q9
$$ -66 -25 99 -3 68 57 -27 115 -23 107 35 -16 30 88 11 -93 38 -18 -87 -44 -10 85 -69 -36 -52 -21 68
5724F8j26L3NK7K2j2O5q0O1q3k4J33j23K5M7k3j6K6n1K2N4p1N1p4O1n0j4L1N0
$$ 68 -58 -25 -20 7 29 17 82 2 63 -20 -44 89 -34 -9 38 15 -1 25 -26 -4 50 -21 30 -44 17 -33 -47 -16 34
5753C4j7m8J04j13n8J29j0p4O4o0jPL7n6O5K6J0q3rJK3L6R0Jn0q3PN7O8n4Jl4
$$ 34 17 -31 73 -40 -98 31 21 -53 11 -49 -50 -43 -6 -62 3 29 39 -44 -53 -52 -29 7 97 98 48 -35 -28 29 97 43 44 10
5785A0j5K9l1l1P0Jp8Q7l6J6K0m1pM4j34J95j14K23j51o6L6n1M7J5j01J07l1K0
$$ 10 -5 24 -7 -38 32 33 -45 42 6 22 42 1 -6 38 -96 99 -15 208 57 -9 27 -24 23 38 -63 44 13 33
5813C3l0O2q5l1J59n5NK5o3KO4j35J6l7Q3r8R2o5kN1k8O4O8j15KJ12n7QL4Rj54
$$ 33 3 65 -20 -51 108 53 58 83 20 22 86 -49 -33 -70 13 -85 7 -58 -60 -9 -37 27 95 -20 -18 94 37 45 79 88 -66
5844f6J1J7l7J29j32P1o9J10o3R4n7n3R7l5k7M7m3K8L8j9j8M6q3Q9r8O2r4J17
$$ -66 -55 -38 -75 54 -78 -7 -76 34 -29 65 8 -45 52 17 -10 37 -6 22 60 41 23 69 -14 75 -23 39 -55 62
5872F2r8K8j65J93jL6m4o5M6P3n4r1k2K8L2j1R8j7n7j10J19M8j7K9l8R9r9p1J67
$$ 62 -36 -8 -173 20 19 55 11 -54 -8 65 11 -80 -102 -74 -42 -53 45 28 -29 -139 -20 28 11 40 2 101 2 -69 98
5901I8r8J28j20N1Nj6r7J07k7pp0R0L1j4j00J20r4rj18J17m8Q5L5J6o9O0r7J25
$$ 98 0 128 8 59 64 48 -49 58 31 24 -46 44 75 61 -39 81 -13 -22 -140 -23 -71 14 49 65 -4 56 -41 84
5929H4l5Q0m0r0J8k4Q0M8j28m3J34j42L9P4j0m2K1J3k1J1m5o1J15M0p4O1j37K0
$$ 84 49 129 89 -1 17 -7 73 121 -7 -50 84 -58 -19 55 45 3 24 37 16 27 -18 -79 36 76 2 63 -74 -54
5957e4j7M6M9j07J44j20J18m1M0o2rR6o1q8N2j3M8j14J87o4N1l7p6k2J45j02k6
$$ -54 -71 -25 24 -83 61 -59 59 18 58 -4 -13 83 22 -66 -14 -27 21 -93 94 30 81 44 -32 -54 91 -11 -37
5984c7NM2J6Qn8n3K7l0Q9l2P3q0m1J08n2J32j40P2m3l9k9N6J12o6N2k4J9j06K9
$$ -37 -32 10 26 34 -24 -77 -50 -80 9 -23 50 -30 -71 37 -15 117 -23 49 6 -33 -62 -6 106 40 92 68 87 -19 10
6013A0j22K7J36r0J8J2N2o3l4J49l1j27j2N4Q7LK8j12O4j8pn5J5r9J06J2k1M5
$$ 10 -112 -85 51 -39 -21 -9 43 -20 -54 95 64 -63 -75 -21 66 69 97 -15 49 31 24 -31 -16 -115 -9 3 -18 27
6041B7q6Q1j14R1mJ07n2j21J17l0k7J4J9j6o3kJ44r4j4Kj5O8M1n5j5K7K0j6q5
$$ 27 -59 22 -92 -1 -5 102 50 -71 46 16 -11 3 22 6 -57 -59 85 -9 -23 -21 -36 32 73 18 3 30 50 34 -51
6070e1K9J33j04lnK8j2r4J47m9n7M8k5m9M0O0j35Q9j7J5k8j2N8J2J2ql0K8MJ6
$$ -51 -22 111 7 4 -1 27 15 -79 68 19 -38 10 -15 -64 -24 36 -99 -10 -27 -12 -40 -52 6 18 30 22 -8 20 24 40
6100D0l0m8K0K7%l6J6J7o6N1m8L3P5qq3j8J08j7m8j0ql3nJ53o0j30J60m1pn5R2
$$ 40 10 -38 -18 9 9 -27 -11 6 -60 -9 -57 -24 51 43 -40 -58 50 33 -15 -25 -33 -66 -71 82 22 -108 52 11 4 -51 41
6131D1k1m4J0k8LO9Lp6J5j4R8n6j15P5R7j22K1N9m9P0j08P6P5m2m9pk3Q6K0J0
$$ 41 20 -24 -14 -42 -39 30 33 -43 -28 -42 56 0 -115 -40 57 -65 -44 15 -34 36 -72 4 79 37 -12 -19 -42 44 64 74
6161G4r5m2J05K7lq4Q0j24k9J81o1J4p9O3Mn3l4N7K3o7J56j29N6j50J74l7m5k2
$$ 74 -21 -63 42 69 66 -18 62 -62 -91 90 29 43 -36 27 31 -22 -56 1 24 -43 113 -16 40 -110 64 27 -18 -40
6189d0K3M8m2M7J0m5k1P2j40J37L3j77L2P5Jo1O3Qj07J31n8LK0K3J2j0m5mO7m0
$$ -40 -17 31 -11 36 46 1 -20 52 -88 49 82 -95 -63 12 13 -48 15 23 -84 47 -11 -8 12 35 47 37 -8 -12 55 15
6219A5l7q0P8j9J05j8p8j5P7j08P2O6j31O7MK0n4J58p6K9j10J21j07JJ4M6r6M1
$$ 15 -22 -102 -24 -43 62 44 -34 -49 28 -80 -8 58 -73 -6 -2 18 -36 122 46 75 -35 86 -21 -20 -6 40 -56 -15
6247a5M4q1O7m5j9P5o3J9kj4J04j14J17O3q4p9M1r4J19k7r3O3l7Q6Q1K2r7j23
$$ -15 29 -52 15 -30 -49 26 -37 -18 -20 -34 70 -44 73 136 52 -27 14 -80 39 12 -81 -18 -55 31 112 134 37 -86
6275h6Q0j1j4nRJ7Kl1K7Nj6P0j00K2n3M2P4r8P3k1QM0l5LK4No7Q0r2J24k6M3j7
$$ -86 -6 -17 -31 -36 -27 -10 -8 -39 -12 -7 -23 47 -53 -31 -84 -42 32 -66 7 -14 -6 34 -1 2 26 31 -36 44 -48 76 50 93 76
6308G6lM3l8k1l0M9j53l7J62p3K5P9j22J6m5P6m9R0J7j13K6M4L4l8P0r9O6k2K7
$$ 76 73 116 78 57 27 76 -77 -114 48 -25 0 79 -43 -27 -72 4 -45 45 62 -51 -25 19 53 15 85 -14 52 30 57
6337E7Rj27Q9k3j7l0m0J35Jm5QO7j39K8j03R5QO8K3P3j21J3N7p1J01o8j03J02
$$ 57 66 -61 28 5 -12 -42 -82 53 54 9 17 84 -55 -27 -130 -35 -27 41 64 137 16 29 86 15 116 48 -55 47
6365D7Mm5J4rL0k6j1M1p4K7L2j33J35j04J68m5rJ4p7m5O2j3j02K09r7m6J11l1
$$ 47 51 6 20 11 41 15 4 45 -29 -2 30 -103 32 -72 96 51 42 56 -21 -66 -4 -17 -119 90 -7 -53 58 27
6393B7%nj04O0M3qj09R0J6j9KN9o2k3l3mJ29j4Mj1P8j44o1R6M0r7KL0O9j2n4M1
$$ 27 27 22 -82 -22 21 13 -96 -6 10 -9 -7 52 -10 -33 -66 -70 59 45 49 38 116 -28 -89 7 47 -50 -48 -18 51 39 -15 26
6425B6l3M2r6J00J3j6oj13M9P1ML1L5j17L6L4r8M4r0M2J34o4p2kNk8N0L5k2O7
$$ 26 -7 35 -61 39 52 36 30 -83 -34 37 41 72 107 -10 26 60 -38 6 -84 -42 92 28 -44 -46 -41 -69 -19 16 -6 61
6455F1o0m0m8O6R9j37M4j3jJ04p9n6P4n4n5J07o8J22j16N1m2ol6N0k2l2K08k7
$$ 61 1 -39 -87 -21 78 -59 -15 -28 -29 75 -4 -60 14 -40 -95 12 -56 66 -50 1 -41 -47 -83 -33 -55 -87 121 94
6483I4n3m1j1j61J95j5O6q6K5q6J23o4LQ0j44Q4k4k6O8r1M4J6K6l3r8O0O5L1k8
$$ 94 41 0 -11 -172 23 8 74 -12 13 -73 50 -14 -11 69 -75 9 -15 -41 27 -64 -20 -4 22 -11 -109 -49 16 47 19
6512A9n6P6o9O2LL2oRn9j2j3N5L4j5J5l7Pq4Q9n0j13N1J14M6j33J7L5jPL7j23
$$ 19 -37 39 -30 32 35 67 61 70 11 -1 -14 41 75 60 75 38 45 -39 50 0 -113 -62 52 98 -35 -18 17 16 23 60 -63
6543f3Ql1R8l9P6o5m7O5rm2n8J12jq5P5PJ6o2P0j6l2j5J06Q6q1j78J77m8M3Kp5
$$ -63 -55 -86 12 -27 49 -16 -63 2 -7 -49 -107 5 4 -81 -6 1 17 -45 25 9 -23 -38 68 154 73 -105 72 24 67 69 -6
6574fJ8r3J43l5q6L6N7j3L8r1J8J2N9Rn4m3L5L4j2kmm5J17j77Q2J44o5j14L9Q2
$$ -6 12 -81 62 27 -59 -23 34 21 59 -32 -14 -2 57 66 12 -31 4 38 26 24 20 -25 92 -85 -3 141 76 -38 1 83
6604H3n9q1J08q7K5L3n3L7o7J57m6n8R1l7q6J2o2L3j1J13J7p5N2o7Q3r1L0j1n2
$$ 83 24 -57 51 -36 -11 22 -31 6 -61 96 50 -8 83 46 -40 -28 -90 -57 -68 45 62 -13 39 -28 55 -36 -6 -17 -69
6633f9o2J00P0P5j05N1o2P8j6R0j45J4jj6KM0n2J15j16m6J09J3j0p2Q9J7k3j1
$$ -69 -131 -31 39 114 9 60 -2 76 60 150 5 19 18 2 4 44 -8 107 -9 -55 54 67 57 -15 74 91 68 57
6661E7j7m6J3J9p5j2J5K9K0N5q5o8N3J0K9q9J32M8j15P5r4P1m0J11j90J32l5K
$$ 57 40 -6 7 26 -49 -61 -46 -17 3 58 -27 -95 -42 -32 -3 -92 40 88 -27 48 -46 25 -15 96 -94 38 3 5
6689Eo3L5Q0l4Qj3r9J25r0J4M4N9j20R3j8j03O7Nn7R8l5j07J24J07j50Q5Jq7j7
$$ 5 -58 -23 57 23 31 18 -81 44 -46 -32 12 71 -49 44 26 -77 -10 -5 -62 36 1 -106 18 125 -25 60 61 -26 -43
6718d3J28j28Q1L9r6o7Q4l6J4R2p4N7r0L5J00l6p0O2Jj06Q9l9J8L4j43J05l7j7
$$ -43 85 -43 38 77 -19 -86 -2 -38 -24 68 -6 51 -39 -4 96 60 -10 52 53 -53 36 -3 15 49 -94 11 -26 -43
6746d3Q5J6l6L0l1m3m0Q6l2J6P2n6n3n9O5n1P5m4M8N9o1j2Kk7J06r9rK5p7P8K7
$$ -43 42 58 22 52 21 -22 -62 24 -8 8 80 24 -29 -88 -23 -74 1 -43 5 64 3 -9 -7 -34 72 -27 -36 -11 -88 -10 17
6777A7K5PlK6q0P7j03N4J00j59j4Q0N2l5j4n8M6j20K08m7k7k9n1J13j28j0M9K3
$$ 17 42 49 46 72 -8 69 -34 20 120 -39 -53 27 79 44 30 -28 18 -102 106 59 32 3 -48 65 -63 -73 -24 -1
6805aK2l4R8o9N8j26N5l2N9M7m7N1m0p8m8Q4K6J5k4r3N9M4j23J06Qm2o9O5n5K0
$$ -1 21 -13 85 16 74 -52 3 -29 30 77 30 81 41 -37 -85 -1 25 40 16 -77 -18 26 -97 9 17 -25 -94 -29 -84 -64
6835f4R6j20M9M1N6Rj15L3O3j06%R8j19J15M9j39J22L0j52M6L3j50J03mK7m7P6
$$ -64 32 -88 -39 2 58 67 -48 -15 48 -58 -58 40 -79 36 85 -54 68 98 -54 -8 25 -125 -22 -26 1 -46 30
6862C0J6m7K5J6M6o8q5P2Jp0J00J0p4m3O1J30l6j77J69j3q7L6K7M9kj55L1O4m8
$$ 30 46 -1 24 40 86 18 -67 5 6 -64 36 46 -28 -71 -10 120 84 -93 76 63 -24 12 39 88 86 -69 -38 26 -22
6891b2P9ll4k2N1l1l2jN3q5O0J9L1o3pJ6j07J61k5PJ0j00J59j18J8l8K0lP3m5
$$ -22 57 54 20 -2 49 18 -14 -15 38 -47 13 32 63 0 -7 9 -98 63 38 45 55 -45 114 -4 14 -24 -4 -7 66 21
6921B1m1p0Q1J6j5r0J74l6N6p2J3n0Ll5m3J32m8N3L4K5o9J9n4N5k2o5O9L4j06
$$ 21 -20 -90 -9 7 -8 -98 76 40 96 24 37 -13 -10 -45 -88 44 -4 49 83 108 39 58 4 59 37 -28 41 75 -31
6950c1j3N8MJ8p3J33k35J12j2Q8r7O3l7J9pl2J12n8M9l2pM3o0q1J6O2Q5j76J24
$$ -31 -44 14 18 36 -37 96 -139 -27 -39 49 -48 15 -22 -3 -10 -42 70 12 61 29 22 65 5 -76 -60 2 87 -89 35
6979C5j8l8N3n9J02J4q8n9Q9q0Q8r8J28o4j45J30K6L1n5l7J03n8r1P7mL0m9M3
$$ 35 17 -21 32 -27 75 89 1 -58 31 -49 39 -59 69 5 -140 -10 16 47 -8 -45 58 0 -91 -14 -18 12 -37 6
7007FM2J4j35J22M3p9k0PJ31j23M9l1r6R1l4M9L5q5M7k8N4j6j5n8N8n2L0j2pJ2
$$ 6 48 62 -73 49 92 13 -7 0 131 8 57 26 -70 21 -13 36 71 -14 33 5 59 43 28 -30 28 -24 6 -6 -13 -1
7037aN9q0K5o5J9M6L2j07O9K3qlj13P9lJ03n0J0m0J05m6o8K7K4N4p2Pp7P1K5l8
$$ -1 58 -22 3 -62 -43 3 35 -72 -3 20 12 9 -104 -25 -28 75 25 35 -5 100 54 -14 13 37 91 19 26 -51 20 45 7
7068GK3PNo1p8Q6J16l4J8n3MO6o1j12M8R6m5j50J47p5n8O6K9Qo4P5m2L8K4kNj4
$$ 7 30 37 42 -19 -97 -11 105 71 89 36 40 106 45 -67 -19 77 32 -118 29 -46 -104 -38 -9 -1 -65 10 -32 6 30 28 33 19
7100A9j01K6J7K4J00j35L5R1r1O7j12J28l6q0L8J2M2k4o0J3L8j25N8M2o7J15N3
$$ 19 -82 -56 -39 -15 85 -50 -15 76 -15 52 -60 68 32 -48 -10 2 44 20 -40 -27 11 -114 -56 -14 -81 34 87
7127H7m4m9L7qNm1j5RR8k6Rj31P8J07Ol0n5L6m2N0j92Q1J19o3r4L6P3r0O5r0J33
$$ 87 43 -6 31 23 28 -13 -28 -19 79 53 62 -69 9 116 122 92 37 73 31 81 -111 -30 89 26 -68 -32 41 -49 16 -74 59
7158E9r8K0M6Q2k25K59j41J9r4L0M2j06J31j53J28k6r9Q0K1m5p9K24r5o2M4n1
$$ 59 -39 -19 27 109 -116 143 2 21 -73 -43 -1 -107 24 -129 -1 -27 -126 -46 -25 -70 -149 75 -20 -82 -38 -89
7184h9N3oP1l0l7L%o9R2n9K7Q6M9K1p1l2l3O8o0LR0j9j40J39p3O5j27O6P3l5o3
$$ -89 -36 -42 29 -1 -38 -35 -35 -104 -12 -71 -44 42 91 112 41 9 -24 44 -16 -13 77 58 -82 57 -16 49 -78 -12 61 26 -37
7215c7Q1o4j07J09O5m3pQ0j05l5R2ppm7J0J9J6J0lL6J6q9Ql2L2O9q8Pj8J09K6
$$ -37 44 -20 -127 -18 47 4 -3 77 -28 -63 29 22 15 -32 -22 -3 13 23 20 56 72 -17 -9 -41 -9 60 -28 -21 -39 70 96
7246I6p9Kn0l9P1o0J26Oq5j3K9q8pJ67m2j10O9j17J09J00p2L4k1j1O3l4j32O2
$$ 96 17 19 -31 -70 1 -59 67 73 -12 -25 4 -84 -91 76 34 -76 -7 -124 -15 85 13 47 26 15 78 44 -88 -26
7274b6L0N6%J7q0Oo3L2N2j05J28q9J5K5j4J7K5JjR1j89J01Ol9Q7K2j0k10J51p7
$$ -26 4 60 60 77 -3 3 -60 -28 24 -81 47 -42 -27 -2 -16 1 26 27 26 117 -72 29 35 -4 83 105 95 -115 36 -41
7304d1M1J06j06L3m6N0M3po5m0Q3q1Ln1Q4J0m9o3J39l1lL8k10J20o3Q0J7m5o0
$$ -41 0 106 0 33 -13 37 80 73 8 -32 51 -30 -27 -78 6 16 -33 -96 43 12 9 47 -163 -43 -106 -26 -9 -54 -114
7333a14O1J2N6K5k5l9J08L7j02K9o3Q3o5m1N5k5J9M7r3j9J94j40qj4j4J1Q5m1
$$ -114 -53 -41 15 40 15 -24 84 121 19 48 -15 68 3 -38 17 -8 11 58 -35 -54 140 0 -8 -22 -36 -25 60 19
7361A9j2j5mo8N9L0l9n5J41K2p0k0n0M7l5R8q4O4l3NO1k6n5Ol3M3m2Q3n4l1m2
$$ 19 7 -8 -12 -80 -21 9 -30 -85 56 78 8 -12 -62 -15 -50 48 -36 28 -5 0 61 35 -20 -14 -47 -4 -46 37 -17 -48 -90
7392i0%J36q1n5J10K2j37J82j2r4O6j24QK7k5O7k3j1JQ2o0J17j02j4K3K1m0m6
$$ -90 -90 46 -35 -90 20 42 -95 87 75 -19 47 -77 -69 -42 -67 0 -23 -34 -33 49 -11 106 4 -10 13 34 -6 -52
7420e2kNJ4M2R9j00r8Q3K0J1p3K1ojO3n7K5m0J9M6nO9rj26Q5L9j7l5L7l1l1l4
$$ -52 -54 -49 -35 7 106 6 -92 -9 11 22 -51 -30 -36 -37 26 -31 -6 -46 -27 19 14 83 74 -52 33 72 55 20 57 26 -5 -39
7452c9M7j9l3R2q1m3N3l9O4oRM9kr1q8J28L3km2K8J41j92J08l3N8q2R1o9k4L4
$$ -39 8 -11 -44 48 -33 -76 -23 -62 2 -4 5 54 52 -39 -127 1 34 32 -10 18 159 -33 75 42 100 18 109 40 16 50
7482E0j33R6j3N8o4J0m7R9l7n9KK4M4j18k7J14P8r5K2o7R0n8n8R3K6Q0j08j6P7
$$ 50 -83 13 0 58 -6 4 -43 56 19 -40 -38 -14 30 -88 -115 -1 77 -18 4 -63 27 -31 -89 4 30 110 2 -14 63
7511F3o4j8N1l1qO3m6m3j4J14j00Q4j13R6p9OL9j11Q1m7R1j65K11p9Q3m5Rq1Q
$$ 63 -1 -19 32 1 -7 56 10 -33 -47 67 -33 51 -62 34 -45 -39 0 -111 -30 -77 14 -151 60 -19 64 19 28 -53 -45
7540d5K7J9k5L9P1n2k4k8N4l7p9M6R0j1m0l1K1n2J5K8OJ5J7o2J9J0N7q3n8O7P9
$$ -45 -18 1 -24 15 86 34 10 -18 36 -1 -80 -34 56 45 5 -26 -5 -57 -42 -14 -8 7 24 -38 -19 -9 48 -35 -93 -26 53
7571E3q6kM8Mn7j8O6j7qN2O8j47JQ4n4M8L9q9mQ9o9nL1o5j3Rj1Q1k9rL7q0N7P8
$$ 53 -33 -35 13 17 -40 -58 8 -9 -17 35 103 -44 -43 41 -13 35 74 -15 -19 70 1 -4 27 -38 -51 -42 -53 28 -1 -10 27 -53 4 82
7605H2Mo4Oj9m1J4J5P0l6K5J11j06j22J04l5n1RK5J22q2j37J64j26J03Oj2kp7
$$ 82 86 22 28 9 -32 -18 -3 67 31 56 167 61 -61 43 8 -43 -34 -9 113 31 -106 58 -68 35 41 29 27 -50
7633e0L0O8Jm2K1j11J23o6P3j74O1J03j0n4M5L7j6j7p5M4j2J34q3pJ20j90J47
$$ -50 -20 48 49 7 28 -83 40 -26 47 -127 -66 37 27 -27 18 55 39 22 -53 -9 -21 113 30 23 143 -47 100
7660A00q5j9R1q3M4p7lM1l7J7Q9j11q7K24n4QRj64R9o5l2Q5K2J0n1L0o5R1Pj0
$$ 100 15 -4 87 4 48 -29 -32 9 -28 -11 78 -33 -120 104 50 58 67 -97 2 -63 -95 -10 12 22 -29 1 -64 27 34 24
7690B4m0j8N9rM6q4J8%L2m3M1m7RML7R0o3k6j55J14j8Q1j2J2n9N6p1k5J05Kj13
$$ 24 -16 -34 25 16 62 -22 -4 -4 28 -15 26 -21 -12 -8 29 119 56 30 -125 -11 -29 52 40 52 -7 49 -22 -47 58 60 -53
7721e3jMK4NLk4m5R3M1k1m8O3q3M7J2m7J11j22M7o8Q0j4K1j07RJ14J1j07jJ1Q6
$$ -53 -54 -50 -26 -21 -18 -42 -87 6 47 26 -22 41 -42 5 17 -30 81 -41 6 -62 18 4 25 -82 -73 41 52 -55 -56 -45 41
7752D1n7J18n7n6N8k04J92k6rO8J8j13n4jJ39k2r3lQ6L9l3r2P1o0LJ4Q3N1Mj14
$$ 41 -16 102 45 -11 47 -157 35 9 0 68 86 -27 -81 -82 57 35 -58 -61 25 64 31 -61 10 -50 -47 -33 50 101 105 -9
7782iP4p2P3l1K0j22K7Q3n0K2k8%%j4M4l4L5o3Lk8J05k9L2p9o6Q7M5M9K3r7N4
$$ -9 65 -7 66 35 55 -67 -40 43 -7 15 -13 -13 -13 -27 17 -17 18 -45 -42 -70 35 6 38 -41 -107 -20 25 74 97 0 54
7813E4j47N5M7J4j58R8N5M0j33J11l9o3P9qN4j7j58K30p8n9N0Q7lj47KKQ5m9j03
$$ 54 -93 -38 9 23 -135 -37 18 58 -75 36 -3 -66 13 5 59 42 -116 114 36 -23 27 114 111 -36 -34 -32 53 4 -99
7842i9J63Pn0pj7L7j48O9J8L9q6k5J45o9k7N6m0J44j55L4L3p4M0K2o5N6J04j13
$$ -99 64 71 21 14 -3 34 -114 -45 -27 12 -74 -99 46 -23 -50 6 -34 110 -45 -11 22 -52 -12 10 -55 1 105 -8
7870hJ09p6q6Q3J3o8M2o6J35J1j39J07o6O6j30Q5L6j02J23j77K44j23R0p7r4R1
$$ -8 101 25 -61 22 35 -33 9 -57 78 89 -50 57 -9 57 -73 12 48 -54 69 -108 136 13 103 26 -68 23
7896B3q6J36K5j38K1R5q4P1j12q5K42j01K0O4l4o7L9q9N0M4m4P5j94J40M0q7K9
$$ 23 -63 73 98 -40 -19 76 -8 63 -49 -134 108 7 27 91 57 -10 29 -60 -10 34 -10 65 -129 11 51 -36 -7
7923gM1L9j19M7N8n0l5l0M0JR5k5k8j01L8R2oK7j22%J21j3r9m1PJ38m8J7p5L9
$$ -7 34 73 -46 1 59 9 -26 -56 -16 -15 80 55 27 -74 -36 56 50 77 -45 -45 76 63 -36 -77 -70 68 20 37 -38 1
7953A%J22j72j01J91oj6k2q1Q6r6K9k8N5R4m4j0J3O2q9J7R0m7J6j13j33J47Q6
$$ 1 1 123 -49 -150 41 35 19 -3 -84 2 -94 -65 -93 -38 56 12 2 15 77 -12 5 95 48 64 -49 -182 -35 51
7981E1Jl6m0R5n5p4J2L4J5n5K4K1K5nO4j22J06M6k2k80J92K0j00J75k46J34j20
$$ 51 52 16 -24 71 16 -58 -46 -12 3 -52 -28 -7 18 13 77 -45 61 107 85 -195 -3 17 -83 92 -154 -20 -140
8008a40J99j6L7j70M7O0p9J45n3Kj15Q1n4K05j54K1m4Q9j13O8J6m8%%L9PL0j7
$$ -140 59 43 80 -90 -43 17 -62 83 30 32 -83 -2 -56 149 -5 16 -28 61 -52 16 32 -16 -16 -16 23 30 60 43
8036D3j08J03N3j53R1J0n8j51J79l2M5k1M7j17NJ55n1L9k8j79NJ19L6r9J51r9
$$ 43 -65 38 91 -62 29 39 -19 -170 9 -23 22 1 48 -69 -64 91 40 79 51 -128 -123 -4 32 -67 84 -15
8062a5L5pl1mJ8J9o8P1ON2j25J12r4K2K2M8n0qJ9q5J37k03J28n3LN5N2o0k5j8
$$ -15 20 13 -18 -22 -4 15 -53 18 24 76 -49 63 -31 -9 13 61 11 3 22 -63 74 -129 -1 -54 -51 4 56 -4 -29 -47
8092d7p2J21K5r2J02l7OJl3k8J46m6mj18K4M3mJ05o4pK0j07n5J83j00N2L6o7K2
$$ -47 -119 2 27 -65 37 0 6 7 -26 -54 92 46 42 -76 -52 -9 -13 92 28 21 41 -66 -121 62 -38 14 50 -17 5
8121EK0l5J07Rj51L5L5r5m0J35j26J29l0j8j5K0K1o9O1M0N9j59J36j18J00j12
$$ 5 25 -10 97 106 -45 -10 25 -70 -110 25 -101 28 -2 -20 -35 -15 6 -63 -2 38 97 -62 74 -44 56 -56
8147e6K1J4K2l3LpN1P5j57jR5j38R1M2M0lj37L5L4J3M6%r0R5j9j1Ml8l3L2J4n3
$$ -56 -35 -21 1 -32 -29 -36 15 90 -67 -68 27 -111 -20 22 62 59 -78 -43 -9 4 50 50 -40 55 36 25 29 -9 -42 -10 4 -49
8179d9N4jOm6O3NJ7q9L4O8j28J17
$$ -49 5 4 10 -36 27 32 49 -40 -6 62 -66 51
8191E1
$$ Imaginary data points
##PAGE= N=2
##DATA TABLE= (X++(I..I)), XYDATA
0@%%%%%%%%%%%%%%%%%%%%%%%%%%%%%%kNnMnNlKj%%%KnOqJ0j0J1j3J4j4J4j4J3
$$ 0 0 0 0 0 0 0 0 0 0 0 0 0 0 0 0 0 0 0 0 0 0 0 0 0 0 0 0 0 0 0 -2 3 -2 2 -3 2 -1 1 0 0 0 0 2 -3 3 -5 5 -5 6 -7 7 -7 7 -7 6
55Fj1Rlj0L1o0J04j73K87m85Q43j552L211q378M8943K12540k19324j23368J73270
$$ 6 -5 4 1 -9 22 -38 66 -107 180 -305 538 -1014 2197 -6181 42762 255302 35978 -87390 85880
74H5880j49716j48769K79632J07579k18847M2765Q7870k17482r587K67576m3508
$$ 85880 -63836 -212605 67027 174606 -44241 -1476 86394 -131088 -140675 126901 83393
85H3393j52957J30715k571k13014R2250J88913j23306n0389J54028r5390j67197
$$ 83393 -69564 61151 58580 -154434 -62184 126729 3423 -46966 107062 11672 -155525
96a55525J52655J00223j36966M1786J09992j59925q0583J72579M839j04220J09227
$$ -155525 -2870 97353 -39613 2173 112165 -47760 -128343 44236 49075 -55145 54082
107E4082L2069j82249J5222J50574o7410m6560J30479m4358j51927Q3007R0860
$$ 54082 86151 -96098 -80876 69698 2288 -44272 86207 41849 -110078 -27071 63789
118F3789r5239J9611J04273r9217q6791J12488J9343q6273O9255N5096j17584
$$ 63789 -31450 -11839 92434 -6783 -93574 18914 38257 -48016 21239 76335 -41249
129d1249j6617J00519m1598m8964R7616M82j10207L7575O6821p3929k941R5266
$$ -41249 -57866 42653 1055 -47909 49707 50189 -60018 -22443 44378 -29551 -32492 62774
141F2774m3831p6774O6058J9029p4780M1853O8396p0523l3664O6695k2498m8378
$$ 62774 18943 -57831 8227 27256 -47524 -5671 62725 -7798 -41462 25233 2735 -45643
153d5643O8477K5248p5334Q390M8849m8091j3999P1531j3694o0052L5834K1308
$$ -45643 22834 48082 -27252 -18862 29987 -18104 -32103 39428 25734 -34318 1516 22824
165B2824n4353J7740N6749m0734l3897M7719n789m4951L8893L0448n1364k132
$$ 22824 -31529 -13789 42960 2226 -31671 16048 10259 -34692 4201 34649 -16715 -18847
177a8847M4756k9803k7128M8500L898m5256K2541K6862m2016l112M4257j8348
$$ -18847 25909 -3894 -31022 17478 21376 -23880 -1339 25523 -16493 -19605 24652 6304
189F304k7934L5010L608m0932J6827L0470k8808p385L2405j6850k8037L0263J3047
$$ 6304 -21630 13380 16988 -23944 -7117 23353 -5455 -12840 19565 2715 -25322 4941 17988
202A7988l0713Q300K2087k6656r695L2793n431k4981K0426R553k8892O737K6394
$$ 17988 -12725 -4425 17662 -8994 -18689 14104 8673 -16308 4118 13671 -15221 -8484 17910
215A7910j8997j3152K5552l912k3458J8284J3463k5254J135K3549j4238j3939
$$ 17910 -1087 -14239 11313 7401 -16057 2227 15690 -9564 -8429 15120 882 -13057
227a3057K1197l70k1020J3454J3721k0683k343J9386j0436j1867J8881J299j9651
$$ -13057 8140 7770 -13250 204 13925 -6758 -9101 10285 -151 -12018 6863 8162 -11489
240a1489Q874J2719j6277j366J8614q907j4021J5271M479j6091P030J2254j4901
$$ -11489 -2615 10104 -6173 -7539 11075 2168 -11853 3418 7897 -8194 -1164 11090 -3811
253c811m394J6595m764j2122J1962L938j4630M563J1578j1153m424J3144m292
$$ -3811 -8205 8390 3626 -8496 3466 7404 -7226 -2663 8915 -2238 -6662 6482 2190
266B190j0691J0400M547j2659K835J0066r008m059J1819k745j0064Q044N088r845
$$ 2190 -8501 1899 6446 -6213 -3378 6688 -2320 -6379 5440 2695 -7369 675 5763 -4082
280d082J825Q385p297m059R926j607q029O354L798r207J683P960n884m205Q038
$$ -4082 -2257 6128 -1169 -5228 4698 3091 -4938 1416 5214 -3993 -2310 5650 -234 -4439 3599
295C599j462p522N804M241p819N1O576m256l036O280p45n867L917L285n311Q44
$$ 3599 2137 -5385 419 4660 -3159 -3108 3468 -788 -3824 2456 1711 -4156 -239 3046 -2265 -1421
311a421M790l920k321N391q05m260L537K131n140O97M736k908k632L811n14l467
$$ -1421 3369 -551 -2872 2519 1714 -2546 991 3122 -2018 -1321 3415 507 -2125 1686 1172 -2295
327b295K604J974l688j34K814j862j135K699p58k475K004J437k663O35K508k021
$$ -2295 309 2283 -1405 -1539 1275 -587 -1722 977 219 -2256 -252 1185 -1478 -843 1665 -356
343c56j449K679J94j863J187P92j854J80K041q73j044R29k50p13R94J29j267J85
$$ -356 -1805 874 1068 -795 392 1184 -670 -490 1551 678 -366 563 313 -400 594 723 -544 -359
361c59Q03p75l32J023k57j110M83N76n82J07N89j55o86M35N50J13n06O4L00R8
$$ -359 444 -331 -663 360 103 -1007 -524 52 -530 -423 166 11 -675 -240 310 423 -83 -19 281 379
381C79k7J62j26k79J47J40j89P6L5m45j9M12k67o49P32jj035M09J077q68o43R91
$$ 379 352 514 388 109 256 396 207 283 318 -127 -146 266 -1 -650 82 81 -954 -545 532 -336 -979 12
403A2j7q94J045N28j281J37J204o83m08J311m97j141J272L35j427N89J278j624
$$ 12 -5 -899 146 674 -607 -470 734 51 -357 954 457 -684 588 923 -504 85 1363 -261
421b61o50J814m56j484J361L89j976M84J761j416q45J739n20j227J478O22k037
$$ -261 -911 903 447 -1037 324 713 -1263 -779 982 -434 -1279 460 -60 -1287 191 813 -1224
438a224P35J602j697k31K240q61j724J864N25k099R37J844k307q27K546o21j879
$$ -1224 -489 1113 -584 -815 1425 564 -1160 704 1229 -870 67 1911 -396 -1223 1323 702 -1177
455a177J769L50k351R99J855k171m98K280j265j437K125L44k358J255J633k274
$$ -1177 592 942 -1409 -410 1445 -726 -1224 1056 -209 -1646 479 823 -1535 -280 1353 -921
471i21l21K769j278j819K270N64k303R88J748k209l44K467j027j768J971Q0k183
$$ -921 -1242 1527 249 -1570 700 1264 -1039 -51 1697 -512 -856 1611 584 -1184 787 867 -1316
488a316J224J652k323m34K230j191j663K439L57k681J017J654j862r2K255j135
$$ -1316 -92 1560 -763 -1197 1033 -158 -1821 618 975 -1706 -689 965 -897 -989 1266 131
504A31j611K009L75j855J266J138k020l7K051j117j201J800J43k078J018J288
$$ 131 -1480 529 904 -951 315 1453 -567 -604 1447 330 -871 929 1072 -1006 12 1300
520A300j790m00J815p78j363J470L20j697M67J345j104l17J426p99r81J385L87
$$ 1300 -490 -890 925 147 -1216 254 574 -1123 -656 689 -415 -732 694 -105 -1086 299 686
537F86j430O12J144j390j98J598n82r08J099K78j401L34R87p15n50R13l17p29
$$ 686 -744 -132 1012 -378 -576 1022 440 -468 631 909 -492 -158 829 114 -436 477 160 -569
555e69N41K26n96J20N03n15k92M85P4n06M62M12n76j30P33k06n99O74M41o54j31
$$ -569 -28 198 -398 -278 225 -290 -582 -97 -23 -529 -67 345 -231 -361 372 166 -433 241 682 28 -103
576a03N30k16l27N60J83p29o0M28k71j01L69k28n42K93L08n59J12N08l50n30O40
$$ -103 427 211 -116 444 627 -102 -162 266 -5 -106 263 35 -507 -214 94 -465 -353 155 -195 -725 -85
597h5K65o76K09P22n27m39J132j27r96P91M92r91J48R03p07n20J026j31j016O67
$$ -85 180 -496 -287 435 -92 -531 601 474 -522 269 761 -230 -82 821 114 -406 620 489 -527 140
617A40M40j256K67J178j032n30J152k75j239J020P18j323l4J281o10o50J299n4
$$ 140 580 -676 -409 769 -263 -793 359 84 -1155 -135 583 -740 -774 507 -103 -753 546 492
635D92j233Q58P41j310K31J219r58n98J419k17j477J102P29j653J71J530j032
$$ 492 -741 117 858 -452 -221 998 40 -558 861 644 -833 269 998 -655 -484 1046 14
652A4j110J480m2j374R54P02j413K00J174q18n97J393l73j100J048O71j350J90
$$ 14 -1096 384 342 -1032 -78 624 -789 -589 585 -233 -830 563 190 -910 138 809 -541 -351
670c51J354q88o77J371j21j410Q33Q86j317j26J194q22o39J329l46j175R83M59
$$ -351 1003 115 -562 809 688 -722 111 997 -320 -446 748 -74 -713 616 270 -905 78 537
688E37j350K49J277j058n55J362j86j186J058N64j416M57J063q33m57J117k32
$$ 537 -813 -564 713 -345 -900 462 276 -910 148 712 -704 -247 816 -17 -474 643 411
705D11r03Q57L10r38R0Q74p81l50R40k32r45P00L51j000K68O95n97l65P71Rp26
$$ 411 -492 365 675 -263 -173 701 -80 -430 510 278 -667 33 384 -616 -348 347 -250 -615 156 165 -561
726e61N44L18p27L55N68o47j47O86k68m32O76Q9o39L82M06p41o0P11m27m81O54
$$ -561 -17 301 -426 -71 497 -150 -297 389 121 -311 365 454 -185 197 603 -138 -198 513 86 -395 259
747B59j08n27J62K81l31p2L39r7j68K55o3j58K15J88l59K09J89k27j13L02Q6k66
$$ 259 151 -376 -214 67 -264 -336 3 -94 -262 -7 -70 -228 -13 175 -184 25 214 -13 -126 176 262 -4
769dJ97N8j93MJ32r8o1qk0n5R1j11j08J84p9j97K12p6j53J07J48j53q3K44p2k8
$$ -4 193 251 58 62 194 96 35 27 7 -48 43 -68 -176 8 -71 -268 -56 -132 -285 -178 -30 -183 -266 -22 -94 -122
795a22K40j12j01L57j19j78J54K61l44N3J14j89o8L20j36m12K95P7k23L4K02l15
$$ -122 118 6 -95 262 143 -35 119 380 36 89 203 14 -54 266 130 -282 13 90 -133 -99 103 -212
817b12o8L07k50k77N58m4m44K76L72m59J37M18j44l57M06J87n14K21K59l20j29
$$ -212 -280 27 -223 -500 58 14 -430 -154 218 -241 -104 314 170 -187 219 406 -108 113 372 52 -77
838g7N19l20l01M95j67m41K18K96o25J76M49l71l05N85n9n26L79K81n01J08M55
$$ -77 442 122 -179 316 149 -292 -74 222 -403 -227 222 -149 -454 131 72 -454 -75 206 -295 -187 268
859B68l51j17N36j10m73M26J83n55J84M87m79j77N21k51l60M02J03o68K04N21
$$ 268 -83 -200 336 226 -247 179 362 -193 -9 478 -1 -178 343 92 -268 134 237 -431 -227 294
879B94m46k00M62j63l21N13J6n70K65M41n18N6N23l75k77N09L3m44L58K75l89
$$ 294 -152 -352 110 -53 -374 139 155 -415 -150 291 -227 -171 352 -23 -300 209 242 -202 156 431 42
900D2j24N28l55k65M64j66l05K53J56l51j27L84k57j75K78N5m52K81K34m43J94
$$ 42 -82 446 91 -174 290 124 -181 72 228 -123 -250 134 -123 -298 -20 35 -417 -136 98 -345 -151
921a51L61k84j71M61M7k91J37K48l45l1M57m83J04K61j47l41L54q9l22J97J37
$$ -151 210 -74 -245 216 263 -28 109 357 12 -19 438 -45 59 320 173 -168 186 97 -225 -28 109
942A09l00M1K98l42p8J99J7k12J88J10j70J28J20k28o7K48J20j76Q0J10j63J25
$$ 109 -191 -150 148 -194 -272 -73 -56 -268 -80 30 -140 -12 108 -120 -187 61 181 5 85 195 32 157
964A57J52l52M9J79j0j98R5N0j18K8lj29l1J59k29R2J14q2k08L67o1j87J59J17
$$ 157 309 -43 6 185 175 -23 72 122 4 32 29 -100 -131 28 -201 -109 5 -77 -285 82 21 -166 -7 110
988A10j65J25J43j93O5J27j36j7N9Q5k07J44O8k63K9J74j93p0J39p3j43J28R5
$$ 110 -55 70 213 20 85 212 76 59 118 203 -4 140 208 -55 -26 148 -45 -115 24 -49 -192 -64 31
1011C1j93P9Q4j80L8K39m4k69K97J0j90J04K22j98j13M35k85j12K77L7m14K03
$$ 31 -162 -83 1 -179 -141 98 54 -215 82 92 -98 6 228 30 -83 352 67 -45 232 269 -145 58
1033E8K41m32Q6K02j74j92K74Kl55J79J02k57J37J42j47j31L63o8j76K15J04k31
$$ 58 299 -133 -47 155 -19 -211 63 65 -290 -111 -9 -266 -129 13 -134 -265 98 30 -146 69 173 -58
1055e8n5M02k89r1K86o5k52K81J34l88R6K52l76m6L66k09j48J87K6l37J26K80
$$ -58 -113 289 0 -91 195 130 -122 159 293 -95 1 253 -123 -169 197 -12 -160 27 53 -284 -158 122
1077A22m23Q7L92j73k42K45mj54J07K30l20J79J64j33p1K26j4l24L34M7l42J60
$$ 122 -301 -214 178 5 -237 8 4 -150 -43 187 -133 46 210 77 6 232 218 -106 228 275 -67 93
1099I3R5k47L3J41j00k00K50nk92P3J89k57O9R6r0j1K30J28k40lL62l59LJ82j41
$$ 93 188 -59 -26 115 15 -185 65 60 -232 -159 30 -227 -158 -62 -152 -163 67 195 -45 -48 314 -45 -42 140 -1
1124am8J30Pj80J52R5j78n0K92k95J2K12k19j16J56m6o6L7J70j49p5J91Pj75J90
$$ -1 -49 81 88 -92 60 155 -23 -73 219 -76 -64 148 -71 -187 -31 -77 -143 -106 64 -85 -160 31 38 -137 53
1149E3L7j57J00L7j02K6L3Jp4J89n2j72J04J02j72k0J85k13M9P2o1j05J16Mj75
$$ 53 90 -67 33 70 -32 -6 27 28 -46 143 91 -81 23 125 -47 -67 118 -95 -46 26 -35 -140 -24 -20 -195
1174a95K03J03j30n8Rp0Q1J97j62l3K59o9q3k8J74r4j14J42j04k8O7J0k16J26
$$ -195 8 111 -19 -77 -68 -138 -57 140 -22 -55 204 135 52 24 198 104 -10 132 28 0 67 77 -139 -13
1198a3L5j8k8Qj76J2K52r7j11J43R0k98J00K31o3o2n6R4j91K14M4j04N9J04k01
$$ -13 22 4 -24 -16 -192 -180 72 -25 -136 7 97 -201 -101 130 67 5 -51 43 -148 66 110 6 65 169 -32
1223c2P6J93j44k10L13o8k52K27L0k29j9J74j62o5J93L9k03J21R1j55J9J20l1
$$ -32 44 237 93 -117 196 128 -124 103 133 -96 -115 59 -103 -168 25 64 -139 -18 73 -82 -63 57 26
1246B6o4J31n0j52K42Q2k58l0K42j81N1J25j09k14J87O0j37N6O6j16q9J60r5j62
$$ 26 -38 93 43 -109 133 215 -43 -73 169 -12 39 164 55 -159 28 88 -49 7 73 -43 -132 28 -67 -229
1270b29K60j9j79J39Q5j75J70n1l7K4J40m0j45J37J0r8RQ7j02k9J70j67k6J09
$$ -229 31 12 -167 -28 57 -118 52 1 -36 -12 128 88 -57 80 90 -8 1 88 -14 -43 127 -40 -66 43
1294D3O6k96K43q8j38q4L00n1k18K09J59l31K72q3k13J63J38j07J8O6m2r3K56
$$ 43 109 -187 56 -32 -170 -254 46 -5 -223 -14 145 -186 86 3 -210 -47 91 -16 2 68 26 -67 189
1317A89P3l13J20J36k06%R8o6q9L5j8J0N3K2j81oJ16j11J20J00j33j80J76K28
$$ 189 262 -51 69 205 -1 -1 97 31 -58 -23 -41 -31 22 44 -137 -143 -27 -138 -18 82 -51 -231 -55 173
1341A73k63N3R3jj05O0R5j12Q4N6j27O4Mq1pJ65j36o2Q0n7r1J07Pq7O1M0j93O4
$$ 173 -90 -37 56 55 -50 10 105 -7 77 133 6 70 74 -7 -14 151 15 -47 33 -24 -115 -8 -1 -88 -27 13 -180 -116
1369a16J67j11R4j6l8o7O2N3j58M5Q2l0M7J43l5j14k4J58j45L4Q9j53oK6n3M3
$$ -116 51 -60 34 18 -20 -87 -25 28 -130 -85 -3 -33 14 157 122 8 -16 142 -3 31 120 -33 -39 -13 -66 -23
1395b3ll2m3N0%K2m8M3n0k8J72j3j85R4J74j13o0J77j25j14J93m6j0m4P5r0O0
$$ -23 -26 -58 -101 -51 -51 -29 -77 -34 -84 -112 60 47 -138 -44 130 17 -43 134 9 -105 88 42 32 -12 63 -27 33
1422C3J20k03n6J80r9n5J06m0Pn7O0rLNJ8j26J30M1j94K31j8j93Q7J57j02k1J44
$$ 33 153 -50 -106 74 -25 -80 26 -14 -7 -64 -4 -13 -10 -5 13 -113 17 58 -136 95 77 -116 -29 128 26 5 149
1449A49j02q7P0M4j31PM7J6j62J60j42j5K4J21J5p8J05j43pK21j01j0J3nP1j00
$$ 149 47 -40 30 74 -57 -50 -3 13 -149 11 -131 -146 -122 -1 14 -64 41 -102 -109 112 11 1 14 9 80 -20
1475b0J18j00J18m1Oj35J20n7M8p2J01o4l2K7m0NJ03l5j49J53m5o4n4K21k25J7
$$ -20 98 -2 116 75 81 -54 66 9 57 -15 86 22 -10 17 -23 -18 85 50 -99 54 9 -55 -109 112 -113 -96
1501i6J20p8L4jR1L8l7l4K2p6J06L9r4P5J0j03k0J35q7l5k5m7J0R8o6l1k9P7n2
$$ -96 24 -54 -20 -21 70 108 71 37 59 -17 89 128 34 109 119 16 -4 131 44 9 -16 -63 -53 45 -21 -52 -81 -4 -56
1530e6L6o7k5J16O6n2j01M4K8l8O8m9L8j0K4M7q2M4rKk5O7j71P6J79k56QJ38p9
$$ -56 -20 -87 -112 4 70 18 -83 -39 -11 -49 19 -30 8 -2 22 69 -13 31 22 24 -1 66 -105 -29 150 -106 -98 40 -39
1559c9j09J86j11Qm4J63p5m7J34j47J02l2k0qJ10j15M7L5M4j53j9J07k0M5M6p4
$$ -39 -148 38 -73 -65 -109 54 -21 -68 66 -81 21 -11 -31 -39 71 -44 3 38 82 -71 -90 17 -3 42 88 14
1585A4j11J86j91l4j1J68k1j15J64j3j22K0P4n1L4p7J28l0n9J69k00J14Qj23J11
$$ 14 -97 89 -102 -136 -147 21 0 -115 49 36 -86 -66 8 -43 -9 -86 42 12 -47 122 -78 36 44 -79 32
1610C2K1j02R5K5r7N1M6j90J6L0M9p5L6Lo6M0N7M6j7RR6j39L9njl5Q4l8m0n6J87
$$ 32 53 -49 46 71 -26 25 71 -119 -103 -73 -24 -99 -63 -60 -126 -86 -29 17 0 9 105 -34 5 0 -1 -36 48 10 -30 -86 101
1641A01n6j7Q9j48P4p0J7m3J29k7j02J15kj21j31K43j37l9J14L6m4j2L7J6o5J64
$$ 101 45 28 117 -31 43 -27 -10 -53 76 49 -53 62 60 -61 -192 51 -86 -125 -11 25 -19 -31 6 22 -43 121
1667A21j33j2J65j42j9P7O0j39Q7N1n1o1OK7r5R0l6m0k3J96k90J35K06k91Q0K8
$$ 121 -12 -24 141 -1 -20 57 117 -22 65 116 65 4 10 37 -58 32 -4 -44 -67 129 -161 -26 180 -111 -31 -3
1693cq4O7Ql5P6lj3m6O2K2K2j86K53j20l9L0O4k2qL4l6m6LL6j13L5J16j62R2o7
$$ -3 -87 -20 -12 -47 29 26 13 -33 29 51 73 -113 140 20 -19 11 75 53 45 79 43 -3 0 36 -77 -42 74 -88 4 -63
1723f3R8j09L1J50j48M6M3n6O2o9N3j9J10j05k5M3p8M6L9j3j65O6lQ0J1j14J07
$$ -63 35 -74 -43 107 -41 5 48 -8 54 -15 38 19 129 24 -1 42 -36 10 49 36 -129 -63 -66 14 25 -89 18
1750A8km5J6r9P0PJ8j2R9p3%M6J1o6P9O5j20J6k2kLP4j1j28J5P4p7P6n2n2k4J32
$$ 18 16 -29 -13 -112 -42 -35 -17 -29 70 -3 -3 43 54 -12 67 132 12 28 6 4 7 81 70 -58 -43 31 -46 30 -22 -74 -98 34
1782C4Jj4n2K5k9n3P6m5L0O3n9jQ6Po3p3O8j0j4o1J9M4R1rm2J6N6j06l7J21j63
$$ 34 35 21 -31 -6 -35 -88 -12 -57 -27 36 -23 -24 62 69 6 -67 1 -9 -23 -84 -65 -21 70 61 19 35 91 -15 -52 69 -94
1813i4N4l2J61j44mM8p6Q4j8L3r8J12r4j8J40P8j79Q6J4L3q4k3J0j6J33m0o1P3
$$ -94 -40 -72 89 -55 -59 -11 -87 -3 -21 12 -86 26 -68 -86 54 132 -47 39 53 86 2 -21 -11 -27 106 66 5 78
1841G8o6N9j3o0J1mR7o3j64J52o6P1m6l4nJ05j14J56l5pK0q0k7J73j33j3P9j18
$$ 78 12 71 58 -2 9 5 102 39 -125 27 -39 32 -14 -48 -53 52 -62 94 59 52 72 -8 -35 138 5 -8 71 -47
1869d7L4J23Lj01K3LM9p0Nj13P1j8J9p4J20n1P8n4J05j65l7J07k8o5P2R3o3J6
$$ -47 -13 110 113 12 35 38 87 17 22 -91 -20 -38 -19 -93 27 -24 54 0 105 -60 -97 10 -18 -83 -11 82 19 35
1897C5J12j75K3M2Q1j68J67l7j56J10Jj2q6O3J7n8P5m2j21M3J15j45R3N2qr1Q3
$$ 35 147 -28 -5 37 118 -50 117 80 -76 34 35 23 -63 0 17 -41 34 -8 -129 -86 29 -116 -23 29 21 -70 13
1924A3L9o7L0oJ1k7o0M3J03j13Qj7J39o5J4J9m5n8l3M0nL9MKp9R0L5q3P5O8j36
$$ 13 52 -15 15 9 20 -7 -67 -24 79 -34 -26 -43 96 31 45 64 19 -39 -72 -32 -37 2 6 8 -71 19 54 -29 46 114 -22
1955b2j43J14P2m0P5n1jr5J79L0q9mK7n7kL0k9N0q9M6m1J8K8%l0K8n6R4n5J00
$$ -22 -165 -51 21 -19 56 5 4 -91 88 118 29 25 52 -5 -7 23 -6 44 -45 1 -40 -22 6 6 -24 4 -52 42 -13 87
1985H7Mn8j17P4M0k0p0Q9J6mm9o5M2pJ7ml1P3P7j50nJ13k9p6M7nJ9o7j2MJ10p9
$$ 87 91 33 -84 -10 30 10 -60 29 45 41 -8 -73 -31 -38 -21 -25 -56 17 94 -56 -61 52 23 -53 -6 -11 8 -59 -71 -67 43 -36
2017c6P4K3j7p0o2J07J00j38J7Lr0J85k7j7p6P7r0N6Rj9m2m3J63j17R1j07l5L9
$$ -36 38 61 44 -26 -88 19 119 -19 -2 1 -89 96 69 52 -24 53 -37 19 28 9 -33 -76 87 -30 61 -46 -81 -42
2045d2P3p9n9J61r9n7O3K0k5o0J65m8l5M4K2k5K4r5M6O9M6j48jJ58j57MN8m9q1
$$ -42 31 -48 -107 54 -45 -102 -39 -19 -44 -104 61 13 -22 22 44 19 43 -52 -6 63 109 -39 -40 118 -39 -35 23 -26 -107
2074a07O3O8j19N3L5j26J6P9J02p2Q6m5j33Q1n3R6M9m9q9L9J5P9r6j15L44k33
$$ -107 -44 24 -95 -42 -7 -133 -117 -38 64 -8 78 33 -100 -19 -72 24 73 24 -65 -26 -11 68 -28 -143 201 -32
2100c2P4L1q5r0R5M2M8j94J29kl0J5r1J28k0mj00J23q9J38j24O3j9%PL8m7j03
$$ -32 42 73 -12 -102 -7 35 83 -111 18 16 -14 1 -90 38 18 14 -86 37 -52 86 -38 25 6 6 13 51 4 -99
2128i9J33m8M7n0J09Or9O4l2M1m8l6L8M8n1P1o6J10j05L4N7j32J24j23L0j00P0
$$ -99 34 -14 33 -17 92 98 -1 63 31 72 24 -12 26 74 23 94 28 138 33 67 124 -8 116 -7 23 -77 -7
2155goL1J44k46J56j89M3J18L5j08Jnm6R7p8R8j23l4J30K0j6Ok3J5Q9j14QJ01
$$ -7 -13 18 162 -84 72 -117 -74 44 79 -29 -28 -33 -79 18 -60 38 -85 -119 11 31 15 21 -2 13 102 -12 -4 97
2183I7j66J55j2j60J74j26J30Qrp7L5o9m1Q8k0J4oq0M5J3k0O2j01q4J55r6M0P3
$$ 97 -69 86 74 -86 88 -38 92 100 91 14 49 -20 -61 27 7 21 15 -65 -20 -7 -27 35 -66 -150 5 -91 -51 22
2211B2qN2j06Q7L7j26O2j03K04p2k0QN3o0j4l0J6q5N1J23n7j29L7P2j19N8M5L1
$$ 22 14 66 -40 47 84 -42 20 -83 121 49 29 37 90 30 16 -14 2 -83 -32 91 34 -95 -58 14 -105 -47 -2 29
2239B9j8m3L6n2J20j02J01p2j5mj0J02r6l5J35j84%N5Q2k0m2Q4k4n6J19m3jj01
$$ 29 11 -32 4 -48 72 -30 71 -1 -16 -20 -30 72 -24 -59 76 -108 -108 -53 29 9 -33 51 27 -29 90 47 46 -55
2267e5R1mK0n8p5J4J02j16o0J30K2rk5J50j30N7O7p6j25J63n8l1L8pk1O6j60K18
$$ -55 36 32 52 -6 -81 -67 35 -81 -141 -11 11 2 -23 127 -3 54 121 45 -80 83 25 -6 32 25 4 70 -90 128
2295A28k08R0qN4p6M3J5n9L1nk4P4q7%lO8j02K6JP0J9n1P5m2J6j5k9mO8qr4L0
$$ 128 -80 10 2 56 -20 23 38 -21 10 5 -19 55 -32 -32 -35 33 -69 -43 -42 28 47 -4 71 29 45 30 1 -3 65 57 -37 -7
2327gN0o2K9k9M2M6m4o0J32n1k3p1Q3K8J0o3p4J51o1J1l2L9n0oP6j0p1Kk4J09
$$ -7 43 -19 10 -19 23 69 25 -35 97 46 23 -48 35 63 73 10 -64 87 26 37 5 44 -6 -12 64 54 -17 -15 -39 70
2357G0r8l4J20k7J1j06J74j43l%n6M1O0n0L1j2k1K5J04n7j21P5j9L2O0q6J30j42
$$ 70 -28 -62 58 31 42 -64 110 -33 -36 -36 -92 -51 9 -41 -10 -22 -43 -18 86 29 -92 -17 -36 -4 56 -30 100 -42
2385d2J05j1l7Q8n4j03l3P6j8l0J61j19k1Q2nL5j12p0L7P8n6l2j8J15n0P0k2K9
$$ -42 63 52 15 103 49 -54 -87 -11 -29 -59 102 -17 -38 44 39 74 -38 -108 -71 7 -49 -81 -99 16 -34 36 14 43
2413D3j31J4J7K5K3L6o8J00p2P6o2j2l2O3l5L0K8k9L4n4K6k2Q7j57O8o4Q8m1J2
$$ 43 -88 -74 -57 -32 -9 27 -41 59 -13 63 1 -11 -43 20 -15 15 43 14 48 -6 20 -2 85 -72 -4 -68 20 -21 -9
2442ij0J2N7j11N7L8K7p0k1L9m1K8q8J38j9r6J3J37n2rq4Q2p6M9l2L8M9n0L3J
$$ -9 -19 -7 50 -61 -4 34 61 -9 -30 9 -32 -4 -92 46 27 -69 -56 81 29 20 -64 18 -58 -9 -41 -3 46 -4 29 30
2472C0k6NP8mr7j9qJ23j3k1l9l4qJ04j14R9j80J51p1Lm2JJ70q2J7m8P5r2P0M0
$$ 30 4 9 87 83 -14 -33 -41 82 69 48 9 -25 -33 71 -43 56 -124 27 -44 -41 -83 -82 88 6 23 -25 50 -42 28 68
2502F8j10K11j47q4N3K3KPk3J25j09n9L5PN6o1P2k5j05O8j28J74j22k9J36m0p
$$ 68 -42 169 22 -62 -9 14 16 23 0 125 16 -43 -8 -1 55 -6 66 41 -64 4 -124 50 -72 -101 35 -5 -12
2529a2M7L4j6J0j68J43M5j72J15K9l9r2Q4l0N8p6L8Ml4K2j19J09K6n4J08n3nj14
$$ -12 35 69 53 63 -105 38 83 -89 26 55 16 -76 8 -22 36 -40 -2 2 -32 -10 -129 -20 6 -48 60 7 2 -112
2557a12O8M2j0L1m4JO2q9kj9N8m6K7n9L7J74j87K2k3J26m9Q5j77J02J26k08J86
$$ -112 -44 -2 -12 19 -25 -24 38 -51 -53 -72 -14 -60 -33 -92 -55 119 -68 -46 -69 57 8 93 -84 18 144 -64 122
2584A22o3j92K25p7j8m4P5m0KM8p5P7n1J69k21P5M6j03J71j14q5N5R3j17J0M1
$$ 122 59 -133 92 15 -3 -47 28 -12 -10 38 -37 40 -11 158 -63 12 58 -45 126 12 -73 -18 75 -42 -32 9
2610IN6o4J04j55LJ34j04jL6Nj09O8oOl2J4k2m0M9Q6j09P0L8k9j8P7K6m1jn5Q8
$$ 9 65 1 105 -50 -47 87 -17 -18 18 23 -86 -18 -24 -18 -50 -36 -58 -98 -49 37 -72 -2 36 7 -11 66 92 51 50 -5 83
2641H3q2M1l0kO4J0o5m3M8l3q5O8J2k1J14p6n8J51j65N7J2j4L4n8l9R9q7pJ35
$$ 83 1 42 12 10 74 84 19 -24 24 -9 -94 -26 -14 -35 79 3 -55 96 -69 -12 0 -14 20 -38 -77 22 -65 -72 63
2670F3j0K2j41Q2l4M9PL7q9j3Q3k6j4L0Ml4M4n8L3o3mJ5r5M4O6J21j63M0O8q2
$$ 63 53 75 -66 16 -18 31 38 75 -14 -27 56 30 16 46 50 16 60 2 35 -28 -32 -17 -112 -68 -2 119 -44 -4 64 -18
2700a8l0m2P0j2N2l5n4P8O8oj23J57j43J8N9L7q3RJ6L4m7RJ7K7o6n4K0J2L4pP0
$$ -18 -48 -90 -20 -32 20 -15 -69 9 77 71 -52 105 -38 -20 39 76 -7 2 18 52 5 14 31 58 -8 -62 -42 -30 4 -3 67
2731F7q5p3Q6L6NL8K0q5N3r4J09k1mM2q5n0J24j27L2J11j53JJ23q4R9q5L7L9q0
$$ 67 -18 -91 -5 31 36 74 94 9 62 -32 77 56 52 94 9 -41 83 -44 -12 99 -54 -53 70 -14 85 0 37 76 -4
2760dP1j59J88q1q3L9M5P2j49O2q7mN3oN1J0j3p2J5R9l8Lk0O1l6J7K5J8j13J4
$$ -4 67 -92 96 15 -68 -29 16 88 -61 1 -86 -90 -37 -43 8 18 5 -67 -52 47 9 12 -8 53 17 34 59 77 -36 -22
2790b2J3j9j3j5RJ06p4j4P5J3n0q2J74m4L2o0n1oL4J8L5j9j29J78j63K4l8J22
$$ -22 -9 -28 -41 -56 -47 59 -15 -29 46 59 9 -73 101 57 89 29 -22 -28 6 24 59 40 -89 89 -74 -50 -88 34
2818C4j20O5P6k3q4O3J14j62qN1J9j03Q2qkn6O0N6N3j18k9M0N9K9r9J09m8j15
$$ 34 -86 -21 55 32 -52 11 125 -37 -45 6 25 -78 4 -4 -6 -62 -2 54 107 -11 -40 0 59 88 -11 98 50 -65
2846f5J12k9L0n6O6q5J4N5k9l2K8l1N3n5j3N4L7Ll9k2L1p0L8mJ6K5n1M2q7O6L7
$$ -65 47 18 48 -8 58 -27 -13 42 13 -19 9 -22 31 -24 -37 17 54 57 18 -4 27 -43 -5 -9 7 32 -19 23 -64 2 39
2877C9N5l8k6l4pR9j9o7jj07N5j7J78o9n7qj0K4J21o7p3K7K6j25J63l3P1j17Q
$$ 39 94 56 30 -4 -11 88 69 2 1 -106 -51 -68 110 41 -16 -24 -34 -10 111 44 -29 -2 24 -101 62 29 100 -17 -9
2906iP4n9M7m8j5J0j5j4L2%LJ1l2lP2j48J04n1N5j%m0m9J53p4k3J02m6r5J1J37
$$ -9 65 6 53 5 -10 0 -15 -29 3 3 6 17 -15 -18 54 -94 10 -41 14 13 13 -27 -76 77 3 -20 82 36 -59 -48 89
2937H9k53J96l3Rk5N8r3P0L2j66M3R6m2N6M0j14j0L0RN7Jp3krP4Nj05J08p0Rm4
$$ 89 -164 32 -1 8 -17 41 -52 18 50 -116 -73 23 -19 37 77 -37 -47 -17 -8 49 50 -23 -25 -34 40 45 -60 48 -22 -13 -57
2968e7o5J77l2m7K3Q5j03O0q4O5q1O9m8O1K9L3j36l6N4J13q1l9J10o3k5l8J25
$$ -57 -122 55 23 -24 -1 84 -19 41 -43 22 -59 10 -38 23 52 85 -51 -87 -33 80 -1 -40 70 7 -18 -56 69
2995F9K8j26J15j02lKJ1l1Q4j2n5N1j5J0n4nO8j6q1O0j4lR1q6j23R8mK1J66j07
$$ 69 97 -29 86 -16 -19 -17 -6 -37 47 35 -20 31 16 26 -28 -33 35 19 -62 -2 -16 -19 72 -14 -137 -39 -43 -22 144 37
3025C7lq0N8m0L6Ll2p4O2P1O5m5N6j05p3J07m4KM2l6j4P9m0J5j6N1j09K3J06q7
$$ 37 34 -46 12 -28 8 11 -21 -95 -33 38 103 58 114 9 -64 43 -1 1 43 7 -7 72 32 47 31 82 -27 -4 102 15
3055A5J4mo7J5P9jPk3%mk5l4J11j19%R2Lj30J24M3j05J2J19j68j21J62%nM1M0
$$ 15 29 25 -42 -27 52 51 58 35 35 31 6 -28 83 -36 -36 56 59 -71 53 96 -9 3 122 -46 -167 -5 -5 -10 31 71
3085G1J9m1J8r9R8j06P8o4J03q1p7J46q7N8m0P7j12M1P7j71R5K2l8mJ03q0m6J5
$$ 71 90 49 67 -32 66 -40 38 -26 77 -4 -81 65 -22 36 -4 73 -39 2 79 -92 3 25 -13 -17 86 6 -40 -25
3113b5N2m8kM8Ql8m5Q9M8j40P4NJ5l0l9PM5J8J5r8P1j64R2J58o7k8Q1O2j05j27
$$ -25 27 -21 -23 25 33 -5 -50 39 87 -53 21 26 41 11 -28 -21 24 42 57 -41 30 -134 -42 116 49 21 102 164 59 -68
3143f8P0N9n6j4M2rn1o2J18p0j4J86j34L0n5N4jK1j2ml6M0jL9l6m7Lj4R6mq3l3
$$ -68 2 61 5 -9 33 24 -27 -89 29 -41 -55 131 -3 27 -28 26 25 46 34 30 -6 34 33 72 36 -11 -8 -22 74 70 -13 -46
3175d6R1j22J20J5j00K0kN5m4Mq0K5J05L4o0n6O8P4r0J8o3N2J4j2q4Q7k6J9j03
$$ -46 45 -77 43 58 -42 -22 -24 31 -13 -9 -89 -64 41 75 15 -41 27 101 11 29 -34 18 32 20 -64 23 -3 16 -87
3204h7J11j1j25J37K1q0l4P2O6q8q2J89j11j2Pl7M9o7R4l2N7m2J9m8J8M2M9q1
$$ -87 24 13 -112 25 46 -34 -68 4 70 -18 -100 89 -22 -34 -27 -64 -15 -82 12 -20 37 -5 14 -34 -16 26 75 -6
3232fj4N9O7j87kO2Q9r1l7L0nN0Q9q9n8Q0P9o9p2K1N8m3L1L3k5l7j57R8J30j27
$$ -6 -20 39 106 -81 -83 -21 68 -23 -60 -30 -35 15 104 15 -43 37 116 47 -25 -4 54 11 42 75 50 13 -144 -46 84 -43
3262d3J23p2j01J19m2n0J11nj5J9J5j21R6qj02J77j39l4J17J0N7j24nJ80k07%
$$ -43 80 8 -93 26 -16 -66 45 40 25 44 59 -62 34 26 -76 101 -38 -72 45 55 112 -12 -17 163 -44 -44
3288d4J00j2m1oJ6pmM2j4N%m3L3j1N6j50Q7J3j04j0J77p6L2j60J31p9J08m5P5
$$ -44 56 44 3 -3 13 6 2 44 30 35 35 -8 25 14 70 -80 7 20 -84 -94 83 7 39 -121 10 -69 39 -6 69
3317F9M9j78Rj6O0O7m2m2M7n3QK6j14NP2m1J56j4M4j62O5K3q5Q3J7j05O6oQm5
$$ 69 118 -60 -51 -67 -7 60 18 -24 23 -30 -22 4 -110 -105 -33 -74 82 68 112 -50 15 38 -47 36 53 -52 14 8 16 -29
3347b9M8kj9P8Nl2l5q9N9J8l0O7p2K2L0Mn9k9N5m8PJ34n7q2P3rJ3M3j33K7p6J99
$$ -29 19 17 -2 76 81 49 14 -75 -16 2 -28 39 -33 -11 19 23 -36 -65 -10 -58 -51 83 26 -56 17 8 21 64 -69 -42 -118 81
3379H1k0j09M4N2k8k3j3M4j33K5J79k4Jq3O8p4n0j9J24j12L4N5j8r5J56J2m1j20
$$ 81 61 -48 -4 48 20 -3 -16 28 -105 -80 99 75 76 -7 61 -13 -63 -82 42 -70 -36 19 1 -94 62 74 33 -87
3407h7O1n3N2Q0q6O6o0K5kMJ9l9o4J48l6J3k8j1R1r4LL8J0L3j29P8j31J73q2j7
$$ -87 -26 -79 -27 53 -33 33 -27 -2 -4 0 19 -20 -84 64 28 41 13 2 93 -1 2 40 50 83 -46 32 -99 74 -8 -25
3437b5J14r0N2l4k2J27j54mJ11o7o2n2j1J99P8j28J6m6l4J17q6K0Ol0R7o0k1Q5
$$ -25 89 -1 51 17 -5 122 -32 -36 75 8 -54 -106 -117 82 160 32 48 2 -32 85 -1 19 25 -5 92 32 11 96
3465I6l5l0q8J30k6k0M9j65J3Q6lp0k8J00M1l6k7p1K0J4J11Qq9Q7j22L1M9j7j4
$$ 96 61 31 -57 73 47 27 76 -89 -76 10 7 -63 -91 9 50 14 -13 -84 -64 -50 61 69 -20 67 -55 -24 25 8 -6
3494fK2lq4J05o7J03q5R9o1o9L0P3j06J21Jq4lk5N0kj9lPK6qK0m2N1K6j00L0K6
$$ -6 16 13 -71 34 -33 70 -15 84 23 -46 -16 57 -49 72 73 -11 -14 -39 11 9 -10 -13 -6 20 12 32 -10 41 67 -33 -3 23
3526B3K5n3n4O4K4n3J0j02Q9R5nr6Q0o9M0n8K9L0P8j22L1Lm5N7K2Q5j07J26p7
$$ 23 48 -5 -59 5 29 -24 -14 -116 -27 68 63 -33 47 -22 18 -40 -11 19 97 -25 6 9 -36 21 43 128 21 147 70
3555G0j52J31K6n1j6j4O1j37Q4l2pR9j9p8R0l5l2J41r8j8K1N0j01M5j9o3L2O9
$$ 70 -82 49 75 24 8 -6 55 -82 2 -30 -37 62 43 -35 55 20 -12 129 31 13 34 84 -17 28 9 -54 -22 47
3583D7r1Q6p4j2L6N1k6N5q9K6l9M8J4p6J51q2o6P5m5P0n3qN5p1K4k8M0Q5j43R7
$$ 47 -44 42 -32 -44 -8 43 17 72 -17 9 -30 18 32 -44 107 25 -41 34 -11 59 6 -2 53 -18 6 -22 18 103 -40 57
3613E7o4N%q4J25J7j50L0R3k9L2J5r0K0MJ76r6j33K5LJ1P0P1m6o0K9o8Q6N0o5
$$ 57 -7 -2 -2 -86 39 56 -94 -64 29 0 32 47 -43 -23 -19 157 61 -72 -47 -44 -33 37 108 62 2 31 -37 49 99 34
3643C4j24J20Rk2o2P8J23j77J23k46M3J35J9j48P3J00OoK8lj78Q1M2r3K4M8m2
$$ 34 -90 30 39 17 -45 33 156 -21 102 -144 -101 34 53 -95 -22 78 84 78 106 103 -75 6 48 -45 -21 27 -15
3670a5J2j1L7j6R1j01m6K7R4j28R6K7j00J14n2L1j77J98q2m0Q5j54J83j52P8p9
$$ -15 -3 -14 23 7 98 -3 -49 -22 72 -56 40 67 -33 81 29 60 -117 81 -1 -41 44 -110 73 -79 -1 -80
3696h0N9n2R6q3nP3J17j24OJ0N1r8j6J26o7J0n5P0q9m1J04Mn2M9n4ML4P9j42P8
$$ -80 -21 -73 23 -60 -65 8 125 1 7 17 68 -30 -46 80 13 23 -32 38 -51 -92 12 16 -36 13 -41 -37 -3 76 -66 12
3726A2k9N3l9k7O7J5N2j43k2O1n4J3MO7k9k0nQ0o8K0n7R3o8N4n0L7Oq8k5J10J5
$$ 12 -17 36 -3 -30 37 52 104 -39 -61 0 -54 -41 -37 30 1 -19 -24 56 -12 8 -49 44 -24 30 -20 17 23 -65 -90 20 35
3757C5K3m9m7P9m2k5O1J6r9j0l5K88k75J52N2j20K3p1M0j5P0j30J30j05lN0p0
$$ 35 58 9 -38 41 -1 -26 35 51 -48 -58 -93 195 -80 72 124 4 27 -44 -4 -19 51 -79 51 -54 -57 -7 -77
3784g7K3J14j11L5P5l1mj2m8O0j02J16N0m8K9j53Q7J3jM2L9j6p9K3n2O3N2j69
$$ -77 -54 60 -51 -16 59 28 24 12 -36 24 -78 38 88 40 69 -84 3 16 15 57 96 80 1 24 -28 35 87 -82
3812h2J16o9L2p7M0K2L6K3L5j35K0l0J24o7M8J26j19l8q8J49j68P5J8O9J3j15
$$ -82 34 -35 -3 -80 -40 -18 18 41 76 -59 -39 -69 55 -12 36 162 43 5 -83 66 -102 -27 -9 60 73 -42
3838d2M5m5O1L5Lm0n4J38q2l5j1JK5M6kn2lkm3Q3k8J3N6m5j04J06p3p1J68j2k8
$$ -42 3 -42 19 54 57 17 -37 101 19 -16 -27 -26 -1 45 43 -9 -12 -14 -57 26 -2 11 67 22 -82 24 -49 -120 48 36 8
3869Hj22J64p4L5K1Jj4o9Q5k8o7O1Lp3Q4M3j90P8M7J06p6r7Q6j6j9o8P7j21L0
$$ 8 -114 50 -24 11 32 33 19 -50 35 7 -60 1 4 -69 15 58 -132 -54 -7 99 23 -74 12 -4 -23 -91 -14 -135 -105
3898a05J44p7J05n5Qq0J21q9J0j6J3N0m8N1j02K8M6RL6j14O1N0j3q5J40o5%o4
$$ -105 39 -38 67 12 20 -60 61 -28 -18 -34 -21 29 -19 32 -70 -42 4 13 49 -65 -4 46 33 -52 88 23 23 -41
3926d1p5J16J9R8j46m9N5L7M4Om0o6m3lJ33j27J15L3l2n1O5j9j04K9K8M8o8J73
$$ -41 -116 0 19 117 -29 -78 -23 14 58 64 24 -42 -85 -88 45 -82 33 66 34 -17 48 29 -75 -46 -18 30 -38 135
3954A35j52jQ0p8k7M4j10J37n9J7M2o4M3N9q5l2J00R7j85r3J61p3N9r6J18K1j05
$$ 135 -17 -18 62 -16 -43 1 -109 28 -31 -14 28 -36 7 66 -19 -51 49 146 -39 -132 29 -44 15 -81 37 58 -47
3981d7J5J7j11J71l7o3M0l4P4n0j4K1R8j65J7J25q9Q9q9Q1L7k1ql8L9M4j20J29
$$ -47 -32 -15 -126 45 8 -55 -15 -49 25 -25 -39 -18 80 -85 -68 57 -32 57 -32 49 86 65 57 19 58 102 -18 111
4009A11o6m6k9K6J9J6p9k3J07q2P9j8p6L3oJ02q6O8J2l6l9j2%P5q0N6n4J3l3J6
$$ 111 45 -1 -30 -4 15 31 -48 -71 36 -46 33 15 -61 -28 -34 68 -18 50 62 26 -13 -25 -25 50 -30 26 -28 -15 -48 -32
4039c2K3m6QJ29l7q2J35o4k6k8L9J31j11q3J16j14n9k4R0M4n0j1J21j22M8O4p2
$$ -32 -9 -55 -47 82 45 -37 98 34 8 -20 19 150 39 -44 72 -42 -101 -125 -35 9 -41 -52 69 -53 -5 59 -13
4066a3n3%J39l2m8P1L3o0j19J17l7K4lNl0J40l9j50P6l1Q9q4j6R5q2K1K8QK6q0
$$ -13 -66 -66 73 41 -7 64 97 37 -82 35 -2 22 19 24 -6 134 95 -55 21 -10 79 -5 -21 74 -8 13 41 49 75 -5
4096eJ04j48O4p8L2M8l6J5jO5r1R6M2r7Rrq9P0ql9J9L3K0N0k2l4O9N7m6m9j34
$$ -5 99 -49 15 -63 -31 17 -19 -4 -5 60 -31 65 107 10 19 10 -79 -9 -17 -56 -37 -4 16 66 44 10 79 136 90 41 -93
4127i3P9M4M2j13J27q5n4R4l9n1k9Q6L6j6r0M6p9M9M1j2o8L8lp3J19l6KN0N7q4
$$ -93 -14 30 72 -41 86 1 -53 41 2 -49 -78 8 44 28 -62 -16 -95 -46 -5 -17 -85 -47 -50 -123 -4 -40 -38 12 69 -15
4157a5j7J4l0M3l%N0m5ojmQ5j73J10k5K0k7l4R7k6Oo1Q2o4oN1lR5o2j7o3Kj1n3
$$ -15 -32 -18 -48 -5 -8 -8 42 -3 -9 -10 -14 71 -102 8 -17 3 -24 -58 39 13 19 -42 40 -24 -30 21 18 113 51 34 -29 -27 -38 -91
4191i1L8k6Q7K6m9J5Pj7M6l4P4j30NJ05j52j4Q3lP2j28J09jK0j09J24K3p2l1l7
$$ -91 -53 -79 8 34 -15 0 7 -10 36 2 76 -54 -49 56 -96 -110 -27 -30 42 -86 23 22 42 -67 57 80 8 -23 -60
4220f0R8n5L4o1M2l9N3k7LL6l9M6j2j9pj4J9L6q6J3j2pJ09m6j0l3o6L6j1O1l6
$$ -60 38 -17 17 -44 -2 -41 12 -15 -12 24 -15 31 19 0 -7 -21 -2 34 -52 -39 -51 -58 51 5 -5 -38 -104 -68 -79 -18 -54
4251e4K9M8o1P4nl6j04J58r0O5l4N7p7Lm6L4N6j74K5J18K3j7qn2k4J34n9j08Q1
$$ -54 -25 23 -38 36 31 -5 -109 49 -41 24 -10 47 -30 -27 -73 -39 17 -157 -132 -14 9 -8 -16 -68 -92 42 -17 -125 -44
4280d4n0J45k5n5M1l3J05j26P9l4nQj7O5M0n2n3j19J17O7r8N9q5N1J20j28L6L3
$$ -44 -94 51 26 -29 12 -21 84 -42 37 3 -2 6 -11 54 94 42 -11 -130 -13 54 -44 15 -70 -19 101 -27 9 42
4308D2j26P6j4K6N9l9k5rj4JRK4kM3n6n4J00j37P8l3R1Mm8K7k0M5Kj4j42J41l4
$$ 42 -84 -8 -22 4 63 24 -1 -10 -24 -23 -14 10 8 51 -5 -59 41 -96 -18 -51 40 44 -4 23 3 48 50 36 -106 35 1
4339AK3R6j91Q1M0n7R0m7l3l5O5mJr5o1Q4M8nmj6j5M1n7J03J27j65M3M0r6L0o2
$$ 1 24 120 -71 10 50 -7 83 36 3 -32 33 29 30 -65 -126 -42 6 1 -3 -19 -34 7 -50 53 180 15 58 98 2 32 -30
4370c0P1q3mL3NK5L6m6q4O7L4r4P4O6qj57J22j0l7m8N8K8k3l7Q3k9l5j01Q7L7
$$ -30 41 -42 -46 -13 -8 17 53 7 -77 -10 24 -70 4 70 62 -95 27 17 -20 -68 -10 18 -5 -42 41 12 -23 -124 -37 0
4400@o3R3Kl3q9Q7j5N1oJj01J24j08K1M2m6k8O9N1j8q8M3J7j7M6p4P2J4O7r8K7
$$ 0 -63 30 32 -1 -90 -3 -18 33 27 28 -73 51 -57 -36 6 -40 -68 1 52 34 -54 -11 6 -11 35 -39 33 47 114 16 43
4431D3j13J63j7p2L2k6R2p8k2J2Nr2RL2j08Q0R7l0j22O4pN3J25j22mJ11j47K9
$$ 43 -70 93 76 4 36 10 102 24 2 14 19 -73 -64 -32 -140 -60 37 7 -115 -51 -58 -5 120 -2 -6 105 -42 -13
4459a3KL8n1rL2Ok4l1J00k2Mr4K6k8N7N8j06Q9Q7j12m6K0M4j02O7J6O3j06l2J20
$$ -13 -11 27 -24 -33 -1 5 -19 -50 50 28 32 -62 -36 -64 -7 51 -55 34 121 9 -37 -17 27 -75 -8 8 71 -35 -67 53
4489E3j19J27m2l3Rjk7R8o1j5J20j49J59j36J35n3j04Q9j60O4Q8Q3r5p0rJ24j8
$$ 53 -66 61 19 -14 -5 -6 -33 65 4 -11 109 -40 119 -17 118 65 -39 50 -110 -46 42 125 30 -40 -49 75 57
4516E7M4n8j06rMM2P1m2l0K1J7Q0J7q1l3M2L6j34P3lM3kj05%L9k8N5M5n3o6J03
$$ 57 101 43 -63 -72 -68 -26 45 3 -27 -6 11 91 108 27 -6 36 72 -62 11 8 51 49 -56 -56 -17 -45 10 55 2 -64 39
4547C9M5p5j0Q8n9l7P8j05O5M1r2j6J6P4p4M4m2N0k5k3J9l3m4J40p9n8L2KQ6J9
$$ 39 84 9 -1 87 28 -9 69 -36 29 70 -22 -38 -22 52 -22 22 -20 30 5 -18 1 -32 -76 64 -15 -73 -41 -39 47 66
4577F6j04j0M2O0j4m1j1K4n9J39l5j03P5j02Q1QLL9m6K6j01O0K3o2n2N6J49r8
$$ 66 -38 -48 -6 54 40 -1 -12 12 -47 92 57 -46 29 -73 8 16 19 58 12 38 -63 -3 20 -42 -94 -38 111 13
4605A3j14J16oJ4J2n6O9j6o8N2l1L8l9j4M1q3J00J1K6o3K6K0o4L9L1l6J1Q6j20
$$ 13 -101 15 9 23 35 -21 48 32 -36 16 -15 23 -16 -30 11 -72 28 39 65 2 28 48 -16 23 54 18 29 115 -5
4634eQ0l9K9k0rn9j0J00Rn7j47J10R6r4M6n4O9N2j03N0m6mN6j4n9O7j08O9m3L2
$$ -5 75 36 65 45 36 -23 -33 67 76 19 -128 -18 78 -16 30 -24 45 97 -6 44 -2 -6 50 36 -23 44 -64 5 -38 -6
4664fN8j55O1J75j6j18pR7r1j07J35j01K9J71j16k8R5j41R0p9L0J00j8j27MN2
$$ -6 52 -103 -42 133 117 -1 -8 89 -2 -109 26 -75 -46 125 9 -19 76 -65 25 -54 -24 76 58 -69 -65 -13
4690a3J2k5M0K8N6k01J44j5j6l9N3l0n9L6J6j3l4N7o6O6P4o2M1m2n3J3nO3n5O7
$$ -13 -1 -26 14 42 98 -103 41 26 10 -29 24 -6 -65 -29 -13 -26 -60 -3 -69 -3 71 9 50 8 -45 -32 -37 26 -29 38
4720C8n4No1N9N5J0r7N0l8j49J61O2p0j0P7pk6K7k2Q2p5p6l2R8N4q0Q3q6J05j8
$$ 38 -16 -11 -72 -13 42 52 -45 5 -33 -182 -21 41 -29 -39 38 31 5 32 10 92 17 -59 -91 7 61 -19 64 -22 83 65
4750F5n5j4M6k1m0J33Qq1l8l3j3j7N5M8n5k1J7P0o6kq6J03P7n7ol4j6qJ07p1j21
$$ 65 10 -4 42 21 -19 114 122 41 3 -30 -43 -60 -5 43 -12 -33 -16 54 -12 -14 -100 3 80 23 17 -17 -33 -41 66 -5 -126
4781a26J48j3k7J6K7p8L4L2N6l3q8J91j18ln6R0j83J91m2N9p1J00j31L4p7Q3j8
$$ -126 22 9 -18 -2 25 -53 -19 13 69 36 -52 139 21 18 -38 52 -131 60 18 77 6 106 -25 9 -68 15 -3
4808cl9L3l8J79j55j3J45o7j11J43j21l4R8k4j9Q5r8K7M9j11J19m2j41J26k5R5
$$ -3 -42 -9 -47 132 -23 -36 109 42 -69 74 -47 -81 17 -7 -26 59 -39 -12 37 -74 45 3 -138 -12 -37 58
4834E8o0Q5m2m1r1J28J5q7J01j4k0m7l8k5P4rk7J01j09l6L2J09K6j36J45j9j31
$$ 58 -2 83 41 0 -91 37 52 -35 66 52 32 -15 -53 -78 -4 -13 -40 61 -48 -84 -52 57 83 -53 92 73 -58
4861e8Q3M7k8j9n4j0M4J0K9k9J2qq0J21R9j28q8R3l9M0k0om1rL0L2k1p1jN9l1
$$ -58 25 72 44 25 -29 -39 5 15 44 15 27 19 -61 60 159 31 -57 36 -3 37 17 11 -30 -39 -9 23 2 -69 -70 -11 -42
4892d2P1m1N6m1J2j05R7N1o3N9l7OJO5j10M9o8j0P8q4M2R3l6n3m9J49q2p1K07
$$ -42 29 -12 44 3 15 -90 7 58 -5 54 17 23 24 89 -21 28 -40 -50 28 -56 -14 79 43 -10 -59 90 8 -63 144
4921A44p0n1k9j3J14o7l6j5K4r1O0ln2J05j6%k9m4J05qm9p4J21j03J0J50r7K4
$$ 144 74 23 -6 -19 95 28 -8 -23 1 -90 -30 -33 -85 20 4 4 -25 -69 36 28 -21 -95 26 -77 -67 83 -14 10
4949A0NKJ5mKj17J17jpJ43j55NK0j11L6O2q3J34m6p7j7P3k3K3m7P7j05nQ1N7m5
$$ 10 15 17 32 28 30 -87 30 29 22 165 10 15 35 -76 -40 22 -61 73 27 -50 -67 6 -17 6 -41 36 -69 -74 7 64 19
4980A9N6j53JQ3Or8M6J20r3n3Q2M0j4J5j02R3j60Q8R0mN3r2l5J4L7k8J6Rk4L0
$$ 19 75 -78 -77 6 12 -86 -40 80 -13 -66 16 56 42 57 -45 48 -112 -24 66 62 115 23 -12 2 39 11 27 36 12 42
5010D2p1O3k4L2l5j9m8R0o7L2KqQJ2o5J7O5j2L4L9q4J4K4j04N4J1Pn1J0P2p0J23
$$ 42 -29 34 10 42 7 -12 -60 30 -37 -5 -3 -11 -3 9 -56 -39 26 14 48 87 3 17 41 -63 -9 2 9 -42 -32 40 -30 93
5042I3L3j34L4rl9R1k6j6N2j30K7m9O1rM2nK4j17Q9j3j0l2P6k3q7kN6l7P1k4N7
$$ 93 126 -8 26 17 -22 69 43 27 79 -51 -24 -73 -12 -21 21 16 40 -77 12 -1 -11 -43 33 10 -77 -79 -23 -60 11 -13 44
5073D4j01M8J6J30j57Q9J0j23J32l4k1n7K1LM9R4j42pJ08q0r2K9P6n2M5M0j57
$$ 44 -57 -9 7 137 -20 69 79 -44 88 54 33 -24 -3 0 49 143 1 -6 102 22 -70 -41 35 -17 28 68 -89
5100h9P8L7m3L9k4Nj02R8qJ01p7m7j4M8p5J07n4M8q2J33k7j41Q8p0N7R1p5M6q4
$$ -89 -11 26 -17 22 -2 3 -99 -1 -9 92 15 -32 -46 2 -73 34 -20 28 -54 79 52 -89 -1 -71 -14 77 2 48 -36
5129c6R6N1q8l7l1J1J33j22J5n6O2P8k3p0L5J4m0M6p4LJ6om2M3Q3l4K4ppK9j48
$$ -36 60 111 23 -14 -45 -34 99 -23 -8 -64 -2 76 53 -17 18 32 -8 38 -36 -33 -17 -23 -65 -22 61 27 51 44 37 66 -82
5160h2M5L0L6j9j0K6j0j5j17J53j30O8J13p7kNo3N6Nl0k4N5L9m3k3n7O6l4P6n2
$$ -82 -37 -7 29 10 0 26 16 1 -116 37 -93 -25 88 11 9 14 -49 7 12 -18 -42 13 52 9 -14 -71 -5 -39 37 -15
5190a5m1P1K7j14j6R6r2R8j5o1K14j89J59p0k7o8M2J9J2k1L9jj4j8L6o2N8o6O
$$ -15 -56 15 42 -72 -88 8 -84 14 -1 -62 152 -37 122 52 25 -43 -1 18 30 9 48 47 33 15 51 -11 47 -19 -13
5219a3K7m5Jn9M6J02j04P9q9J19m9l1J5q7J18m3k9P9k8j6qRRm7P6K0n6N3j1o1
$$ -13 14 -31 -30 -89 -43 59 -45 34 -55 64 15 -16 -1 -88 30 -13 -42 37 9 -7 -15 -6 3 -44 32 52 -4 49 38 -23
5249b3J0n0O4k6R6j18j5K5k6O4j8j5N3j25O0J95j63ol5J21r8J34k05J74j30L4
$$ -23 -13 -63 1 -25 71 -47 -62 -37 -63 1 -17 -32 21 -104 -44 151 -12 -18 -53 68 -30 104 -101 73 -57 -23
5275b3o7Q9j8r8J59p6J1j8J05K1r3K2P0l5k4Op8O6n2l8J22k0J3j8P4j52OQj8J42
$$ -23 -90 -1 -19 -117 42 -34 -23 -41 64 85 -8 14 84 49 25 31 -47 19 -33 -71 51 31 44 26 100 -52 -46 -38 -56 86
5305H6on1m4O7o6L2p6K4Q0j17R1j7j18J22n0L0O2pO6j03Q0o1p4K7J6n4pM4N8M8
$$ 86 80 29 -15 52 -14 18 -58 -34 46 -71 20 3 -115 7 -43 -13 49 42 108 5 85 24 -50 -23 -7 -61 -68 -24 34 82
5335H2r2P8j45NJ80l4j8j9l4m5J70Lj64N1M1j08L8K7k3j04M0R3r2O1j04J43M9
$$ 82 -10 68 -77 -72 108 74 56 37 3 -42 128 131 -33 18 59 -49 -11 16 -7 -111 -71 22 -70 -9 -113 30 79
5362G9j2j17Q6n2OJ5Q6p1j1m4Q9n6r1J00m1O1k1M9l5n8%L2J9O5r3R0j26N9Pjp8
$$ 79 67 -50 36 -16 -10 5 91 20 9 -35 54 -2 -93 7 -34 27 6 55 20 -38 -38 -6 13 78 -15 75 -51 8 15 14 -64
5393f4R8L7j33J60l8L3r6l1R0j44M3P4j3M8Kj48Q6j3K5PJ14j21k1J3J27K1j22
$$ -64 34 71 -62 98 60 93 -3 -34 56 -88 -45 29 16 64 66 -82 4 -9 16 23 137 16 -5 8 135 156 34
5420C4n0L9n0J70j69j6L9ok8O4k2k6j9j9NO2j16O8O3o6R4j08N7KN0l2L9Lj24Q3
$$ 34 -16 23 -27 143 -26 -42 -3 -9 -37 27 5 -21 -40 -59 -54 8 -108 -40 23 -43 51 -57 0 2 52 20 59 62 -62 21
5450B1r6M0J26o2m6L7l7Q7k8mr4O6K7pk7ml5J39j06q2P4L1N5j6j32M5N1j2L5p6
$$ 21 -75 -35 91 29 -17 20 -17 70 42 38 -56 10 37 30 3 -1 -36 103 -3 -85 -11 20 75 59 -73 -28 23 11 46 -30
5480c0L8N1K7j86M4R0q8M4m2J19j05M8m8N1N0m3m6j3Q6o0%Q2rm0J4J1p0k7Q1j97
$$ -30 8 59 86 -100 -56 34 -54 -10 -52 67 -38 10 -38 13 63 20 -26 -39 47 -13 -13 69 60 20 34 45 -25 -52 29 -168
5510a68K4J56k8LM0j3P6j01N6q9K0J36j99O4N4l3M5o3K2p2M0L4L8j9O3j41MJ47
$$ -168 -144 12 -16 -13 27 14 90 -11 45 -44 -24 112 -87 -23 31 -2 43 -20 2 -70 -30 4 42 23 86 -55 -51 96
5538I6p8qk5L1L3j0OJ0j0o9K2K7q3J62j20Qo5J20j33R2q3Q1M6r0o7J18l8J6M1
$$ 96 18 10 -15 16 49 39 45 55 45 -24 -2 25 -58 104 -16 -8 -73 47 -86 6 -77 4 50 -40 -107 11 -27 -11 30
5567C0l1N7l5q5R1m0M1m7j0K7J1j03M2J43j04N0k9j3p9J90j06m6R6r0Q1Om4mP5
$$ 30 -1 56 21 -64 27 -13 28 -19 -29 -2 9 -94 -52 91 -13 37 8 -5 -84 106 0 -46 50 -40 41 47 3 -1 74
5596G4k7l4k6P5j99J79J9jj28P0K9N4m4q6M3n1K3oO9rM7k6k7q7J36p2Rj0J6J0
$$ 74 47 13 -13 62 -137 42 61 60 -68 2 31 85 41 -45 -2 -53 -30 -36 33 24 71 45 18 -69 67 -5 4 -6 10 20
5626B0l3NJ8o9O0Q6o5p0R3j35J24k4r5J46r2pK0L4m0N8p0R4o5m9N2jRk3NJ01o4
$$ 20 -13 -8 10 -59 1 87 22 -48 45 -90 34 10 -85 61 -31 -38 -18 16 -24 34 -36 58 -7 -56 -4 -5 4 -19 -14 87 23
5657B3O6j20PL3m7r0J01J5j3N5q9J33o3Q5j22oN9j0J00j20Mj4O3o8nJ08q5NJ9
$$ 23 89 -31 -24 9 -38 -128 -27 -12 -25 30 -59 74 11 96 -26 -32 27 17 117 -3 1 -13 50 -18 -23 85 0 5 24
5686B4o4N0Q7j08M0p3Q2J8j07N8p2J77j60M5m4J16K1l5j05K9jP2p1O5l6o1N8l1
$$ 24 -40 10 97 -11 29 -44 38 56 -51 7 -65 112 -48 -3 -47 69 90 55 -50 -21 -22 50 -21 44 8 -53 5 -26
5714b6Q1k4K4K0m7j13L7M4q1K9N8n9R3j28R5j03K5J37r3oM7rR6j22J7P6k3j95
$$ -26 55 31 55 75 28 -85 -48 -4 -85 -56 2 -57 36 -92 3 -100 -75 62 -31 -37 10 1 97 -25 -8 68 45 -150
5742a50J37N1n0K5j1O8j1m6j18R1n9J46r3P9o5P8m0q2qN6J02j80PkN5k7p5M9J60
$$ -150 -13 38 -12 13 2 70 59 13 -105 -14 -73 73 -20 59 -6 72 32 -50 -58 -2 100 -80 -73 -75 -20 -47 -122 -73 87
5771H7j36N8%k9ml5k2K4QJ91r1l4L3m3lk4J34n5L8j57J43q5J3L5j81M9L2J18K4
$$ 87 -49 9 9 -20 -24 -59 -81 -57 -49 142 51 17 50 7 4 -20 114 59 97 -60 83 -2 11 46 -135 -86 -54 64 88
5800H8j2j36J68l5q9r7Q9k1N1n1R6j28%M6ml5J38o2m0J0j05J39l0M4k7P6o4l7
$$ 88 76 -60 108 73 -16 -113 -24 -45 6 -45 51 -77 -77 -31 -35 -70 68 6 -34 -24 -129 10 -20 24 -3 73 9 -28
5828b8L0Qj02Q8M8p1QpL0k1l8L3k3J0O4K4j08J04m1m9N4M5o1M9o2j2Mk2N5L5q8
$$ -28 2 10 -92 -4 44 -27 -19 -26 4 -17 -55 -22 -45 -35 29 53 -55 49 8 -41 13 58 -3 46 -16 -28 -24 -46 9 44 -44
5859d4O0L0m0Oj02J75n7Rjl4n6L1%Q1k13K01r7o4J39p5N6M9k1J8Lk1j02J44j7
$$ -44 16 46 6 12 -90 85 28 37 36 2 -54 -23 -23 58 -155 46 -51 -115 24 -51 5 54 33 51 54 33 -69 75 58
5888E8o1J1k5n4N7O0j05R9o3j7kp6O4K3N9j84J55L0k7K8m0k3m2N8O4j2k6P0j53
$$ 58 -3 8 -17 -71 -14 46 -59 40 -23 -40 -42 -118 -54 -31 28 -156 -1 29 2 30 -10 -33 -75 -17 47 35 9 79 -74
5917g4N0Q1j28J43p3l1O4r0R3q2kk1K2J0J0j6J19J4j09m1R7p1l4k4J11m0K4p4
$$ -74 -24 57 -71 72 -1 -32 32 -58 35 -47 -49 -70 -48 -38 -28 -44 75 89 -20 -61 36 -35 -69 -93 18 -22 2 -72
5945g2L9K1K7r5j0L7N1j4Lj11Q7N6k2Oo5J0kJ61q5l7O4m3k3n0j1K0Q8j6MM5p5
$$ -72 -33 -12 15 -80 -90 -53 -2 -16 -13 -124 -37 19 -3 3 -62 -52 -54 107 22 -15 49 6 -17 -67 -78 -58 30 14 18 63 -12
5976a2J5J12j49l8M2M8mj0N2j12N0M3n8jK0M9l5N4L3m7p9J19p3Q7p3q5J14j37
$$ -12 3 115 -34 -72 -30 18 14 4 56 -56 -6 37 -21 -22 -2 47 12 66 99 52 -27 92 19 106 33 -52 62 -75
6004g5j6Q7k2J3M6N2kj48p6J03P6o6m1J14n1k4M2n0R2j36J55j50J19rn2o4J37
$$ -75 -91 -4 -26 -13 33 85 83 -65 -141 -38 38 -28 -69 45 -6 -30 12 -38 54 -82 73 -77 42 33 -19 -83 54
6031E4jj9q4L8l3J7R4p9kO1j00P5l6J6M5K0q6K2L0q3Q0L7r5PPLrQn1J9j8L2P0
$$ 54 53 34 -50 -12 -45 -28 66 -13 -15 46 -54 21 -15 1 46 66 -20 2 32 -51 29 66 -29 -22 -15 -12 -21 -13 -64 -45 -63 -31 39
6064C9l5p6K3J64j21ol1Mm9KQ7K6n3L6Kjk5M9j5k0j11J95p2L3pL5j91J77q5N1
$$ 39 4 -72 -49 115 -6 -12 -43 -39 -88 -86 1 27 -26 10 12 11 -14 35 20 0 -111 84 12 45 38 73 -118 59 -26 25
6094B5n1M4P0j38N8N1j40J29o3mM0l9J01j12lM5l0N8o1J0Q1r6J09j63P4N5l2q5
$$ 25 -26 18 88 -50 8 59 -81 48 -15 -19 21 -18 83 -29 -32 13 -17 41 -20 -10 71 -25 84 -79 -5 50 18 -67
6122f7J51l9o1qj4k7NM1k0N5O2q6Q9j39J1J11j26P3J4M2j63O6J03j42J01K8k6
$$ -67 84 45 -16 -24 -38 -65 -60 -19 -39 16 78 -8 81 -58 -47 64 -62 11 25 67 -96 -30 73 -69 32 60 34
6149C4p9L1J3P3k29J84L3q4OL5n8R8o9j8L2l2P9q5K1K1m2L4M4n4j9K8N5Oo6m8
$$ 34 -45 -14 -1 72 -157 27 60 -24 -18 17 -41 57 -12 -30 2 -30 49 -36 -15 6 -36 -2 42 -12 -31 -3 52 58 -8 -56
6179e6K6M9o5R6q0k5LL9n7M0j5m4o1J86j16L5Q5k6l5M1j4k0L6j4J8j37J44j0l1
$$ -56 -30 19 -46 50 -30 -55 -52 -13 -70 -30 -45 -89 -150 36 -80 -45 40 14 -21 20 6 -14 22 8 26 -111 33 23 -8
6208hj8K9rJ2O8j25J5O6o6l3L6j0K3N5q2n2J43l3J9j48M3P4j0K3k7MQ0j26l9R
$$ -8 -26 3 -6 6 74 -51 -36 30 -36 -69 -33 -43 -20 35 -47 -99 44 11 30 -118 -75 -1 -11 12 -15 -11 69 -57 -96 -87
6238h7R0L0K3j1k5o8q2J24pJ01k0Pn5o3M8L1J2r6Q9n7OJ63r4p9Q0J9j24J8K5O8
$$ -87 3 33 56 45 20 -48 -130 -6 -13 88 68 75 20 -43 5 36 48 -48 41 -16 -10 153 59 -20 60 79 -45 -27 -2 66
6268F6pr6J15m2%r6N0K6J13k24Q5L1Kp0oK4j2n2L5J13Mk5J8Ln2m6J78j69P6ml4
$$ 66 59 -37 78 36 36 -60 -10 16 129 -95 -10 21 23 -47 -53 -29 -41 -93 -58 55 59 34 52 55 3 -43 135 -34 42 38 4
6299Dn9J00j47N7R8p1j08J14J02j29m9P7K4QM3j30q1K10l1p5N6O9M7j45N0p7J18
$$ 4 -55 45 -102 -45 53 -18 -126 -12 90 -39 -88 -11 13 21 64 -66 -147 63 32 -43 13 82 129 -16 34 -43 75
6326G5l7j6l8M3J01q3%j10J00rn9J3K2P8J0k6n2o3Q1j14J64m2j68J58k9kP8j17
$$ 75 38 22 -16 27 128 45 45 -65 35 26 -33 -20 2 80 90 64 12 -51 30 -84 80 38 -130 28 -1 -3 75 -42
6354d2R7m9N7l8k5Q3p2KLn8j8L9L9Po0Q4M2O4j14k1L9j27J19l5J3r0L4j4R6p3
$$ -42 55 6 63 25 0 83 11 13 16 -42 -60 -21 18 25 -35 49 91 155 41 20 59 -68 51 16 29 -61 -27 -41 55 -18
6384a8M2J6n3m9n0J29n1J66j30Q6j00P9k9p6P1L0l4j4n1P6k5k6M5PK6j4j0L1o7
$$ -18 24 40 -13 -62 -112 17 -34 132 2 88 -12 67 38 -38 33 63 29 15 -36 40 15 -11 34 41 67 53 43 74 7
6413GP6q6M2q1L8P1n5Nj6O6j28K0m5O0Rl5J05p6K8q7K41k19J1P7o4J03j44Q0m5
$$ 7 83 -3 39 -42 -4 67 12 17 1 67 -61 -41 -86 -26 -17 -52 53 -23 5 -82 159 -60 -49 28 -36 67 -77 3 -42
6442d2K0K5j9q2Q4O3r0K2M6j14O9Q7JJj37R3j4J6%n9N8nK8rLk6q0M4j10O8K0Q3
$$ -42 -22 3 -16 -98 -14 49 -41 -19 27 -87 -18 69 70 71 -66 27 13 29 29 -30 28 23 51 42 45 19 -61 -17 -127 -59 -39 44
6474D4j2o8ON3l7K7o4M7K2K3Qo3k0M8m6O2j6m7M8l8L8m8J33j41N0J5J16j97R2
$$ 44 32 -36 -30 23 -14 13 -51 -4 18 41 49 -14 -34 14 -32 30 14 -33 15 -23 15 -33 100 -41 9 24 140 -57 35
6503C5q8oK58j27K6j65P4pM7k3j08J29m9mjo1K4l2J60o2j14J43J3k0n3n3J18n4
$$ 35 -53 -59 199 72 98 -67 7 0 47 24 -84 45 -4 -8 -9 -70 -46 -78 82 20 -94 49 62 42 -11 -64 54 0
6531@L8Nj8oP6j47P6L9p4J1oL9Mk2j5l7P6N3j46N8k9J03p7kro3R2k8N4p1J56j14
$$ 0 38 43 25 19 95 -52 24 63 -11 0 -6 33 37 15 0 -37 39 92 -54 4 -25 78 1 -1 -10 -73 19 -9 45 -26 130 16
6563A6l2k5N9L1K3K0l7n6p3N5P1k1Rn2l5L4R3j14nqQ8k0n4K7j0O2k8L6kn8L2o3
$$ 16 -16 -41 18 49 72 92 55 -1 -74 -19 52 31 40 -12 -47 -13 80 -34 -39 -47 41 21 -33 -6 -16 46 18 54 52 -6 26 -37
6595c7N1j05O8l8J58j08k5O5j52J92j25J45o9Q0l1p2P6j85J33Ol3L2j1R5j61J48
$$ -37 14 -91 -23 -61 97 -11 -36 29 -123 69 -56 89 20 100 69 -3 73 -112 21 27 -6 26 15 110 -51 97
6621I7j06o8J63r7Lk5P8K2K2Np9n3N4%o5oN5l6L6m8j0J34j22Nl3P0m6J01rj0j4
$$ 97 -9 -77 86 -11 -8 -33 45 67 89 94 15 -38 16 16 -49 -55 0 -36 0 -48 -58 76 -46 -41 -74 -4 -50 51 42 32 18
6652A8k6m3Q0r2J51r7k5O4pk4p0J31j09Q2N8j9o0L2L5k4r6J1n2J66j00K8k3mJ3
$$ 18 -8 -51 29 -63 88 -9 -34 30 23 -1 -71 60 -49 33 91 72 12 44 79 55 -41 -30 -82 84 -16 12 -11 -15 -2
6681bmLm9K9R0o9O%J8L5r9J13j5j05J9L9J3m1j5J30o3l2n5l1Q6J5l8J23j19QL
$$ -2 -6 -3 -52 -23 67 -2 4 4 22 57 -42 71 56 -49 -30 9 22 -19 -34 96 33 1 -54 -85 1 16 -22 101 -18 -10 -7
6712gn1N6P1j04L6K0j1j10Q5lJ8m0P2O0n4K1o8M5l6j6J17o5qL0m4j8Q5p8O8q0
$$ -7 -58 -2 69 -35 1 21 10 -100 -15 -18 0 -40 32 92 38 59 -9 36 0 -16 101 36 28 58 14 -4 81 3 71 -9
6742iK3K4j2m7L3m6J3M3r6N6m4L5lM1J9L4q3J3k1R8p6Q1n2k3K9q5Q9m2K0N6k5
$$ -9 14 38 26 -21 12 -34 -21 22 -74 -18 -62 -27 -30 11 30 64 -19 -6 -27 71 -5 76 24 1 30 -55 34 -8 12 68 43
6773D3m2o7J13j11J93k29J20QK6l2l0J9kK2Rj9m1N5m7O9mm8PJ7lq8J43m7k3J01
$$ 43 1 -66 47 -64 129 -100 20 28 54 22 -8 11 9 31 40 21 -20 35 -12 57 53 5 12 29 26 -62 81 34 11 112
6803A12r1J7j7O0o4L5j15J04m0j7n5J5j8J62j34k6O6M2o9K8K6L3m3nn2K0K1K9
$$ 112 21 38 21 81 17 52 -63 41 1 -16 -71 -56 -74 88 -46 -72 -6 36 -33 -5 21 54 11 6 -46 -26 -5 24
6831B4k7O0n7L5q7L4l3k0Q3o1J9o2M9Q0l3j7l4Q0m7R3j64P9P4p1m9N3N7m7l1M
$$ 24 -3 57 0 35 -52 -18 -51 -71 12 -49 -30 -92 -43 37 4 -13 -47 33 -14 79 -85 -6 68 -3 -52 1 58 11 -20 -16
6861a6pJ4m8J79k03J5J45j05L9j46R8J19l6l6j6m1m7K6P0K9K8l5rro6P1o2P3m4
$$ -16 -23 -9 -57 122 -81 -66 79 -26 13 -133 -35 84 48 12 -4 -45 -92 -66 4 33 61 26 17 8 -58 13 -49 24 -20
6890b0Mn5m8O3%J19j0kj05J45r6K1M9j32K8L6J13Or3Jj3K7l9J6k2j4k0k6N5r5
$$ -20 -16 -71 -119 -56 -56 63 53 51 -54 91 -5 16 65 -67 -39 -3 110 116 23 24 11 38 -1 15 -7 -21 -41 -67 -12 -107
6920a07O4q4J28J1P9j45P5M4j06J6J09m2o0l6J18r4R8L2r5Q6j6j15K1M1l7j6L0
$$ -107 -43 -127 1 12 91 -54 21 65 -41 -25 84 42 -18 -54 64 -30 68 100 5 91 75 -40 -19 22 -15 -31 -1
6947aP5j4r8L7k3M4M0Lm0o5M9j8Qm6J02m9L2M9n1j25R6M1j01N3l8J5p2RR1J8k3
$$ -1 74 60 -38 -1 -24 20 60 63 23 -42 7 -11 -3 -49 53 4 36 85 34 -91 5 46 -55 -2 -40 -25 -97 -88 3 21 -2
6978bO8j05j8O4p2K4O6n6O4m4j1N9M6q9Jj29J23n1M9P0k8r4RL7N2N7r6J8j34R5
$$ -2 66 -39 -57 7 -65 -41 25 -31 33 -11 -22 37 83 -6 -5 -134 -11 -62 -13 57 29 -65 -56 -19 33 90 -6 12 -122 -27
7008b7J01p6l4N5m1QL0kL6r7J50j70J1J05K8k0q1Q7k8j2K8n4O3j8Mm8P9j25M9
$$ -27 74 -2 -36 19 -22 -14 16 14 50 -47 103 -67 -56 49 77 57 -24 63 35 23 51 -3 60 42 46 -2 77 -48 1
7037AR1r5pj9k3L9R5j69K1J07M4k08J41N7r0K4q2O4L3M4j2j53O7JO6jm3k0O8k6
$$ 1 92 -3 -10 -29 -52 -13 82 -87 -66 41 85 -123 18 75 -15 9 -73 -9 24 68 56 -97 -30 -29 37 36 -7 -27 41 15
7067A5j39J70o5K7l2M6Kk7q9J48rn4L4k2MN7L9j94O1k3R8o7P4M3j25N5n2JJ3n1
$$ 15 -124 46 -19 8 -24 22 24 -3 -92 56 47 -7 27 5 9 66 105 -89 -28 -51 47 -20 54 97 -28 27 -25 -24 -11 -62
7097f2N0p5J34j03J03q0O7j08J5k0L1qR3Pr0R1M2j47kQ0l0L4j01Q7K6m8q5NJ07
$$ -62 -12 -87 47 -56 47 -33 34 -74 -59 -79 -48 -56 37 44 -46 45 87 -60 -62 18 -12 22 -79 8 34 -14 -99 -94 13
7126A3k3K4J2K6m7P2JJ9j13L0j5L4m2j5m9nK9K0L7R0r7jn6pR5l4M6j06O3j5k0
$$ 13 -10 14 26 52 5 77 78 97 -16 14 -1 33 -9 -24 -73 -78 -49 -29 8 98 1 0 -56 -63 32 -2 44 -62 1 -14 -34
7157c4O9r6K0R0l6J00j09j3O0j5o3m0J91j22o0QJ7J10j23J10j55R6p5N2R7m0r
$$ -34 35 -61 -41 49 13 113 4 -9 51 36 -27 -67 124 2 -58 -50 -33 77 -46 64 -91 5 -70 -18 79 39 30
7184C0j00m1R2M0m3N8N4j07pQ7n6K1j13N8K8k9m0J35o7P1p3m5J16o2k4m5j6J49
$$ 30 -70 -111 -19 21 -22 36 90 -17 -24 63 7 28 -85 -27 1 -28 -68 67 0 71 -2 -47 69 7 -17 -62 -78 71
7212G1j30P3No6M0k3J05q5nr2J6L7J53j17M1l5j5l8J7L5M9r8J14L2p5L4r5JR3
$$ 71 -59 14 19 -47 -7 -30 75 -10 -15 -107 -91 -54 99 -18 23 -12 -27 -65 -48 -13 36 -62 52 84 9 43 -52 -51 42
7241D2l9M7q2L1o0J00m0Rm2K1nJ1j38J77k0j28J50o9Q8p0O8j09J53j80J8J07q1
$$ 42 3 50 -32 -1 -61 39 -1 8 -34 -13 -18 -7 -145 32 12 -116 34 -35 53 -17 51 -58 95 -85 -67 40 -41
7268d1j9Q9p3o6J07P0j13K8OlJ6J8l7l3J9L0PK8j0K9q5P0j02N3k4R5q2KK1M0M2
$$ -41 -60 29 -44 -110 -3 67 -46 -18 -12 -15 1 19 -18 -51 -32 -2 5 33 23 52 -33 37 -65 -12 -36 59 -23 -21 0 40 82
7299H2o0q1L6j2K3j4N2N8j29K9J69j02o8J06l8J0j05K4n8N7l0JK2j0J4l1J15n6
$$ 82 22 -59 -23 -35 -12 -26 26 84 -45 -16 153 51 -17 89 51 61 -44 -20 -78 -21 -51 -50 -28 -38 -24 -55 60 4
7327Dk4r7M5J90k23J22Lj14O6K8L8m5Q6rj06J9N0r1J28q3j6K7J3o2qJ03n7P5r4
$$ 4 -20 -117 -72 118 -105 17 20 -94 -28 0 38 -7 79 70 -36 -17 33 -58 70 -13 -29 -2 11 -51 -59 44 -13 62 -32
7356c2lN4K6K6o3J09l5j01o8N0L3n3J74p9r7J5M2J5j4K8J1nk9J8r1P7n8P0r5%
$$ -32 -35 19 45 71 8 117 82 -19 -87 -37 -4 -57 117 38 -59 -44 -2 13 -1 27 38 33 4 22 -69 8 -50 20 -75 -75
$$ [...]
8191G5
##END NTUPLES=NMR FID
##END=
