##TITLE=1H_CPA2B2906
 CDCl3, 8 sc, 
 1.07.2021
##JCAMPDX= 6.0         $$ Bruker NMR JCAMP-DX V2.0
##DATA TYPE= NMR FID
##DATA CLASS= NTUPLES
##ORIGIN= UXNMR, Bruker Analytische Messtechnik GmbH
##OWNER= root
$$ XWIN-NMR		Version 3.5
$$ Thu Jul  1 09:30:53 2021 Russian Standard Time (UT+4h)  she@DPX200
##.OBSERVE FREQUENCY= 200.131506
##.OBSERVE NUCLEUS= ^1H
##.DELAY= (6, 6)
##.ACQUISITION MODE= SIMULTANEOUS
##.ACQUISITION SCHEME= undefined
##.AVERAGES= 8
##.DIGITISER RES= 18
##SPECTROMETER/DATA SYSTEM= spect
##.PULSE SEQUENCE= zg30
##.SOLVENT NAME= CDCl3
##.SHIFT REFERENCE= (INTERNAL, CDCl3, 0, 15.7039)
##AUDIT TRAIL= $$ (NUMBER, WHEN, WHO, WHERE, WHAT)
$$ ##TITLE= Audit trail, XWIN-NMR		Version 3.5
$$ ##JCAMPDX= 5.01
$$ ##ORIGIN= Bruker BioSpin GmbH
$$ ##OWNER= she
$$ F:/spectra/data/she/nmr/H-F/1/audita.txt
$$ ##AUDIT TRAIL=  $$ (NUMBER, WHEN, WHO, WHERE, WHAT)
(   1,<2021-07-01 09:29:20.95 +0400>,<she>,<DPX200>,
      <created by zg, POWCHK disabled, PULCHK disabled
       configuration hash MD5:
       00 E9 B6 7A A2 85 ED C7 34 08 36 98 17 FE 4E 26
       data hash MD5: 16K
       39 EB 79 72 8E 7F 6A C8 68 37 8A 3B 95 4B 60 9D>)
$$ ##END=
$$ 
$$ hash MD5
$$ E1 04 9B 05 FC D2 43 44 29 DB 59 DD B1 C1 07 19
##$RELAX= 
##$RELAX= 
##$RELAX= 
##$RELAX= 
##$RELAX= 
##$RELAX= 
$$ Bruker specific parameters
$$ --------------------------
##$DU= <F:/spectra>
##$EXPNO= 1
##$NAME= <H-F>
##$PROCNO= 1
##$TYPE= <nmr>
##$USER= <she>
##$AMP= (0..31)
100 100 100 100 100 100 100 100 100 100 100 100 100 100 100 100 100 100 
100 100 100 100 100 100 100 100 100 100 100 100 100 100 
##$AQSEQ= 0
##$AQ_mod= 1
##$AUNM= <au_zg>
##$AUTOPOS= <>
##$BF1= 200.13
##$BF2= 200.13
##$BF3= 200.13
##$BF4= 200.13
##$BF5= 200.13
##$BF6= 200.13
##$BF7= 200.13
##$BF8= 200.13
##$BYTORDA= 1
##$CFDGTYP= 0
##$CFRGTYP= 5
##$CHEMSTR= <none>
##$CNST= (0..31)
1 1 145 1 1 1 1 1 1 1 1 1 1 1 1 1 1 1 1 1 1 1 1 1 1 1 1 1 1 1 1 1 
##$CPDPRG= <>
##$CPDPRG1= <>
##$CPDPRG2= <>
##$CPDPRG3= <>
##$CPDPRG4= <mlev>
##$CPDPRG5= <mlev>
##$CPDPRG6= <mlev>
##$CPDPRG7= <mlev>
##$CPDPRG8= <mlev>
##$CPDPRGB= <>
##$CPDPRGT= <>
##$D= (0..31)
0 1.2 0 0 0 0 0 0 0 0.06 0 0.03 0 0 0 0 0.0002 0 0 0 0 0 0 0 0 0 0 0 0 
0 0 0 
##$DATE= 1625117360
##$DBL= (0..7)
120 120 120 120 120 120 120 120 
##$DBP= (0..7)
150 150 150 150 150 150 150 150 
##$DBP07= 0
##$DBPNAM0= <>
##$DBPNAM1= <>
##$DBPNAM2= <>
##$DBPNAM3= <>
##$DBPNAM4= <>
##$DBPNAM5= <>
##$DBPNAM6= <>
##$DBPNAM7= <>
##$DBPOAL= (0..7)
0.5 0.5 0.5 0.5 0.5 0.5 0.5 0.5 
##$DBPOFFS= (0..7)
0 0 0 0 0 0 0 0 
##$DE= 6
##$DECBNUC= <off>
##$DECIM= 32
##$DECNUC= <off>
##$DECSTAT= 4
##$DIGMOD= 1
##$DIGTYP= 9
##$DL= (0..7)
0 120 120 120 120 120 120 120 
##$DP= (0..7)
150 150 150 150 150 150 150 150 
##$DP07= 0
##$DPNAME0= <>
##$DPNAME1= <>
##$DPNAME2= <>
##$DPNAME3= <>
##$DPNAME4= <>
##$DPNAME5= <>
##$DPNAME6= <>
##$DPNAME7= <>
##$DPOAL= (0..7)
0.5 0.5 0.5 0.5 0.5 0.5 0.5 0.5 
##$DPOFFS= (0..7)
0 0 0 0 0 0 0 0 
##$DQDMODE= 0
##$DR= 18
##$DS= 0
##$DSLIST= <SSSSSSSSSSSSSSS>
$$ [...]
##$SUBNAM2= <"">
##$SUBNAM3= <"">
##$SUBNAM4= <"">
##$SUBNAM5= <"">
##$SUBNAM6= <"">
##$SUBNAM7= <"">
##$SUBNAM8= <"">
##$SUBNAM9= <"">
##$SW= 20.0188882624521
##$SWIBOX= (0..15)
0 0 2 0 0 0 0 0 0 0 0 0 0 0 0 0 
##$SW_h= 4006.41025641026
##$TD= 16384
##$TD0= 1
##$TE= 0
##$TE2= 300
##$TE3= 300
##$TEG= 300
##$TL= (0..7)
0 120 120 120 120 120 120 120 
##$TP= (0..7)
150 150 150 150 150 150 150 150 
##$TP07= 0
##$TPNAME0= <>
##$TPNAME1= <>
##$TPNAME2= <>
##$TPNAME3= <>
##$TPNAME4= <>
##$TPNAME5= <>
##$TPNAME6= <>
##$TPNAME7= <>
##$TPOAL= (0..7)
0.5 0.5 0.5 0.5 0.5 0.5 0.5 0.5 
##$TPOFFS= (0..7)
0 0 0 0 0 0 0 0 
##$TUNHIN= 0
##$TUNHOUT= 0
##$TUNXOUT= 0
##$USERA1= <user>
##$USERA2= <user>
##$USERA3= <user>
##$USERA4= <user>
##$USERA5= <user>
##$V9= 5
##$VALIST= <valist>
##$VCLIST= <CCCCCCCCCCCCCCC>
##$VD= 0
##$VDLIST= <DDDDDDDDDDDDDDD>
##$VPLIST= <PPPPPPPPPPPPPPP>
##$VTLIST= <TTTTTTTTTTTTTTT>
##$WBST= 1024
##$WBSW= 4
##$XGAIN= (0..3)
0 0 0 0 
##$XL= 0
##$YL= 0
##$YMAX_a= 606703
##$YMIN_a= -593372
##$ZGOPTNS= <>
##$ZL1= 120
##$ZL2= 120
##$ZL3= 120
##$ZL4= 120
##$ABSF1= 10
##$ABSF2= 0
##$ABSG= 5
##$ABSL= 3
##$ALPHA= 0
##$AQORDER= 0
##$ASSFAC= 0
##$ASSFACI= 0
##$ASSFACX= 0
##$ASSWID= 0
##$AUNMP= <proc_1d>
##$AZFE= 0.1
##$AZFW= 0.1
##$BCFW= 1
##$BC_mod= 2
##$BYTORDP= 1
##$COROFFS= 0
##$CY= 11.3945322036743
##$DATMOD= 1
##$DC= 2
##$DFILT= <>
##$DTYPP= 0
##$F1P= 15.9154993809931
##$F2P= -4.1035820241983
##$FCOR= 0.5
##$FTSIZE= 0
##$FT_mod= 4
##$GAMMA= 1
##$GB= 0.15
##$INTBC= 1
##$INTSCL= 1
##$ISEN= 128
##$LB= 0.24
##$LEV0= 0
##$LPBIN= 0
##$MAXI= 10000
##$MC2= 0
##$MEAN= 0
##$ME_mod= 0
##$MI= 1.114404
##$NCOEF= 0
##$NC_proc= 0
##$NLEV= 6
##$NOISF1= 3.799351
##$NOISF2= 2.8
##$NSP= 1
##$NTH_PI= 0
##$NZP= 0
##$OFFSET= 15.70392
##$PC= 1
##$PHC0= -11913.86
##$PHC1= 9.600991
##$PH_mod= 1
##$PKNL= yes
##$PPARMOD= 0
##$PSCAL= 0
##$PSIGN= 0
##$REVERSE= no
##$SF= 200.130013532006
##$SI= 16384
##$SIGF1= 3
##$SIGF2= 2
##$SINO= 400
##$SIOLD= 16384
##$SREGLST= <1H.CDCl3>
##$SSB= 0
##$STSI= 0
##$STSR= 0
##$SW_p= 3612.71676300578
##$SYMM= 0
##$S_DEV= 0
##$TDeff= 0
##$TDoff= 0
##$TI= <>
##$TILT= no
##$TM1= 0
##$TM2= 0
##$TOPLEV= 0
##$USERP1= <user>
##$USERP2= <user>
##$USERP3= <user>
##$USERP4= <user>
##$USERP5= <user>
##$WDW= 1
##$XDIM= 8192
##$YMAX_p= 0
##$YMIN_p= 0
$$ End of Bruker specific parameters
$$ ---------------------------------
##NTUPLES= NMR FID
##VAR_NAME=  TIME,          FID/REAL,        FID/IMAG
##SYMBOL=    X,             R,               I
##VAR_TYPE=  INDEPENDENT,   DEPENDENT,       DEPENDENT
##VAR_FORM=  AFFN,          ASDF,            ASDF
##VAR_DIM=   8192,          8192,            8192
##UNITS=     SECONDS,       ARBITRARY UNITS, ARBITRARY UNITS
##FACTOR=    0.0002496,     1,               1
##FIRST=     0,             0,               0
##LAST=      2.0444736,     0,               0
##MIN=       0,             -593372,         0
##MAX=       2.0444736,     606703,          0
$$ Real data points
##PAGE= N=1
##DATA TABLE= (X++(R..R)), XYDATA
$$ [...]
2039A285k734J255J901k559Q34K153k967K9K917k254n91K734j886j558L371j365
2055E65k134K933l37k562K666Q1l252K503J146l189J842J787l503R52K693l007
2071h16k49K917k448q21K969j932j776L084m16j993J986N8k264J697J067k258
2087a195P72J397j999J38K036j708r49K115l76j566J407J04j729J625O07j754
2103a075J042J092k114L95J979k174k92K443j483j085K567j141j827K996k28l135
2119b040K724Q47l237J712K039l157Q76K253k772J78K695k811o91L680j994k123
2135a821L321m64k751K779P76l248J687J695l172J033K331k690l03K636j711j146
2151a048K243q46j646K076K1k133K025L42k523J562J655k952N67K353k316m92
$$ y = [1285, -1449, -194, 1707, -852, -18, 2135, -832, -803, 2114, -140, -731, 2003, 117, -1441, 1930, 565, -1569, 1364, 1027, -1535, 1131, 1212, -2040, 463, 1609, -1580, 262, 2049, -1454, -502, 2191, -816, -1065, 1852, -596, -1417, 1552, -380, -2156, 928, 512, -1481, 505, 563, -1701, -4, 1063, -1195, -423, 974, -1025, -887, 1149, -559, -1508, 607, 231, -1335, 72, 176, -1553, 72, 679, -1075, -33, 1059, -1055, -660, 1319, -855, -1147, 1296, -187, -1272, 1295, 154, -1673, 1323, 1095, -2040, 684, 1531, -1706, 6, 2045, -1112, -236, 2017, -755, -577, 2118, -693, -1384, 2296, 302, -1821, 1500, 1036, -1715, 1064, 1840, -1408, 279, 1974, -1198, -165, 2166, -524, -827, 1809, 98, -1048, 1195, 349, -1297, 779, 800, -1333, 692, 1034, -1489, 73, 1728, -1224, -657, 1696, -620, -1112]
2167a112K043j311p17K030j124j224K416r33j825K290k0k289J798P93k488J425
2183b48J200k439O60K063k054k90K230j344j298K095k93j470J361K04j283J037
2199A31L90j205O78P09j095k69J403n62q59J005L25j076M14R98j373J85J127j132
2217b06k39J336p59o93J454m08q43J095l64p82J174k60r14J211nj555J360L22
2235I24j680J186P72j987J073O84j877J179Q51j856O36J310j682L0J382j361k45
2252f61J725j410m61J591q85p47J318o87n15R43l27p01J001l20l91O57k43o39
2270g52P81k31l76M80k05l65Q32m25m08Q23l20j78L08j57N7L81m48O1N86n69k13
2291c38O38n07l8N60n12j25Q42n86j95Q91l22o41J034m83n52R13l29o56J003j21
$$ y = [-1112, 931, -380, -1097, 933, -191, -1415, 1001, 68, -1757, 533, 513, -1776, 22, 815, -1673, -248, 952, -1487, -827, 1236, -818, -1108, 1122, -222, -1520, 575, 282, -1188, 173, 377, -906, 131, 521, -684, -6, 703, -392, -661, 742, 180, -679, 326, 651, -425, -11, 987, -386, -201, 926, -206, -445, 891, 132, -561, 893, 485, -358, 737, 373, -409, 765, 505, -409, 802, 797, -758, 602, 924, -756, 430, 1202, -785, 288, 972, -905, 274, 1125, -731, -95, 1215, -467, -437, 945, -416, -661, 1064, -346, -807, 784, -101, -848, 470, -217, -732, 211, -116, -817, 184, -136, -527, 130, -113, -752, 29, -202, -578, -98, -303, -668, 164, -261, -669, 154, -166, -344, -36, -193, -136, 245, -203, -142, 444, -125, -338, 300, -207, -245, 315, -197, -322, 520, -66, -261, 630, 308, -333, 701, 218, -334, 579, 250, -406, 597, 476]
2311D76n92O06l9p57O97l6m60N03K41o70L87J40o36O60m1m85L82q9n49M14J29
2332B81n10O45m9n67M37o8m82O43Qp74N19J33n85J92L53p23J82M79n08J13L86
2353A05n68r8M72j12l16M30rl85J67M7j74K58K6k89O6K04k6l50N90p2l33K03m3
2376b07QO7J36m35J30M61m59K10L18l59J0N27m48J20L75n03J41O34o30j97Q40
2397G39n96n33J100l58o44P79j08p80J068o9r71R21L91j374P18O29j286N37P83
2416I46j250K97Q03r20m12J529r08p58J221Oj020O02M95j170L23R20j017r0Q91
2435D88p94l67J053m31j017J110P4j026O96O81j306M92J007j266j17J491j179
2452d11n78J673o62j350J657j74j414J279K98j489R04J071j960Q08J312j716J73
$$ y = [476, -116, 490, 451, -306, 391, 355, -105, 398, 639, -31, 356, 496, -140, 520, 479, -6, 376, 287, -262, 152, 281, -229, 416, 367, -200, 237, 169, -313, 330, 338, -436, 83, 216, -369, -177, 176, -547, -365, 114, -394, -281, 105, -463, -561, -89, -201, -517, -87, -96, -481, -314, -267, -441, -183, -157, -446, -380, -176, -202, -552, 38, -34, -367, -164, -207, -199, -132, 4, -431, -301, 160, -299, -89, 229, -130, -120, 407, -41, 79, 454, -49, 92, 726, 96, -101, 739, 143, -390, 710, 352, -292, 487, 379, -401, 667, 598, -373, 548, 939, -435, 283, 912, -374, 163, 946, -304, -7, 796, -124, -536, 993, 85, -673, 548, 554, -466, 136, 631, -539, -216, 704, -313, -403, 488, -306, -673, 380, -51, -1068, 42, 116, -910, -214, 467, -839, -347, 660, -606, -723, 768, -411, -989, 684, 22, -1328, 329, 155, -1259, 20, 318, -1171, -267, 804, -1156, -348, 964, -752, -579]
2469e79J664j374m78J753j164n18J621r37q74J591k89j247J470p1j283J070L62
2486G17j030O26O10j251N26P80j171J28R17p16k22Q14l10p60Q53n1n83M48K64
2505E89r07N52O23r62j07R62o26l78P79k52o78P73p4r01P15N27j285M96R52j321
2525e23J80J214j283l67J358j075o45J826p12j089J568o21j176J576k01j349J670
2542C51J30j751J359M76j867J267Q78j999Q84Q44j821P64J401j641O2J531j142
2559b74m89J517o58q96J533l18j090R29K61j121P62O53r76O0N96k87m85P25Q1
2578E23o03M38L58q00Q1O10n74j44J187q82p73J426l34j217J463k9j613J300N15
2597I32j835J039Q21j815R74J160k156N00J335j661K69J572j571l64J726j377
$$ y = [-579, 1085, -289, -767, 986, -178, -696, 925, -12, -886, 705, 416, -831, 639, 568, -715, 355, 717, -313, 313, 923, -328, 198, 978, -193, -65, 852, 136, -86, 728, 418, -342, 511, 460, -123, 325, 589, -318, 234, 857, -105, -212, 750, 124, -254, 525, 273, -405, 368, 294, -607, 108, 635, -650, -154, 798, -523, -343, 871, -412, -779, 579, -496, -1141, 685, -27, -1116, 452, -169, -1345, 231, 30, -1319, 351, 481, -1270, 89, 565, -1302, -35, 843, -1156, -272, 572, -1249, -485, 916, -725, -663, 868, -274, -763, 754, 96, -800, 733, 415, -675, 254, 515, -606, 156, 809, -167, -107, 489, 202, -283, 442, 523, -80, 358, 716, -84, -3, 607, 33, -111, 1076, 194, -579, 847, 513, -704, 759, 730, -883, 417, 932, -903, 136, 957, -858, 116, 1276, -880, -380, 955, -706, -437, 1135, -436, -800, 926, -451]
2613d51n04K010j472n45J788r16j036J514l31j059J616p56j131J524l42j095J757
2630E71l24j461J382L01j524R01K96j066Q12O95j342L74M68o14M7Q78o69r0L51
2649a4j22M8J75j0J51j32J10l8n28N29O97r75J65P60j054j22J338p96p29J712
2669A165j112n09J888j197j163K157m27j725J896r9j939J731M05j921J090J009
2685A249k114J065J324k353L55J716j500N5R27j296j08J458r60k91J235j064n09
2702h11J275n80n46Q09k58j63M74m78k45O72j81n02K90l3l83N31j45o7K38m47
2722e50n0P29k93l10M81k32k09P00n20j95P09m70m27O56m3l46K63R1l06M49n8
2743F9k16L97K9l92M04l47K69J15k92j9M10o12K43O62p88r5P86m85k98J113n66
$$ y = [-451, -955, 1055, -417, -962, 826, -90, -1126, 388, 57, -1002, 614, -142, -1273, 251, -91, -1186, 571, 247, -1214, 168, 469, -1055, -154, 142, -924, -112, 583, -759, -385, 83, -531, -484, 394, -275, -365, -14, -136, -88, 87, 77, 228, 96, 206, 168, -360, 169, 866, -109, 56, 816, -238, -360, 978, 182, -547, 1165, 53, -456, 1432, 235, -928, 1229, 802, -923, 973, 874, -1065, 666, 1071, -850, 240, 1249, -865, 200, 1524, -829, -474, 1242, -258, -203, 724, -572, -680, 778, -182, -473, 762, -302, -811, 464, -116, -662, 147, -111, -274, 200, -278, -523, 149, -32, -534, -244, -277, -660, -129, -274, -341, -103, -550, -600, 129, -164, -474, 7, -225, -434, 266, -254, -449, 260, -210, -637, 19, -24, -370, -107, -16, -322, 127, 69, -147, 250, 279, -113, 291, -56, 213, 328, 36, 17, 427, -185, 58, 720, -68, -163, 623, 138, -160, 953, 387]
2764C87p38J234k10j330J297N0j260R48N49j387K66J231j238m0J097j046k05J163
2782G68p50o45J134m58p52J019j23p05P81l41o58Q05j59n18M77J14l21K62M2o04
2802f32N60L8m97L97K28q55N17K53o56L34M35r07M05O30n42k31Q88o19j67O39
2822B18k63m34N78j21k66K92n3n2k4K62j93JL9L08q0m17N30j97m10P15Q2m86K84
2845C13L48q30M87M91j053L36P90j029K83P77q18j11J003r71k28J024o70n75J258
2864H25o30p12J254o07p03J169m27p75Q72Q8q53P27J50r36O14Q7o78N04J41o98
2884e88M95K67o63J95L78n95K06L01o25L40L88o84K9O53n01J72K84n42K22L01
2904C3m96L26J28m55J95L36n11Q8L26k65K60P6l26O4M61n70M18J89o01O56o1m45
$$ y = [387, -351, 883, 673, -657, 640, 690, -570, 378, 927, -460, -194, 1037, -201, -241, 856, -190, -395, 768, 18, -627, 507, 49, -703, 316, 193, -512, 269, -72, -730, 75, -84, -602, -125, -11, -332, -70, -28, -632, -72, -34, -531, -134, 94, -761, -244, 9, -647, -313, 122, -785, -380, 250, -292, -523, 365, -254, -421, 218, -45, -479, 99, -22, -288, 4, -49, -101, -125, 137, -56, -55, -16, 292, 212, -205, 325, 128, -282, 433, 515, 29, 313, 661, -169, 318, 809, -244, 92, 882, -147, 136, 913, 95, -16, 987, 16, -212, 812, 142, -433, 825, 195, -517, 737, 130, -573, 596, 169, -606, 266, 354, -499, 228, 378, -558, 56, 143, -535, -31, 110, -588, -93, 174, -489, -294, 84, -511, -305, -4, -629, -289, 99, -585, -556, 97, -404, -232, 52, -490, -268, 33, -463, -137, -9, -464, -269, 67, -444, -356, -30, -295, -35, 41, -285, -221, 240, -330, 88, 277, -324, 332, 271, -174]
2926a74N17O2n16L53M40r44L16O02o20J68M09n71N5N08o01J6O95m33j23M85l56
2947B88k48M94l11m22P74l78l59N35j64k79L11j11k90L17n6j84K85m7k96J38O3
2968F0k65J77p6q4J28k57j10L86k19j49L91j03l57N66l34k18M67l11m26O46P4
2989a4o50M64K12n24M78L4m68K33M13n89L03L20n50J14M66m34J03L19l54J13j8
3010b9qL5L51m11J29R3q4J35r5R7K39j51q8O9ll59L31L2j18J9K07j26N8P1j79
3035B15J78j45k09K68j65qK12o9l06L70j71m15P47k09o08N98o7m75M72M1q04P07
3057A57L06j184O89N12j153J73J118j116j41J259r56l18J074m49r04J194j98j144
3075a081J057K45j191O93P15j045r1J009j000j09J435o63p65J140n0j194Q48P70
$$ y = [-174, 343, 405, -111, 242, 682, -262, 54, 656, 36, 204, 613, 42, 97, 605, 4, 20, 715, 282, 159, 644, 288, 40, 534, 223, -199, 575, 197, -162, 373, 209, -70, 241, 130, -160, 157, 101, -83, 202, 155, -141, -3, 60, -205, -28, -104, -188, -60, -317, -427, -41, -260, -409, -18, -121, -478, 88, -246, -464, 3, -308, -734, -88, -14, -664, -200, 12, -512, -34, 0, -468, -235, 178, -411, -108, 212, -338, -224, 242, -192, -89, 230, -124, -11, -29, -37, -2, 349, -62, 67, 160, 76, 211, 116, 213, 452, 301, 213, 282, 279, -80, 251, 283, 165, 184, 391, 265, 323, 394, 215, 393, 248, 39, 307, 142, 134, 346, 277, -29, 341, 170, -245, 502, 293, -315, 283, 216, -259, 213, 254, -550, 157, 463, -721, -32, 480, -673, -500, 618, -498, -639, 620, -336, -654, 420, -29, -933, 261, 63, -1081, -24, 221, -970, -277, 438, -607, -698, 311, -689, -798, 637, -26, -791, 349, 299, -895, -47, 723]
3093G23j386L39J255j602J19J356j014o73J931o32j628K026p4j656J303Q59k106
3110h60P79J509k019L98J725j842l33K033j244r96K210r44j457J885j0j641J408
3127F01N48j975R53R96j636N21R54j114l6J148j116l68J143m54n23O85k24m80
3145c77M51M7o09L52M90p51J15M05m01j86N95k43n71O65k3o53N99l1p26P82K05
3166A35r29N78Q95j653N78J031j304m2J520j431j30J590j216p36K264j136j352
3183a338K130l96j665J905j7j865J669P25k455J355J409k508O48J813j965p5K110
3200A480j547n80K088j327p76J704p60j105J825q6j892J538K44j579J157O39j659
3217f36P33J158j592o0J547j188p84J873m82j365J450P3j670R91R81j950N86J743
$$ y = [723, -663, -324, 931, -671, -552, 804, -210, -883, 1048, 416, -1212, 814, 740, -916, 387, 1246, -860, -81, 1428, -591, -193, 1532, -310, -643, 1390, 146, -850, 1360, 416, -1041, 844, 834, -807, 601, 1149, -826, 127, 1123, -513, 8, 962, -152, -188, 960, -156, -524, 619, 165, -358, 327, 103, -377, 74, 121, -488, -136, 354, -397, -282, 123, -278, -464, 131, -112, -683, -18, -41, -694, -95, -126, -852, -70, 135, -794, -216, 679, -974, -396, 635, -669, -711, 809, -622, -752, 838, -378, -1114, 1150, 14, -1338, 792, 396, -1269, 636, 619, -1246, 423, 1148, -1307, 48, 1457, -1051, -403, 1410, -555, -630, 1480, -67, -647, 1441, 114, -662, 1042, 282, -823, 1002, 916, -976, 562, 806, -773, 384, 1023, -636, 97, 1255, -337, -397, 1150, -38, -822, 1051, 569, -796, 654, 727, -943, 48, 1029, -921, -335, 1408]
3235A408j775n98K106j095j573K523m93k302K435J53k520J820J134k993J182K031
3251A443k876J15K836k355m28K581j850j227K824j019j887K811m01k392K281M52
3267I08k558J659J221k708J018J903k553L60K266k179k41K336j751q07K081m49
3283E06j596J856R4j975J757O08k193J004J373j871r5J920j597q18K390q58j270
3300g65J786l35j613J492N54k031J166J038j727J12J695j524n50K025j373n96
3316f46J844r04j352K070l91j962J761J97j613J142Q86k099Q75J322j890J78J578
3333I96j758j3J673j240p62J906j021j071J939m36j615J631L18j940J484N32j981
3350a358Q21J544j988K10J591j411m39K006j183j080K079n14j511J805J50k109
$$ y = [1408, -367, -965, 1141, 46, -1527, 996, 503, -1799, 636, 789, -1731, 89, 1223, -1770, -588, 1443, -1433, -1318, 1518, -837, -1265, 1316, -534, -1761, 1063, 44, -1843, 968, 567, -1825, 456, 908, -1650, 9, 1230, -1478, -460, 1443, -1110, -750, 1516, -663, -904, 1432, -319, -1126, 955, 506, -1090, 766, 860, -1115, 642, 1250, -943, 61, 1434, -437, -532, 1388, -209, -1027, 1363, 505, -765, 1021, 686, -927, 565, 1119, -912, 254, 1292, -435, -323, 1372, -152, -702, 1323, -50, -646, 1198, 294, -1058, 1012, 621, -1341, 420, 617, -996, 146, 1032, -1067, -192, 1130, -760, -582, 996, -762, -775, 898, -342, -1104, 802, -219, -1290, 649, 213, -1402, 229, 547, -1393, 91, 623, -1358, -537, 1007, -981, -771, 820, -591, -1030, 976, -207, -1287, 792, 278, -1233, 572, 722, -1387]
3366a387J553P05j818R05J122j645J23J512j267l73J393o65q09J551p37q93J452
3383G22o6j195J099L52j605Q41Q97j582M84J129j148m08J705j050p79J561n03
3400D54j266J389K7j406J225L87j673Q20J102j823K41J701j765j56J835j284p22
3417i14J804q48j275J823j40j628J605M08j917R88Q84k061P43J542k123M16J594
3434I01j454m59K033j231r16J746l82j710J753O2j487J101O68j468O48R11j388
3451f72J01J257j032j95J202p20n68P25L24r96P00M00r41L51Q24q46j61Q82n43
3470I2n57R90j36q32J032J0r73N68K89q00N97M60r56K86O80o99j88O78o92J7Q52
3491G18n91k17Q78o88n75J025m93n21R91m64o61Q76j20q91Q78K41j009N99L57
$$ y = [-1387, 166, 871, -947, -42, 1080, -565, -442, 1070, -197, -570, 823, 158, -651, 900, 163, -730, 722, 656, -539, 560, 912, -693, 148, 1045, -537, -53, 1076, -72, -480, 1225, 175, -604, 957, 454, -812, 577, 604, -802, 423, 810, -863, -43, 1059, -764, -523, 1178, -587, -743, 1092, -192, -914, 890, 42, -1233, 590, 450, -1178, 427, 835, -1082, -94, 790, -1271, -528, 1014, -1109, -693, 901, -553, -1012, 1021, -210, -1126, 620, 238, -1472, 281, 343, -1144, -43, 625, -843, -195, 716, -672, -571, 686, -346, -541, 661, -59, -627, 98, 422, -574, 126, 526, -415, -64, 760, -86, -247, 635, 92, -465, 525, 389, -443, 589, 599, -374, 194, 483, -317, 280, 740, -216, 70, 750, 51, -137, 541, -151, -134, 718, 127, -90, 788, 100, -475, 550, 57, -464, 527, 63, -598, 278, 158, -733, 145, 386, -623, -24, 333]
3510C33r94M23P33q92J78O61q80m1P57n04k24N38l26m36O23m5m14L99Q2l28J39
3531b18R1j56N1L39k57jJ54M5k07j06K38l9l4k4N4q6L91k90L0K21j99p3K31Jl29
3556a73M77o8k67K12J9j97K45K23q05N18L75o74J64N33o65J33O40o39k2O90n62
3577A57k24N61l07k79M48j36l66N92k87k95K88o2k71M41r1m83N04j71j65K67m2
3598G9l35L71j31k26K44J10m02K70M1k58J06J91l96K55j28j89J48L7j35J03RM8
3620a88PP4j58p5J88O0j9P9k89K12L3P0o9j06K78j41L9k8Jr1L4M20l36o9J84j32
3646b2p4L71k91k04O00k86k07K60J09l65M40k23k00L14L9m82L53L61n74L11J43
3667C73m41K45M06p96K89L99n11r8O56o41P2O08o26l06Q98k49n36N19p4o04M76
$$ y = [333, -661, -238, 495, -397, -219, 442, -438, -479, 278, -226, -450, 88, -238, -674, -51, -96, -510, -111, -29, -357, -218, -127, -283, -232, 107, -150, -151, 3, 48, -159, -265, -27, -66, -100, -124, -70, -156, 235, -55, -25, 196, -3, -76, 155, 156, -173, 304, 236, -31, 181, 200, 3, 248, 471, -334, 184, 559, -115, 49, 582, -83, 50, 690, 51, 29, 719, 157, -67, 494, 187, -92, 356, 220, -146, 446, 159, -136, 152, 90, -181, 260, 169, -314, 190, 19, -146, 121, 79, -256, 115, -16, -242, 2, 112, -290, -20, 21, -237, -131, 60, -336, -81, -209, -398, -250, -213, -348, -245, -236, -188, -181, -107, -265, -340, -152, -92, -111, -32, -321, -109, -76, -6, -75, -181, 97, -44, -5, -33, -32, -123, -89, 331, -5, -74, 110, -22, -96, 275, -16, -220, 380, 94, -113, 147, 256, -109, 331, 108, -92, 222, 261, -221, 132, 493, -81, 230, 373, -68, 177, 583, -213, 76, 475, -36, -134, 522, -119, -47, 561, -65, -371, 527, 278, -258, 261, 187, -417, 59]
3688E9J46l91R9L14l47j12M09qn34J71K79l02P1K54k68k1J52J9m70N19m2m01N03
3711I9k9m91L49J44m06L91j1l65Q5K49m16L62K77p06N00N8m50M44J84l83j35O62
3733D12n38p4P82n52k68N69j36m56N90N1n53K26K57m76M00O8l56L43Nq6N1m7J08
3756C20j62lL3M5q5l0Q4j28j44K86j65r7K93q4m11L62j29j39K59J50k84J36n5
3779E2p5k1n0N9J03m11L02J26l06K50Q8n10L28L57p13J7P02o82k30J110o53l75
3801e32Q11k12o23P63j48o60O52J49q46N36M15o23K13L77n71L1N99m67j10L85
3821A39N0n64M86p0j83P6J65l3l4J15j44p7J30M31l82q8N87n80k25P38k05p99
3843d67R70j54p16O00M02o36K9N67q59J75O78m93l74P95j74o51O34J28p53K83
$$ y = [59, 205, -186, -87, 227, -120, -232, 177, 169, -365, -194, 85, -217, -146, 108, -160, -181, -29, -10, -480, 39, -3, -404, 99, 70, -421, -72, 72, -334, 57, 46, -319, -234, 15, -401, -39, 238, -468, 32, 90, -360, 84, 268, -115, -250, 412, -126, -200, 582, 30, -238, 331, 195, -261, 329, 380, -173, 53, 310, -166, 234, 302, -54, 289, 294, 208, 259, 212, 320, 158, 155, 188, 233, 148, 118, 202, 74, -70, 216, 51, -46, 247, 163, -248, 114, -15, -154, 105, 255, -29, 107, 52, -23, -44, -94, -35, 68, -343, -41, 85, -221, 29, 117, -393, -65, 292, -421, -404, 298, -384, -614, 496, -157, -532, 279, 67, -556, 207, 59, -601, 51, 200, -646, -110, 305, -318, -105, 272, -299, -268, 331, -136, -246, 139, 189, -375, 111, 41, -142, -66, 99, 66, 32, 147, 3, -74, 56, 487, 105, 17, 604, 24, -201, 537, 332, -467, 503, 349, -367, 233, 635, -1, 28, 595, -264, -89, 589, 96, -278, 517, 343, -308, 326, 454, -299, -16]
3863a6L98o46O6M79m43o6M32N0o57N20L7l65J07L76m64j22N32n05%N15l57l59
3885d88N18L8m70J82M27p46K74K53n30M52K59m41OM47m81J34M48m30m05Q44l38
3906d7m00O21r5n12N43nl93K24L65n64K07M82n75O7M72n46K1N76l90k21M13Ll79
3929a33L62L07q23L48L42m80J84M10m83O3N33n16m42O97k9m85N73k42m84O77r2
3950B87m56L36J5m85K97L77n86M7O30p68J27N83n21j90N38j45o85O54M2n81P27
3971B43o7m63J91M11p41K11M21l86j70K78p4l15M48R0m65P17j26q18O73J33o40
3992d49K99L91o95K16M72m92j39O32m64j20N33k50k99P00j88n58P18L5r17Q66
4012B91K72j167O32N79r04K53N85q08J22R52o91l90Q59k22p64Q88k17p62P29L29
$$ y = [-16, 382, -264, -198, 281, -162, -228, 204, 254, -403, 117, 154, -211, -104, 272, -192, -314, 218, -287, -287, 228, -129, -488, 30, 68, -402, -220, 207, -539, -265, -12, -542, -90, 169, -272, -266, 181, -300, -166, 282, -148, -553, 291, -47, -447, 174, 79, -433, 110, 105, -288, -64, 301, -263, -56, 426, -149, -82, 390, -156, -135, 441, 51, -170, 243, 246, -133, 229, 536, -287, 61, 403, -77, 107, 517, 34, 97, 630, 114, -328, 369, 340, -145, 428, 186, -298, 379, 287, -169, 167, 182, -303, -6, 371, -215, -168, 462, -306, -179, 404, -117, -307, 231, 86, -599, 55, 97, -484, 243, 176, -287, -96, 315, -426, -215, 206, -180, -350, -72, -146, -461, -13, 77, -388, 329, 203, -615, 58, 191, -449, -150, 241, -454, -238, 234, -258, -397, 235, -229, -349, 184, -66, -365, 335, 147, -411, 307, 342, -575, 291, 563, -604, 28, 607, -297, -44, 541, -267, -145, 807, 116, -274, 585, 363, -401, 487, 270, -492, 237, 566]
4032E66q28M04O65j086J95O26o92k9Q54o31k13O53l98m13Q37l52n54O65K94r65
4052d02M68L93r06Q7O75p28j41Q31m11m54Q93p4r07R10J18j177J087K09j314N93
4072b50P03r94K04J050j230j38J331r53m08J162l66q25J108n1j210J035K65j152
4090g19N09P11j064L41O38p95o7R80n51n93J107m68j90M23J96q30N33L27p75K09
4110g8L59l21N0L83j89l08O19j75k64J67Q6k85K61J86n93K44L81n08K2M74n57
4131d6j6N36l58l70P87m34k87N90k32n53O69j8n30J79N39q14L84K32n87J53L48
4152A72m95K23K51m45M3L32j79k33L90k51l38M59j10j97M36m6m90L10L99n36Q6
4173b19J90j73mJ45j20j5K08m9k15J76l0j03J61K20k57L2K71k49M5J74r6k02L52
$$ y = [566, -262, 142, 807, -279, -84, 542, -150, -179, 675, 44, -169, 484, 86, -327, 510, 158, -396, 269, 563, -402, 66, 459, -447, -360, 315, -413, -554, 277, -134, -588, 305, 231, -676, 234, 352, -825, 262, 471, -843, -250, 453, -541, -337, 713, -517, -655, 676, -277, -685, 477, 111, -714, 394, 343, -867, 168, 433, -719, -210, 501, -563, -222, 416, -379, -446, 534, -17, -610, 497, 29, -161, 262, 458, -372, 161, 488, -287, -78, 281, -40, 10, 393, 204, -104, 515, 340, 76, 243, 329, 44, 305, 491, -102, 142, 523, 15, 37, 511, -46, -62, 474, 116, -254, 533, 99, -188, 402, 170, -383, 286, 268, -262, -83, 456, -358, 26, 258, -329, -176, 172, -323, -100, 151, -294, -251, 81, -98, -331, 59, -192, -530, -71, -181, -378, 58, 12, -478, -168, 231, -305, -219, -29, -202, -206, -61, -181, -196, 12, -37, -252, -76, -106, -209, -48, 172, -85, -53, 218, -31, 14, 188, 92, -110, 242]
4196B42ml75R3L56l84Q2M99n44R6L19l99J14K32n7l50N56l36M8K33k24k08K60
4218B49j64j90M57k29k28K69p4j89L49j39j47J53L3k56L89k89l31K62J50o2j64
4239a51J98k72J32q3R4J09j35j77K55J5j54K06l55J24K19j55k35M11j88k12K84
4260g0R7l02K26j78O4m2K46l75K59J79l62N3K67k19RL18j27j10M9j64J28J91k15
4283g8M3M4j3J48p1QJ27j7j35J21l7q2J15l5q2L14l54p9N12m59j01O18k59l34
4307h6N42p5q20N52K73o54M72J26m25J94K67n41m9Q87p87o8O49n75k53P12m85
4328a44m00P60k82l95N02o9l94N43O7o30L50J68m20K32J69m57J00N85m69k08M65
4349G3q7m33M30J98o59M52J28l98L3L72n16r7P93m49l77R58k27q55Q08O6p19M40
$$ y = [242, 238, -137, -44, 312, -72, 10, 509, -35, 61, 380, -19, 95, 327, 270, -80, 476, 140, 188, 421, 197, -11, 249, 85, -105, 352, 123, -105, 164, 90, -99, 250, 111, -36, 117, 150, -106, 283, -6, -337, -75, 75, 13, -151, 47, -225, -93, -176, -82, 27, -108, -285, -30, -15, -169, 37, -318, -194, 25, -130, -365, 46, -142, -354, -70, 27, -275, -49, -227, -163, -205, 41, -334, -75, 104, -258, -205, 62, -157, -148, 170, 43, -67, -18, -182, -54, 137, -78, -35, 9, -4, 144, 73, 81, 208, 191, 56, 177, 140, 58, 173, 138, 56, 370, 16, -63, 449, -10, -111, 507, 248, -86, 456, 381, -439, 113, 386, -268, 204, 330, -95, 99, 366, -175, -224, 663, -124, -192, 457, -118, -371, 341, -144, -544, 216, -66, -461, 41, -28, -422, 121, 188, -442, -92, 76, -344, -112, 57, -400, -300, 285, -184, -392, 73, -14, -447, -17, 181, -478, -26, 102, -296, -263, 109, -407, -504, 289, -160, -537, 421, 194, -661, 147, 213, -506, -66]
4371f6N52r74L93N80o35Q3O04o47k13J038q09j73R96m90o53Q79p8q16Q69Q1p94
4392b73P22J54r30L43P00q52M6P58q33m2O95m69k22P48l58n75O33L8o81O59J82
4413D43q05L53M66p00J47O13p47k09P03k55m57O10r0n87M45L52p30J88N71q08
4433d97J14O71p88j91J063o12l39J064m97p93J078n0r26P86L40j008O01K57p60
4452d87M15O16j045J79Q58p25j06Q76q93m7R78l99q24J104l56m75N68J25q01O12
4472A73K40q48N06N90p09j53Q81q75K3P91m65k65O68j47p18O94O8o07K25L94p95
4493c29K28O03n91k88Q01l54k18O83l31n76O40j46o36O97K19q08N06K23q73K80
4513b70P33q11n3Q73n70m57Q70l83o09Q50p1p88Q79r2o07M83K19r70M72O19q45
$$ y = [-66, 486, -488, -95, 485, -150, -67, 537, -110, -323, 715, -94, -267, 729, 239, -414, 465, 387, -429, 440, 521, -273, 449, 603, -327, 16, 716, -136, -90, 668, -165, -207, 488, 19, -203, 545, 187, -388, 245, 283, -398, 261, 443, -362, -9, 457, -243, -96, 517, -230, -439, 264, 9, -448, 162, 72, -515, -70, 282, -448, -260, 311, -497, -383, 288, -500, -691, 372, -240, -579, 485, -12, -805, 273, 223, -703, 83, 423, -585, 16, 273, -487, -72, 544, -501, -322, 536, -189, -295, 581, -312, -359, 619, 220, -604, 500, 144, -331, 237, 362, -439, 173, 413, -435, 71, 661, -48, -201, 680, -195, -172, 619, 154, -111, 557, 410, -308, 386, 454, -153, 72, 466, -329, -101, 502, -89, -377, 424, 70, -148, 535, 204, -372, 268, 122, -514, 183, 402, -406, 100, 323, -550, -270, 463, -348, -401, 472, -98, -555, 315, -68, -677, 173, 102, -686, 193, 101, -506, -23, 196, -774, -302, 317, -528]
4534e28L66N65n09m10R52p04k15R28m90n48Q94j47p68P70J35p62M26M67p11J94
4554i5O07o03j86P35l39m03Q52m34o30Q83m2n82P03j5p92N58L74q21K30P92o39
4575A53l48O76k54l70N46l8n83O63r4n71L38L76n49l9M00l01k5N46o42k57P94
4596D21m30k55L60pm52M13J23n02L08J88n33K83K32o40K36K23j97j78O66n14j35
4617c90O03l77l49L33K92l53K41J59m37J22K75m48K62J56l86K17J95l05l0M26
4637B06l82r1N39k97j47L85j14k90M17k26k19N15J1k21J05m9j99J77L08m78J88
4658A38K92m27M0M23m02n4L45K9o28M04J99m03J62L89p06K74K35k47K6K69k46
4679A12k82K84N0l44O5J98q0o8K28k13k05M07k96pK35j88l48M29N7k69K71J00
$$ y = [-528, -162, 403, -106, -516, 436, -268, -483, 445, -45, -593, 301, 154, -614, 156, 291, -471, -45, 422, -289, -95, 512, -91, -277, 458, 119, -284, 568, 134, -496, 387, 345, -237, 466, 451, -341, 217, 591, -230, 0, 792, 153, -195, 481, 227, -143, 403, 365, -218, 445, 351, -220, 118, 494, -55, -94, 306, 5, -20, 526, -116, -373, 421, -9, -264, 96, 89, -363, 50, 173, -329, -21, 167, -366, -83, 149, -491, -255, -32, -229, -407, 259, -255, -390, 213, -164, -513, -180, 112, -241, 0, 159, -278, -156, 119, -329, -67, 89, -297, -80, 115, -190, -220, 206, -176, -267, 272, -25, -172, 213, 99, -191, 226, 0, -219, 296, 307, 86, 191, 142, -57, 120, 428, -50, 138, 430, 3, 43, 466, 64, 10, 355, 384, -244, 160, 359, -44, 118, 507, -199, 75, 310, 63, 89, 358, 112, -170, 114, 164, -180, -115, 83, 3, -65, 163, -50, -255, 152, -144, -151, 84, -104, -452, -23, 34, -235, 36, 136]
4701A36m04J02J72k79K23J64k96qN3o8o5K18j87k93M54j69PL12k78j21L27j34
4723a34j39K93j45o0K40m0k15K31P7k49K08M8l13J85K41k7k0J6j02k0O5j02k4
4746A4K49k34J25J83k55J22M7k86Q0J86P3j26o7K14m3l14L00r8j88J01J50k60
4768b7J86n5rl8L9k42L20O7m12J9L78k91k13L89j45p8P5n1MJ84l15L1J96Qm60
4793d40K45K90m15K28j61Q7m8Q4j18K5N5j2j2L9M2j00J62j04k6K61k18P0J76k8
4817H2l1J14k19M5J09n6N9J09r8Ln0p0J95p7k27J36Q4k8pK2J1J75m86L38N7k7
4843A63O1j1m1k97M59j50j49k6J62j28KJ58m02J70K61k77J64l0j24n9K19k08q2
4866a65J63m0j60K79Q4l29J87q2q7P1J5rL8j8k53J46j2j3J00k10K41j92J43NJ01
$$ y = [136, -268, -166, 6, -273, -50, 114, -182, -190, -137, -205, -270, -52, -239, -532, -78, -247, -240, 72, -206, -327, 0, -134, -273, 20, -125, -185, 55, 15, -200, 31, 108, -141, 67, 115, -198, -13, 228, 201, 181, 197, 95, 75, 140, 38, 14, 263, 29, 154, 337, 82, 204, 251, -35, 45, 231, 304, 178, 111, 325, 282, -32, 268, 170, -18, 83, 233, -27, 159, 104, 95, 57, 96, -146, 174, 241, -171, -152, 226, -65, -278, 111, -34, -112, -37, -88, -84, 100, -215, -184, 12, 20, -440, -195, 95, -320, -92, -253, -166, -214, -130, -248, -223, -168, -180, -192, -153, -111, -211, -49, -153, -179, 82, -136, -66, 110, 82, 51, 165, -54, -9, 100, 44, 103, 212, 114, 117, 67, -3, 192, 115, -112, 24, 108, 80, 73, 95, 106, 281, -205, 133, 190, 163, 224, 213, 172, -125, 334, 184, 35, 9, 171, 43, 45, 203, -199, -29, 232, -45, 119, 89, -35, -94, 125, -83, -165, -2, -42, -202, 77, 161, -168, 19, -63, -150, -79, -64, -73, -35, -53, -306, -160, -172, -185, -85, -295, -54, -246, -103, -98, 3]
4891Cm8j34J49p0j06K22j25r9J78q5r9K54j98L8k8J14J21O2j54j7J75r4o5J81
4915A75kj15M1n5M2J62j7k05J68K1j75J40J78k31K49j32j24j48K48Q1p3M6j23
4938A51j27K61l10J77j98R4j06L44r9k4j7mLj25Q2K0j86O0L8j87J20K6m6j65K03
4963a5l4j0Q6k93J75J96j99k49L66k22n9J9J59j53P3r2m3K70K0q7k12K91l27K64
4987g6P1k12L8J86j21j00K77o5k02K17M8j89R4J91p7OJ57j11k88L90j22j00K28
5010B40K9l15J35J18j45q9K92l15L2K23L8k70K39Q3l92L43J68m75J09J67l03L26
5032B38J60m77J36L36l20l26L54l4j10J29l63P8L80p5l21K63M8k47L2Q2j49p2
5054b58K84k12Q7J09k32j98L35k13M0K96j19m14K69l9R4P5L05m61J24O1j35j36
$$ y = [3, -45, -179, -30, -100, -206, 16, -109, -208, -30, -115, -214, 40, -158, -120, -148, -34, 87, 149, -5, -22, 153, 59, -6, 175, 173, 58, 99, 44, 86, 248, 231, 26, 194, 215, 40, 180, 358, 127, 376, 244, 120, -28, 220, 301, 228, 274, 151, 24, 285, -25, 152, -46, 48, -58, 286, 187, 163, 146, 142, 145, 20, 102, 122, -64, -4, 34, -153, -33, -7, -53, -218, -15, -49, -59, 27, -266, -91, 105, -94, -343, 23, -199, -258, -239, -80, -233, -160, -252, -295, -25, -5, -92, -304, -13, -340, -76, -5, -217, -179, 7, -114, -214, 63, -2, -204, 13, 61, -128, -34, 157, 80, 86, 243, 132, -156, 234, 112, 12, 240, 269, -46, 89, 207, 62, -27, 265, -50, -18, 205, 243, -27, 212, 295, -97, 246, 414, -61, 48, 215, -88, 238, 398, -79, 57, 393, 73, -253, 101, 67, -43, 86, -277, -199, 181, 106, -215, 48, 96, -151, -119, -37, -186, -258, 26, -186, -99, 10, -222, -420, -85, -298, -258, 38, -81, -495, -226, -265, -171, -96, 209, -252, -128, -67, -202, -338]
5076c38M51k37j52L45k20j67K86P1m66N06P7m35K32L07n01J43K01j80N1K43j72
5097D5j40L04J9l75M61p5k37M12j13l62K15K96m74J57M01n21NM08m49q7N16k70
5119A36q6M67m18k86L03J01o18M33K67l43j6M01l75o1K49k60O6K98l24j73M85
5140B46l85j57M98k38m38M55Lk21J72K54n89L7M34l57K37J36m45k1L95r3k00L72
5162I5M6p21O03N2m76L28K89n49J44N14o32P0O24m38k36P46n15j22M94j06l85
5183a75L75J02o97M04N37p22L07J87m77J81N02n48n0N86k36l54M94j24n08N33
5203C17j4m04K03M57o43M0M65l70nL45l75j52M49j24n26N92n3l82L61O3n92L09
5225c9K55l64m6L70m67J10L48l83o8L84j26l93N36j81m75O58n2n15L74K33m56
$$ y = [-338, 113, -124, -276, 69, -151, -318, -32, 39, -427, 79, 156, -279, -47, 260, -241, -98, 103, -77, -26, 217, 45, -95, 209, 228, -147, 314, 239, 2, 414, 301, -61, 154, 450, -24, 133, 534, 13, 18, 426, -23, -110, 406, 136, 50, 517, 99, -187, 116, 217, -401, 32, 299, -44, -60, 341, -34, -95, 154, -106, -40, 258, -66, -239, 246, -139, -296, 202, -36, -474, -19, -16, -237, -65, 189, -400, -363, 71, -286, -49, 87, -358, -379, 16, -77, -277, 95, 141, -580, 23, 75, -401, -73, 216, -333, -189, 325, -307, -237, 387, -51, -287, 459, -56, -178, 316, 210, -175, 200, 302, -395, 9, 546, -176, 131, 318, -159, 22, 524, -24, -74, 512, 276, -78, 416, 292, -216, 317, 303, -101, 102, 559, -84, -44, 421, 51, 46, 391, 16, -136, 313, 189, -337, 255, 202, -180, 181, 244, -348, -39, 216, -148, -194, 176, -291, -181, 167, -216, -284, 100, -26, -419, 117, -64, -539, 119, 67, -448, -74, 159, -297]
5246b97J52L9j60j17N42l18L5J46n8l45L69J01j75J73M1m18K81L8j41M4L38k45
5268B5n0K50k95n4L07p4l76N09j35k80L21j84k49M47K10l98J78J81m46K74K60
5289D21k77j20L26l27p5L20k48p9N05k64m76N85N9m81L41P1m29R6L14m99K3N01
5311B87n39K69K81l81k64M15m9k54K63J5n39M32K58n23J86K04k91p7M83l48k27
5332c99M17j80j87M39m4m97M27j3l43K31J41l18N7L81m24J50M02k58j76L38j81
5353c7k51O00j41m36M32L1m41L44L65o26J81M10n57R5N43m75r1L41j9l64K08N9
5375A71j15O2K58j32j35J82k82N6K23r5n0NM7k20J52L7j43J13k3l3K7L9j79m3
5399g8J09kj26J64j75p8K02n1o2J60k26l2O3L6l02L24j2k13J92J2p8n7K11k51
$$ y = [-297, -145, -106, -266, -383, 159, -159, -124, 22, -36, -381, -12, 89, -86, 87, 128, -290, -9, 29, -112, -68, 270, 25, -25, 225, -70, -124, 183, 109, -267, 242, 107, -173, 148, -36, -285, 162, 372, -26, 152, 333, -113, 161, 421, 144, 24, 350, 23, -52, 268, 20, -59, 446, 182, -294, 291, 350, -131, 210, 281, -148, -52, 262, -237, -214, 287, -252, 17, 298, -83, -347, 68, 19, -235, 28, 43, -496, -64, 194, -329, -143, 61, -230, -307, 176, -172, -399, 18, -162, -349, 90, 46, -451, -24, -37, -380, -149, -8, -326, -269, 112, -312, -162, 240, -18, -194, 144, -37, -288, 312, 171, -265, 167, 198, -243, 101, 466, -160, 21, 431, -126, -31, 512, 37, -54, 287, 268, -96, 112, 171, 56, 118, 376, 244, 109, 291, 9, 65, 288, 193, 143, 148, 195, -25, 127, 164, 21, 134, 111, 78, 105, 144, -35, -78, 31, 29, -97, 67, -108, -186, 16, -35, -97, 63, -163, -195, -132, -96, -398, -74, -86, -299, -107, -95, -173, -230, -19, -270]
5423b70Q1K73l50O8K55k37l06M83j32J6K10k01j42K84Q3k38J95Q4k52j68M66r5
5445A07P1n0k31J68M3k56K49j47MJ42np8k8J27r3L9J50Ql01P5J75j14J97n7j13
5470H2j40K59Q1k88K15r9n4R6J2j73R3L2k05j36K49n8J23J14l31J61K12l93J16
5493c2l1J48k42K27n9j00J05o5j50P9J43k49M1KK5Pn9L6L2L6n2j03K37m5j35M2
5519a62k0j02J68l7J97j5j38R7J98k74OK22l59M87m77K18J66j15N6k6M7k29J57
5542F5J53p6r9J9n5J38j07%J40k49J96Pk04J86K19l83J34J45j48J2K5J5j80J73
5566A26p1J27k14R7mJ36r9l7Q4P2k51o7J25j94R6K68k20p6j1P1Oj77O2j1J86j36
5592a12n0J06p5n2nN5j65J32j57J60O2k0l5o6J73j14J40n4p4J69J07j01r5J02
$$ y = [-270, -189, 84, -266, -198, 57, -180, -486, -3, -135, -119, 91, -110, -252, 32, 115, -123, 72, 156, -96, -264, 202, 107, 178, 128, -103, 65, 108, -148, 101, -46, -42, 100, 95, 17, -11, 116, 23, 62, 212, 220, -81, -6, 169, 55, 252, 195, 82, -58, 201, 282, -6, 209, 110, 56, 152, 164, -9, 84, 116, -89, -225, 24, -34, 89, 203, -128, 33, 245, -148, -32, -63, 85, -157, 70, 11, -89, 16, -49, -199, -120, 23, -226, -185, -183, -158, -151, -210, -174, -142, -106, -158, -261, -24, -69, -204, -162, -182, -284, -116, -153, 44, 29, -109, -12, 186, -88, -82, 140, -219, 268, -209, 9, 175, 60, 116, 90, 137, -92, 65, 218, 142, 43, 62, 7, 145, 38, 38, 178, -71, 125, 132, -72, 114, 333, -50, 84, 229, 81, 93, 118, 133, -47, 126, 55, 182, -32, 65, 61, 197, 98, 61, 145, 217, -34, -101, 24, -170, -74, 194, -26, -102, -113, -42, -36, -213, -151, -162, 24, -112, -162, -56, -131, -183, -188, -133, -298, -166, -323, -163, -101, -121, -156, -222, -49, -163, -23, -77, -151, 18, 125, 24, -71, 31]
5616C1p8l54M17J5k56K69j40J26p0K13j51r5J94M5j60Q0N5kj8q7J8J82j87O6l9
5641G4J85p6j82J94j30N7R7m3r4R2K0L0P6j57j99K12k07rJ10M4n7j9Jj44J92P5
5667A42j66Q2Lj61J15J1r4KO1p2p6J6J42k53J92J5j84K6Q4l8j41L12r9o2K54k77
5693a66k15M47k51k5N3K7j34J0K81l06J57J46j39q9K27j23P9J14j62P2J13o9J2
5716E9Q9r1N2Rj06J86j13K6j16J87k6j69J85J40k25LK17k29l1J68lj43K12m3l8
5741B00j21J47k61K22k56K95j27Q6m2r6p0J39j33M2N3o8J1N1k27J31rp1l6k9J24
5766d5o5qq6J30P3p0J55p0k70J58J5j19QK12j93o5K32j14j26J42q1N1N9N3j06
5791a30O4J93j93j81J01J77k01L05K0l25L43j20n1o5J75j61J74n2l4J84m9m4q1
$$ y = [31, -47, -401, 16, 31, -225, 44, -96, 30, -40, 173, 22, -73, 121, 166, 6, 86, 141, 139, 121, 34, 52, 234, 47, 113, 74, 259, 183, 1, 195, 65, 122, 219, 176, 82, 174, 194, 224, 300, 143, -56, 156, -51, -60, 50, 94, 37, 18, 19, -125, 67, 142, -24, 58, 61, -100, 15, 26, -68, -66, -5, -77, -153, -137, 5, -248, -56, -41, -225, -199, -115, -153, -294, 18, -81, -143, 111, -166, -381, 66, -185, -210, -157, -130, -264, -254, 27, -279, -122, 24, -115, -204, 23, -100, -21, 93, -69, 3, 116, 47, 59, 148, 57, 109, 118, 12, 198, 85, 111, -5, 182, 156, -13, 172, 312, 87, 90, 307, 78, 47, 215, 212, 69, 281, 238, 200, 79, 226, -35, 187, -69, 226, 99, 185, 143, 47, -23, 116, -17, 25, 78, 10, 21, 72, -155, -24, -33, -104, -140, -169, -45, -110, -118, -204, -74, -1, -71, 84, 14, -256, -98, -83, -202, -194, 18, -175, -240, -8, -122, -248, -106, -187, -136, -77, -24, -130, -66, 127, -66, -247, -146, 31, -170, 135, 155, -170, 173, 53, 2, -63, 112, -49, 125, 73, 39, 223, 174, 130, 49]
5814D9J59J41j66M2j50l6K11q3k09L43j73j4N5r4K4J22O6r7k5m2o3R2j63J13J43
5839B45l38R9p8L2rJ60J9Or4N1pk22K5R0Q3j39M3n3Q9o7LN9k75J63j16J14m4j7
5867a78O3J02j12K65l97J97kj1r8J79M3j66j46K56j27q3J77M8l2K1M0j66K73M9
5891A95k82Q9N5R8j81J92m4l3N5J70k91j%J9L08k38l4J20j23k17L73k16K71k61
5915B4J26j77l9K27j90oK44k96J46l8r2NJ51k58J38K8l1Q4j25Nj2J30j14j12J59
5940b3N8r2QK2q3o1K03J0j90M7O3k25k6J35j09J51L6J8j13l6o7K86k56k1O1P3
5966a31P2k9K7J8o5MJ41l32K05q6k8J91J46k02M1N4QJ6Q7k86R5L11k04l3J44r4
5992G0J19j00K1j28Q7K04k71j2L05l75J68J18j30N7N1pq9L8O5k60J77j04p4L23
$$ y = [49, 208, 349, 183, 225, 75, 39, 250, 167, -42, 301, 128, 114, 169, 75, 99, 221, 287, 190, 165, 123, 60, 152, -11, 102, 245, -93, 6, -72, -40, -49, 111, 130, 136, 42, 93, 86, -136, -111, -21, 62, -77, -34, -87, 2, -65, -62, -3, -278, -115, -231, -117, -161, -178, -115, -13, -125, 140, -257, -60, -62, -73, -171, 8, 51, -115, -261, -5, -132, -215, -38, 10, -22, -1, 39, -127, 146, 195, -87, 2, 57, 155, -26, 166, 122, 89, 144, 314, 23, 22, 22, 41, 349, 111, 77, 197, 74, -143, 230, 14, 285, 24, 150, -27, -66, 161, -29, -35, 209, -87, 59, 21, -71, -66, 85, -173, -35, -7, -38, 46, -79, -74, -86, 44, -70, -182, -23, 35, -57, -49, -27, -110, -171, 32, 42, -148, -101, -38, -263, -289, -154, -263, -112, -76, -58, -171, -207, -274, 12, -244, -265, -204, -131, -59, -88, -61, -43, -108, -104, 37, -295, -90, -176, -204, -13, 133, -69, -28, 26, 34, 50, 137, -149, -54, 257, 53, 20, 164, 70, 189, 89, 110, -18, 69, 273, 2, -10, 295, -80, 88, 206, 76, 133, 184, 177, 88, 126, 191, -69, 108, 4, -70, 253]
6016B53l4m28L43r6O8j23K52l25O6J35k25M4J49m2k79P5P2J94l7m9j27j01L43
6039A28l52r8K28n8q5L56m96K89j34J18j4lM0n0K35k69Q7J23K01l51n9O4P1l8
6063f7J33r1o1P7j06r2K55j84R8J36K6j57L7O7j5jJ39j66j61L79k91r7K77M9j11
6088G3O4K1l7p3r9J80l1K9n1J02r9j37J96o8k10J77N9j06P4J00j75J08Ol40K77
6113D0pj81L5K9J37q2lJ7j62J03k7rL9J62m43J41N0J10n0N9n4nJ6j3q5J34o0J34
6141B5l45L25o4r6J48K9j30l7J0L3L2J36mj10N2p5m0J6K29k40n2K80j74m8k5j03
6167b28K24rJ38k06K30R2L7J6k62N3J28m1k9j09J12J06q6J93l9j77J3O8k29L1
6191B6LJ66k20QMK0n1K60J13k05j52M6J6J19l16kJ27o9O8j28J03P9m6K3p5k8J16
$$ y = [253, 219, -209, 134, 38, 106, -17, 235, -90, -24, 111, -114, -70, 79, 37, -242, -167, -95, 99, 62, 13, -114, -215, 128, -224, -322, -94, -152, -237, 119, -377, -88, -222, -104, -118, -121, -81, -131, 104, -165, -78, 45, 246, -105, -164, -100, -29, -67, 66, -25, -86, -9, -115, -207, 48, -136, -38, 98, 124, -33, 4, 71, 56, 55, 194, 28, -133, 246, -45, -142, 135, 184, 73, 137, 158, 121, 48, -51, 129, 98, 127, 76, 178, 79, -58, 138, 70, -140, 37, 96, -10, 64, 164, -11, 97, 103, -237, 40, 33, -148, -113, -84, 53, -29, -32, -15, -177, -74, -101, -110, -71, 91, -352, -211, -161, -51, -101, -42, -96, -101, -85, -98, -183, -49, -109, 25, -320, 5, -59, -155, -7, 22, -108, -145, -135, -102, -70, 66, 62, -48, 4, -71, -111, -95, 134, -106, -158, 122, -52, -100, -125, -228, -4, -13, 125, -81, 149, 241, 278, 294, 32, 85, 213, 172, 143, 34, 146, 252, 166, 359, 320, 143, 156, 224, -5, 26, 29, 195, -25, -17, -13, 7, -44, 216, 329, 124, -28, 18, 34, 153, -163, -165, -38, -107, -39, -167, -64, 15, -31, -8, -83, -111, 5]
6218En4J14l89L54Mj48J11l6p6K1q5M4p4J58M9j10L7K0j7m0K92k10j65NJ50K3
6244a7%R2j04n8K76j66P6p8K2o4J90k24Q7j48L84j29m7j45J42K8n2j93R3J67o0
6269G2K3J03l42K12K59l21P7M5j75J3K31k35j63K99n9n9J67O2k02J29J8k98J67
6292B3N0k12J00K31j43j25J61l4j11N5r2j00K05Q1l05l1J32j49M13J11l21j32
6314a93Q8P8r0J26j0k09L68k48j71K38R4l36K64K01k34p1K71j61j21K08j18%K17
6337A91j07j18kj2j42K62J56m46J00K19j37O8J66l05J99O6j77P9K67k02k12K90
6359B03J6l45K98j6l51L67O4k48L2R5j32J82K9j93n7J21p2p2K24k23p6J58K9j66
6383a33K13o9k2R0j8r0o2L19n68J34K99k65j3J15r4p7K51M1l54K12J61j03Q9j06
$$ y = [5, -49, 65, -324, 30, 34, -114, -3, -39, -115, -94, -179, -135, -209, -51, -2, -112, -75, -55, -72, -112, 180, -30, -195, -190, -40, -17, -17, 75, -29, -87, 189, 23, 99, 21, 43, -21, 169, -55, 32, -116, 268, 139, 92, -53, 89, 117, 65, -128, -35, 132, 72, 95, 198, -144, 68, 327, 6, 83, 128, -47, -34, 197, -38, -201, 98, 39, -20, 147, 209, 7, 136, 154, -144, 23, 73, -139, -39, 192, 49, -76, 85, 51, -60, -5, -97, -197, 8, 89, -216, -247, -115, -264, 149, 260, -61, -193, -105, -27, -117, 9, -1, -210, 158, -90, -261, -23, 71, -265, -1, 200, -34, -105, 166, 5, -116, 92, -26, -26, 191, 84, -34, -36, -48, -190, 72, 228, -218, -118, 101, -36, 32, 198, -107, 92, 158, -19, 60, 327, 125, -87, 203, 219, -126, 172, 156, -195, 172, 236, -12, 20, 115, -17, 165, 194, 1, -56, 65, -7, -79, 145, -78, -154, 4, 33, -133, 80, 11, -11, 79, 61, -29, -91, 228, -340, -206, 93, -172, -185, -70, -164, -241, 10, 51, -303, -91, 70, -33, 56, -50]
6407e0k31K07J67l74K64N5j83L5J47j99L5K39j10j36J17J1k12K38R4j48J84J38
6429B88l73P9L15j73k72N41k77j4P8M3k78L56j22l38J98J30k13J06K57l30N3J68
6451B22m04K37K92l01J3K07j89j89N55k66j82J48j1k47J93K06m76K25J23k69N9
6472e4J90j38q6L16N4o06M30m0j96J11J08m98J96K55q6j10K16k14LK93k66j72
6494b94K49n9k25L46k9k49K08J79l94K89P0l51J10L19l82J28J79n9m9J14j54P6
6516B2J00M2k21J70o0p3N0K33k51K7L4l19K46J31n7j03K37l65O5M18j81n2KL9
6540A34l55K98K09j80j23K78k06j65K46r3o5K49l36R8K54k66pO8Q5k02r0K86j58
6563d1J17q5k10L04j6j97j1L65l29l2K89k68R3P2p8k01L00j93j04K08l8j89K52
$$ y = [-50, -281, -74, 93, -281, -17, 38, -145, -110, 37, -162, -127, 112, 2, -134, -17, -6, -218, 20, 114, -34, 150, 288, -85, -6, 309, 136, -136, 405, 128, 114, 192, 235, -43, 313, 191, -147, 51, 181, -32, 74, 331, 1, 54, 222, -182, 55, 347, 46, 59, 266, 77, -112, 443, 177, -5, 143, 132, -115, 78, 284, -192, 33, 156, -113, -54, 136, -2, -88, 228, 282, -324, 106, 66, -130, -19, 89, -409, -213, 42, -44, -154, 62, -152, -149, 144, -122, -294, -45, -104, -329, 17, -12, -261, -53, 126, -268, 21, 91, -260, -150, 169, -213, -85, 94, 35, -14, 100, -54, 22, 122, 164, -57, 113, 53, -20, 30, 263, 12, 39, 73, -246, 0, 131, 74, -29, 208, -157, -92, 326, 145, 93, 95, 134, -221, 77, 286, 106, -17, 261, 55, -110, 136, 43, -22, 227, -109, -11, 243, -23, -30, 38, 123, -79, -169, 117, -41, 76, -9, -219, 85, 69, -128, -139, 226, -103, -135, 154, -114, -21, 51, -27, -228, 72, -121, -225, -17, -55, -244, 8]
6586HL7k47J45L0k60QL21k64L1M16k83j70K27N7k47L27k6n7Q4q3L9j33K05k36
6610g1m0K98m6k53J37p3oK50q1q5o9K37k95L23J9j03M9M1j31j44K82k49j7J14
6634H7Nj06K0J06L9r2M1p5Q6M3k25J79j08R8o8P2r6m6K80l51J73j58J50j80K18
6659I2j49j22j6K33j65K5P8J5PO3L1k79J61P7j3jj37j14J66N4k81L23p1p8pK22
6685A14l27R6J31n9K7R8j46p8L03qk53Q6J17j63J58n0n6n3P7j09K06k2m6NJ51
6710A99j6k90K45p0j23K32j40M8J5k06O4J15lj4lN0l2n3L4l9J42Nm9j30J71l5
6736A17k11N8qp6R9M4P5p2J23j14Q6k85K6J74k78K73j4r8J02p9J23k30j0J40m6
6761h1k0N7M8l0M0j07O7K13k00j51L3K48m00J08K28l0j18k2M0k00L37j80K0j1
$$ y = [8, 45, -202, -57, -27, -287, -279, 42, -222, -191, 225, -58, -228, -1, 56, -191, 136, 110, 53, 137, 54, 93, -40, 165, -71, -111, 187, 141, -112, 25, -48, -54, 196, 115, 30, -39, 198, -97, 226, 245, 142, 191, 232, 101, -43, 239, -10, -27, 87, 92, -14, 6, 112, 151, 59, 100, 25, 111, 154, -71, 108, 0, 98, 30, 102, 6, -40, 240, -111, 62, -96, 54, -126, 92, -57, -179, -195, 38, -127, -102, -24, -9, -2, 61, 92, -187, -26, 51, 38, 37, -100, -214, -48, 6, -275, 48, -23, -101, -108, 114, -213, -117, 14, -45, -18, 80, -66, -144, 159, 151, -102, -16, 101, -62, 96, 46, -10, -63, 14, -95, 111, 89, 43, 48, 199, 183, -107, 138, 68, -55, 177, 37, 85, 100, -106, -42, 73, 70, 56, 53, 103, 71, 18, 52, 13, 155, 160, 111, -19, 152, 117, -94, -36, -44, -120, -21, 23, 98, 26, 149, 35, 121, -164, -138, 36, -242, 31, 17, -81, 21, -58, 65, -165, -175, -35, -81, -101, -44, 4, -26, 14, -93, -26, 187, -13, -164, -131, 117, -283, -175, 53, 23, -95, -117, -77, -277, 60, -120, -100, -111]
6785a11K09m7op0j1J70j7j75O9M1r5N9k9OR6K8j15J76j44J59j06M4l8q3MM5J01
6812A60k4j28j10R1j10K47Lk4n4j82K17ml5k69O5K45O6Q6j57j3qq5Q3o8m5l2o0
6839a45K89k04o9k0K03K7j62N6rL0r9N4J92k38jJ40k21J09J72k40J72k47J59J67
6863A15j26n7q7J80k02n1K87O0k45M9N7j46J24j22J75l3j14J89nj0R9k06K61N
6887A97k53N1R2k58L16O7k98M19l17J29M8P0l56N1K59n9j87M4J1n6J7o%L8m2K5
6913Bq8J03p2R9Q6k28J28j68K38j36J07K5oq4L8j2j62J42kP9j07k35K57N7j43
6938h2J49q3k20J58R8j87J52p2j13K4R4N8O5L0j00p0O5M9n1k03K88K8k04K11q5
6963am3k47L85r9nKj73M23j33j13j06Q1M8K9j63K5J25R7Jo8n1o0K27j17j3N6l3
$$ y = [-111, 98, 51, 45, -25, -36, 134, 117, -58, 11, 52, -43, 16, -13, -7, 89, 117, 2, 178, 34, 193, 87, 131, 93, 10, 14, 59, 160, 136, 8, -102, -11, -121, 126, 129, 105, 51, -131, 86, 82, 47, -222, -157, 88, 154, 240, 83, 70, 62, -23, 60, -8, -53, -85, -145, 144, -60, -129, -149, 54, 81, -81, -25, -34, -4, -103, -49, 143, -95, -96, 44, -177, -68, 104, -136, 36, -211, -52, 115, -11, -68, -155, 25, -177, -228, 59, 119, -126, -77, -20, -166, -42, -164, 11, -22, -136, 53, 48, 38, 137, -69, 192, 197, -56, -5, 87, -171, 145, 212, -86, 333, 16, 145, 193, 263, -93, -42, 217, 158, -29, 15, 26, -30, -13, -19, -19, 19, -23, 2, -86, 17, -55, 44, 130, -98, 30, -138, 100, -36, 71, 96, 90, 6, 44, 32, -130, 12, 10, 89, -18, -253, 4, 61, -82, 67, -16, -236, -78, 20, -167, -15, -87, -200, -176, -82, -24, 41, 71, -29, -99, -34, 15, -36, -239, 49, 77, -127, 84, -1, -44, -291, 94, -5, -10, -8, -181, 242, 109, -4, -110, -29, 19, 48, -115, -90, 35, 132, 133, 65, 14, -46, 181, 64, 51, 107, 74]
6990G4j15J52p5n8J06j4p6J50o7p8K37j99J08M4r7j22KJ8K59q4j15p7q2R7j45
7015a57J09P9j22K48o9k48J16j1%l1K3o7Jp3J53P4o8n6o0K49q5j16O9OK5Qj5j00
7043a18q0O3M8K14k15M4J83j02J3j3l40L82q2pj8n9J68rl9m6J18k32k8K65m6M7
7069A11k5J18k12K53n3j09J29J08k05l7J3n7L5n0J00k37J44nOLk7R6m8nK70j85
7095A31oLk63K46j61l7K45k73J03l6J68j70P1j58pJ90q7o6M5RO0j86J14J14k28
7120a79K39q6%J41k48J15j2l7j9J44M5j96j1J40L5q1J7j06P1O4q8OJ34j97R6J39
7146A26p3l8p5J30k31k4K47r6R1l2r8J73J5j76Q3qN7O3k86K89r2k4K20k48K44
7171B37J4j52m0J75k38R4Q0j25j6J71N3k15p5L0j38M3J71j35J75k28J85j7j1k13
$$ y = [74, -41, 111, 36, -22, 84, 70, -6, 144, 77, -1, 236, 37, 145, 189, 92, -30, -28, -10, 249, 165, 50, -27, -109, -12, -157, -48, 31, -91, 157, 88, -160, -44, -55, -55, -86, -63, -130, -129, -202, -49, 25, -43, -99, -159, 90, 5, -111, -42, -36, -11, -3, -18, -118, -198, -135, -87, 127, -88, -44, 139, 37, 50, 37, -303, 79, -3, -10, -28, -87, 81, 72, 33, -13, 105, -127, -155, 110, 64, 111, 86, 204, -8, 245, 192, 83, 212, 320, 115, 78, 91, 34, 69, 19, 119, -118, 26, 21, 27, 30, 3, 99, 51, 46, 316, 131, 125, 128, -135, 111, -50, -87, 158, -115, -12, -48, 120, -50, 21, -137, -144, 46, -41, -107, -62, -53, 7, -179, -65, 49, -179, 60, -26, -26, 115, -133, -18, -30, -67, -86, 58, 103, -93, -104, 36, 71, -10, 7, -99, -28, 36, -52, -46, 88, -109, -13, 126, 53, 15, -60, 70, -161, -185, 62, -34, 57, 25, -73, 100, 115, -61, 22, 14, 71, 134, -152, 137, 45, 21, 241, -7, 237, 251, 99, 59, 234, -4, 90, 170, 45, 29, 200, 253, 38, -37, -7, -145, -102, 69, -66, 109, -119, 66, 49, 38, -175]
7195a75J61k8M7j1j28J20N8m1j34J43MJ60j68JK1k32L09j30j09NL29k24j26J51
7219CL3k09K72l25O0J49J35k28J09o6M5n4Q2M0n8J63k43LL0rk6K27L9j47M2J36
7245B03k60P9j68K27n5J01mk28J08N4j15R9J68j12Nj3k42Q1J05O6L5j15o6J66
7269A19Q1k22J76k5p2j10K27j26j14M7o0R3k9M8P7j75R1p3O5k25K00j13J1J42
7293C3j95KP3Jp5O9N8Q5k05j1J04P4lq4M5k2j26J34Qj09K07r5p0J93q5L6n7l4
7321d9j63R9Q7j3j91J74r5J27K6j13K77j82J9Q8q8j50P6Q3j67K60P1k60J55k7
7345D4j45Q1L10k81J59L5j32O7j80J67j41K07j27j49J53m0j6N2Q5j19N8r3j5j
7369b1J18K9k81J04M8r7J9J32o9N5J07j40n5j00J36J2j13N7o2R9r6m0qL66l94
$$ y = [-175, -14, -42, 5, -6, -134, -14, 44, 3, -131, 12, 16, 176, 8, 9, 30, -202, 107, -23, -132, -127, 202, -22, -148, 3, 36, -173, 99, -226, -166, -17, 118, -110, -1, -67, -22, -76, 6, 46, -12, 151, -92, -89, -59, -68, -94, 133, 172, 25, 67, 203, -57, 22, -146, 81, 26, 127, 123, -105, 3, 57, -58, 41, 209, 97, 102, 89, -153, -72, 33, 99, 134, 19, -47, 119, 200, -22, 154, 129, 57, -53, 174, 48, -66, -19, -79, 14, -15, 33, 110, -65, 26, -47, 18, -207, -7, -120, -109, 33, -162, -160, -87, -86, -161, -92, -34, 51, -154, -165, -61, 13, 10, -74, -29, -51, -177, -43, -35, -144, 63, -32, -102, 91, 6, 42, -15, -49, -212, -113, -26, -39, -230, -56, -151, -24, 2, -111, 166, -16, 3, 91, 3, -147, -71, 12, -155, 105, 176, -84, 71, 44, -101, -20, 290, 9, 168, 203, 71, 138, -42, 125, -16, 191, 64, -85, 68, 28, 12, 64, 149, 30, 88, -5, -20, -21, 97, 126, -155, -51, -3, -100, -81, 51, -18, 37, 144, 4, -51, -151, -15, -3, -116, -59, -121, -22, -118, -158, -166, 200, -194]
7394a94J30M5K5mj0%j03J16q3l5p9N0J81j7Nm7j93K20ML5P7j39q2K70j91J15o2
7421C4N8l7n0J70j26o2J80j58M4k1j55Q5J68k5L1j20L9L1oj03kJ66j41J43o7l3
7447D3M1r8OO9K66l38O6L7o1j0j68J02J93j02K1o9M9Q5pr7K0l41K84o4n0J14O9
7474F0r6O8j65K9j5J80j07M6j2r8m4J82n7q1Q4L8j36N1NjL2M8J8r1p4R8J8r1J24
7503A3N7r6o6N9j31K49K4j22j1Q3Mn8jP3l6KL1O3j42N3O9j89K93k42J48N8l3k10
7531e8P1j0L65j65j06J21j85J57pM4k39L8J05J06j57Q1j03O8m7k8k8P9j87O7L4
7556A6L9oj87J60p4J50q4M9j43K0n2J51j42M8q3j22J92RJ82j8j06n0o3Q6p8J66
7582F0m8qn9J44r0j62K88o8lk32P7J37j54K6K4M3l3M6m8N0Q0j71J91p4J09O2j13
$$ y = [-194, -64, -19, 6, 2, -8, -8, -111, 5, -78, -113, -192, -142, 39, 22, 27, -20, -213, 7, 11, 46, 123, -16, -98, 172, -19, 96, 34, 92, 55, 5, 175, 49, -13, 167, 9, 53, 32, -123, -38, 130, 105, 136, 16, 55, 86, 80, -23, -25, 141, 0, 143, 76, 43, 84, -14, -8, 61, 327, -11, 55, 92, 31, 21, -147, -45, 148, 46, 67, -2, 47, 132, 125, 28, 48, -293, -9, -73, -123, -9, 60, -36, 32, -133, -104, -119, 61, -46, 0, -12, -110, -154, 28, -29, -110, -26, 12, -124, -73, -68, -69, -37, 11, 29, -62, -136, -38, -20, -111, 13, 70, -26, -92, -33, -164, 85, 109, -13, -24, 59, 63, 5, 4, 77, 41, 43, 74, 137, -5, 48, 117, -72, 221, -21, 127, 185, 152, -58, 13, 3, 368, 203, 97, 218, 33, 190, 183, 227, -12, 26, 131, 237, 80, 161, 58, 126, 79, 51, 23, 102, -85, -18, 16, 55, 49, -138, 22, -52, 98, 14, 63, -80, -60, -112, 39, -103, -55, -138, -260, -68, -59, 123, 105, -1, -51, -114, -28, -106, 60, 12, 4, -55, 89, -1, -163, 125, 57, 54, -178, -101, 36, -118, -92, -68, -25, -58, -12, -60, -10, 70, -101, 90, 16, 125, 187, 74]
7609G4j49J18j1J09J01j55R7r0p8%RK02n4l0Q6j54k7o1J08r8K21k35J16L8j32
7634EM9M7J0n5R7nj67J14j74K08k74N6lK07j09M7j42l6L08j98j58R8L2k9O8j7
7660b1R8k25J62J4j60J35k44O8Q7O9j07J10q0r9J56J1k9j28J94j67K16L5k26J98
7684F7j0r0J00j90J00qJ12m0rO9q8n9Q9M2k54R8N9QJ13k15K20k37R0j5J79O8j34
7711F5Q6k34P9%J29j23R3k3k58J45J44q7L3M5k1j01J5j18K24k15O5L6N5K1J8j89
7737a16J53k94L19l7J07p6k09K06r0j66Q0n4K08J7j71l9P6j30J56R9J9k60J41
7760f1K9l0n9N9p2P3p2N6L8p4k6N8J54q9P4j93J41KRjk7l4K36j40J55p6n9O0r5
7789C6L3O8k19J89M5j44MR8M5j47%Q5O3j32K8J3l7J54j70l7K44k08J2j59K61R8
$$ y = [74, -75, 43, 32, 141, 242, 87, 184, 94, 16, 16, 25, 227, 173, 143, 229, 75, 48, -13, 95, -3, 218, -17, 99, 137, 5, 54, 101, 111, 56, 153, 148, -19, 95, -79, 129, -145, -89, -92, 115, 6, 53, -89, -125, 183, -15, -173, -75, -43, -72, -4, -21, 77, -148, 14, 28, -132, 3, -241, -173, -86, -17, -124, -14, -94, -193, -37, -26, -55, -183, 11, -156, 60, 95, -131, 67, 57, -33, 67, -123, -23, -31, 81, 41, 32, 101, 13, -46, 43, 85, -169, -71, -12, -4, 109, -106, 114, -123, -33, -48, 131, 199, 65, 151, -83, -4, -4, 125, 2, 95, 72, -186, -41, 103, 16, 49, 94, 73, -28, -13, -131, 93, -122, -57, -21, 34, 55, 73, -116, 37, -257, 62, 25, 132, 56, -153, 53, -37, -203, -123, -177, 31, 48, -123, -162, -86, -216, -60, 39, 58, -202, -61, -32, -62, -121, -62, -134, -61, -133, -77, -39, -113, -139, -81, 73, -16, 58, -135, 6, 8, 17, 16, -11, -45, 191, 51, 206, 130, 71, 131, 36, 69, 137, -82, 107, 152, 8, 12, 110, 155, 8, 8, 93, 156, 24, 52, 65, 28, 182, 12, -25, 219, 11, 23, -136, 125, 223]
7815B23k57J01r8J4L8j0J1J17l9j53O4r5J02MK1j40K76n6j57O8J0m1k30Q6M7r7
7841a91L3J45l9K37j79m7rJ5m6J23o7l00J98K3J15k23P6J47K8J5M2N3j21k7J22
7866A23j49J30j55O7M2k6J90j84j27K33p4J4p4j14J36J23j50J81r3L1l5k39O6
7889h4J26J03k70K06J15O9m6k93J07n4J60l3j04O2n9j9J36j09Lqk5J20k26L21
7913A98qj05j31J12k2r2R5O1l1q8P2k74R2J64K5k31J66j17n1J70j20K06k52K18
7937E7Q8k12j27J21K3r8M3P4N8l5J9k1J0j94L52k42j6K91q9j13k1P2j73J78p2
7962b7j10Q2p5J44l6O2P3qR1kj53J60j34p7J38j78J07J6KOQ6j68l8j2J76j92J11
7989D4J17J5k15M8j55LN4J54j41P8J16j58J34j84Q8l6nJ54k07j46K34P9j82k1
$$ y = [223, -34, 67, -31, -17, 21, 11, 22, 139, 100, -53, 11, -84, 18, 22, 43, -97, 179, 123, -34, 34, 44, 3, -227, -141, -94, -191, -158, -13, -52, 185, 6, -41, -50, -35, -81, 42, -25, -325, -127, -104, 11, -212, -136, 11, 39, 54, 96, 149, 28, 1, 123, -26, 104, -51, 16, 58, 32, 222, 38, -89, 144, 70, 84, 10, -104, 32, 155, 5, 186, 93, 124, 89, -150, -84, 42, 145, -125, 81, 196, 265, 219, -74, 33, -21, 139, 106, 2, 64, 5, -14, 122, 13, 16, 8, -17, 103, -123, 198, 190, 85, -46, 66, 44, -48, 47, 108, 77, -11, 61, -213, -121, 43, 68, -163, 3, -114, -165, 5, -115, 91, -161, 57, 145, -67, -194, -73, -50, -148, -105, -31, 27, -8, 11, -10, 0, -194, 158, -84, -100, 191, 102, -11, -32, 40, -133, 45, -27, -137, -55, -130, 14, -22, 40, 113, 105, 196, 194, 41, 201, 67, -10, 128, -50, 57, 73, 75, 81, 167, -1, -39, -51, 125, -67, 44, 161, 176, -39, 9, -146, -143, -89, 65, -76, 2, 118, -40, 94, -90, -2, -38, -43, 111, -96, -242, -8, 71, -111, -132]
8013a32r8J83k3m2J27l0j50K97j90K4O2r8O5J65k20J03j57J12N1l6j8Q3j24m7
8037i3q9R7Q2Po9N3K6j58J94J62k54J25q0J8m6J03J55j60k13K20j99P5K57l41
8061a28J64n2J35j41J77k84J46K41j98O9Kq3j31K07j57N9J13j58P0j2n4m0J20
8084F5MK5j58O5j1j12J69o8n9R8m1m9j6J71j33J4P3j91KM8K22l53L25o6Qj97R9
8111f6Q4j67J38J6m5O2j21o2J16Pk13J20mJ68j35K5M4J0J2N0m2l6M4k04K0L06
8137A27j35J48r8k0P0k19J56j76Q0k5N0J91o7l4K7k3J13p0j14K0k4q7L61k19p1
8162c9J39q5J1k8Q6l9N4j19LPj2j1K0Q2j69K11J91k22j91O3j1q0L44j5k69K6%
8189e3P7j61
$$ y = [-132, -230, -47, -70, -112, 15, -15, -165, 132, -58, -34, 28, -70, -5, 160, -60, 43, -114, -2, 49, 13, -5, 78, -46, -93, -182, -85, -3, 4, -65, -12, 14, -144, 50, 212, -42, 83, 3, 21, -25, 78, 233, 73, -140, 80, -119, -44, 213, -128, 36, -16, 119, -22, 155, -129, 17, 258, 60, 129, 131, 48, -83, 124, -33, 26, 139, -19, 51, 39, -15, -55, 65, 69, 94, -64, 1, -10, -122, 47, -21, -80, 18, -23, -72, -88, 83, -50, -36, 37, -154, -152, -104, 118, -235, 90, 24, 32, -165, -66, 18, -149, -11, 5, -40, 22, -99, -161, -45, -38, -251, -131, -135, 33, -102, -77, -33, -23, -11, 39, -3, -39, 5, -199, -179, 127, -8, 140, 42, 22, 92, -127, 29, -147, -67, -92, -42, 149, 82, 48, 75, 52, 165, 95, -19, 1, -23, -110, 251, 32, -39, 100, 15, 26, -2, 84, 45, 99, -20, -17, -10, -22, -33, -13, 69, -100, 111, 302, 80, -111, -48, -59, -139, 205, 190, -79, -53, -53, 24, -137]
8191a37
$$ Imaginary data points
##PAGE= N=2
##DATA TABLE= (X++(I..I)), XYDATA
0@%%%%%%%%%%Qj6J6k4L2l2M0n6O7p5Q8j04J26j50J76k06K37k74L15l60M13m70
32b49N31o01O77p60Q53r54J064j186J318j462J620j792J980k185K408k654K924
49A532l221L549l909M309m759N264n833O485p239Q121r171J0440j2010J4012j6659
64i089K0331k5747L4497n0799R0423l40970l12018J103177m05517n20252P97649
75C81685j06515o23664M98672j0407m61170L95387N3712m48276L00266J38964
85A18654l38314J68511J87470j47449J05596j1447j69069J24600l364j60658R7912
96b7558N611m8377J13732p9279k5966K00131j52280j25909L02665k8171k81012
107a46413R6383P5234q3451K8503j0149P4156R2955k10342K1779K55925k14607
$$ y = [0, 0, 0, 0, 0, 0, 0, 0, 0, 0, 0, 8, -8, 8, -16, 16, -16, 24, -32, 35, -40, 48, -56, 70, -80, 96, -110, 127, -147, 168, -192, 221, -249, 282, -319, 358, -402, 451, -503, 561, -625, 693, -769, 851, -941, 1039, -1146, 1262, -1392, 1532, -1689, 1860, -2049, 2260, -2499, 2765, -3068, 3417, -3822, 4299, -4872, 5568, -6442, 7570, -9089, 11242, -14505, 19992, -30807, 59616, -281354, -593372, 509805, 104288, -415964, 381685, 275170, -348494, 150178, 139771, -321399, 73988, 127700, -320576, -20310, 118654, -219660, -51149, 136321, -11128, 94468, 83021, -86048, 38552, 35188, -125470, -27558, -21947, -70324, 43408, -35871, -61837, 138294, -13986, -139895, 162770, 134599, -146413, -50030, 25204, -58247, -29744, -39893, 34263, 127218, -83124, -61345, 194580, -20027]
118b0027q5066L18305j79320j98260K81471j49726j96784L83886o1309l13265
128b20095L07992L5022k92480K64045Q0007k76975K07409M4017l19988K02428
138C1382J03785l53746J55775K29891k80125L6489K03464j73039M1917J41731
148A37524j73698N7389J22444k31724K2307J70398k08158j5319K24527j21764
158a6074o0894J67686j04966p3042J76134m7305j07900J09373k1962j08332O7188
169b0094K7291n1365M0858K6352l2671Q112R955k1752l813L3070R604o0055r606
182d4114N8017m8213l5302J01685j9184p3586J07203O310j10446R0819K7748j32480
194g1543Q3403N6723j63125N1258J02881j42475L9196J44763j31882p853J57164
$$ y = [-20027, -105093, 213212, 33892, -164368, 117103, -32623, -229407, 154479, 93170, -220095, 87897, 122919, -169561, 94484, 174491, -102484, 104925, 148942, -171046, 31382, 135167, -218579, -62804, 167087, -113038, -76549, 126915, -46124, -4207, 137524, -36174, 21215, 143659, -88065, -65758, 104640, -103518, -118837, 105690, -16074, -76968, 90718, -14248, -87290, 88844, 41539, -66361, 43012, 21050, -87282, -20094, 7197, -44168, -3310, 23042, -9629, -1517, 8438, -13314, -17127, 15943, 25547, -34508, -44114, 13903, -34310, -69612, 32073, 12889, -60697, 46506, 52816, -57630, 33189, 60937, -71543, 11860, 68583, -94542, -43284, 59597, -82878, -43682, 101081, -30801, -38654, 118510]
205A18510j14686n8573J52132q4441r0171J41764n1812j13782J35530P89j15756
216h0496J19576L8170j35809O8278P5411j16076J9272Q5063q8363j5572Q2623
227E2077o0417l6629Q3499k5982n4081P0278K686p0894M6847L7163o3760J6692
239b521M7280o2597j0317O2752m6318l5134P7937j2176o1343O0952J6847p1868
251c6506L2540L4280o2902J3645L5665n8352J2049N6595n0147j622P2608l9454
263H399l5812O0138k4913n3763M7113k044m9297M1015J5051m4551L4467L0476
275B6279m3094J5040L4091l9718m812L1077l0645j0580L6031j8761j6742L7111
287A5277r378k9835K9959N578l2630J9881J9996k5690R533K2226k2582MK1824
$$ y = [118510, 3824, -54749, 97383, 12942, -77229, 64535, 12723, -101059, 34471, 35260, -80496, 39080, 77250, -58559, 9719, 85130, -30946, -11674, 73389, -14974, -30546, 52077, -8340, -44969, 38530, 12548, -41533, 28745, 31431, -39463, 7384, 44547, -19213, -2521, 44759, -17838, -28155, 34597, -11721, -46855, 31082, 18906, -42437, 18515, 35362, -36506, -3966, 30314, -32588, -18943, 16722, -41630, -29581, 27014, -23133, -24755, 47853, 8399, -27413, 32725, 7812, -45951, 1162, -882, -50179, -9164, 5887, -38664, -4197, 26279, -16815, -1775, 32316, -7402, -12214, 18863, -11782, -22362, 13669, -5092, -21834, 15277, 5899, -23936, 6023, 11601, -21029, -1148, 18848, -6842, 2691, 24917, 2335, 2339, 24163]
300B4163k2387q577K4177j6747j6330K7436m601k0267K5661O223k3828J5528Q550
313A9001k6688P866J5035k1407O269K2682j7555k530K1566j7954j4502J8811j1047
326d53j8227J8449M7j6211J7635Q770j4197J2617J0882j8402J713Q276j9609m646
340a3356J3258j0204m499J5997m130q167J1761j945j0856Q759K980j0282N959
353d725O450r490K437Q053o645j488O982n578n956N273l549n040P556K230l941
368g431O211L909o821J536N407m719K7O283k305r50L552m827k056M682m646l588
384e736P837j310n576O781L630k660M381K206n13K115n399m231N024m286n663
399c400Q162J18m967O699j773m586Q206l194p441J1926j376j1861J0147Q16j2254
$$ y = [24163, 1776, -6801, 17376, 629, -15701, 11735, 7134, -13133, 12528, 18751, -5077, 10451, 19001, -7687, 179, 15214, -6193, 76, 22758, 5203, 2673, 24239, 6285, -8217, 10594, -453, -18680, -231, -184, -16395, 1240, 10010, -4187, 8430, 19312, 910, 2623, 10899, -8710, -13356, -98, -10302, -14801, 1196, -2934, -11101, 660, -1285, -12141, -3382, -402, -10684, -4725, 1725, -7765, -5328, 2725, -3920, -5408, 1574, -4004, -9960, -4687, -8236, -13276, -5720, -3490, -7431, -1220, 2689, -4132, -2596, 2811, -1908, -1881, 4402, 2097, 1147, 4699, -128, -2184, 2498, -2148, -5736, 2101, 791, -4785, 1996, 5626, 2966, 7347, 9553, 9040, 11155, 5756, 1525, 6549, 2263, -3400, 4762, 4880, -87, 6612, 4839, 253, 8459, 5265, -2176, 9750, 8374, -3487, 6660, 7476, -4778]
414d778J0765J449j4021J2903L606k0620J0750J1157k0662M541J4922j5689j75
427e852J0823j3667K120J2305j4001K587J6661j3320n028J3887q966q095Q500
440b046n175l146O091m749N13O765k886L089L118m753N379k396j1108J0138l70
455a536j4520J5233N215j8475J6468P555k4986J5729J2816k9862J2960J9784l0749
468a4368Q417K5040l0444M756K9510k9988k063L2013k7521q328L2648k0763r017
481a0108L0970j8571j1117K9590j9072j5017K9124j3631j2509K6841j3174r481
493f155K8077j8465j3613L3827j6632k3922L0225o371k3850K2157j602j1451K2119
506A4344r356j3578K5403r792k1640K0904j894j5342J2851n143l321J6198j5787
$$ y = [-4778, 5987, 7436, -6585, 6318, 9924, -10696, 54, 11211, -9451, -4910, 10012, -5677, -5852, 4971, -8696, -6576, 5729, -8272, -5685, 10976, -2344, -7372, 6515, -2451, -10546, -2046, -7221, -10367, -4276, -9025, -8512, -1747, -4633, -1544, 1574, -3179, 2200, -196, -11304, -1166, -1536, -16056, -823, 4392, -14083, 2385, 9940, -15046, 683, 13499, -16363, -3403, 16381, -14368, -5951, 19089, -11355, -6599, 22911, -7077, -9140, 22873, -4648, -12976, 19672, -1091, -10108, 20862, 2291, -8826, 20764, 1692, -13325, 15799, 2168, -10341, 16500, 3326, -6155, 21922, 3457, -10156, 23671, 7039, -16883, 13342, 6971, -16879, 5278, 3676, -7775, 14344, 4988, -8590, 16813, 7021, -14619, 6285, 4391, -10951, 1900, -3243, -6564, 9634, -6153]
519f153l777K5283j7122j0733K0776j7259l222K4390k6969k475M1426l1816k0945
532b8596M9440j6731l2405L7916p204k2945L1874j7200j8993M8664j8832m0290
544c5302M9968l15m7705L5963J1609l5756K7260M313l2662L4102O689m3338K7580
557B406K1260l7901O779J5385j8103J3812M132j9438K3802N842l0692J3018J4049
570A4351j6650K463j51J350J6779k4722j3074M2474j0284k8641L5055l908l0014
583a4972K6334q142k1357M1680j2311l8813M7625R43n2593L5269J7393l7335K8838
596A2559L507m3106L7508J1289n3289L4996K8691n4329J2624L0220l6361Q397
608g294J6598k8769K6805J6956n1027J6381L3328m0932N264L3062k9378n19J8961
$$ y = [-6153, -9930, 15353, -1769, -12502, 8274, -8985, -12207, 12183, -14786, -17261, 24165, -7651, -28596, 20844, 4113, -28292, 9624, 2420, -20525, 11349, -5851, -24844, 23820, 4988, -35302, 14666, 14351, -33354, 2609, 14218, -21538, 5722, 10035, -22627, 11475, 18164, -25174, 2406, 23666, -14235, -7456, 7929, -10174, 3638, 7770, -11668, 12134, 17976, -12716, 302, 14351, -2299, 164, 13, 1363, 18142, -6580, -19654, 22820, 12536, -16105, 18950, 15042, -14972, 11362, 3220, -18137, 23543, 11232, -27581, 20044, 20987, -31606, 3663, 21056, -16279, 12559, 16066, -27040, 10468, 21757, -31532, 3464, 32155, -22174, -9550, 20670, -15691, -7294, 9304, -19465, 7340, 24296, -26731, -10350, 22978, -17954, -12690, 20372, -9006, -9525, 9436]
621I436k6643R792K2059k8859O436K5839k4887p070J0431p223J7434J017k5584
634a7822K2448M090l4935K7576J7954l5355J9909J2145l8843K5780J4290m9431
646c2194L2690L6591n6912N846L7064m2291P566L9749l4086M550K7746m1938P625
659g994L4947m2347N869M1569l9666p47L2676m8014P132N7994m6001j3103N8343
672D0658m4524l1779O4971j8358l8871N2661n441m1850L4544j139l8331L2771
684E312J8711l0473M794P397j6287L839R654L465J92j1381O059O408k0975P597
698e688J7530k1751R960K1056l8028k443L4567k5906j652L6372l3282j3661M0492
711A7566k5122j4126M3815k3792j9183M7196k5372l4498M7809j2161l2202N2349
$$ y = [9436, -17207, -7415, 14644, -14215, -7779, 18060, -6827, -13897, -3466, -10689, 6745, 7762, -17822, 4626, 8716, -26219, 1357, 19311, -16044, 3865, 16010, -22833, 2947, 17237, -32194, 496, 37087, -19825, -13979, 23085, -19206, -11640, 28109, -5977, -1427, 26319, -15619, -7994, 26953, -15394, -9525, 32044, -7622, -8369, 24307, -23707, -16575, 41419, -4582, -17685, 40658, -3866, -35645, 29326, 10968, -27903, 24758, 19317, -22533, 12011, 10872, -27459, 5312, 24023, -6450, -1656, 5741, -10546, -6707, 2947, 6412, 6604, -4777, 1282, 7690, -13285, -5688, 11842, -9909, 51, 21107, -16921, -19364, 15203, -10703, -12355, 24017, -9265, -22926, 17566, -7556, -21682, 22133, -1659, -20842, 26354, 982, -33516, 14293, 2132, -30070, 22279]
723B2279r024n1260M4769R429m8162L9457J9924n2573K4257K7856n0172R341L7119
736B3240l3394K466L4587l1129j6626L0246p315j0021K0273o511j4666J0759J764
749C673p716N301N146o67j380J63j179q999J160J4336l004q136P472n831q217
764g878J3645j357r731J4081o66j3684J0659k070j4052J5946P293j4176P360k191
778C179j7620J4494Q412j7150J1269P516k1076Q314J1490j9779P387J6614j8538
791e488J914J3191k2069R11K4104j5846o208K0716j5570j0796K3937q780j5949
804a5933K2697k252j8948J8648J415k3376J6969J3834k2487N986J4718k1809j86
817a0724K2528j4650q641K1743q775j5676K0628k93k0355J7993J0959k4653O028
$$ y = [22279, 13255, -38005, 6764, 16193, -31969, 7488, 27412, -25161, -904, 26952, -23220, -13879, 23240, -10154, -7688, 26899, -4230, -20856, 9390, 2075, -7946, 12327, 5816, -8850, 1909, 3673, -4043, 1258, 6404, 5737, 4357, 4520, 3341, -5658, -4498, 9838, 6834, -1302, 6170, 339, -7878, 5767, 4410, -5321, 8760, 8094, -5590, 5069, 2999, -11053, 4893, 12186, -1990, 5370, 3179, -14441, 53, 8465, -8685, 2584, 10100, -10976, -2662, 8828, -10951, -3564, 13050, -5488, -3574, 9617, -12452, -11541, 12563, -3283, -9491, 11225, -4345, -15141, 8796, 16, -15933, 6764, 4512, -14436, 4212, 5627, -17749, -780, 13054, -9433, -3447, 11271, -10538, -10724, 11804, -2846, -11487, 10256, 1481, -14195, 6433, 6140, -14215, 3778, 14737, -9916, -3888]
830c888J6592k0714K42K4643j6095j2415K3517q356j7612K4133P53k4253J8721
843E268J0817k7294Q825J8429k3285J410K3721j9500r071K4504j2006j4260K5116
856A2674l990k1709K0590N244k5294J2101J3136k1570N739J7596j9690k919J9279
869A1187j3633p514K1143q076j5000J8322q21j7346J3006N918j6689Q302R542
882H341j6507K846J3121j3409k019J5286r752p565J4670m249j0624J2057j7j1292
896i113R976M028j3026O640P561j2937K758J0802j1337j914J1774p498m745J1494
910D463m627o817J1855j985r245J0050J159j1178P899M182j1378M970P448j0249
924c453J579Q541r009o23J0126o862l345R487m138o162Q710j165o986O977J245
$$ y = [-3888, 12704, -8010, -7768, 16875, 780, -11635, 11882, 3526, -14086, 10047, 10800, -13453, 5268, 16085, -11209, -2384, 16045, -7240, -5830, 17891, -1609, -10680, 13824, 1818, -12442, 12674, 8684, -13025, 7565, 12809, -12485, -384, 12752, -8818, -3079, 14517, -5173, -8092, 11187, -2446, -9960, 11183, 3107, -11893, 6429, 5608, -11738, 1268, 7186, -9503, -1201, 8341, -8166, -5320, 7801, -5608, -7627, 7659, -2093, -9658, 5012, 763, -9861, 2196, 2179, -9113, 863, 4891, -8135, -1495, 6066, -6871, -4113, 6689, -4648, -6562, 5212, -2286, -7031, 4463, -164, -6981, 4874, 2889, -6356, 3694, 4853, -6325, 1574, 5756, -5622, -652, 6796, -3453, -1874, 6667, -2342, -2965, 7161, 299, -3046, 6441, 2303, -3859, 4851, 3686, -3300, 3677, 4922]
939D922p512M417L093p167K258N353o233j27N927m139l199N744j531m750N199
954B255R86n241L000K722o180J758M737o184l85O318n333l064P086l108m671P692
970B388j327n965P048q3p655N960K120p974M324M011q038K609N332p481J358O159
986B786o200J64O342n425j395N978m213j416N508l005k258M952k126k775L959
1001H76r52j685K394m50r24J177j124J86J526j186P25J161j805J645O02l395K640
1018A411J927m433J956K409m184J025K814m159J671L335m564J084M500m768q19
1033g95M478k744p07K089k385J068J233m156K047L138m615Q26L157l552P82J762
1049A626l930K583L032o601K314M851o282L18M607m910J479L250o432K649N336
$$ y = [4922, -2590, 1827, 4920, -2247, 11, 5364, -869, -996, 4931, 792, -2407, 3337, 1806, -2944, 2255, 3241, -2000, 1000, 3722, -2458, -700, 4037, -2147, -2532, 3786, -1547, -4611, 2475, -633, -5304, 2388, 1061, -4904, 2144, 2061, -5594, 366, 2486, -5488, -1164, 2847, -5191, -2582, 2750, -4731, -3373, 2786, -3414, -3250, 3092, -2333, -3728, 2250, -1963, -3379, 2129, -876, -3134, 1818, -308, -3083, 876, -76, -1761, 633, 183, -741, 436, -688, -502, 1024, -162, 563, 1724, -81, 1564, 2166, -1229, 1411, 3338, -1095, 861, 3270, -914, 111, 2925, -1234, 437, 3772, -792, 292, 4792, 24, -795, 3683, 939, 232, 2321, -64, 1004, 2237, -1919, 128, 3266, -1349, -523, 2634, -918, -136, 1626, -2304, 279, 3311, -3290, -976, 3875, -2407, -2089, 2518, -2392, -913, 2337, -4095, -1446, 3890]
1064C890q798J362P641p081m67O631o068M65O481q576P79J0120r653l194J2205
1079E737o213o554R749k533n372Q199l173n382R099j989p586P482K237o697K159
1094h37K569j781M31j257K67K715k127o86K151j366J135K6l896M444L163q462
1110c511K815P264p820o24O854n731O12N572q433J851Q750j0458j333J1961q021
1125b52m171J0525o429k657R686q843k675J3823r327p630J5900n812j0319J3612
1139E431k838r869J2571l206j0666J3899j417j4045J2597L485j4084Q347M805
1152E010j1291O510M083j1116O570N853j1521L138Q278q514j444O542k947j864
1166b713K850j178L1J020o28p63p6K215K96m729L899M157r523K090R490r607j623
$$ y = [3890, -4908, -3546, 4095, -2986, -3453, 3178, -2890, -2425, 4056, -4520, -3741, 6379, -3274, -6468, 5737, -476, -7030, 2719, 186, -5186, 3013, -160, -5542, 3557, 1568, -6018, 1464, 3701, -2996, -837, 1732, -49, 382, -875, -608, 2107, -20, -706, 1445, 79, 1214, 1240, -2656, 1788, 4951, -3511, -696, 6568, -1252, -1876, 4978, -753, -141, 5431, -3002, -1151, 7599, -2859, -4192, 7769, -252, -4423, 6102, -327, -2984, 6702, -2141, -4816, 9007, -320, -7950, 7950, 2138, -8181, 5431, 2593, -7276, 5295, 2089, -8577, 5322, 3905, -10140, 2457, 5942, -8142, 205, 5010, -6281, 229, 4312, -6804, -234, 5619, -5902, -2764, 5514, -3000, -4444, 2098, -849, -2713, 137, -1041, -1010, 10, -618, -1381, -1457, 758, 1054, -3675, 224, 4381, -5142, -3052, 6438, -3169, -4792]
1183d792J2362r746l868J4491j0198p322J8932p372j3145J9310l346j7602J8023
1196E727K424j9095J5299N456k1021J2983R422k1753R126J4723k0176K949J5895
1209A1959j6806j426J6999j1966m660J5078q886p004J3331m240q350R769o04p453
1223d259N627R80n634K964L152l135n02J510k94k408J360L384l873j589N948l683
1239d52m428P695k387n968R244r56j0496Q078K764j0224Q624M655j3139N278P176
1254E464j2210M815R363j2544K059J0374j2022n65J0944r198q37J1774r594l705
1268e882J1298p252m025J2198n980n729J1219m727p413J0201l172o629J1455j210
1282D352j0281P606R18q450Q091L668r291L925L919q069K349N997n719n0O294
$$ y = [-4792, 7570, -2176, -6044, 8447, -1751, -9073, 9859, 2487, -10658, 8652, 5306, -12296, 5727, 8151, -10944, 4355, 9811, -11210, 1773, 11195, -10558, -1432, 13291, -6885, -3936, 11959, -4847, -6273, 10726, -1240, -5900, 9178, 292, -6712, 6619, 2379, -5971, 3798, 3194, -4259, 1368, 2348, -3286, -322, 2830, -305, -807, 703, 409, -1999, -639, 2745, -1128, -2717, 3231, -452, -4880, 2815, 428, -5540, 3704, 2748, -7748, 330, 3094, -7130, 1494, 6149, -6990, -1712, 5464, -6746, -1931, 7432, -5112, -3053, 7321, -4701, -5266, 5678, -3520, -4357, 7417, -2177, -5882, 5416, -1836, -5861, 6337, 357, -5372, 5847, 1120, -6293, 3908, 736, -5893, 5562, 4352, -5929, 1677, 2595, -5855, 2236, 5904, -3387, 538, 4457, -3612, -1263, 4734, -985, -1035, 5259]
1297E259m678m084M796Q9k750M033P75n419L83M508l158j551N378k483m625O507
1313B980K12q234N079M426p934L606O033j0441J13R679q057j954J1284p444n947
1328f599J2042m711r214J1842N51r773Q932J086j2977P408P095j0177M260O195
1342E960j1663R76R930p713j850R607n701m302Q322l971n706Q512P68o436M870
1357A603O09p166L720M931n641N23M551m092j063M666l372k850O080M36m275K912
1373A572Q8n434L297M735m320l18L793m329j531N162k741k415O281j180n330L702
1389A032J15m621N373K981o321J133K348m767K004M858n088p16M961l559j941
1404b208M494k557k444N322r35m195L379j97l436M291R69m835K186K061l980J216
$$ y = [5259, 581, -3503, 1293, 1382, -1368, 2665, 3440, -1979, -1596, 2912, -246, -1797, 3581, 1098, -3527, 2980, 3192, -5042, 37, 4463, -3471, 135, 6168, -4273, -4160, 5519, -2538, -4492, 6792, -652, -6599, 5443, 732, -8482, 3360, 3911, -5862, 3070, 4156, -8821, -1413, 5682, -4495, -235, 5960, -5703, -4727, 5203, -2510, -4360, 5247, -454, -4756, 3566, -405, -6111, 2401, 3169, -3267, 1603, 2212, -4954, -1234, 3697, -1944, -1421, 3130, -962, -2025, 2641, -731, -3581, 2499, 2935, -1340, 1572, 1660, -3774, -477, 4258, -62, -380, 3413, -916, -2447, 2715, -26, -2441, 3840, 2660, -2670, 1032, 1147, -3474, 1899, 4880, -1441, -308, 2040, -2727, -723, 4135, -953, -1669, 3292, -267, -2208, 2286, -271, -2715, 2607, 1672, -2523, 856, 659, -2777, 1514, 2483, -2352, -166, 1895, -2085, -869]
1420h69K189l354O75L504k784j166K296j750m91L539j136k817J991J26j906K103
1436A50J045k549Q69J763k475n55K039j129k73K708j302k661K285P86k088K057
1452F70J012l242J004K426k951q0L220k493n49L742k670k303L616p01k205L370
1468A866n60l278K892R66l375K014J378l051J798J870l591R7K852k144L54K009
1484B097k105o91J971j292m55J838j324p07J639o99r66J271l55l38P87o67m58
1501d54O25l44j07O01o47l52R10m29r1K96o87O9O39l83R6L9m83O46J03p78O69
1522f2k91o15Q61J14j360J421j7j629J464O42k086J234J240k015N21J590j907
1539h95J50K066k028k62K221j772p70K219r60j014J949p56r47J961n28j672J922
$$ y = [-869, 1320, -2034, -1359, 2145, -639, -1805, 491, -1259, -1750, 1789, 653, -2164, -173, -47, -1953, 150, 1195, -1354, -485, 1278, -1197, -1752, 287, -842, -1115, 1593, 291, -2370, -85, 701, -1387, 670, 1682, -1560, -556, 1870, -1081, -1161, 2059, -434, -983, 2759, 89, -2214, 1402, 701, -1504, 1866, 1306, -1972, 920, 1886, -1489, 525, 1903, -1148, 650, 2520, -1071, -974, 1878, -266, 88, 2097, -8, -699, 1272, -20, -475, 1363, 39, -668, 971, 272, -694, 577, 222, -116, 671, 4, -454, 171, -173, -280, 321, -326, -678, 232, -197, -288, 8, -679, -610, 29, -354, -258, -219, -702, -56, 47, -731, -62, -353, -968, -107, 7, -1353, 68, 51, -1578, -114, 528, -1558, -324, 916, -1099, -578, 1012, -895, -745, 1321, -707, -969, 1252, -520, -1290, 929, -31, -1045, 904, 148, -799, 1162, 634, -1038, 884]
1556H84M9j349P40L98o55K65j02k02O73l40n14M50Q6k06l5N5O13n1q99O98P80
1577A338j396K6P52r14J28Q21j243J99J190j230n81J821j04j682Q53Q05o51m57
1595c25p2Q66k10p94K90L57k19l01j97j73R12m24r34J402O56j911N40J379j389
1614e47k2P73r85L24Q30j608J56J903j127p88J267j04m92P0l46Q64M41j396M53
1633c34J601j041q13Q55J20n69P7l69N61M17j124L99J238q05o6M18k78M38J9j458
1653g14J096J027j966M39J152r90q1L54n40R76K26k093J417J397k160J71J744
1670A455j213j88Q25j401P67O83j972M81J898j951k08J953r97n95J285j306K55
1687b29J220j511m75J743p96p24R98n35J32K78j061O54Q57j923O39J566j691M12
$$ y = [884, 933, -416, 324, 722, 67, 332, 230, 28, 701, 361, -153, 297, 383, 177, 142, 197, 810, 759, -140, 558, 1338, -58, -32, 720, -194, -66, 755, -488, -289, 901, -329, -910, 911, 807, -875, -22, 783, 132, -325, -397, 469, 259, -535, -245, 112, -107, -408, -605, -778, 134, -290, -1224, 178, 834, -1077, -537, 842, -547, -569, 204, -781, -457, 373, -1235, -1079, 824, -303, -1091, 176, 72, -420, -350, -696, 168, 609, -787, -334, 1267, 226, -587, 268, 388, -181, -104, -473, 88, 505, -619, -220, 1018, 213, 147, 565, 287, 725, 744, -714, 382, 1409, -557, -118, 1034, 44, -37, 317, -223, 753, 979, -1114, 303, 1700, -460, -289, 1455, 242, 54, 879, -522, 245, 928, -1044, -563, 1335, -616, -824, 1129, 132, -463, 822, -484, -229, 991, -520, -995, 748, -48, -772, 226, -309, -177, 101, -960, -306, 551, -1372, -733, 833, -858, -446]
1705d46J488k007O09J432k279L74K194k619k2K771k393o07K544j575o73K802j784
1722a91r84K524j338j350K469p61j288J746q03j159K107j246q51K430j070j231
1738i96K356r31j280K224j002j160K073p28j408J953o11j357J658k04j353J709
1754I43n25j146J768n99j019J803q26j022J972j180j300K370j252j391K730j117
1770B09j775L030j235j991L094p48k515L359l92l065L159m9l203K794M16l558
1786b470K750J007l766K238J636l893K382J849l676J687K179l523R35K699l612
1801a578L52L044l054m33K862j999n74K490j473o66J889p36j214J738l85j099
1817h36J118K1k38j78M3J84m19l0R05p05m28J565o99j244K168k19k510K722K89
$$ y = [-446, 1042, -965, -356, 1076, -1203, -829, 1365, -1254, -1276, 1495, -898, -1505, 1039, -536, -1209, 1593, -191, -1175, 1349, 11, -1339, 1130, 369, -919, 827, 24, -1135, 972, -274, -1125, 1305, 235, -996, 1360, 429, -851, 1373, 371, -789, 1284, 556, -852, 1101, 490, -867, 791, 587, -766, 943, 418, -728, 1040, 441, -578, 1225, 399, -623, 1349, 169, -1131, 1239, -13, -1404, 1326, 209, -1566, 1464, 229, -1762, 1332, 584, -1931, 1428, 1036, -2029, 1130, 1081, -2122, 672, 1088, -2470, 280, 1287, -2479, -241, 1395, -2498, -116, 1733, -1943, -256, 1923, -1600, -665, 2034, -1578, -1226, 1818, -1236, -1669, 1193, -806, -1380, 1110, -363, -1029, 860, 124, -1090, 648, 263, -836, 282, 303, 65, -113, -70, 114, -305, -335, 570, -135, -563, 1002, 303, -941, 1227, 1008, -1502, 1220, 1509]
1836A509l247K613J000l725K314J755m035J559L164m468N87L833l985n84M726
1851C016l489j443M934k711k603M754j590l554M376k14m140L343Q67m127K453
1866a28K419l714J054K534l002k11K579k077j015K611q05j778J845O2k093J404
1882c15J244j777mJ424j043o42J651j98j517J733L01j670N46J019k128N79J898
1899A101j821l26J938j505p70K586j111j110K041o68j654J904j02j691J952L02
1915A066k201J521k9j616J936M97k361J429R32k311J566J363k619J030J959k852
1931f90J32K212k343k33L287k240j422L019j533k036L599o43l035L063N26l419
1947a756J911J884l688J303L242l440j287L331j729j810L814o57l491L052P36
$$ y = [1509, -1738, 875, 1875, -1850, 464, 2219, -1816, -257, 2907, -1561, -974, 2859, -1126, -1710, 3016, -473, -1916, 3018, 307, -2296, 2458, 868, -2686, 1690, 1476, -2664, 679, 1546, -2581, -128, 2291, -1423, -369, 2165, -837, -1048, 1531, -546, -1561, 1050, 245, -1533, 312, 374, -1719, -315, 929, -848, -852, 572, -471, -1113, 538, 340, -1177, 556, 857, -813, -267, 752, -1376, -797, 1101, -720, -1046, 892, -613, -1383, 1203, 92, -1018, 1023, 355, -1299, 605, 503, -1188, 764, 1066, -1135, 386, 357, -1259, 677, 1174, -1187, 242, 1174, -1137, 429, 1792, -827, 203, 2162, -690, -558, 1654, -689, -922, 2365, 125, -1297, 1722, 189, -1847, 1752, 1109, -1926, 1137, 1663, -1756, 155, 2039, -1649, -346, 2896, -544, -1831, 1500, -229, -2039, 1775, 1118, -2373, 679, 1415]
1962A415l909K335K415l997Q14L602l919j501M563j986k485M764j117m393M063
1977F64R31m822L204K550n122J698M095n249n05N083l268j522N143k914l573N279
1993A672n70m060M271R52n001K963K164m725J323L538l317k69L566l417j306L822
2009A606r73k188L209p38l079L079Q17k891J378J619k451M15K025k534l71K659
2025A582r90j535K214p50k079K437O79k672J486J217k593R52J725k612L16K510
2041A887k137o46K337j962j283L376j161k123K834m77k672L027J29l108K412J222
2057A655l299J564J162l169J370K604l277L64K690l078j12L369k255j475L312
2072A425j326j782K739m37k722K787M65k725J416J008k584J247J486j870J40J956
$$ y = [1415, -2494, -159, 2256, -1741, -927, 2675, -1244, -2745, 1818, -168, -2653, 2111, 994, -3399, 664, 1595, -3227, -23, 2527, -2595, -897, 3198, -2051, -2556, 2527, -741, -2263, 2880, -34, -3607, 1672, 1102, -2958, 1313, 2265, -2736, 227, 2391, -2334, -1011, 2527, -790, -1059, 2507, -910, -2216, 1606, 633, -1555, 1654, 916, -2163, 916, 1733, -1158, 220, 1839, -612, -197, 1828, -706, -1077, 1582, 592, -943, 1271, 521, -1558, 879, 1558, -1114, 372, 1589, -1004, -52, 1673, -939, -623, 1887, -250, -896, 1441, -521, -1804, 1572, 411, -1712, 1122, 645, -2027, 1000, 1129, -1979, 433, 1655, -1644, -80, 1082, -2087, -717, 1887, -1390, -1026, 1664, -1414, -1526, 1843, -412, -1887, 1425, 99, -1683, 1056, 619, -2103, 684, 1149, -1576, -160, 848, -1736, -489, 997, -873, -733, 1223]
2088A223j511p81K108p42j723K289M09k477J181R34j717J051J014j717J4J901
2104A456j641l99J855j174j176K362l06j916K110L5k484K273O90l168J319K146
2120A982k912J71L041k542q14L143k083j241L239j692k037L398o32l283K979Q59
2136A576l278J913J661l524R05K416k474k81K680j731j422L037j037k337K390
2151D94J32j951J418N35k224J375J168k171L41K410k298p08K815j631j345K352
2167G12o88j443J960j62j971K053K10k349J837J062k597J032J805k437K88K111
2183A423j892l99K358j459j172K292m82j836J705M44j598Q33N53j173K77J163
2199A037j247J46J143r48n04J205p4j287P86J015j402r1J216r33l70J269o88n55
$$ y = [1223, -288, -1069, 1039, 297, -1426, 863, 1272, -1205, -24, 910, -807, 244, 1258, -459, -445, 1456, -185, -584, 1271, 97, -1079, 1283, 977, -939, 1171, 1206, -1278, 995, 1685, -1483, -164, 1982, -930, -759, 2282, -260, -1074, 2069, -14, -1255, 1984, 292, -1745, 1653, 1021, -2262, 717, 1576, -1702, 211, 1872, -1652, -747, 1669, -805, -1086, 1594, -137, -1559, 1478, 441, -1896, 494, 626, -1325, 93, 628, -1596, -221, 947, -1224, -883, 1527, -771, -1479, 1336, -295, -1640, 712, 24, -1419, 541, 379, -1592, 461, 671, -1678, 159, 1221, -1376, -344, 1461, -976, -688, 1423, -469, -868, 1490, 31, -1141, 1151, 669, -1167, 538, 982, -616, 217, 770, -403, -126, 1037, -210, -64, 1079, 131, -373, 832, 758, -529, 257, 1272, -130, -221, 995, 62, -308, 961, 273, -282]
2217b82J177m23j193J259L3j447J140J36r21Q78J82j343P99P32j692P88J030j739
2235h86M52J128j589L75J276j616m0J548j302m75J897j336q43K202r01r95J650
2252E45n29j202J599k48j400J283J45j115R70K02r34Q93j01p07N49K07p54O61
2270F4M3n08N18K51o61O07M1m67J74O1l75K61K63k78M45k41p4N17j95m59O92k78
2292D01n08O15k15l98P35k43n94Q74k21o62P94k31p04Q60R5q27N92K21p17N02
2312C69K12q64L59pn58M02M35p58M06J10m17L41J2n68M44K46q34M46L65p20L26
2333b53L17o80K77L59p18M04L79p42K82N50n65q1O42n04j11N95m84j40N43m71
2353d01j85O69j03m06M18O6k71J67J70ql6J89k84N0J19Kp4P9K21l47J88K52k21
$$ y = [-282, 895, 472, -721, 538, 571, -876, 264, 400, -521, 357, 539, -804, -5, 727, -965, -177, 853, -886, -434, 694, -895, -520, 756, -860, -900, 648, -654, -1129, 768, -568, -1411, 791, -110, -1105, 545, 16, -1186, 413, 165, -1235, 48, 193, -922, 48, 250, -684, 209, 108, -599, -50, 157, -597, 64, 107, -401, 117, 368, -293, 314, 355, -112, 62, 123, -252, 9, 272, -6, 439, 198, 124, 641, 446, -13, 679, 401, -107, 508, 293, -105, 630, 387, -207, 667, 446, -216, 578, 347, -357, 503, 598, -229, 363, 584, -133, 369, 581, -283, 76, 69, -489, -87, 348, -410, -4, 106, -311, 30, 42, -526, -82, 164, -670, -224, 141, -579, -253, 64, -616, -339, 20, -698, -294, 85, -657, -375, 175, -390, -471, 171, -333, -444, 151, -333, -473, 70, -401, -586, 83, -20, -426, -8, 58, -213, -46, 124, 116, 80, 269, -15, 35, 154, 156, 82, 161, 382, 35, 223, 475, 254]
2376B54j65L12j81p6M32k70k11N10k50l87O02l12m30O76k26k47O30k55o77Q48
2396E77k6q92R21k01p80O30L77j099P01L56j082L47J010j499P7J060r97j40J152
2415D92r89k37J199n89q05J275l03r62P76L70j232N40O02q69P9Q89n27n25J241
2434D25n76o77J239k44q95P09M34j316M49Q35q11k00J456q36p49J525n51j184
2452i67J639O8j709J274O91j723Q43R40j638M61J261j609L6J817j483n75J970
2469A296p99j167J749m39j091J323j95j317J266M30j699J140M62j465N46Q66j375
2486d69L55R89j085j23J290r49n22J267m96p88Q01m4p77M60M60q57J96N42n00
2505b50r9N13l97l78J147m89q48P70J18q26O54M43j308M58Q41j191J12J229j105
$$ y = [254, 89, 401, 220, 144, 576, 306, 95, 605, 355, -32, 570, 258, -172, 504, 278, 31, 661, 406, -271, 577, 551, -341, 580, 379, -401, 229, 606, -493, 208, 564, -518, -171, 839, -660, -583, 477, -520, -660, 492, -497, -734, 465, -124, -929, 346, 43, -919, -143, 227, -1005, -465, 137, -732, -653, 236, -291, -816, 425, -151, -828, 411, 167, -728, -19, 415, -901, -452, 383, -428, -628, 828, -8, -757, 768, 217, -967, 672, 740, -969, 305, 996, -727, 116, 1056, -582, -121, 1140, -469, -433, 1384, -99, -674, 1296, 497, -670, 1079, 640, -451, 872, 677, -640, 626, 1056, -643, 497, 959, -506, 40, 906, -469, -114, 875, -210, -333, 957, 8, -514, 753, 257, -531, 270, 226, -551, -91, 369, -488, -292, 250, -250, -349, 164, -233, -611, 536, 47, -801, -31, 87, -739, -85, 358, -950, -492, 349, -842, -730, 499, -606]
2524f06n69J969j015q51J543n00j071J623l24j291J282K50j503J296N30j752R53
2541c6Q52j681O73J298j722M43J648j758j04J577j399l17J842j049j084J779n81
2558C81j003J572l63j335J435L09j245N68M31r17M63P69q21o16P78j82m44O45
2576D25m2n20J55O52q93j68J003m04o81J147p11r73J201K28j279R70M09j643P19
2595d05J130j757L11J432j419J39J503j851l40K079j145o10J631j129j064K282
2611G87r70j154J940n32j307J627j66j585J657N8j161J131jj452J249M49j497
2628i27R94N53j599P97J163j765O98R51j229M00R34j408J25R33m70l07J174q59
2646A58l82O60n7l22K45q5l9M1Q4R2o06K90P91o47n26J133j065k51J488o44j025
$$ y = [-606, -1175, 794, -221, -1072, 471, -29, -1100, 523, 199, -1092, 190, 440, -1063, 233, 763, -989, -36, 816, -865, -192, 1106, -616, -173, 1475, -283, -387, 1190, -209, -526, 1316, 267, -817, 962, 381, -622, 950, 587, -748, 687, 996, -249, 319, 750, -167, 296, 1065, 244, -372, 406, 224, -220, 425, 383, -137, 18, 670, -223, -391, 612, 208, -473, 674, -37, -1010, 191, 419, -860, 110, 519, -1124, -405, 725, -1032, -721, 711, -708, -569, 934, -917, -1257, 822, -323, -933, 698, -431, -1495, 787, -183, -1337, 603, 71, -1236, 391, 225, -1360, 297, 355, -806, 325, 324, -1128, 121, 570, -927, 67, 620, -979, -182, 981, -784, -86, 865, -364, 36, 970, -438, -313, 620, 150, -157, 1017, 158, -224, 436, 379, 57, 302, 217, 178, 219, 303, 395, -211, 79, 870, 223, -303, 830, -235, -486, 1002, 358, -667]
2667f67J277l58j195J648k78j511J554M45j938J123O44j967J009J425k117M17
2683d89J514k067K10J932j822l04K014j237r41J662o78r05J820o55j140J351k98
2700c3j107J513m22o66P86J1o90N82j06n79Q51j58o01O96j82n09Q84m2m80L72
2720A20k46j24N90M4p05O53K6m84M18o9m26N99o7m66M77K12n10J05M51p31M60
2741C27M1l57K47J20m21K61K39k91K85k47Q7R3m6n82O59k77m66P19r0p89P17K36
2763D65j221J079Q5j285O53Q67j322K36J167j263j69J246r51n71J396n00j017
2780a105J462m13r25J093j05p89P58K10q72M05M10n15N7L46o97N30K29m83L21
2799h3J35m04J81M28o16L08M48o61J61N18o28q1R42n95k29P54m69m50P48k36k82
$$ y = [-667, 610, 252, -943, 705, 427, -1084, 470, 915, -1023, 100, 744, -1223, -214, 1211, -906, -489, 1025, -1042, -832, 1100, -722, -1026, 988, -249, -1190, 472, -206, -1111, 709, 54, -1086, 265, -33, -1140, 373, -49, -715, 71, 82, -608, -26, -132, -711, 140, -18, -619, 77, -105, -614, 270, 228, -252, 120, -126, -250, 340, 384, -321, 332, 358, -126, 292, 223, -203, 396, 329, -137, 340, 552, 42, 147, 598, -133, 327, 368, 11, 258, 378, -43, 218, 457, 166, 451, 204, 291, 384, 338, -244, 415, 138, -328, 391, 301, -488, 229, 465, -756, 323, 408, -877, -224, 643, -679, -443, 724, -539, -708, 538, -413, -984, 412, -88, -1105, 357, -56, -981, 112, 7, -782, -24, 186, -686, -281, 129, -386, -329, 17, -680, -150, 79, -404, -83, 52, -352, -171, 257, -359, -51, 397, -264, -103, 415, -213, -294, 648, 53, -176, 578, 109, -341, 407, 171, -111]
2820a11O36Rp65O43q7j48n6L48l52J41K00n1j54j84K65m4k60M00o0n38N40K31
2842F03p74R9O37q36K0Q16o38k39R69p70l12R65o56l93R38l97p51R96j98p20Q66
2863B25mj091R49K01j212R37Pr80O89O40j070L71N65r20K26O64q30K55N27o42
2883d93N3N64n32M1M77m59l6M47k46j12N57l56k05N95m09l9M34k08m0K18j64q3
2905DM01k66n0L83l41j20L71r2j82N70l95j18K18k96J14K56l96LL64m83L45K03
2927D93n39L1O46p28J11N67m55l87O30l74j79N91l91k04N39l33m42P63j97n96
2947d54N45j15n18N42O3n74N05n7m82K88J90l92K67K5k86K21j11j32K30J58m08
2968d95M44j28k68L30nk14K90M3n20N28q7k23L76k03k57N26p9k98M27M0m53K70
$$ y = [-111, 525, 534, -231, 412, 325, 177, 121, 469, 117, 258, 458, 407, 253, 69, 334, 290, 30, 430, 370, -168, 372, 603, -171, -72, 565, -271, -251, 565, -73, -312, 657, -113, -425, 540, -116, -509, 429, 32, -719, 277, 79, -641, 225, 221, -870, 79, 280, -932, 5, 12, -968, -279, 361, -709, -338, 227, -693, -467, 197, -633, -378, 149, -493, -440, 124, -408, -367, 110, -349, -385, 62, -184, -296, 261, -95, -300, 295, -114, -153, 281, 73, 33, 251, 87, 4, 405, 139, 89, 472, 131, 11, 382, 290, 108, 678, 283, 165, 383, 87, 201, 457, 61, 64, 428, -55, 290, 493, -46, -15, 631, -97, 14, 581, 126, -261, 369, -5, -184, 407, 16, -188, 351, 18, -424, 339, 142, -454, 91, -24, -542, 0, 63, -511, -6, -63, -545, -257, -67, -459, -192, -167, -453, -232, -343, -475, -245, -87, -495, -51, -179, -447, -117, -122, -336, -46, -3, -523, 5, -82, -305, 71, -132, -389, 137, 58, -240, 187, 227, -226, 44]
2990D4L50m84J97K27l89mM43m30J67M38m54k22N24n8l07L11k72M3J71l7N3j7O
3013C00j78J08J06k64K02r9j4J35M4k74j6P3PJ12O3k05o6L1q4N3l23L54l7l94
3037c66N18l55l14O36j46l76L64j8o45O73J03p14M30L73j021N55N83j003L20P59
3057C56r68l0J007q93j96J105n11p34J162k26q05J075k8j092R36K40j026O12P33
3076G17j281L32Q87r85k37J319o63m87R71p6j058J084K70j027K52J040j230k58
3094d30J635r67q84J656m28j295J424K62j904J462N66j910P50J479j935N7K046
3111A584j844n09K054j004j296K025n45j792K075Q9k115J540P22j932O37J410
3127A099j957K64J420j438j57J417r81m85J300o91p94J173j87q92R79M5r10O03
$$ y = [44, 394, -90, 107, 334, -55, -59, 384, -46, 121, 559, 105, -117, 407, 349, 42, 353, 81, 124, 295, 258, 311, 294, 300, 122, 230, 336, 72, 274, 175, 161, 296, 340, 66, 50, 123, 130, 242, 305, 100, 34, 65, -19, 34, -289, 65, 28, -366, 152, -203, -517, 119, -27, -403, -39, -57, -702, -29, 74, -640, -210, 163, -858, -303, 280, -723, -403, 356, -612, -642, 365, -528, -724, 381, -130, -864, 298, 72, -733, 342, 314, -778, 158, 398, -628, -16, 717, -564, -232, 655, -330, -567, 752, 89, -398, 573, 497, -561, 523, 793, -234, 18, 1058, -172, -430, 1205, 238, -646, 1010, 582, -713, 711, 973, -931, 531, 1097, -813, -63, 1416, -519, -462, 1584, -260, -769, 1285, 281, -1015, 1010, 465, -1327, 748, 837, -1278, 262, 984, -948, -311, 1099, -858, -594, 826, -612, -769, 648, -333, -818, 482, -209, -1003, 170, -17, -909, 70, 115, -795, -192]
3145a92K26m82K08L12k52j30M09k16l97M58P5o75O40L06q35N63L52r08O27M85
3165E74r24PR62q65j61J268q77o50J677q18r68J724n77j187J747R5k048J433O99
3184A111k054J476Q69k203P36J537k143L13K124j859m73K009j506o96K118j030
3200C29j280J822m15j382J475J04j837J619M89j975J061R13j487L58J125j460
3216e41r1J610j150j022J778m01j520J695K69j943J094Q80j723M84J614j676l73
3233a016K050j292j361K390n68j958K284L63k629J608J380k616P19K005k348L0
3249i59K591k169r63K833j307j734K796n96k357K584P7k308K093Q09k711J506
3265A85J441k715P68K175k567K3K366k007o66K566j282j324K432p97j947K111
$$ y = [-192, 34, -448, -240, 72, -180, -310, 99, -117, -514, -56, 19, -656, -16, 290, -545, 18, 370, -538, 89, 574, -350, -343, 619, -246, -407, 861, -16, -666, 1011, 193, -775, 949, 372, -815, 932, 1027, -1021, 412, 1111, -943, 533, 1402, -801, -65, 1472, -671, -358, 1766, -93, -566, 1443, -63, -759, 1359, 329, -951, 871, 456, -926, 549, 653, -1184, 435, 924, -1051, 10, 923, -564, -206, 919, -541, -632, 978, -172, -1194, 584, 183, -1337, 358, 627, -1316, -222, 658, -1065, -581, 1033, -643, -1016, 1034, -258, -1619, 771, 203, -1755, 529, 892, -1737, -129, 1251, -1365, -646, 1359, -989, -959, 1632, -537, -1500, 1333, 26, -1708, 1088, 492, -1865, 719, 796, -1512, 581, 1390, -1321, 185, 1626, -1089, -321, 1854, -713, -690, 1676, -331, -997, 1569, 287, -1037, 1395, 598, -1349, 762]
3281G62L70k147J397Q45k142Q86J340j907M9K005j498p29J908j042j302K079p3
3298H01j808J253O36j857P92J447k101J15K098j783m33J976j293j308K175m22
3314B88j793J909J23j842J468P34k099P66J206j893N74J486j964N40J623j688
3330e62l05J711j206q50K007m45j695J838j29j689J492Q65k280J217J055j844
3346h20M26J485j640M9J655j438o25K125r34j320K058l86j751J747L52j997J397
3363C83O91j817P22J455j815P2J581j278n13J700r30j008J688m50j146J379J20
3380H34j591R87O00j335M91J014j553K50J389j411l54J255o08p09J392m90j052
3397h91J351K0j648J287P20j916P56J117j701K84J425j392n16J906j043j146K022
$$ y = [762, 1132, -1015, 382, 1227, -915, -29, 1311, -596, -547, 1458, -40, -769, 1139, 97, -1205, 874, 801, -1007, 246, 882, -975, -183, 1264, -837, -722, 1376, -407, -840, 1136, -157, -1465, 710, 288, -1505, 404, 527, -1315, 153, 887, -1212, -446, 760, -1133, -559, 927, -1037, -497, 1126, -562, -867, 844, -362, -1212, 795, 350, -1345, 493, 364, -1325, 167, 1032, -1248, -31, 1024, -820, -394, 1091, -549, -500, 1155, -283, -908, 1217, 283, -1037, 1021, 635, -1116, 631, 983, -1014, 383, 1074, -743, -21, 1434, -381, -309, 1272, -6, -519, 1181, 251, -757, 931, 481, -665, 714, 834, -757, 230, 830, -505, -14, 1000, -553, -303, 1086, -325, -679, 576, -32, -741, 651, 161, -891, 460, 480, -1168, 119, 839, -1077, -321, 796, -905, -621, 804, -588, -1104, 802, -241, -1387, 635]
3414F35l58j787J650J97j873J684O82k074J035J124k041O74J491j833O9J749j386
3431c62o75K000p88j278J931k03j669J443M04j905J176Q86j787P72J206j552J87
3448b14J209r87m78J423o89p85J187L4j212P52N61j195M35O95q99J51P81p64l53
3467c48J064n03o53P24J70q91O86N38j307M55O60q59J09P06o98l33J081o03n34
3486e36J037n81l77O11k16o98R89q1r78R80N4r42P33K97j125P42K87j032N88N90
3506C42j098L38P35q87J80P89o33l66R02n09m20J023n67l68Q36j57p00O12J52
3525B04m97K42K84l89N8L02l96J11K21R9j94J50J1o9j6N8RK2oK03l75J37m5j15
3549IJ71O8j14M1K59m51K21J42l63K21L6m77L17K99n70O8O80p13J10L83n14j85
$$ y = [635, 277, -1510, 140, 337, -1536, 148, 830, -1244, -209, 915, -1126, -452, 1039, -794, -725, 1024, -362, -1037, 963, 175, -1103, 828, 625, -1044, 399, 803, -1102, 74, 960, -827, -55, 1151, -401, -214, 995, 8, -470, 953, 264, -521, 666, 700, -512, 240, 801, -394, 41, 736, -163, -12, 769, 5, -348, 716, 213, -440, 284, 454, -437, 249, 787, -520, -65, 595, -264, -155, 551, -147, -480, 601, -2, -536, 501, -80, -457, 154, -62, -760, 229, 148, -830, 150, 204, -738, -5, 292, -833, -91, 196, -836, -248, 342, -756, -418, 317, -570, -390, 399, -234, -600, 302, -207, -627, 396, -171, -539, 297, 140, -560, 52, 204, -293, -51, 233, -156, -98, 204, -192, -81, 140, 239, 45, 195, 206, 137, 121, 179, 188, 210, 204, 407, 32, 169, 124, 9, 180, 248, 134, 175, 434, -17, 204, 346, -17, 204, 240, -237, 80, 379, -191, -123, 557, -156, -46, 337, -177, -362]
3571c62O02j98k21M30k66k21N00k03n18N37q5m09M72r1l71M15q5m05K96J26l36
3592c93P8L61n88M19J30l18J59N7m52L23K00k81J15N1O4q5J60l55M03R4k44q7
3614a89N04n53N4N54o17J31J97K0k92K24J30j53L81j93k10J35J74k40P8O3j5j00
3636H3O3K79l92K68J02k71j32J50L3j12J72l7k51L35j5l74L81jm42L42J55m96
3658a60R9N11o53K09K91o16M1N96o31J7O50m68k05O62n75l21R07o27k49O69k96
3679a49m67N81K29p11L99K28m53J05K97m06N8K77j52j48L71k03j61J36K92k67
3699a44J5K93j83k38M67k23k43M32ql64M13Q7m85M35P3m20N6K67l97J61M71n23
3721e8k0M35l63O6N20m73k22N06m06j13N94l77k66N05n9m97O95k04l36K54J12
$$ y = [-362, 240, 42, -179, 251, -15, -236, 264, 61, -457, 80, -5, -414, 58, -33, -404, 11, -74, -479, -183, -57, -393, -315, 46, -542, -123, 7, -311, -152, -95, -547, -224, -24, -305, -190, -139, -75, -160, 0, -355, 48, 142, -102, -189, 315, -238, -184, 370, -247, -116, 81, 101, -191, 33, 163, 10, 391, 198, -12, 123, 297, 57, 135, 198, 183, 83, 146, 425, 33, 301, 403, 132, 0, 150, 183, 71, 243, 206, -45, 290, 275, -99, 282, 281, -161, 181, 336, -160, -61, 450, -203, 6, 297, -319, -278, 318, -313, -296, 354, -114, -319, 343, -232, -553, 354, -273, -522, 147, -149, -616, -35, 194, -517, -118, 110, -343, -238, 59, -347, -289, -12, -164, -312, 59, -144, -305, -169, 123, -144, -129, 164, -19, -257, 210, -13, -256, 176, 168, -196, 217, 304, -181, 254, 327, -93, -37, 230, -167, -6, 465, -58, -78, 357, -6, 60, 580, 107, -115, 391, -15, -128, 466, 89, -177, 328, 269, -228, 467, 263, -73, 181, 293]
3742B93l52J67J57l56J69J45l92K54M6k74J03m9J36k04J39jO9j98m0N51m25k17
3764b79K93j86o1L12j67l60M50j53j07N6J17rl2l5j04N1M3p0O7j06N8K13k27J31
3788a05K00l73n5N31m60j14N17l2n31O95j81p60Q86N9p66P05K73q30M10O08r12
3809b35L3P98o83M4N31l28k45M96j83l25M90j72j98L6K54j77j5J12O1l97J56N40
3831E93n63j89N29m32q1N45l32m16N55K02p78L74M59p04P6O24r54R4R61q62l19
3852f18R33m53m85R06k48p65P83L22q15K67L87m53j80N26k92j99K81J58m24J89
3872a80K68k06j36L89l25j74L47Q0m39L80J51m31K30N2l88L62K44o43K97L77l28
3893g3j16O86o36j15N14k28k21N65j90l46N96j62m51M67K09o67J78M06n24J83
$$ y = [293, -59, 108, 265, -91, 78, 223, -169, 85, 131, -143, -40, -89, 47, -157, -18, -19, 50, -148, -188, 363, -62, -279, 14, -172, -233, 79, -88, -448, 2, -151, -258, -202, -85, -94, -126, -161, -265, -214, -171, -241, -174, -280, -222, -9, -236, -105, 95, -278, -333, 198, -262, -376, 141, 109, -422, 273, 92, -668, 218, 277, -489, 216, 489, -341, 69, 677, -235, -202, 596, -87, -43, 488, 160, -85, 411, 228, -97, 393, 221, 23, 59, 313, 136, 121, 233, 294, -103, 53, 593, 30, -159, 370, -62, -143, 402, 70, -346, 209, 411, -367, 7, 466, -238, -162, 462, -492, -398, 563, -299, -618, 315, -138, -623, 283, 35, -730, 53, 375, -440, -173, 214, -239, -419, 107, -185, -384, -103, 55, -369, -180, 88, -118, -254, 135, -190, -364, -17, 63, -376, 4, 155, -276, -46, 6, -382, -20, 224, -419, -122, 255, -73, -189, 497, -139, -254, 260, 32, -189, 376, 186, -160, 436, 274, -177, 290, 499, -168, 10, 416, -108, 75]
3913G5M97n10p1L97m51j87P67m62r8M64l6o78N71j10n12N66k1l78N2N89o83J5
3935b04M79k79l12M84r5l18M83j23m25M43m8o03N45L76o80J5M35o14K9N26l79
3956b65k33P53k70m42O39q8n08L83N3o34L65L56n64K17N43p57K24M50m92k24O73
3977A79k15l09N16J73o81M56o9m80M76K39n26K24M43o09l4O66m17J12L47n42k17
3998b68Q21m50l22O31n1o96O53J25q84P59L63r20K66N06q08J00R91r63n8Q51n00
4019A46m25P70k67q69J068j21p39P10J69r83N28O93q90J18M82n82j18P70o27m21
4039e88Q89k71n18O57%p18L74L08p44N13J18n20J64O67n95j24Q82o45m46Q46k85
4060c6o93P98K33q95P29M90j258N67N30r27J06R88r20j79Q84m50n44J111k08j036
$$ y = [75, 572, 62, -9, 388, -63, -250, 517, 55, -43, 421, 385, -293, 278, 168, -344, 222, 201, -177, -125, 464, -219, -204, 275, -4, -316, 168, 73, -245, 238, 115, -310, 133, 85, -518, 27, 403, -277, -262, 173, -441, -412, 114, -265, -498, 255, -15, -457, 182, 94, -414, -31, 22, -612, -247, 109, -455, -238, 305, -452, -228, 222, -270, -494, 179, -36, -345, 171, 344, -337, 119, 50, -430, 46, 285, -241, -17, 426, -183, -217, 449, 32, 144, 491, -51, -268, 553, 103, -219, 412, 361, -335, 318, 443, -441, 318, 681, -239, 27, 533, -275, -175, 816, -147, -205, 646, 146, -279, 491, 224, -645, 423, 302, -437, 273, 442, -541, -13, 680, -210, -92, 390, -192, -310, 460, -167, -588, 301, 30, -488, 169, 169, -549, -175, 133, -611, -98, 20, -500, -336, 331, -264, -388, 494, -151, -597, 249, -36, -729, 69, 302, -593, 136, 626, -632, -65, 465, -462, -356, 632, -288, -467, 417, -33, -577, 534, 326, -710]
4080g10J106j13j007J014L96j272M56R00j050J97R16q73j32P86m65o60R25Np24
4099c05O83L16j085N78L61o30j1P03n56o8M92m53l40P01l69l75O10o1l63M7L71
4120B46o09L49K48n91J74M37l88r2N14m50l31N44j7o01M88K47p02M75J00n80M93
4141d6K65o94K45N52p00n9N55n16M4N34m06k50N25k77l6M34l51j03L53J5l28M65
4163B21j7m87L87j6j60J65J23l88j31N94k59k8L28k32k12L27p8k64K26K68m67
4184a00J75J46o6k78L12P7j36K24q2l13K00K50l03N7J85l41RK30n5j61K53l12
4206b9j39N38m62j12M18j15k34J99J16l69M07k79j79K19O1m32K22K19l82J55K03
4227B5l82J83J71m77L75O9o5R8J10l16l0J29o6J35K6j54O4m6p1K23k40J01J81
$$ y = [-710, 396, 283, -724, 290, 686, -586, -130, 770, -280, -83, 833, -40, -172, 614, 149, -511, 414, 419, -305, 378, 694, -391, 187, 548, -82, -93, 610, 54, -14, 478, 25, -315, 386, 17, -358, 252, 191, -172, -125, 246, -363, -14, 234, -357, -183, 254, -134, -226, 288, -162, -493, 51, 34, -567, -79, 168, -534, -59, 41, -539, -46, 219, -475, -230, 322, -378, -437, 118, -398, -354, 180, -226, -476, 49, -228, -264, 170, -181, -284, 69, 84, -244, 221, 204, -283, 104, 88, -72, 93, 216, -172, -303, 291, 32, 4, 332, 100, -112, 215, 137, -127, 99, 367, -100, 75, 221, 155, -123, 189, 266, 130, 354, 272, -41, 159, 409, 106, 163, 348, 7, 16, 246, 191, 30, 283, -29, -168, 370, -92, -204, 214, 99, -135, 64, 180, -189, 218, -61, -240, -21, 40, -392, -170, 49, -333, -178, 25, -357, -174, -3, -480, -105, -36, -101, -3, 107, -209, -239, -110, -176, -41, -15, -169, -105, -151, -222, 1, -239, -138, 43]
4250D3j25l2K04L5m68N04q3l28J95K07l26J74L48m28J88J31j39k23K88j25j9K56
4272B77J8k18R5P4j46q7O4j4J40m2On3m9J12lrJ82k59J39q3j67O6K06j09j46J82
4298A76j69K1K19j05m22M35m8k71J02L26n96K50K89n63N1N80q18J04Q05n71k68
4319d73P55m19l90P14m00l68O83q6o14O67r7k97J93K10o27L57M50p97L76M61o14
4340c16Q6K65k10j02O12l75m13O93l0l94L78J49m68Q3L44k66k19P60l05n11N25
4361B86r3n65O85K11r56O86M05q35j8R34p17k03R66q77l03J016m26m53O93k60
4381A76o97J014J4r83P41K94r27N05L93r96M27M52q19J35R40r66k11J108p19m03
4401e22Q62j97p74R51k51p30P91J32q70L88M69n45j79Q05q15l1R06o09m70P13
$$ y = [43, -82, -114, 90, 125, -343, 161, 78, -250, -55, 152, -174, 0, 348, -80, 108, 239, 100, -123, 165, 40, 21, 277, 295, 77, 172, 246, 100, 13, 77, 63, 203, 161, 167, 114, 65, 177, 174, 165, 347, 88, 227, 144, -23, 43, 249, 140, -6, 176, 7, 28, 247, 142, -280, 155, 107, -164, -62, 264, -332, -82, 207, -356, -305, 275, -543, -439, 366, -205, -473, 282, -137, -527, 187, -213, -581, 102, 16, -598, 69, -28, -325, -132, 78, -549, -192, 258, -539, -163, 298, -316, -230, 35, -175, -277, 335, -40, -453, 240, 210, -184, 194, 343, -125, -42, 302, 36, -183, 577, 272, -239, 286, 193, -372, 313, 524, -432, 254, 659, -176, -194, 740, 23, -180, 786, -91, -394, 622, 196, -257, 436, 176, -521, 493, 507, -476, 265, 559, -368, 137, 530, -466, -39, 413, -406, -271, 669, -297, -508, 600, -119, -522, 340, 143, -631, 320, 69, -661, 130, 262, -608, -220, 249, -296, -475, 330, -485, -516, 390, -219, -689, 24]
4421B4K03q25M99L51o80J75O45p26P9N86m84k64Q06l84m49R50m58o48Q84m4p17
4442d77O14M55j130N45N87q33J99O08q43N7R90p98l7P65o65l46Q69q2q69J052
4462F61q7j038P98L12j010M35N50r01L80M71o43k4O45p02j90R14m60o36J134k22
4482C87q06N79J34p36K38Q60j040J59O78q98R0Q00m61l75N96j87o06O62P0r31
4502g87P55K51q12M33M41p36O8P28o99k62J024n00k27N53k01n83P12m3p54P63
4522A24J62p58L87M76r08M68O35q84J42O88p22k70J081n30n78R51m50m77Q11j07
4542B41o55O08K84q14L90N39o83L6O19o49k34J125p45l78R65l73n52P82j64p34
4562c92M14N63q58L19M96q64K58N01n29k99P86n29m25J024l09o20P44M9p99M41
$$ y = [24, 227, -598, -99, 252, -428, -253, 392, -334, -255, 331, -153, -417, 389, 5, -444, 506, 48, -600, 284, 240, -477, 137, 592, -538, 7, 594, -239, -40, 568, -275, -218, 772, -26, -63, 702, 37, -309, 560, 478, -391, 661, 574, -464, 334, 646, -364, 71, 621, -280, 100, 571, -72, -96, 549, -153, -343, 571, 111, -525, 609, 387, -419, 160, 294, -442, -204, 656, -384, -225, 453, -445, -355, 445, -16, -391, 205, 18, -588, 74, 144, -787, -32, 219, -593, -160, 281, -455, -387, 341, -358, -620, 404, -96, -323, 230, 29, -554, 158, 115, -639, 124, 286, -472, -85, 391, -517, -49, 586, -298, -156, 532, -190, -460, 621, 91, -487, 464, 14, -463, 348, 241, -414, 194, 478, -336, 54, 593, -90, -54, 565, -84, -318, 807, 62, -316, 649, 276, -276, 506, 342, -392, 22, 585, -273, 46, 542, -322, -64, 437, -92, -391, 395, -134, -559, 465, 156, -464, 280, 329, -470, -29]
4582b9Q3m61K15L03m63j0N54l54k77N39k25l98O44j79m38L26K30n84K80M05m33
4603b72m1O73p27N3L66k84j02N40l10l90P03j29l57L96l2k56K41K16o08L16J98
4624A94l00J93J79m77K49M54m87J4M31m03j22L52o4m04O61k52l11M03n3l83K42
4645A16J11n02L34L63m72J89J99l15K0L63m03p2L15q6l61K76j4l39L83ok60J33
4667b8J46k19j10L92l57l8K67j35j04J57j18k90K79J60l45J0M47k85j81M42k99
4688b09j60N01j83l47L77O7n98O22N0l88J0L58l31J1K16K4l6K29l59j4L33k56
4710h3k5L00j16l06M44j49q7J86j40j10K73K6k33L23Jk83K20j90P3J49J47l08
4732A12m4K14p8Q3j20j9j56K70j9q3m8J16k23K49n8k38N2K81k89P4n7m9j21J91
$$ y = [-29, 54, -407, -192, 111, -352, -362, 192, -162, -439, 100, -125, -523, 121, -58, -496, -170, 60, -524, -244, 161, -272, -313, 360, -367, -314, 52, -232, -334, 206, -104, -494, 209, 80, -277, 119, 87, -169, 72, 288, -320, -4, 194, -106, 87, 266, -211, 38, 492, 5, 19, 450, 47, -75, 277, 213, -191, 470, 218, -93, 310, 257, -126, 116, 227, -275, 59, 422, -50, 139, 338, 23, 43, 406, 3, -69, 246, 160, -201, 75, 61, -278, 105, 99, -161, -28, 118, -101, -211, 181, -176, -214, 53, -82, -186, -29, -147, -437, -158, 2, -343, -333, 114, -171, -352, 90, -209, -369, 132, -51, -398, -21, 46, -552, 70, 120, -268, -258, 100, -231, -220, -4, 20, -16, 213, -146, -160, 173, -83, -108, 192, 76, -230, 214, 65, -22, 164, 24, -86, 187, 213, -20, 303, 304, 21, 241, 51, 124, 273, 420, 112, 68, 282, 204, 287, 167, 148, -8, 262, 243, 160, 112, 228, 5, 254, 196, -42, 10, 291, 2, 76, 19, -30, -151, 40]
4756D0j25R4Qj74j00L49q1l16J98N8k62K67o8j65o9L73l09O5J31k21N1K30q4j08
4780b18K69l6l21J54J02l02L01N1k49K80J10m39J27K97k10J06P9k99n6M05j59
4801hj96J68O6K8O2on1P3J11o8Mm1N3o3n4R1j15J6m9J87j01K0JJ38r0J54j36n8
4829A36k0n3J3R5o7m6Q8k37L7K38k03K08j54k35L65l9m88M07j79N8n8O5J1kk1
4854h1r7q6J44j10J92L4j04j24K92j31l72K73Q3j18J82k5j93J90j11Q9j1J60j74
4877i8Q7j86M1k02L48j45J17q3J47K6j57K41J16l37J52j03kJ31J21k07J77o7L6
4900A53N9P5j61q2K9j5J94n8p7j27L31k87J21J93j81j67Q2J78j29R4k26jQ7n5
4924C0n9P4K49m01J80r8J1p2J12j23r4J15J00Q1j19k5J0k18K70k78K65k35O6P9
$$ y = [40, -85, 9, 17, -157, -257, 92, 11, -305, -107, -49, -311, -44, -112, -277, -346, 27, -282, -217, -86, -307, -256, -26, -110, -218, 51, 15, -306, -152, -50, -352, -51, 0, -249, 31, 141, -298, -171, 126, -84, 22, 101, -198, -254, 151, -8, -204, -36, 30, 58, 120, 114, 63, 136, 247, 179, 183, 142, 195, 132, 78, 169, 54, 70, 21, 208, 107, 127, 128, 266, 176, 330, 194, 136, 116, 63, 76, 171, 104, 58, 146, -91, -54, 184, -19, 189, 35, -200, 165, 126, -362, 45, -134, -76, -134, -69, -58, -60, -81, -178, -264, -120, -230, -38, -4, -108, -232, 60, -71, -443, -170, -87, -205, -23, -48, -241, -51, -162, -73, -84, 76, -98, -11, -197, -156, -358, -10, -155, -38, -121, 26, 52, -105, 136, 252, -85, 67, -36, -38, 93, 214, 7, 184, 117, 153, 212, 287, 126, 44, 73, 58, 252, 194, 117, -10, 321, 34, 155, 348, 167, 0, 82, 260, 131, 225, -1, -2, 85, 30, -29, 45, 294, -107, 73, -25, -14, -86, 26, -97, -191, -76, 24, 105, -14, -39, -29, -247, 23, -255, 10, -225, -159, -80]
4948h0p6J42j11l9l1J10j9q3r2J47O8pj20J98k08KK06O5l05K09o6k07K31K34j06
4973F2M6r0j05j4M68m35K86kl53J02K40p7k41J95J45k75K38J13l49L25l1j50r1
4996GJ80n1j50K08j40m7L47j20j15O3nn1l9K29k48M0L52m28q7K29j16j62J79N1
5020A26l15L45N8l58J40M7l97J85K37k30j69L77j29j32K13j14j15J59l9k14L04
5041b1k41r0J36J83k17K2K67k67J43K39l74K11m3lm4J04l5q5J88j11k00K36Ql67
5065c61L79J68l67K14J72j62l0L19l53j34M38j32j17K10l7k13K21J07m20L47j1
$$ y = [-80, -156, -14, -125, -164, -195, -85, -104, -187, -279, -132, -64, -71, -191, 7, -201, -199, 7, 72, -233, -24, -90, -297, -66, 168, 62, 108, 18, -87, -101, 367, -68, 218, 216, -137, -35, 205, 128, -113, 82, 227, -48, 190, 303, -46, 279, 248, 98, 7, 187, 136, -14, 194, 54, 7, 354, 234, 119, 182, 177, 126, 87, 316, 68, 108, 460, 32, -55, 174, 58, -104, 75, 126, -189, 156, 214, -144, -4, 43, -354, -169, 68, -162, -331, 46, -83, -215, -2, -116, -231, -72, -111, -325, -21, -262, -352, -216, -33, -250, -228, 39, -228, -85, 154, -220, -9, -52, -55, -99, 5, -30, -115, 73, -38, -238, -2, 6, -361, 18, 186, -181, 33, 205, 43, 13, 332, -21, -155, 283, 151, 34, 244, 207, -6, 215, 322, -98, 249, 238]
$$ [...]
8191E6
##END NTUPLES=NMR FID
##END=
