##TITLE=1H_CPA2B2806
 CDCl3, 8 sc, 
 29.06.2021
##JCAMPDX= 6.0         $$ Bruker NMR JCAMP-DX V2.0
##DATA TYPE= NMR FID
##DATA CLASS= NTUPLES
##ORIGIN= UXNMR, Bruker Analytische Messtechnik GmbH
##OWNER= root
$$ XWIN-NMR		Version 3.5
$$ Tue Jun 29 09:10:31 2021 Russian Standard Time (UT+4h)  she@DPX200
##.OBSERVE FREQUENCY= 200.131506
##.OBSERVE NUCLEUS= ^1H
##.DELAY= (6, 6)
##.ACQUISITION MODE= SIMULTANEOUS
##.ACQUISITION SCHEME= undefined
##.AVERAGES= 8
##.DIGITISER RES= 18
##SPECTROMETER/DATA SYSTEM= spect
##.PULSE SEQUENCE= zg30
##.SOLVENT NAME= CDCl3
##.SHIFT REFERENCE= (INTERNAL, CDCl3, 0, 15.7039)
##AUDIT TRAIL= $$ (NUMBER, WHEN, WHO, WHERE, WHAT)
$$ ##TITLE= Audit trail, XWIN-NMR		Version 3.5
$$ ##JCAMPDX= 5.01
$$ ##ORIGIN= Bruker BioSpin GmbH
$$ ##OWNER= she
$$ F:/spectra/data/she/nmr/H-F/1/audita.txt
$$ ##AUDIT TRAIL=  $$ (NUMBER, WHEN, WHO, WHERE, WHAT)
(   1,<2021-06-29 09:09:28.21 +0400>,<she>,<DPX200>,
      <created by zg, POWCHK disabled, PULCHK disabled
       configuration hash MD5:
       00 E9 B6 7A A2 85 ED C7 34 08 36 98 17 FE 4E 26
       data hash MD5: 16K
       A6 EB 64 46 C0 A8 C5 DF BA 4C 61 56 61 E8 78 E6>)
$$ ##END=
$$ 
$$ hash MD5
$$ A6 CC 17 14 B4 55 EF E5 A4 21 80 6B 34 73 23 30
##$RELAX= 
##$RELAX= 
##$RELAX= 
##$RELAX= 
##$RELAX= 
##$RELAX= 
$$ Bruker specific parameters
$$ --------------------------
##$DU= <F:/spectra>
##$EXPNO= 1
##$NAME= <H-F>
##$PROCNO= 1
##$TYPE= <nmr>
##$USER= <she>
##$AMP= (0..31)
100 100 100 100 100 100 100 100 100 100 100 100 100 100 100 100 100 100 
100 100 100 100 100 100 100 100 100 100 100 100 100 100 
##$AQSEQ= 0
##$AQ_mod= 1
##$AUNM= <au_zg>
##$AUTOPOS= <>
##$BF1= 200.13
##$BF2= 200.13
##$BF3= 200.13
##$BF4= 200.13
##$BF5= 200.13
##$BF6= 200.13
##$BF7= 200.13
##$BF8= 200.13
##$BYTORDA= 1
##$CFDGTYP= 0
##$CFRGTYP= 5
##$CHEMSTR= <none>
##$CNST= (0..31)
1 1 145 1 1 1 1 1 1 1 1 1 1 1 1 1 1 1 1 1 1 1 1 1 1 1 1 1 1 1 1 1 
##$CPDPRG= <>
##$CPDPRG1= <>
##$CPDPRG2= <>
##$CPDPRG3= <>
##$CPDPRG4= <mlev>
##$CPDPRG5= <mlev>
##$CPDPRG6= <mlev>
##$CPDPRG7= <mlev>
##$CPDPRG8= <mlev>
##$CPDPRGB= <>
##$CPDPRGT= <>
##$D= (0..31)
0 1.2 0 0 0 0 0 0 0 0.06 0 0.03 0 0 0 0 0.0002 0 0 0 0 0 0 0 0 0 0 0 0 
0 0 0 
##$DATE= 1624943367
##$DBL= (0..7)
120 120 120 120 120 120 120 120 
##$DBP= (0..7)
150 150 150 150 150 150 150 150 
##$DBP07= 0
##$DBPNAM0= <>
##$DBPNAM1= <>
##$DBPNAM2= <>
##$DBPNAM3= <>
##$DBPNAM4= <>
##$DBPNAM5= <>
##$DBPNAM6= <>
##$DBPNAM7= <>
##$DBPOAL= (0..7)
0.5 0.5 0.5 0.5 0.5 0.5 0.5 0.5 
##$DBPOFFS= (0..7)
0 0 0 0 0 0 0 0 
##$DE= 6
##$DECBNUC= <off>
##$DECIM= 32
##$DECNUC= <off>
##$DECSTAT= 4
##$DIGMOD= 1
##$DIGTYP= 9
##$DL= (0..7)
0 120 120 120 120 120 120 120 
##$DP= (0..7)
150 150 150 150 150 150 150 150 
##$DP07= 0
##$DPNAME0= <>
##$DPNAME1= <>
##$DPNAME2= <>
##$DPNAME3= <>
##$DPNAME4= <>
##$DPNAME5= <>
##$DPNAME6= <>
##$DPNAME7= <>
##$DPOAL= (0..7)
0.5 0.5 0.5 0.5 0.5 0.5 0.5 0.5 
##$DPOFFS= (0..7)
0 0 0 0 0 0 0 0 
##$DQDMODE= 0
##$DR= 18
##$DS= 0
##$DSLIST= <SSSSSSSSSSSSSSS>
$$ [...]
##$SUBNAM2= <"">
##$SUBNAM3= <"">
##$SUBNAM4= <"">
##$SUBNAM5= <"">
##$SUBNAM6= <"">
##$SUBNAM7= <"">
##$SUBNAM8= <"">
##$SUBNAM9= <"">
##$SW= 20.0188882624521
##$SWIBOX= (0..15)
0 0 2 0 0 0 0 0 0 0 0 0 0 0 0 0 
##$SW_h= 4006.41025641026
##$TD= 16384
##$TD0= 1
##$TE= 0
##$TE2= 300
##$TE3= 300
##$TEG= 300
##$TL= (0..7)
0 120 120 120 120 120 120 120 
##$TP= (0..7)
150 150 150 150 150 150 150 150 
##$TP07= 0
##$TPNAME0= <>
##$TPNAME1= <>
##$TPNAME2= <>
##$TPNAME3= <>
##$TPNAME4= <>
##$TPNAME5= <>
##$TPNAME6= <>
##$TPNAME7= <>
##$TPOAL= (0..7)
0.5 0.5 0.5 0.5 0.5 0.5 0.5 0.5 
##$TPOFFS= (0..7)
0 0 0 0 0 0 0 0 
##$TUNHIN= 0
##$TUNHOUT= 0
##$TUNXOUT= 0
##$USERA1= <user>
##$USERA2= <user>
##$USERA3= <user>
##$USERA4= <user>
##$USERA5= <user>
##$V9= 5
##$VALIST= <valist>
##$VCLIST= <CCCCCCCCCCCCCCC>
##$VD= 0
##$VDLIST= <DDDDDDDDDDDDDDD>
##$VPLIST= <PPPPPPPPPPPPPPP>
##$VTLIST= <TTTTTTTTTTTTTTT>
##$WBST= 1024
##$WBSW= 4
##$XGAIN= (0..3)
0 0 0 0 
##$XL= 0
##$YL= 0
##$YMAX_a= 428684
##$YMIN_a= -374411
##$ZGOPTNS= <>
##$ZL1= 120
##$ZL2= 120
##$ZL3= 120
##$ZL4= 120
##$ABSF1= 10
##$ABSF2= 0
##$ABSG= 5
##$ABSL= 3
##$ALPHA= 0
##$AQORDER= 0
##$ASSFAC= 0
##$ASSFACI= 0
##$ASSFACX= 0
##$ASSWID= 0
##$AUNMP= <proc_1d>
##$AZFE= 0.1
##$AZFW= 0.1
##$BCFW= 1
##$BC_mod= 2
##$BYTORDP= 1
##$COROFFS= 0
##$CY= 11.3945322036743
##$DATMOD= 1
##$DC= 2
##$DFILT= <>
##$DTYPP= 0
##$F1P= 15.9154993809931
##$F2P= -4.1035820241983
##$FCOR= 0.5
##$FTSIZE= 0
##$FT_mod= 4
##$GAMMA= 1
##$GB= 0.15
##$INTBC= 1
##$INTSCL= 1
##$ISEN= 128
##$LB= 0.24
##$LEV0= 0
##$LPBIN= 0
##$MAXI= 10000
##$MC2= 0
##$MEAN= 0
##$ME_mod= 0
##$MI= 1.114404
##$NCOEF= 0
##$NC_proc= 0
##$NLEV= 6
##$NOISF1= 3.799351
##$NOISF2= 2.8
##$NSP= 1
##$NTH_PI= 0
##$NZP= 0
##$OFFSET= 15.70392
##$PC= 1
##$PHC0= -11571.16
##$PHC1= 12.40101
##$PH_mod= 1
##$PKNL= yes
##$PPARMOD= 0
##$PSCAL= 0
##$PSIGN= 0
##$REVERSE= no
##$SF= 200.130013532006
##$SI= 16384
##$SIGF1= 3
##$SIGF2= 2
##$SINO= 400
##$SIOLD= 16384
##$SREGLST= <1H.CDCl3>
##$SSB= 0
##$STSI= 0
##$STSR= 0
##$SW_p= 3612.71676300578
##$SYMM= 0
##$S_DEV= 0
##$TDeff= 0
##$TDoff= 0
##$TI= <>
##$TILT= no
##$TM1= 0
##$TM2= 0
##$TOPLEV= 0
##$USERP1= <user>
##$USERP2= <user>
##$USERP3= <user>
##$USERP4= <user>
##$USERP5= <user>
##$WDW= 1
##$XDIM= 8192
##$YMAX_p= 0
##$YMIN_p= 0
$$ End of Bruker specific parameters
$$ ---------------------------------
##NTUPLES= NMR FID
##VAR_NAME=  TIME,          FID/REAL,        FID/IMAG
##SYMBOL=    X,             R,               I
##VAR_TYPE=  INDEPENDENT,   DEPENDENT,       DEPENDENT
##VAR_FORM=  AFFN,          ASDF,            ASDF
##VAR_DIM=   8192,          8192,            8192
##UNITS=     SECONDS,       ARBITRARY UNITS, ARBITRARY UNITS
##FACTOR=    0.0002496,     1,               1
##FIRST=     0,             0,               0
##LAST=      2.0444736,     0,               0
##MIN=       0,             -374411,         0
##MAX=       2.0444736,     428684,          0
$$ Real data points
##PAGE= N=1
##DATA TABLE= (X++(R..R)), XYDATA
$$ [...]
$$ plain form
2001 2048 -1415 -852 2207 -699 -996 2177 206 -1524 1208 98 -2087 876 1511 -1013 577 1658
2017 1658 -993 -199 1792 -258 -610 2041 397 -1152 1506 802 -1580 1210 1637 -1456 65 1401
2033 1401 -1748 -432 2035 -828 -377 2560 -149 -1324 2104 -43 -1789 1944 687 -2510 1006
2048 1006 1048 -2593 673 1956 -2213 2 1924 -2214 -767 1914 -1324 -908 2239 -866 -1506 1697
2064 1697 -868 -2153 1384 -42 -2460 437 418 -2072 169 1000 -1361 66 998 -997 -699 798
2080 798 -589 -798 830 144 -1188 64 396 -1044 -99 1010 -1322 -388 1586 -848 -1196 2153 764
2097 764 -1689 1592 1359 -2072 588 1214 -1802 575 1739 -2001 147 2432 -1677 -408 2984 -1158
2113 -1158 -964 2605 -655 -1354 2583 -83 -1849 2467 616 -2322 1710 1057 -2065 689 1231 -1481
$$ packed form
2001B048l463N63L059k906k97L173j971j730K732j110k185K963O35k524J590J081
2017A658k651P94J991k050l52K651j644j549K658p04k382K790M27l093J521J336
2033A401l149J316K467k863M51K937k709j175L428k147j746L733j257l197L516
2048A006M2l641L266J283m169K215J922m138J447K681l238M16L147l105o40L203
2064A697k565j285L537j426k418K897j9k490K241Q31k361J427R32j995K98J497
2080G98j387k09J628o86j332J252L32j440R45J109k332R34J974k434l48L349j389
2097G64k453L281k33l431K660O26l016K377J164l740K148K285m109J269L392m142
2113a158J94L569l260o99L937k666j766M316j851k938M032o53l122K754N42k712
$$ plain form
2129 -1481 537 1188 -1260 690 1654 -1521 -278 1982 -830 -1366 1017 134 -1083 119 627 -606
2145 -606 -359 418 -383 -776 485 -137 -1078 436 652 -1436 -192 1035 -1246 -734 767 -1557 -507
2162 -507 1038 -1551 -937 2132 -706 -1615 2075 45 -1917 1120 284 -1698 1108 -55 -1924 1467
2178 1467 543 -2417 1092 1256 -2308 466 1660 -1863 234 2016 -1287 -51 2149 -792 -699 1982
2194 1982 -273 -1004 945 69 -538 620 144 107 821 245 -55 471 478 189 25 206 869 -84 -123 833
2214 833 415 -904 626 343 -882 536 244 -973 803 665 -985 889 810 -940 413 657 -1330
2231 -1330 453 718 -1824 211 1077 -1822 20 1634 -1514 -410 1403 -1227 -522 1453 -1078 -829
2247 -829 1468 -759 -1173 1081 -687 -1374 515 -261 -1090 555 -249 -758 749 -122 -490 526 -92
$$ packed form
2129a481K018O51k448J950R64l175J243K260k812n36K383q83j217J202N08j233
2145f06K47P77q01l93J261o22r41J514K16k088J244J227k281N12J501k324J050
2162e07J545k589O14L069k838r09L690k030j962L037q36j982K806j163j869L391
2178A467r24k960L509J64l564K774J194l523K097J782l303J236K200k941R3K681
2194A982k255p31J949q76o07J158m76l7P14n76l00N26Pk89j64J81O63r53l9R56
2214H33m18j319J530k83j225J418k92j217J776j38j650J874p9j750J353K44j987
2231a330J783K65k542K035Q66k899J842J614l148J104J813k630P05J975k531K49
2247h29K297k227m14K254j768o87J889p76q29J645q04n09J507q71l68J016o18
$$ plain form
2264 -92 -422 318 -394 -354 462 -489 -467 953 -281 -414 911 -275 -696 923 -201 -502 1179 119
2282 119 -277 1142 266 -273 1000 -154 -533 783 -304 -602 1150 -46 -459 1203 122 -513 1227
2299 1227 147 -857 1155 143 -902 998 262 -788 780 364 -810 724 252 -907 555 128
2315 128 -833 672 374 -643 734 -81 -865 540 -139 -1124 530 189 -1104 603 306 -1152 417
2332 417 490 -1426 350 575 -1474 -2 632 -978 14 746 -964 -126 654 -1017 -371 542 -815 -437
2350 -437 524 -483 -294 638 -251 -176 582 -321 -388 162 -184 -196 174 -3 -46 230 -176 150 174 26 140
2371 140 85 -124 311 227 -176 756 236 -365 613 303 -706 542 569 -925 506 900 -894 408 1346
2390 1346 -638 -64 1225 -622 -356 1217 -617 -477 1315 -334 -800 1219 -102 -1209 939 159
$$ packed form
2264i2l30P40p12M0Q16r51K2J420j234j33J325j186m21J619j124l01J681j060
2282A19l96J419q76n39J273j154l79J316j087k98J752j196m13J662j081o35J740
2299A227j080j004K012j012j045J900p36j050J568m16j174J534m72j159J462m27
2315A28r61J505k98j017J377q15p84J405o79r85J654l41j293J707k97j458J569
2332D17P3j916J776K25k049J472O34j610R92P32j710Q38P80j671O46R13j357L78
2350d37R61j007J89R32q89P5P58r03o7N50l46j2L70j77m3K76m06L26K4j48J14
2371A40n5k09M35q4m03R32n20o01R78l10j009J248K7j494J431L94j794J302R38
2390A346j984N74J289j847K66J573j834J40J792j649m66K019j321j107K148p80
$$ plain form
2406 159 -1199 568 419 -1005 389 594 -837 269 598 -942 -439 333 -573 -508 255 -385 -370 149
2424 149 -146 -542 289 80 -931 -45 302 -606 -596 600 -30 -724 251 101 -791 110 78 -871 59 467
2444 467 -860 6 1080 -774 -448 1113 -422 -678 1000 -353 -897 1142 9 -1195 1167 508
2460 508 -1273 834 958 -1140 242 1049 -897 350 1171 -665 -60 1609 -697 -587 1395 -86
2476 -86 -1059 1103 316 -855 717 628 -872 499 885 -765 69 857 -624 -507 931 -108 -534 632
2494 632 385 -838 533 398 -1104 107 729 -941 -266 1075 -729 -721 1286 -140 -1173 1022 -136
2511 -136 -1593 633 388 -1618 557 940 -1697 -82 1116 -1374 -302 1501 -986 -901 1400 -815
2527 -815 -1115 1374 -357 -1235 1113 167 -1599 665 564 -1162 605 987 -957 -3 1027 -723 -267
$$ packed form
2406A59j358J767j49j424J394K05j431J106L29j540N03P72r06O5P63o40J5N19
2424A49k95l96Q31k09j011Q86L47r08J0J196o30o94R75j50q92R01l2r49R30M08
2444D67j327Q66J074j854L26J561j535k56J678j353n44K039j133j204K362o59
2460E08j781K107J24k098J382Q07j946J247Q21j836O05J669k306J10J982j481
2476h6r73K162p87j171J572q9j500J371L86j650Q34P88j481J17J438j039m26J166
2494F32k47j223J371j35j502J211O22j670O75J341j804QK007j426j033K195j158
2511a36j457K226k45k006K175L83k637J615J198k490J072J803k487Q5K301k215
2527h15l00K489j731q78K348r46j766K264j01j726J767L82j944R54J030j750M56
$$ plain form
2544 -267 1100 -346 -564 818 -80 -744 644 482 -666 489 737 -756 -191 948 -221 -320 1285
2561 1285 165 -754 806 381 -1087 830 901 -1089 363 1229 -1326 -125 1534 -922 -177 1810
2577 1810 -800 -1239 1693 -342 -1362 1710 252 -1729 1078 508 -1886 503 818 -1511 641 968
2593 968 -1647 -115 1054 -1440 -208 1528 -930 -852 999 -670 -1114 765 -254 -883 669 -25
2609 -25 -1180 160 630 -533 -281 615 -363 -892 439 128 -759 453 494 -1040 -51 789 -1186 -537
2627 -537 1634 -538 -1235 1409 -60 -1554 1385 647 -1360 1260 826 -1864 834 1156 -1944 690
2643 690 1817 -1599 -8 1652 -1455 -274 1858 -851 -407 2106 -939 -1105 1788 -220 -1109 1627
2659 1627 180 -1062 1077 -87 -1048 1126 539 -1118 621 1025 -1016 -12 959 -396 -453 594
$$ packed form
2544b67J367j446k18J382q98o64J388j62j148J155K48j493N65J139j169r9J605
2561A285j120r19J560m25j468J917P1j990J452Q66k555J201J659k456P45J987
2577A810k610m39K932k035j020L072j458j981K807n70k394K389L15k329K152L27
2593I68k615J532J169k494J232J736k458P8J851j669m44J879j019o29J552o94
2609b5j155J340M70j163K52Q96r78n29J331l11q87J212M1j534R89Q40j975O49
2627e37K171k172o97K644j469j494K939p38k007K620m34k690K698L22l100K634
2643F90J127l416J591J660l107J181K132k709M44K513l045j66K893k008q89K736
2659A627j447j242K139j164r61K174n87j657J739M04k041J004R71j355n7J047
$$ plain form
2675 594 49 -368 71 121 -248 -79 706 -367 -619 538 41 -1185 643 544 -1303 218 824 -1330
2693 -1330 145 1031 -1557 -32 1532 -1581 -1023 1765 -1176 -1195 1727 -677 -1349 1444 -599 -1477
2709 -1477 1711 -100 -1760 1459 385 -1972 1031 834 -1725 843 916 -1826 458 1145 -1613 242
2725 242 1454 -1178 -191 1528 -716 -556 1002 -329 -587 747 -18 -675 472 363 -606 52 743
2742 743 -140 -603 482 544 -683 396 766 -700 -109 1180 -740 -629 1568 -339 -1218 1610 64
2759 64 -1619 1388 611 -1642 970 838 -1734 639 1100 -1624 -3 1396 -1681 -75 1370 -1248
2775 -1248 -473 1285 -1114 -691 1327 -982 -747 1172 -395 -1133 1012 -256 -1102 834 61 -1102
2791 -1102 544 210 -1054 219 351 -758 -151 565 -186 -340 285 97 -550 37 340 -419 -334 491 -72
$$ packed form
2675E94n45m17M39N0l69J69P85j073k52J157m97j226J828r9j847J521O06k154
2693a330J475Q86k588J525J564l113N58K788k941j9K922k404o72K793k043q78
2709a477L188j811j660L219j074k357L003j97k559K568P3k742K284O87k758J855
2725B42J212k632R87J719k244J60J558j331k58J334p65o57J147j09r69O58O91
2742G43q83m63J085O2j227J079L70j466N91J289j920J11K197j907q79K828j546
2759F4j683L007p77k253K612j32k572K373M61k724J621J399l077J606J445k618
2775a248P75J758k399M23K018k309K35J919j567p38K145j268q46J936p73j163
2791a102J646l34j264J273J32j109O07P16p51j54O25j88o47N87L03p59Q5Q25n63
$$ plain form
2810 -72 -662 807 265 -751 595 643 -945 408 884 -914 175 972 -1110 -157 1159 -696 -251
2827 -251 1248 -502 -395 1219 -237 -601 1149 -108 -633 1034 62 -712 947 35 -998 853 217
2844 217 -1030 857 522 -798 504 656 -749 140 506 -556 23 645 -513 -320 319 -29 -339 75
2862 75 -57 -259 -36 127 -165 -429 -19 82 -447 74 185 -560 -184 334 -453 -439 529 -464 -503 487 -346
2883 -346 -683 501 -156 -726 661 -63 -646 490 235 -557 384 237 -708 462 172 -787 304 405
2901 405 -815 180 605 -593 -109 463 -361 109 571 -335 139 705 -297 -211 554 -1 -107 290 41
2920 41 11 315 -180 170 451 -141 71 183 23 193 170 -307 241 291 -276 101 377 -312 34 490 -191
2941 -191 -54 347 -391 10 567 -286 -266 409 -107 -239 169 -119 -145 85 -217 -518 139 -168 -331 -39 -123
$$ packed form
2810g2n90J469n42j016J346M8j588J353M76j798J089P97k082R53J316j855M45
2827b51J499j750J07J614j456l64J750j257n25J667r72p74J659r12j033J851o36
2844B17j247J887l35j320J302J52j405Q89L66j062N79O22j158J93O39l48l10M14
2862G5j32k02K23J63k92k64M10J01n29N21J11p45L76N18p87J4R68r93l9R90q33
2883c46l37J184o57n70J387p24n83J136k55p92R41j47r45J170k90r59J091J01
2901D05j220R95M25j198M84N72q24M70M62r06M74N66j002Q6P65n55j06L97k49
2920D1l0L04m95L50K81n92K12J12j60J70k3m77N48N0n67L77K76o89L46M56o81
2941a91J37M01p38M01N57q53K0O75n16j32M08k88k6K30l02l01O57l07j63K92q4
$$ plain form
2962 -123 -270 22 -159 -70 58 -494 -159 150 -319 -181 97 -183 -90 193 -334 -88 254 -442 -113 626 -198
2983 -198 -397 549 -290 -326 488 -188 -355 517 -13 -515 456 266 -559 382 433 -369 323 409 -484 255 486
3004 486 -588 124 567 -432 99 559 -105 -81 480 99 -167 487 68 -179 412 276 -280 169 293 -322
3024 -322 -212 368 1 -192 299 79 -480 107 350 -570 4 458 -504 -200 571 -475 -551 776 -238
3043 -238 -700 531 -8 -754 654 142 -837 351 226 -1073 236 433 -1015 -108 745 -812 -79 679
3061 679 -781 -403 885 -435 -725 829 -379 -874 636 253 -900 657 265 -900 310 685 -635
3078 -635 6 607 -375 -261 717 -271 -579 640 148 -563 266 565 -630 41 601 -436 -88 859 -290
3097 -290 -412 876 -59 -736 694 203 -897 564 617 -1070 469 738 -978 269 1086 -890 -75
$$ packed form
2962a23j47K92j81Q9J28n52L35L09m69J38K78k80R3K83n27K46L42o96L29P39q24
2983a98j99R46q39l6Q14o76j67Q72n30n02R71j90q25R41N1q02O92Q6q93P39K31
3004D86j074P12M43r99N31M60o64K4N61l81k66O54m19k47N91j36n56M49J24o15
3024c22J10N80l67j93M91k20n59N87K43r20N74M54r62L04P71j046p6J327j014
3043b38m62J231n39p46J408n12r79J188j25j299J309J97j448R07Q53j557P33P58
3061F79j460L78J288j320k90J554j208m95J510l83j153J557l92j165J210L75j320
3078f35O41O01r82J14R78r88l08J219m92p11Q29K99j195O71N60j037L48R47j149
3097b90j22J288r35o77J430m91j100J461N3j687J539K69j716J247Q17j976Q15
$$ plain form
3114 -75 1319 -699 -657 1503 -547 -943 1206 -106 -1129 1231 260 -1382 889 726 -1518 424 965
3131 965 -1224 -78 986 -813 -729 1089 -575 -724 755 -256 -796 679 196 -1015 278 439 -916
3148 -916 -376 631 -534 -473 628 -283 -572 464 -133 -859 459 323 -1115 230 625 -936 -117 917
3166 917 -952 -302 1260 -570 -788 1496 -340 -1220 1279 190 -1502 1133 470 -1437 777 755 -1391
3183 -1391 473 1354 -1591 156 1476 -1189 -461 1572 -631 -827 1167 -276 -827 1014 80 -792
3199 -792 976 274 -910 535 639 -553 232 607 -500 -130 542 -429 -145 676 -195 -663 450 53
3217 53 -809 82 663 -600 -168 768 -666 -517 902 -346 -854 1007 -174 -1400 802 532 -1481
3234 -1481 412 1024 -1558 180 1118 -1278 -376 1477 -1255 -797 1606 -973 -1144 1442 -365 -1347
$$ packed form
3114g5J394k018M2K160k050l96K149j312j023K360r71j642K271j63k244J942N41
3131I65k189J146J064j799Q4J818j664j49J479j011n40J475m83j211J293J61j355
3148i16N40J007j165O1J101r11k89J036n97p26J318j36j438J345L95j561Q19J034
3166I17j869O50J562j830k18K284j836q80K499j089j692K635o63j907K214k2k146
3183a391J864Q81k945J747J320k665P28K033k203j96J994j443n51J841r34q72
3199g92J768p02j184J445J04j192P85L75j107L70O72r71K84Q21q71m68J113l97
3217E3q62Q91N81j263M32R36j434J49J419j248n08J861j181j226K202k70k013
3234a481J893O12k582J738R38k396R02J853k732M58K403k579j71K586j807r82
$$ plain form
3250 -1347 1186 50 -1371 1203 424 -1346 964 771 -1446 418 931 -1093 21 892 -534 -47
3266 -47 1017 -702 -382 1017 -146 -586 850 242 -752 500 426 -558 127 811 -454 -330 829 84
3284 84 -720 648 435 -914 484 875 -947 -25 1049 -701 -322 1397 -689 -788 1436 -282 -925
3301 -925 1297 163 -1410 978 619 -1456 653 685 -1400 429 908 -1273 84 1021 -1283 -112
3317 -112 1119 -928 -460 963 -626 -644 902 -384 -771 844 -184 -896 521 45 -909 285 302
3334 302 -773 160 463 -656 -238 517 -217 -349 501 105 -508 118 410 -595 -145 643 -431 -409 971
3353 971 -199 -736 837 301 -793 534 403 -1008 460 620 -950 319 931 -824 -71 1037 -700
3370 -700 -309 1160 -355 -444 1100 -190 -659 969 97 -835 845 320 -786 651 410 -623 558
$$ packed form
3250a347K533j136j421K574p79j770K310j93k217J864N13k024J114Q71j426M87
3266d7J064j719L20J399j163m40J436o08r94J252p4r84O85O84j265J24J159p45
3284H4q04J368k13j349J398L91j822R22J074j750L79J719k086r9K224j718o43
3301i25K222j134j573K388l59k075K109L2k085J829M79k181J357R37k304J171
3317a12J231k047M68J423j589j8J546j286l87J615j028p12J417m76r54J194J7
3334C02j075R33L03j119M18P55p34j32Q50l96o13O26K92j005M50P88j074K2J380
3353I71j170n37J573n36j094J327j31j411J468J60j570J269O12j755P53J108j737
3370g00L91J469j515q9J544j290m69J628q72r32J680n25j106J437k41j033J181
$$ plain form
3387 558 648 -628 151 655 -565 90 693 -285 -300 691 -146 -542 456 79 -449 169 289 -517 -117 300
3407 300 -243 -349 224 -73 -500 236 136 -388 39 502 -562 -15 357 -490 -248 445 -447 -383 568 -107
3427 -107 -355 461 -144 -531 471 44 -425 511 157 -703 488 322 -634 228 465 -527 148 555 -506
3446 -506 1 375 -386 -146 596 -109 -419 369 125 -357 489 192 -274 294 407 -288 145 474 -212 -162
3466 -162 172 155 -210 242 278 -34 100 293 -95 -59 366 -16 -272 417 77 -253 269 -43 -434 247 198
3487 198 -321 194 193 -381 126 272 -366 8 369 -419 -89 221 -220 -121 418 -338 -235 396 -177 -291 227
3508 227 -191 -408 115 38 -293 137 -77 -322 -88 79 -323 -40 147 -166 -179 70 -162 -101 28 -78 7
3529 7 122 32 -58 -201 120 112 -150 46 139 -29 75 151 -105 -49 115 -41 -58 320 21 -218 367 18 -148
$$ packed form
3387E58R0j276P79N04j220O55O03r78j5R91q37l96R98l77n28O18J20q06M00M17
3407C00n43j06N73k97m27P36j00n24M27M63j064N47L72q47K42O93q92O4R51o75
3427a07k48Q16o05l87J002m27m69R36l54q60J191j66r56Q62K37r92O75M07j061
3446e06N07L74p61K40P42p05l10P88k44m82Q46k97m66N68J13o95M33L29o86N0
3466a62L34j7l65M52L6l12J34J93l88L6M25l82k56O89l40l30N22l12l91O81m9
3487A98n19N15jn74N07J46o38L74L61p88L30L10m41R9N39p56J03O31n73j14N18
3508B27m18k17N23p7l31M30k14k45K34J67m02K83J87l13j3K49k32O1J29j06Q5
3529GJ15r0r0j43L21qk62J96R3j68J04P6k56N6J64j56j7L78k99k39N85l49j66
$$ plain form
3552 -148 60 57 -86 306 139 -143 254 51 43 386 163 -63 251 3 -177 175 18 -203 199 89 -199
3573 -199 74 -47 -41 126 49 -166 63 18 -258 326 -199 -276 -9 96 -245 117 111 -376 -14 120 -251 -74
3595 -74 29 -285 -14 124 -242 -108 148 -234 -9 35 -109 52 126 10 -199 29 -137 64 266 -131 -44
3616 -44 -10 -75 -30 138 -45 10 -15 -144 118 54 -76 71 -67 -36 161 81 -12 148 -33 -35 228 -104 -259 421
3640 421 272 -236 46 278 -338 202 395 -355 178 483 -277 -96 407 -164 -256 419 82 -274 288 87
3660 87 -298 336 -10 -354 221 152 -159 124 90 -327 21 56 -345 78 -17 -348 5 143 -173 -230 26 -87
3682 -87 -125 -19 224 39 -8 133 -61 -188 182 -101 -301 71 68 -480 -68 289 -521 -33 380 -222 -34 464
3704 464 -343 -261 562 -29 -517 568 179 -551 428 237 -407 568 130 -343 163 450 -372 163 440 -467
$$ packed form
3552a48K08lj43L92j67k82L97k03qL43k23k26L14k48j80L52j57k21M02j10k88
3573a99K73j21OJ67p7k15K29m5k76N84n25p7K67J05l41L62om87L62J34l71J77
3595g4J03l14K71J38l66J34K56l82K25M4j44J61P4j16k09K28j66K01K02l97Q7
3616d4L4o5M5J68j83N5k5j29K62o4j30J47j38L1J97q0r3J60j81kK63l32j55O80
3640D21j49n08K82K32o16N40J93p50N33L05p60J81N03n71r2O75l37l56N62k01
3660H7l85O34l46l44N75o9l11K83l4m17L48L5m01M23r5l31L53J38l16n7K56j13
3682h7l8J06K43j85m7J41j94j27L70k83k00L72ln48M12L57q10M88M13o02J88M98
3704D64q07Q2Q23n91m88J085l89p30R79j91o44R75m38m73N06K87q22N35K77r07
$$ plain form
3724 -467 83 486 -328 -129 302 -235 -77 397 -114 -216 444 77 -239 335 271 -152 6 396 -261 50
3744 50 268 -141 -85 356 84 -495 249 249 -384 -78 267 -293 -197 299 -253 -295 570 -21 -491 422 -42 -636
3766 -636 236 213 -597 164 310 -514 86 355 -706 -107 603 -794 -112 368 -646 -326 544 -280 -360 425
3786 425 -132 -615 445 -44 -530 403 180 -508 6 325 -350 -15 457 -168 -184 369 -263 -280 377 160
3806 160 -417 264 225 -260 202 313 -251 30 459 -153 -41 571 117 -376 461 245 -382 259 347 -405 188
3827 188 605 -513 61 713 -492 -39 632 -300 -253 779 -286 -436 718 -137 -550 725 165 -640
3845 -640 538 303 -745 325 602 -648 38 745 -651 -225 689 -668 -403 485 -189 -472 280 -90
3863 -90 -434 396 97 -616 180 205 -413 -124 299 -210 -354 271 -220 -308 263 -68 -282 251 211 -530 -57
$$ packed form
3724d67N50M03q14J99M31n37J58M74n11j02O60l67l16N74o4m23J58L90o57L11
3744E0K18m09N6M41k72n79P44%o33L06L45n60R6M96n52m2Q65n91m70R13m64n94
3766f36Q72k3q10P61J46q24O00K69j061N99P10j397O82M80j014L20Q70q24q0P85
3786D25n57m83J060m89m86R33k23o88N14L19o75L35M72o25j6N53o32j7O57k17
3806A60n77O81l9m85M62J11n64K81M29o12J12O12m54m93Q37k16o27O41Q8p52N93
3827A88M17j118N74O52j205M53O71r32M7J032j065j50J154q55m13J275n60q05
3845f40J178k35j048J070K77j250O86P07j396M26R14j357K65Q88o74k83P52l70
3863i0l44Q30k99p13P96K5o18K89M23n09j44O25m91q8N71l31k14N33m0p41M73
$$ plain form
3884 -57 425 -543 -96 590 -317 -272 584 -341 -568 732 32 -546 532 286 -809 478 613 -670 294
3903 294 592 -604 22 736 -377 -290 678 -352 -363 723 -26 -393 439 190 -371 420 252 -499 209
3922 209 339 -603 104 504 -326 21 381 -312 -284 423 -30 -260 186 77 -256 124 124 -379 -78 323 -327
3943 -327 -192 361 -141 -362 329 14 -482 270 235 -611 105 340 -585 40 379 -514 -27 551 -488 -294
3963 -294 405 -323 -514 480 -241 -422 524 78 -529 389 144 -589 276 353 -496 109 479 -381 122 458
3983 458 -393 -102 373 -148 -77 441 -106 -247 467 -60 -236 332 162 -237 38 331 -160 -127 330 -164 -80
4004 -80 440 89 -193 411 183 -297 251 310 -295 102 416 -358 -76 464 -209 -147 323 -160 -420 431 153
4025 153 -474 229 127 -448 54 203 -471 72 321 -407 -72 292 -505 -258 327 -292 -310 360 -54 -261
$$ packed form
3884e7M82r68M47O86r07M5Q56r25k27J300p00n78J078k46j095J287J35j283R64
3903B94K98j196O26P14j113Q7R68j030j1J086p49l67Q32k49n61P91j68p51P08
3922B09J30r42P07M00q30L47L60o93K8P07m53k30M46j09l33L80%n03L01M01o50
3943c27J35N53n02k21O91l15m96P52l5q46P16K35r25O25L39q93M87N78j039J94
3963b94O99p28j91R94p21j81R46m46o07R18k45p33Q65P7q49O05L70q60N03L36
3983D58q51K91M75n21P1N18n47j41P14n27j76N68j70l99K75K93m91L3M57m94Q4
4004h0N20l51k82O04k28m80N48N9o05L97L14p74K82N40o73O2M70m83k60Q51k78
4025A53o27P03j02n75N02J49o74N43K49p28L35L64p97K47N85o19j8O70m14k07
$$ plain form
4045 -261 356 -14 -327 173 -7 -375 -94 -61 -413 -72 171 -196 21 254 -66 -157 163 -29 -158 238 137
4066 137 -68 70 72 -270 -32 313 -266 -93 296 -293 -271 235 169 -366 305 261 -202 221 141 -314 53 350
4088 350 -189 -98 434 -172 -26 499 -100 -152 374 37 -304 57 118 -123 232 80 -222 173 281 -302 24
4109 24 190 -171 29 307 -129 -15 92 -26 -87 162 -89 17 47 -15 -196 -35 77 -27 99 39 -195 16
4131 16 -35 -109 -260 102 -36 -134 -102 -40 -162 -47 90 -100 -85 17 -264 -69 164 -129 -54 100 -32 -45 58
4154 58 24 -51 71 54 -267 223 45 -199 211 52 -81 39 -20 -5 -6 133 -118 60 335 91 5 22 41 -30
4178 -30 71 125 70 43 -30 82 -13 133 78 -10 51 126 103 8 258 7 120 -32 14 -63 56 113 -11 -162 106
4203 106 -93 2 58 -53 -124 4 -28 -81 -45 -74 -110 112 46 58 -85 -158 51 43 -168 -91 -38 -305 -70 -217 -108
$$ packed form
4045b61O17l70l13N00j80l68K81L3l52L41K43l67K17K33l20r1L20j92j29L96j01
4066A37k05J38Kl42K38L45n79J73L89n89K2N06o6n35O71m4m63M23q0m55L67K97
4088C50n39R1N32o06J46N25n99n2N26l37l41L61O1k41L55j52l02L95J08n83L26
4109B4J66l61K00K78m36J14J07j18o1K49k51J06L0o2j81J61J12j04J26o0k34K11
4131A6n1p4j51L62j38r8L2O2j22J15J37j90J5J02k81J95K33k93P5J54j32j3J03
4154E8l4p5J22j7l21M90j78k44M10j59j33J20n9J5jJ39k51J78K75k44q6J7J9p1
4178c0J01N4n5k7p3J12r5J46n5q8O1P5k3r5K50k51J13j52M6p7J19N7j24j51K68
4203A06j99R5N6j11p1J28l2n3L6k9l6K22o6J2j43p3K09qk11P7N3k67K35j47J09
$$ plain form
4228 -108 -81 4 -47 -46 -81 -164 -18 0 -21 115 33 -146 -39 50 -23 -101 214 -99 -93 -21 -81 -71 131 -91 -148 62
4254 62 119 -73 127 11 -22 174 23 -64 89 123 -92 158 25 -74 -41 158 -24 47 190 76 75 -25 29 -136
4278 -136 72 55 11 155 133 53 22 63 94 40 -102 -107 39 181 94 -78 -20 -111 -149 -55 -5 -115 -38 156 -98 -77
4304 -77 246 -305 -60 59 -160 -213 263 -77 -392 37 -28 -175 67 59 -186 -34 207 -142 -238 46 -238 49
4326 49 110 -42 -128 -14 -21 -116 -69 51 -49 123 -117 -45 59 -98 -120 15 5 -12 183 65 -81 -65 -16 24 -164
4351 -164 280 157 -62 -103 163 -110 114 114 -120 -160 263 -85 4 247 59 -74 165 133 -269 124 126 -62 89
4374 89 212 -80 78 167 -129 -24 259 -125 -155 175 -119 -55 61 -150 -173 -11 -67 -168 84 -144 -225 105
4396 105 -14 -126 30 36 -300 57 140 -167 -106 85 -87 -61 -54 110 -249 -75 53 -271 6 48 -94 -228 103
$$ packed form
4228a08K7Q5n1Jl5q3J46J8k1J36q2j79J07Q9p3p8L15l13OP2o0J0K02k22n7K10
4254F2N7j92K00j16l3J96j51q7J53L4k15K50j33r9L3J99j82P1J43j14jj00N4j65
4278a36K08j7m4J44k2q0l1M1L1n4j42nJ46J42q7j72N8r1l8R4N0j10P7J94k54K1
4304g7L23n51K45J19k19n3M76l40l15M29o5j47K42qk45J52K41l49r6K84k84K87
4326D9O1j52q6J14pr5M7J20j00J72k40P2J04j57k2J35j0j7J95j18j46J6M9M0j88
4351a64M44j23k19m1K66k73K24%k34m0M23l48Q9K43j88j33K39l2m02L93Kj88J51
4374H9J23k92J58Q9k96J05K83l84l0L30k94O4J16k11k3J62n6j01K52k28q1L30
4396A05j19j12J56Ol36L57Q3l07O1J91j72K6PJ64l59J74J28l24K77M2j42j34L31
$$ plain form
4419 103 12 -128 -8 132 -227 98 89 -277 -57 199 -83 -33 344 -104 -95 365 -10 -48 315 36 -188 213
4441 213 12 -78 206 49 -115 80 159 -136 204 248 -160 1 56 54 82 287 -20 -76 282 72 -71 118 122
4464 122 -80 -5 52 69 54 159 -37 -7 69 -165 -150 10 -122 -140 -55 -47 -239 25 56 -166 51 74 -243 -12
4488 -12 267 -19 -4 79 25 -174 -1 -87 -267 144 8 -157 70 -23 -215 58 156 -228 -98 142 -78 -134 180
4511 180 -134 -147 92 -66 -10 221 119 -305 148 87 -124 105 54 20 93 331 -53 30 103 -76 58 284 121
4534 121 -100 273 231 49 70 62 20 56 198 17 -82 30 11 63 135 103 -199 140 102 -98 28 48 -167 4
4558 4 212 -245 -60 140 -137 -83 64 -132 -91 242 -34 -227 109 56 -261 65 -118 -193 66 111 -124 -128 25
4581 25 -211 62 75 -216 -207 146 -98 -63 124 -3 -58 35 2 -250 -119 -24 -132 94 40 -162 -81 88 63 -63
$$ packed form
4419A03r1j40J20J40l59L25rl66K20K56k82N0L77m48RM60l75l8L63k79k24M01
4441B13k01r0K84j57j64J95P9k95L40M4m08J61N5kK8K05l07n6L58k10j43J89M
4464A22k02P5N7J7j5J05j96L0P6k34J5J60j32j8Q5Qj92K64L1k22K17K3l17K31
4488a2K79k86J5Q3n4j99J73q6j80M11j36j65K27r3j92K73R8l84J30K40k20n6L14
4511A80l14j3K39j58N6K31j02m24M53o1k11K29n1l4P3K38l84Q3P3j79J34K26j63
4534A21k21L73m2j82K1qm2L6J42j81r9J12j9N2P2l2l02L39l8k00J26K0k15J71
4558DK08m57J85K00k77N4J47j96M1L33k76j93L36n3l17L26j83p5K59M5k35mJ53
4581B5k36K73J3k91RL53k44L5J87j27n5R3l3k52J31R5j08K26n4k02Q1J69k5j26
$$ plain form
4605 -63 58 66 -219 137 84 -191 69 0 -82 49 282 4 -102 206 122 80 262 -127 -104 325 86 -82 151
4628 151 342 -170 210 55 -153 103 212 42 19 240 79 -118 180 4 -59 29 9 -7 176 10 -67 47
4650 47 91 -190 32 -43 -80 7 -31 45 -88 -11 132 -120 108 -123 -160 -35 22 -110 -50 146 -86 -158 14 -123
4674 -123 -178 70 -116 -106 24 -100 -108 141 -87 -21 32 45 -57 18 -8 18 -109 -16 -128 -107 78 -212 -169 7
4698 7 7 100 76 69 -117 142 -2 -170 99 175 -5 19 107 -50 -19 33 81 131 185 215 56 142 166 188 35 65 27
4725 27 73 191 -70 112 116 -106 -100 112 28 -25 -56 100 -16 64 -7 57 43 235 -168 -110 204 -134 -146 18 -167
4750 -167 -308 112 78 -128 -101 -127 -175 -89 22 -5 -70 -49 -128 -122 29 -44 -102 3 40 -89 6 -51 73 36 -114 -199
4776 -199 -147 -16 -81 -57 -17 -116 28 -123 -96 40 28 40 -4 21 213 22 12 30 151 -22 -12 82 -62 221 176
$$ packed form
4605f3J21Qk85L56n3k75K60o9q2J31K33k78j06L08q4m2J82l89K3M29k39j68K33
4628A51J91n12L80j55k08K56J09j70k3K21j61j97K98j76o3Q8k0j6J83j66p7J14
4650D7M4k81K22p5l7Q7l8P6j33P7J43k52K28k31l7J25N7j32O0J96k32p2J72j37
4674a23n5K48j86J0J30j24qK49k28O6N3J3j02P5k6K6j27R3j12K1J85k90M3J76
4698G%R3k4pj86K59j44j68K69P6j80K4Q8j57L1N2M8N0N4L0j59Q6K4K2j53L0l8
4725B7M6J18k61J82Mk22OK12q4n3l1J56j16Q0p1O4j4J92m03N8L14l38j2J64j85
4750a67j41M20l4k06K7k6m8Q6J11k7o5K1p9OJ51p3n8J05L7j29R5n7J24l7j50q5
4776a99N2J31o5K4M0r9J44j51K7J36j2J2m4K5J92j91j0J8J21j73J0R4j44K83m5
$$ plain form
4801 176 -29 -37 18 -52 56 230 123 172 176 -73 191 -65 -101 3 -27 29 -13 127 -97 18 -44 -96 156 35
4825 35 -145 -88 53 -4 160 -52 116 -154 10 -15 -52 16 -40 -62 -160 81 -33 43 91 65 -137 -34 -124 62
4849 62 -92 -78 -33 -123 78 -96 -258 -3 -33 -131 -102 14 -23 -12 -95 24 -16 -35 -75 -57 65 70 -104 76 31 105
4875 105 87 157 55 -68 -60 3 86 -11 28 -43 87 75 140 113 59 -32 -11 58 0 96 112 64 37 0 16 -27 127 43
4903 43 -20 -54 30 83 -176 -66 -12 87 70 38 133 52 -24 -36 -47 73 50 -52 -4 -123 -21 -132 -34 -22 -76 -151 -63
4930 -63 -15 -87 -282 -142 -121 -157 -132 -124 92 -207 -28 -65 -150 16 8 -254 18 -45 -92 -26 -92 -61 -107 3 -272 -13
4956 -13 51 -19 -29 -93 -88 -88 -6 -9 -161 19 99 25 90 144 -86 117 15 -88 12 207 6 94 155 99 11 101 -41
4983 -41 8 10 35 -121 22 126 -63 5 -18 115 -3 76 -55 21 -11 66 -61 154 144 -48 166 141 112 3 90
$$ packed form
4801A76k05qN5p0J08J74j07M9Mk49K64k56l6J04l0N6m2J40k24J15o2n2K52j21
4825C5j80N7J41n7J64k12J68k70J64k5l7O8n6k2r8K41j14P6M8k6k02J03r0J86
4849F2j54J4M5r0K01j74j62K55l0r8K9J16l7J1q3J19m0j9m0J8J22Nj74J80m5P4
4875A05j8P0j02j23QO3Q3r7L9p1J30j2O5k7n4r1K1O9n8R6J6m8k7l7J6m3J54q4
4903D3o3l4Q4N3k59J10N4R9j7l2R5q1p6j2j1J20k3j02M8j19J02j11R8J2n4p5Q8
4930f3M8p2j95J40K1l6K5QK16k99J79l7q5J66qk62K72o3m7O6o6L1m6J10k75K59
4956a3O4p0j0o4N%Q2lj52J80Q0p4O5N4k30K03j02j03J00J95k01Q8O1n6q8R0j42
4983d1M9KK5j56J43J04j89O8k3J33j18P9j31P6l2P7j27K15j0j92K14k5k9j09Q7
$$ plain form
5008 90 10 -61 113 -22 -123 155 60 -124 6 2 -205 81 32 -115 64 -171 -91 -176 136 -81 0 -46 -107 -108 -30
5033 -30 -183 -142 -50 -72 -124 -22 -6 -55 124 57 -156 66 61 -202 -14 91 -170 -37 -41 -6 -9 7 57 -145 151 175
5059 175 -115 74 134 -25 -7 191 -96 -56 115 -97 -53 57 106 -124 205 128 6 -63 45 98 -74 211 37
5082 37 100 138 142 -195 119 -37 -156 197 -11 -164 182 96 -273 -44 57 -175 -24 -27 -147 -91 240 -165 -105
5105 -105 115 -185 -161 27 -102 -86 -42 -2 -284 -19 31 -331 -30 55 -62 -75 162 -58 -158 225 -184 -143 39
5128 39 -76 -197 75 -8 -39 -43 93 -166 20 264 -9 -3 153 55 -174 23 -185 -93 134 125 -131 -51 240 -101
5152 -101 0 63 -117 63 191 -91 55 329 17 -86 255 94 -71 119 181 -106 153 42 -97 34 339
5173 339 -41 59 50 -74 78 221 -174 1 185 -23 -135 121 -4 -157 -69 -71 -343 129 194 -118 -101 113
$$ packed form
5008I0q0p1J74j35j01K78r5j84J30mk07K86m9j47J79k35Q0q5L12k17Q1m6o1jP8
5033c0j53M1R2k2n2J02J6m9J79o7k13K22nk63J88J05k61J33mL5lJ6N0k02K96K4
5059A75k90J89O0j59J8J98k87M0J71k12M4J10M9k30L29p7j22o9J08N3j72K85j74
5082C7O3L8Ml37L14j56j19L53k08j53L46q6l69K29J01k32J51lj20N6L31m05O0
5105a05K20l00K4J88j29J6M4M0k82K65N0l62L01Q5j17j3K37k20j00L83m09M1J82
5128C9j15j21K72q3l1mJ36k59J86K44k73OJ56r8k29J97k08R2K27rk56Q0K91l41
5152a01J01O3j80J80J28k82J46K74l12j03L41j61j65J90O2k87K59j11j39J31L05
5173C39l80J00rj24J52J43l95J75J84k08j12K56j25j53Q8kk72M72O5l12J7K14
$$ plain form
5195 113 -67 -235 51 -67 -179 181 66 -102 177 -1 -186 -58 -78 -107 13 8 -347 -137 141 -143 -189 88
5217 88 -110 -144 61 -76 12 45 84 -227 129 92 -138 -39 293 -103 3 182 25 76 11 29 25 233 98 -236
5241 -236 129 36 65 199 145 -16 63 190 -34 22 161 -2 -106 113 -73 -163 90 207 -73 91 135 -64
5263 -64 91 127 -103 -30 82 -51 -17 60 15 -186 149 20 -149 -14 143 -197 -29 4 -42 -64 -10 -298 -210 72
5287 72 -94 -52 174 -145 -238 138 -10 -65 -18 113 -210 -22 163 -155 -119 143 9 -58 18 -46 -155 159 -4
5310 -4 -331 131 177 -195 34 -4 -61 -38 68 -36 68 82 -76 -3 25 -69 -149 150 62 -177 76 38 -94 106
5334 106 192 -158 177 83 29 -78 206 78 -164 238 8 -208 190 243 -44 76 21 -170 119 161 -15 133
5356 133 155 -173 -9 133 51 0 26 -12 -269 16 -45 -5 27 -119 -40 63 -130 -98 20 -114 24 -178 -40
$$ packed form
5195A13j80j68K86j18j12L60j15j68K79j78j85J28k0k9J20nl55K10K78k84m6K77
5217H8j98l4K05j37Q8L3L9l11L56l7k30R9L32l96J06J79j57N1o5J8mK08j35l34
5241b36L65r3K9J34n4j61P9J27k24N6J39j63j04K19j86r0K53J17k80J64M4j99
5263f4J55L6k30P3J12j33L4P7m5k01L35j29j69J35J57l40J68L3m6k2N4k88Q8K82
5287G2j66M2K26l19r3L76j48n5M7J31l23J88J85l18L6K62j34o7P6o4j09L14j63
5310dl27M62M6l72K29l8n7K3J06j04J04J4j58P3K8r4q0K99q8k39K53l8j32K00
5334A06Q6l50L35r4n4j07K84j28k42M02k30k16L98N3k87J20n5j91K89M2j76J48
5356A33K2l28J64J42q2n1K6l8k57K85o1M0L2j46P9J03j93L2J18j34J38k02J38
$$ plain form
5379 -40 -69 -80 -63 -59 -134 -137 -52 -161 28 -28 28 9 -95 53 -124 -58 -19 -13 -1 118 -88 -22 -62 36 155 129 -65
5406 -65 107 120 66 177 54 11 67 54 -145 43 188 59 -60 145 44 -106 141 -9 75 182 221 6 -54
5429 -54 170 -29 103 -31 -6 83 199 -148 41 16 -108 -60 -66 -84 -32 12 222 28 -76 -16 -56 -102 45 -70
5453 -70 3 130 -44 6 -96 -168 5 110 -271 -140 113 90 -177 -21 57 -154 -84 46 -154 10 143 19
5475 19 -65 82 -62 -39 -106 9 -9 -57 54 -98 11 -100 52 48 54 -50 -42 -84 -39 65 -34 -107 6 -62 15 8 202
5502 202 -43 182 120 80 -79 120 51 97 126 -126 -29 109 6 -61 114 -63 -82 -11 3 23 6 79 -53 103
5526 103 -29 -74 29 103 48 25 -33 158 76 -140 96 134 -1 -52 -52 -31 193 -94 -35 75 -30 -45 30 -49 27
5551 27 155 -59 -170 61 -2 9 5 -56 79 75 134 -63 -43 -150 -96 -115 59 -63 -59 73 84 -154 -75 -109 5 -58
$$ packed form
5379d0k9j1J7Mp5lQ5j09J89n6N6j9j04J48j77O6L9OJ2J19k06O6m0R8J19k6j94
5406f5J72J3n4J11j23m3N6j3j99J88J45j29j19K05j01j50K47j50Q4J07L9k15o0
5429e4K24j99J32j34K5Q9J16l47J89k5j24M8oj8N2M4K10j94j04O0m0m6J47j15
5453g0P3J27j74N0j02p2J73J05l81J31K53k3k67J56P8k11P0J30k00J64J33j24
5475A9q4J47j44K3o7J15j8m8J11j52J09j11J52mOj04Qm2M5J04r9p3J13o8P7pJ94
5502B02k45K25o2m0j59J99o9M6K9k52R7J38j03o7J75j77j9P1J4K0j7P3j32J56
5526A03j32m5J03P4n5k3n8J91q2k16K36L8j35n1%K1K24k87N9J10j05j5P5p9P6
5551B7J28k14j11K31o3J1mo1J35mN9j97K0j07N4j9J74j22MJ32J1k38P9l4J14o3
$$ plain form
5577 -58 86 -82 -4 198 -13 -82 -84 65 8 115 -29 11 69 46 52 -74 95 15 -75 25 -84 71 34 -169 -29
5602 -29 185 56 99 89 72 118 109 121 -109 -32 137 -44 169 -29 94 -19 218 -62 23 174 11 -98 66
5625 66 72 -179 163 43 -108 11 6 -163 -73 33 -23 -69 100 -142 92 45 17 -19 85 -76 -75 118 -44 -164
5649 -164 54 183 69 -44 -35 -17 -4 111 -13 -70 65 -126 -164 19 20 -166 -7 56 -85 33 113 -23 89
5672 89 288 -32 127 132 14 -73 184 -3 -99 139 97 -113 84 86 -60 -65 297 22 -90 255 -1 -81 276 178
5696 178 -181 262 158 -163 104 113 -157 -2 159 -114 -47 55 -56 -75 70 -4 19 137 93 -137 -49 94 -115
5719 -115 123 107 -242 134 192 -169 -41 201 -78 -107 166 -46 -64 34 -70 -89 -36 131 -153 -105 72 -53 -52
5742 -52 -3 -61 -341 367 -62 -81 212 -147 -243 82 25 -200 25 89 -109 86 178 -162 89 34 -212 -38 -24
$$ packed form
5577e8J44j68P8K02k11o9kJ49n7J07j44M0N8k3Oj26J69q0r0J00j09J55l7k03J40
5602b9K14j29M3j0j7M6rJ2k30P7J69j81K13j98J23j13K37k80Q5J51j63j09J64
5625F6Ok51L42j20j51J19nj69R0J06n6m6J69k42K34m7k8l6J04j61JJ93j62j20
5649a64K18J29j14j13RJ8J3J15j24n7J35j91l8J83Jj86J59O3j41J18Q0j36J12
5672H9J99l20J59Nj18q7K57j87r6K38m2k10J97Kj46nL62k75j12L45k56q0L57r8
5696A78l59M43j04l21K67Rk70J55J61k73O7J02j11j9J45p4K3J18m4k30Q8J43k09
5719a15K38j6l49L76N8l61J28K42k79k9K73k12j8R8j04j9N3J67k84M8J77j25J
5742e2M9n8k80P08m29j9K93l59r6L25n7k25K25O4j98J95R2l40K51n5k46J74J4
$$ plain form
5765 -24 18 -140 200 151 -89 125 109 -168 149 36 -285 22 146 -71 -62 275 -7 -86 233 241 -86 198 23
5788 23 -235 59 -6 -88 -52 27 -11 78 41 -138 -11 87 28 92 131 64 -186 199 -116 -283 254 157 -218 -40 68
5813 68 -125 -127 89 -164 -168 65 -63 -239 114 73 -345 60 59 -145 16 117 -164 -45 136 -220 -69 210 -243
5836 -243 9 10 -118 -81 232 107 -131 91 -46 -221 18 24 -12 39 72 -164 -88 259 -273 -154 175 67 -173
5859 -173 73 42 -173 224 188 -28 18 277 -89 51 393 -236 -194 157 37 -199 38 4 -215 95 93 -107
5881 -107 257 194 -208 164 205 -132 23 166 5 -197 126 -2 -162 -5 -27 -31 228 68 -304 68 94 -127
5903 -127 126 141 -235 -98 1 -155 -91 99 -219 -255 154 1 -269 60 -67 -173 29 268 -249 -89 104
5924 104 -223 -132 283 -134 -174 153 118 -386 76 158 -262 -176 104 -290 -37 121 -68 -17 129 -77 -199 74
$$ packed form
5765b4M2j58L40m9k40K14j6k77L17j13l21L07J24k17RL37k82p9L19Ql27K84j75
5788B3k58K94o5q2L6P9l8Q9l7j79J27R8n9O4L9o7k50L85l15j67N37r7l75J78J08
5813F8j93kK16k53mK33j28j76L53m1m18M05jk04J61J01k81J19J81l56J51K79m53
5836b43K52Jj28L7L13j25k38K22j37j75K39Ol6N1L3k36P6L47n32J19L29j08k40
5859a73K46l1k15L97l6k16M6K59l66J40L42o29M2L51j20k36K37l4k19L10kk00
5881a07L64o3m02L72M1l37J55J43j61k02L23j28j60J57k2mK59j60l72L72K6k21
5903a27K53J5l76J37R9j56O4J90l18l6M09j53k70L29j27j06K02K39n17J60J93
5924A04l27R1M15m17m0L27l5n04M62Q2m20Q6K80l94K53J58j89N1J46k06j22K73
$$ plain form
5946 74 -28 -86 180 97 -65 127 62 -1 219 193 19 99 89 -243 0 176 -109 -60 86 -96 -20 163 -72
5969 -72 32 149 10 -108 35 91 -30 8 131 -206 -22 73 -88 -135 94 -41 -134 42 1 -188 123 -1
5991 -1 -284 15 186 -204 -102 91 -200 -190 119 126 -201 140 34 -327 92 -21 -57 42 -109 -343 -49 110
6013 110 -15 29 55 -86 -58 217 106 -24 1 -35 -229 236 12 -47 251 132 -354 105 86 -85 65 60 -111
6036 -111 43 194 -65 -61 98 4 16 53 42 -49 18 175 -34 40 139 -54 35 41 -35 -29 231 29 -84 204 60
6061 60 -101 87 46 -199 14 116 128 110 166 -36 73 10 -160 -63 20 12 -5 18 -30 -204 139 -112 -67 -75 -38 -93
6087 -93 11 -71 -215 -72 -3 107 -87 -152 73 -163 52 30 39 -16 -100 -132 -19 7 21 -93 -77 19 48 -180 11
6112 11 -57 52 -39 28 15 -44 5 18 -39 62 71 1 -43 -16 4 9 -26 59 103 -40 152 -58 84 25 -56 -24 -75 122
$$ packed form
5946G4j02n8K66q3j62J92o5o3K20k6j74Q0j0l32K43J76k85M9J46j82P6J83k35
5969g2J04J17j39j18J43N6j21L8J23l37J84R5j61m7K29j35r3J76m1j89L11j24
5991ak83K99J71l90J02J93k91J0L09Pl27L41j06l61M19j13l6R9j51k34K94J59
6013A10j25M4K6j41K8K75j11j30K5l6j94M65k24n9K98j19m86M59j9j71J50nj71
6036a11J54J51k59MJ59r4J2L7j1r1O7J57k09P4R9j93Q9Op6OK60k02j13K88j44
6061F0j61J88m1k45K13J02J2j8N6k02J09o3j70R7Q3qj7K3m8j74L43k51M5qL7n5
6087i3J04q2j44J43O9J10j94o5K25k36K15k2Rn5q4l2J13K6J4j14J6R6K9k28J91
6112A1o8J09r1O7j3n9M9J3n7J01Rp0m4K7K0Nl5Q5M4j43J92k10J42n9q1L2n1J97
$$ plain form
6140 122 -5 -59 137 56 -144 109 142 -120 126 -60 116 18 48 -43 -78 3 23 41 57 -12 140 -115 24 -90
6164 -90 8 47 175 -102 -78 85 -154 -56 106 65 -16 73 -91 -163 32 -8 -81 79 28 -222 -23 5 -44 -68 3
6189 3 -117 -83 126 -85 20 89 91 -115 -23 -33 -143 -97 8 -9 -41 -65 14 130 -23 -102 -3 -72 104 73 -141 -47
6215 -47 -29 108 -123 -78 191 112 -118 95 174 -34 49 59 1 -76 -19 0 -108 170 126 114 117 46 -91 135 34
6240 34 14 68 52 25 -63 38 38 6 130 32 31 87 31 -1 -35 195 -271 102 97 -178 4 151 -43 -44 -8 -129 -123 -51
6268 -51 -206 -90 -4 51 -123 -62 -88 -205 -78 160 -122 -7 13 -99 71 210 123 -55 144 116 -183 174 -74
6291 -74 -201 206 -7 -234 86 165 -180 52 118 -22 -73 269 60 2 34 24 -67 8 22 -178 86 116 -54 -121
6315 -121 167 -101 153 65 -149 -89 101 -50 11 215 -4 -77 8 147 -207 82 16 -18 -82 120 -197 -206 90
$$ packed form
6140A22j27n4J96q1k00K53L3k62K46j86J76r8L0r1l5Q1K0J8J6o9J52k55J39j14
6164i0R8L9J28k77K4J63k39R8J62m1q1Q9j64p2J95m0p3J60n1k50J99K8m9k4P1
6189Cj20L4K09k11J05O9Kk06R2j0j10M6J05j7l2k4P9J16j53p9R9o9J76l1k14R4
6215d7J8J37k31M5K69p9k30K13P9k08Q3J0n8p7N7J9j08K78m4j2Lp1j37K26j01
6240C4k0N4j6k7q8J01%l2J24r8jN6n6l2l4K30m66L73nk75J82J47j94jL6j21OP2
6268e1j55J16Q6N5j74O1k6j17J27K38k82J15K0j12J70J39q7j78J99k8k99L57k48
6291g4j27M07k13k27L20P9l45K32O6j40n1L42k09n8L2j0r1P5J4k00K64L0j70o7
6315a21K88k68K54q8k14O0J90j51O1K04k19p3Q5J39l54K89o6l4o4K02l17rK96
$$ plain form
6338 90 -83 -149 86 -129 -25 202 15 -49 -42 -71 -256 168 120 -78 -20 102 -70 -166 106 -64 -139 116 -33
6361 -33 -160 47 -60 -127 34 -104 -118 40 -19 -141 -145 48 -98 -85 130 -54 -29 179 108 -208 -30 163 -115
6384 -115 -6 166 -25 62 35 -109 -49 117 -121 72 268 -95 25 162 -19 -141 171 45 -131 104 221
6405 221 -64 -33 124 -165 3 290 -127 -217 105 21 71 230 -21 -257 109 -4 -22 -44 34 -83 72 94 -52
6428 -52 -16 -63 16 8 169 12 -120 86 42 -37 -27 -11 -155 -118 117 -172 -79 7 48 -125 63 71 -139 261 -215
6453 -215 -85 133 118 -72 84 -230 -103 -25 -34 -75 -55 111 -70 -108 159 15 -127 166 71 -90 315 88 -181
6476 -181 122 28 72 -114 189 70 -81 228 -10 49 159 15 -67 178 44 -43 149 146 -231 103 387 -92
6498 -92 73 116 -117 111 311 -158 -96 156 -8 -64 39 106 -8 62 -55 -109 136 -25 -80 -82 -7 -215 -173 81
$$ packed form
6338I0j73o6K35k15J04K27j87o4Pk9j85M24m8j98N8J22j72r6K72j70p5K55j49
6361c3j27K07j07o7J61j38j4J58n9j22mJ93j46J3K15j84K5K08p1l16J78J93k78
6384a15J09J72j91Q7k7j44O0J66k38J93J96l63J20J37j81j22L12j26j76K35J17
6405B21k85L1J57k89J68K87m17r0L22q4N0J59k51k36L66j13j8k2P8j17J55K2j46
6428e2L6m7P9qJ61j57j32K06m4p9J0J6j44L7K35k89R3Q6M1j73J88Qk10M00m76
6453b15J30K18j5j90J56l14J27P8rm1K0J66j81l8K67j44j42K93r5j61M05k27k69
6476a81L03r4M4j86L03j19j51L09k38N9J10j44q2K45j34q7J92ll77L34K84m79
6498i2J65M3k33K28K00m69O2K52j64n6J03O7j14P0j17n4K45j61n5kP5k08M2K54
$$ plain form
6522 81 -9 -22 19 -133 -166 99 68 10 84 -36 -162 36 76 -86 -132 113 53 -171 172 -103 -165 105 -92 -194
6546 -194 95 19 -87 103 70 44 179 167 -88 6 39 -82 -133 63 -196 -137 133 21 45 -38 136 -132 -102 70
6570 70 -78 -52 -14 -1 122 252 41 -33 14 293 49 130 28 -41 -35 103 -20 -46 -26 105 -125 99 -68 -124
6594 -124 107 -16 -87 -19 7 -80 15 30 -127 45 18 -99 -123 -62 -186 2 -44 -89 -160 48 -176 -63 40 -8
6618 -8 -160 107 -15 -110 119 -12 -85 -160 74 -128 -115 45 24 -230 110 85 -62 -32 -27 -134 -112 107 6 -102
6642 -102 188 19 15 69 74 -62 -56 -46 86 -36 -104 -96 -73 186 -1 33 -8 43 -13 -31 -1 59 23 41 148 14 17 19
6670 19 138 97 18 64 124 2 101 136 -84 10 -21 -15 -96 148 -1 14 32 152 -70 41 36 -33 -154 78 20 28 142
6697 142 25 -71 -25 -39 -182 62 -43 -26 29 36 70 -181 -152 -84 -113 -81 -32 -55 -12 65 15 -34 2 -9 18 -155 -46
$$ packed form
6522H1r0j3M1j52l3K65l1n8P4j20j26J98M0j62m6K45o0k24L43k75o2K70j97j02
6546a94K89p6j06J90l3k6J35j2k55R4L3j21n1J96k59N9K70j12K4q3J74k68L0J72
6570G0j48K6L8J3J23J30k11p4M7K79k44Q1j02o9OJ38j23k6K0J31k30K24j67n6
6594a24K31j23p1O8K6q7R5J5j57J72k7j17k4O1j24J88m6m5p1K08k24J13J03m8
6618hj52K67j22r5K29j31p3p5K34k02J3J60k1k54L40k5j47L0Nj07K2K19j01j08
6642a02K90j69mN4Nj36OJ0J32j22o8QK3K59j87L4m1N1n6j8L0O0l6J8J07j34LK
6670A9J19m1p9M6O0j22R9L5k20R4l1Oq1K44j49J5J8J20k22J11no9j21K32n8QJ14
6697A42j17r6M6j4j43K44j05J7N5PL4k51K9O8k9L2M9k3M3P7n0m9L6j1K7j73J09
$$ plain form
6724 -46 273 59 79 112 -44 -92 -157 65 -188 41 95 48 -8 -16 -61 -103 154 27 96 76 1 -84 -22 -129 68 72
6750 72 4 -32 20 26 176 -38 14 -136 -68 0 9 -2 58 -72 127 65 -43 40 36 76 89 -24 -153 3 -35 180 -12
6777 -12 -60 -46 -32 -87 -28 -91 -14 8 -60 11 -55 100 -57 -73 157 -48 105 1 -75 40 -89 42 24 74 -116
6802 -116 17 7 -131 49 101 -26 72 62 10 99 10 -97 -41 -10 -104 -74 144 -23 -103 155 98 109 33 27 5 123
6828 123 180 -64 -20 -97 -67 124 22 67 63 99 0 -28 15 71 -77 16 89 26 79 -90 -126 84 -1 60 29 2 44
6855 44 -43 -13 67 -94 113 28 -29 93 -62 39 19 69 -121 -9 -54 2 0 97 66 -9 -54 -159 -78 18 -33 -123 3
6882 3 -143 -76 -138 1 -51 136 -69 -23 85 204 119 -86 -142 -133 108 56 30 -192 72 38 4 41 158 -79 28
6907 28 30 -79 16 50 -78 -73 99 -29 -29 -3 0 -171 111 20 -65 17 -91 -45 109 20 0 72 39 20 -71 168 -65
$$ packed form
6724d6L19k14K0L3j56m8o5K22k53K29N4m7n6qm5m2K57j27O9k0p5q5O2j07J97M
6750G2o8l6N2OJ50k14N2j50O8O8Rj1O0j30J99o2j08Q3mM0J3j13j29J56l8K15j92
6777a2m8J4J4n5N9o3P7K2o8P1o6J55j57j6K30k05J53j04p6J15j29J31j8N0j90
6802a16J33j0j38J80N2j27R8j0n2Q9q9j07N6L1r4L0K18j67q0K58n7J1p6ok2J18
6828A23N7k44M4p7L0J91j02M5mL6r9k8M3N6j48R3P3o3N3j69l6K10q5O1l1k7M2
6855D4q7L0Q0j61K07q5n7J22j55J01k0N0j90J12m5N6kR7l1p5m5j05Q1R6n1r0J26
6882Cj46O7o2J39n2J87k05M6J08J19q5k05n6RK41n2k6k22K64l4l4L7J17k37J07
6907B8Kj09R5L4j28NJ72j28%K6Lj71K82r1q5Q2j08M6J54q9k0P2l3j9r1K39k33
$$ plain form
6934 -65 -127 11 5 -98 27 40 8 -5 69 96 -60 170 -110 42 270 -43 -61 49 110 43 99 -33 40 76 25
6959 25 -12 45 121 -32 -40 114 -101 -178 -69 -111 -119 45 37 -271 45 -46 -42 152 44 -237 -36 78 -108 -143 92
6984 92 -139 -17 -91 -97 -186 43 -150 -160 -88 -9 -130 -136 33 -203 178 -7 -21 -7 65 -24 -60 132 123 80 51 -46 -165
7011 -165 43 59 -85 101 120 66 -88 248 -93 14 115 -43 31 99 4 50 164 -91 -91 -56 22 -33 13 84 3
7036 3 -7 17 8 -93 15 -13 -1 149 145 42 79 5 -129 31 -63 -212 -49 111 -140 -48 -23 -108 70 31 -145 -22
7062 -22 156 -102 -31 -84 86 -120 56 -52 -54 -97 -19 -60 18 102 -73 -104 52 7 -100 87 -3 -146 -57 20 -125
7087 -125 110 105 -81 134 119 60 9 24 -49 -133 119 -178 94 120 9 -106 55 -14 -188 147 -24 -71 14 24
7111 24 19 18 41 -59 45 65 -17 -102 113 -162 -11 55 40 -75 202 23 77 11 -42 2 -31 70 -19 -126 -10 31
$$ packed form
6934f5o2J38oj03J25J3l2j3P4K7j56K30k80J52K28l13j8J10O1o7N6j32P3L6n1
6959B5l7N7P6j53qJ54k15p7J09m2qJ64ql08L16r1MJ94j08k81K01J14j86l5K35
6984I2k31J22p4oq9K29j93j0P2P9j21oJ69k36L81j85j4J4P2q9l6J92rm3k9r7j19
7011a65K08J6j44J86J9n4j54L36l41J07J01j58P4O8r5M6J14k55%L5P8n5M6P1q1
7036Cj0K4rj01J08k8J2J50mj03L7p4j34J60r4j49J63J60k51R2K5q5J78l9j76J23
7062b2J78k58P1n3J70k06J76j08km3P8m1P8Q4j75l1J56m5j07J87r0j43Q9P7j45
7087a25K35nj86K15j5n9n1J5p3q4K52k97K72K6j11j15J61o9j74L35j71m7Q5J0
7111B4njK3j00J04K0q2q5K15k75J51O6j5j15K77j79N4o6n3M4l3J01q9j07J16M1
$$ plain form
7137 31 -25 14 -66 -165 -106 9 -101 35 -28 1 31 102 -44 119 -14 -129 -59 65 -41 -103 -65 -124 -197 94 133
7162 133 -67 -15 39 -28 43 13 -13 131 81 63 -69 200 -81 -203 139 60 -53 -16 19 -44 -111 41 -52 167 -157
7187 -157 -92 92 19 -107 -63 80 32 -53 199 -32 -169 115 81 -108 93 26 -100 -28 -62 -54 54 42 37 13 79
7212 79 -53 -37 1 -77 -52 25 64 71 -136 52 74 13 -4 129 -67 114 54 -55 62 -59 -33 85 27 -121 12
7237 12 25 6 -133 -48 -67 -67 12 -116 56 40 -185 -96 -17 -121 56 -16 -191 -71 -78 115 -160 -7 -24 -69 -26 -33
7263 -33 -106 -105 96 -132 -70 -195 -34 67 226 -177 -27 101 -104 -8 -10 77 16 18 199 28 -37 24 -17 30 53 -60
7289 -60 85 37 -12 -93 44 84 78 120 -34 -44 35 -61 -11 -13 45 77 -94 102 39 0 6 -22 44 230 162 -10 -22 -53
7317 -53 -37 51 -78 -3 118 42 68 55 -48 -90 14 52 -180 -18 19 -110 -1 -60 167 -46 -2 -237 -251 -15
$$ packed form
7137C1n6L9q0r9N9J15j10J36o3K9L0P1j46J63j33j15P0J24j06o2L8n9p3K91L9
7162A33k00N2N4o7P1l0k6J44n0j8j32K69k81j22L42p9j13L7L5o3o7J52r3K19l24
7187a57O5J84p3j26M4J43m8q5K52k31j37K84l4j89K01o7j26P2l4QJ08j2nk4O6
7212G9j32J6L8p8K5P7L9Pk07J88K2o1j7J33j96J81o0j09J17j21K6J18n8j48J33
7237A2J3j9j39Q5j9%P9j28J72j6k25Q9P9j04J77p2j75J20pJ93k75J53j7m5M3p
7263c3p3JK01k28O2j25J61J01J59m03J50J28k05R6kQ7o1KJ81j71o5O1m1M7K3j13
7289f0J45m8m9q1J37M0oM2j54j0P9r6N0kN8L2j71J96o3l9Ok8O6J86o8j72j2l1
7317e3J6Q8j29P5J21p6K6j3j03m2J04L8k32J62L7j29J09n9K27k13M4k35j4K36
$$ plain form
7341 -15 -17 34 -119 84 1 -16 -4 -2 -150 -5 115 48 58 30 48 12 60 56 58 44 -84 -13 58 -19 -221 124 105 8
7369 8 -34 20 144 67 10 -25 -2 -14 51 152 -49 -48 202 -64 29 -29 -72 10 -28 -1 -34 1 -18 -30 -61 -118 -31 48 126
7398 126 -108 205 -2 -58 61 61 19 -154 -183 -18 -15 -81 -29 -8 -78 -4 45 74 -17 -29 -16 85 15 95 30 -182 18
7425 18 -53 -104 -31 11 -37 -56 -12 26 -79 -42 -16 -90 120 67 78 40 144 -36 -53 -76 4 79 52 33 60 56 30 117 39
7454 39 41 41 8 49 113 -114 -86 56 99 46 64 -53 -26 -101 -136 37 -15 -38 21 107 -24 64 99 -1 4 163 24 -24
7482 -24 146 39 69 -47 14 -88 77 46 -164 47 15 -77 -77 122 -46 -193 -59 75 66 -86 -8 -14 -14 53 -199
7507 -199 -60 -23 -114 -118 23 -33 2 70 -156 80 5 -16 -108 -93 -120 -217 -132 22 -38 31 -77 -11 -58 -74 32 164
7533 164 -32 43 -41 37 -15 -89 91 141 -3 -30 -110 -81 77 66 -25 15 87 11 8 167 -32 -124 88 37 70 -37
$$ packed form
7341a5kN1j53K03q3j7J2Kj48J45J20o7J0k8J8l6M8mKj4j28P1P1p7k02L45j9r7
7369Hm2N4J24p7n7l5K3j2O5J01k01JK50k66R3n8m3Q2l8K7l3L5j9j2l1n7Q7P9P8
7398A26k34L13k07n6J19%m2j73k9J65Lo6N2K1p0P4M9K9r1j2J3J01p0Q0o5k12K00
7425A8p1n1P3M2m8j9M4L8j05L7K6p4K10n3J1l8J04j80j7k3Q0P5k7j9K7mk6Q7p8
7454C9K%l3M1O4k27K8J42M3n3J8j17K7p5l5J73n2k3N9Q6j31Q8L5j00NJ59j39m8
7482b4J70j07L0j16O1j02J65l1k10K11l2r2%J99j68j47J34J34rj52P8o%O7k52
7507a99J39L7r1mJ41n6L5O8k26K36p5k1r2J5k7r7Q5J54o0O9j08O6m7j6J06J32
7533A64j96P5q4P8n2p4J80N0j44k7q0K9J58j1r1M0P2p6lJ59j99r2K12n1L3j07
$$ plain form
7559 -37 -125 35 3 24 -139 -21 96 -80 -1 29 77 105 128 -30 151 -15 16 32 35 -49 -89 134 107 81 -21 59
7585 59 72 -68 -15 3 -65 -19 -89 -23 30 -17 80 112 -110 -173 18 138 -119 -33 -71 86 49 -4 64 -107 41 -41
7611 -41 -12 81 -71 -33 -33 87 -48 -146 -110 -16 96 158 45 54 168 -50 151 64 -41 -68 -12 140 -165 -81 -2 143
7637 143 -21 62 -105 212 71 112 169 64 37 21 19 58 103 20 -59 28 -9 -12 201 60 208 -125 132 46 -16 -2
7663 -2 -4 -137 -91 46 -107 -79 -153 81 -127 92 -62 -118 -98 53 -166 69 10 87 -82 134 -106 -45 118 -83
7687 -83 4 -80 6 -109 73 41 -113 -174 -17 -141 -68 142 -66 -100 -15 61 -167 -12 -45 1 32 109 97 -102 106
7712 106 -192 101 40 -46 50 175 94 166 171 256 -26 -28 -32 -148 115 47 -64 11 -17 102 -22 -89 121 -28 3 1
7738 1 -72 96 67 39 -66 64 9 11 166 -79 47 2 -19 -42 82 -38 13 46 -13 45 17 -5 -54 -71 28 -62 10
$$ packed form
7559c7q8J60l2K1j63J18J17j76P9L0M8K8K3j58J81j66L1J6Lq4m0K23k7k6j02Q0
7585E9J3j40N3J8o8M6p0O6N3m7R7L2k22o3J91J20k57Q6l8J57l7n3O8j71J48q2
7611d1K9R3j52L8%J20j35r8L6R4J12O2j13RJ14k18K01q7j05k7N6J52l05Q4P9J45
7637A43j64Q3j67L17j41M1N7j05k7j6kL9M5q3p9Q7l7lK13j41J48l33K57q6o2J4
7663bkj33M6J37j53K8p4K34k08K19j54n6K0J51k19K35n9P7j69K16k40O1J63k01
7687h3Q7q4Q6j15J82l2j54o1J57j24P3K10k08l4Q5P6k28J55l3M6L1P7j2j99K08
7712A06k98K93o1q6R6J25q1P2NQ5k82kmj16K63o8j11P5k8J19j24o7K10j49L1k
7738Ap3J68k9k8j05J30n5KJ55k45J26m5k1k3J24j20N1L3n9N8k8k2m9j7R9r0P2
$$ plain form
7765 10 -5 83 31 38 37 3 37 -70 -61 -72 -143 -117 11 44 36 63 -92 -118 -3 62 -76 70 15 60 -90 -63 34 56 92
7794 92 108 -63 52 67 -110 -69 12 -40 24 226 -10 -46 205 -26 -109 78 -47 -54 -84 68 -77 74 91 -182
7818 -182 287 -21 -59 12 1 -92 23 56 19 10 30 66 41 104 -13 9 -14 17 -113 1 -24 -79 3 -80 -28 144 41
7845 41 61 -6 27 -144 -106 18 -313 -77 29 -92 -96 40 -37 -158 79 44 -237 46 91 15 -67 38 -220 -48
7869 -48 246 -63 74 -80 223 110 -5 91 -10 -153 86 -38 -107 86 -166 42 12 -98 -5 25 -69 43
7891 43 -98 -172 -127 120 -124 -105 -8 57 -33 -87 11 -66 -79 -57 12 180 80 -39 -12 49 202 126 163 178 20 -48
7917 -48 13 -139 70 -15 -193 -40 -22 -12 -42 48 17 12 97 95 -89 112 -119 213 -36 109 22 -92 167 -41 87
7942 87 57 24 -101 122 85 -62 -22 22 -92 39 175 -26 -88 -32 -8 10 -30 -20 -141 45 100 15 66 -91 -103
$$ packed form
7765A0j5Q8n2Pjl4L4j07Rj1p1K6J28L3qK7j55k6J15O5j38J46n5M5j50K7R7K2L6
7794I2J6j71J15J5j77M1Q1n2O4K02k36l6K51k31q3J87j25pl0J52j45J51J7k73
7818a82M69l08l8P1j1r3J15L3l7rK0L6k5O3j17K2k3L1j30J14k5n5Q2q3N2J72j03
7845D1K0o7L3j71L8J24l31K36J06j21mJ36p7j21K37l5k81K83M5p6q2J05k58J72
7869d8K94l09J37j54L03j13j15R6j01j43K39j24o9J93k52K08l0j10R3L0r4J12
7891D3j41p4M5K47k44J9R7O5r0n4R8p7j3K2O9J68j00j19K7O1J53p6L7J5j58o8
7917d8O1j52K09q5j78J53J8J0l0R0l1nQ5kj84K01k31L32k49J45q7j14K59k08J28
7942H7l0l3j25K23l7j47M0M4j14J31J36k01o2N6K4J8m0J0j21J86N5q5N1j57j2
$$ plain form
7967 -103 -112 22 -188 -63 -49 -19 101 13 106 -82 111 -28 103 -31 5 -53 -96 -61 107 59 4 106 22 -8 -149
7992 -149 55 -49 -195 50 54 -52 -34 -51 -67 -165 187 157 -48 46 166 -123 -125 48 -12 -137 60 48 -60 27
8016 27 -7 -126 77 18 31 -54 -22 17 46 -2 -36 -19 -73 85 92 -30 63 176 232 99 -11 67 -29 -5 14 20 46 -82
8044 -82 -1 -104 -59 21 39 68 -212 143 -89 -10 131 -67 -32 -13 -122 -154 -5 -118 20 64 -104 128 -189 177
8068 177 44 -17 17 -28 26 -64 122 112 47 87 63 -34 2 53 -125 -3 29 50 134 -69 143 101 197 157 -23 -7
8094 -7 118 4 81 -31 21 -7 -16 160 65 102 -168 -56 -61 -79 65 73 -34 -36 53 7 33 -31 67 -108 -152 33 -69
8121 -69 20 -219 -97 -12 -77 -114 -15 -12 -13 -114 -2 -99 -31 -108 58 -12 16 -127 42 98 -36 -46 -67 239 -49 -30
8147 -30 147 -69 77 -36 68 158 30 83 21 -148 48 -75 47 127 -82 -11 74 105 -14 103 125 60 24 21
$$ packed form
7967a03rJ34k10J25J4L0J20q8R3j88J93j39J31j34L6n8m3L5J68m8n5J02q4l0j41
7992a49K04j04j46K45Mj06J8j7j6r8L52l0k05R4J20k89kJ73o0j25J97j2j08Q7
8016B7l4j19K03n9J3q5L2L9K9m8l4J7n4J58Pj22R3J13N6j33j10P8r6K4J9OK6j28
8044h2Q1j03M5Q0J8K9k80L55k32P9J41j98L5J9j09l2J49j13J38M4j68K32l17L66
8068A77j33o1L4m5N4r0J86j0o5M0k4r7L6N1j78J22L2K1Q4k03K12m2R6m0j80J6
8094gJ25j14P7j12N2k8rJ76r5L7k70J12nj8J44Qj07kQ9m6K6o4R8j75m4J85j02
8121f9Q9k39J22Q5o5l7R9Ljj01J12r7O8p7J66p0K8j43J69N6j34j0k1L06k88J9
8147c0J77k16J46j13J04R0j28N3o2j69J96j23J22Q0k09P1Q5L1j19J17K2o5l6l
$$ plain form
8171 21 -163 -88 100 -29 86 -65 -10 138 116 20 138 52 -155 -156 75 48 -86 51 -113 -56
$$ packed form
8171B1j84P5J88j29J15j51N5J48k2r6J18q6k07jK31k7j34J37j64N7
8191e6
$$ Imaginary data points
##PAGE= N=2
##DATA TABLE= (X++(I..I)), XYDATA
$$ plain form
0 0 0 0 0 0 0 0 0 0 0 0 8 -8 8 -16 16 -16 24 -32 37 -40 48 -61 72 -86 96 -114 134 -152 176 -202 230 -262
32 -262 298 -336 381 -428 478 -535 598 -665 740 -821 909 -1005 1113 -1226 1354 -1493 1643
49 1643 -1811 1995 -2198 2424 -2675 2960 -3280 3646 -4071 4568 -5158 5874 -6759 7892 -9392
64 -9392 11483 -14592 19693 -29448 54501 -245393 -374411 395197 15572 -233503 276211
75 276211 173649 -169419 87293 -16021 -182853 84420 10400 -195137 73755 66255 -143046
86 -143046 12034 79304 -23389 69278 11863 -108970 6574 10880 -93007 2332 68185
97 68185 52908 36168 -49588 -5620 91550 -77511 -118242 108672 56712 -142775 -64727 52305
109 52305 29964 -29547 -9388 138827 91588 -133744 -6218 131686 -108327 -61292 159860
$$ packed form
0@%%%%%%%%%%Qj6J6k4L2l2M0n6O9p7Q8j09J33j58J82k10K48k86L28l78M32m92
32b62N60o34P17q09R06j013J133j263J405j561J730j914K118k339K580k847L136
49A643l454L806m193M622n099N635o240O926p717Q639r726J1032j2633J4651j7284
64i392K0875k6075L4285m9141Q3949k99894j29018P69608l79625k49075N09714
75B76211j02562l43068K56712j03314j66832K67273p4020k05537K68892p500k09301
86a43046J55080O7270j02693R2667n7415j20833J15544M306j03887R5339O5853
97F8185j5277j6740q5756M3968R7170j69061m0731K26914n1960j99487P8048J17032
109E2305k2341n9511K0159J48215m7239k25332J27526J37904k40013M7035K21152
$$ plain form
120 159860 -56783 -90381 134913 -80050 -138945 188766 27868 -159894 131245 55385
130 55385 -165989 78794 75402 -105033 122919 92130 -162545 61772 111028 -193703 -29807
141 -29807 160718 -80705 -71359 88182 -31106 -30419 57752 -23834 25721 79965 -65829 -33038
153 -33038 70015 -50959 -48514 77034 3631 -38160 33492 -27066 -66424 14763 6477 -37806
165 -37806 5389 26514 -9338 -18991 20925 40183 -1824 -2240 29743 -26704 -51465 2757 -35402
178 -35402 -40355 54181 -3870 -58669 60877 18928 -84048 49434 56951 -82727 21022
189 21022 65819 -81877 -2672 79740 -59470 -8617 87971 -57823 -50939 63097 -50377
200 -50377 -56396 77411 -7932 -45568 78078 14859 -47612 60680 24425 -48898 37922 16759
$$ packed form
120A59860k16643l3598K25294k14963n8895L27711j60898j87762K91139p5860
130E5385k21374K44783l392j80435K27952l0789k54675K24317M9256l04731J63896
141b9807J90525k41423R346J59541j19288O87Q8171q1586M9555N4244j45794L2791
153c3038J03053j20974K445J25548p3403m1791P1652o0558l9358Q1187q286m4283
165c7806M3195K1125l5852r653L9916J9258m2007m16L1983n6447k4761N4222l8159
178c5402m953R4536n8051n4799J19546m1949j02976J33482P517j39678J03749
189B1022M4797j47696P9205Q2412j39210N0853R6588j45794O884J14036j13474
200e0377o019J33807q5343l7636J23646o3219o2471J08292l6255p3323Q6820k1163
$$ plain form
212 16759 -62624 15388 23723 -51182 16084 50260 -33326 -9341 41383 -17932 -21579 34688
224 34688 8504 -11857 28668 17886 -15699 11866 18942 -22228 -11397 15663 -23112 -31272
236 -31272 16246 1078 -19256 30092 20969 -21894 22497 22541 -41082 1598 34347 -37830 -17644
249 -17644 41646 -19758 -29847 31942 -9194 -32266 20140 -13605 -37690 23345 314 -32892
261 -32892 34478 26858 -29055 19102 26601 -37267 -8742 14992 -37725 -18041 19175 -22987
273 -22987 -14686 30383 -2533 -14535 25314 3458 -20737 11689 3907 -19422 11340 14421 -13751
286 -13751 8799 19906 -16618 -9662 14057 -15024 -20991 11631 867 -11466 18997 18326 -1320
299 -1320 18852 19130 -9173 3023 10377 -18138 -8843 12481 -10034 -7754 19630 2173 -7819
$$ packed form
212A6759p9383P8012Q335p4905O7266L4176q3586K3985N0724n9315l647N6267
224C4688k6184k0361M0525j0782l3585K7565P076m1170J0831K7060l8775q160
236c1272M7518j5168k0334M9348r123m2863M4391M4o3623M2680L2749p2177K0186
249a7644N9290o1404j0089O1789m1136k3072N2406l3745k4085O1035k3031l3206
261c2892O7370p620n5913M8157P499o3868K8525K3734n2717J9684L7216m2162
273b2987Q301M5069l2916j2002L9849k1856k4195L2426p782k3329L0762L081k8172
286a3751K2550J1107l6524O956K3719k9081n967L2622j0764j2333L0463o71j9646
299a320K0172K78k8303J2196P354k8515R295K1324k2515K280K7384j7457r992
$$ plain form
312 -7819 16871 4931 -13082 9196 6766 -11718 9210 15118 -5562 8110 16827 -8107 -4873
325 -4873 7851 -14121 -15942 3663 -7030 -11189 10394 6346 -3314 12222 9074 -6865 2583
338 2583 2865 -13114 -5445 2515 -9636 -5246 5406 -5114 -7265 2309 -5852 -11349 -884 -3098
352 -3098 -8155 3036 5708 -941 5062 7660 -2501 -2910 -630 -9232 -10640 -4495 -7555 -7328 2189
367 2189 1706 -895 6535 5542 -2222 1858 3650 -3820 -1384 3936 337 1113 4542 810 1318 2322
383 2322 -5030 -3940 1740 -4034 -3475 6740 5887 4128 9539 8597 6716 5731 -807 37 2493 -6160
399 -6160 -4323 4717 -1303 -1132 7901 1020 -202 8065 -1503 -3920 8723 688 -4509 9822 4138
414 4138 -2976 8522 851 -8640 5227 -3227 -16832 2633 2910 -14459 2201 10852 -5444 2132
$$ packed form
312g819K4690j1940j8013K2278k430j8484K0928N908k0680J3672Q717k4934L234
325d873J2724k1972j821J9605j0693m159K1583m048r660J5536l148j5939R448
338B583K82j5979P669P960j2151M390J0652j0520k151R574q161n497J0465k214
352c098n057J1191K672o649O003K598j0161m09K280q602j408O145l060K27R517
367B189m83k601P430r93p764M080J792p470K436N320l599P76L429l732N08J004
383B322p352J090N680n774N59J0215q53j759N411r42j881r85o538Q44K456q653
399f160J837R040o020J71R033o881j222Q267r568k417J2643q035n197J4331n684
414D138p114J1498p671r491J3867q454j3605J9465K77j7369J6660Q651j6296P576
$$ plain form
428 2132 8288 -4669 387 2553 -10588 -2236 3476 -10507 -4464 5094 -5683 -5159 1304 -5174
442 -5174 -4595 -1637 -5265 -1377 713 -1027 3518 1185 -271 5483 -3737 -7582 4353 -6669 -12906
457 -12906 5946 -2860 -11795 12087 3727 -12505 14466 7635 -17086 10981 10491 -18955 8512
470 8512 15012 -18618 7076 18960 -19733 889 20404 -19361 -5518 21608 -14038 -5699 25351
483 25351 -7106 -5171 26972 -3491 -10888 20110 -2211 -13445 12248 -2733 -8640 13441 -4406
496 -4406 -8703 18868 -157 -14567 13460 6823 -12059 2171 5145 50 3376 -2754 2225 8388
510 8388 -8190 -5651 4940 -8495 -4023 2924 -12420 2282 11787 -15093 90 19074 -11857
523 -11857 -4900 13517 -17595 -4755 16906 -25629 -8696 33989 -20663 -27233 33778 -2442
$$ packed form
428B132O156j2957N056K166j3141Q352N712j3983O043R558j0777N24O463o478
442e174N79K958l628L888K090j740M545k333j456N754r220l845J1935j1022o237
457a2906J8852q806q935K3882q360j6232K6971o831k4721K8067m90k9446K7467
470H512O500l3630K5694J1884l8693K0622J9515l9765J3843K7126l5646Q339L1050
483B5351l2457J935L2143l0463p397L0998k2321j1234K5693j4981n907K2081j7847
496d406m297K7571j9025j4410K8027o637j8882J4230K974n095L326o130M979O163
510H388j6578K539J0591j3435M472O947j5344J4702R505k6880J5183J8984l0931
523a1857O957J8417l1112J2840K1661m2535J6933M2685n4652o570O1011l6220
$$ plain form
535 -2442 -32604 18180 4894 -19074 14736 -5306 -17498 27879 -1709 -29101 28039 11263
547 11263 -36161 9468 13757 -26122 7503 12482 -21835 12275 17841 -24449 2931 23748 -11301
560 -11301 -3519 11510 -5832 3755 3777 -13589 11462 17816 -15619 -5356 16507 30 -11418
573 -11418 -3688 12340 15294 -12993 -6363 27015 -2035 -20510 20355 9321 -16369 11764 -1459
586 -1459 -19590 19678 4002 -25683 22804 17227 -28297 7648 12525 -22539 14118 13420 -28279
599 -28279 17579 21649 -41042 1681 36491 -26248 -12712 26429 -16068 -11202 13345 -22207
611 -22207 1277 31806 -23585 -13475 35996 -15693 -31429 25529 4597 -22364 11306 1489
623 1489 -18292 6789 974 -14058 7836 10042 -7414 -7272 -2742 3024 -1051 -8330 10754 12526
$$ packed form
535b442l0162N0784j3286k3968L3810k0042j2192M5377k9588k7392N7140j6776
547A1263m7424M5629M289l9879L3625M979l4317L4110N566m2290K7380K0817l5049
560a1301P782J5029j7342R587K2j7366K5051O354l3435J0263K1863j6477j1448
573a1418P730J6028K954k8287O630L3378k9050j8475M0865j1034k5690K8133j3223
586a459j8131L9268j5676k9685M8487n577m5524L5945M877l5064L6657o98m1699
599b8279M5858M070o2691M2723L4810o2739J3536L9141m2497M866K4547l5552
611b2207K3484L0529n5391J0110M9471n1689j5736N6958k0932k6961L3670r817
623A489j9781K5081n815j5032K1894K206j7456J42M530N766m075p279J9084J772
$$ plain form
637 12526 -14192 -4308 8127 -9268 1203 7642 -11212 7795 11456 -25226 -1168 25939 -12757
650 -12757 -4424 26225 -8577 -12312 13815 -10021 -1999 23787 -11229 -7250 25310 -13993 -17421
663 -17421 26189 -4702 -13354 30247 -5165 -25648 26508 2164 -27521 29449 18595 -30959
675 -30959 9472 17085 -27474 1584 21016 -14494 2217 18985 -16442 -9572 15279 -5014
687 -5014 -5836 14529 1738 -10795 -1672 467 -2046 -267 4012 3704 -4819 -4809 -277 -8900 -4275
702 -4275 9949 -1191 -5006 6690 -7258 -11025 9202 -165 -6450 10905 -3958 -14583 7305
715 7305 -3893 -14241 14383 4921 -14758 11171 1275 -23662 9365 12831 -17724 8430 15924
728 15924 -22132 -2221 17943 -15713 -2560 22726 -10356 -10710 16459 -9165 -14366 18396 4444
$$ packed form
637A2526k6718R884J2435j7395J0471O439j8854J9007L661l6682K4058K7107l8696
650a2757Q333L0649l4802l735K6127k3836Q022K5786l5016L979L2560l9303l428
663a7421M3610l0891q652M3601l5412k0483N2156k4344k9685N6970j0854m9554
675c0959M0431P613m4559K9058J9432l5510J6711J6768l5427O870K4851k0293
687e014q22K0365j2791j2533R123K139k513J779M279l08q523J0M532q623M625
702d275J4224j1140l815J1696j3948l767K0227r367o285J7355j4863j0625K1888
715G305j1198j0348K8624r462j9679K5929r896k4937L3027L466l0555K6154P494
728A5924l8056J9911K0164l3656J3153K5286l3082l54K7169k5624n201L2762j3952
$$ plain form
741 4444 -9737 12446 2307 -13786 6958 7181 -7048 7137 8666 -8070 -970 6278 -4461
754 -4461 -1177 8905 3027 -1734 1962 -1119 -3641 3387 5483 113 2656 4251 -4605 -3576 5568
769 5568 -969 -3479 8046 1459 -8118 3311 649 -8693 6999 8102 -9413 1214 6635 -12192
783 -12192 -2551 11287 -6890 -4057 10851 -6859 -9708 8558 -4269 -9789 10975 699 -12907
796 -12907 5443 2040 -12840 4747 7717 -10024 500 6693 -10687 -3611 7714 -6720 -4082
809 -4082 9648 -3861 -8020 6093 -1147 -7832 6900 4030 -7961 2097 4069 -7589 526
822 526 7540 -4189 -1317 8080 -3516 -5611 7182 494 -5699 7214 4206 -7187 3241 5923
836 5923 -5702 2260 8519 -4406 -876 8422 -3454 -4192 8885 146 -5071 7767 2390 -7017
$$ packed form
741D444j4181K2183j0139j6093K0744K23j4229J4185J529j6736P100P248j0739
754d461L284J0082n878m761L696l081k522P028K096n370K543J595q856J029R144
769E568o537k510J1525o587r577J1429k662r342J5692J103j7515J0627N421j8827
783a2192R641J3838j8177K833J4908j7710k849J8266j2827n520K0764j0276j3606
796a2907J8350l403j4880J7587K970j7741J0524O193j7380P076J1325j4434K638
809d082J3730j3509m159J4113p240o685J4732k870j1991J0058J972j1658Q115
822E26P014j1729K872R397j1596k095J2793o688o193J2913l008j1393J0428K682
836E923j1625P962O259j2925L530R298j1876p38J3077q739n217J2838n377r407
$$ plain form
850 -7017 4875 4327 -6078 3888 6363 -6142 441 7068 -5116 -2161 8010 -2207 -4410 6155
864 6155 -923 -6066 4367 1189 -5747 3675 2387 -6895 1161 3936 -5847 -1109 5066 -4466 -3497
879 -3497 4074 -3004 -4844 3669 -1145 -5426 2842 215 -6112 1059 2272 -5433 -394 2995 -4545
894 -4545 -2344 3369 -3492 -3195 3529 -1947 -4215 3434 -189 -4863 2561 1970 -4414 1532 3050 -3852
910 -3852 389 3733 -3257 -538 4691 -2202 -1524 4793 -857 -2384 4666 721 -2994 3788 1923
925 1923 -2818 2941 3064 -2287 2175 3501 -2156 1204 3769 -1384 -67 3713 -386 -748 2964 542
941 542 -997 2328 1357 -1028 1438 1684 -1132 332 1763 -817 -939 1568 130 -1663 846 600
957 600 -2109 301 1063 -2672 -172 1833 -2789 -1252 2346 -2511 -2394 2349 -1745 -3167 2133 -1352
$$ packed form
850g017J1892n48j0405R966K475j2505O583O627j2184K955J0171j0217k203J0565
864F155p078n143J0433l178o936R422j288r282Q056K775r783M738O175r532R69
879c497P571p078j840Q513m814m281Q268k627o327P171J213p705N039L389p540
894d545K201N713o861K97O724n476k268P649l623m674P424n91o384N946J518o902
910c852M241L344o990K719N229o893O78O317n650j527P050l945l715O782j865
925A923m741N759J23n351M462J326n657L360K565n153J317L780m099l62L712k422
941E42j539L325r71k385K466K46k816J464J431k580j22K507j438j793K509k46
957F00k709K410P62l735K500K005m622J537L598m857J17M743m094j422N300l485
$$ plain form
973 -1352 -3810 1737 -866 -4230 1690 -46 -4480 1183 709 -4015 580 1306 -3807 186 1510 -3476
989 -3476 -232 1694 -2940 -326 1774 -2270 -172 1968 -1873 -182 1900 -1372 -151 1573 -990
1004 -990 671 1623 -1174 1375 2143 -1526 1245 2434 -1198 1349 2064 -1342 1838 2608 -2012 1534
1020 1534 3477 -1656 858 3354 -1221 838 2927 -1565 958 3288 -2116 148 3896 -1233 -795
1035 -795 2909 -800 -108 2004 -1831 429 2751 -2635 -700 3224 -1925 -1561 2048 -1680 -900 1697
1051 1697 -3007 -743 2943 -3343 -2211 3191 -2131 -2718 1704 -2153 -1345 2005 -3607 -1889 3547
1066 3547 -3258 -3498 3499 -1773 -3200 2392 -2230 -2247 3675 -3178 -3786 5249 -1500 -5504 4009 867
1082 867 -4758 2380 472 -3404 3165 305 -4419 3615 2294 -4419 1434 3277 -1945 401 1342
$$ packed form
973a352k458N547k603l364N920j736m434N663m74m724M595P26n113L993J324m986
989c476L244J926m634K614K100m044K098K140l841J691K082l272J221J724k563
1004i90J661R52k797K549P68l669K771J189l632K547P15l406L180P70m620L546
1020A534J943n133K514K496m575K059K089m492K523K330n404K264L748n129M38
1035g95L704l709O92K112l835K260K322n386J935L924n149L64L609l728P80K597
1051A697m704K264L686o286J132N402n322n87M422l857Q08L350n612J718N436
1066C547o805k40O997n272j427N592m622j7N922o853o08R035o749m004R513l142
1082H67n625P138j908l876O569k860m724Q034j321o713N853J843n222K346R41
$$ plain form
1097 1342 -765 2188 557 -1882 2859 1709 -1786 1422 1642 -61 2020 -167 -433 3807 -65
1112 -65 -2460 3842 1584 -2064 2187 908 -827 3039 -479 -2135 4527 457 -4040 3448 1967
1127 1967 -3581 2459 1121 -3238 3440 390 -5231 3958 2363 -6808 1880 4208 -5646 29 3482
1142 3482 -4871 196 3397 -5289 -837 4750 -4763 -2788 4338 -2472 -3090 2429 -1750 -2159 1629
1157 1629 -2289 -1927 2405 -1709 -2694 1320 -517 -1736 -68 -817 -109 298 -2024 -121 1202 -1431
1173 -1431 -341 857 -888 617 70 -1846 1965 1169 -2552 1701 2054 -2720 1657 2454 -3042 2077
1189 2077 3440 -3848 1487 4949 -3895 -19 6038 -2796 -1280 5849 -2304 -2114 6013 -1380 -2874
1204 -2874 6239 -67 -3963 5143 1130 -4205 3827 2182 -3552 2668 1942 -3722 1699 2300 -2732
$$ packed form
1097A342k107K953j631k439M741j150l495L208K20j703K081k187k66M240l872
1112f5k395O302k258l648M251j279j735L866l518j656O662m070m497P488j481
1127A967n548O040j338m359O678l050n621R189j595r171Q688K328r854N675L453
1142C482q353N067L201q686M452N587r513J975P126o810o18N519m179m09L788
1157A629l918L62M332m114r85M014j837j219J668p49P08M07k322J903J323k633
1173a431J090J198j745J505n47j916L811p96l721M253L53m774M377P97n496N119
1189B077J363p288N335L462q844L876O057q834J516P129q153J90Q127p393j494
1204b874R113o306l896R106m013n335Q032j645n734O220p26n664N421O01n032
$$ plain form
1219 -2732 881 2402 -2283 -355 1527 -1490 -561 1377 -748 -802 286 -635 -1069 -463 399 -172 -1254
1236 -1254 -80 -365 -2337 -152 614 -2344 -156 1621 -3014 -1530 1921 -2721 -1804 3045 -2132 -2917
1252 -2917 2795 -1843 -3391 3298 -279 -3930 2884 258 -4814 2099 1329 -3886 2402 2466 -4039 1018
1268 1018 2741 -3676 725 3989 -2537 -500 3573 -1851 -1227 3434 -667 -650 3490 48 -1831 2294
1284 2294 696 -1259 2443 1897 -984 757 1306 -675 549 1872 235 102 1412 314 -1028 1016
1300 1016 1482 -440 764 1784 -1114 -834 1698 -464 -763 2174 -347 -1855 1542 -225 -2579 1711
1316 1711 1083 -2445 970 1275 -3519 -320 1758 -2509 -89 2458 -2753 -1937 2119 -2430 -2473 2580
1332 2580 -931 -2733 1820 -831 -3822 1277 865 -2620 835 998 -3516 -365 1453 -2152 -299
$$ packed form
1219b732L613J521m685J928J882l017R29J938k125n4J088r21m34O06Q62n71j082
1236a254J174k85j972K185P66k958K188J777m635J484L451m642R17M849n177p85
1252b917N712m638j548O689l577l651O814k626n072O913p70n215O288O4o505N057
1268A018J723o417M401L264o526K037M073n424O24M661m101J7M140l442j879M125
1284B294j598j955L702n46k881J741N49j981J224J323j637j33J310j098j342K044
1300A016M66j922J204J020k898K80K532k162k99K937k521j508L397j767k354M290
1316A711o28l528L415L05m794L199K078m267K420K547n211Q16M056m549m3N053
1332B580l511j802M553k651k991N099m12l485L455J63m514L151J818l605J853
$$ plain form
1347 -299 2173 -1487 -1477 1586 -1046 -1724 1624 621 -1354 1111 429 -1912 503 1832 -873 282
1363 282 2184 -832 -1037 1644 82 -815 2259 1137 -960 1625 1076 -1633 1496 2518 -760 476
1379 476 2294 -1170 -522 2386 13 -365 2416 181 -1372 1734 391 -1558 1926 1818 -1684 936
1395 936 1617 -1825 303 2098 -1236 -428 1648 -1307 -1448 1391 -602 -1535 1624 9 -1980 482
1411 482 3 -2085 366 909 -1668 -469 615 -1757 -1176 919 -1165 -1369 921 -793 -2014 369
1427 369 -242 -1696 513 638 -1696 -319 736 -1598 -523 1265 -1008 -1229 1208 -673 -1541 1109
1443 1109 268 -1218 1226 963 -1610 523 1317 -1074 665 1807 -699 -5 1768 -569 -555 1922
1459 1922 -54 -658 1768 399 -907 1493 886 -757 1572 1345 -845 734 1361 -531 602 1627
$$ packed form
1347b99K472l660J0L063k632o78L348j003j975K465o82k341K415J329k705J155
1363B82J902l016k05K681j562q97L074j122k097K585n49k709L129J022l278J236
1379D76J818l464O48K908k373l78K781k235j553L106j343j949L484j08l502K620
1395I36O81l442K128J795l334Q08K076k955j41K839j993r33L159j615j989K462
1411D82m79k088K451N43k577J199J084k372N81K095k084k04K290j714j221K383
1427C69o11j454K209J25k334J377J055k334J075J788k273k21K437j881q68K650
1443A109q41j486K444k63k573K133P94k391J739J142k506O94J773k337J4K477
1459A922j976o04K426j369j306K400o07j643K329k27k190J579O27j892J133J025
$$ plain form
1475 1627 -243 59 1414 36 -330 1042 310 -529 922 638 -672 227 765 -460 -271 842 -463
1492 -463 -785 585 -332 -1153 389 189 -1440 61 322 -1425 -486 771 -1333 -733 790 -1421 -1101
1509 -1101 863 -992 -1417 803 -789 -1582 601 -656 -1878 514 -26 -1691 555 362 -1462 294
1525 294 432 -1261 50 718 -1424 94 695 -1045 -231 972 -529 -329 883 -137 -175 642 276
1542 276 39 700 486 253 419 685 515 48 322 813 141 40 1014 366 135 926 316 391 1310 -87
1562 -87 -201 1511 258 -876 1338 767 -922 939 697 -876 965 394 -1148 872 862 -1306 540
1579 540 1333 -1122 153 1056 -1149 -96 876 -1714 -687 1205 -1248 -1378 782 -317 -1074 70
1595 70 -558 -392 38 -1333 -272 552 -1077 -856 537 -658 -961 -31 -704 -312 -121 -1332 -241 514
$$ packed form
1475A627j870L02J355j378l66J372p32q39J451k84j310Q99N38j225J89J113j305
1492d63l22J370r17q21J542k00j629J501K61j747R39J257k104O00J523k211L20
1509a101J964j855m25K220j592p93K183j257j222K392n40j665K246j93j824J756
1525B94J38j693J311O68k142J518O01j740Q14J203j501K00J212j020l8Q17l66
1542B76k37O61k14k33J66K66j70m67K74M91o72j01R74o48k31P91o10P5R19j397
1562h7j14J712j253j134K214n71j689J861k42j573J841n71j542K020j0k168J846
1579E40P93k455J275R03k205J053R72k590J027J892k453j30K160j099p57J144
1595G0o28J66M30j371J061Q24j629K21J393j195l03R30o73L92J91j211J091P55
$$ plain form
1613 514 -1059 -311 416 -673 113 570 -1229 72 1089 -1449 -552 1224 -421 -597 617 -214 398
1630 398 808 -1057 498 1864 -1000 -475 2174 114 -486 1435 546 -110 1193 -223 -203 1328 -524
1647 -524 -476 1474 168 -133 1364 -6 -109 1602 -225 -623 1592 10 -994 1140 362 -501 851
1664 851 -525 -177 1097 -1007 -1165 1594 -307 -1450 1203 279 -1023 650 -16 -831 654 -654
1680 -654 -1405 869 -342 -1897 502 -56 -1358 568 -269 -1509 582 -44 -1690 255 408 -1413
1696 -1413 -40 65 -876 99 -561 -1274 494 -232 -1474 469 187 -1018 484 274 -606 886 -5
1713 -5 -835 1087 102 -1445 1040 551 -1078 1174 705 -1179 1172 851 -1289 1094 1106 -1128 1095
1730 1095 1397 -812 915 1530 -1146 860 1414 -1440 556 1327 -1301 324 1843 -762 245 1929
$$ packed form
1613E14j573P48P27j089P86M57j799J301J017k538Q97J776j645j76J214q31O12
1630C98M10j865J555J366k864N25K649k060o00J921q89o56J303j416K0J531j852
1647e24M8J950j306l01J497j370j03J711j827l98K215j582j004K134p78q63J352
1664H51j376L48J274k104j58K759j901j143K653r24j302J673o66q15J485j308
1680f54p51K274j211j555K399n58j302J926q37j240K091o26j646J945J53j821
1696a413J373J05r41R75o60p13J768p26j242J943k82j205J502k10q80J492q91
1713eq30J922r85j547K485m89j629K252m69j884K351l21k140K383J2k234K223
1730A095L02k209J727O15k676K006N54k854J996P71k628J625J519k605J007J684
$$ plain form
1746 1929 -810 23 1875 -567 -619 1361 -439 -654 1191 -16 -667 716 -258 -721 209 -273 -410
1763 -410 1 -275 149 155 -431 257 61 -806 66 -344 -1374 3 -45 -1660 223 536 -1669 73 810
1782 810 -1663 -302 924 -1571 -482 1136 -1569 -462 1513 -1512 -886 1515 -1175 -1305 1490 -998
1798 -998 -1310 1670 -229 -1254 1991 192 -1370 1509 561 -1441 764 985 -1307 863 1045 -1011
1814 -1011 527 1402 -738 45 1430 -244 -386 1179 397 -33 998 995 76 354 748 -222 -189 856
1832 856 245 -620 617 555 -643 579 1179 -603 301 1422 -1029 -332 1269 -959 -704 1732 -618
1849 -618 -1257 1390 -416 -1812 1282 -160 -2124 980 368 -2154 906 1114 -2027 364 1150 -2046
1865 -2046 -609 1029 -1943 -967 1344 -1197 -1215 1346 -798 -1650 1225 -136 -1604 1045 364 -1881
$$ packed form
1746A929k739Q33J852k442n2J980j800k15J845j207o51J383r74m63R30m82j37
1763d10M11k76M24On86O88j96q67Q72m10j030J377m8j615J883L13k205J742P37
1782H10k473J361J226k495J089J618k705J107J975l025O26K401k690j30K795k488
1798i98l12K980j899j025L245j799j562K879r48k002K205K21k292K170J82k056
1814a011J538Q75k140P83J385j674j42J565p82m30J031lr19K78L94r70L3J045
1832H56o11q65J237o2j198J222O00j782R04J121k451O97J601k228K55K436k350
1849f18o39K647j806j396L094j442j964L104o12k522L060K08l141K391P86l196
1865b046J437J638k972R76K311k541j8K561k144q52K875j361j468K649o81k245
$$ plain form
1881 -1881 248 997 -1152 -91 1302 -959 -949 717 -537 -1104 950 370 -904 868 773 -1153 647
1898 647 1408 -984 306 1574 -821 -848 1560 -136 -758 2060 427 -1314 1464 693 -1584 1225
1914 1225 1459 -1136 945 1657 -1323 118 1939 -888 -98 2018 -1184 -1398 1928 -514 -1409 2167
1930 2167 655 -1467 1539 677 -2147 895 1255 -1683 376 1377 -2088 -620 1534 -1156 -938 1638
1946 1638 -933 -1904 1094 -233 -1909 1374 848 -1684 589 1095 -2237 -689 1458 -1428 -1090 1305
1962 1305 -1203 -1891 1202 -121 -1888 1579 713 -2227 486 1041 -2372 26 2169 -1441 -594 2111
1978 2111 -1465 -1565 2175 -802 -1803 2053 174 -2276 1557 1125 -2048 1763 2184 -1782 529 1878
1994 1878 -2075 -181 2583 -1072 -766 2534 -662 -1478 2174 222 -1333 2186 1019 -1651 958
$$ packed form
1881a881K129P49k149J061J393k261J0J666j254n67K054n80j274J772r5j926J800
1898F47P61k392J290J268k395k7K408j696o22K818j633j741K778p71k277K809
1914A225K34k595K081P12k980J441J821k827P90K116l202k14L326k442q95L576
1930B167j512k122L006q62k824L042L60k938K059J001l465J468K154k690K18K576
1946A638k571r71K998j327j676L283n26k532K273N06l332J548K147k886L38K395
1962A305k508o88L093j323j767L467q66k940K713N55l413K398K143l610Q47K705
1978B111l576j00L740k977j001L856j879k450L833m32l173L811M21l966K311J349
1994A878l953J894K764l655L06L300l196q16L652j952j555L519j167k670K609
$$ plain form
2009 958 1192 -1349 960 2192 -804 -337 1557 -945 -1232 1457 -11 -1241 1338 599 -1615 620
2025 620 1332 -1317 470 1761 -1326 -944 1348 -1226 -1217 1906 -488 -1798 1384 -196 -2670 1192
2041 1192 710 -2416 1075 1283 -2414 311 1754 -2321 -307 2221 -2154 -1635 1742 -1607 -1795 1882
2057 1882 -594 -1626 1935 -71 -2003 1488 475 -1979 1176 952 -1970 362 1428 -1407 -17
2072 -17 1556 -790 -521 1222 -672 -921 1150 361 -687 1168 1219 -742 501 1056 -460 -6 1193
2089 1193 -677 -708 1608 5 -1351 1649 1132 -1775 1008 1815 -1665 145 2128 -1097 -186 2161
2105 2161 -1129 -747 2401 -1136 -1590 2333 -491 -2358 1952 172 -2336 2177 849 -2325 1593
2120 1593 1175 -2594 416 1785 -2220 -442 1655 -1627 -626 1246 -1559 -703 1467 -1486 -1342 1707
$$ packed form
2009I58K34k541K309J232k996M67J894k502k87K689j468j230K579p39k214K235
2025F20P12k649J787J291l087L82K292k574RL123k394j310L182j580k474L862
2041A192m82l126L491K08l697K725J443m075K014K528m375N19L377l349j88L677
2057A882k476j032L561k006j932L491j013k454L155k24k922K332J066k835J390
2072a7J573k346K69J743j894k49K071p89j048J855N1j961J243N55j516M54J199
2089A193j870l1K316j603j356L000n17k907K783Q07l480J810J983l225R11K347
2105B161l290L82L148l537m54L923k824j867M310j780k508M513j328l174L918
2120A593m18l769L010J369m005J778K097l282J001J872k805Q56K170k953J44L049
$$ plain form
2136 1707 -305 -1837 1097 736 -1378 -129 588 -693 -569 144 -326 -775 211 88 -935 117 992
2153 992 -928 -432 1263 -461 -736 1359 -227 -730 1312 -405 -1123 1858 168 -2070 1533 1077
2169 1077 -2150 948 1460 -1357 825 1378 -1176 1171 1769 -1989 457 2098 -1996 -549 2266 -1139
2185 -1139 -542 2140 -611 -934 2079 -196 -1314 1710 320 -1354 1054 663 -538 389 190 -286
2201 -286 516 -199 -767 54 61 -434 -64 158 493 -3 -578 529 404 -1064 -38 414 -1176 -194 392
2220 392 -1118 36 673 -1089 -189 937 -1229 -309 920 -1197 -264 1099 -1261 -209 1533 -1248
2236 -1248 -863 1582 -1131 -1412 1548 -643 -1317 1353 -199 -1307 1551 169 -1391 1323 362 -1438
2252 -1438 775 455 -1064 637 417 -853 639 505 -735 484 290 -521 689 122 -310 1020 190
$$ packed form
2136A707k012j532K934l61k114J249P17j281J24P13m70m49R86j23j023J052Q75
2153I92j920M96J695j724k75K095j586n03K042j717p18K981j690k238L603m56
2169A077l227L098N12k817K182N53k554K347N98l758K446J641m094J447K815l405
2185a139N97K682k751l23L013k275j118L024j390j674K408l91j201R27j99m76
2201b86Q02p15n68Q21Pm95L70K22L35m96n75J107j25j468J026M52j590R82N86
2220C92j510J154O37j762R00J126k166R20J229k117R33J363k360J052J742k781
2236a248L85K445k713k81K960k191o74K670j552j108K858j382j560K714r61j800
2252a438K213l20j519J701k20j270J492j34j240J219j94q11J210n67m32J330q30
$$ plain form
2269 190 -316 1198 284 -590 647 158 -980 635 241 -803 886 588 -496 847 518 -594 587
2286 587 174 -606 680 223 -626 893 222 -1018 740 288 -1183 467 158 -1255 499 446 -992
2303 -992 638 684 -970 103 373 -1020 -28 273 -1218 -75 392 -1019 -46 417 -886 231 249 -825
2321 -825 59 350 -1202 235 470 -1069 224 670 -1093 -16 789 -1322 -414 895 -1019 -459 1231
2338 1231 -397 -172 1160 -366 -593 1076 -404 -472 911 -155 -548 908 128 -486 731 43 -351
2355 -351 624 115 -268 555 335 -45 324 277 85 334 -27 133 372 -231 -12 267 -161 186 417 -320
2375 -320 429 636 -490 288 631 -779 74 678 -702 -127 1032 -841 -496 1241 -727 -927 1019
2392 1019 -389 -1173 790 -175 -1114 932 -139 -1314 803 185 -1550 399 468 -1410 -23 680 -842
$$ packed form
2269A90n06J514r14q74J237m89j138J615l94j044J689k98j084J343l29j112J181
2286E87m13p80J286m57q49J519o71j240J758m52j471J650l09j413J754n3j438
2303i92J630M6j654J073K70j393R92L01j491J143M67j411R73M63j303J117J8j074
2321h25Q84K91j552J437K35j539J293M46j763J077Q05k111R08J309j914N60J690
2338A231j628K25J332j526k27J669j480o8J383j066l93J456p80o14J217o88l94
2355c51R75n09l83Q23k20l80L69m7j92K49l61J60K39o03K19K79m28L47K31p37
2375c20P49K07j126P78L43j410Q53O04j380N75J159j873L45J737j968k00J946
2392A019j408p84J963r65r39K046j071j175K117o18j735J949O9j878J387P03j522
$$ plain form
2409 -842 -204 665 -897 -173 749 -793 -643 826 -198 -717 542 67 -521 193 117 -471 310 260 -666
2428 -666 69 526 -284 -436 604 343 -518 286 608 -468 -27 756 -366 16 786 -360 -198 1307
2446 1307 -127 -636 973 156 -779 977 486 -797 994 731 -985 600 1180 -1039 16 1229
2462 1229 -991 -239 1237 -606 -471 1414 -494 -768 1276 -131 -1239 1184 238 -1210 641 606
2478 606 -984 45 778 -1028 -83 751 -757 -518 810 -481 -904 773 175 -901 448 292 -1059
2495 -1059 -143 369 -972 -335 720 -700 -914 881 -184 -1130 1087 290 -1352 549 321 -1431 455
2512 455 1098 -1221 135 1395 -1200 -533 1583 -695 -882 1387 -290 -1326 1285 145 -1203 1299
2528 1299 718 -1257 857 811 -1456 414 1182 -886 2 1381 -753 -349 1293 -253 -565 1161 -80
$$ packed form
2409h42O38Q69j562P24R22j542J50J469j024n19J259m75n88P14p6n88P81n0r26
2428f66P35M57q10j52J040k61q61Q04L22j076M41P83j122L82P70j146J62J505
2446A307j434n09J609q17r35J756m91j283J791k63j716J585N80k219J055J213
2462A229k220P52J476j843J35J885j908k74K044j407j108K423r46j448J851l5
2478F06j590J029P33j806R45Q34j508K39J328j291m23J677n98j076J349j56j351
2495a059R16N12j341O37J055j420k14J795j065r46K217p97j642J901k28j752J886
2512D55O43k319J356J260k595O67K116k278j87K269j677j036K611j140j348K502
2528A299n81j975K114m6k267J870P68k068Q88J379k134M04J642j546l12J726j241
$$ plain form
2545 -80 -736 745 399 -738 573 992 -632 178 803 -674 -583 990 50 -698 875 242 -1017 527
2563 527 658 -870 204 914 -1198 -506 1171 -1101 -813 1550 -386 -1008 1273 -405 -1887 1123
2579 1123 227 -1799 1109 871 -2011 442 1032 -1649 -33 1369 -1209 -320 1063 -1533 -670 1485
2595 1485 -914 -742 1403 -488 -1127 973 -56 -1132 741 557 -886 386 509 -1094 302 969
2611 969 -509 -446 600 -248 -627 434 529 -405 364 773 -753 -144 1073 -558 -743 1583 200 -1405
2629 -1405 1220 610 -1470 933 1297 -1253 446 1127 -1662 139 1756 -1452 46 2128 -999 -1028
2645 -1028 1696 -729 -1044 1686 -408 -1244 1491 -259 -1698 1565 398 -1576 1003 656 -1684 345
2661 345 525 -1303 454 839 -1279 -44 998 -1143 -549 975 -358 -708 219 -106 -610 -44 215
$$ packed form
2545h0o56J481l46j137J311M19j624Q10O25j477R1J573r40p48J573o33j259J544
2563E27J31j528J074P10k112O92J677k272K88K363j936o22K281j678j482L010
2579A123q96k026K908k38k882K453N90k681J616J402k578Q89J383k596Q63K155
2595A485k399J72K145j891o39K100j029j076J873j84j443J272J23j603J396O67
2611I69j478O3J046q48l79J061R5r34P69M09j526O09J217j631j85K326j383j605
2629a405K625o10k080K403L64k550J699O81k789J801J617l208J498K082l127k9
2645a028K724k425l15K730k094q36K735j750j439L263j167j974K579l47k340K029
2661C45J80j828J757L85k118J235J042k141N94J524j333l50R27l25n04N66K59
$$ plain form
2678 215 -270 -172 308 -325 -823 159 324 -955 217 893 -1123 -233 943 -895 -502 1344 -688 -704
2696 -704 1742 -866 -1391 1822 1 -1550 1714 494 -1644 1188 482 -1519 1139 902 -1813 837
2712 837 1433 -1940 461 1565 -1413 139 1570 -1255 -250 1669 -1024 -433 1715 -665 -805 1327
2728 1327 -48 -951 1072 203 -644 794 375 -909 226 753 -607 -52 635 -205 -581 276 470 -647
2746 -647 -205 910 -432 -663 1079 -193 -1126 1177 47 -1734 808 712 -1757 536 1131 -1768 -22
2763 -22 1118 -1720 -316 1429 -1508 -538 1561 -1111 -1006 1409 -663 -1077 1532 -322 -1170 1231
2779 1231 -284 -1272 1092 170 -1280 708 559 -1218 672 609 -1019 317 693 -893 31 791 -406
2796 -406 -168 694 -143 -423 339 254 -149 -32 350 -35 -268 630 342 -573 391 642 -651 296 742 -780
$$ packed form
2678B15m85R8M80o33m98R82J65j279J172O76k016Q90J176j838L93J846k032j6
2696g04K446k608n25L213j821j551L264j220k138K832p06k001K658k37k715K650
2712H37N96l373K401J104k978J552J431k825J005J919k693N91K148k380j40K132
2728A327j375r03K023q69q47J438m19j284J135N27j360N55O87q40l76Q57J94j117
2746f47M42J115j342k31J742j272r33K303j130j781K542r6k469K293N95k899J746
2763b2J140k838J404J745k937R70K099k672J05K415k072m14K609j854q48K401
2779A231j515r88K364r22j450J988j49j777J890o3j628J336L76j586R24P60j197
2796d06K38Q62q37k80P62q5m03J17L82l85k33Q98k88r15R64K51j293R47M46j522
$$ plain form
2816 -780 -140 1062 -582 -255 1197 -416 -661 1134 -189 -550 1025 -96 -933 950 110 -944 777
2833 777 181 -1119 628 321 -1121 599 562 -948 296 706 -1179 50 805 -872 -236 685 -710
2850 -710 -389 705 -588 -552 627 -339 -499 311 -168 -601 -5 129 -186 -144 76 48 -290 -9 119 -286
2870 -286 -179 181 -363 -369 557 -114 -425 651 142 -698 365 249 -493 464 331 -649 372 456 -641 317
2890 317 694 -618 105 699 -536 89 634 -452 49 802 -422 -30 681 -260 -312 580 -306 -233 756
2909 756 -134 -292 581 37 -408 384 144 -349 174 11 -51 155 -135 -188 176 -201 -168 26 -165 -102 107
2930 107 -348 106 269 -482 -239 282 -394 -381 387 -219 -170 213 -154 -359 278 -208 -535 307 82 -382 -30
2951 -30 120 -276 149 4 -351 239 -123 -362 56 36 -144 0 -36 -86 193 -172 -72 333 -18 -162 316
$$ packed form
2816g80O40J202j644L27J452j613k45J795j323l61J575j121q37J883q40j054J721
2833G77n96j300J747l07j442J720l7j510J244M10j885J229P55j677O36R21j395
2850g10L21J094j293L6J179r66j60Q10m79m33N96J34l15M2K20k8l38K81J28m05
2870b86J07L60n44oR26o71l11J076n09q40J063j16p42R57j33r80J021Q4j097R58
2890C17L77j312P23N94j235O25N45j086N01P53j224L92P11r41n2Q92q86P3R89
2909G56q90j58Q73n44m45P92k40m93N23j63o2K06k90n3L64l77L3J94j91O3K09
2930A07m55M54J63p51K43N21o76J3P68o06M9L83l67k05O37m86l27Q42k25m64L52
2951c0J50l96M25j45l55N90l62k39M18k0j80J44l6n0K79l65J00M05l51j44M78
$$ plain form
2972 316 50 -160 222 -193 -165 509 -183 -189 615 34 -430 360 198 -395 328 84 -269 424 245 -361 448
2993 448 406 -443 294 575 -481 137 678 -469 -41 534 -404 -8 658 -390 -281 503 -140 -472 413
3012 413 -64 -453 171 141 -608 152 241 -414 -155 204 -251 -298 171 -40 -391 137 226 -598 -126 193 -479
3033 -479 -385 379 -348 -429 561 -136 -658 475 149 -609 255 456 -976 277 461 -967 194 585 -670
3052 -670 67 913 -727 -249 874 -552 -538 887 -349 -706 867 -90 -823 852 188 -895 799
3069 799 548 -872 347 704 -520 174 828 -426 -191 854 -47 -450 864 125 -580 654 505 -616
3087 -616 269 620 -439 -108 686 -295 -358 556 -90 -577 694 100 -906 449 552 -954 134 737
3105 737 -943 -179 983 -829 -568 1122 -728 -840 1240 -456 -1102 1197 -125 -1392 947 574
$$ packed form
2972C16k66k10L82m15K8O74o92oQ04n81m64P90j62n93P23k44l53O93j79o06Q09
2993D48m2q49P37K81j056O18N41j147M28N75r38L96O66j048J09P84o43l32Q85
3012D13m77l89O24l0p49P60Q9o55K59L59m55m7M69k11l51N28Q9q24M72L19o72
3033d79R4P64p27q1R90o97n22J133l26p58Q64K01j432J253J84j428J161L91j255
3052f70P37Q46j640M78J123j426J4J425j236l57J573r57p33J675o64j083J694
3069G99k51j420J219L57j224O94O54j254K35J045r01m03J314p39p05J234j49j121
3087f16Q85L51j059L31P94r81o3R14o46m87J271n94j006J355J03j506J088O03
3105G37j680P64J162j812K61J690j850j12K080j696o46K299j322j267K339l73
$$ plain form
3121 574 -1492 645 756 -1381 394 1052 -1397 -111 1269 -1040 -505 1109 -512 -953 1033 -194
3137 -194 -1002 770 155 -1086 608 494 -932 256 717 -558 -458 776 31 -443 707 105 -640
3154 -640 452 427 -636 353 750 -719 -135 1089 -543 -384 1171 -112 -639 1022 -152 -1032 1186
3171 1186 327 -1298 937 671 -1716 567 1268 -1363 183 1392 -1198 -270 1595 -1051 -682 1617
3187 1617 -654 -1127 1401 -58 -1171 1050 134 -1354 818 388 -1129 473 468 -1013 11 773 -757
3204 -757 -287 622 -396 -336 528 -175 -555 576 -78 -712 116 500 -783 33 593 -528 -444 646 -341
3223 -341 -780 872 -27 -1049 767 362 -1394 492 989 -1438 52 1352 -1135 -408 1523 -920
3239 -920 -846 1626 -439 -1047 1632 -118 -1620 1385 498 -1456 885 905 -1463 490 989 -1375 365
$$ packed form
3121E74k066K137J11k137J775O58k449J286J380k309N35J614j621m41J986j227
3137a94q08J772o15j241J694j14j426J188M61j275J00J234p45m74J150o02p45
3154f40J092k5j063R89L97j469N84J224j632J59J555j283n27J661j174q80K218
3171A186q59j625K235k66k387K283P01k631J546J209k590R28J865k646L69K299
3187A617k271m73K528j459j113K221r16j488K172m30j517J602nj481J024P62j530
3204g57M70R09j018O0Q64p03l80J131o54o34Q28L84j283Q16N60j121Q4J090r87
3223c41m39J652q99j022J816m05j756J886M97k427J490J300k487P27J931k443
3239i20P4K472k065o08K679j750j502L005q87j954K341K0k368J953M99k364J740
$$ plain form
3256 365 1331 -1180 -125 1239 -739 -512 1227 -399 -592 965 -167 -608 975 145 -698 584 597
3273 597 -613 224 641 -423 -259 777 -216 -506 554 -3 -835 431 627 -947 -78 786 -768 -492
3291 -492 1197 -507 -854 1288 -272 -1178 1066 248 -1471 810 621 -1593 526 949 -1151 151
3307 151 1045 -1161 -125 1201 -853 -499 1233 -609 -668 1152 -230 -919 1018 -217 -837 908 112
3324 112 -1061 530 563 -994 141 484 -792 243 814 -531 -199 603 -294 -429 691 -16 -537 361
3342 361 381 -302 78 589 -435 -190 807 -103 -501 663 277 -639 510 527 -753 450 758 -837 -2
3361 -2 1168 -744 -185 1011 -668 -606 1046 -356 -692 918 44 -919 830 137 -1013 683 344 -988
3379 -988 465 504 -996 134 601 -934 -21 707 -789 -295 783 -550 -653 715 -86 -612 550
$$ packed form
3256C65R66k511J055J364j978K27J739j626j93J557j132m41J583q30q43J282J3
3273E97j210Q37M17j064J64J036r93k90J060n57q32J266J96j574Q69Q64j554K76
3291d92J689j704l47K142j560r06K244q18j719K281j89k214K119M23k100J302
3307A51Q94k206J036J326k054L54J732j842n9J820j382o89J937j235o20J745p96
3324A12j173J591L3j557J135L43j276J035N71j345L32Q02q97j35J120p07n21Q98
3342C61K0o83L80N11j024K45R97r10l98J164l86r16J149J7j280J203L08j595Q35
3361bJ170j912N59J196j679O2J652j402l36J610q74r63J749o93j150J696l39j332
3379i88J453L9j500J130M67j535R13P28j496M94J078j333j03J368q01n26J162
$$ plain form
3396 550 144 -603 144 85 -444 -153 459 -296 -242 231 -143 -269 299 197 -384 163 388 -392 12 470 -179
3417 -179 -82 568 -285 -265 655 -76 -363 640 87 -492 433 309 -458 576 279 -441 460 596 -594 189
3437 189 736 -500 30 596 -396 -139 630 -442 -316 669 79 -287 592 -14 -344 415 254 -376 295
3456 295 155 -379 92 376 -222 5 384 -269 -334 23 30 -147 121 214 -217 10 41 -193 -132 227 -45 -301
3478 -301 103 13 -362 98 181 -460 -80 125 -410 -116 232 -427 -130 504 -364 -246 544 -10 -314 201 -221
3499 -221 -162 235 -148 -370 262 101 -336 263 184 -439 47 273 -282 84 230 -262 143 335 -260 61 208
3520 208 82 -43 234 58 45 82 15 -68 81 129 39 -7 57 65 -187 4 175 -136 -70 180 -95 -108 291 -42
3544 -42 -94 182 38 -158 307 -59 -112 187 -62 -172 45 84 -254 128 105 -226 -76 -61 -303 -91 127 -218
$$ packed form
3396E50m06p47P47n9n29K91O12p55N4M73l74j26N68j02n81N47K25p80M04M58o49
3417a79R7O50q53K0R20p31k87J003n53n79R25j24p67J034k97p20R01J36j190P83
3437A89N47j236N30N66r92K57P69j072J26R85n90l66Q79o06l30P59j61o30O71
3456B95j40n34M71K84n98K27L79o53o5L57Pj77K68R3m31K27L1k34O1L59k72k56
3478c01M04r0l75M60Q3o41L80K05n35K94L48o59K97O34q68J18P90n54l04N15m22
3499b21N9L97l83k22O32j61m37N99p9o23M86K26n55L66J46m92M05J92n95L21J47
3520B08j26j25K77j76j3L7o7q3J49M8r0m6O4Qk52J91J71l11O6K50k75j3L99l33
3544d2n2K76j44j96M65l66n3K99k49j10K17L9l38L82k3l31J50J5k42K12K18l45
$$ plain form
3566 -218 29 -138 -149 -87 2 -325 81 -2 -39 173 25 -133 -61 40 -389 41 45 -252 66 226 -178 -3 79
3589 79 -169 -149 148 -205 -95 340 -6 -119 460 -48 -95 403 -48 66 208 10 -120 121 37 -28 303 139
3611 139 180 209 44 -102 55 21 -86 139 36 -19 266 88 -26 226 44 118 -19 -102 145 25 -70 128
3633 128 139 -327 144 35 -295 192 227 -256 53 260 -413 -1 166 -345 -184 497 -183 -290 449 -132 -677
3654 -677 363 109 -315 61 93 -399 141 87 -433 40 138 -434 -95 111 -313 -91 102 -135 -35 136 -159
3675 -159 -156 76 -98 -306 111 9 -267 58 86 -110 24 165 79 -242 14 136 -212 108 243 -406 34
3696 34 352 -260 -246 569 -77 -325 542 -9 -407 578 -13 -468 546 351 -331 292 264 -558 150 370 -385
3717 -385 196 572 -363 -54 553 -316 -193 440 -115 -245 472 -132 -324 492 49 -426 290 16 -372 183
$$ packed form
3566b18K47j67j1O2Q9l27M06q3l7K12j48j58P2J01m29M30Mk97L18J60m04J75Q2
3589G9k48K0K97l53J10M35l46j13N79n08m7M98m51J14J42j98j30K41q4o5L31j64
3611A39M1K9j65j46J57l4j07K25j03n5K85j78j14K52j82P4j37q3K47j20r5J98
3633A28J1m66M71j09l30M87L5m83L09K07o73M12J67n11J61O81o80j07P39n81n45
3654f77J040k54m24L76L2m92N40n4n20M73R8n72L39K06m24K22J93k37J00J71k95
3675a59LK32j74k08M17j02k76L25K8j96J34J41q6l21K56J22l48L20J35o49M40
3696C4L18o12J4Q15o46k48Q67n51l98R85n91m55J014j95o82O23k8q22P08K20p55
3717c85N81L76r35L09O07q69J23O33n55j30P17o04j92Q16m43m75P16k74l88N55
$$ plain form
3737 183 163 -395 -137 229 -212 -173 253 -81 -383 170 26 -501 108 235 -403 -293 454 -192 -451 446 -24
3758 -24 -322 460 66 -644 146 204 -595 -22 367 -586 -3 518 -434 52 576 -423 -146 521 -324 -347 802
3779 802 -79 -292 644 108 -541 600 261 -590 617 330 -503 366 445 -548 178 536 -381 10 563 -197
3799 -197 -191 669 -31 -302 384 248 -415 43 373 -344 -124 282 -61 -305 288 104 -341 157 20 -373 263
3820 263 246 -539 93 454 -427 -58 395 -286 -324 647 -263 -542 511 -135 -532 473 -84 -756 520 109
3840 109 -834 326 428 -786 84 493 -641 -125 562 -456 -237 612 -383 -385 628 -278 -423 442 74
3859 74 -560 400 192 -462 193 298 -280 32 529 -320 -120 404 -8 -249 467 71 -383 259 482 -157
3879 -157 23 512 -278 -118 501 -268 -301 725 30 -488 681 174 -734 409 392 -740 238 543 -677
$$ packed form
3737A83k0n58K58L66m41L9M26l34l02N53j44n27O09J27o38J10P47o46k59Q97m70
3758b4k98P82l94p10P90N8p99N73L89r53N83N21r52M86N24r99K77O67q45k3J149
3779H02q81k13R36n36o49J141l39q51J207k87q33Q69P9r93P26L58r17L91N53p60
3799a97OQ60p00k71O86j36o63M58L30p17K20M06l43k44N93j84m45M98j37l93O36
3820B63j7p85O32L61q81L69M53o81l8R71r10k79J053o46l97J005n57o72J276m11
3840A09r43J160J02j214Q70M09j134N16O87j018K19Q49r95kJ013r06j45Q65l68
3859G4o34R60k08o54O55J05n78L12M97q49K00N24m12k41P16l96m54O42K23o39
3879a57J80M89p90J60O19p69l3J026o95n18J169n07r08J143j7j132R78L05j220
$$ plain form
3898 -677 70 654 -613 -125 836 -483 -433 721 -214 -564 677 63 -553 543 77 -792 417 262
3916 262 -687 242 251 -550 113 376 -373 -162 347 -212 -237 333 -179 -440 219 34 -484 113 -58 -405 -69
3937 -69 290 -232 -157 473 -219 -389 446 54 -477 228 227 -604 214 291 -414 -36 418 -474 -265 672 -396
3958 -396 -165 650 -108 -425 481 -59 -467 571 96 -613 336 335 -678 201 321 -482 246 459 -355 24
3978 24 586 -240 -143 543 -260 -154 400 -58 -326 409 33 -424 185 15 -325 56 210 -379 14 397 -264
3999 -264 -226 412 -168 -196 319 -20 -271 141 280 -316 -38 305 -307 -118 431 -318 -341 307 -128 -447 294
4020 294 56 -510 221 161 -392 149 304 -412 -215 371 -368 -162 403 -356 -300 443 -403 -348 399 -118 -286
4041 -286 362 48 -424 272 199 -285 140 131 -293 3 314 -262 -93 351 -218 -45 324 54 -190 287 0
$$ packed form
3898f77P47N84j267M88R61j319N0J154r35l50J241o14o16J096m66q69J209j55
3916B62r49R29Rq01O63K63p49K11N09n59k5N70n12k61O59j85n18N97j71l47L36
3937f9L59n22P5O30o92j70Q35l92n31P05jq31Q18P7p05L78M54q92K09R37j068
3958c96K31Q15p58l17R06n40m08J038m75p09R49jj013Q79J20q03P28K13q14L79
3978B4N62q26R7O86q03J06N54m58k68P35l76m57O09j70l40L81J54n89L93L83o61
3999b64L8O38n80k8N15l39k51M12J39n96K78L43o12J89N49p49k3O48m35l19P41
4020B94k38n66P31o0n53N41J55p16J97N86p39K06N65p59N6P43q46N5P47n17j68
4041b86O48l14m72O96p3m84M25rm24K96L11n76J69M44n69J73L69k70k44M77k87
$$ plain form
4062 0 -222 181 370 -245 21 297 -175 53 321 103 -198 266 -35 -303 321 181 -238 150 395 -165 98
4083 98 235 -189 -112 304 -111 -128 261 16 -162 304 -105 -138 262 23 -254 77 154 -347 37 172 -251 -49
4105 -49 50 -278 -17 -1 -105 -194 -36 -123 -230 184 -223 -233 33 25 -218 91 174 9 -100 55 -165 -62 120
4128 120 -83 -172 190 -17 -156 115 -181 -106 0 223 -22 58 189 75 -155 6 95 -135 149 93 -163 260
4150 260 55 -122 148 172 -178 48 226 -92 30 192 -65 13 90 32 -141 158 -262 -1 243 22 47 96
4172 96 58 -106 91 168 -187 137 57 13 -35 -25 19 13 -46 -139 -8 -89 -160 -107 -42 51 -108 -178 -59 40 -16 -53 63
4199 63 -273 63 -53 -178 -21 -28 -118 -49 -138 -60 -134 32 -74 -119 160 -220 9 105 -104 -151 70 -61 -113 128
4223 128 -148 -67 36 77 37 15 170 -91 163 9 -2 47 78 78 95 -91 17 47 73 -134 151 11 -53 190
$$ packed form
4062@k22M03J89o15K66K76m72K28K68k18l01M64l01k68O24j40m19L88K45n60K63
4083I8J37m24P7M16m15j7L89k45j78M66m09l3M00k39k77L31P7n01L84J35m23K02
4105d9R9l28K61J6j04q9J58q7j07M14m07j0K66qk43L09Q3j65j09J55k20J03J82
4128A20k03q9L62k07j39K71k96P5J06K23k45Q0J31j14k30J61Q9k30K84n6k56M23
4150B60k05j77K70K4l50K26J78l18J22J62k57P8P7n8j73K99m20K61K44k21K5M9
4172I6l8j64J97P7l55L24q0m4m8J0M4on9r3J31q1p1N3O5R3j59p0J19R9n6l7J16
4199F3l36L36j16j25J57pr0O9q9P8p4J66j06m5K79l80K29R6k09m7K21j31n2K41
4223A28k76Q1J03M1m0k2J55k61K54j54j1M9L1%J7j86J08L0K6k07K85j40o4K43
$$ plain form
4247 190 -117 0 229 73 173 229 177 -86 231 48 -63 -51 223 -107 -50 8 -126 -49 232 -34 79 26
4269 26 -32 -90 -1 32 -111 24 -6 -5 -60 -286 -137 -197 -109 -88 22 -110 -201 -101 30 -81 -20 -79 -11 -10 -165 -60
4295 -60 -205 29 -15 -227 -144 63 -102 -204 152 -4 -272 182 17 -391 83 194 -214 84 153 -50 85
4316 85 165 -213 -156 32 -94 -132 163 -49 7 113 -56 -154 161 0 -69 230 -5 42 108 40 186 -83 125
4339 125 13 118 284 31 -104 82 -7 -56 132 -73 -53 95 152 55 27 40 -27 -67 7 19 -91 101 -108 -76
4363 -76 78 48 -292 -205 218 -229 106 -51 -49 -146 147 -70 -137 66 -47 -163 199 -87 -174 114 43 -338 60
4386 60 -158 -310 64 -13 -149 19 56 -258 15 104 -56 -16 172 -74 -149 95 -35 16 148 58 9 18 131 19
4410 19 118 46 -130 10 209 142 -105 166 124 31 160 165 3 141 133 56 116 330 -35 -190 143 61 -116 210
$$ packed form
4247A90l07J17K29j56J00N6n2k63L17j83j11J2K74l30N7N8j34P7K81k66J13n3
4269B6n8n8Q9L3j43J35l0Jn5k26J49o0Q8K1J10j32r1J00J31j11O1n9O8Jj55J05
4295f0j45K34m4k12Q3K07j65j02L56j56k68M54j65m08M74J11m08K98O9k03J35
4316H5Q0l78N7J88j26l8K95k12N6J06j69r8L15j61o9K99k35M7O6o8J46k69K08
4339A25j12J05J66k53j35J86q9m9J88k05K0J48N7r7k8J3o7m0P4J2j10J92k09L2
4363g6J54l0l40Q7M23m47L35j57Kr7K93k17o7K03j13j16L62k86q7K88p1l81L98
4386F0k18j52L74p7j36J68L7l14K73Q9j60M0J88k46p5K44j30N1J32r0m9RJ13j12
4410A9R9p2j76J40J99o7k47K71m2r3J29Nj62J38qp7O0K14l65j55L33q2j77L26
$$ plain form
4434 210 -99 -104 173 8 -220 194 136 -187 215 82 -246 151 228 -251 -49 93 -296 -165 -27 -124 -87 128
4456 128 -73 -109 121 87 -252 82 -1 -87 -197 31 -203 -36 143 -56 -120 126 -247 -307 -29 60 -140 83
4478 83 142 -188 -64 121 -87 -52 46 -34 -179 127 -99 -101 165 23 -165 37 140 -159 44 317 -112 -22 227
4501 227 -150 -14 170 -183 -62 142 -85 -104 176 -79 -100 287 149 -252 39 103 -6 55 220 -44 90
4522 90 201 -55 10 162 -132 -4 117 -49 -87 100 -21 -169 -50 -83 -137 75 68 -35 -173 78 -107 -255
4544 -255 117 -140 -226 140 102 -193 55 109 -66 -232 77 -128 -122 88 -158 -102 63 -41 -250 52 5 -298
4566 -298 64 -146 -145 94 -6 -181 114 3 -210 -10 119 -108 -22 231 -85 -184 132 19 -9 88 18 -196
4588 -196 103 42 -68 58 73 -163 82 173 5 -29 169 67 1 156 -21 -62 179 197 41 133 180 17 161
$$ packed form
4434B10l09nK77j65k28M14n8l23M02j33l28L97P7m79K02J42l89J31J38r7L7K15
4456A28k01l6K30l4l39L34q3q6j10K28k34J67J79j99o4K46l73o0K78Q9k00K23
4478H3N9l30J24J85k08L5R8q0j45L06k26kK66j42j88K02J03k99K03K73m29R0K49
4501B27l77J36J84l53J21K04k27j9K80k55k1L87j38m01K91O4j09O1J65k64J34
4522I0J11k56O5J52k94J28J21j66l8J87j21j48J19l3n4K12pj03j38K51j85j48
4544b55L72k57q6L66l8k95K48N4j75j66L09k05OK10k46N6J65j04k09L02m7l03
4566b98L62k10JK39j00j75K95j11k13K00J29k27Q6K53l16r9L16j13k8R7p0k14
4588a96K99o1j10J26J5k36K45R1j68l4J98j02o6J55j77m1K41J8j56R2M7j63J44
$$ plain form
4611 161 140 27 -36 263 92 -91 190 16 -211 110 74 -121 203 119 -202 -16 50 -243 -46 195 -226 -21
4633 -21 212 -93 -96 10 69 -203 176 -133 -111 -2 -29 -87 -64 88 -173 -161 -26 -30 48 159 -70 -23 100 -61
4657 -61 -51 33 73 -38 -95 97 -136 -113 -55 -190 -83 48 -143 -93 146 -28 -220 244 -9 -139 160 24 -211
4680 -211 101 270 -119 42 197 -106 124 115 -10 -45 204 96 24 42 -17 40 138 110 5 141 80 -79 209
4703 209 124 -38 47 81 28 -33 -7 114 68 -53 -63 -78 -87 -154 86 57 121 12 -58 27 -89 -144 -15 -106 -97 -92 -112 -42
4731 -42 25 -145 -159 -51 38 -199 44 -106 -23 -45 -10 -135 -117 -54 -181 -119 -57 -77 64 -79 8 -112 -10 -38 3
4756 3 4 40 50 -19 211 -62 -157 153 78 -5 159 -44 73 15 150 -60 50 18 12 94 131 67 62 205 67 143 269
4783 269 71 -26 165 -46 140 59 231 -76 53 66 -15 17 86 81 97 32 55 -217 86 -158 -121 -45 183 -76
$$ packed form
4611A61k1j13o3K99j71j83K81j74k27L21l6j95L24q4l21J86O6k93J97K41m21K05
4633b1K33l05lJ06N9k72L79l09K2J09k7n8K3J52k61J2J35mP8J11k29M7J23j61
4657f1J0Q4M0j11n7J92k33K3N8j35J07J31j91N0K39j74j92M64k53j30K99j36k35
4680b11L12J69l89J61J55l03K30rj25l5K49j08p2J8n9N7R8k8j05J36o1j59K88
4703B09q5j62Q5L4n3o1K6J21m6j21j0j5ro7K40k9O4j09p0Q5j16n5J29r1RNk0P0
4731d2O7j70j4J08Q9k37K43j50Q3k2L5j25J8O3j27O2O2k0J41j43Q7j20J02k8M1
4756CJL6J0o9K30k73r5L10p5q3J64k03J17n8J35k10J10l2oQ2L7o4nJ43j38P6J26
4783B69j98r7J91k11J86q1J72l07J29J3q1L2O9nJ6o5K3k72L03k44L7P6K28k59
$$ plain form
4807 -76 -21 14 -113 -41 -23 21 -231 194 -133 -146 -41 -6 74 96 190 40 36 86 -55 -37 -51 -127 12 40 -73 -81 -45
4834 -45 -110 -239 -72 -124 181 15 -148 -71 -33 -16 91 36 -51 86 -67 -4 -21 -12 -15 -13 -180 -60 11 60 -9 28 148
4861 148 97 65 9 22 43 114 -20 -36 194 227 51 69 207 10 -28 112 91 18 -36 -62 95 -179 5 -86 43
4886 43 18 -58 -17 -72 91 99 66 86 -93 -13 -125 -172 32 51 -117 -90 -65 4 56 -60 -46 101 9 -194 13 18 -115
4913 -115 -187 -156 -75 23 7 -66 -112 136 -133 -190 -73 2 -243 51 -122 11 -57 4 41 -116 -93 -60 -76 -22 45 -106
4939 -106 55 -49 50 53 -33 120 177 103 -62 -105 178 54 35 138 23 -126 -52 -2 -6 52 28 60 61 199 -186 -82
4965 -82 113 -57 53 148 -144 -59 -69 20 -78 193 105 -42 29 29 -105 27 6 -11 114 -22 -219 -54 26 -40 -133
4990 -133 -154 -132 -28 -55 -104 -18 -5 -13 -176 -33 9 -82 -158 -99 -181 -233 134 -117 -43 47 -142 -165 -35 -39 -156 -45
$$ packed form
4807g6N5L5j27P2J8M4k52M25l27j3J05L5Q0K2R4j50mN0j41J8j4p6J39K8j13qL6
4834d5o5j29J67n2L05j66j63P7L8J7J07n5q7J37j53O3j7RlKj67J20P1M9o9L7J20
4861A48n1l2n6J3K1P1j34j6K30L3j76J8J38j97l8J40k1p3n4k6J57k74J84r1J29
4886D3k5p6M1n5J63Ql3K0j79Q0j12m7K04J9j68K7K5O9N2j16J4J47r2k03K07Nj33
4913a15p2L1Q1R8j6p3m6K48k69n7J17P5k45K94j73J33o8O1L7j57K3L3j6N4O7j51
4939a06J61j04R9Lq6J53N7p4j65m3K83j24j9J03j15j49P4N0mN8k4L2JJ38l85J04
4965h2J95j70J10R5k92Q5j0Q9r8K71q8j47P1%j34J32k1j7J25j36j97J65Q0o6r3
4990a33k1K2J04k7m9Q6J3qj63J43M2r1p6N9q2n2L67k51P4R0j89k3J30mj17J11
$$ plain form
5016 -45 102 -76 54 279 -170 -9 -23 -217 -180 162 23 -29 203 -69 -110 119 73 -128 233 9 -47 129
5038 129 107 -62 13 144 26 -23 284 144 -43 239 62 0 125 141 -180 153 171 -130 -8 97 -198 -34
5060 -34 226 78 33 114 19 -62 137 -39 -143 100 -12 -195 112 178 -41 -67 45 -101 -49 179 -76 -196 -3
5083 -3 -30 -110 -124 -36 -153 -88 109 -228 146 231 -173 -172 132 -243 -32 170 -93 -121 45 -9 -144 23 107 -245
5107 -245 4 99 -262 53 242 -254 -36 -67 -194 56 79 -96 -192 152 17 -250 109 55 -184 100 165 -121
5129 -121 91 109 -134 89 137 -24 -40 188 -60 3 199 -11 -139 156 5 -41 198 3 -81 4 196 -109
5151 -109 59 200 -102 -102 223 59 -79 88 124 -138 234 110 -118 -51 4 -254 -49 -31 -204 -67 180 -176
$$ packed form
5016d5J47j78J30K25m49J61j4j94L7L42j39n2K32k72m1K29m6k01L61k24n6J76
5038A29k2j69P5J31j18m9L07j40j87K82j77o2J25J6l21L33J8l01J22J05k95J64
5060c4K60j48m5Q1r5q1J99j76j04K43j12j83L07O6k19k6J12j46N2K28k55j20J93
5083ck7q0j4Q8j17O5J97l37L74Q5m04JL04l75K11K02k63k8J66n4j35J67Q4l52
5107b45K49R5l61L15J89m96K18l1j27K50K3j75r6L44j35k67L59n4k39K84O5k86
5129a21K12J8k43K23M8j61j6K28k48O3J96k10j28K95j51m6K39j95q4Q5J92l05
5151a09J68J41l02%L25j64j38J67L6k62L72j24k28O7N5k58K05J8j73J37K47l56
$$ [...]
8191A14
##END NTUPLES=NMR FID
##END=
