##TITLE=1H_CPA2B2506-2
 CDCl3, 8 sc, 
 28.06.2021
##JCAMPDX= 6.0         $$ Bruker NMR JCAMP-DX V2.0
##DATA TYPE= NMR FID
##DATA CLASS= NTUPLES
##ORIGIN= UXNMR, Bruker Analytische Messtechnik GmbH
##OWNER= root
$$ XWIN-NMR		Version 3.5
$$ Mon Jun 28 10:15:52 2021 Russian Standard Time (UT+4h)  she@DPX200
##.OBSERVE FREQUENCY= 200.131506
##.OBSERVE NUCLEUS= ^1H
##.DELAY= (6, 6)
##.ACQUISITION MODE= SIMULTANEOUS
##.ACQUISITION SCHEME= undefined
##.AVERAGES= 8
##.DIGITISER RES= 18
##SPECTROMETER/DATA SYSTEM= spect
##.PULSE SEQUENCE= zg30
##.SOLVENT NAME= CDCl3
##.SHIFT REFERENCE= (INTERNAL, CDCl3, 0, 15.7039)
##AUDIT TRAIL= $$ (NUMBER, WHEN, WHO, WHERE, WHAT)
$$ ##TITLE= Audit trail, XWIN-NMR		Version 3.5
$$ ##JCAMPDX= 5.01
$$ ##ORIGIN= Bruker BioSpin GmbH
$$ ##OWNER= she
$$ F:/spectra/data/she/nmr/H-F/1/audita.txt
$$ ##AUDIT TRAIL=  $$ (NUMBER, WHEN, WHO, WHERE, WHAT)
(   1,<2021-06-28 10:14:01.64 +0400>,<she>,<DPX200>,
      <created by zg, POWCHK disabled, PULCHK disabled
       configuration hash MD5:
       00 E9 B6 7A A2 85 ED C7 34 08 36 98 17 FE 4E 26
       data hash MD5: 16K
       F4 DE BB D7 E2 71 D1 A5 15 CD 81 B8 32 CB 1E 56>)
$$ ##END=
$$ 
$$ hash MD5
$$ 91 0A 99 12 4B 4F F0 CA 8C E2 47 DB 71 A1 69 03
##$RELAX= 
##$RELAX= 
##$RELAX= 
##$RELAX= 
##$RELAX= 
##$RELAX= 
$$ Bruker specific parameters
$$ --------------------------
##$DU= <F:/spectra>
##$EXPNO= 1
##$NAME= <H-F>
##$PROCNO= 1
##$TYPE= <nmr>
##$USER= <she>
##$AMP= (0..31)
100 100 100 100 100 100 100 100 100 100 100 100 100 100 100 100 100 100 
100 100 100 100 100 100 100 100 100 100 100 100 100 100 
##$AQSEQ= 0
##$AQ_mod= 1
##$AUNM= <au_zg>
##$AUTOPOS= <>
##$BF1= 200.13
##$BF2= 200.13
##$BF3= 200.13
##$BF4= 200.13
##$BF5= 200.13
##$BF6= 200.13
##$BF7= 200.13
##$BF8= 200.13
##$BYTORDA= 1
##$CFDGTYP= 0
##$CFRGTYP= 5
##$CHEMSTR= <none>
##$CNST= (0..31)
1 1 145 1 1 1 1 1 1 1 1 1 1 1 1 1 1 1 1 1 1 1 1 1 1 1 1 1 1 1 1 1 
##$CPDPRG= <>
##$CPDPRG1= <>
##$CPDPRG2= <>
##$CPDPRG3= <>
##$CPDPRG4= <mlev>
##$CPDPRG5= <mlev>
##$CPDPRG6= <mlev>
##$CPDPRG7= <mlev>
##$CPDPRG8= <mlev>
##$CPDPRGB= <>
##$CPDPRGT= <>
##$D= (0..31)
0 1.2 0 0 0 0 0 0 0 0.06 0 0.03 0 0 0 0 0.0002 0 0 0 0 0 0 0 0 0 0 0 0 
0 0 0 
##$DATE= 1624860841
##$DBL= (0..7)
120 120 120 120 120 120 120 120 
##$DBP= (0..7)
150 150 150 150 150 150 150 150 
##$DBP07= 0
##$DBPNAM0= <>
##$DBPNAM1= <>
##$DBPNAM2= <>
##$DBPNAM3= <>
##$DBPNAM4= <>
##$DBPNAM5= <>
##$DBPNAM6= <>
##$DBPNAM7= <>
##$DBPOAL= (0..7)
0.5 0.5 0.5 0.5 0.5 0.5 0.5 0.5 
##$DBPOFFS= (0..7)
0 0 0 0 0 0 0 0 
##$DE= 6
##$DECBNUC= <off>
##$DECIM= 32
##$DECNUC= <off>
##$DECSTAT= 4
##$DIGMOD= 1
##$DIGTYP= 9
##$DL= (0..7)
0 120 120 120 120 120 120 120 
##$DP= (0..7)
150 150 150 150 150 150 150 150 
##$DP07= 0
##$DPNAME0= <>
##$DPNAME1= <>
##$DPNAME2= <>
##$DPNAME3= <>
##$DPNAME4= <>
##$DPNAME5= <>
##$DPNAME6= <>
##$DPNAME7= <>
##$DPOAL= (0..7)
0.5 0.5 0.5 0.5 0.5 0.5 0.5 0.5 
##$DPOFFS= (0..7)
0 0 0 0 0 0 0 0 
##$DQDMODE= 0
##$DR= 18
##$DS= 0
##$DSLIST= <SSSSSSSSSSSSSSS>
$$ [...]
##$SUBNAM2= <"">
##$SUBNAM3= <"">
##$SUBNAM4= <"">
##$SUBNAM5= <"">
##$SUBNAM6= <"">
##$SUBNAM7= <"">
##$SUBNAM8= <"">
##$SUBNAM9= <"">
##$SW= 20.0188882624521
##$SWIBOX= (0..15)
0 0 2 0 0 0 0 0 0 0 0 0 0 0 0 0 
##$SW_h= 4006.41025641026
##$TD= 16384
##$TD0= 1
##$TE= 0
##$TE2= 300
##$TE3= 300
##$TEG= 300
##$TL= (0..7)
0 120 120 120 120 120 120 120 
##$TP= (0..7)
150 150 150 150 150 150 150 150 
##$TP07= 0
##$TPNAME0= <>
##$TPNAME1= <>
##$TPNAME2= <>
##$TPNAME3= <>
##$TPNAME4= <>
##$TPNAME5= <>
##$TPNAME6= <>
##$TPNAME7= <>
##$TPOAL= (0..7)
0.5 0.5 0.5 0.5 0.5 0.5 0.5 0.5 
##$TPOFFS= (0..7)
0 0 0 0 0 0 0 0 
##$TUNHIN= 0
##$TUNHOUT= 0
##$TUNXOUT= 0
##$USERA1= <user>
##$USERA2= <user>
##$USERA3= <user>
##$USERA4= <user>
##$USERA5= <user>
##$V9= 5
##$VALIST= <valist>
##$VCLIST= <CCCCCCCCCCCCCCC>
##$VD= 0
##$VDLIST= <DDDDDDDDDDDDDDD>
##$VPLIST= <PPPPPPPPPPPPPPP>
##$VTLIST= <TTTTTTTTTTTTTTT>
##$WBST= 1024
##$WBSW= 4
##$XGAIN= (0..3)
0 0 0 0 
##$XL= 0
##$YL= 0
##$YMAX_a= 894553
##$YMIN_a= -722764
##$ZGOPTNS= <>
##$ZL1= 120
##$ZL2= 120
##$ZL3= 120
##$ZL4= 120
##$ABSF1= 10
##$ABSF2= 0
##$ABSG= 5
##$ABSL= 3
##$ALPHA= 0
##$AQORDER= 0
##$ASSFAC= 0
##$ASSFACI= 0
##$ASSFACX= 0
##$ASSWID= 0
##$AUNMP= <proc_1d>
##$AZFE= 0.1
##$AZFW= 0.1
##$BCFW= 1
##$BC_mod= 2
##$BYTORDP= 1
##$COROFFS= 0
##$CY= 11.3945322036743
##$DATMOD= 1
##$DC= 2
##$DFILT= <>
##$DTYPP= 0
##$F1P= 15.9154993809931
##$F2P= -4.1035820241983
##$FCOR= 0.5
##$FTSIZE= 0
##$FT_mod= 4
##$GAMMA= 1
##$GB= 0.15
##$INTBC= 1
##$INTSCL= 1
##$ISEN= 128
##$LB= 0.24
##$LEV0= 0
##$LPBIN= 0
##$MAXI= 10000
##$MC2= 0
##$MEAN= 0
##$ME_mod= 0
##$MI= 1.114404
##$NCOEF= 0
##$NC_proc= 0
##$NLEV= 6
##$NOISF1= 3.799351
##$NOISF2= 2.8
##$NSP= 1
##$NTH_PI= 0
##$NZP= 0
##$OFFSET= 15.70392
##$PC= 1
##$PHC0= -11567.65
##$PHC1= 8.601009
##$PH_mod= 1
##$PKNL= yes
##$PPARMOD= 0
##$PSCAL= 0
##$PSIGN= 0
##$REVERSE= no
##$SF= 200.130013532006
##$SI= 16384
##$SIGF1= 3
##$SIGF2= 2
##$SINO= 400
##$SIOLD= 16384
##$SREGLST= <1H.CDCl3>
##$SSB= 0
##$STSI= 0
##$STSR= 0
##$SW_p= 3612.71676300578
##$SYMM= 0
##$S_DEV= 0
##$TDeff= 0
##$TDoff= 0
##$TI= <>
##$TILT= no
##$TM1= 0
##$TM2= 0
##$TOPLEV= 0
##$USERP1= <user>
##$USERP2= <user>
##$USERP3= <user>
##$USERP4= <user>
##$USERP5= <user>
##$WDW= 1
##$XDIM= 8192
##$YMAX_p= 0
##$YMIN_p= 0
$$ End of Bruker specific parameters
$$ ---------------------------------
##NTUPLES= NMR FID
##VAR_NAME=  TIME,          FID/REAL,        FID/IMAG
##SYMBOL=    X,             R,               I
##VAR_TYPE=  INDEPENDENT,   DEPENDENT,       DEPENDENT
##VAR_FORM=  AFFN,          ASDF,            ASDF
##VAR_DIM=   8192,          8192,            8192
##UNITS=     SECONDS,       ARBITRARY UNITS, ARBITRARY UNITS
##FACTOR=    0.0002496,     1,               1
##FIRST=     0,             0,               0
##LAST=      2.0444736,     0,               0
##MIN=       0,             -722764,         0
##MAX=       2.0444736,     894553,          0
$$ Real data points
##PAGE= N=1
##DATA TABLE= (X++(R..R)), XYDATA
$$ [...]
2418I11k475R4J930j750m74J725j382j83K013j414q25K226p83j795J489Q82k128
$$ 911 -1564 -1470 460 -1290 -1764 -39 -1421 -1604 409 -1005 -1830 396 -387 -2182 -693 189 -1939
2435a939P39J483j484n1J616j264n43J835q05j575K477n3k238K063R41k308J181
$$ -1939 -1200 283 -1201 -1252 364 -900 -1443 392 -413 -1988 489 436 -1802 261 1202 -1106 75
2452G5J492k582P44K150k875J91L240k635r66L793j542k639L583o38k546K910
$$ 75 1567 -1015 -271 1879 -996 -805 2435 -200 -1166 2627 1085 -1554 2029 1391 -1155 1755
2468A755K01l085K767Q12l446K149J710l758J039K737l382j62L178k110j044K935
$$ 1755 1956 -1129 1638 2450 -996 1153 2863 -895 144 2881 -501 -663 2515 405 -639 2296
2484B296j440j566K628p66k448K548K82k822J396J277k244L95J906k161k96K190
$$ 2296 856 -710 1918 1152 -1296 1252 1534 -1288 108 1385 -859 -464 1442 -719 -1015 1175
2500A175j712j220K559p40k266K897j25k781K162R26l075J217K000l361O87K526
$$ 1175 -537 -1757 802 62 -2204 693 568 -2213 -51 875 -2200 -983 1017 -2344 -1657 869
2516H69k915n5L497k502j310L510j800k279L736r83k667L395J53l284K814Q74
$$ 869 -2046 -2101 1396 -1106 -2416 1094 -706 -2985 751 -232 -2899 496 649 -2635 179 1053
2532A053l815K593J465l567J508K285l369Q93K975k724RK739k302j013K814j161
$$ 1053 -2762 -169 1296 -2271 -763 1522 -1847 -954 2021 -703 -694 2045 -257 -1270 1544 383
2548C83j463K791m68k104K048L37k342J642J450k528L42J738j740m73K647j097
$$ 383 -1080 1711 1243 -861 1187 1524 -818 824 2274 -254 88 1826 86 -387 2260 1163
2564A163j471K466n11k629K169R33l185J881J819l546P28K698l228J47L530l416
$$ 1163 -308 2158 1647 -982 1187 2120 -1065 816 2635 -911 -183 2515 -713 -566 2964 -452
2580d52r80M136k828k158M787j692l153M193q23l979L596L90l771L145R70m453
$$ -452 -1432 2704 -124 -2282 2505 813 -2340 1853 1030 -2949 647 1037 -2734 411 1381 -3072
2596c072K944J472m411K266K878m330P06L275l776k14L566k726n24L386k236k090
$$ -3072 -128 1344 -3067 -801 2077 -2253 -1547 1728 -2048 -2262 1304 -1422 -1946 1440 -796 -2886
2612b886L264n55k426K629M78k221R11J167j566M04J798j475r53K513j137k246
$$ -2886 378 -177 -2603 26 504 -1717 -806 361 -1205 -801 997 -478 -1431 1082 -55 -2301
2628b301K685R18l058J890K125l704O86K868k905J27L581l256r90M373k864k125
$$ -2301 384 1302 -1756 134 2259 -1445 -759 2109 -796 -669 2912 -344 -1334 3039 175 -1950
2644a950N071j747l133M446j314l708M699l83m401M848M63n690M020K274n689
$$ -1950 3121 1374 -1759 2687 1373 -2335 2364 1981 -2420 2428 2891 -2799 1221 3495 -2194
2659b194K661L218n068J432K966m343Q94L875m356l52M649l876j760M316j528
$$ -2194 467 3685 -1383 49 3015 -1328 -434 3441 -915 -1267 3382 -494 -2254 2062 534
2674E34k554L312k07k777K136N15k707J536J607k470m72K272j031j965K362N35
$$ 534 -2020 1292 1085 -1692 444 959 -1748 -212 1395 -1075 -1547 725 -306 -2271 91 626
2690F26k514J236J230k620R48K185l064L14L548l400j257M658k517k665M889j341
$$ 626 -1888 -652 578 -2042 -1094 1091 -1973 -1659 1889 -1511 -2768 1890 -627 -3292 1597 256
2706B56l732M700r87l732M683j07m722M576J040n515L633K237n127K596K836m929
$$ 256 -3476 1224 237 -3495 1188 1081 -3641 935 1975 -3540 93 2330 -2797 -201 2635 -2294
2722b294J908L336m872R70M318m411o20M718l163j276L730j833j526L179j120
$$ -2294 -386 2950 -1922 -952 3366 -1045 -1665 3053 -110 -1386 2344 511 -1015 2164 1044
2737A044j912K585l45j954J470Q86j676K23J039n53o91Q57J91j129N93P74j687
$$ 1044 -868 1717 1372 -582 888 1774 98 321 1360 807 116 973 1164 35 628 1402 -285
2754b85K54J803j930m50K514j775j217K683j143j862K773j006k080L209j057k841
$$ -285 -31 1772 -158 -608 1906 131 -1086 1597 454 -1408 1365 359 -1721 1488 431 -2410
2770b410L543n54l308L608j06l601L230O97m154L189J174m408K773K010m652J766
$$ -2410 1133 579 -2729 879 773 -2828 402 1099 -3055 134 1308 -3100 -327 1683 -2969 -1203
2786a203K890m266J035L363l822k1L778l386n17L525k201j441L387j424j648K571
$$ -1203 1687 -2579 -1544 1819 -2003 -2024 1754 -1632 -2149 1376 -825 -2266 1121 -303 -1951 620
2802F20o04j535J711K60j427P32O03n09p7M70N7o49M20P37r21m5J412j166l74
$$ 620 16 -1519 192 452 -975 -243 360 -149 -226 244 301 -348 72 809 -112 -157 1255 89 -285
2821b85J774j100q97K249j205j307K685j093j980L148q48k579L107K2l205L122
$$ -285 1489 389 -508 1741 536 -771 1914 821 -1159 1989 1141 -1438 1669 1691 -1514 1608
2837A608L83l635K709J414m070K233K131m320J601K814m052M43L379l311m31L169
$$ 1608 1991 -1644 1065 2479 -1591 642 2773 -1547 54 2868 -1184 -741 2638 -673 -1104 2065
2853B065k539q76L149j980j267K722j303j442K097n80j159J255l84o85P10l81
$$ 2065 -474 -1350 1799 -181 -1448 1274 -29 -1471 626 46 -1113 142 -242 -927 -217 -598
2869e98j78O20m11p3K94o34N59j27o27Q68J50j127P57M30j084P01M13j126P86
$$ -598 -776 -156 -567 -640 -346 -980 -421 -548 -1175 -307 -157 -1284 -527 -97 -1181 -480 -67 -1193 -407
2888d07N79j573J253M73j544J035Q19j669Q05Q62j624J114Q69k049J031J507k159
$$ -407 172 -1401 -148 325 -1219 -184 635 -1034 -229 633 -991 123 992 -1057 -26 1481 -678
2905f78N69J655j931L40J546j716J56J800j773l5J892j553n16J700q81m24J069
$$ -678 -109 1546 -385 -45 1501 -215 -59 1741 -32 -67 1825 272 -244 1456 575 151 1220
2922A220q16k14R59q40l90J389q04l69Q56o07j55N99q72L09P55j259J12J209j051
$$ 1220 404 190 1149 309 -81 1308 504 135 991 384 229 828 -44 265 1020 -239 -127 1082 31
2941C1l64R84p92k8O70r16j20J188r42o25J358m83r23R90m64l73Q22p46j02Q14
$$ 31 -333 651 -141 -169 501 -415 -535 653 -289 -914 444 -39 -962 28 -436 -809 13 -733 -835 -21
2961b1l94o84R54l23o40O47m7k27L06k63r3O35l24m40N74N3j97M8q0K75J08n00
$$ -21 -415 -1099 -145 -468 -1108 -461 -508 -735 -429 -692 -785 -150 -474 -914 -340 -287 -484 -436 -516 -241 -133 -633
2983f33L32N97q39J60N07n32M44K83p09N40O59j287M91J124j525K09J505j291
$$ -633 -301 296 -543 -383 124 -408 36 319 -390 150 809 -478 13 1137 -388 -179 1326 35
3001C5j30J458j493J2J751j520n39K054q75j278K052p14j224J590k50j518J634
$$ 35 -95 1363 -130 -118 1633 113 -426 1628 753 -525 1527 813 -411 1179 929 -589 1045
3018A045J97j793J395M52j817P50J070j599N5J260r62l05J185o71o22J050m47
$$ 1045 1242 -551 844 1296 -521 229 1299 -300 -245 1015 53 -252 933 262 -360 690 243
3035B43p81Q40L4j117N88O90j187N9J033r08m24J177o84p96J477l36j328J422
$$ 243 -538 302 336 -781 -193 497 -690 -631 402 -506 -930 247 -437 -1233 244 -92 -1420 2
3053BK59j770J348N92k053J052J160k063M80J933k244J38K312k101o12K796j862
$$ 2 261 -1509 -161 431 -1622 -570 590 -1473 -993 940 -1304 -1166 1146 -955 -1567 1229 -633
3070f33j129K888j121j839K922n38k227K341L67k606J774J094k661J327J636k547
$$ -633 -1762 1126 5 -1834 1088 550 -1677 664 1031 -1575 199 1293 -1368 -41 1595 -952
3086i52N30K036j800l87K115j023j193J933m56j278J586J27j963J400Q58k005
$$ -952 -422 1614 -186 -573 1542 519 -674 1259 803 -475 1111 1238 -725 675 1533 -472
3102d72O24J492j562k29J688j287o95J842p39j495K072k32k162K197L16k732J802
$$ -472 152 1644 82 -147 1541 254 -441 1401 662 -833 1239 1007 -1155 1042 1358 -1374 428
3119D28J141k891J070J986k820M42K350k599k24K995k595j060L306j651k086L342
$$ 428 1569 -1322 -252 1734 -1086 -644 1706 -893 -1117 1878 -717 -1777 1529 -122 -2208 1134
3135A134r89k323K820l24k313K373kk394K074R64l052J286J683k331L29J855j849
$$ 1134 145 -2178 642 318 -1995 378 376 -2018 56 1020 -2032 -746 937 -1394 -1065 790 -1059
3152a059q4J803j436m60J731q94j272K115r4j824J417O41j534N22J542k060K61
$$ -1059 -1143 660 -776 -1236 495 -399 -1671 444 350 -1474 -57 584 -950 -428 1114 -946 -685
3169f85K008j823o77K833j461j801L077k72l140K810R69l290K009J635l542J637
$$ -685 1323 -500 -1177 1656 195 -1606 1471 1199 -1941 869 1838 -1452 557 2192 -1350 287
3185B87K468m015P79L537l521q54M300k867j716M103j853k174L694j229k740L497
$$ 287 2755 -1260 -481 3056 -465 -1319 2981 114 -1602 2501 648 -1526 2168 939 -1801 1696
3201A696j91l419K864J070l505J881J273k801J076J727k556M85K137k464n64K766
$$ 1696 1505 -1914 950 2020 -1485 396 1669 -1132 -56 1671 -885 -400 1737 -727 -1291 1475
3217A475j636j526K361Rk167J585N19k080J050J221j994k6K358j923j213K955
$$ 1475 -161 -1687 674 683 -1484 101 620 -1460 -410 811 -1183 -1209 1149 -774 -1987 968
3233I68r24k258K636L68l282K496J070l404K099J829l772J278K826l698L13L449
$$ 968 44 -2214 422 790 -2492 4 1074 -2330 -231 1598 -2174 -896 1930 -1768 -1455 1994
3249A994k903r57L481k156j371L319j690j597L639j561k178L514p62k692L101
$$ 1994 -909 -1866 1615 -541 -1912 1407 -283 -1880 1759 198 -1980 1534 772 -1920 1181
3264A181J9k675K274O52k829J953J139k668R42J835k338J3K283j628p97K291q03
$$ 1181 1200 -1475 799 1451 -1378 575 1714 -954 -12 1823 -515 -502 1781 153 -644 1647 844
3281H44j425J521j00j434J118R44j816K76J579j407p64J960p60j515K051j55k103
$$ 844 -581 940 840 -594 524 1468 -348 -72 1507 100 -664 1296 536 -979 1072 917 -1186
3298a186J750O44k405J557J348l096J073K000l032O13K407k816N0K754k704o44
$$ -1186 564 1208 -1197 360 1708 -1388 -315 1685 -1347 -734 1673 -1143 -1093 1661 -1043 -1687
3314a687L406k342j394L552j734j918L370j332k439L625n45l100K929O13l342
$$ -1687 1719 -623 -2017 1535 -199 -2117 1253 -79 -2518 1107 562 -2538 391 1004 -2338
3329b338K131J349l160J378J844k617M30J880j746k44J859j037r84J655l9j374
$$ -2338 -207 1142 -2018 -640 1204 -1413 -983 897 -849 -1093 766 -271 -1255 400 361 -1013
3345a013Q75O39j274M62J040r32n45J459l51j371J731Q4j724J298Q56j914Q22
$$ -1013 -138 501 -773 -311 729 -203 -748 711 360 -1011 720 804 -920 378 1234 -680 142
3362A42J347k117P88J663k366K72K082k082j65K476k072q52L078k102j307L240
$$ 142 1489 -628 160 1823 -543 -271 1811 -271 -436 2040 -32 -884 2194 92 -1215 2025
3378B025j394j956L138p37k534K885l16k568K427L20k865J976J037k858J432J642
$$ 2025 631 -1325 1813 1076 -1458 1427 1111 -1457 970 1290 -1575 401 1438 -1420 12 1654
3394A654k693M51J896k100k31J948j151n89J461p78p46J005j79p58K96O89o98
$$ 1654 -1039 -588 1308 -792 -1023 925 -226 -815 646 -132 -878 127 -52 -810 -514 175 -523
3411e23m00Q57l89m50P16Op26Q13J63j275Q48Q90j697L52J472j523r1J735j588
$$ -523 -923 -66 -455 -905 -189 -183 -909 -96 67 -1208 -360 530 -1167 -815 657 -866 -957 778 -810
3430h10k65K000j624o90K391j466q08K586j039j596K462n57j996K263k3k395K240
$$ -810 -1075 925 -699 -1389 1002 -464 -1272 1314 275 -1321 1141 584 -1412 851 828 -1567 673
3447F73O97k915J993J165k598J022J527j972P8J692j339j74J512j024n74J488
$$ 673 1370 -1545 448 1613 -985 37 1564 -408 -330 1362 23 -151 1361 337 -237 1251
3463A251p73q70J312k74q29M80M08n02q4L21k08J9L11j34o48N61M59j031J6R07
$$ 1251 478 -392 920 646 -183 297 705 203 119 440 232 251 562 428 -220 341 800 -231 -215 692
3483F92q11l37R92n90n84R40n38n41J375q15j011J602l33j194J352j54j166J063
$$ 692 -119 -456 536 -54 -638 302 -236 -777 598 -217 -1228 374 41 -1153 199 45 -1121 -58
3501e8r2j060Q85M45j363J057O06j618Q25P92j307M30O96j107L50Q29j094L22
$$ -58 -150 -1210 -325 120 -1243 -186 420 -1198 -373 419 -888 -458 238 -869 -519 310 -784 -462
3519d62R69j100l9Q08l52l44N98k40k09N47l12k8M61k15k43O14l97O6J75k55L23
$$ -462 507 -593 -632 176 -176 -520 78 -162 -371 176 -136 -164 297 82 -161 453 56 122 297 42 365
3540C65K47m98K90J11n44K50K27l56K01L38m59L68j5l84L33J08m70L19J40n78
$$ 365 612 114 404 515 -29 221 448 92 293 631 172 540 525 141 474 582 112 431 571 -7
3560gM56K08o48M89J18q08L36N60q26K64L18o91J92O37o88P8L92p26K07J35l12
$$ -7 449 657 9 498 616 -192 144 704 -122 142 460 -231 -39 598 -90 -12 380 -346 -139 -4 -316
3581c16n1L60n14L51P5m45L11J17o04N27K3n42L97K48o68M83M97j043M54L83p41
$$ -316 -367 -7 -521 -170 -95 -540 -229 -112 -716 -189 -166 -708 -311 -63 -731 -248 249 -794 -340 43 -698
3602f98L00L66p04L66N48r20K21P98p02j70Q88o68j15Q68p29J94M91m65j25P84
$$ -698 -398 -32 -736 -370 178 -742 -521 277 -425 -595 293 -375 -490 378 -351 -157 334 -131 -256 528
3622E28m80l83N01L1m26M42k7k42M39L28n01q1O18k76o04N02K93p56K82N99m82
$$ 528 48 -335 166 197 -229 213 186 -56 383 711 210 129 747 471 -133 369 662 -94 188 787 305
3643C05k31O97m46l86J104o85p06J356k71j136J132J05j481J134L31j506Q49O23
$$ 305 74 771 325 -61 1043 358 -348 1008 737 -399 733 838 -643 491 822 -684 165 788
3661G88j417O15Q56j565L99J151j322Q7Q98j062J70R94j359J71J366j324n92J918
$$ 788 -629 -14 842 -723 -324 827 -495 -408 490 -572 -402 592 -767 -596 770 -554 -1146 772
3679G72j063j106J428m9j258J042K52r43Q00M16j111L99P62j015k2R41m11r91
$$ 772 -291 -1397 31 -18 -1276 -234 18 -925 -125 291 -820 -421 341 -674 -696 245 -166 -1157
3697a157J133K21j145P51N24j319P85J054j560M2J771j381p38K038o37j466J979
$$ -1157 -24 197 -948 -197 327 -992 -207 847 -713 -671 1100 -281 -1019 1019 382 -1084 895
3714H95m10j319J706m39j445J756N0k002K079N69k386J189J390k426R25J627k372
$$ 895 485 -834 872 433 -1012 744 794 -1208 871 1440 -946 243 1633 -793 132 1759 -613
3731f13M94K246k473k57K611k020r89K528j083j550K224m63j471J617J70j906
$$ -613 -119 2127 -346 -603 2008 -12 -1001 1527 444 -1106 1118 655 -816 801 971 -935
3747i35J180J023k151N46J648j666m26J722p77r75J287j09j223J045J35j660J010
$$ -935 245 1268 -883 -337 1311 -355 -781 941 164 -811 476 367 -856 189 324 -1336 -326
3764c26J056j815L95J643j739l52K039j335r53K340j435j259K535r37k003L024
$$ -326 730 -1085 -690 953 -786 -1138 901 -434 -1387 953 -482 -1741 794 -143 -2146 878
3780H78l81k712K519O77l031K034J268l368J746K119l432R61K754l222k60L336
$$ 878 497 -2215 304 981 -2050 -16 1252 -2116 -370 1749 -1683 -722 2032 -1190 -1450 1886
3796A886k504j019L372j734j811L200p72k323K794j01k444K054Q44k467J323J134
$$ 1886 -618 -1637 1735 1 -1810 1390 618 -1705 1089 988 -1456 598 1442 -1025 298 1432
3812A432k002M74J755j893k57J889j218j070J916l35j642J850M63k059J012J328
$$ 1432 -570 -96 1659 -234 -491 1398 180 -890 1026 691 -951 899 1362 -697 315 1643
3828A643k111J46K134k324k53K566j790j093K822j453k005L040m23k788K706M63
$$ 1643 -468 -322 1812 -512 -765 1801 11 -1082 1740 287 -1718 1322 899 -1889 817 1280
3844A280l221K298J510l690J668K141l740J003K827l275j28L120k838p57L534
$$ 1280 -1941 357 1867 -1823 -155 1986 -1754 -751 2076 -1199 -1327 1793 -1045 -1802 1732
3859A732k027j720L306j519j813K861m38k467K520J10k486J967P37k369R76J680
$$ 1732 -295 -2015 1291 -228 -2041 820 382 -2085 435 545 -1941 26 763 -1606 -630 1050
3875A050k274M39J792j843k86K083j291q62J970l67j762J763L22j796Q50J430
$$ 1050 -1224 -785 1007 -836 -1122 961 -330 -1192 778 411 -1351 412 734 -1062 -212 1218
3891A218j991N04J756j913j45K057j650q66K447j140j566K679k65k368K396L22
$$ 1218 -773 -269 1487 -426 -571 1486 -164 -1030 1417 277 -1289 1390 1125 -1243 1153 1475
3907A475k762K070R08l029J628J739l091Q89K321k896J36K577k364m51K900k359
$$ 1475 -1287 783 1691 -1338 290 2029 -1062 -173 2148 -748 -612 1965 -399 -850 2050 -309
3923c09r77L430j849k025L393o60k666K569M11l076K000J092k959J427J660k771
$$ -309 -1286 2144 295 -1730 1663 1003 -1663 906 1317 -1759 241 1333 -1626 -199 1461 -1310
3939a310M30K493k380n41K547j301j592K587o47k050K099M89k497J379J448k718
$$ -1310 -880 1613 -767 -1308 1239 -62 -1654 933 286 -1764 335 824 -1673 -294 1154 -1564
3955a564L70K429k106p66K891j582j295K650o94k178K528j32k462K468O25l069
$$ -1564 -1194 1235 -871 -1637 1254 -328 -1623 1027 333 -1845 683 551 -1911 557 1182 -1887
3971a887J930J193k839R96K220k742K51K487k303m33K887j895j209L066j216j927
$$ -1887 43 1236 -1603 -607 1613 -1129 -878 1609 -694 -1127 1760 -135 -1344 1722 506 -1421
3987a421K504k70k084K151M3j978J608Q95k416J107J540k180K78J855j712m74
$$ -1421 1083 813 -1271 880 923 -1055 553 1448 -968 139 1679 -501 -223 1632 -80 -554
4003e54J929r57q72J524m82j211J409J53j758R85R17j645K80J314j261j20J327
$$ -554 1375 418 -454 1070 588 -623 786 939 -819 166 1083 -562 -282 1032 -229 -349 978
4020I78r53p11J450p74r88J620k14j453J462K24j902J356L91j723R91P98j709
$$ 978 25 -686 764 -10 -998 622 408 -1045 417 641 -1261 95 486 -1237 -246 552 -1157
4037a157P12J322j979L58J637j781o7J941j690m88J922j046j042K014o05j551
$$ -1157 -445 877 -1102 -744 893 -888 -955 986 -704 -1192 730 -316 -1358 656 51 -1500
4053a500J998k58j716J503M11j729J068R11j500N54J034j445J89J245r47o54J517
$$ -1500 498 240 -1476 27 438 -1291 -223 688 -812 -258 776 -669 -480 765 -182 -836 681
4070F81m69r25J086J26j002O08O58j037M02P42j042N6J102p95o71J526n37r67
$$ 681 212 -713 373 499 -503 105 763 -274 128 870 -172 -116 986 191 -480 1046 509 -458
4088d58J286j21j128P89M72j322R51O24j370O00O52j440N77J108j725L05J337
$$ -458 828 707 -421 368 840 -482 469 1093 -277 323 975 -465 112 1220 -505 -200 1137
4105A137j345l35J570j001o09J430p53j036J642m89j056J290P6j343Q57M25j256
$$ 1137 -208 -543 1027 26 -583 847 94 -942 700 211 -845 445 521 -822 35 460 -796
4122g96N41P04j254M25O93r13j09J068p40l65P37j80l67K2M82m74k9M50r2j34
$$ -796 -255 449 -805 -380 313 -600 -709 359 -381 -746 -9 -189 -556 -534 -52 -526 -555 -105 -197 -331
4142c31J13M2j09J24r1j62M90j81l35K65K99n31L57K06n46K19L60m60J22O02p07
$$ -331 -218 -176 -285 -161 -252 -414 76 -105 -440 -175 124 -407 -50 156 -390 -171 189 -271 -149 453 -254
4163b54J80P44o60k52Q33o45l8P82o73j02Q81m37p26J188k25q06N79K03m46J44
$$ -254 -74 670 10 -242 591 -54 -92 690 17 -85 796 359 -367 821 596 -210 369 572 126 270
4183B70J34l39L25qm15N99p3n62K85p9j05L00o8l20N55l50l30L90j3k95J86p2
$$ 270 404 65 390 382 -33 566 493 -69 216 137 32 332 264 -56 499 149 -181 209 196 -99 87 15
4205A5l11M16j73l61N38k21m37N16j35j38j9lJ6K68l65j66N73k28m28O23r3o00
$$ 15 -296 120 -53 -414 124 -97 -534 -18 -153 -291 -310 -313 -297 -29 -394 -560 13 -215 -643 -20 -113 -713
4227g13L58j9m8K38k7k61K15J72r0L2n1O2j7k46L30K56o17Q4O69n37L4N01n18
$$ -713 -355 -374 -422 -184 -211 -472 -257 -85 -175 -143 -194 -132 -149 -395 -65 191 -426 -342 327 -210 -176 325 -193
4250a93K9P32p35O1Q20o57l13J095m41o61R44k28o44P10r0n94P44r1p12P55J77
$$ -193 -164 568 -167 -106 714 57 -256 839 398 -263 681 453 -191 519 429 -165 579 488 -224 531 708
4271G08p48M93K78p91M94M6n50N04Np50M87M02p57M3N05l30N7K13l45OL81m20
$$ 708 -40 453 731 -60 434 480 -70 434 439 -311 176 578 -179 -136 369 39 96 309 -36 -30 351 -69
4293f9r6K11K29m91k6N03m31k32M17m0n31L27K86p83M80N03j060L59P95j146J30
$$ -69 -165 46 275 -216 -242 261 -170 -402 15 -25 -556 -229 57 -726 -246 257 -803 -444 351 -795 -665
4314f65J156r85l59J111n46n82J063k05r80J419m95q93R26L7q55R61Rq94Q32K62
$$ -665 491 -494 -853 258 -288 -870 193 -12 -992 427 -68 -961 -35 2 -853 108 117 -777 55 317
4334C17j077P52N09j202O45P23j144L13R76r33K0Q29p54k80R09j75p88Q94Rp68
$$ 317 -760 -8 501 -701 -56 667 -477 -164 812 -121 -101 728 -26 -306 603 428 -360 534 543 -225
4354b25M90M47o69n5O14l83j70N64j32p02O84L01j167P12N93j296K53J056j183
$$ -225 265 712 43 -12 602 219 49 613 481 -221 463 764 -403 309 902 -394 -141 915 -268
4373b68L6J138j244r3J304p35q65J287m19p39J164k62j256J378l04j156J378K1
$$ -268 -232 906 -338 -431 873 138 -727 560 141 -598 566 304 -952 426 122 -1034 344 365
4391C65j301Q80N29j517Q94M80j295M76R07j197J39R23j005PJ225j022k89J136
$$ 365 -936 -56 473 -1044 -150 330 -965 -489 418 -779 -640 283 -722 -715 510 -512 -801 335
4409C35m88p95Q08Mn99O33K63q13M92M27p10m1R37o01n06R96j82n51M96J97q65
$$ 335 -153 -948 -140 -136 -735 -102 161 -652 -160 267 -443 -484 453 -148 -654 342 160 -391 105 302 -563
4430e63Q69L87j191N86Q26j352Q1J376j087l15J408q15n57J249n34j014J855o88
$$ -563 306 693 -498 88 914 -438 -357 1019 -68 -383 1025 210 -347 902 368 -646 1209 521
4448E21j262J680j45j417J133N44j616R44P07j740R65R08j727K38J705j596n03
$$ 521 -741 939 794 -623 510 1054 -562 382 1089 -651 314 1222 -505 -267 1438 -158 -661
4465f61J720j022n94J215o48p99J292j42j221J187J86j294O25P54j181Q0J018
$$ -661 1059 37 -557 658 10 -789 503 361 -860 327 513 -781 -156 598 -583 -503 515
4482E15r38l23R81n13p24J384m02j055J050K40j217P45P35j332L44R99j279nJ299
$$ 515 -423 -746 235 -278 -1002 382 -20 -1075 -25 215 -1002 -257 478 -854 -510 489 -790 -795 504
4501E04r22m65J501q87r81J766k27j568J746p2j474J232N83j488Q02P91j921R33
$$ 504 -418 -883 618 -269 -1250 516 289 -1279 467 395 -1079 153 736 -752 50 841 -1080 -147
4519a47J262j679J02J444j280l08J611j063l91J410o95q81J403k28j193J288K29
$$ -147 1115 -564 -462 982 -298 -606 1005 -58 -449 961 266 -615 788 560 -633 655 884
4536H84j412P65P75j304M31Q30j069R3J059r85m44J231m47r64J072m1j047R90
$$ 884 -528 237 1012 -292 139 969 -100 -7 1052 67 -377 854 407 -557 515 474 -573 417
4554D17J90j287P40N53j235L85J158j385r0J439j163n12J489p94p93J501m46j283
$$ 417 607 -680 60 613 -622 -237 921 -464 -554 885 -278 -790 699 -95 -888 613 167 -1116
4572a116J288K07j594J083O94j653P78Q54j421L76J216j453j35J514j109n68J719
$$ -1116 172 379 -1215 -132 562 -1091 -313 541 -880 -504 712 -741 -876 638 -471 -1039 680
4589F80r49q09J414l27r96J283J07j547J195L40j330P02Q25j187K62R69q54k04
$$ 680 -269 -1078 336 9 -987 296 403 -1144 51 391 -939 -237 588 -599 -337 632 -222 -426
4607d26J120p84n66J421n15q39J175M6j096Q39N69j278M32Q49j017n8J130r54
$$ -426 694 -90 -656 765 250 -589 586 632 -464 375 944 -334 98 947 -70 -128 1002 48
4625D8m60J458q40n02J167l62r27J075m2j178J007M27j343P91M72j142K90R65
$$ 48 -412 1046 206 -296 871 509 -418 657 615 -563 444 871 -472 319 791 -351 -61 904
4643I04j224K16R65j111K1Q05o35n47J217o88o06J224l78r11J023M4j167P89K91
$$ 904 -320 -104 861 -250 -229 576 -59 -606 611 -77 -683 541 163 -748 275 319 -848 -59 232
4662B32q15M30L32q48L04O35q28j19R06n29l53P28k06n33P82J3j159R44L54j024
$$ 232 -583 -153 179 -669 -365 270 -558 -677 229 -300 -653 75 -131 -664 118 131 -1028 -84 270 -754
4682g54M83P41j118J49J154q63m60J168o07m21J033k63p93R27M4j038Q33M05j211
$$ -754 -271 470 -648 -499 655 -208 -668 500 -107 -528 505 242 -551 376 420 -618 215 620 -591
4701e91P08O71j105L47N23p22K75P46p96m9Q54p19l32Q33m83m37Q19k37o60J068
$$ -591 117 788 -317 30 553 -169 106 852 56 7 861 142 -190 643 160 -277 542 305 -355 713
4721G13k17p77Q31J01r83M38O01q19j10P30l10m44N82j24n84P70j51o67N07K99
$$ 713 496 -281 550 651 -332 106 707 -112 -222 508 198 -246 336 212 -372 398 247 -420 87 386
4741C86q92N2Q43o76o4P37n36k88O02m81k96N48O4p11O73J28o93M70J2m33L13
$$ 386 -506 -454 389 -287 -351 386 -150 -438 164 -317 -613 -65 -1 -712 -39 89 -604 -134 -122 -555 -242
4762b42K66o21K91K36n01L83M26p63P2P74n34lK07k09j36O83n03k12O01l25l26
$$ -242 24 -597 -306 -70 -571 -188 238 -525 -453 321 -213 -216 -9 -218 -354 329 -174 -386 215 -110 -436
4783d36N55N9n12N19O5l74K95m3k20K14J2k5o6L31p0k15J80N0k48J92K3o1J0P5
$$ -436 119 178 -334 185 250 -124 171 128 -92 122 134 109 43 374 304 89 269 319 71 263 286 225 235 310
4807C10j7k23K34l0j59K28L5k90J96Q6k83J47J26l66J28K64m99K51Q9k98J13K73
$$ 310 293 70 304 274 115 343 378 88 284 370 87 234 360 -6 122 386 -113 138 227 -71 42 315
4829C15m19l9M17n61K71J51m38O1L50l85M9K21j60j39K66j19p9J23j37j23K41
$$ 315 -104 -143 274 -287 -16 135 -303 -242 108 -277 -228 -7 -167 -306 -40 -159 -238 -115 -252 -375 -134
4850a34r0j29J70n7j76J18K9j3R6j84Q8J00k72J66L15k64k2K74k93M5L08j82j26
$$ -134 -224 -353 -183 -240 -416 -298 -269 -282 -186 -370 -282 -182 -454 -288 27 -237 -259 15 -278 -233 75 -107 -233
4873b33L93l37q9M22J08m18M40j42j08R8J51j36K3O7j14P2k9P0o4N9O9Qj31J08
$$ -233 160 -177 -266 156 264 -154 286 144 36 134 285 149 172 239 125 197 168 238 174 233 302 310 179 287
4897B87o2j5K33r6k97K01P2j20K4J79l69K70j01j14J36M0m34K73K19l53Q4J92
$$ 287 225 210 443 347 50 251 323 203 227 406 37 307 206 92 228 268 -166 107 326 -27 57 249
4919B49n08K58K16m30J23K73m96j27O02n02n7M71m47j49N92j75l63L86l2o06O39
$$ 249 -259 -1 215 -215 -92 181 -315 -442 160 -342 -399 72 -375 -524 68 -107 -470 -84 -116 -722 -83
4940h3P2m71K37R3k07J17O7q3j31L63j84j50K10J18l38L53Pk26J06R7r5pJ97j73
$$ -83 -11 -482 -245 -152 -359 -242 -175 -258 -389 -26 -210 -360 -150 -32 -370 -17 -10 -236 -130 -33 -128 -135 62 -111
4964a11q3K81k19k1K97m3k99M92j90k43M68L2m42M92L5o72L73N26p23J10N52m45
$$ -111 -194 87 -132 -153 144 101 -198 294 104 -139 329 361 -81 411 446 -226 147 673 -50 60 612 167
4986A67r7K97m00O4N71n26j36N81k20n12P13j6p52N25K1n01M13J46m49M0K79n05
$$ 167 70 367 -33 31 602 76 -60 521 301 -211 502 486 -266 259 280 -221 192 338 -111 -71 208 -297
5008b97L99J14m50K8L32k64j35L24k54j49L73m8m11L13J28n61L00K87l50Q0J86
$$ -297 102 216 -234 -206 126 -138 -273 51 -203 -352 21 -27 -438 -125 3 -558 -258 29 -321 -241 -55
5029e5j30k63M28j80l53M42N1l46K68K16p28O38J62o55K80M22n72K81J73m34L58
$$ -55 -185 -448 -20 -200 -553 -111 -60 -406 -138 78 -650 -12 150 -505 -225 197 -375 -94 79 -355 3
5050CL29n01j00P46m73k07Q12l85n42Q04j80n15N39J16q49P23J45o07L47L49n35
$$ 3 332 -169 -269 477 4 -203 609 224 -318 486 306 -209 330 446 -403 320 465 -142 205 554 19
5071A9j2M79m26p9N21l24k13M76j46m27N46l7m27K08L11o04K37L68o15J79K31
$$ 19 7 486 60 -19 502 178 -35 441 295 -132 414 377 -50 158 469 -135 102 470 -145 34 265
5092B65l00j2L79o4n38M45m7m30L79J75q12M54K22n13J43M82n96oO55n88l0M29
$$ 265 -35 -47 332 268 -270 175 128 -302 77 252 -560 -106 116 -397 -254 228 -368 -374 281 -307 -337 92
5114I2m15k28P77m13n04O23n9m83O77Ln95K86L04n86L10L62n32K8M56m02mN05
$$ 92 -323 -551 226 -187 -691 -68 -127 -610 67 70 -525 -239 65 -521 -211 151 -381 -353 103 -299 -303 202
5136B02n29j38N50k13M7L43j50k53K37N8k98K64K46m20O2L41k04j23K58q5j76
$$ 202 -327 -465 85 -128 -81 262 112 -141 96 154 -144 120 366 -54 8 349 145 22 280 195 19
5157A9K34j08j17L31j42l83N62ok88J91O6k89O1K69k12p6M42n80k9N63l23m14
$$ 19 253 145 28 359 217 -166 396 390 102 293 359 70 131 400 188 112 554 -26 -55 508 185 -229
5179b29M95k08j81L35k59k50M91J53o65N33p0l57J45L25n56J29M33n82r9N68l92
$$ -229 266 58 -123 212 -47 -297 194 347 -318 215 145 -212 -67 258 -298 -169 264 -318 -417 151 -241
5200b41k40O31l90j00K03P2l97K81Q4l41Q8N03o46K75K23l35j0L83l08o3N16k16
$$ -241 -481 150 -240 -340 -137 -65 -462 -181 -97 -438 -350 153 -493 -218 5 -330 -340 43 -265 -328 188 -28
5222b8m56M06N8k86J81L07m13L19J08m47M2N06k93j27M61m71M7N25l28j51K79
$$ -28 -484 -78 -20 -306 -125 182 -231 88 196 -251 -209 297 4 -123 338 -133 -86 439 111 -40 239
5243B39j50k91M55J36m49K73K26n05K76K78n20J39L82m61j25M80l14k18L82O7
$$ 239 89 -202 253 389 -60 213 439 -66 210 488 -32 107 489 28 -97 383 69 -149 233 300
5263C00l18K31P9l67K15M9j27J38O0m01J50K51l64j4K23j83j61M05k68q4J46N7
$$ 300 -18 213 292 -75 140 189 62 200 260 -141 9 260 -104 -118 105 -78 -239 166 -102 -186 -40 17
5285A7l27L15J8k74j09K26j80lK91l45j24M78k51j25L14j78j77N41k33l69M63
$$ 17 -310 5 23 -251 -360 -134 -314 -317 -26 -371 -495 -17 -268 -393 -79 -257 -434 107 -126 -495 -32
5306c2q7k62J95J41k39Q6J57k64J48K22l20J63J46j87j0K55j89o0M51l38J1L7
$$ -32 -119 -381 -186 -45 -284 -198 -41 -305 -157 65 -255 -92 54 -133 -143 112 -77 -137 314 -24 -13 24
5328B4K14j68J68J84l59O4K10k65K25j07jo6L12l76p3K97m0k60L84r5m17M28J30
$$ 24 238 70 238 422 63 127 337 72 297 190 189 123 435 59 -14 283 243 -17 367 272 -145 283 413
5351D13l49P4K50m52P4K97k19j32K26j34j92K88r3j58K50k04r8K06P8m31J76J41
$$ 413 64 138 388 -64 10 307 88 -44 182 48 -144 144 51 -107 143 -61 -159 47 125 -306 -130 11
5373A1k52Q7K13l13l0K26j84m8J20j74J37L5j16L9J31j38j48K29J05l8Kpk34K19
$$ 11 -241 -154 59 -254 -284 -58 -242 -290 -170 -344 -207 -172 -288 -249 -118 -256 -404 -175 -70 -108 -106 -113 -347 -128
5397a28P8k39pJ77N3r6J41l6j30K58j95L0P4J81k41R7K52k32N8J28j17j12K95
$$ -128 -50 -289 -296 -119 -66 -162 -21 -57 -187 71 -124 -94 -20 161 -80 17 269 37 95 223 106 -6 289
5420B89j63j19K82n3o3J04O8l24K82lk04L61k1k61j1o9j19K65r9p3J42M1k65K08
$$ 289 126 7 289 236 173 277 345 21 303 300 96 457 436 175 164 95 -24 241 142 69 211 252 -13 195
5444A95j1k21J84qk87J82K7j12q5J03p2l9P6K4Q4j47J32q9j09J75n8k10K68q8
$$ 195 184 -37 147 139 -148 34 61 -51 -136 -33 -105 -144 -68 -44 40 -107 25 -64 -173 2 -56 -266 2 -86
5468h6j29L8O7l07K10R4k20P1J91l1j60J67j55n0J94n9o5J12k00LJ52M8o1J97
$$ -86 -215 -177 -110 -417 -207 -113 -333 -262 -71 -102 -262 -95 -250 -300 -106 -165 -230 -118 -318 -315 -163 -115 -176 21
5492B1j53L6L3L5N8n3O3j44J27j26J23J9L7P9K5P5k98L85r5j73J2J53K6j8q9L5
$$ 21 -132 -96 -63 -28 30 -23 40 -104 23 -103 20 39 76 155 180 255 -43 342 247 74 86 239 265 247 158 193
5518A93P7M2j32J90j13M5M9j23o9J76j56j94L23l8k25N7k9r5K03r5k67L38k3k04
$$ 193 270 312 180 370 257 302 351 228 159 335 179 -15 308 270 45 102 73 -22 181 86 -181 157 134 -70
5542g0N4n4k3o9J54j43L5L0R7j35j5K39l38J22P9n5j41OJ05j04q3N2J70p8j2j47
$$ -70 -16 -70 -93 -162 -8 -151 -116 -86 11 -124 -139 100 -238 -116 -37 -92 -233 -227 -122 -226 -309 -257 -87 -165 -177 -324
5568c24J26O4j40J18J04l62K39op1j5K67k48N1K95j89j97M17j44j25K79k0j23
$$ -324 -198 -134 -274 -156 -52 -414 -175 -181 -252 -267 0 -248 -197 98 -91 -288 129 -15 -140 139 119 -4
5590dk3l6J08J18R1k96J66J85l90J93J89k01k16M67j50j40L43k60O3K12j15m92
$$ -4 -27 -63 45 163 254 -42 124 309 -81 112 301 100 -116 351 201 61 404 144 207 419 304 -188
5612a88M89q6j39J78J31l54M4P6r2j41K27j46j35L43j47j31K40o2l27L05n4k22
$$ -188 301 215 76 254 385 31 75 151 59 -82 145 -1 -136 207 60 -71 169 107 -220 85 31 -191
5634a91J45K8k4r8K26l28K9K27j99j13L19k92j9K37k12M8J13j00j73M55k41j58
$$ -191 -46 -18 -42 -140 86 -242 -213 14 -185 -298 21 -271 -290 -53 -265 -217 -104 -204 -377 78 -163 -321
5656c21K71Q6m97K17K75m43J12K06q9j43N65l27k41N86k74k68L70k07j10K54M9
$$ -321 -50 36 -461 -244 31 -412 -300 -94 -183 -326 239 -88 -329 257 -17 -285 85 -122 -232 22 71
5677G1j80K04J80m42K85J2k01L7M40l88l3L90k72m5L19l00PJ33Q0k43K02J36n07
$$ 71 -109 95 275 -167 118 130 -71 -34 406 18 -15 375 103 58 377 77 84 217 297 54 256 392 -115
5700a15L41M3j95J05K25l45q8M04l16q6N65n73l6M87l91k20K76j1k26J23J79n78
$$ -115 226 269 74 179 404 59 -29 375 59 -27 538 -35 -71 416 25 -195 81 70 -156 -33 146 -432
5722d32N09J19o07K84L55n25O2L46l29k39M99l59j63M03p4l95M45K2l61L22M1
$$ -432 77 196 -411 -127 228 -297 -235 111 -218 -457 42 -317 -480 -77 -151 -546 -101 -79 -440 -118 -77
5743g7l35O1M01l64P6K79l87O6M07l27j06M35k55k74L75mk72M16o3l42K66K17
$$ -77 -412 -351 50 -314 -238 41 -346 -280 127 -200 -306 129 -126 -400 -25 -29 -301 115 52 -290 -24 193
5765A93m32K84K15l10m1K68k64j8M92l20k77O38l33l38N19J87m58K54J29l74K57
$$ 193 -239 45 260 -50 -91 177 -87 -105 387 67 -210 428 95 -243 276 463 5 259 388 14 271
5786B71K42o36L72N6m44P8M88k55j85L46k85j03K16jl64N06j69k81N21j38m09
$$ 271 513 -123 249 305 -139 -61 427 172 -13 333 48 -55 161 160 -204 302 133 -148 373 235 -174
5807a74J27J50k04k9K47l66Q9L31l98j29M83k03k65M98j2m95M02p2m36K45L73
$$ -174 -47 103 -101 -130 117 -249 -160 171 -227 -356 127 -76 -341 157 145 -350 52 -20 -456 -211 162
5828A62m97R2L61m66j6M35l25j61L88j15l79P09l04l20L93rm48O33J3n17N34J35
$$ 162 -335 -243 118 -348 -364 71 -254 -415 -27 -142 -521 188 -116 -436 -43 -52 -500 133 146 -371 163 298
5850B98o25K62K71k96L9L88l16j48M43l40n6L18k92mL53r3l28L03J43l06K60K1
$$ 298 -327 -65 206 -90 -51 337 21 -127 316 -24 -80 238 -54 -58 295 202 -126 177 320 14 274 295
5872B95k94q2M26l18M5K92k94l5L20j43k13L21r6l61L31L1l56L36M6l79K76J08
$$ 295 1 -81 345 27 72 364 70 35 355 212 -1 320 224 -137 194 225 -131 205 251 -128 148 256
5894B56l52M7L32l18j54M59m14n8K10J87m07L53n5m67L50Q6m90K94J72l27R0P7
$$ 256 -96 -49 283 -35 -189 270 -144 -202 8 195 -212 141 86 -381 -31 55 -435 -141 31 -296 -206 -129
5916a29j86pM12l54j94M06j19j65L38j69l5K64p0k48L9J81k42J98J56l30J12K66
$$ -129 -315 -322 90 -264 -458 -52 -171 -336 2 -167 -202 62 -8 -256 -217 -36 -278 -80 76 -254 -142 124
5938A24j98j63L88j36k73K94q8mK85k20j13K29K07l39O3L40n50L34K52m36K7L12
$$ 124 -74 -237 151 15 -258 36 -52 -56 229 9 -104 125 332 -7 56 396 -154 180 432 -4 23 335
5960C35k83LK66j77N8l3M7j24K33o1n22N14j17j00J1K06k76J9K17l13L0L02k21
$$ 335 52 55 321 144 202 169 216 92 325 264 -258 256 139 39 50 256 -20 -1 216 -97 -67 235 14
5983A4j44K29j08l21M72j62j82J34R4k13J03Q9j56O5J21k36k5K65k50Q6J89l13
$$ 14 -130 99 -9 -330 142 -20 -202 -68 26 -187 -84 5 -151 -86 35 -201 -226 39 -211 -125 64 -249
6005b49j44L09n5k61K64J35k86J07J3J2M7J61k91q4M12k81L7J80l11N4L80n6k13
$$ -249 -393 -84 -139 -400 -136 -1 -287 -180 -167 -155 -108 53 -238 -322 90 -191 -154 26 -285 -231 149 93 -120
6028a20J69n8j37K14l3m3J56r3p6J85k2j21j3K17k13R6J35k68K5K02r3Q3Q0Rj93
$$ -120 49 -9 -146 68 35 -8 148 55 -21 164 142 21 8 225 12 108 243 -25 0 202 109 192 272 281 88
6053H8J06k28J27J34M7k08O5K4l9n4J15j57OJ71l6j32N4m2o0J0J15k30KK93l74
$$ 88 194 -34 93 227 274 66 131 155 116 62 177 20 26 197 161 29 83 41 -19 -9 106 -124 -122 171 -203
6078b03K04j00l9N0R3j14J22j88O7M0n4R7r8M9m7o7J45l45J01J81k4j18J24j3
$$ -203 1 -99 -138 -88 5 -109 13 -175 -108 -68 -122 -25 -123 -74 -121 -188 -43 -388 -287 -106 -130 -248 -124 -137
6102a37J04Q5k25J8J40q4ok05K00p0Q4J38j77K10k33K25k13K07j62J56o5L8KR
$$ -137 -33 52 -173 -155 -15 -99 -105 -310 -110 -180 -96 42 -135 75 -158 67 -146 61 -101 55 -10 28 30 39
6126C9J14k06K40j08J9M0o9J05N3k20O9m1O5J4J34j98K2K97k87JJ55J10k47l2
$$ 39 153 -53 187 79 98 138 69 174 227 7 76 35 100 114 248 50 72 369 82 83 238 348 101 69
6150F9K57k27mM2J2r8o1J40n8%k2L1o9L7j2r5J31q1L9k20J96j63Q9M9l7m4Qq2
$$ 69 326 99 95 137 149 51 -10 130 72 72 50 81 12 49 37 -58 73 -8 31 -189 7 -156 -67 -18 -55 -99 -91 -173
6178a73M5Mj68K36k4p1J71l02R4Q7r7j52K48j33P3P9qj02K6J73k31jK48r0p0J37
$$ -173 -128 -124 -292 -56 -80 -151 20 -282 -188 -101 -198 -350 -102 -235 -162 -83 -91 -193 -167 6 -225 -226 22 -68 -138 -1
6204aj03n0K02J09m74L85M6j46P5K99l57J45k1P8k62K61r6N1J46j54l8N0M9N3
$$ -1 -104 -154 48 157 -317 68 114 -32 43 342 -15 130 109 187 -75 186 90 141 287 133 95 145 194 247
6228B47l1j04o9J52J24k06P9P9k85Q2J49j5j69J60m3l17L95l2j82K5J56k23J92
$$ 247 216 112 43 195 319 113 192 271 -14 68 217 202 33 193 150 -167 228 196 14 39 195 -28 164
6251A64l4l30K78J19k45j08K36k87o5K65k02J28k3Q8k77K15o0r4O5L0j27J88r6
$$ 164 130 -200 78 197 -48 -156 80 -207 -272 -7 -209 -81 -104 -16 -293 -78 -138 -232 -167 -137 -264 -76 -172
6274a72l8mL47k68r3J28n9j06L63j24k34J34O0l50J75K43k01K9L17l00j7K95q9
$$ -172 -210 -214 133 -135 -228 -100 -159 -265 98 -26 -260 -126 -66 -416 -241 2 -199 -170 147 -153 -170 125 36
6297C6n7J28j77O3J13J82l01J01O5k95K92L3l45K65K40l91J66K51k59n1J59j13
$$ 36 -21 107 -70 -7 106 288 -13 88 153 -142 150 183 -162 103 343 -48 118 369 110 59 218 105
6319A05j06K44k02n3K71j70j22J65l3j97L79k7j74N8J00j97N8J74l06o9M45l32
$$ 105 -1 243 41 -12 259 89 -33 132 99 -98 281 254 80 138 238 41 99 273 -33 -102 343 11
6341A1k14M72k58k34K84q4j44J51N6k13P7K97m20J58K33m21J43K30k03j69K83
$$ 11 -203 269 11 -223 61 -23 -167 -16 40 -173 -96 201 -219 -61 172 -249 -106 124 -79 -248 35
6362C5l61n9K32k6k74L18M5k55J67K3j71K93R9l80J27K65k31p5K92j46q4L70k23
$$ 35 -326 -385 -153 -179 -453 -135 -90 -345 -178 -155 -326 -33 66 -314 -187 78 -153 -228 64 -82 -166 204 -19
6385a9l92N45L2n83M05K19l15J24K62m63L04J19j51q2L50l27n3M11r9l16J79M7
$$ -19 -411 134 166 -417 -12 207 -108 16 278 -185 119 238 87 5 355 28 -25 386 287 -29 150 197
6407A97k51L71j11m18L52K18m41K26R6k40LK40k46j84M59k43j27N10l05k40K77
$$ 197 -54 317 206 -212 140 358 -83 143 239 -1 2 242 -4 -188 271 28 -99 411 106 -134 143
6428A43j23j12L13j24l51L56J79m24J44R5k75O2K67j92k06L03j23m41O45k72k66
$$ 143 20 -92 221 97 -254 102 281 -143 1 96 -179 -117 150 -42 -248 55 -68 -509 136 -136 -402
6449d02M70o6j74J38O3m39L05M0k81J94K01l46K22L19o88K14K05j15k17N20k04
$$ -402 68 2 -172 -34 29 -410 -105 -65 -346 -152 49 -297 -75 244 -444 -230 -25 -140 -357 163 -41
6470d1j09J93M9k55K61Q4k95K2K95l42p4M79l28J4L78k80j09K39k7j81L29r7l70
$$ -41 -150 43 92 -163 98 182 -113 -91 204 -138 -212 267 -61 -47 331 51 -58 181 154 -27 302 205 -165
6493a65K20J97l39K18K74l60P8N38p17K1M70l58j67M20j85l21L63Ql65L30mk56
$$ -165 55 252 -87 131 405 45 123 661 -56 -35 435 77 -90 330 145 -176 187 195 -170 160 156 -100
6515a00K05K79n05P1L50n71L6L99k21k21M15j76k60L66n4l88N11j37l39L13ol02
$$ -100 105 384 -121 -50 300 -271 -235 164 -57 -278 137 -39 -299 67 13 -375 136 -1 -340 -27 -33 -335
6537c35R3K12k26R2L82m05o4K65l05o2M16k44k23M80j03l17K67K48m93L49K8l13
$$ -335 -242 -30 -256 -164 218 -187 -251 14 -291 -353 63 -181 -404 76 -27 -344 -77 171 -322 27 55 -258
6559b58J83L45m38j4M45l85qK44k03j16M80k73k46N49r6m36N40j9o40L60J70l75
$$ -258 -75 270 -168 -182 263 -122 -130 114 -89 -205 275 2 -244 305 209 -227 313 294 -346 14 184 -191
6581a91K79K03l17K0M18k98q3L50k15j54K38J6l69K85Q7l98K88R4l42K79L3l93
$$ -191 88 291 -26 -6 412 114 31 381 166 12 250 266 -103 182 269 -129 159 253 -89 190 223 -170
6603a70J37K94l49m9L75l46k11N68r2l31L19j60j22P2K23l93L12n9k30J10K30
$$ -170 -33 261 -88 -137 238 -108 -319 249 157 -174 145 -15 -137 -65 158 -235 77 18 -212 -102 128
6624A28k77j36L73k70l46O30j45j53J16k8P6J26j99k32K59l9j97K70K79l77J91
$$ 128 -149 -285 88 -182 -528 102 -43 -196 -80 -108 -32 94 -105 -337 -78 -117 -314 -44 235 -142 49
6645D9J0k66O2J80q8o6K90j60j84K50k42l1J23J93j70K53J5j92j9J72k37J74J63
$$ 49 59 -207 -145 35 -53 -119 171 11 -173 77 -165 -196 -73 120 -50 203 218 26 7 179 -58 116 279
6668B79j46m5Q2o5j38K76n5k25J75J95k95Q2K42m74O0K99k68L2L25j35j32K34
$$ 279 133 88 170 105 -33 243 188 -37 138 333 38 120 362 -112 -52 247 -21 11 336 201 69 303
6690C03l46j67N55k70k40K21j55M0J58j0k68J67N7k48K08K8k21Q0L19m84Q7J16
$$ 303 -43 -210 345 75 -165 56 -99 -59 99 89 -179 -12 45 -203 5 33 -188 -108 211 -273 -186 -70
6712g0j08J9J85j72j27J75J57m23K60Kj99J49K09k76M3J23j25j72M13j62K8J00
$$ -70 -178 -159 26 -146 -273 -98 59 -364 -104 -102 -301 -152 57 -219 -176 -53 -178 -350 63 -99 -71 29
6734B9p6k04J42j08K11L1j39J67j19l8N5j2J57O8j41j15K20J42k25O5k66L00r0
$$ 29 -47 -251 -109 -217 -6 25 -114 53 -66 -104 -49 -61 96 164 23 -92 128 270 45 110 -156 144 54
6757E4R4M1j69K1J22nj45J07n3j00K15o1j52J38NQ2j54P5j64K84l38K14r9J34
$$ 54 148 189 20 41 163 158 13 120 67 -33 182 121 -31 107 112 194 40 115 -49 235 -103 111 12 146
6781A46k12O7p5m0K1J24k4m2J7j17R9j62J09J85k24P4J13j73R1k3j49k1L3J62
$$ 146 -66 1 -74 -114 -93 31 7 -35 -18 -135 -36 -198 -89 96 -128 -54 59 -114 -23 -46 -195 -216 -183 -21
6805b1j15J02M9j63L7N4l1k73K21l5n4J87q0n2J34L5j16O4J51k30O3J04k68K39
$$ -21 -136 -34 15 -148 -111 -57 -88 -361 -140 -175 -229 -42 -122 -174 -40 -5 -121 -57 94 -136 -73 31 -237 2
6829BJ47q5j92K07o8m5J83N4k7l46M50k22j40K05j34R5pPj16K99j44L8j41K07
$$ 2 149 64 -128 79 11 -34 149 203 176 -170 280 58 -82 123 -11 84 77 84 -32 267 123 161 20 227
6853B27j02K51j97m6k7J23j51j27L32j96j34K90j92j6J04r0j29K81L9k68K4N0
$$ 227 125 376 179 133 106 229 78 -49 283 87 -47 243 51 35 139 49 -80 201 240 -28 -4 46
6875D6j98M7K80m43J65K49l42J36ol5j49K32J7j86J40j35n4K96j88o5J45Om3l2
$$ 46 -152 -105 175 -268 -103 146 -196 -60 -66 -101 -250 -18 -1 -187 -47 -182 -236 60 -128 -193 -48 -42 -85 -117
6899a17J15j70Q6qj52l6K23pj34J84j14n1K24p9k03K77J6l03L39j6k05K39kk24
$$ -117 -2 -172 -86 -94 -246 -282 -59 -66 -200 -16 -130 -181 43 -36 -239 38 54 -249 90 74 -131 108 106 -118
6923a18jM22j48k62M79l28n3K26k08n7L37k12k84M20q0j27L08m9k92N6J48j12
$$ -118 -119 303 155 -107 372 44 -9 217 9 -48 289 77 -207 213 133 6 314 265 -27 29 177 65
6945F5P3J27j07J7J19j2l25L38j22k93J46J16k32K90j56j89J67J37k45K8L77l02
$$ 65 138 265 158 175 294 282 -43 295 173 -120 26 142 -90 200 44 -145 22 159 -86 -58 319 17
6967A7k95K23Jk34L22j70j31M49k36l18L53lk02J71mk31N0J84k67J22J12j02P5
$$ 17 -278 -55 -54 -288 34 -136 -267 182 -54 -372 -19 -22 -224 -53 -57 -288 -238 -54 -321 -199 -87 -189 -114
6990a14J74j89j05J89q6j34J60N1o1P8N9k22J17J72l13J25K85l16N3M90m28j38
$$ -114 60 -129 -234 -45 -131 -265 -105 -54 -115 -37 22 -200 -83 89 -224 -99 186 -130 -77 413 -15 -153
7012a53M40j89j85L36j09j02r2K51k71J04K58l68K23L4j53J02J35k88J77N9j63
$$ -153 287 98 -87 249 140 38 -54 197 -74 30 288 -80 143 177 24 126 261 -27 150 209 46
7033D6j91M50j79k20J59Q5j66K33n3j61J64J70l85lJ72j76J23L19m46j61L15j09
$$ 46 -145 305 126 -94 65 150 -16 217 164 3 167 337 -48 -51 121 -55 68 387 -59 -220 95 -14
7055a4j31K93j50j48J69P4k15j2K9j51K08N4j46K6K04m10J19K63k35j05K97J3
$$ -14 -145 148 -2 -150 19 93 -122 -134 -105 -256 -48 6 -140 -114 90 -320 -201 62 -173 -278 19 32
7077C2k64K70l9m39K62J95l20R3K76m03J34L88k89J1J94k32n7K94k45j04L92n6
$$ 32 -232 38 -1 -440 -178 17 -303 -210 66 -337 -203 185 -104 -93 101 -131 -188 106 -139 -243 149 93
7099I3j65R4J69l07K67O9k98K0K01k07J15J60j31k82N55l47r6K67J1l21M37j02
$$ 93 -72 22 191 -116 151 220 -78 -58 143 -64 51 211 80 -202 353 6 -90 177 188 -133 304 202
7121B02k99L25O8k89K3L47n46K28K65k04j36J38j58J08m6J35j92K51L3l57K51
$$ 202 -97 228 296 7 30 377 -169 59 324 120 -16 122 -36 72 26 161 -31 220 253 -104 147
7142A47j20j11N2J98k40k2K13l03J76J82j43k26J21q3n3K68q4j36J28o3j48L39
$$ 147 27 -84 -32 166 -74 -96 117 -186 -10 172 29 -197 -76 -159 -212 56 -28 -164 -36 -99 -247 92
7164I2j07j33k5L11m28K46R0q2j95K87k69j57L95q3j19J97j9j10J01J6j59K53
$$ 92 -15 -148 -173 138 -290 -44 46 -36 -231 56 -213 -370 25 -58 -177 20 1 -109 -8 8 -151 102
7186A02n7j31M3J59j99rK72k15MK79j11j92K56p8j41Q8J27k19J16J21k42J00J24
$$ 102 45 -86 -43 116 -83 -92 180 -35 -31 248 137 -55 201 123 -18 70 197 -22 94 215 -27 73 197
7209A97l25Q7J17j53O3K48r3j46L35k29j71MO2j14J60P4k33J57J69l08J4K30j99
$$ 197 -128 -41 76 -77 -14 234 141 -5 330 101 -70 -66 -4 -118 42 116 -117 40 209 -99 -85 145 -54
7232e4q6J46M9j72J24n4n1P9k7j59J74j20j4O0J07n3m6L5n3L8K22k88K6M3J02
$$ -54 -140 6 55 -117 7 -47 -98 -19 -46 -205 -31 -151 -165 -105 2 -51 -97 -62 -115 -77 145 -143 -117 -74 28
7257B8k27J47r8L9M3p9L3q6K50q0J9N0j07j33J85M9j52J55K4j69J67L5j09K7Q3
$$ 28 -199 -52 -150 -111 -68 -147 -114 -200 50 -30 -11 39 -68 -201 -16 33 -119 36 60 -109 58 93 -16 11 94
7282I4n9J06k7j89K50n7j87J85Q2k70N7J87p5j30J65j03j40J24K17j75J76j36
$$ 94 35 141 114 -75 175 118 -69 116 198 -72 -15 172 97 -33 132 29 -111 13 230 55 231 95
7304I5n0J96j59j24Q6J78k73J12j6koJ54j77l8J4k3l2N0pK8j0M0j57R1K7r7L1
$$ 95 45 241 82 -42 44 222 -51 61 45 43 37 191 14 -24 -10 -33 -65 -15 -22 6 -4 36 -121 -30 -3 -100 -69
7331f9Q8j87k4J86l5l1J31j97O7n4o9m5J49O9j09k8J49j85J35j2j88K11O7p9j41
$$ -69 19 -168 -192 -6 -41 -72 59 -138 -71 -125 -194 -239 -90 -21 -130 -158 -9 -194 -59 -71 -259 -48 19 -60 -201
7356b01J53J26k11M7K71l07N5J38k1k0k8l0J40l5p2R2N6q2O5P6q5j60L3J51j38
$$ -201 -48 78 -133 -86 185 -122 -67 71 50 30 2 -28 112 77 5 97 153 71 136 212 127 -33 0 151 13
7381A3J88j05pQ7j18n3q0K34kp5K1J50j19J07j20j37K81k88J1p2K48j69j4P9L9
$$ 13 201 96 89 176 58 5 -75 159 157 82 103 253 134 241 121 -16 265 -23 -12 -84 164 -5 -19 60 99
7406I9j7o8O4k36J08J01n2K4K9k03J44j50J41j6o8J97j88KQ5o1l3n8L5Q6K4J25
$$ 99 82 14 78 -158 -50 51 -1 23 52 -151 -7 -157 -16 -32 -100 97 -91 -89 -4 -65 -98 -156 -121 -35 -11 114
7432A14k93K0K49j47j8J58j51J93l06M7j01J12m0R6K7r4L3J08M5j62P0J01j9k4
$$ 114 -179 -159 90 -57 -75 83 -68 125 -181 -134 -235 -123 -163 -67 -40 -134 -101 7 52 -110 -40 61 42 18
7456A8r1K16j10r0lk9J79Q8r2%j6J45j48m3J76k36K44k51J25q6M1O9K5N4%j55
$$ 18 -73 143 33 -57 -60 -89 90 178 86 86 70 215 67 24 200 -36 208 -43 82 -4 37 106 131 185 185 30
7482C0k0J93l3j76K0K06k01k4J93k03j03J01l5qK54k54j08K31K0l31L41J22m91
$$ 30 10 203 170 -6 14 220 19 -5 188 -15 -118 -17 -52 -60 194 -60 -168 63 83 -248 93 215 -276
7505b76K20K68j59j64K22k00rJ88j46m2P8m6m6R3o8j84K26J11k09J74j67J1J34
$$ -276 -56 212 53 -111 111 -89 -98 90 -56 -98 -20 -66 -112 -19 -87 -271 -45 66 -143 31 -136 -125 9
7528Imk08R5mM0L2Q3j34QJ54J5j86J59rn7m2J49j09j16K93l12J30K36j79j61M41
$$ 9 5 -203 -108 -112 -72 -40 43 -91 -83 71 86 -100 59 50 -7 -49 100 -9 -125 168 -144 -14 222 43 -118 323
7554C23j50k53K24k21J82O0j81j42K75n2l3K6O6j23J59N6j57R7n3j20LK73j20
$$ 323 173 -80 144 -77 105 165 -16 -158 117 65 32 58 124 1 160 216 59 156 103 -17 -14 259 139
7577A39k08L11q1l06K59q7j07k1K10j40K08j68p6n6J07M5j79J62J1j29J04q9j24
$$ 139 -69 242 161 -145 114 27 -80 -101 109 -31 177 9 -67 -123 -16 29 -150 12 23 -106 -2 -91 -215
7600b15K15j6l32M79j76n4k8L6p1P9J35k72J90j5m3q8J38o5j8l0J01k22K90O2
$$ -215 0 -16 -348 131 -45 -99 -127 -91 -162 -83 52 -220 -30 -45 -88 -176 -38 -103 -121 -151 -50 -272 18 80
7624H0m59M04J13l34J65J52k51J0L21j09l64L72j73J5K48n2k81K74J6q6O3N2j98
$$ 80 -379 25 138 -196 -31 121 -130 -120 201 92 -272 100 -73 -58 190 138 -143 131 147 61 124 176 -22
7647b2p6J90j11P1J69l05M3K95j85L3J31j39p8J93K4k81R7J23k35K27lk46O5J94
$$ -22 -98 92 -19 52 221 -84 -41 254 69 102 233 94 16 209 233 -48 49 172 -63 164 161 -85 -20 174
7671A74j77N0J34j8m55M97j59j43P2M0j30J69q2k26J16K40k13p0J96k84R3J44
$$ 174 -3 47 181 163 -292 205 46 -97 -25 15 -115 54 -28 -254 -138 102 -111 -181 15 -269 -176 -32
7693c2q4o2J28p9O7k9n0M3PQq3K05M0l07Q9J81j98O9K09k81J49J10j41n8J46j62
$$ -32 -116 -178 -50 -129 -62 -91 -141 -98 -91 -83 -166 39 79 -228 -139 42 -156 -87 122 -159 -10 100 -41 -99 47 -115
7719a15PK19m0j99K83p7j59Q5J94k81Q4P8n2L6Q7j01p0J75r1j7P2m7o9J52r0N6
$$ -115 -108 111 71 -128 155 78 -81 4 198 -83 1 79 27 63 150 49 -21 154 63 46 118 71 2 154 64 120
7745A20pJ24k21J73K0l34J37J92j24o6R3j87r6L82qj48K39m28Q4J85j50J80l8
$$ 120 113 237 16 189 209 -125 12 204 80 14 107 -80 -176 206 198 50 289 -139 -55 130 -20 160 122
7768A22Ro5k6p0j14j2J79j37mL00k58J7R7j20o2K89j66q5P5N9m3J06l7l09K05
$$ 122 131 66 40 -30 -144 -156 23 -114 -118 182 -76 -59 38 -82 -144 145 -21 -106 -31 28 -15 91 54 -255 -50
7793e0J33k42m9J73p0N3J2j31j9K19Q3k46K55m5j00j4Jj00L60J8l64J83Jj23J43
$$ -50 83 -159 -208 -35 -105 -52 -40 -171 -190 29 112 -134 121 76 -24 -38 -37 -137 223 241 -123 60 61 -62 81
7818H1m3O3k30K57j74m2K88kj83O8K14k77K0J85l22O3J98l39J82K01j24k44L83
$$ 81 38 101 -129 128 -46 -88 200 198 15 83 297 20 40 225 -97 -34 164 -175 7 208 84 -160 223
7841B23l58J50L06k15j51J20J24j56o2J27j22P5R8j70K8J58k00p8K66j10l3Qr5
$$ 223 -135 15 321 106 -45 75 199 43 -19 108 -14 61 159 -11 17 175 -25 -103 163 53 20 28 -67
7864f7m0J91J3k11K31j26j95K13k86K28j54J32L9O2r0j35J34M8R5q7l2L8j48J28
$$ -67 -107 84 97 -114 117 -9 -204 9 -277 -49 -203 -71 -32 30 -60 -195 -61 -13 82 -5 -37 1 -147 -19
7888a9j37J5J66p4k96L52N5j31L6L0O3Qo6J6k9J67j29k21Q0J39r1nK09k56J65
$$ -19 -156 -141 25 -49 -345 7 62 -69 -33 -3 60 68 2 18 -11 156 27 -194 -114 25 -66 -71 138 -118 47
7913D7k01K24J20m1j60N7J91j39j58K42pj26oR6k07J25J4j90L26j41l9mN2K3r9
$$ 47 -154 70 190 149 -11 46 237 98 -60 182 175 49 43 139 -68 57 71 -119 207 66 27 23 75 98 -1
7938aJ1jk0J19j46N7j43J93o9q8O8j05J58j03o5p9J97r9j06J29J06q7P3p3j04
$$ -1 10 9 -11 108 -38 19 -124 69 0 -88 -20 -125 33 -70 -135 -214 -17 -116 -222 -93 13 -74 -1 -74 -178
7963a78J40m0k5L9j6p6J13l3L3P6j14N1K4r7J75j93O7j40J70J99j03k63K60j21
$$ -178 -38 -78 -103 -64 -80 -156 -43 -76 -43 33 -81 -30 -6 -103 72 -121 -54 -194 -24 175 72 -191 69 -52
7987e2Q3rn7n7j24L01k3J3o1P9j40j1O6J16j18j9K2m3Q1p1R9J38j91O8j39K5O3
$$ -52 31 22 -35 -92 -216 85 62 75 14 93 -47 -58 8 124 6 -13 9 -34 47 -24 75 213 22 90 -49 -24 39
8014C9j03J53J08j11q7J49j04O6j32J22m7K09k18j10J88j59J20J12j51o1O9p5
$$ 39 -64 89 197 86 -1 148 44 110 -22 100 53 262 44 -66 122 -37 83 195 44 -17 52 -23
8036b3Q0j25J06q8J5j9r0J69j42J16j05J75n0p8M2j6j24K43j91J0O8j53J87j7
$$ -23 57 -68 38 -50 -35 -54 -144 25 -117 -1 -106 69 19 -59 -17 -33 -157 86 -105 -95 -27 -180 7 -10
8060a0j4j24K32j03N9j47j48L18o7n4K9P0Q3j83J22k99L01j57Q1PPO2j11PJ27
$$ -10 -24 -148 84 -19 40 -107 -255 63 -4 -58 -29 41 124 -59 63 -236 65 -92 -11 -4 3 65 -46 -39 88
8085H8j35k5J58p0N6p1O2j05K7M9P4j04J24n0o5J08M4j90O8n5J09j17J53l5j4
$$ 88 -47 -72 86 16 72 1 63 -42 -15 34 108 4 128 78 13 121 165 -25 43 -12 97 -20 133 98 84
8110H4K31r3k76P2O1Nj22J35k40P8N0Q3l2k07j7J90R1j70P7j05n5N2J31l5m6J07
$$ 84 315 222 -54 18 79 84 -38 97 -143 -65 -15 68 36 -171 -188 2 93 -77 0 -105 -160 -108 23 -12 -58 49
8136D9q0MK21k45q4O1KJ3N9J19k22R9j82J31j12J82j39m8J86j2j21J28j32jJ04
$$ 49 -31 -27 194 -51 -135 -74 -72 -59 0 119 -103 -4 -186 -55 -167 15 -124 -172 14 2 -119 9 -123 -124 -20
8161b0l2o7J40J3j36R7pp1M1P4o8M2N9m6p7J78n0j5j21J5Q1j9J18j09np4Q4O8
$$ -20 -52 -119 21 34 -102 -5 -12 -83 -42 32 -36 6 65 19 -58 120 70 55 -66 -51 30 11 129 20 15 -59 25 93
8189I3j0j24
$$ 93 83 -41
8191d1
$$ Imaginary data points
##PAGE= N=2
##DATA TABLE= (X++(I..I)), XYDATA
0@%%%%%%Qj6J6j6J6k4L6m4N6p2Q8j04J28j56J83k17K58l04L56m16M84n59O41p35
$$ 0 0 0 0 0 0 0 8 -8 8 -8 8 -16 20 -24 32 -40 48 -56 72 -84 99 -118 140 -164 192 -224 260 -299 342 -393
30c93Q42r59J088j230J387j562J752j962K194k444K716l018L349l707M098m524
$$ -393 449 -510 578 -652 735 -827 925 -1037 1157 -1287 1429 -1589 1760 -1947 2151 -2373
46b373M990n504O064o677P356q103Q930r855J0892j2063J3400j4934J6718j8833
$$ -2373 2617 -2887 3177 -3500 3856 -4247 4683 -5172 5720 -6343 7057 -7877 8841 -9992
60i992K1377k4504K8453l3612M0666n0914O7144r6601J65794n96643k33932J617317
$$ -9992 11385 -13119 15334 -18278 22388 -28526 38618 -57983 107811 -488832 -722764 894553
72H94553r38417o05089J099981k39998n83065O84626k82601l87464N89789j83330
$$ 894553 -43864 -648953 451028 211030 -372035 312591 29990 -357474 232315 48985
82D8985l69205N48026k03034m77722M04515J67444j28302J92527k38770k07445
$$ 48985 -320220 227806 24772 -452950 -48435 119009 -9293 183234 -55536 -262981
92b62981L13181j7066j48753J98749j1440o6007K3618r8061J61732O7632m36372
$$ -262981 50200 33134 -115619 83130 71690 5683 29301 -68760 92972 160604 -275768
103b75768J03677M83356k71958l34298K33312J16245p5242j3140J39957K07196
$$ -275768 -172091 311265 39307 -294991 -61679 54566 -20676 -33816 106141 313337
113C13337l28436l41440N01966J11189m95384L30823K01356n64802K64527L20878
$$ 313337 -15099 -356539 145427 256616 -238768 92055 293411 -271391 -6864 314014
123C14014n93348K06833M62065o23892L8432N79179n21719j42280N74000k84940
$$ 314014 -279334 -72501 389564 -234328 -195896 383283 -138436 -280716 293284 8344
133H344p1023M57850m59243j96379N69805l29822k92890O08708j50772m73783
$$ 8344 -62679 395171 -64072 -260451 309354 -20468 -313358 295350 144578 -329205
143c29205L77816Q2692k69960J85284k2683j26077K32007j24304j82814K87411
$$ -329205 48611 131303 -138657 46627 23944 -102133 129874 5570 -177244 110167
153A10167o1842k11247K98879L6807k77234R9348K0673j76429J47889R5671j73738
$$ 110167 48325 -162922 135957 172764 -104470 -5122 15551 -160878 -12989 82682 -91056
164i1056J7164R9560p0344k7279Q7582L8504p0566k8474Q4122l8837r2234J02549
$$ -91056 -73892 25668 -44676 -71955 15627 54131 -16435 -44909 39213 376 -91858 10691
176A0691J2771q0153J43017l2187k15479J63100N8110k54477J81151J63887l11871
$$ 10691 23462 -56691 86326 54139 -161340 1760 59870 -194607 -13456 150431 -161440
187a61440R2581K44672k74307L2926K74060k59906m0056K81253k40990j05187
$$ -161440 -68859 175813 -98494 -65568 208492 -51414 -91470 189783 -51207 -156394
197a56394L03005j59348j22419L01551j28158j95607K56023o3615j91794K39911
$$ -156394 146611 -12737 -135156 166395 38237 -157370 98653 35038 -156756 83155
207H3155m085j99995J86661L4571j81774J53272N3371j93536J05233Q0856k02386
$$ 83155 79070 -120925 65736 100307 -81467 71805 125176 -68360 36873 117729 -84657
218h4657L6328J30696j29704l245J45096p1578o8682R0663k1472o3860P5901J1165
$$ -84657 -48329 82367 -47337 -50582 94514 22936 -45746 44917 23445 -40415 35486 46651
230D6651q9797M4403O6153p9152J813R0685p3686n6442R5637m7027r0073R8498
$$ 46651 -43146 1257 67410 -11742 -9929 80756 7070 -49372 46265 -762 -90835 7663
242G663j1567r4982J36062L8216j58471Q4461R1189j59049L2588J22016j38121
$$ 7663 -3904 -98886 37176 75392 -83079 1382 92571 -66478 -33890 88126 -49995
253d9995k1631J21905q5459j0923J15112j02453m0441J34890q3522q2966J33098
$$ -49995 -71626 50279 -35180 -46103 69009 -33444 -73885 61005 -22517 -105483 27615
264B7615m0331r5958J36537J9718j02659Q4076K0507j06004O7564M3735j15610
$$ 27615 -12716 -108674 27863 47581 -55078 28998 49505 -56499 11065 54800 -60810
275f0810K1979O6590p6780J3194Q2377n8077k2126O9046l7917l0248O4557l2559
$$ -60810 -38831 27759 -49021 -35827 46550 -11527 -33653 35393 -2524 -32772 31785 -774
287g74n2429P7039J9084n9663M6028L1350p2417J2022M9482n8612j9067M5487
$$ -774 -53203 23836 42920 -16743 29285 60635 -11782 240 49722 -8890 -27957 17530
299A7530l6686r604O8917k1491l4279N8712r758m8071N1033K970o6708L4616L3349
$$ 17530 -19156 -28760 40157 18666 -15613 43099 33341 -14730 36303 39273 -27435 7181 40530
312D0530m9917K3450L7329n6419R8M2830m6853j5616M1146l5493j6177N9270r479
$$ 40530 -9387 14063 51392 -5027 -4929 37901 -8952 -24568 16578 -18915 -35092 24178 14699
325A4699k8296M4512l767m0645L1578N435m7880J4528J6896l3762J4975K6755
$$ 14699 -13597 30915 27148 -13497 18081 23516 -24364 -9836 7060 -26702 -11727 15028
337A5028l2152q97K6596k5638j0714K5384j6727j4489L1644K163j2930K3870P56
$$ 15028 -17124 -18021 8575 -17063 -27777 -2393 -19120 -33609 -1965 198 -12732 11138 11894
350A1894k4025J1717L050k6576K946J0009j7673L853K0295q010k914J5939o095
$$ 11894 -12131 -414 2636 -23940 -20994 -10985 -28658 -24805 -4510 -12520 -15434 505 -5590
363e590q856J3598l145j0515J4759M694r831J5129Q270j8339O85P612j8310n209
$$ -5590 -14446 -848 -3993 -14508 251 4945 -4886 10243 18513 174 859 8471 -9839 -15048
377a5048J1220o306M38J2943j898Q237J3462j3730j323J5508j4303q447J6726
$$ -15048 -3828 -10134 -9696 3247 1349 9586 23048 9318 7995 23503 9200 753 17479
390A7479m279q142Q521r41K218K851j8387j72J0741j9149J839K2604j3423J979
$$ 17479 13200 5058 13579 12638 14856 17707 -680 -852 9889 -9260 -7421 15183 1760 3739
404C739K5086j5242R16K1923l2180j1238L0793k4942j5438L2713j9120j3505L5361
$$ 3739 28825 13583 14499 36422 4242 -6996 23797 -1145 -16583 16130 -2990 -16495 18866
417A8866k0733j6432L8870k8826l0660N4114q141m1472M5605Q643l6744L0572
$$ 18866 -1867 -18299 20571 -8255 -38915 15199 7058 -34414 11191 19834 -16910 13662
429A3662M402l6235J9178n792l4362K9978O589l5209K3679J7688k2954J4236R816
$$ 13662 18064 -18171 1007 -4785 -39147 -9169 -2580 -37789 -14110 3578 -19376 -5140 4676
442D676j9265O440J989r106J2480r84m325R869p628O940R704l0695M884J9045
$$ 4676 -14589 -8149 -6160 -15266 -2786 -3770 -8095 1774 -5854 1086 10790 -19905 -15021 4024
456D024l7818J2442L7889m3063J0630N3310m8730K557O1952o2489j8563P4966
$$ 4024 -33794 -21352 16537 -26526 -15896 37414 -11316 -8759 53193 -9296 -27859 47107
468D7107n4876k7520Q4723n0928l9722R4625m1877n6405R2928l3869p0388R3142
$$ 47107 -7769 -35289 49434 -1494 -41216 53409 11532 -44873 48055 14186 -56202 36940
480C6940j2749p1716Q8405k327p6749Q4034R412r1250N8297K0206p9380M2582
$$ 36940 24191 -47525 40880 38553 -38196 45838 55250 -36000 22297 42503 -36877 5705
492E705K2328n6750M3091P378n5897N9070J4350p6717M1559L7154o2982J1491
$$ 5705 28033 -28717 14374 21752 -34145 24925 39275 -37442 4117 41271 -21711 -10220
504a0220L4443k4816O360K802j1865K2791j7044k6497K5578j1487j1049K6205
$$ -10220 24223 -593 5767 8569 -3296 19495 2451 -24046 1532 -9955 -21004 5201
516E201k7532L678M6688m8362p775O7947m5379k6913N5685m4441m689O4441p9453
$$ 5201 -22331 -18653 28035 -20327 -28102 39845 -5534 -32447 23238 -21203 -25892 38549 -40904
529d0904l147J17317r6614o3606J48292m9660j08595J18710K843q2161Q0572k0680
$$ -40904 -44051 73266 -23348 -86954 61338 11678 -96917 21793 24636 -57525 23047 2367
541B367n6629J10203m0043r1377J29574j4218j30552J05993K9658j11234Q1107
$$ 2367 -54262 55941 15898 -75479 54095 39877 -90675 15318 44976 -66258 14849
552A4849K5938j04965Q4154L4627j24900O3334P7706j01372R797O5068m6798N213
$$ 14849 40787 -64178 19976 54603 -70297 -6963 70743 -30629 -20832 44236 -2562 2651
564B651J5527l4739M8452J1824q1732K6570N6638n1097k7614M3884L2287k7520
$$ 2651 18178 -16561 31891 43715 -38017 -11447 45191 -5906 -33520 10364 42651 15131
576A5131n0080M5198M7258q1358j027Q7085n7126k9663O9021n8138j3652R2875
$$ 15131 -34949 10249 57507 -23851 -24878 62207 5081 -24582 44439 -13699 -27351 65524
588F5524p5774l6881J19289o7843q0633J10910k4153n4085R7535n2982n5070J27061
$$ 65524 -10250 -47131 72158 4315 -76318 34592 10439 -43646 53889 907 -54163 72898
600G2898p0980j00695J67524j3859j53779J16910L7676j27455O7690K8423p8897
$$ 72898 1918 -98777 68747 54888 -98891 18019 55695 -71760 -4070 24353 -54544
611e4544R1105n573j22735J06922L6728j47035Q1060R7030j24424J0148P9100
$$ -54544 36561 30988 -91747 15175 51903 -95132 -14072 82958 -41466 -31318 47782
622D7782q1556K784O7283n9875l324O1496m5554l6702M0343J8507j2854j4451
$$ 47782 -33774 -30990 36293 -23582 -26906 34590 -10964 -47666 -7323 11184 -1670 -16121
634a6121K2259K3322n2708j5179N8744j5173j7942L8639k8125o403L9126o2245
$$ -16121 6138 29460 -23248 -38427 20317 5144 -12798 25841 -2284 -8687 30439 -31806
646c1806Q89R6479o4478n0551R6457m1753o3671R1432j2409m1732P8404m8030
$$ -31806 -30917 65562 1084 -49467 46990 5237 -58434 32998 20589 -21143 57261 9231
658I231n6861R7658m2264o7185J20132k2290r2060J01269k4304j00619J23940
$$ 9231 -47630 50028 7764 -59421 60711 38421 -53639 47630 23326 -77293 46647
669D6647N013j23732J14641K8020j59470Q1185Q6093j27959M1439R2838j08391
$$ 46647 51660 -72072 42569 70589 -88881 -7696 78397 -49562 -8123 84715 -23676
680b3676j925P4737q2497o97Q8846n5391k9319O2091l5869l9483M9289R390k1137
$$ -23676 -25601 49136 -33361 -34058 54788 -603 -29922 32169 -3700 -43183 6106 15496 -5641
693e641J0259R13j4854r333O728J4468n301P747J3761l4422q978K7536k3090K672
$$ -5641 4618 5531 -9323 -18656 -11928 2540 -2761 4986 18747 -15675 -24653 2883 -20207 -17535
707a7535M3763l4090j8451L9084l6240r524O3308l4998k1847O5406m8588m4242
$$ -17535 26228 -7862 -26313 12771 -23469 -32993 30315 -4683 -26530 38876 -9712 -53954
719e3954Q0764k9224m5923R6462k4952q4643Q3479l308q8126R0330K9149j01705
$$ -53954 26810 -2414 -48337 48125 23173 -61470 22009 18701 -69425 20905 50054 -51651
731e1651N8845L9240j02691M4506O7811q4965K2291O8888q3612j1517O9754m8211
$$ -51651 7194 46434 -56257 -11751 56060 -28905 -6614 62274 -21338 -32855 36899 -11312
743a1312r219O7333l8539k9679M7190k6862k5635N2619m956l2767L0206o23l5023
$$ -11312 -20531 46802 8263 -21416 25774 -1088 -26723 25896 20940 -11827 18379 17756 -17267
756a7267J7201J7175j4403R027R718k2332o380J4539r145n544K6529k613k7800
$$ -17267 -66 17109 2706 11733 21451 -881 -7261 7278 -1867 -7411 19118 16505 -11295
769a1295J5908P157l3115J8434K9613l3572L733K8239m5083n222N3102l1255j8991
$$ -11295 4613 11770 -21345 -2911 26702 -6870 -3137 25102 -19981 -25203 27899 -3356 -22347
782b2347N5055l1036m3131N5649r225m4905N6653L525n7106M3062J0994o2905
$$ -22347 32708 1672 -41459 14190 4965 -39940 16713 20238 -36868 6194 17188 -45717
794d5717M1517L6328o2258K0000M0606o1968M329N5640m4465q618N4425l7978
$$ -45717 -4200 32128 -30130 -10130 30476 -31492 -27163 28477 -15988 -24606 29819 -8159
806h159k5384N2317k2993l2329N4157l937m2901L8400O309m7653L0091K6922m1922
$$ -8159 -33543 18774 -4219 -36548 17609 13672 -29229 9171 15480 -32173 -2082 24840 -17082
819a7082J1871L0450m0978k100M0577k5980j2848M2283j8613l0455L7694j759
$$ -17082 -5211 25239 -15739 -17839 22738 -3242 -16090 26193 7580 -22875 14819 13060
831A3060l5859L4257J5198m2038J7874K3999m0012Q637L5687l4562n671L8823
$$ 13060 -22799 11458 26656 -15382 2492 26491 -13521 -4884 30803 -3759 -9430 29393
843B9393k9274j9732M3501j3388k8477L8793k788l7057K9774Q239l7390K4653
$$ 29393 119 -19613 23888 10500 -17977 20816 18028 -19029 10745 18984 -18406 6247
855F247J7950l9373J4214K6739l7765Q14L4857k7213j0386L3344j9976j9287L1340
$$ 6247 24197 -15176 -962 25777 -11988 -11174 23683 -3530 -13916 19428 -548 -19835 11505
868A1505q942k0486K9797l856k9165K3862P362l0060J6354J5880k7659O781J9763
$$ 11505 2563 -17923 11874 8018 -21147 2715 10077 -19983 -3629 12251 -15408 -8627 11136
881A1136k3817m91K3132j8610o391K4813j4635j5093K4289m201j8190K0314K351
$$ 11136 -12681 -13172 9960 -8650 -15041 9772 -4863 -19956 4333 132 -18058 2256 4607
894D607k1104J4470Q735k1452R780J3915k1788M378K0003j9300l937K2911j3804
$$ 4607 -16497 -2027 6708 -14744 -4964 8951 -12837 -8459 11544 -7756 -11693 11218 -2586
907b586r996K3548q306j5888K1436k519j8200K0739K606k2656J6910R038k4029
$$ -2586 -12582 10966 2660 -13228 8208 5689 -12511 8228 10834 -11822 5088 14126 -9903
920i903J2012J4954k4179N164J9257j9785m86K0170j6735n016K0804j2744r346
$$ -9903 2109 17063 -7116 -1952 17305 -2480 -2966 17204 469 -4547 16257 3513 -5833
933e833K0261q319j3095J8680k194j5233J2884K436j3302Q495M405j1718M043
$$ -5833 14428 6109 -6986 11694 9500 -5733 7151 9587 -3715 4780 9185 -2533 1510
946A510O300q689J72P715n666m798O811J96p000K637M152p159K33P698p381l341
$$ 1510 7810 -879 -707 7008 1342 -3456 3355 3551 -3449 -812 3340 -3819 -3586 4112 -3269 -6610
962f610J0776p188p274J4829m664j3220J5304l02j5763J4561K624j8102J3803
$$ -6610 4166 -3022 -10296 4533 -131 -13351 1953 1651 -14112 449 3073 -15029 -1226
975a226N647k0024J2620R223k1965R925J3584k1172O767J4968k0347M483J6199
$$ -1226 4421 -15603 -2983 6240 -15725 -5800 7784 -13388 -6621 8347 -12000 -7517 8682
988H682j8624K246J6229j6525R12J5603j5027J28J5363j4626k66J5455j2703k119
$$ 8682 -9942 -7696 8533 -7992 -7080 8523 -6504 -6376 8987 -5639 -5905 9550 -3153 -5272
1002e272J3426j0052j26J0475j1077L015J0154j3895L633J1952j4405K473J0994
$$ -5272 8154 -1898 -2024 8451 -2626 389 10543 -3352 281 12233 -2172 301 11295
1015A1295j3268M672R717j6863O641J3026j9406L731J6026j7074O53J3650j4864
$$ 11295 -1973 2699 12416 -4447 2194 15220 -4186 -455 15571 -1503 -850 12800 -2064
1028b064L851J1885j8889N019J6493k0338n66J7915j4415k362J1407j1272M027
$$ -2064 1787 13672 -5217 -198 16295 -4043 -4609 13306 -1109 -3471 7936 -3336 691
1041F91Q093j7696P007J4830k0846Q44J7341j4936p59J0790j3548O317R487k0831
$$ 691 8784 -8912 -1905 12925 -7921 -7077 10264 -4672 -5431 5359 -8189 -1872 7615 -13216
1055a3216P310J6856k1348n2J6320j3062J540P759j4840J1473Q770k5120J1324
$$ -13216 -5906 10950 -10398 -10450 5870 -7192 -5652 2107 -12733 -1260 7510 -17610 -6286
1068f286J8691k5523L104J8471j8961N920J1718k4168J4346J8769l5006P916L1684
$$ -6286 12405 -13118 -10014 8457 -10504 -4584 7134 -17034 -2688 16081 -18925 -11009 20675
1081B0675l0726n432L0048j8926m819K1496k0350N95K6115k5083p871L2216j4487
$$ 20675 -10051 -15483 14565 -4361 -9180 12316 -8034 -7439 18676 -6407 -14278 17938 3451
1094C451j6757K1894k464q993R201q048K101J3176j5836k682J8209r109o956Q978
$$ 3451 -13306 8588 6124 -2869 6332 -1716 385 13561 -2275 -4957 13252 4143 -2813 6165
1108F165l832L358K386j3935J0219J1624k0680J232J6432j0996j964N415p331
$$ 6165 2333 5691 8077 -5858 4361 15985 -4695 -3463 12969 1973 9 5424 -1907
1121a907R269O83j8740J5508J0237k4748P931J3666j7548P364M769j9217J9244
$$ -1907 7362 8045 -10695 4813 15050 -9698 -1767 11899 -5649 1715 6484 -12733 6511
1134F511O749l3936J9791K1939l8907P373K9457l0436J411K4788k8438L839K8147
$$ 6511 13260 -20676 -885 21054 -17853 -10480 18977 -11459 -10048 14740 -13698 -9859 18288
1147A8288l2430l060L6394k4969j5538L2259j0916j5565K0251q260p506J8255
$$ 18288 -14142 -17202 19192 -5777 -21315 10944 28 -15537 4714 -3546 -11052 7203
1159G203j2787r000K1736o598j4071J4816N65q572M882j269J122N246q054j7Q376
$$ 7203 -5584 -14584 7152 554 -13517 1299 1864 -6708 -1826 -3095 -1973 3273 -4781 -4798 3578
1174C578m467k221K772J14M405m710n320J2788l757j1556J5453m70j3948J5973
$$ 3578 -889 -3110 -338 -224 4181 -529 -5849 6939 3182 -8374 7079 6609 -7339 8634
1188H634k914j7538K3606J18k8145K6099R092l6171J9718J9587l5057J3308K2968
$$ 8634 5720 -11818 11788 11906 -16239 9860 18952 -17219 2499 22086 -12971 337 23305
1201B3305l4357Q545K6357l4867L591L3101l0528o062L3738k3866j2674L0455
$$ 23305 -11052 -2507 23850 -11017 -7426 25675 -4853 -10915 22823 -1043 -13717 16738
1213A6738j4548j3157K5677j1547j5455K1753n752j4717J7850j114j3780J0576
$$ 16738 2190 -10967 14710 3163 -12292 9461 3709 -11008 6842 5728 -8052 2524
1225B524L92j0242O763K209n551L430R25l864r83J109K456j519j229M777m954
$$ 2524 2916 -7326 -563 1646 -3905 -475 450 -3414 -4397 -3288 -832 -2351 -3580 1197 -3757
1240c757m911R516l557o889J3559l303j2826J3913j090j5554J6751L849j9055
$$ -3757 -8668 848 -2709 -9598 3961 658 -12168 1745 655 -14899 1852 5701 -13354
1253a3354J4700M865k3066J5586J1522k3646J2411J4304k6359P198J7676k2965
$$ -13354 1346 6211 -16855 -1269 10253 -13393 -982 13322 -13037 -5839 11837 -11128
1265a1128O260K1095k3213J46K1727k2058l399K6317j6142q350K3183j3038j1774
$$ -11128 -4868 16227 -6986 -6840 14887 -7171 -10570 15747 -395 -8745 14438 1400 -10374
1278a0374K1011p357j0973K0509m757j5680J4453o71j4004J3453N535j2973N594
$$ -10374 10637 3280 -7693 12816 8059 -7621 6832 6161 -7843 5610 11145 -1828 3766
1291C766L913j1458L777P748o561P3P004n842n868O108J387n242N056M322r631
$$ 3766 7679 -3779 -2 7746 1185 1258 8262 2420 -3448 2660 4047 -1195 3861 8183 -1448
1306a448j321O888o942n20J1854p499p510J2937o172j1964J5899N96j5353J4534
$$ -1448 -2769 4119 -2823 -3343 8511 1012 -6498 6439 267 -11697 4202 4798 -10555 3979
1320C979L125k1315J1386R877j9269R869J4516k2655J739J7249j9209r84K2344
$$ 3979 7104 -14211 -2825 7052 -12217 -2348 12168 -10487 -8748 8501 -10708 -11692 10652
1333A0652j4617p783K0519j2391j3031K1636k995j4184J7831j264j9094J3350
$$ 10652 -3965 -11748 8771 -3620 -16651 4985 1990 -12194 5637 4373 -14721 -1371
1345a371N924j5208J0790R166j6881K692J1140j3122J23J4673p516n428J1328
$$ -1371 4553 -10655 135 9301 -7580 -4888 6252 -6870 -6747 7926 410 -5018 6310
1358F310n976q382J2367R48r581Q720L337j2876M517Q054r771J717J1280q949
$$ 6310 334 -8048 4319 5267 -4314 4406 7743 -5133 -616 7438 -2333 -616 10664 1715
1372A715m214J0093p431n618J4491k320j0317J0891o51j3474J0041O237j2393
$$ 1715 -2499 7594 163 -5455 9036 6716 -3601 7290 6639 -6835 3206 9443 -2950
1385b950O161P143j4393K232R975j1647J542J3576j1081n626J2141p857o953J4959
$$ -2950 3211 10354 -4039 -1807 8168 -3479 -1937 11639 558 -5068 7073 -784 -7737 7222
1399G222l308r938J0706j624j1871J0308L157j1936P346N824j3093K421Q108r589
$$ 7222 3914 -6024 4682 3058 -8813 1495 4652 -7284 62 5886 -7207 -4786 3322 -6267
1413f267J154J0242p999l440Q921o121n024J0556k015p625Q342N41r901N738M922
$$ -6267 -5113 5129 -2870 -6310 2611 -3510 -8534 2022 7 -7618 724 1265 -8636 -2898 2024
1428B024q236L535O027q785m89P759o209j332J0319m818n898R392k603q004R357
$$ 2024 -6212 -2677 3350 -5435 -5924 1835 -4374 -5706 4613 -205 -6103 3289 686 -7318 2039
1443B039J663r080O876L513j0709M964O989r588K831Q503j0204r52J0479p546
$$ 2039 3702 -5378 1498 5011 -5698 -734 6255 -3333 -502 8001 -2203 -3155 7324 -222
1457b22k920J1316n315n504J0068l890p313R673o54q620Q316J164r519N766M305
$$ -222 -3142 8174 2859 -2645 7423 3533 -3780 5893 5239 -3381 4935 6099 -3420 2346 6651
1472F651q061L576M701p473J084N019n759n03O467m014l130N456j874m866L961
$$ 6651 -1410 2166 6867 -606 478 5497 -262 -765 5702 1688 -1442 4014 2140 -2726 1235
1487A235J301m627J824K432m633J64M764l690j902N804k583m847N543l49o496
$$ 1235 2536 -2091 -267 2165 -2468 -2304 2460 -1230 -3132 2672 89 -4758 785 436 -6060
1502f060N745J860p510M545L344q839M021N366q992K340O976q768R96Q499q369
$$ -6060 -315 1545 -5965 -1420 1924 -6915 -2894 2472 -6520 -4180 2796 -5972 -4976 3523 -4846
1517d846l85R914q267k910J0780o891m964J0809m292n711R766k812o572R241j369
$$ -4846 -5231 4683 -3584 -6494 4286 -2605 -7569 3240 -1052 -6763 3003 191 -6381 2860 1491
1532A491p511Q318N18p573O228K134o199L939K402m968K374K245l887R64K186
$$ 1491 -6020 2298 2816 -4757 1471 3605 -2594 1345 3747 -1221 1153 3398 -489 475 2661
1547B661j292q88P86J904k56k780K551K119l958P34K597l117J316J571m520L929
$$ 2661 1369 481 1267 3171 2915 135 2686 4805 847 1581 4178 1061 2377 3948 -572 3357
1563C357J972p867L926N702r820J713P962q761O13Q300r015N3R800r827k448J1479
$$ 3357 5329 -2538 1388 7090 -2730 -1017 6945 -1816 -1203 7097 -1918 -1865 7935 -1892 -4340 7139
1579G139p829n019J0625n773m228R614o714m000J1609o944p343J2755k438r951
$$ 7139 -690 -5709 4916 -857 -5085 4529 -2185 -6185 5424 -1520 -8863 3892 1454 -8497
1593h497Q680J548o389M075q70k343N079m352l182P930l595m778O953j592l296
$$ -8497 183 1731 -4658 -583 -1453 -3796 1283 -3069 -6251 1679 -1916 -6694 259 -1333 -4629
1608d629N201k998j850O497m343l054P127k925k554N449m064K23O231p993p15
$$ -4629 572 -2426 -4276 2221 -2122 -5176 1951 -974 -3528 1921 -2143 -1920 4311 -3682 -4397
1623d397J0577p422n145J0724k638n065O601k536j068O112o934p74J0365q425
$$ -4397 6180 -1242 -6387 4337 1699 -3366 3235 699 -369 5743 -1191 -1965 8400 -25
1637b5m682J2436m815o426R357l127m854Q245m445m707R411l893n538Q600k411
$$ -25 -4707 7729 2914 -3512 5845 2718 -2136 6109 1664 -3043 6368 2475 -3063 5537 3126
1652C126m201P052m693k744R100p046n420J1603m275p929R256r92n488N790l236
$$ 3126 -1075 5977 1284 -1460 7640 594 -4826 6777 2502 -5427 3829 2837 -2651 3139 -97
1667i7k254P213o425l682J0823n191o787J0141k330o551P380k834m814P757m206
$$ -97 -2351 4862 -1563 -5245 5578 387 -6400 3741 1411 -5140 2240 -594 -5408 2349 -1857
1682a857n006Q949k964n901Q331k233n004P950l924m994R168l130p299R084L0
$$ -1857 -6863 2086 -878 -6779 1552 -681 -5685 2265 -1659 -6653 2515 -615 -7914 1170 1200
1697A200p438O011Q75m793M289j377l383N921k309m008O858j288m078N127r11
$$ 1200 -6238 -227 648 -4145 144 -1233 -4616 1305 -1004 -5012 1846 558 -3520 1607 696
1712F96k731M516k856j942N674l895k177O866l761k288O638m342k389P371m948
$$ 696 -2035 2481 -375 -2317 3357 -538 -2715 4151 390 -1898 4740 398 -1991 5380 432
1727D32k969Q324m162m175Q513l374m337P625l516m496P849l824n212R082l080
$$ 432 -2537 5787 1625 -2550 5963 2589 -1748 5877 2361 -2135 5714 1890 -3322 5760 2680
1742B680o158Q846j877p050Q391j338p410P692j86p630O593J613p676M842K471
$$ 2680 -3478 5368 3491 -3559 4832 3494 -3916 3776 3590 -4040 2553 4166 -3510 1332 3803
1757C803o925L254K613n572J646K663l849J169J947k380P62P50j409N07j51p82
$$ 3803 -3122 132 2745 -2827 -1181 1482 -2367 -1198 749 -1631 -869 -119 -1528 -1021 -1172 -1954
1773a954Q02j150N83J241k329P38K535l835N00L381m089J17M130l794R6M758m457
$$ -1954 -1152 -2302 -1719 -478 -2807 -2069 466 -3369 -2869 512 -3577 -3460 670 -3124 -3028 1730 -2727
1790b727k22N405n102q70O418n257j731P355m595k997Q341m157m700Q935k846
$$ -2727 -2949 2456 -2646 -3516 2902 -2355 -4086 3269 -1326 -4323 4018 -139 -4839 4096 1250
1805A250o303Q285o28p194P579J045p325N973K040p764M515L613p469K661M960
$$ 1250 -5053 3232 2604 -4590 2989 4034 -3291 2682 4722 -3042 1473 5086 -2383 278 5238
1820E238o256Q02N359m286j199M913k665k354L656j008k823L050R87l141J196
$$ 5238 -1018 -216 5143 857 -342 4571 1906 -448 3208 2200 -623 2427 3414 273 1469
1835A469J915l152l39K799k324j686L624j250l368M198L44m510L642J595n852
$$ 1469 3384 232 -107 2692 368 -1318 2306 1056 -2312 1886 2230 -2280 1362 2957 -2895
1850b895K615K848o033J826M930o177M25N804o188j325O861n046k974P881m098
$$ -2895 -280 2568 -3465 -1639 3291 -2886 -2461 3343 -2845 -4170 2691 -2355 -5329 2552 -1546
1865a546m630P933j869n685P463k96p066N522J428p456M659L424o993L344M401
$$ -1546 -6176 1757 -112 -5797 1666 1370 -5696 -174 1254 -6202 -1543 1881 -5112 -1768 2633
1880B633p054J237O102n776q27O652m047l218O336j630l550N396j96m819L860
$$ 2633 -4421 -3184 2918 -2858 -3685 2967 -1080 -4298 2038 408 -3142 2254 2058 -2761 1099
1895A099J341n473K717L659m913J248M626m831r00N556k850k444N715k296m861
$$ 1099 2440 -3033 -316 3343 -1570 -322 4304 -527 -1427 4129 1279 -1165 4550 2254 -2607
1910b607N884K75n900N347K446o943K813L527p129J840N749o214N25O286o222
$$ -2607 3277 3552 -2348 2999 5445 -1498 1315 4842 -2287 -447 5302 -912 -387 5899 -323
1925c23k131Q294m389m325Q083k802o820P119k79p068O502K126p948M071L516
$$ -323 -2454 5840 1451 -2874 5209 2407 -4413 2706 2427 -4641 1861 3987 -3961 110 3626
1940C626q465K645O223p000Q2O891o039k395P352l746l773P229k216o453O002
$$ 3626 -4839 -2194 4029 -2971 -2889 4002 -2037 -4432 2920 -826 -4599 2630 414 -6039 -37
1955c7M21o703N254L621o647J908M320o205K01O222m502j713O455l636l956O669
$$ -37 384 -6319 -1065 2556 -4091 -2183 2137 -4068 -3867 2355 -2147 -3860 2595 -1041 -4997 1672
1971A672j007n338N971Q80p039L819L008o232L282N159o420P83N828n981j039
$$ 1672 665 -4673 1298 2178 -4861 -1042 1966 -4266 -984 4175 -2245 -1462 4366 -1615 -2654
1986b654P266m485k796P541l459n004O848j026n201O432M15p110M905J835o389
$$ -2654 4612 127 -2669 4872 1413 -3591 3257 2231 -2970 3462 3877 -3233 1672 3507 -2882
2001b882M397L918o303J881M578o132O7N122m254r73N202l869k833M943j535l140
$$ -2882 1515 5433 -870 1011 5589 -543 -476 4646 392 -581 4621 752 -2081 2862 1327 -1813
2017a813M623k49m568L067R75m115K360K873m025Q43L280m258j421M442k723k190
$$ -1813 2810 2561 -2007 1060 2035 -2080 280 3153 -872 -29 3251 -1007 -2428 2014 -709 -2899
2033b899M401j548m321M553O33n028M320K030o207K804L372o544J570O036o372
$$ -2899 1502 -46 -4367 186 819 -4209 111 2141 -4066 -1262 2110 -4434 -2864 3172 -3200
2048c200l0O590o175k402Q160m559m283Q237k729n760P456n42n969O957P21p011
$$ -3200 -3230 3360 -2815 -5217 2943 -1616 -5899 2338 -391 -6151 1305 763 -5206 1751 2472 -4539
2064d539N337K004p704M298M021o778K276M833o047M68N261m374j186N268k690
$$ -4539 798 2802 -4902 -604 3417 -3361 -1085 3748 -2299 -1831 3430 -944 -2130 3138 448
2079D48k513M378j63l317L221J211l043R35J365k650L18K386k286r09L900j503
$$ 448 -2065 2313 2150 -1167 2054 3265 222 1157 2522 -128 190 2576 290 -619 3281 1778
2095A778l570M645O80n473L605L005o190J454M447n163N32N298n770q13O312n577
$$ 1778 -1792 2853 3533 -1940 1665 4670 -1520 -66 4381 -782 -250 5048 -722 -1535 4777 -800
2111h00k379P232m391l552P269l072m223P435k499n764P928j201p744O668J548
$$ -800 -3179 4053 -338 -3890 3379 307 -3916 3519 1020 -4744 3184 1983 -5761 907 2455
2126B455p364M223K821n866K899J988n322L316K004n556K572L680m742M67L880
$$ 2455 -4909 -686 2135 -3731 -832 1156 -4166 -850 1154 -4402 -1830 1850 -2892 -2425 1455
2141A455k804n74K197j630l47J247j128L1N96l4L21q66J005J316k048k32K791
$$ 1455 -1349 -1923 274 -1356 -1703 -456 -1584 -1553 -957 -991 -670 -1536 -531 785 -1263 -1495 1296
2158A296j676r13K434j346Q8J968k762M63L918m753o73O056m286k616O640k791
$$ 1296 -380 -1293 1141 -205 -117 1851 -911 -448 3470 -1283 -1956 4100 -186 -2802 3838 1047
2174A047l013O106k864l260O659l089m508P320j675o029O984m27o068N845K80
$$ 1047 -1966 4140 1276 -1984 4675 1586 -2922 4398 2723 -3306 3678 3251 -2817 3028 3308
2189C308o644N700J244p220M835K974o271K334L275m403J513J491l477J985Q91
$$ 3308 -3336 2364 3608 -3612 1223 4197 -2074 260 3535 -868 645 2136 -1341 644 1535
2204A535l796K532J368l661J700J355k847J764Q1k175K317j22k506K411J50k263
$$ 1535 -2261 271 1639 -2022 -322 1033 -1814 -50 31 -2144 173 51 -2455 -44 106 -2157
2220b157K370m40k352K832j330k139L446r64k857L817q37k486L779j334k565M839
$$ -2157 213 -227 -2579 253 -1077 -3216 230 -734 -3591 226 -611 -3097 682 -652 -3217 1622
2236A622k161l556N644j275m347N344J1n026M854M48n357M429J314n378L995J829
$$ 1622 -539 -4095 1549 274 -4073 1271 1282 -3744 1110 1558 -3799 630 1944 -3434 561 2390
2252B390n130L387K070m485K502J823m249K754J386m095K769J383l727K537J380
$$ 2390 -2740 647 2717 -1768 734 2557 -1692 1062 2448 -1647 1122 2505 -1222 1315 2695
2267B695l781K431J347l965K514J406l777K472J704l896K241J649l798J885J503
$$ 2695 -1086 1345 2692 -1273 1241 2647 -1130 1342 3046 -850 1391 3040 -758 1127 2630
2282B630l714J721J543l171J578J300k769J614P81k719J847N95k902K220N66l210
$$ 2630 -1084 637 2180 -991 587 1887 -882 732 1513 -1206 641 1236 -1666 554 1120 -2090
2298b090K672O31l204K256R05l826K018J555l550J505J934l223J354J712k716
$$ -2090 582 1213 -1991 265 1170 -2656 -638 917 -2633 -1128 806 -2417 -1063 649 -2067
2313b067R61J564k559Q86J280k104R48J149k134J414P38k083J502L81k123J988
$$ -2067 -1106 458 -2101 -1215 65 -2039 -1091 58 -2076 -662 76 -2007 -505 -124 -2247 -259
2329b59N16k467K276O52k768K414R89l301K058J523l373J704J844l205J372K163
$$ -259 257 -2210 66 718 -2050 364 1353 -1948 110 1633 -1740 -36 1808 -1397 -25 2138
2345B138k947P67K255k705L60K109k139L71J868j871K81J891j932%J896j855k75
$$ 2138 -809 -42 2213 -492 -132 1977 -162 209 2077 206 487 2378 446 446 2342 487 212
2362B12J714j235m80J496q46n83J312p28n76R47n18l38N36l14j0j42n4M23l12
$$ 212 1926 691 211 1707 861 278 1590 862 286 1233 715 377 913 599 589 447 393 816 504
2381E04n63K60l51l38O40p82r7J328r67j010J991n98j777J790k5j911J715l7j625
$$ 504 -59 201 -150 -488 152 -630 -727 601 -366 -1376 615 17 -1760 30 5 -1906 -191 -228 -1853
2400a853J750M0k411J930Q37k905J369J469k320O58J957k317O13J924k212j7K517
$$ -1853 -103 -63 -2474 -544 293 -2612 -1243 226 -2094 -1436 521 -1796 -1183 741 -1471 -1488 1029
2417A029k219p94K351q92j147K075m98j359K091n48j533K049K19k143J379J528
$$ 1029 -1190 -1984 367 -525 -1672 403 -95 -1454 637 89 -1444 605 824 -1319 60 1588
2433A588k092K16J892j017q62J550n15j204J600j72j652J833P06k296J189J622
$$ 1588 -504 -288 1604 587 -275 1275 760 -444 1156 984 -668 1165 1871 -425 764 2386
2449B386k232jK279k008n01K578j890j280L551j786k471L632l64l850K919J004
$$ 2386 154 153 2432 424 -77 2501 611 -669 2882 1096 -1375 2257 1893 -1957 962 1966
2465A966l525J929J961l643J538K080l343N62K968l366p17L595k516j546L152
$$ 1966 -1559 370 2331 -1312 226 2306 -1037 -475 2493 -873 -1590 2005 -511 -2057 1095
2480A095r49k240K702n24k434K191M37k682J710J479k744O46K271k253m37K194
$$ 1095 146 -2094 608 84 -2350 -159 278 -2404 -694 785 -1959 -1313 958 -1295 -1732 462
2496D62j412j149K148q41j613K189L71k467J867J288k960R79K241k731K60K774
$$ 462 -950 -2099 49 -792 -2405 -216 155 -2312 -445 843 -2117 -1138 1103 -1628 -1368 1406
2512A406k440n85L123j820j436L511j231k693L337j46l365L045R69l332K361J638
$$ 1406 -1034 -1619 1504 -316 -1752 1759 528 -2165 1172 1026 -2339 706 1675 -1657 704 2342
2528B342l730J714K218l324R19K813l376n0L140k431r94L540j915j690K965j225
$$ 2342 -1388 326 2544 -780 139 2952 -424 -474 2666 235 -759 2781 866 -824 2141 916
2544I16k099K801p4k145K175L44k517J231J220k270P15J595k165o25K396j395
$$ 916 -1183 1618 1544 -601 1574 1918 -599 632 1852 -418 297 1892 -273 -898 1498 103
2560A03j304K412k11k400J856N56k910J507J933k870M03K699l145o18L392k299
$$ 103 -1201 1211 1000 -1400 456 1012 -1898 -391 1542 -1328 -925 1774 -1371 -1989 1403 -896
2576h96j385L769k020k797M186r56l276M133J39m185L284J349m689K385K540m069
$$ -896 -2281 1488 -532 -3329 857 -99 -3375 758 897 -3288 -4 1345 -3344 -959 1581 -2488
2592b488J726K522m343J068L337l865K63M036l531j000L959k650j243M103j524
$$ -2488 -762 1760 -2583 -1515 1822 -2043 -1780 2256 -1275 -2275 1684 -966 -2209 1894 370
2607C70k176L404p74l038L164O56l049J694J573k338K7J975j197n55K023j062
$$ 370 -1806 1598 824 -2214 950 1606 -1443 251 1824 -514 -487 1488 291 -264 1759 697
2623F97j482K216n9k591K199J767l109L99K875l072p77L570k002j761L695j670
$$ 697 -785 1431 1372 -1219 980 2747 -362 37 2912 -160 -937 2633 631 -1130 2565 895
2639H95k696M167j025l381M236P3m434L419R69m660L233J788n002K835K643n941
$$ 895 -1801 2366 1341 -2040 2196 2269 -2165 1254 2223 -2437 796 2584 -2418 417 3060 -2881
2655b881J816M277n507L08M945m211j223M653l512j319M998l099k335M830j954
$$ -2881 -1065 3212 -2295 -1987 2958 -1253 -2476 2177 -1335 -2654 2344 -755 -3090 1740 -214
2670b14l398M385L2l731K647J125l240J397J502k218M16K272k134o92K258j48
$$ -214 -3612 773 805 -2926 -279 846 -2394 -997 505 -1713 -1297 975 -1159 -1851 407 259
2686B59k197J615J572k674K62K092j976k19K715k332q37L872k170k691M693m96
$$ 259 -1938 -323 1249 -1425 -1163 929 -1047 -1266 1449 -883 -1720 2152 -18 -2709 1984 1488
2702A488m185M198Q18n001L647J558m673L171K232n507K520L288n388J304M490
$$ 1488 -2697 1501 2319 -2682 965 2523 -2150 1021 3253 -2254 266 3554 -1834 -530 3960
2717C960m965L00M673m614n78M801l701j268N055l296k403M763j522l107L859
$$ 3960 -1005 -705 3968 -646 -1224 3577 -124 -1392 3663 367 -2036 2727 1205 -1902 1957
2732A957m39k854K656Kk639K055O20k509J112J341j719j84J218l71j031O72M56
$$ 1957 1518 -1336 1320 1322 -1317 738 1358 -1151 -39 1302 -417 -601 617 246 -785 -113 343
2749C43j157K02R29j043l51J667j177j252K390p57k194K794k31k560K425J88k665
$$ 343 -814 -612 317 -726 -1077 590 -587 -1839 551 -206 -2400 394 163 -2397 28 216 -2449
2766b449K216Q45l395K525J355l803K240J871m113K003K363m125J514L196m211
$$ -2449 -233 612 -2783 -258 1097 -2706 -466 1405 -2708 -705 1658 -2467 -953 2243 -1968
2781a968O75L971m414m6M454l483j005M402k795j757M080j747k515M188r05k876
$$ -1968 -1293 2678 -1736 -1782 2672 -811 -1816 2586 -209 -1966 2114 367 -2148 2040 1135 -1741
2797a741L170J47k706K027P20k123J085P98j445L94R02n57n21P24n8m59L8P54
$$ -1741 1429 1576 -1130 897 1617 -506 579 1377 -68 326 1228 671 150 874 816 357 395 1149
2815A149o65m16J185o00r35J585n80j449K044k24k108K047K01k790K399N98l340
$$ 1149 484 68 1253 653 -282 1303 723 -726 1318 1094 -1014 1033 1234 -1556 843 1441 -1899
2832a899K292J368l620J569K189l819Q77L159m014N48L360l619j53L848k963j474
$$ -1899 393 1761 -1859 -290 1899 -1920 -1043 2116 -1898 -1350 2010 -1609 -1762 2086 -877 -2351
2848b351L731k024j953L611j235k261L087o30k238K566l8k322J771O11j784R29
$$ -2351 1380 -644 -2597 1014 -221 -2482 605 -25 -2263 303 265 -2057 -286 325 -1459 -530
2864e30N23r79N78K66n91O66j24m50M83k45K10N16q08L04Q16r88L43O99p84M8
$$ -530 -7 -986 -408 -142 -733 -67 -191 -641 -158 -403 -193 323 -485 -181 635 -353 -10 689 -95 -47
2884d7R94r90K75Q94j330L78J282j530j01J708j478J08J303j398J32J652j797
$$ -47 947 -43 232 1126 -204 174 1456 -74 -175 1533 55 163 1466 68 200 1852 55
2901E5j6J900j662o59K202j396q47K046j213j032J955j029j072K126o17j695J724
$$ 55 39 1939 277 -382 1820 424 -423 1623 410 -622 1333 304 -768 1358 741 -954 770
2918G70j8j444J125m2r17J010m60p18J196m54q86Q73k64n34O35l32j85R21q00
$$ 770 752 -692 433 391 -526 484 24 -694 502 48 -838 35 -229 -763 -128 -460 -645 276 -524
2937e24p78J524o80q43J146k30p21R98o07o19J296m48r43J319j09j091P94L74
$$ -524 -1302 222 -458 -1301 -155 -385 -1106 -108 -715 -1334 -38 -486 -1429 -110 -219 -1310 -516 -142
2955a42o74O02p1n47P77m7q41Q02L49r54P89K45m71K99k4j75N48j88m21M95K74
$$ -142 -816 -214 -285 -832 -55 -102 -943 -141 208 -746 43 288 -183 116 92 -83 465 277 -144 351 625
2976F25m31L13r8L6K48m61K28M79o09k6O70o42NO77q13K14R71j247oJ186j038
$$ 625 194 507 409 445 693 232 460 939 330 304 974 332 337 1014 201 415 1386 139 133 1319 281
2997B81m21J319o15r87J659p61r27J533p38j329J908m26j744J859J79j811J158
$$ 281 -140 1179 564 -423 1236 475 -452 1081 343 -986 922 496 -1248 611 790 -1021 137
3014A37O28j820R31Q43j847P95J150j906J2J688j220o65J609p07r77J335k84r37
$$ 137 765 -1055 -124 719 -1128 -333 817 -1089 -1077 611 -609 -1274 335 -372 -1349 -14 -298 -1235
3032a235R29K1r22P90M83j055J56R96q72l59J070k81q30R49j5r87J159N23j723
$$ -1235 -306 -285 -1207 -417 66 -989 -833 163 -709 -1068 2 -279 -1109 -160 -175 -1162 -3 520 -1203
3051a203J048Q34j703P29J254j752K36J844j657k41K068j639o82K644j463j579
$$ -1203 -155 679 -1024 -295 959 -793 -557 1287 -370 -611 1457 -182 -864 1780 317 -1262
3067a262K898p26k180K707n8k617K335P74k913J522J571k892Q48K300k427j70
$$ -1262 1636 910 -1270 1437 1379 -1238 1097 1871 -1042 480 2051 -841 7 2307 -120 -290
3083b90K386k129n79K443j234j401K170n18j784J837M4j749J156Q43j932O54J197
$$ -290 2096 -33 -612 1831 597 -804 1366 848 -936 901 945 -804 352 1195 -737 -83 1114
3100A114j662OJ752j418q78J778o43j381J654K8j905J757N19k397J424J505l039
$$ 1114 -548 -542 1210 -208 -1086 692 49 -1332 322 350 -1555 202 721 -1676 -252 1253 -1786
3117a786Q65K169k709J02K510k184q68L045j844j443L214j201k299L313k30l217
$$ -1786 -921 1248 -1461 -1359 1151 -1033 -1901 1144 -700 -2143 1071 -130 -2429 884 654 -2563
3133b563L016M75k997K011J065k657J413J422k515P45K022k516M5K531j867p26
$$ -2563 453 928 -2069 -58 1007 -1650 -237 1185 -1330 -585 1437 -1079 -1034 1497 -370 -1096
3149a096K328j209q00J792o12j256J845l23j747J873O59k130Q62J275j517o9J735
$$ -1096 1232 23 -777 1015 403 -853 992 669 -1078 795 1454 -676 186 1461 -56 -125 1610
3166A610j419o29K102j130j312K423m13k509K604O96l434J720K001l239N32K692
$$ 1610 191 -438 1664 534 -778 1645 1232 -1277 1327 2023 -1411 309 2310 -929 -397 2295
3182B295l010n1L330l176r82M157k376k499M335j274l235L645p2l282K962M59
$$ 2295 -715 -766 2564 -612 -1594 2563 187 -2312 2023 749 -2486 1159 1087 -2195 767 1226
3198A226l510K408J231l726J963K253l521O21K620k837k11K812k190n21K513j906
$$ 1226 -2284 124 1355 -2371 -408 1845 -1676 -1055 1565 -1272 -1483 1329 -861 -1382 1131 -775
3214g75j396K880n81k404K341Q05k647J137J523k047%K130j612r12K466r56j970
$$ -775 -2171 709 128 -2276 65 870 -1777 -640 883 -1164 -1164 966 -646 -1558 908 -48 -2018
3231b018K885Q2k909K198J508l331J178K303k977L28L059l006o04L691k646j330
$$ -2018 867 949 -1960 238 1746 -1585 -407 1896 -1081 -753 2306 -700 -1304 2387 -259 -1589
3247a589L945j618k313L386r65k443L250l51k735L035ll274K668J068l551K060
$$ -1589 2356 738 -1575 1811 846 -1597 1653 1302 -1433 1602 1599 -1675 993 2061 -1490 570
3263E70J683l427J530J632k848O95K320k540k30K473k039q65K495j036j491J985
$$ 570 2253 -1174 356 1988 -860 -165 2155 -385 -615 1858 -181 -1046 1449 413 -1078 907
3279I07l32j589J203P10j812O55J245j558l03J740q88j346J692J47j913J232P73
$$ 907 575 -1014 189 899 -913 -258 987 -571 -874 866 -22 -1368 324 471 -1442 -210 563
3296E63k256J101J550k341K74K308k324m30K780k183q17K945j740j408L252j484
$$ 563 -1693 -592 958 -1383 -1109 1199 -1125 -1555 1225 -958 -1775 1170 -570 -1978 1274 -210
3312b10j936L406j090k539L250j95l316L159N19l303K642J155l521J801K163l564
$$ -210 -2146 1260 170 -2369 881 686 -2630 529 1048 -2255 387 1542 -1979 -178 1985 -1579
3328a579R38K685l037J74K823k413p70K733j234j345K236n24j575J639L78j615
$$ -1579 -641 2044 -993 -819 2004 -409 -1179 1554 320 -1025 1211 687 -888 751 1129 -486
3344d86Q37P76j074N0J083o77r60J242K79j469Q26R70j935P20J335j847K4J759
$$ -486 351 1127 53 103 1186 509 -451 791 1070 -399 427 1397 -538 182 1517 -330 -306 1453
3362A453j497n23K060j606q79K548j298j446K484j052j934K843o75k411K780K7
$$ 1453 -44 -567 1493 -113 -992 1556 258 -1188 1296 244 -1690 1153 478 -1933 847 874
3378H74k948K552N79l289K081J449l107J517J491k932R16K151k655K48K425k341
$$ 874 -2074 478 1057 -2232 -151 1298 -1809 -292 1199 -1733 -817 1334 -1321 -1073 1352 -989
3394i89n28K325j389r90J979p18j001J417l1j266J087L28r39K10P98o97k72Q37
$$ -989 -1517 808 -581 -1571 408 -310 -1311 106 75 -1191 -104 224 -715 -505 293 -404 -676 161
3412A61r6n27M27K33p57M15N14q79L70J246j236m44J887j217p21J888p33j283
$$ 161 65 -462 -35 198 -559 -144 370 -509 -139 1107 -129 -573 1314 97 -624 1264 531 -752
3430g52K034r27j295K236o12j652K255N5k366J842P71k511J625R18k451J229J479
$$ -752 1282 355 -940 1296 684 -968 1287 1342 -1024 818 1589 -922 703 1621 -830 399 1878
3447A878k561N10K137k365r0K036j647o57J953r39j052J798p18j200J559j06j558
$$ 1878 -683 -173 1964 -401 -491 1545 -102 -759 1194 255 -797 1001 283 -917 642 536 -1022
3464a022J153L36r48J95M36n35r7L87%l06J84K44q05L40M32n52k82J138n47p90
$$ -1022 131 467 -481 -286 150 -385 -482 -95 -95 -401 -217 27 -778 -438 -6 -558 -840 298 -249 -1039
3484a039J012j14q35R39k50p12J054k07j184J393K47j611J172K69j118Q27O06
$$ -1039 -27 -141 -976 -37 -287 -999 55 -152 -1336 57 304 -1307 -135 134 -984 -157 449
3501D49j087L88Q20j308O40J072j752K54J578j378k00J295q48k29J262q46m65
$$ 449 -638 -250 570 -738 -98 974 -778 -524 1054 -324 -524 771 -77 -306 956 110 -355
3518c55J321p41o23J133k94n44P45k41q6K53k8n07M67n8l01L60k57JK08j27R9
$$ -355 966 225 -398 735 441 -103 642 401 315 568 540 33 500 442 141 501 244 245 453 326 425
3539D25Q9m61L58K57o00J53K55m33J52J40l87J42Q2m96J6N63o78K12N92o85J14
$$ 425 514 53 411 668 68 221 476 43 195 335 -52 90 172 -324 -308 255 -423 -211 381 -304 -190
3560a90L37n04%N42o72q4P27r15J43M94n18l1Q67o28k65N40k56l32P41l87k71
$$ -190 147 -357 -357 185 -487 -571 156 -759 -616 -122 -640 -671 196 -432 -697 -157 -413 -745 -4 -391 -662
3581f62L84j50J31K77n24L09J68n68K27L93o13K75O39p43K64Q47r35L9R05q35
$$ -662 -278 -428 -297 -20 -544 -235 -67 -635 -408 -15 -628 -353 286 -457 -193 654 -281 -242 663 -172
3601a72j6P26p33J93Q27q27j00R15o67n27R91l76j69O68m64j46P05k42m91N86
$$ -172 -188 538 -195 -2 825 -2 -102 813 146 -381 610 234 65 733 269 123 828 586 95 681
3621F81l8o95N81P6o48M28J57n51L94K90n07k29N69j37p39N05L82n00j59Q70m93
$$ 681 643 -52 529 605 -43 385 542 -9 385 675 168 -61 508 371 -368 137 519 19 -140 730 237
3642B37n03N56r2r06P09N0j084J142J28j195Q46O97j480M49R55j384K18J096j445
$$ 237 -266 290 198 -708 1 51 -1033 109 237 -958 -112 585 -895 -446 509 -875 -657 439 -1006
3661a006L84J085j235k16J411j078m51J454p40n61J222p46n13J665r03r87J705
$$ -1006 -622 463 -772 -988 423 -655 -1106 348 -392 -953 269 -477 -990 675 -228 -1215 490
3678D90k87j661J721M20j694P97R42j373K65J013j034QJ126o76n47J135n3r03
$$ 490 203 -1458 263 683 -1011 -214 728 -645 -380 633 -401 -393 733 57 -490 645 592 -311
3696c11N84O88j203L35Q36r90p4J111j103l65J614m65j552J913J4j839J390O30
$$ -311 273 961 -242 93 929 -61 -135 976 -127 -492 1122 657 -895 1018 1032 -807 583 1213
3714A213j776J007P00j883J143R71k278J145J449k511M60K039k297k36K320j818
$$ 1213 -563 444 1144 -739 404 1375 -903 242 1691 -820 -360 1679 -618 -854 1466 -352
3730c52o80K547j626j306K647j119j831K399q9k371J853M77j997J224Q66j805
$$ -352 -1032 1515 -111 -1417 1230 111 -1720 679 590 -1781 72 549 -1448 -224 642 -1163
3746a163L79J726k082k9J957j056j080J596m0j391J168L84j557P44Q77j542M97
$$ -1163 -784 942 -1140 -1169 788 -268 -1348 248 208 -1183 -15 369 -1188 -444 433 -1109 -612
3763f12J287j511l71K165j107j136K060o17j601K188l79j860K227K10k447K036
$$ -612 675 -836 -1207 958 -149 -1285 775 158 -1443 745 366 -1494 733 943 -1504 532
3779E32R98l168J560J826l139J055K451l129L71K850k619p88L485k064j820L613
$$ 532 1530 -1638 -78 1748 -1391 -336 2115 -1014 -643 2207 -412 -1200 2285 221 -1599 2014
3795B014j327k300L235l14k868K695M29l071K264R57k900J232J857k424K14K096
$$ 2014 687 -1613 1622 1308 -1560 1135 1564 -1507 757 1714 -1186 46 1903 -521 -307 1789
3811A789j794o33K000j208j017J697k62j610J537M20k067J124J118j867J73J593
$$ 1789 -5 -638 1362 154 -863 834 572 -1038 499 919 -1148 -24 1094 -773 -600 993
3827I93j564o24K328j434j262K591q38j890K564l10k557K176P96l172J842J671
$$ 993 -571 -1195 1133 -301 -1563 1028 190 -1700 864 554 -2003 173 969 -2203 -361 1310
3843A310l135R44K565l342K36L172l032n55L507k309j416L758j760k038L255n32
$$ 1310 -1825 -881 1684 -1658 -1422 1750 -1282 -1837 1670 -639 -2055 1703 -57 -2095 1160 628
3859F28k953L112J09k995K408J086l056J759J605l160J215J957k481Q0K248j828
$$ 628 -2325 787 896 -2099 309 1395 -1661 98 1703 -1457 -242 1715 -766 -686 1562 -266
3875b66m00K157j195j282K200n14j751K025K18k092J044J302j871L23J794j746
$$ -266 -666 1491 296 -986 1214 700 -1051 974 1192 -900 144 1446 -425 -102 1692 -54
3891e4m13J922j276q52K051q65j633K216k6k394K068N99k498J378J301k644P99
$$ -54 -467 1455 179 -673 1378 513 -1120 1096 1070 -1324 744 1343 -1155 223 1524 -1120 -321
3908c21J977k670M14K493k672l39K809k085j263L046j450j781L028j127k114L082
$$ -321 1656 -1014 -600 1893 -779 -1118 1691 -394 -1657 1389 -61 -1842 1186 59 -2055 1027
3924A027m40k749K654N68l377K256J597l287R55K368k902J00K709k295o86K543
$$ 1027 587 -2162 492 1060 -2317 -61 1536 -1751 -796 1572 -1330 -1230 1479 -816 -1502 1041
3940A041j273j640K550j19k449K070O93k482J442J439k588O95K110k355k72K581
$$ 1041 -232 -1872 678 559 -1890 180 873 -1609 -167 1272 -1316 -621 1489 -866 -1138 1443
3956A443j447j644K884n10k285K321L13k460J681J193k820J521J760k845P97K285
$$ 1443 -4 -1648 1236 726 -1559 762 1075 -1385 296 1489 -1331 190 1950 -895 -98 2187
3972B187k697k88K912k245r06K770j265j624K849q91k230K871k84k636K144Q48
$$ 2187 -510 -798 2114 -131 -1037 1733 468 -1156 1693 802 -1428 1443 1159 -1477 667 1515
3988A515k624J432J167k398R00J632k438M13K004k164o22K326j086j289K013k15
$$ 1515 -1109 323 1490 -908 -8 1624 -814 -401 1603 -561 -1183 1143 57 -1232 781 566
4004E66j511J178L25j627R43P22j571M49J336j421l95J690j156p10J631n01j113
$$ 566 -945 233 558 -1069 -126 596 -975 -526 810 -611 -1006 684 -472 -1182 449 -52 -1165
4021a165J263q9j223J183L90j614R48J057j860M86J436j606J04J374j484J17J526
$$ -1165 98 9 -1214 -31 359 -1255 -307 750 -1110 -624 812 -794 -690 684 -800 -683 843
4038H43j452k90J817j226q29J863m64j408J876j07j583J718j7j812J476O73j999
$$ 843 -609 -899 918 -308 -1137 726 262 -1146 730 623 -960 758 741 -1071 405 1078 -921
4055i21J095J150j875L67J444j294l76J664j079o28J540n97j166J498p3j079P52
$$ -921 174 1324 -551 -184 1260 -34 -410 1254 175 -453 1087 490 -676 822 749 -330 422
4072D22N25j361N64P22r33p1R73o73p20J231k92p45R78r4j078P16L42j023L16
$$ 422 947 -414 150 872 -61 -132 841 168 -552 679 387 -358 620 526 -552 164 506 -517 -201
4091b01P33r74K60P02j008r6J261j151k78J374q02q04J551q93q20J796n42j242
$$ -201 532 -442 -182 520 -488 -584 677 -474 -752 622 -180 -984 567 -326 -1146 650 108 -1134
4109a134J263J86j420J108K82j643J274L37j336O46Q06j222K48J067j011n2J082
$$ -1134 129 315 -1105 3 285 -1358 -84 253 -1083 -437 369 -853 -605 462 -549 -601 481
4126D81n54n54Q68j71o45N55k4m97K69P39l36n62N29K49k59nK53k46P1J78l05
$$ 481 -73 -627 241 70 -575 -20 -44 -541 -272 467 131 -431 98 347 88 83 336 90 161 339 34
4147C4P4L88m37J85K67l05p9M83l34k30N18m14l7P57n76k60P21l64l79N39j50
$$ 34 108 496 59 244 511 206 127 610 276 46 564 150 113 870 294 34 755 391 12 551 401
4168D01n54N86j83n25Q82k57o90O13K46j021L33P14n52k32L73m03K54Q5m66M79
$$ 401 -153 433 250 -275 607 350 -340 273 519 -502 -169 545 -7 -239 134 -269 -15 70 -396 83
4188H3l0n48K08J48k01K59j44j33K94j48n25M15K02m32J15L09l79J63L4k95O04
$$ 83 53 -495 -287 -139 -340 -81 -225 -358 -64 -212 -737 -322 -120 -552 -437 -128 -507 -344 -310 -605 -1
4209aj75n52L77K68l46j8K54N6j35K29k71N04J5p69O47J23m32J79J95m00L45K75
$$ -1 -176 -728 -351 -83 -429 -447 -193 -137 -272 -43 -314 190 205 -564 83 206 -226 -47 148 -252 93 368
4231C68m68M62J5l14L6K68k60JO6R3L31n34j05P49l12m61N37j91k01L81k92k18
$$ 368 -100 362 377 63 99 367 107 108 174 267 598 64 -41 708 396 -65 472 281 80 461 169 -49
4253d9P86l01p64R08Mj029P38K46q63M23M69p18M21J72q87K99O43p21O6N35o26
$$ -49 737 436 -328 580 584 -445 293 539 -324 99 568 -150 271 443 -444 -145 498 -223 -157 378 -248
4274b48l5M54o42M11L38o00j9M11m57l05Q44m95k05L93j03l32N05j30l75L22J94
$$ -248 -283 171 -471 -60 278 -322 -341 70 -387 -692 152 -343 -548 -155 -258 -590 -85 -215 -590 -268 -74
4295g4m66K6M08o4l98M55J92o61K47M29m25k7R56j078K8J060p18n47J265l97q80
$$ -74 -540 -514 -106 -170 -568 -113 79 -582 -335 94 -331 -358 598 -480 -452 608 -110 -657 608 211 -669
4316f69R68J83j029Q10J21q93J031K55j356R20M07j162O52P61j297L59P77r67
$$ -669 299 482 -547 263 384 -509 522 777 -579 341 748 -414 238 999 -298 61 838 -129
4334a29K20Q81j142K43R93q88l60J155p61m88R09j91p11P18L0q76N01N93r49J58
$$ -129 91 972 -170 73 1066 178 -182 973 212 -276 633 442 -269 449 479 -397 104 697 -252 -94
4354i4O48m99k21N19l20n28O98j3p19N00M83j060J85J016q40n20J288r23l24J263
$$ -94 554 55 -166 353 33 -495 203 190 -529 -29 454 -606 -421 595 -245 -765 523 -400 -724 539
4374E39p51p82J341k97j006J072K8j332J132M13j451R92M65j335N64J038j512
$$ 539 -212 -994 347 50 -956 116 144 -1188 -56 357 -1094 -102 363 -972 -408 630 -882
4391h82M77R91j174P2J200j181k31J378j024j86J210p83o33J313k98r76J070P9
$$ -882 -405 586 -588 -516 684 -497 -728 650 -374 -560 650 -133 -766 547 249 -727 343 422
4409D22j013Q01M30j022N44O07r15K18M94m72k16P63l27n89O55J94q05P86K90
$$ 422 -591 210 640 -382 162 769 -146 72 566 94 -122 641 314 -275 380 574 -231 555 845
4428H45j167L81Q27j054Q9J051r10m13J416q35q49J442l46j070J224k5j615J478
$$ 845 -322 59 886 -168 -79 972 62 -351 1065 230 -619 823 477 -593 631 606 -1009 469
4446D69L29j851J282N63j735P10R67j573N06J475j843R6J360j305m46J761j048
$$ 469 798 -1053 229 792 -943 -233 734 -839 -333 1142 -701 -605 755 -550 -996 765 -283
4463b83q47J478k00j258J218K86j684J159N02j363N45R63j316K82R32r22k09J057
$$ -283 -1130 348 148 -1110 108 394 -1290 -131 371 -992 -447 516 -800 -518 414 -508 -717 340
4481C40m25p59J042p9j005J052K56j274O33Q52j191J63J067q24n61J483p51m81
$$ 340 -85 -844 198 119 -886 166 422 -852 -219 633 -558 -395 672 -152 -713 770 19 -462
4499d62J214l96j011J309o6j434J395M33j607Q56Q21j533O33R61j416J77J535
$$ -462 752 356 -655 654 588 -846 549 982 -625 231 1052 -481 152 1113 -303 -126 1409
$$ [...]
8191a28
##END NTUPLES=NMR FID
##END=
