##TITLE=1H_CPA2806
 D2O, 8 sc, 
 29.06.2021
##JCAMPDX= 6.0         $$ Bruker NMR JCAMP-DX V2.0
##DATA TYPE= NMR FID
##DATA CLASS= NTUPLES
##ORIGIN= UXNMR, Bruker Analytische Messtechnik GmbH
##OWNER= root
$$ XWIN-NMR		Version 3.5
$$ Tue Jun 29 09:20:34 2021 Russian Standard Time (UT+4h)  she@DPX200
##.OBSERVE FREQUENCY= 200.131506
##.OBSERVE NUCLEUS= ^1H
##.DELAY= (6, 6)
##.ACQUISITION MODE= SIMULTANEOUS
##.ACQUISITION SCHEME= undefined
##.AVERAGES= 8
##.DIGITISER RES= 18
##SPECTROMETER/DATA SYSTEM= spect
##.PULSE SEQUENCE= zg30
##.SOLVENT NAME= CDCl3
##.SHIFT REFERENCE= (INTERNAL, CDCl3, 0, 15.7039)
##AUDIT TRAIL= $$ (NUMBER, WHEN, WHO, WHERE, WHAT)
$$ ##TITLE= Audit trail, XWIN-NMR		Version 3.5
$$ ##JCAMPDX= 5.01
$$ ##ORIGIN= Bruker BioSpin GmbH
$$ ##OWNER= she
$$ F:/spectra/data/she/nmr/H-F/1/audita.txt
$$ ##AUDIT TRAIL=  $$ (NUMBER, WHEN, WHO, WHERE, WHAT)
(   1,<2021-06-29 09:19:26.87 +0400>,<she>,<DPX200>,
      <created by zg, POWCHK disabled, PULCHK disabled
       configuration hash MD5:
       00 E9 B6 7A A2 85 ED C7 34 08 36 98 17 FE 4E 26
       data hash MD5: 16K
       09 9D 4A A9 04 94 8F 34 6E 2C 24 40 F2 16 84 CA>)
$$ ##END=
$$ 
$$ hash MD5
$$ 2E 0D F2 9F 43 C6 9A 36 DA C8 37 67 BA 8A 55 96
##$RELAX= 
##$RELAX= 
##$RELAX= 
##$RELAX= 
##$RELAX= 
##$RELAX= 
$$ Bruker specific parameters
$$ --------------------------
##$DU= <F:/spectra>
##$EXPNO= 1
##$NAME= <H-F>
##$PROCNO= 1
##$TYPE= <nmr>
##$USER= <she>
##$AMP= (0..31)
100 100 100 100 100 100 100 100 100 100 100 100 100 100 100 100 100 100 
100 100 100 100 100 100 100 100 100 100 100 100 100 100 
##$AQSEQ= 0
##$AQ_mod= 1
##$AUNM= <au_zg>
##$AUTOPOS= <>
##$BF1= 200.13
##$BF2= 200.13
##$BF3= 200.13
##$BF4= 200.13
##$BF5= 200.13
##$BF6= 200.13
##$BF7= 200.13
##$BF8= 200.13
##$BYTORDA= 1
##$CFDGTYP= 0
##$CFRGTYP= 5
##$CHEMSTR= <none>
##$CNST= (0..31)
1 1 145 1 1 1 1 1 1 1 1 1 1 1 1 1 1 1 1 1 1 1 1 1 1 1 1 1 1 1 1 1 
##$CPDPRG= <>
##$CPDPRG1= <>
##$CPDPRG2= <>
##$CPDPRG3= <>
##$CPDPRG4= <mlev>
##$CPDPRG5= <mlev>
##$CPDPRG6= <mlev>
##$CPDPRG7= <mlev>
##$CPDPRG8= <mlev>
##$CPDPRGB= <>
##$CPDPRGT= <>
##$D= (0..31)
0 1.2 0 0 0 0 0 0 0 0.06 0 0.03 0 0 0 0 0.0002 0 0 0 0 0 0 0 0 0 0 0 0 
0 0 0 
##$DATE= 1624943966
##$DBL= (0..7)
120 120 120 120 120 120 120 120 
##$DBP= (0..7)
150 150 150 150 150 150 150 150 
##$DBP07= 0
##$DBPNAM0= <>
##$DBPNAM1= <>
##$DBPNAM2= <>
##$DBPNAM3= <>
##$DBPNAM4= <>
##$DBPNAM5= <>
##$DBPNAM6= <>
##$DBPNAM7= <>
##$DBPOAL= (0..7)
0.5 0.5 0.5 0.5 0.5 0.5 0.5 0.5 
##$DBPOFFS= (0..7)
0 0 0 0 0 0 0 0 
##$DE= 6
##$DECBNUC= <off>
##$DECIM= 32
##$DECNUC= <off>
##$DECSTAT= 4
##$DIGMOD= 1
##$DIGTYP= 9
##$DL= (0..7)
0 120 120 120 120 120 120 120 
##$DP= (0..7)
150 150 150 150 150 150 150 150 
##$DP07= 0
##$DPNAME0= <>
##$DPNAME1= <>
##$DPNAME2= <>
##$DPNAME3= <>
##$DPNAME4= <>
##$DPNAME5= <>
##$DPNAME6= <>
##$DPNAME7= <>
##$DPOAL= (0..7)
0.5 0.5 0.5 0.5 0.5 0.5 0.5 0.5 
##$DPOFFS= (0..7)
0 0 0 0 0 0 0 0 
##$DQDMODE= 0
##$DR= 18
##$DS= 0
##$DSLIST= <SSSSSSSSSSSSSSS>
$$ [...]
##$SUBNAM2= <"">
##$SUBNAM3= <"">
##$SUBNAM4= <"">
##$SUBNAM5= <"">
##$SUBNAM6= <"">
##$SUBNAM7= <"">
##$SUBNAM8= <"">
##$SUBNAM9= <"">
##$SW= 20.0188882624521
##$SWIBOX= (0..15)
0 0 2 0 0 0 0 0 0 0 0 0 0 0 0 0 
##$SW_h= 4006.41025641026
##$TD= 16384
##$TD0= 1
##$TE= 0
##$TE2= 300
##$TE3= 300
##$TEG= 300
##$TL= (0..7)
0 120 120 120 120 120 120 120 
##$TP= (0..7)
150 150 150 150 150 150 150 150 
##$TP07= 0
##$TPNAME0= <>
##$TPNAME1= <>
##$TPNAME2= <>
##$TPNAME3= <>
##$TPNAME4= <>
##$TPNAME5= <>
##$TPNAME6= <>
##$TPNAME7= <>
##$TPOAL= (0..7)
0.5 0.5 0.5 0.5 0.5 0.5 0.5 0.5 
##$TPOFFS= (0..7)
0 0 0 0 0 0 0 0 
##$TUNHIN= 0
##$TUNHOUT= 0
##$TUNXOUT= 0
##$USERA1= <user>
##$USERA2= <user>
##$USERA3= <user>
##$USERA4= <user>
##$USERA5= <user>
##$V9= 5
##$VALIST= <valist>
##$VCLIST= <CCCCCCCCCCCCCCC>
##$VD= 0
##$VDLIST= <DDDDDDDDDDDDDDD>
##$VPLIST= <PPPPPPPPPPPPPPP>
##$VTLIST= <TTTTTTTTTTTTTTT>
##$WBST= 1024
##$WBSW= 4
##$XGAIN= (0..3)
0 0 0 0 
##$XL= 0
##$YL= 0
##$YMAX_a= 375011
##$YMIN_a= -365585
##$ZGOPTNS= <>
##$ZL1= 120
##$ZL2= 120
##$ZL3= 120
##$ZL4= 120
##$ABSF1= 10
##$ABSF2= 0
##$ABSG= 5
##$ABSL= 3
##$ALPHA= 0
##$AQORDER= 0
##$ASSFAC= 0
##$ASSFACI= 0
##$ASSFACX= 0
##$ASSWID= 0
##$AUNMP= <proc_1d>
##$AZFE= 0.1
##$AZFW= 0.1
##$BCFW= 1
##$BC_mod= 2
##$BYTORDP= 1
##$COROFFS= 0
##$CY= 11.3945322036743
##$DATMOD= 1
##$DC= 2
##$DFILT= <>
##$DTYPP= 0
##$F1P= 15.9154993809931
##$F2P= -4.1035820241983
##$FCOR= 0.5
##$FTSIZE= 0
##$FT_mod= 4
##$GAMMA= 1
##$GB= 0.15
##$INTBC= 1
##$INTSCL= 1
##$ISEN= 128
##$LB= 0.24
##$LEV0= 0
##$LPBIN= 0
##$MAXI= 10000
##$MC2= 0
##$MEAN= 0
##$ME_mod= 0
##$MI= 1.114404
##$NCOEF= 0
##$NC_proc= 0
##$NLEV= 6
##$NOISF1= 3.799351
##$NOISF2= 2.8
##$NSP= 1
##$NTH_PI= 0
##$NZP= 0
##$OFFSET= 15.70392
##$PC= 1
##$PHC0= -11731.42
##$PHC1= 7.80101
##$PH_mod= 1
##$PKNL= yes
##$PPARMOD= 0
##$PSCAL= 0
##$PSIGN= 0
##$REVERSE= no
##$SF= 200.130013532006
##$SI= 16384
##$SIGF1= 3
##$SIGF2= 2
##$SINO= 400
##$SIOLD= 16384
##$SREGLST= <1H.CDCl3>
##$SSB= 0
##$STSI= 0
##$STSR= 0
##$SW_p= 3612.71676300578
##$SYMM= 0
##$S_DEV= 0
##$TDeff= 0
##$TDoff= 0
##$TI= <>
##$TILT= no
##$TM1= 0
##$TM2= 0
##$TOPLEV= 0
##$USERP1= <user>
##$USERP2= <user>
##$USERP3= <user>
##$USERP4= <user>
##$USERP5= <user>
##$WDW= 1
##$XDIM= 8192
##$YMAX_p= 0
##$YMIN_p= 0
$$ End of Bruker specific parameters
$$ ---------------------------------
##NTUPLES= NMR FID
##VAR_NAME=  TIME,          FID/REAL,        FID/IMAG
##SYMBOL=    X,             R,               I
##VAR_TYPE=  INDEPENDENT,   DEPENDENT,       DEPENDENT
##VAR_FORM=  AFFN,          ASDF,            ASDF
##VAR_DIM=   8192,          8192,            8192
##UNITS=     SECONDS,       ARBITRARY UNITS, ARBITRARY UNITS
##FACTOR=    0.0002496,     1,               1
##FIRST=     0,             0,               0
##LAST=      2.0444736,     0,               0
##MIN=       0,             -365585,         0
##MAX=       2.0444736,     375011,          0
$$ Real data points
##PAGE= N=1
##DATA TABLE= (X++(R..R)), XYDATA
0@%%%%%%%%%%%qJ6j6J6k4L2m0M8n6P1p9Q8j10J34j52J76k07K39k72L11l59M08
33B16m59N19n86O59p39Q26r22J028j144J271j409J559j724J905k101K316k552
50a337K811l098L412l762M155m594N095n666O323p094Q008r119J0502j2273J4638
65H001j7980K3094l2001N1883j76085O0474L28140m5274k0469j02227k55461j87680
77c65585K05998K91312J12600l6814r8157k27815j70059O7198K33859J92158P1927
88B76622j26955k44043j46937L3415J14986J99293J90495o2458k91543j69377
98b26502L1359O3227J31944K45594N5814k63329k37610k296N7589Q9187K17340
109A62317J39481j61387k59814r3029L7947R6918J82128J47744o1609k07836j66066
$$ y = [0, 0, 0, 0, 0, 0, 0, 0, 0, 0, 0, 0, -8, 8, -8, 8, -16, 16, -24, 24, -32, 39, -40, 48, -62, 72, -80, 96, -111, 128, -144, 167, -192, 216, -243, 276, -310, 349, -390, 436, -486, 542, -602, 669, -740, 819, -905, 1000, -1101, 1215, -1337, 1474, -1624, 1788, -1974, 2181, -2413, 2682, -2984, 3339, -3755, 4253, -4866, 5636, -6637, 8001, -9979, 13115, -18886, 32997, -143088, -82614, 245526, 200252, 179783, 77556, -177905, -365585, -159587, 131725, 244325, 207511, 109354, -118461, -288520, -221322, 12537, 204695, 276622, 149667, -94376, -241313, -207898, -92912, 106381, 296876, 234418, -57125, -226502, -195143, -131916, 28, 245622, 301436, 38107, -199503, -201799, -144210, -55023, 162317, 301798, 140411, -119403, -212432, -174485, -77567, 104561, 252305, 190696, -17140, -183206]
120a83206m0640J02787J95974J33264j9168j23411j74965j35353N7370K19336
130C1988J52819j355p3420j37850j77998k8612J92980J96077L5337n5917j06748
141B7301j71415r1610J22415K04755R6350k5483j03413j58039j09772N1012J69773
152A1874J46636L2450r3146j61812j17638Q328J20101J57727R5170n1481j63960
163a5751j36895k2878P9162J42936J30515M938j38082j57100o1031M7168J23335
174c683J39871N0410r3351j56717r9813R041J07145J43521P8462m7907j36337
185i358j27442l3874Q3056J43308J03053o854j09384j37844p2895M4946J31306
196H018J23539L2607p7630j36742j01116O332J04678J29767P0258m0455j26750
$$ y = [-183206, -223846, -121059, 74915, 208179, 189011, 65600, -109365, -244718, -187348, 31988, 184807, 183452, 110032, -27818, -205816, -234428, -41448, 154629, 189966, 134049, 27301, -144114, -235724, -113309, 91446, 187796, 162313, 58900, -99139, -208911, -157899, 11874, 158510, 190960, 97814, -63998, -181636, -173308, -53207, 104520, 199690, 148209, -15751, -152646, -175524, -96362, 46574, 177089, 182027, 43945, -113155, -174186, -127018, -3683, 136188, 186598, 93247, -63470, -163283, -154242, -47097, 96424, 174886, 126979, -9358, -136800, -170674, -87618, 55690, 158743, 151889, 42505, -95339, -168234, -123288, 8018, 131557, 164164, 86534, -50208, -151324, -144992, -40314, 89453, 159711, 119256, -7494]
207g494j18924k7299P4731J24707R6319j170j04467j30131n9312M5358J13928
218F246J11542L4067p3387j28806r0475Q260R9069J21406N9974l9544j11336j11635
230a14619l3436P3910J24726Q2014r353q7085j14333o7783L7744J18490J02505
241A12780J8158o3778j07435q8788R62R8386J15923M9159l9762j00209j00837
252a05441k9605O8108J14904P9377p761q9152j09330n3167L6685R9458R8494K8831
264A31401o6875j12074p3297R514P9255J02409N9209l5154j05837r1082j5781
275a18312N8675R8551P9477l640q9000j02434m3969L5410R1834R1711K4702o3549
287E9456j03525p0108P281P8813R8781M9593l5574r3207q6152k2403N8002R9777
$$ y = [-7494, -126418, -153717, -78986, 45721, 142040, 140870, 36403, -93728, -153040, -107682, 6246, 117788, 151855, 78468, -50338, -140813, -132553, -33484, 87922, 147896, 108352, -2984, -114619, -148055, -74145, 50581, 132595, 123242, 36157, -78176, -145959, -108215, 10275, 112780, 130938, 67160, -40275, -129063, -128101, -29715, 86208, 135367, 95605, -4604, -105441, -135046, -66938, 47966, 127343, 119582, 30430, -78900, -132067, -95382, 4076, 102570, 131401, 64526, -47548, -120845, -111331, -32076, 70333, 129542, 94388, -11449, -102531, -118312, -59637, 38914, 118391, 114751, 25751, -76683, -120652, -85242, 6592, 98303, 123005, 59456, -44069, -114177, -106896, -28083, 70698, 120291, 84717, -8490, -94642, -117045, -59043, 40734]
299D0734O9398q770p6201r2349m8060L2876R2562Q3720J6906n6707r2413o7799
311a06103N968P7671R2545M2057l4196q6106q1846k1227N7217R4059O3300q205
323I5134p1699q8904m5313L2962Q6591P7780J7719n2299q8184o3829P064P2583
335b0395Q5282L9765l0854q0902p7006j8204N4384Q6366N8318p113o8492q4734
347f3585m0819L2279Q0505P3012J7380n0544q4549n9349P340O7899Q0778L8917
359I9264k8794p7184p2196j6429N0184Q0695N6019o714o5198p8351l7210K9229
371f6685P5214O9107J4808m9362p8637n4387O961O3978P6765L6229k9064p3700
383h773o6949j4540M6844P6403N4638o006o3340p4278l3203K7421O8491O5677
$$ y = [40734, 110132, 101362, 25161, -67188, -115248, -82372, 10190, 93910, 110816, 54109, -38304, -106103, -100135, -22464, 70081, 112138, 77942, -8164, -90010, -111237, -54020, 40039, 103339, 95134, 23435, -65469, -110782, -77820, 8771, 86551, 104270, 51971, -36213, -100042, -92978, -20395, 64887, 104652, 73798, -7104, -84110, -102314, -47930, 38436, 96754, 89641, 21149, -63585, -104404, -72125, 8380, 81392, 98772, 48228, -36321, -95670, -88330, -20431, 60347, 99264, 70470, -6714, -78910, -95339, -45155, 35540, 91559, 84845, 19647, -58704, -95914, -66685, 8529, 77636, 92444, 43082, -35555, -89942, -82981, -19003, 57762, 93991, 64927, -8773, -75722, -90262, -43418, 32985, 87623, 81617, 18277, -56001, -89204, -61783, 6708, 72385]
395G2385J6861m7291p6499m9159Q975N7050O9661L6799k6880p2901o2375r675
407h3049M3644O9393N2169n150o1585p0538k9954K6989O5495O2297J4577m4894
419C9394p0720m7358O178N6332O8554L0932k7391o3568n8197j5134M2348P0731
431C2101M5309j0111n3353o2859l2745K4466O7002N7771Q332m1067o3408m6826
443g5388N395N6798O4645K6928k4826o0113n7008j2890M1908O4765M2144o674
455F5684n1061o2385k9617K5426O0793N2529R983l8265o1493m3311O653N3174
467a1890O0630K4619k5091n5500n1977j3568L9533O5002L9457j1481m7713n4431
479d2410l0081K0390O1485N2825M875l8258n4777m0232L984M9609N7823K4675
$$ y = [72385, 89246, 41955, -34544, -83703, -74728, -17678, 51983, 88782, 61902, -10999, -73374, -83049, -39405, 29988, 82157, 77007, 15422, -55116, -85070, -58081, 7414, 69711, 84288, 39394, -31326, -78684, -72506, -16174, 52380, 83312, 55921, -7647, -65844, -80978, -38630, 32101, 77410, 67299, 13946, -48913, -81658, -57192, 9810, 67581, 75913, 34846, -28562, -75388, -69993, -13195, 51450, 78378, 53552, -6561, -63569, -76459, -34551, 30214, 72358, 65684, 14623, -47762, -77379, -51953, 8840, 61369, 71352, 33087, -28406, -71717, -65064, -11890, 48740, 73359, 48268, -7232, -59209, -72777, -33244, 31758, 71215, 59734, 12021, -42410, -72491, -52101, 9384, 62209, 67084, 28826, -25951, -66183, -62199, -12590, 45233, 69908]
491F9908k3747n6112m8541o149L6507N2881L9960j919n1850o1238j6449K9572
503c7177M3299M3280K2008l6022p1426l2948K2745L8121M0276L5008j3333o6657
515a2826n1322O537L6461M1068L7868K583m9580n7595j7308K5173M8306M4217
527E3582O489l5473m8022l4761j5M8562O0274J1834l2887l5349l5110k6526L1100
540c6302P4262K9493l1353l2782k7531l6874N478O8900N1894j5559l6803k8551
552a5728l4003r619M8567N9336J1158k8207m0226l8162q620L3093M5966L0803
564E4358r96m5085n6026r740L2080L1185L0344K5703k7553p1313k7717L3576L0425
577g59K0626L4739j152o6368n0455J8844L6217K2457L0248J1674m5236n7444q758
$$ y = [69908, 46161, -9951, -58492, -64641, -28134, 24747, 64707, 62788, 10938, -50300, -66749, -37177, 6122, 49402, 71410, 35388, -36038, -68986, -46241, -8120, 32156, 67164, 53831, -12826, -64148, -57611, -21150, 19918, 57786, 60369, 10789, -46806, -64114, -38941, 9365, 53582, 60071, 24598, -23424, -58185, -58200, -9638, 50636, 62470, 29583, -5766, -40876, -67402, -36302, 37960, 67453, 36100, 3318, -24213, -61087, -55609, 13291, 65185, 49626, 12823, -15728, -49731, -59350, -10783, 48553, 59711, 31504, -8722, -46884, -55504, -22411, 23555, 54358, 53362, 8277, -47749, -57489, -25409, 5776, 36120, 61823, 34270, -37043, -64760, -31184, -759, 19867, 54606, 53454, -12914, -63369, -44525, -8308, 14149, 44397, 56071, 10835, -46609, -55367]
590e5367K9109L5401L2894R585k9995m5041k7997L918M0751M9320R986k8543l0928
603f907k8309k0716K5742O3204K5993k9240k9619k0143k9721K674N9378M5619
615E7955j6306l3524k2193k7192q967M1461N1826P972k7206l3053k9756q935K7828
628b0090M3039K4693o415l6072m2953j1332K5111L2135K6935J4253k4509n3098
640b8303k4000K2281K9924K3475K2662p354m9757l8788J0067L0334K5573K4172
652D0286K872l7489m3978q025K3129L1782K8485O962k6838l9894k1339Q026L1907
665d114L6942J2974k1189l4045k6070o793K3436M2052K2708j4097l0771k7823
677b6790j5435J2280L9182L2139k690k7108l0194k1008L280L2542L6073R787j8845
$$ y = [-55367, -26258, 9143, 42037, 51622, 21627, -23414, -51411, -47493, -6742, 42578, 52564, 24021, -6907, -35216, -55932, -30190, 33014, 59007, 29767, 148, -19995, -49716, -47042, 12336, 57955, 41649, 8125, -14068, -41260, -50227, -8766, 43060, 51032, 23826, -9227, -38983, -47918, -20090, 22949, 47642, 41227, 5155, -37798, -49130, -24019, 8116, 35051, 49304, 24795, -28303, -52303, -30022, -98, 23377, 46039, 38685, -11072, -49860, -39793, -9459, 16114, 40286, 43158, 5669, -38309, -46334, -23205, 8577, 37062, 44024, 17186, -22708, -44047, -36021, -4114, 32828, 45802, 24613, -9432, -35502, -42295, -18859, 23193, 45901, 31804, 1033, -26790, -42225, -29945, 9237, 41376, 38686, 11578, -18616, -39624, -36344, -3802, 32271, 42058, 23213]
690B3213l1703k7264m161K5229L5852J9467q269k9043l1953j2968J7210L4163
702I773K5815J528k2824l3072k1051P379L0342L0921J0190j6379l1059k5772l152
715c7361K3547L3882J8639q866k8036k8692j1358J5015L2225K5905Q05k3626l0847
728a8768j8033P028K7620K8969J0794j5292l1474k4935K36K2870K8266J7657m624
741C0314k7970l1062p945J8355K6898K1118M598k0480l3679j7271J1550K5777
753B03K3612J0879j2311l1159k4748J599K2560K6500J6160n617k6264k7456q262
766c4304J5082K7745K2364L86k1679k6768j5185N623K5169K7699P698j6846k5965
779h981j9084k357J8825K9574J6252j0202k4941k1987q512J1794K7907K2539j478
$$ y = [23213, -8490, -35754, -39915, -14686, 21166, 40633, 32364, 3321, -28632, -41600, -24390, 9773, 35588, 37116, 14292, -18780, -39831, -32452, -2110, 28811, 39001, 22622, -8437, -34209, -37361, -13814, 20068, 38707, 29841, 1805, -26887, -38245, -23230, 8995, 34900, 35705, 12079, -18768, -36801, -29773, -2153, 26816, 37610, 22318, -9156, -34091, -33855, -10985, 17281, 34938, 30314, 2344, -28718, -36663, -18308, 8590, 29708, 34306, 13826, -19853, -37124, -25574, 203, 23815, 34694, 22383, -8776, -33524, -31925, -9365, 17135, 33295, 27678, 1414, -26042, -34304, -19222, 8523, 30887, 31273, 9594, -17174, -32359, -26736, -1567, 26132, 33830, 16984, -8981, -28065, -30422, -11597, 17977, 34229, 24027, -914, -22901, -31413, -19619, 8288, 30827, 29349]
792B9349k1382k4489j4069N646K3853K5415P443j5038k5422j9196o28J9255K6042
805A6779J4139p422k3391k3157p482J3898K5426J8986k54j8737k5122j3971P394
818b2914K3262K2345O670j3146k4424j9071M0J9115K4371J2808p136k1731k2296
831b2107p089J3861K4174J7253k22j7546k4091j3234P866K2004K0592O238j2304
844A5395k3595j8337R71J8832K2202J1583o024k0934k2019n937J4064K2350J6022
857B4573J90j7034k3256j2046P846K0723J9547N941j2309k2419j6637R15J7347
870f619K1631J1343o830k0536j9573n205J2282K1559J6283q53j7450k0948j0499
883b5415O529J9496J9641N412j2882k1247j4852Q72J6011K0889J1053p102j9903
$$ y = [29349, 7967, -16522, -30591, -24945, -1092, 24323, 31766, 16728, -8694, -27890, -28518, -9263, 16779, 30918, 23496, 105, -23052, -30534, -16636, 8790, 27776, 27522, 8785, -16337, -30308, -22914, 348, 22693, 29363, 16217, -8207, -27278, -27238, -8123, 16248, 29056, 21920, 189, -22107, -29196, -15335, 8839, 26092, 25870, 8324, -15767, -29001, -21135, 869, 21461, 27699, 15395, -8200, -26537, -25566, -6734, 15468, 27051, 21027, 93, -21926, -27863, -13799, 8551, 24573, 24763, 7729, -15527, -27573, -19727, 996, 20543, 26484, 14175, -8244, -24881, -23966, -6619, 15012, 26355, 19525, -1011, -20584, -25789, -13507, 8052, 24335, 23482, 6032, -14916, -25415, -18886, 610, 20251, 25663, 12781, -8466, -23318, -22446, -6435, 14454, 25507, 18405, -1498]
896a498j8179m522J1538K0520J5525j158j6855j9908r672O501J8645J8463M899
909B4299j2463k0216j3967J091J5461J9937J0205p282j8842j7020m289J1216J9794
922G924J4505j603j5909j8757r282O356J8211J7272L963j1758j8934j3566J269
935b0309J5513J8671Q795o714j7512j6686m133J1737J8987J2641j616j4628j8050
948a3304r146O795J7822J5745L322j0939j8058j2974J535J5114J7637Q001o640
961A4910j6809j5622l465J1211J7850J2086j790j4388j7174q117O940J6776J4636
974A7044L082j0386j7536j2448K368J4865J5814P171n601j6066j5784k841J2135
987h183J6537J0076j327j2809j7221q164P936J6322J2940K592r727j6565j1587
$$ y = [-1498, -19677, -24199, -12661, 7859, 23384, 22226, 5371, -14537, -24209, -17708, 937, 19400, 24299, 11836, -8380, -22347, -21256, -5795, 14142, 24347, 17065, -1777, -18797, -23086, -11870, 7924, 22429, 20826, 4917, -13840, -23122, -16766, 1445, 18717, 22680, 10922, -8012, -21578, -20309, -4796, 13875, 22670, 15956, -1556, -18242, -22375, -10638, 8349, 20990, 19374, 4746, -13304, -22450, -15655, 2167, 17912, 21234, 10295, -7763, -20737, -19202, -4088, 13549, 21550, 14910, -1899, -17521, -20986, -9775, 8075, 20161, 18371, 3983, -13191, -21308, -14368, 2408, 17044, 20126, 9740, -7796, -20244, -17876, -3011, 12803, 19974, 14373, -1693, -17477, -20318, -8183, 8354, 18430, 17103, 4294, -12927, -21091, -13155, 3167, 16107, 18699, 8972, -7593, -19180]
1000a9180K186J3997J5879O904p171j5517j2703k653Q977J6837J2343l518j5251
1013A130j3245n123L846J4147J6539K576j3855j5066o809Q23J0008J7206Q756
1026B0933r173j6362j0340j325P954J5058J1438k040j3958j5059n443P623J3850
1039C156J0806K815p653j6520j2286M938J5504J0236L533j493j2915j7807j595
1052a9281J5679J2921L905L54p849j7461q957J0508J5865P925O56o493j3939j1275
1066a7442K377J3664J3902M583p789j2912r017k500O170J5975J2490o090j5727
1079b316p934k100r3J1717J8343J001j6842j1273j552j287O304J7603Q661j1600
1093H632j5118n644m85M983J3622J1064l500j3117j2005m127O967J2523Q496J395
$$ y = [-19180, -16994, -2997, 12882, 19786, 12615, -2902, -15605, -18258, -9281, 7556, 19899, 16381, 1130, -12115, -17238, -13392, 755, 17294, 19870, 6015, -9051, -15860, -15037, -5029, 12177, 20933, 11760, -4602, -14942, -16267, -8313, 6745, 18183, 16143, 2185, -12874, -18317, -10694, 3156, 13962, 16777, 9124, -7396, -19682, -14744, 760, 10996, 14529, 13036, 121, -17686, -19281, -3602, 9319, 13224, 13578, 5729, -11732, -20689, -10181, 5684, 13609, 14265, 7772, -6167, -17442, -15065, -1401, 12501, 17084, 9295, -3617, -12634, -15134, -8964, 7011, 19501, 13411, -2316, -10250, -12350, -12443, -726, 17617, 18618, 1776, -9497, -11049, -12336, -6032, 11571, 20232, 8632, -6486, -12130, -12615, -7632, 5990, 17054, 13554, 437, -11568, -15695, -8728, 3795, 12291, 13686]
1107A3686n916j4359j1773N793J5285P322J147M0j0480j7308j072J6421J0791
1120I577N85R29n345j6683q306J1689J4291M403L53m291j3051j0577M091J2725
1134C90J0267L455n598j2014q897m33O824J2308R850m224j3763q363j151K116
1148i233R625J4123J308j3809j1096j597O96O061J4018O965r829j3203n121J05
1162a0987N070J1852R132l815j1898r497k759N016J1067R069J26p942j1007p332
1176a3905L106J1471R312K090m394r859j0348q38J0241J0818M156k319q082j0958
1190i509m703P144J1420P019j50o897j0685o806L272R956R459L023n438j0513
1204c408q054k6P819J0257N808k753r616r529k800N598J0123P722N5p547j0199
$$ y = [13686, 7770, -6589, -18362, -12569, 2716, 10038, 11185, 11225, 745, -16563, -17635, -1214, 9577, 10162, 11091, 5746, -10937, -19243, -7554, 6737, 11140, 11493, 7202, -5849, -16426, -12335, 390, 10657, 14112, 8514, -3500, -12397, -12830, -6006, 6302, 16152, 11928, -1835, -10198, -11349, -9233, 392, 14515, 15823, 2014, -9082, -10679, -9983, -3922, 10096, 17061, 7232, -5971, -11092, -10987, -5917, 5935, 15067, 11252, -646, -10143, -12902, -7886, 3181, 12250, 12376, 4434, -6573, -13905, -10799, 672, 9984, 12074, 7680, -2179, -12527, -13365, -3124, 7694, 11850, 9531, 1449, -9509, -14212, -7068, 4352, 11371, 11221, 4324, -6361, -13167, -9895, 61, 9520, 12543, 7105, -3408, -11462, -11488, -3669, 6588, 12396, 9643, 27, -9502, -12302, -6704, 3419, 11141, 11196, 3649, -6550]
1219f550n849K978R756Q978K312n031r442q317l80Q464J0134M484k971q092r251
1234h777l527N781J0335P000m66p199r328n376K566Q892R190K693n881r685o467
1249a0249L23O367R446O245l177j0013p915j218M233Q251Q363N56q716r619l420
1264a0543K880P184Q565L550n516j0108o422J057O684Q407M998k345q523q640
1278h772k227N792R027N704j58o055r153n593L400R273P133J269m088q178p582
1293a0208M6Q014Q738L377k740p182p931k853N256R292N943q75o511q045m415
1308a0094K450Q037P895K022n591q330n468K57O006Q585M844l392q322o754j490
1323i345M167Q127O675m41p315p944l390K531P173P609K049n209q250n333M93
$$ y = [-6550, -12399, -9421, 335, 9313, 11625, 6594, -2848, -11165, -11545, -3081, 7053, 11537, 8566, 474, -8777, -12304, -6523, 3812, 10812, 10346, 3147, -6181, -11557, -8991, -99, 9091, 11784, 5903, -3782, -10249, -9926, -3559, 5887, 12132, 8955, -1058, -8973, -10191, -5958, 2293, 10656, 11212, 2496, -7123, -10543, -7663, -479, 8086, 11636, 6120, -3988, -10410, -9353, -2669, 5738, 10736, 8391, -132, -8772, -10999, -5207, 3820, 9524, 9366, 3311, -5842, -11435, -8035, 1238, 8371, 9640, 5552, -2626, -10208, -10162, -2148, 6590, 9967, 7227, 45, -7886, -10739, -5483, 3809, 9752, 8877, 2366, -5679, -10094, -7644, 393, 8288, 10310, 4719, -3611, -9079, -8822, -2816, 5769, 10613, 7221, -1101, -7855, -9345, -5178, 2949, 9624, 9183, 1868, -6076, -9466, -6935, 238, 7847, 9896, 4687, -3563, -8896, -8403]
1338h403O213P932L972k897p497o996j768M821Q002N458n60o265p688m001K990
1353f687P552O682J429m485p678n707O15O593P399L271k553o921o965j659M985
1368d129P623M934o06n855p549l697L031P297O198J264m276p445n475Q00O432
1383a453O991L161k542o856o589j360M778P161M928o20n849p218l298K879O831
1398I44O049J412m552p273m763R57N726O715L347k758o916n940r66M313O805M949
1414H049o87o004o780k728K626O239O102J363m550o979m321Q46N388O554L120
1429H238k780o582n478j006M052O654M592q76n676o219k703K445O280N781R61
1444G683m459o370m198O88N342O395K806k793o120n305j078L987O536M287j104
$$ y = [-8403, -2190, 5742, 9714, 6817, -680, -7676, -9444, -4623, 3379, 8837, 8277, 2012, -5676, -9677, -6687, 865, 7547, 8976, 4491, -3187, -8894, -8279, -1686, 5713, 8984, 6431, -490, -7455, -9114, -4129, 3494, 8428, 7822, 1967, -5582, -9279, -6248, 1049, 7247, 8511, 4235, -3210, -8685, -7885, -1453, 5538, 8699, 6157, -699, -7288, -8648, -3870, 3291, 8219, 7599, 1750, -5468, -8766, -5887, 944, 6993, 8405, 3853, -3420, -8183, -7226, -1500, 5215, 8562, 5804, -1112, -7052, -8018, -3705, 3100, 8049, 7362, 1358, -5422, -8150, -5524, 715, 6817, 8180, 3630, -3349, -7670, -6824, -1436, 5118, 8238, 5458, -1124, -6602, -7608, -3556, 3098, 7690, 6814, 1138, -5081, -7784, -5339, 941, 6722, 7683, 3224, -3146, -7344, -6656, -1314, 5081, 7887, 5094, -1026, -6331, -7409, -3422, 3114, 7401, 6297]
1459F297n211n857k739K303O225N380O97m075n966m164P03N349O176K247k620
1474D745n675n165j094M082O364L792j049m908n841k588K556N881M913P33l769
1489B977o018l923J121M982N347K545k308n860n035l90M065N398L669o19m908
1504A043n926k164K869N408M379R10l488n968l925J090N152N208J854k196m996
1519g50m973j087M237O005K843j269m015n043k764K339O031M428j31l607m767
1534b523l640M38M989N520J739k747n076m071n04L163N220L940q77n377m992q49
1550e647K118L892M728J855m493o418j784J969K757M192L723k217o797l826J283
1565d665K787L668M067j05n352n327r79K592M319L956N73l198m814l521N93N199
$$ y = [6297, 1086, -4771, -7510, -5207, 1018, 6398, 7095, 3020, -2946, -7110, -6407, -1058, 5118, 7365, 4745, -930, -6095, -7189, -3107, 3257, 7049, 6000, 1092, -4749, -7337, -4781, 1100, 6013, 6746, 2977, -3041, -6964, -5843, -861, 4486, 7031, 4723, -1137, -6172, -6562, -2497, 2901, 6570, 5951, 1043, -4883, -7047, -4178, 1230, 5609, 6519, 3031, -2937, -6862, -5772, -620, 4588, 6442, 4246, -750, -5723, -6810, -2573, 3432, 6275, 5006, 991, -4052, -6816, -4477, 1554, 5982, 5851, 2244, -2523, -6163, -5725, -736, 4784, 6523, 3776, -1300, -5371, -5875, -2712, 2508, 6448, 5571, 194, -4798, -5647, -3529, 363, 5091, 6946, 2453, -3965, -5749, -3780, -1023, 3169, 6892, 4675, -2122, -5948, -4665, -1878, 1790, 5857, 5752, 400, -4927, -5906, -3314, 1005, 4961, 5534, 2336, -2478, -5999, -5406, -207]
1581b07N001M23k319k989m301k360M306O721J418k728k061l284m155J624P361
1596B450L646k195k563k600m098n22N479N450K63k653l447l636r86L218M819K877
1612E502p68m451m699n22K425K864L701K198l922o410j401K829K088K752L766
1627E952j333o927l636K243K569K343L634P01n202n208j32K687L168L244J033
1642E136l035m663k593R51M031M209P29k264l115l353j567L460N621J502k298
1657B751k395k803l029J482N887L404j546k638k597l115k22M603M496M30k241
1672B467l287l147o77K847M207K282q67l619l943q29K112L330K920J016l060m805
1688c053j711J698K796L159K052j700m730l033O93K529L275K628n55l933l664
$$ y = [-207, 4794, 5217, 2898, -91, -4392, -6752, -2446, 4275, 5693, 2965, 904, -2380, -6535, -4911, 2450, 6096, 3901, 1338, -1262, -5360, -5882, -403, 5047, 5310, 2657, -790, -4426, -5412, -2194, 2625, 5502, 4734, 283, -4416, -4938, -2513, 351, 4052, 6250, 2328, -4082, -5483, -2654, -566, 2186, 5952, 4619, -2308, -5944, -3701, -1132, 1211, 4845, 5546, 344, -4864, -4996, -2309, 859, 4103, 5136, 2101, -2562, -5155, -4204, -173, 4036, 4765, 2501, -614, -3967, -5534, -2074, 3547, 5049, 2751, 356, -2447, -5476, -3994, 1893, 5297, 3751, 1113, -1484, -4599, -4821, -218, 4278, 4708, 2467, -820, -3967, -4644, -1797, 2410, 4692, 3825, 206, -3737, -4566, -2454, 876, 3796, 4812, 1752, -3053, -4764, -3066, -270, 2889, 4941, 3241, -1489, -4522, -3829, -1300, 1975, 4603, 4048, 115, -3549]
1703c549q48J786L442L228K07k971l660j838N75L193L903J082k266l490k538m54
1719d198K601M066K060j233l159l255j211J760L734K815R7k645l740k057J056
1734c309L238L068J066j464l541l232J60L004L170J599m54k936l555j182K201
1749b167L582K241n8k191l269k354Q03L507L283N02j799k910k690n90K617L997
1765B504J590j453k620k611j421J370L748K827m32k612k839j671M58L055L170
1780C063R96j965l386k255K77K172K870K153n83l503l218k46J857K490K302Q74
1796C898k518l900j434J633K282K302J595j302l813k406O09K302K525J719m72
1811C020k939l035o81J811K908K218q8k304k864j640O06K933L031M73j795k528
$$ y = [-3549, -4397, -2611, 831, 4059, 4266, 1295, -2365, -4203, -3628, -435, 3468, 4550, 2284, -1206, -3744, -4198, -1597, 2469, 4529, 3296, 137, -3118, -4329, -2569, 1165, 3980, 4077, 1432, -2308, -4365, -3309, -71, 2997, 4063, 2599, -942, -4174, -4014, -1010, 2160, 3759, 3305, 369, -3186, -4368, -2167, 1415, 3656, 3598, 1407, -1862, -4216, -3413, 94, 3377, 3879, 2080, -830, -3520, -4110, -1493, 2504, 4094, 2641, 21, -2590, -4011, -2641, 1107, 3934, 3502, 890, -1949, -3620, -3162, -107, 3063, 4059, 2094, -1292, -3547, -3270, -1098, 1772, 3925, 3342, -161, -3379, -3625, -1768, 722, 3024, 3898, 1380, -2520, -3954, -2321, -39, 2263, 3858, 2556, -1257, -3663, -3054, -752, 1773, 3492, 3020, 81, -2954, -3635, -1824, 1084, 3302, 3214, 910, -1954, -3594, -2988, -55, 2976, 3449, 1654, -874]
1827h74k105m83K144L590J412j393k318k133j232J179L420K343o09k238k364j544
1843c205L77K788K891N45j839k545k028j83K190K933J458q88k527k540p47J591
1859a729K737J949N4j968k854j473Q95K510K312O84j292k769k184K75K122K466
1875A735J310o35k456k553o60J740K482J859O1j947k790j413R85K416K220P60
1891C114j345k639k062J96K018K388J276n73k423k386n67J465K424J824nj967
1907G38k558j198Q31K341K160O60j482k470j744J08J907K373J307p53k288k129
1923b197n81J244K426J778q1j980k271j108O97K146K127N75j424k337j584Q0J813
1940f77K325J185q04k172j994n31J267K310J738j41j883k230j075O51K101K057
$$ y = [-874, -2979, -3462, -1318, 2272, 3684, 2291, -27, -2160, -3392, -2213, 1207, 3550, 2941, 703, -1661, -3205, -2828, -40, 2851, 3396, 1557, -988, -3016, -3199, -1009, 1924, 3382, 2494, -33, -2573, -3320, -1729, 1008, 2957, 3011, 1043, -1811, -3284, -2389, 121, 2433, 3117, 1825, -944, -3128, -2853, -731, 1735, 3045, 2410, -46, -2599, -3259, -1519, 963, 2822, 2883, 936, -1854, -3267, -2282, 134, 2354, 3114, 1769, -870, -2932, -2736, -718, 1670, 2946, 2373, -50, -2436, -3003, -1538, 886, 2710, 2705, 738, -1820, -3018, -2187, 154, 2314, 2974, 1492, -978, -2722, -2614, -707, 1666, 2973, 2220, -68, -2197, -2778, -1534, 892, 2670, 2589, 609, -1662, -2770, -2073, 73, 2200, 2775, 1351, -986, -2570, -2490, -677, 1648, 2833, 2029, -143, -2137, -2668, -1401, 909, 2647, 2506, 623, -1607, -2682, -2031, 70, 2127]
1956B127N20j365k194j565J32J650K233J101q13k034j898n10J302K294J520k09
1972B291j757k044j051P08K043J966L04j210k122j544R6J766K094Q75o71j862
1988a18j851n58J320K147J305j59j527j980j052P54K013J742K75j172k004j423
2004b288J73J641K035Q50p19j879j726m82J232J967J367j15j618j988q46Q03J774
2021A81J641L84j042k019j343L24J590J651Q06m76j817j849k72J446J622J114
2037A941P0j429k064r12R37J717J413L98j002j876j346K33J522J692Q19o40j704
2054b31j352l85R24J848J379m14j565j408o43K70J568J967K43j648j510p31q7
2071a775J050K111J013j138j728j086k51O83J786J443k96j575j508o24O60J482
$$ y = [2127, 2647, 1282, -912, -2477, -2345, -695, 1538, 2639, 1826, -208, -2106, -2616, -1314, 980, 2500, 2291, 534, -1510, -2561, -1853, 190, 2156, 2460, 1250, -872, -2416, -2320, -554, 1540, 2415, 1744, -118, -1969, -2527, -1207, 940, 2245, 2086, 559, -1421, -2473, -1719, 294, 2036, 2311, 1139, -865, -2288, -2115, -474, 1561, 2411, 1692, -187, -1913, -2395, -1163, 804, 2171, 2056, 438, -1550, -2396, -1593, 181, 1822, 2206, 1164, -855, -2198, -1874, -284, 1367, 2173, 1697, -120, -1969, -2241, -795, 827, 1941, 2011, 582, -1482, -2394, -1457, 260, 1673, 2071, 1069, -807, -2153, -1920, -398, 1294, 2113, 1473, -231, -1583, -1968, -1044, 804, 2183, 1769, 204, -1204, -1847, -1577, -9, 1958, 2201, 553, -957, -1688, -1775, -725, 1386, 2399, 1261, -467, -1553, -1804, -1121, 665, 2108, 1812, 237, -1271, -1895, -1235, 247]
2087B47J284L83q49j847j346N85J522J171M55p5j476k034j74J660J391M72K41
2104A610q60k029j048J164J715Q83J57n56j575j417K69J530J472M58o58j389j127
2121a401l48P24J801J296o75j505r93l73mJ375J991J42j779j165l09l25P46K069
2139A267R79j286j510p20k24N16J604J234l50j368j293n59O16J391J046J86o60
2156H69j599j265N31J635R02K96J0j259j921j26J727J103L04J84o03j999q39J146
2174i04J463O41J82m81j562j143M59J268J144M91n26j433j052M6P04J287J133
2191A717k78j550r91k37L12J023J566K22j387j269l85M4P29J549O89q73j341p55
2209a215j33N89J448Q43l27j094j094n24N02J375J017pq27j196p70J09J225J225
$$ y = [247, 1531, 1914, 1065, -782, -2128, -1543, -21, 1150, 1605, 1530, 54, -1980, -2154, -494, 897, 1369, 1610, 750, -1279, -2327, -1163, 552, 1435, 1592, 1036, -539, -1956, -1687, -157, 1315, 1773, 1115, -274, -1401, -1749, -1025, 776, 2072, 1397, -108, -1101, -1474, -1478, -103, 1888, 2030, 251, -914, -1223, -1548, -802, 1267, 2246, 960, -550, -1270, -1494, -978, 626, 1860, 1510, 142, -1151, -1710, -1094, 297, 1343, 1529, 869, -730, -1995, -1464, 171, 1073, 1369, 1379, 120, -1801, -1927, -200, 903, 1207, 1391, 788, -1211, -2050, -904, 559, 1200, 1382, 901, -661, -1804, -1345, -77, 1067, 1558, 1032, -401, -1453, -1407, -703, 584, 1717, 1439, -111, -1102, -1339, -1027, -4, 1562, 1784, 397, -872, -1257, -1213, -484, 1065, 1754, 881, -460, -1215, -1348, -759, 689, 1532, 1205, 111, -983, -1507, -1005, 370, 1387, 1380, 553, -643, -1413, -1304, -79, 1146]
2227A146L26n78j039j087k86R07J359O46l00r93j065m54M46J159J079J83r73j193
2245g17o23K88Q51J184N29n87j305q44j2P66J043P76j37j055j255l49O50J129
2263C32P75J24n78j262r21L74J229Q92J45k45r66j184j61J175J132K57j19p55
2281B44j112o10O90J234P14m2o38r80q44K16J025J047M06o49j046p66m9O16J055
2300E11Q49k60j154q81j04L34P45J129K19j061j129k35K12N58J065O56o76j231
2318d53p26J49N84R32P58j89r92r42l50N42R62P43J12o48j090o56L31R94Q61J34
2338A056l74q62r12j42R14J024L97k97p18r07m13M95J108P09j07o51q09o45J91
2357i43R07R00K85n32q16q18j0O43R23O31k91q85p35l09L62R48P43Qp18q96m66
$$ y = [1146, 1472, 894, -145, -1232, -1518, -611, 748, 1394, 1094, 101, -964, -1418, -972, 187, 1266, 1449, 476, -717, -1340, -1052, -201, 983, 1512, 925, -380, -1224, -1236, -470, 573, 1349, 1212, 157, -1098, -1447, -797, 332, 1107, 1231, 653, -609, -1530, -1156, 73, 965, 1110, 865, -101, -1285, -1446, -271, 861, 1118, 999, 244, -868, -1478, -788, 446, 1160, 1118, 480, -500, -1344, -1128, -103, 944, 1350, 701, -345, -1111, -1160, -544, 511, 1360, 1100, -54, -935, -1039, -705, 40, 1169, 1388, 327, -802, -1037, -825, -267, 798, 1454, 778, -453, -1179, -1030, -446, 486, 1244, 1055, 63, -879, -1229, -687, 275, 1018, 1130, 482, -608, -1264, -933, 61, 922, 1056, 682, -180, -1092, -1234, -320, 704, 1101, 804, 86, -821, -1234, -739, 369, 1078, 971, 320, -489, -1134, -943, -36, 864, 1149, 617, -199, -1017, -1027, -384, 539, 1170, 879, -6, -741, -1050, -688, 260, 1003, 1011, 293, -603, -1069]
2378a069J84Q38R01K58n41q57o59n6P00Q72M91k33p91p93l56M91Q76P32k3o80
2398B85q20m95K63P35Q07K30m18r03o68N2O34Q46M78j40q63q48k10M99Q14O37
2418I15M3n71r74m65L20P10P72K50m12q80o51M3O38P57M07j07p50q29k45N07Q14
2439B92N31M9n82q04m75K02P88P28K45m55p98n95K6O05P23M47k32p53o45j93L78
2460e18O97O38Q0o55p51l72K24O57P02K53m43p37n64k0N19P51N23l05o67o56k34
2481h78L60P36N76%n34p25l64J36O71P14J98m20p09m70m4M36P71M15k52n78o33
2502e94k64L64P48N87m2n52o65m49K14O63O25J77l41o56n73n5N58O16M52j66o09
2523C8o78j54M10O77M54L3n74o13m18K48O05N54J91l09o64n66J1N47O14L72j73
$$ y = [-1069, -885, -47, 854, 1112, 571, -286, -945, -1001, -301, 571, 1062, 829, 38, -755, -1111, -620, 256, 988, 965, 285, -535, -1030, -767, -32, 775, 1005, 587, -316, -984, -932, -298, 548, 1026, 886, 23, -825, -1035, -536, 278, 915, 958, 387, -587, -1052, -732, -22, 750, 1000, 588, -292, -943, -900, -262, 495, 902, 795, 45, -784, -1029, -522, 292, 823, 872, 290, -514, -989, -787, 1, 729, 974, 519, -279, -874, -848, -243, 480, 927, 695, -58, -703, -896, -518, 179, 817, 897, 242, -509, -881, -657, 0, 702, 955, 512, -225, -789, -809, -290, 461, 984, 679, 12, -644, -878, -518, 218, 794, 794, 260, -465, -829, -693, -22, 692, 890, 470, -239, -709, -753, -317, 454, 869, 617, 39, -594, -858, -494, 254, 841, 799, 247, -418, -867, -653, 10, 635, 812, 471, -185, -758, -813, -255, 361, 813, 647, 38, -640, -794, -384, 293, 747, 780, 206, -407, -825, -577, 28, 582, 773, 464, -200, -766, -755, -208, 406, 778, 605]
2544F05n68o28k36M81N04N30J5m20o90l75K34N61N09K19k46o84m88p8N77N96K90
2565G08j44n19n92k25L47O56M97m0m66o18l57N8P01N89J23k98o12l91j01L46P24
2586C86L59j57o46m56j56K49M93O34L4n08o58j97J70L53N48L95l30q15l28Q6K63
2607b81N02N13n3p50n36K1K39M41M74J50m54o83k52J39M94N25J78k80n67m39j37
2628g56N47O72J34k63k11m89m12K62Q96L09l33j86k97n95JP88N89j45k81k11n19
2649e00k55M97P24J69k36l21m96k21K86N23L95Q9m13o19k24J66L75M03L88k41
2669D89p71l77K56K62K71M58J06p07o35J17L49J86M22L09m91o83j74K13L53M69
2689D22J98j88n88l70l2M55M32L02j59m29m16k43K28N57M23j51k72l46l46l9N47
$$ y = [605, 37, -591, -827, -346, 158, 688, 703, 283, -407, -782, -548, 13, 522, 741, 495, -189, -677, -755, -178, 418, 708, 564, 45, -547, -772, -425, 231, 728, 688, 222, -396, -753, -695, 6, 595, 718, 420, -192, -583, -684, -338, 386, 745, 588, -58, -514, -670, -421, 72, 706, 740, 232, -426, -623, -453, -100, 448, 843, 513, -302, -630, -544, -281, 221, 734, 681, -69, -605, -584, -345, 96, 570, 720, 266, -417, -669, -530, -36, 489, 667, 387, -180, -619, -756, -209, 463, 597, 334, 123, -366, -778, -516, 380, 689, 356, 170, -127, -722, -721, 67, 656, 511, 230, 19, -500, -755, -258, 466, 635, 399, 78, -418, -639, -353, 170, 565, 654, 241, -378, -602, -436, -61, 342, 730, 489, -282, -659, -403, -141, 130, 588, 694, -13, -648, -531, -182, 4, 426, 735, 244, -439, -613, -400, -47, 422, 620, 432, -156, -526, -558, -103, 329, 631, 472, 43, -373, -616, -388, 169, 592, 441, 169, -177, -523, -562, -15]
2710a5N17O8l09l73l20j76L98N33K20j12m69l88j26K15M33L94P6m06m37k92J10
2731d59L50M60K53k18n45l37l2L67M16K71m5l82m89j55J61N56L31Ll91k76l74
2752e35k6M65N38R5k96l02l23j77L00N90K29j37l73l50k01Q5N03M24l2l22m02
2773b47k76J52L51L79J72j41m73m37N5L29L13K98M5m15n73j05L59L13K43J39j71
2794C10n69k90J90L58L30J01o0m30l65r1L56M35K15j39k18m23k80J93N67K95j06
2815C79k15l32l00m3M33M89R4k28l94k56r5K11N07L01j47m60k94j15J77K51M59
2836D22J09l49m83j45K18J89K43L48j88n18k74P0K11K77L03K9m73l87m0J98K25
2857a5L74N7k20m20j80N7K74L39J96j89l38k84j02K75M02J94j50k05l64j47P3
$$ y = [-15, 502, 570, 261, -112, -432, -608, -210, 323, 543, 431, -38, -426, -552, -337, 96, 490, 566, 160, -277, -569, -459, -109, 351, 604, 386, -159, -496, -528, -161, 255, 526, 481, 99, -390, -545, -384, 172, 503, 506, 115, -161, -535, -561, -96, 442, 537, 241, -61, -384, -561, -261, 329, 558, 421, 48, -302, -503, -418, 85, 509, 477, 155, -247, -523, -371, -20, 359, 531, 390, -83, -520, -465, -136, 177, 475, 520, 105, -468, -573, -214, 99, 342, 481, 310, -259, -549, -359, -1, 329, 430, 370, -60, -425, -516, -160, 275, 490, 351, 133, -290, -570, -377, 190, 485, 379, 164, -168, -468, -511, -78, 411, 505, 277, -117, -373, -468, -257, 250, 551, 404, -56, -350, -465, -288, -37, 422, 531, 182, -301, -446, -228, -39, 204, 552, 364, -154, -428, -358, -147, 130, 433, 462, -11, -398, -438, -240, -15, 359, 416, 196, -224, -404, -347, -73, 266, 462, 273, -65, -349, -451, -176, 226, 420, 270, 65, -299, -446, -373]
2878c73M44L21o1j96k51k82L0K66M30Q5k30k57k31j40K99L36J64l5k61l06j77
2899d25J65L46K76%k14k98k77Q4K87K91Q3o9k65l27o0K43L45J81qk83l37k20K04
2922b78L35K33N2j57l95j43O0K67L01J12n3l89l21L8J96L29J85J1l33l74q1K10
2944a95K42K51Q9j58m11j83J06J97K83J57n7l97k80K6J57K69K67J2l26l15p1J07
2966b30K60K83J17l18k72j54o9K49L79J85j88k37k44r1J00L68K64j40k22k33j25
2987c18L6K97K54M8j61k93j83J3K45K93J02j27k33k04j71K53L20J80p7k17j93
3008a36j80L0L31K31L2j21k87j77p2K53L69K0j02j51k99j06J98L19J41j3k17k10
3030a47k19Q9L47K31J5j32l69j84O1K83J84J88j77k36k08m8K11J72K06J4j49l48
$$ y = [-373, 71, 392, 331, 135, -116, -398, -368, -102, 328, 413, 183, -74, -305, -445, -146, 190, 354, 319, 58, -248, -425, -260, 86, 362, 362, 148, -150, -427, -343, -56, 235, 318, 249, -16, -343, -403, -160, 185, 366, 358, 75, -262, -482, -278, 57, 290, 342, 185, -210, -353, -293, -26, 275, 387, 334, -55, -376, -338, -142, 187, 372, 383, 50, -324, -405, -195, 47, 298, 387, 229, -182, -365, -259, -62, 221, 378, 321, -76, -356, -330, -173, 96, 363, 375, 49, -266, -337, -230, 30, 313, 430, 112, -160, -314, -383, -134, 245, 430, 242, 5, -239, -330, -230, 138, 402, 262, 40, -193, -318, -282, 15, 269, 317, 156, -137, -320, -307, -62, 231, 333, 206, -27, -231, -402, -149, 171, 351, 274, 57, -136, -316, -286, 45, 276, 308, 187, -100, -277, -349, -96, 273, 293, 191, 40, -259, -365, -167, 152, 293, 280, 63, -147, -366, -277, 70, 301, 316, 184, -185, -369, -308, -25, 159, 347, 170, -66, -274, -322, -111, 61, 267, 281, 132, -216]
3052b16j12J40J87K17J14j28l81j18N1K00J86J49ml34k20lJ56J83J72M7j80l37
3074b31q3J25K17J96M7j08k90j86P5J62K15J77q3l06j84j7J56K03J72J1j85k33
3096a50j50L2K62L02k9j45j59j37j22K54K48J15j74j11j45j24N9K89J91l6k85
3117a5j35j31M1K80K77j3k79r6j08p3J94K61J02j46j72j42n0Q0K00J73Mk09k16
3140a73o2P9J24J67J34r1k31k26R8J69J48P3k2j33k97jJ54K15l0Q5m0k97j66J49
3164a74K10J96l5p5j82j17n5K30J65N8j31p5j34j51J45K05J61j14j18q1j17n4
3186b43K49K05N3j55j49j39J9O8J79J75n5k21j78LR4J02J60R7j69k56p0J45J07
3209B1R7J23o2l31o6O7J09J10J94m7j94k41k3J31J77J73k8j79j76rJJ31K22K5
$$ y = [-216, -328, -188, -1, 216, 330, 202, -179, -297, -246, -46, 140, 289, 285, -49, -269, -272, -116, 67, 239, 286, 106, -231, -314, -189, 28, 224, 271, 163, -127, -313, -238, -76, 139, 316, 233, -73, -257, -274, -118, 85, 257, 268, 83, -150, -300, -268, -6, 296, 267, 122, -37, -174, -296, -42, 206, 321, 147, 36, -109, -233, -174, 115, 306, 270, -15, -150, -281, -240, 40, 317, 304, 25, -71, -179, -252, -58, 203, 305, 159, -13, -155, -205, -125, 75, 248, 252, 43, -173, -235, -156, -32, 135, 269, 178, -53, -279, -181, -12, 136, 209, 187, 54, -243, -244, -90, 125, 95, 180, 140, -157, -323, -174, 36, 232, 197, 122, -60, -177, -232, -2, 163, 221, 90, 15, -119, -270, -125, 80, 241, 127, 9, -72, -189, -243, 6, 211, 264, 109, -40, -179, -160, -92, 87, 262, 207, -14, -192, -189, -95, 7, 167, 264, 95, -161, -231, -86, 21, 118, 241, 179, -152, -218, -151, -42, 68, 262, 215, 21, -220, -243, -112, 65, 238, 210, 31, -145, -154, -153, -22, 200, 225]
3233B25j29j87n5j22J18L17J24j94j91l5p2K1K44J48n3j24j12r7j9J83K52rj50
3256H3n6j38n8J19J52M9oj51j61o9J96N8M7P0k9j80k14J44J90J02L1l5j34k17
3280b07rK18J33L4j04p3q8j28P1K30R6m0j19j12m2l2J87J58J2j09j12j07k1Q2
3304h2J52J30ok07j06rN2J11J15O9j81j41q3J02O9O3J43q5j33j46R8J08m9J69
3328A53M1j39k37N9M4J37L5J17p1k39k3l9J88O7Q8j30r7q7j0M4K28N1j11q9j10
3353a30j5p0K56J73j16p6j9p4p9Q6K24J2j11j02l8o8J5J93J17r6p9r7o2O5J46
3378E5M0L8j03j09p3L6J10J04J1j5j27j24j6J52Q4O9M9k21o9p5J01J39N9j1l6
3403F8j11j16LJ77K9K4%r3j38jJ43R6L5K8j15j61o3R1J18J31M3o7j62j57R4O9
$$ y = [225, 96, -91, -146, -268, -150, 167, 291, 97, -94, -129, -201, -180, 64, 212, 159, 35, -77, -174, -193, -10, 242, 233, 83, 27, -111, -169, -50, 102, 151, 145, -6, -167, -236, -40, 18, 65, 135, 106, -74, -288, -144, 46, 148, 179, 144, 10, -207, -216, 2, 135, 169, 65, -8, -96, -224, -153, 77, 173, 133, 14, -98, -140, -172, 15, 173, 185, 76, -36, -143, -164, -82, 70, 200, 194, -13, -119, -128, -76, 35, 150, 219, 38, -103, -186, -84, -15, 48, 191, 106, -27, -173, -75, 33, -16, 153, 194, 55, -182, -123, -79, 58, 93, 210, 139, -100, -123, -162, 26, 93, 181, 51, -46, -133, -143, -99, 129, 180, 69, -20, -130, -145, -215, 41, 214, 98, 22, 3, -71, -150, -64, 160, 172, 61, -41, -79, -147, -132, 61, 178, 82, 3, -94, -156, -91, 55, 95, 133, 30, -79, -152, -116, -6, 98, 109, 94, -33, -157, -173, -21, 63, 132, 181, -40, -109, -184, -83, 56, 115, 104, 68, -43, -159, -156, 21, 50, 74, 74, -19, -157, -158, -15, 81, 116, 144, 29, -132, -195, -104, 14, 145, 188, 121, -41, -198, -104, -35]
3429c5J14N6J0j92j03J1Q8Q9J06k4j11j28k9N7R3J04N3j14j21m6L7N3J15O8j13
3454C8p7o7j6P2N4Q7N2j51j04J0K5P1J27J9p5j15r9M7M8R4J13rj79r6qN0J60L4
3482A05N6j53j01p5M7J41J14k7o1o9m2q3R3J40J6n9p2j8j02Q3J50N5o1o7p4n2
3508a16j5R0J48nm9j13k1q0J46P8M2k8q8o6m1N7J15N0Pn2j21q7J02L6O5R4k6j45
3536b3j19N2P0P2mN8o9j98k0J56P4J7N5m6j21j01J14K4J15k7l3r7p6N3R3N3M0
3563A12m3j09q2L0K5N1J34k6n9o8r6N7J4J01R0r6r9l0J1j1J55J71j44r9m3n8P6
3590c6M2J07P2j67j34O0m9P8J40N4j71o3k4L8M6P1O7%j13j28rK6J01P9L9r7j30
3617a01k2L0J04Q3j5l5m9r5o4J74O8LJ9j03n5q5J16R3O0m6m2kj40k7J09J39k4
$$ y = [-35, 79, 135, 145, -47, -150, -139, -51, 38, 144, 120, 9, -119, -148, -91, 2, 106, 159, 45, -76, -122, -85, -32, 83, 151, 38, -39, -106, -122, -50, 4, 91, 143, -8, -112, -102, -77, -6, 121, 140, 65, -50, -149, -102, -54, 40, 153, 144, -35, -131, -139, -89, 71, 105, 161, 8, -93, -168, -121, 20, 134, 107, 46, -23, -65, -148, -55, 85, 101, 42, -30, -48, -150, -67, 83, 138, 77, 10, -64, -116, -131, -41, 107, 102, 53, -60, -81, -161, -15, 63, 105, 77, -11, -77, -118, -61, 54, 104, 111, 59, -62, -149, -47, -11, 54, 148, 122, -23, -142, -90, -20, 52, 48, 106, 37, -161, -181, -25, 49, 66, 121, 75, -46, -147, -33, -9, 106, 79, 46, -51, -127, -74, 19, 72, 112, 69, -40, -122, -92, -67, -16, 118, 92, 33, -35, -131, -74, -60, 41, 131, 35, -64, -94, -83, -94, 61, 232, 88, -11, -54, -112, -36, 6, 113, 185, 18, -116, -56, -105, -27, 113, 167, -4, -67, -91, -53, -7, 64, 131, 131, 18, -110, -119, -93, 8, 87, 126, 29, -101, -123, -93, 11, 94, 79, 44, -5, -100, -164, 10, 78, 81, 100, -3, -58, -143, -27, 66, 126, 80, 38, 36, -104, -131, -22, 117, 93]
3644I3o4n4r1l1J29J47j6p2o8n0l4RJ53O1Oo9r3o4%P5Q0M7k5j94K4k5J27L1Q3
3673A15O1j35j45OO5J4Q4M0k1j92n5J47N1KR1k7j50j06J02P2PR3oq3j48L6J5R1
3701B4R4l6n8j30J7k2Q4R1N4n2r0j9j10Q9R1J21n9j21ln3%J19R2Kr8p8m5j7J24
3730A1J13rq1n7j18N3KJ26J08j5j90j2o8R3Q4O6o7k7l6n5m1P0J53pl1q1j10LQ1
3759d2J11K6l7r8k2p2J3J91J4k2ln2r8nR1R0JNr4n7m0L4J19L3K4o3j32q6Q8P4
3789iJ25m9J7j53p0M8Q4J3Q8N6j78j07J1R7N5M1N7o5j44k6P6O0O2l7n6r7n3L0
3817a24J48O6Jo8o7k7j1rJ43M6K0j79k0J0k1N3J75l0j68K1Rq7L8J94Kp3j03ol5
3846a02L8J24O3m1r8n9j8oJ02J20n0j6j23o9K2J08P9J6K4j73n2K1Q0L6N1o9l3
$$ y = [93, 29, -25, -116, -147, -18, 129, 113, 41, -27, -77, -111, -102, 51, 112, 118, 49, -44, -108, -108, -33, 47, 94, 69, -125, -101, -126, 1, 32, 115, 176, 41, -104, -98, -33, -19, 65, 105, 84, -108, -163, -16, 35, 37, 128, 101, -49, -155, -53, 19, 26, 119, 113, 30, -118, -82, -67, 24, 118, 82, 24, -106, -89, -111, -27, 64, 118, 66, -24, -43, -153, -64, 27, 148, 89, -32, -35, -88, -88, 31, 123, 125, 27, -51, -96, -113, 11, 124, 115, 34, -23, -141, -88, -86, 40, 148, 133, -57, -69, -137, -44, 40, 106, 39, 12, -24, -79, -120, -50, 103, 96, 65, -16, -126, -123, -42, 69, 95, 58, -40, -62, -134, -121, 70, 84, 62, 59, 7, -91, -96, -5, 85, 86, 91, -3, -60, -100, -66, 53, 86, 110, 47, -85, -171, -83, -9, 116, 67, 84, -69, -139, -91, -7, 6, 94, 150, -28, -135, -124, -27, 28, 69, 126, 61, -83, -109, -33, 27, 89, 52, -4, -101, -154, -124, 24, 90, 91, 23, -44, -71, -82, -91, 52, 98, 118, -61, -81, -71, -92, -39, 136, 106, -62, -41, -32, -119, -81, 113, 115, 42, -61, -67, -102, -64, 60, 123, 82, -16, -75, -93, -99, 3, 123, 73, 57, -66, -135, -113, -5, 74, 90, 114, -59, -111, -90, -10, 26, 77, 8, -25]
3873b5J0j62O1J68M5o6o6k3n7PP3J18K4n7k9j26%P7Q0N9m9l7o2j15M6R1P8j8q
3902C7q3m7O0L2M7L4K0j16q0pJ10P5mL8j14j16m4J73K9O5j6l9n5j46M4R6j4J02
3930H1pp3j16J4J25J0O7Jj00j00K7j9P6J51q1m6o3o8O8N2K2J15j06j11ml9R7P0
3958D3P3Nj52l6n4M1Q3J46l8j01j02l3N3L0J76pj00q3n8KL7J43N3p1r6J3j19M7
3986a05J47M6j4q1jr9LQ7J58o3m5j03om6K2K45p1jk4j39j4N2J24k6OJj04p8J7
4015a12R6M9Q5o4o3j23J5O5J06jJk5o7q6N5J46k0O7r3m9q0j0J28J02nj6j05j12
4043a16l3J27N1J02K2j21r3j9KQ0M8J09q9j70j2L0Q0P3N3o6j12o7M3L6N2N6K4
4070I0j07j21N5jJ02KN1j5j27l9P7K7R4L6k6q7j44M4j5J80M4p5l8q3k4M9M5J86
$$ y = [-25, -15, -177, -116, 52, 97, 31, -35, -58, -115, -108, -35, 83, 107, 50, 21, -105, -105, -28, 52, 111, 62, 25, -37, -152, -106, -15, 63, 45, 37, -46, -93, -33, -1, 46, 80, 100, -16, -96, -103, 7, 82, 78, 116, 2, -114, -158, 15, 44, 109, 93, 54, -1, -147, -103, -7, -21, 81, 74, 1, -115, -101, 24, 34, 101, 102, 2, -98, -71, -90, -14, 137, 56, 10, -53, -121, -53, -1, 21, 136, 30, -81, -85, -124, -27, 43, 116, 121, -31, -67, -121, -80, 3, 149, 111, 10, -92, -125, -72, -42, 134, 127, 27, -56, -114, -112, -75, 68, 121, 50, -46, -33, -152, -105, 42, 88, 74, -7, -8, -107, -104, -17, 141, 78, 33, -70, -76, -122, -100, 145, 74, 73, 49, -90, -104, -52, 72, 46, 52, 53, -51, -129, -112, -16, 33, 118, 54, -9, -132, -117, -52, 54, 53, 54, 29, -38, -124, -69, 77, 57, 124, 31, -18, -98, -108, 20, 122, 117, 101, -4, -116, -149, -22, 29, 131, 153, 32, -61, -80, -78, 2, 50, 159, 70, -100, -112, -82, -2, 71, 124, 58, -54, -121, -78, -42, 10, 66, 90, -17, -138, -83, -84, 18, 20, 71, 56, -71, -110, -33, -6, 88, 124, 98, 11, -133, -89, -104, 76, 120, 45, 7, -76, -100, -51, -6, 180]
4098A80j86N3l8j18N6K3R1O9j16o8K6o3mJ80L1n0r4k0m5J9J04M4L2j74N4q0j8
4125a12Q9J35%n6r1m4j5J15nO2Qo8q6m0O2J15K0l2Kj25r1QJ36P9J7N1j25j28J5
4154a04J46PPO3j01p5o3O9Q7K1K4m5j08m3lQ7J29rJq1j37L2N2K7J24p4l3p0o7
4183a37O0J05R6o6Op1j00M2L5J16K7p4j04n6K9O7K4J92j32r3Jm2N1M3P2k9K7j70
4211h1Rj1J30k3O5rj58L7n3Q7K9M7m7n7r1JL9J32L5K2p1j02l2J6N9J51k4l0q2
4240a2k0q3N9J34O0q9m1m1o9JP6J27rj04p9ql9J52Q8J0j08Kn5r1J04O9Q6p1kj12
4270f5n0L7R7N7Lp8n7o6LJ31L1K2l8m4j07l0J47O5J5J7nj85rP7L9L5O3l7j12o2
4300a06J1P4L4J45o6r0j16J8R0lR1L9j22q1m1Q3M0J05K2j26q6k0N2N4J00l8K9
$$ y = [180, -6, 47, 9, -109, -53, -30, 61, 130, 14, -54, -28, -91, -95, 85, 116, 66, -28, -48, -93, -74, 30, 74, 106, -68, -14, -94, -112, -23, 112, 112, 56, -35, -79, -94, 21, 16, 78, 86, 18, -68, -108, -46, 69, 89, 57, 59, -66, -157, -149, -13, 66, 83, 134, 9, -119, -104, 42, 49, 56, 119, 18, -57, -120, -51, 36, 57, 81, 36, -72, -115, -118, -31, 98, 89, 90, 9, -128, -96, -44, -17, 107, 33, 0, -70, -137, -77, 28, 124, 58, 64, -7, -107, -65, -30, 86, 113, 39, -65, -121, -92, -25, -1, 191, 59, -34, -33, -75, -24, 19, 91, 62, 89, -81, -72, -83, 47, 24, 89, 80, -78, -41, -94, -7, 22, 69, 22, -35, -126, -125, -86, 46, 81, 103, 32, -70, -102, -86, -27, 124, 100, 70, -12, -32, -115, -56, 78, 138, 49, 8, -33, -102, -101, -25, 102, 93, -11, -90, -98, -137, 15, 103, 113, 5, 7, -48, -139, -35, 34, 120, 49, 47, -65, -115, -78, 19, 76, 79, 1, -56, -122, -119, 12, 43, 65, 27, -17, -124, -154, -7, 58, 73, 90, 85, -100, -109, -32, 7, 42, 105, 68, -44, -106, -95, -21, 13, 158, 92, 2, -114, -96, -6, -9, 82, 121, -1, -82, -123, -40, 0, 105, 127, 1, -85, -105, -53, 1, 101, 63, 92]
4327I2j77K5RN1O2lK3l8j33J9M3N3Q0l0q2p2m5oJ44N8N7l3q7r7K7K0Q5O7l8q3
4357io4k2k8J09J25l9j08k7k9O3k6J37O1j21o5j9j9O4R1K7p8p6l9j0L1P9P6m1
4385D3j9q0n7L7R2L9Rjl0j52qR3P5PlLj30j06J54P4O8j0o0j23rk2J21O8qm1o9
4416d5o0k3J15M8M0Kq2q8P2k8R3L2j2m0n8k0K9QP4orr9jl6J09M9L3j3m8j21J8
4447f7L8R7k9Q1m8j47j6L2N4R7J8j35k0j01R7j2J56n7K4p7p2J2k8J20J14n7m7
4474B7j27J7RM1R6N6o7l6m6m6N2Q2M2j0j47l6N4lO5N7n3m5k6k5M8J8J20m5q5k
4504a5q2l5P1J11Rk3q6Oq5M0J77j6k9n9m9n6O2Q8K6K5m2o6o6L6J27j3Kj8j00J0
4534e0k6L7N0J04j5j06o9k8N0P5j3O1k5p0q0J1J23rK0K1n2p2l0J47J7rQn8n1o5
$$ y = [92, -85, -60, -51, 0, 62, 59, 82, 44, -89, -70, -27, 26, 106, 76, -6, -78, -123, -129, 15, 73, 130, 97, 10, -87, -60, -40, 45, 112, 74, -9, -73, -95, -123, -14, 111, 72, -36, -63, -92, -29, -55, 82, 143, 22, -43, -62, -81, -17, 74, 101, 23, -53, -92, -102, -71, 8, 84, 43, 24, -56, -113, -76, 16, 55, 64, 63, 33, -119, -127, -34, 41, 48, 45, 48, -82, -188, -34, 40, 108, 98, 38, -85, -94, -116, 5, 73, 65, 24, -45, -105, -128, -13, 35, 75, 77, -5, -93, -21, -49, 44, 76, 64, 24, -34, -54, -25, -17, 57, 51, 42, -57, -58, -94, 15, 64, 97, 84, 36, -85, -67, -29, 68, 39, 120, 72, -75, -91, -59, -5, 92, 110, -25, -45, -146, -49, -61, 95, 38, 62, -15, -87, -75, -103, 17, 131, 74, 27, -100, -83, -74, -33, 63, 119, 52, 16, -30, -76, -24, 58, 100, 90, -57, -93, -39, -42, 23, 80, 27, -18, -44, -69, -21, -3, 117, 72, -13, -15, -97, -132, -61, 50, 59, 36, -50, -44, -129, -89, 88, 72, 43, -16, -65, -121, -59, 29, 55, 80, 38, -28, -94, -58, 69, 56, 58, 40, -60, -50, -76, -39, 11, 115, 100, -6, -75, -103, -53, 22, 9, 70, 45, -25, -105, -94, 29, 20, 40, 61, 9, -63, -93, 54, 71, 62, 70, 12, -39, -104]
4564a04Q5O9M7J3k2j05j09P7M5M0Q1m2o0q3J7J03l4O7J5j20o4jP9j8J28K2j05
4591B1n8m3O3M0L5M3j1j65K5l2M6N5O8j4n9q0LK3L5J02n1l4l3o6KJ19RO2m1l6
4621B8p6n5M0J46jn1M2j51K5M8O1L8l9j9p2m1K7M0J22p4k7k4n0l9R3L1P1o4l7
4650hm3o1N6L0R6J7p0r0j2J3N0P2M0l8n2o2qL7J14l2J3p4m5m2O8R6J7L6r4o5o5
4681a06J3J22M7pnp4r7O1K8O4M1l3j7r3n6M6R2NM5m6m4r8L7O3P9nj7n1o2K1JJ22
4713G6M9l4r5m3J0NN8M7L6j00o7L0pK7P6j7po5k1P0p4J00N1o9j05nRL6M5O6j5
4744F7n9k9l6m3Q5P5Ro6o9J8m9L6J52K8m3l2n0n3K1P0J17p6m9l0p6j0J29L7jo2
4774A1Jl0l7O5Q3k8%l2o4n4L5N7N7k3n5nl3N7M0J7J0K6q8j32J6J71Ko2M8q9J4
$$ y = [-104, -19, 50, 97, 110, 88, -17, -126, -49, -4, 36, 117, 75, 15, -68, -51, 52, 18, 85, 100, -20, -84, -85, -6, -24, 104, 126, 21, -37, -80, -17, 23, 58, 101, 90, -75, -50, -82, -36, 19, 87, 73, 14, -66, -63, -40, -5, 97, 46, 12, -21, -87, -85, 34, 43, 105, 64, 28, -48, -103, -63, 83, 82, 31, 73, -78, -53, -5, 56, 94, 55, 36, -36, -77, -50, -10, 112, 38, 11, -13, -63, -102, -9, 22, 93, 29, -8, -51, -112, -56, -26, 70, 87, 17, -73, -85, -72, -22, 50, 90, 52, 0, -62, -70, -33, 81, 49, 62, -12, -57, -99, -31, 65, 82, 118, 24, -41, -106, -93, 29, 76, 69, 64, -10, -107, -46, -18, 46, 87, 54, 37, -56, -112, -66, 26, 31, 76, 30, -14, -112, -75, -12, 67, 62, 45, -6, -68, -47, -46, 76, 125, 91, -4, -47, -37, -32, 26, 73, 109, 9, -58, -28, -35, -8, 68, 51, 44, -21, -42, 28, -46, 54, 105, 36, -69, -74, -65, -29, 16, 82, 67, 8, -21, -57, -100, -15, 60, 69, 3, -66, -48, -97, -61, 91, 119, 76, 44, -6, -59, -38, 32, 149, 73, 24, -6, -82, -92, 37, 74, 73, 11, 12, -18, -55, 10, 93, 65, 65, 33, -31, -85, -50, 7, 64, 41, -14, -19, -52, 5, 45, 62, 72, 98, 10, -122, -106, 65, 67, 5, 53, -36, -22]
4805b2k8K1O5J0Lm2k5o8J04J1N4J2p1m8n8qR2kO3k0o5l0J2K2oJ14l1j2j34O2p
4836c2K7J5Q2q0m8m0L8KK6Q8k4n3j00P4j1Q1O8N8j84k3l2L7L9K1L4l3n5k6l7Q6
4866bK9R7p6l2p7l4R5N3K6m1m3j8j2J9JQ1k3n3J7p0L5k3J24Ko2p4j0j0L4O1O0
4897G4l0l6p3nO1M8k3N6p3n6j0j5R9R1p0lk9j00J6R3N5l4l1K7m4q0R4N5j4Mj2
4928C5j03L1m1J02M4j9k8J2m4j7kP4L1j1o9n3m7M1J19KK7o2q3l6N6O5K5M5j4o1
4958A9j18O6M2K2J9JJ5j16m9O7R5o0O4j5p5k6K7J6Q1J4p9k2k5o4J43l0M1N2j04
4987Ak6l7L7K7R6K6j01o9m6L6K3J11p3J5p6J6OM7J4L4l3o1k1QRO7P9m6k5o1l7
5018f0j7J29K4j0k3m0m3l8P9M7O1m0j31J6OJ2N7M6m5ln5k3k5J06M6j5k3k9j14
$$ y = [-22, -50, -29, 36, 46, 49, 7, -18, -86, 18, 29, 83, 95, 24, -24, -82, -90, 2, 0, 63, 43, -22, -52, -40, -18, -24, 90, 59, 47, -87, -25, -32, -5, 10, 92, 12, -36, -76, -38, -36, -10, 78, 54, 1, -99, -25, -36, 45, 113, 171, -13, -36, -68, -31, 8, 29, 63, 30, -25, -51, -88, -2, 27, 124, 48, 16, -61, -95, 0, 53, 79, 38, -5, -23, -35, -16, -15, 66, 43, -10, 7, -63, -28, -51, 73, 75, 13, -61, -71, -81, -47, 14, 74, 44, 8, -65, -70, -9, 39, 16, 72, -1, -57, -67, -82, 17, 108, 38, 35, 6, -94, -78, 15, 70, 36, 5, 32, -12, -92, 2, 57, 43, 47, 35, -68, -37, -78, 24, 68, 49, 21, 33, -11, -28, -30, 44, 75, 64, -5, -58, -105, -64, 55, 57, 84, 22, -61, -97, -41, 24, 49, 94, 80, 19, -99, -33, 9, 31, 50, 51, 66, -50, -99, -32, 63, 3, 67, 52, -23, -49, -22, -6, 75, 89, 10, -12, -37, -101, 42, 12, 53, 105, 1, -25, -62, -25, 2, 98, 124, 23, -46, -92, -56, -33, 78, 5, 20, -56, -40, -34, 13, 27, 61, 28, -33, -54, -46, -37, 30, 109, 63, 38, -23, -60, -77, 52, 76, 66, 43, 3, -40, -78, 1, 48, 109, 69, -62, -46, -40, -28, 29, 75, 30, 27, -28, -51, -76, 30, 76, 61, 38, 9, -105]
5047a05N8J9M8M3k5n1n3J8J7P5L9l3n8Op3J3J02J6jl8o9j8J2L9R8l0J6m8q0lJ40
5078G4j0l0j5j4r6N0OQR1Rj3p1l2JQ5J9K8l8q8k7k8P1O5N1m5l9n3q1O0R5K6Ln4
5111Hl9k3MM7M2J6j9p4mL0Lj2J27q0l9K8p9lQ6R1l9o9k8n2J5O6L1M3j5o4r6M3
5143e5L5J44m1k2n8p3MP6j7J14m9o6L3j12J4O6O3j9m2j0l2jL9P9m6J2j4n0o0L3
5173e5P1ON0n0p0j0M2J3K3J4j1o1m6MR3l5O6N9j19j6L1J0Q2k5j2j7l1m6l2N4M4
5204B6L8Nj09pk1N3P1k3L4j15l1M4J3L1M3kj7n2p5Q0KP1n3M7j30J3K0j1R8J1m6
5235Hm3n1J6M5L5M8J6o2m7j9PP1M6Nl9n9k7L0j6O5J5Mm1o6k7P9K3K1j3l5l1k1
5267f3N9j1M7Mm3k5q0O9O4k3P8n6n4N6n7%O0O4l7p3J2n9j7P1R5q8K3l9l4J1jP9
$$ y = [-105, -47, -28, 20, 63, 38, -13, -66, -48, -31, 44, 83, 50, -8, -2, -75, -62, 40, 56, 55, 17, -52, -70, -58, -19, 79, 49, 65, 17, -63, -66, 74, 64, 34, 19, 5, -91, -41, -35, -27, 64, 73, 60, -11, -43, -42, 43, 62, 90, 52, -36, -63, -91, -20, 45, 96, 51, 12, -41, -122, -62, 33, 59, 62, 8, -31, -54, -50, -3, 39, 55, 36, -38, -42, -12, -9, -21, 106, 26, -13, 15, -64, -67, 19, 110, 71, 2, -26, -78, -63, 3, 34, 77, 62, -2, -98, -55, -20, 124, 83, 61, 3, -70, -66, 10, -7, 107, 58, -8, 25, -87, -73, -7, 56, 37, -5, -15, -47, -48, -9, 70, 24, 36, 22, -28, -88, -55, 16, 22, 72, 22, -48, -58, -16, -3, 20, 34, 23, -38, -84, -80, 13, -22, 44, 103, -16, -32, -1, 9, 91, 66, 54, 37, 6, -40, -72, -18, 26, 64, 69, -40, -47, -68, -15, 56, 33, 67, -48, -79, -35, -22, 9, 52, 50, 33, -19, -94, -14, -12, 59, 6, 53, -77, -64, -44, -55, 43, 54, 8, -35, -86, -70, -25, 10, 58, 74, 12, -35, -54, -47, 24, 70, 75, 36, -23, -50, -20, -36, 29, 44, 48, 7, -59, -86, -7, 16, 37, 24, -11, -42, -63, -4, -15, 32, 36, -7, -32, -112, -43, 21, -2, 76, 20, -34, 22, -35, -35, 25, 89, 52, -21, -9, -68, -85, -14, 81, -7, 16, -23, -57, -46, -47, 32]
5299C2K1n0j0m0n0M5J33m4j0l3%m7J7N5O4p2J5n7p9L0N7R0j7l9l8l9K0M4M0K3
5329F1m6j3o6j8J4P2L2J1j8kj19jN0J05j5o7k2l7L0R1o6K5M7q1l1J1M0O0p0J8
5359eM3o7M6j03P1L8K2Rk5r7%R2J9j3N4j10q6J03j8M1K6Kk5m3Rk7P9L5k4j9n9
5390c2M1l4OM9N9m7o4j1kj9L8R3m2m5l0pk5R3K8%J9p1l1KROO1J3n7n0PK6L5JP4
5425I3n9o0l8K4O5M6l3k0k8k9K0m1J44m4k3J6p6mJ8P4n3O6r5O6q4QO8K9Ll9n2
5456c8m4Q2n1Q0J1j8Rr7RL2L0K9l8J4l9qK7L3L0K3j4p5o4J2M3M6O6p5k0k7KmM1
5489GK9K1j5p7mk0O3L0K0k6j6k2j9l8O7J6l4l0pl8J04J4kO6l7m4l8J8KK5N8m0
5521C3q4qN0OP3J6l8j0j10K3K7JN1O5o0j11O2m4P4L8k6J2j31M7j9O3O3J0p2jk7
$$ y = [32, 53, 3, -7, -47, -97, -52, 81, 37, 27, -6, -6, -53, -36, 19, 83, 11, 26, -31, -110, -80, -23, 67, 50, 11, -27, -66, -46, -2, 38, 61, 15, 2, -64, -82, -68, 4, 36, 47, 29, 27, -92, -93, -43, 62, 47, -20, -42, -79, -49, 42, -24, 1, 48, -33, -64, -53, -13, 47, -23, -5, 38, -29, 17, -86, -15, 23, 45, 54, 29, -68, -68, 24, 43, 30, 84, -26, -112, -9, -27, 14, 40, 42, 17, -26, -17, -44, 35, 70, 46, 27, -32, 9, -25, -19, 30, 89, 42, -22, -33, -35, -54, -16, 77, 35, -10, -40, -47, -72, 21, 49, 49, 68, -3, -34, -32, -23, -17, 44, 57, 0, -50, -43, -17, 18, 19, 93, 34, -26, -64, -40, 25, 71, 38, 18, -10, -39, -19, -60, 84, 40, 17, 33, -43, -47, -29, 45, -8, 58, -37, 29, -55, -47, 21, 50, 53, 14, -38, -82, 0, -51, 29, 40, 22, 31, -66, -57, -25, 5, 34, -4, 10, -29, -37, -10, 23, 53, 76, 62, -13, -77, -65, -22, 24, 90, 15, -5, -32, -30, -34, 7, 36, 57, 42, -35, -39, -59, 4, 34, 54, 28, 12, -10, -29, -67, 0, 16, -18, -48, -55, -93, 11, 25, 23, 89, 52, 8, -30, -12, -10, 15, 73, 33, -51, -59, -9, -3, 70, 86, 48, 38, -72, -49, -22, -21, 30, 95, 35, -76, -14, -58, 16, 54, 28, 40, -91, -44, -63, 0, 63, 73, 1, 0, -27]
5552b7j8K9J3O3k8l2l6k4L5N7K3l1l8o6K3l1R5K4J1l4k6j4q5R1K4K6Qm0M8p6l3
5583f9R7J7k1N6n6j33Q3M8kJJ1r3L1k8O6J8K2j9J3o8%PL9KL3l0o0k7J7L5P2l2
5615C0k4m9LL0qJ10k9kj06m2K5K5N0qK5jq5L0n4O4O2J5r6K0q4N3K3N7K2k4r0J8
5647d0m0M2R9m9M3k8o3j8K1%P8Nj1m6mj4P4JL5l8l1j1k2l3N9M4j8k5J2q5J3M5
5679eL5J5k8k9J5n5J6P6l1j9lk2qlK9P6mn9l9nKmR3O2p8m4Ml6J1Q6Jp9J5n7L4
5714c8j8O7P0j1n5Pj09P3J0L6Mj4m8k1n0N8N4K4M7j24k4j6N8L2M1pm1n8l2N0N1
5745A6K6j6K7m6q4QQ7M3j3J4r1K5m5L9N5J0L7r1l0m3Q8KRK1l4l0j6J0L2L6l5N3
5777F4n0p6M5OO9rn7j4rK8lk5N6J2Qk3q8J3O1O8k2m7m6K8k3L1KJ5K2l2Nl8j8Q9
$$ y = [-27, -45, -16, -3, 60, 32, 0, -36, -60, -25, 32, 55, 24, -14, -80, -57, -88, 7, 31, 42, 8, -18, -32, -117, -26, -2, 24, 32, -8, 40, -36, -69, 28, 45, 24, 80, 24, -109, -26, 22, 20, 21, 32, -61, -30, -58, 8, 26, 48, 29, 42, -26, -26, -19, 20, 22, 55, 25, -35, -62, -45, -10, 62, 30, 6, -43, -40, -10, -18, 92, 63, 61, -45, -87, -62, -37, 13, 5, 30, 29, -56, -26, -80, -16, 46, 61, -35, -15, -99, -46, -23, 34, 56, 32, -58, -40, -80, -38, 61, 12, 55, 27, -36, -54, -33, -33, 45, 50, 39, -7, -11, -25, 49, 50, 85, 47, 16, 5, -17, -50, 9, 53, 35, 10, 22, -63, -50, -5, 30, 45, 17, -12, 3, -52, -36, 40, 9, -10, -13, -35, -43, -46, -17, 59, 55, -4, -43, -48, -46, -50, 43, 105, 27, -17, -13, -49, -38, 48, 49, -30, -15, -72, -38, -56, 11, 81, 70, 15, 22, -87, -14, -4, 32, 36, 22, -26, -47, -97, -39, 15, 39, 86, -38, -62, -78, -20, 12, 53, 46, 5, -53, -85, -35, 16, 42, 26, 53, 7, -77, -69, 18, 61, 48, 62, -29, -4, -49, -10, 45, 55, 92, 1, -29, -72, 16, 18, 27, 48, 14, -16, -32, -22, 10, 46, 11, 64, 14, -62, -17, -11, 58, 49, -8, -22, -31, -3, -6, -31, 25, 37, 45, 22, -66, -53, 8, 76, 54, 7, -39, -11, -34, -3, -1, 14, 36, 4, 9, -29, -47, 42]
5811D2K3K3r9lm2K2N5jJ9k7J4j03Q0m5N2J6qk5j8K5Ok0M9N6j07Lj8n8Q8O2k6J7
5843E2n8K6l5QO6nj0j9r8P2m9N0M6l5j1n3j5N6K6k0L4M7p5l4J0J5J8LL3k8l9k9
5875e1M7N1m6J7lm6m5Q1rL9J0l0Lo3L0J6O1k3Q0j35jn2O9J4N2r2O1rq0J7J9N9
5907D1k8qpr5P0M9MJj5ql5k4O4l5RJ10q5Lm3L5J2K4J2m6J3p3J7J2O8Pj7m1J5r1
5941h5P7L4k7M7j5n0m0O5J3J5j4J9n5o0R7nN2pJ9j16rK3J8K2j9J3l5mn7L9pP6
5973B4L3j4n0K2m3l2P3K3K3j42N6k7K1K0J5O3r4K9r8N9P5N3n5pl6m5J0L4R0n2
6003B8k7nl3k5j2J06k0kl7Lo7L1M9P7m7kj0p5P5m5J18o6L4l5m0j9M1L0N3o9K1
6034C0q1J5M9J6k8nK5k3qj3j4L0Q0J8r3n0K3oQ3l6J9lp0l8O4m1J17n2RL7j26L3
$$ y = [42, 65, 88, -11, -14, -56, -34, 21, 20, 39, 12, 26, -77, 3, -42, 10, 26, 18, -7, -25, 0, 6, -14, 35, 91, -16, -13, -31, -89, -1, 61, 35, 52, -6, 20, -15, -7, 59, 54, 44, 25, -73, -1, -50, 0, 46, 11, 0, -53, -68, -12, 14, -6, 28, 75, 0, -34, -24, -9, 9, 12, 45, 17, -22, -51, -4, 47, 1, 18, 15, -31, -76, 5, -4, 35, 45, 15, 18, -45, -15, 1, 62, 39, 119, -16, -17, -69, 0, 14, 66, -26, 35, 26, -54, -37, -18, 41, 13, 5, -2, -97, -27, 22, 26, 27, 12, 4, -31, -55, 9, -26, -17, 93, 8, 11, -32, 3, 15, 39, 51, 5, 18, -55, -38, -26, 42, 49, 32, -9, 6, -85, -8, 26, -1, 46, 31, -19, -59, 6, 19, 34, 20, 39, -16, -76, 21, 16, 68, 61, 80, -36, -45, -22, -4, 18, -1, 12, -23, -27, -84, -45, -52, 24, 57, 43, -7, 15, -28, -60, 13, 36, 59, -83, -27, -54, -33, -13, 2, 65, -29, 0, -98, -39, 36, 89, 34, 27, -9, -54, -44, -10, 80, 28, 1, -4, -37, -62, -74, 32, 12, 10, -27, -24, -91, -60, -11, 66, 19, 17, 7, -68, 7, -38, 80, 14, 48, 13, -27, -46, -5, 25, 78, 9, 30, -51, -36, 13, 29, 1, -4, 21, -2, -10, -23, -37, -7, 73, 91, -2, -52, -29, -35, 48, 12, 31, 28, -42, -80, -16, -57, 60, 8, 17, 54, -72, -39]
6066c9J6L6j2M1m3J8m9M8m0J4mK5J4p1R2r6J37n7L2j00O2l1nK2J9J5m6m8m6M0
6096e6N5J11n9p1%LJ5M7J1p2J0L8q0J9M8Ol2N2m4j4m5O2J7M2n7l2j4L2k9O6n5
6127b6K5Oj5j1j9N7J0L1k4K8j40O2K0RL8k7J0j9m7qM8NkQp8L6L4QJ2l8N3j7n6
6160b7n0P2M4k4j3l0mk9J5L4M0Qk3l9K9j2NkN2K2q5nNM6K3k1pn5m4R1r1K5Q4J2
6194D6l2o8J6k2N9k5Q9n6J1l3k4L4n2Q3j5l8K%LN6Pp8O4l7j2k6P4k0L7n7j2j1
6226c7J9J4R0p6lo0J1N3l8J3j4O7ml4lk3L2J5k8L0k9q4K5P9nRok8ql0kL8L5K5
6260D3m5L5o3J8OO9L0j05O0j17M3O1k4L6l8Rm0j8R8K2o3L7j1m3l8k0O4lJ0J0m1
6291a8k5k4Q2RkK5q4Nn0N1mO8m0J3k2j7qK2O0%k5n0k6P4lM5l1j9k9m7M1qR9o0
$$ y = [-39, -23, 13, 1, 42, -1, 17, -32, 16, -24, -10, -14, 11, 25, -46, 46, -50, 87, 30, 62, -38, 24, -7, -12, 10, 29, 44, -2, -50, -96, -56, -1, 110, 51, -20, -20, -17, -2, 45, 56, -16, -6, 32, -48, -29, 19, 25, -7, 45, 1, -13, -58, 4, 21, 63, 6, -26, -40, -8, -37, 29, -26, -1, 5, -10, -21, -40, 17, 27, 58, 34, 62, -78, -16, 4, 13, 51, 24, 34, 15, -32, -40, 8, 13, 11, 19, -59, -23, 11, 19, 31, -7, 46, 29, -27, -77, -5, 39, 15, 2, -28, -32, -61, -46, -12, 28, 36, 13, -26, 3, -9, -4, -6, 46, 68, -17, -22, -17, 29, 52, 31, 24, -31, -75, 16, -75, -50, 34, 46, 14, -54, -38, -60, -1, -26, 63, 7, 18, -15, -39, -5, -57, 26, 11, -27, -25, -25, -22, 34, 41, -37, 27, -10, -22, -48, 26, 6, 43, -14, -26, -37, -18, -4, 86, 10, 7, -53, -42, 11, -27, -14, -28, 39, 35, 1, -2, -25, 7, 22, -6, 24, -5, -89, -64, 15, 10, 19, 13, -15, -23, -53, -55, -17, 18, 43, -2, 33, -30, -12, -6, 63, 93, -12, 48, -69, -26, 35, 11, 47, 9, 18, -22, -40, 58, 80, 17, 54, 43, 0, -38, -58, 6, 3, 13, 23, -18, -43, -67, 15, 24, 22, 47, -37, -32, -82, -31, -35, 33, -7, 6, -16, -33, -41, -19, 41, 41, 16, -34, -60, 14, 11, 56, 25, 6, -23, -70, -29, -37, 62, 2]
6325BL8j7n1k2K2N2mrL1r0j4P9j9nM7l2o6M7m4J1P8j7L6n9J2Oq8J23n7j4NK4n1
6358d6L7L8l0M8l8lOm8%Q5j0n3m5mQN9L2kM0k8l2p2K4P8M4j19Rk2Rm6N6M8Pj9
6392A1Ln9m2jJ20m0L8%k7ol1L9K5K5n7m9oM0QRL8k0j1k3J6j6PL9K3k8q3K9Rj3
6426c3Q4k2nk0j4o2R0mJ4pjkk1k0MN2J7l3j8Kl2M9L9k7m2qM4q7M2K5N6l6l1j4
6460b1J0l2MQ5n4L6j3k2j6nL1K8k5L4k0Nq2J32k9j1r1J7L6p7Q3L2l2j5J6o2L0
6491b8j6J09m6p3L3jm7N4L4%l5L4J1k8j0k1O7Lr5O7o8L4L0k5k2R1j9m7k0K4L8
6522B8j4%k0j6LK0K0Mm8L1m5MnM4mk1N2m5%j5J3L4L9q0J7l2l8N5K0j5P1l5J7m2
6556cl5K5O8J0m7k7m6L9N4l2K5K1n2j6l5R5%j2m3K3J0J4m4m1K9J4K1k3q0J11l1
$$ y = [2, 40, 23, -28, -50, -28, 24, 20, 11, 42, -48, -62, 17, -2, -7, 40, 8, -58, -11, -55, -44, 34, 17, 53, -6, 6, 12, -76, 47, -10, -24, -19, 5, -46, -9, 29, -1, 47, 9, 6, 12, -36, -36, 49, 39, -14, -59, -63, -55, 4, 36, 34, 74, 46, 14, -58, -34, 44, 88, -31, -22, -44, -35, -81, -25, 23, 30, 11, 14, -45, -87, -88, 32, -8, 30, 30, 3, -3, -34, 5, 30, 55, -2, -51, -57, -17, -9, 0, 38, 18, 7, -16, 0, -16, -9, 30, 53, 25, -58, -29, -20, -33, 51, 29, 24, 4, -10, -72, 18, 14, 28, 21, 20, 18, -3, -23, -19, 33, 50, 17, -1, 1, -31, 18, 57, 30, -12, -20, 24, -63, -21, 4, 60, 24, -7, -21, -11, -43, -39, 46, -8, 28, 15, -7, -23, -28, 3, 31, 6, 40, 20, 25, -57, 75, 46, 35, -56, -39, -3, -80, 3, 35, 3, -12, 4, -58, -28, -44, 65, 19, -54, -21, -22, -69, -15, 19, 19, -16, 18, 29, 1, -9, -30, 37, 40, -55, 12, -56, -22, 8, -17, -39, 52, 33, -14, -34, -10, 28, 14, 14, -6, -22, -19, 1, 21, 25, -23, 8, -37, -33, -38, 6, 2, -19, 33, -12, -12, -27, -14, 20, 59, -21, -4, -36, -74, -19, 1, -14, 57, 22, 39, -3, -38, -13, 55, 65, 18, -9, -55, -16, 38, 6, 31, 52, 0, -16, -51, 44, 44, 32, -11, 12, 22, 36, -8, -49, -20, -6, 15, -8, -88, 23, -8]
6587hj5K2M7n0Kn2M9Rkkm3L3M1p0K7M7J0rm2n9J13p8L9J7J9k9o9L7j1N5l3N4n9
6620a0j5P%rK3J6m7J0kNoO8q6L7MM1n4OO1k5Pk0k1RKOj2M4oj2k0l1NP2pOp1J1
6658a4n2L3M6rk5L3l3M6k2L7Pk1j2j0Ll1o1J06KqK9o0oL6qJ3rM3n7m8rN7M6j8
6692B4Pm0q7P5P2l0J4j7J7o4M2k8J8j6L4j8Kn6jL4j0M3K7q4K5N0k7L8o0L4l2m9
6724f3L5j3Q0M0k2q8O6n8rL6L8j5j2k6K1j1JOrO0n6M1j4p8Q4k1N5j05M0Kk0N8
6756D3m8PK2l9j7J8k1M5N0n1mJ0m8j3k9J40q2K1k7j5J7L1nK5ln6oL5JK1L8j08
6788d8J18p0p3J13rj1J6k0j5n9R4qk9M2n9N9o7K6k4N7k8j2j1%LL6jPK2l8k8k7
6820d4L1L1J4P0j35j0L7JrM1k5M2m5L4k1k6J9lmpkK5j6P5m1J7J3p1o5P3M0m3K6
$$ y = [-8, -23, -1, 46, -4, -2, -54, -5, 4, 2, 0, -43, -10, 31, -39, -12, 35, 45, 36, -6, -65, 48, -30, 9, 26, 45, 16, -53, -16, -27, 28, -5, 49, -10, -25, -18, -18, -27, -4, 12, -35, -25, -27, -22, -28, 40, -46, -9, -5, 36, -18, -12, 49, 24, 31, 11, -10, -1, 1, 7, -5, 39, 33, 21, 1, -30, -25, 47, 40, 46, -25, -14, -66, -33, 13, 4, -21, 12, -21, 25, 3, 40, 47, 26, 14, 4, 7, -24, -85, 21, 23, 15, 44, -16, -22, 14, 6, 19, 10, 53, -4, -52, -61, -4, 42, 24, 31, -9, -96, -21, 51, 21, 35, 18, 35, -29, 13, -15, 3, -13, 21, 3, 5, -51, -52, -18, -28, 15, 42, -42, -17, 33, 6, 44, -16, 18, -14, -63, -28, -41, 39, 79, 57, -31, 35, -23, -32, 4, 42, 27, 15, -11, 10, -1, 0, 6, -3, 57, 1, 42, 28, -50, 34, 13, 68, -37, 3, 5, -15, 43, -5, 2, 24, -15, -32, -14, -35, 10, 60, 9, 5, 15, -33, -46, -75, 65, -17, 4, -23, -38, -21, 10, 5, 30, 27, -29, -35, 0, 1, 22, 60, -48, 70, 0, -73, 40, 31, 20, 36, 16, 1, -58, 36, 28, -1, 41, -18, 41, -26, 0, -24, 33, 5, -7, -18, -18, -15, 21, 20, 27, 49, 11, -17, -44, -13, 18, 32, 102, -33, -43, -6, -5, -14, 27, 2, 44, -1, 33, 12, -14, 5, 2, -2, -9, -11, 14, -2, 73, 32, 49, 62, -9, -74, -1, 39, -4, 22]
6853B2J8j03O1q1R8L5n8M0k5Rp6L2M1j9O4m7o9N8j0K4K6k3MJl8j6L9M6m4K2j9
6884A2l8krL5L7L6m5o9K8J1j2N0K7pp8J0K2J0k4K1L2m0l8O0p7L9k4O6M3r0j7j3
6916d4M8k7Q2n5Nl1j5N6l2MJ9n2M7k9L8Qk8lO2q1L6mk6P3k7P0q4K3l5K6J2n9J9
6949dm3%K7MM3k6L6rp2j0Q6m5j5P4j1l5QNn6Q5l6j4j5n7L3L2J1mL2m3JJ8lkN6
6984E1L6o1k1nkj4N5pl0kRkJ4k0L5j6o2O2j6J7p5Q8l0Qj8j1JjN4k4K5kl5L3ll5
7020dM1j8K1pl3L4m1M0j6j5J7J7p4K5J1N6j7l8m2N1l4M8J0Rl2k8llN9rrL5o3j
7054a3rJ7O3o7J02j03J2k6K0oK4jK3n5m4N7k5O0k1LJ6m9L5mQlj7J7j8Rk1j5M2
7087A1N4q3KJ1NrpJ6q%o7P2lm0P5Mj10P6L1n1l2O2Qok0J5J5pmL4o2j9O4j6m2K2
$$ y = [22, 40, -63, -2, -83, 15, 50, -8, 32, 7, 16, -60, -28, 13, -6, 58, 11, -58, 0, -10, 14, 40, 17, 21, 22, -16, -32, 7, 53, 9, 31, 12, -26, -28, -37, -2, 35, 71, 26, -43, -15, -4, -16, 34, 61, 54, -24, -14, 8, 18, -6, 15, 47, 7, -31, 29, -48, -9, -33, 33, 76, -14, -31, -44, 4, -23, 59, 4, 9, -22, -37, 19, -13, -9, 10, -42, 5, -24, 14, 22, -6, -9, 53, -28, 8, 4, -22, 51, 24, 94, 10, 33, -2, 24, 36, -23, -4, -47, -47, -20, -16, 27, 1, 37, 28, -44, -54, 32, -13, -28, 46, 35, 0, 8, 13, -43, 42, 6, -8, -23, -80, -47, -15, -4, -8, 24, -19, -18, 0, -3, -5, 51, 87, 26, 5, 0, -2, -16, 39, 32, 2, 0, 9, 7, 21, 1, 36, 20, -42, 20, 4, 21, -54, 34, 4, 12, -6, -17, -16, -17, 37, 13, 38, 36, 1, 34, 31, -4, 37, 19, 40, 33, 0, 34, -7, 33, 17, 2, 19, 36, -38, -13, -2, 54, 37, -1, -43, 8, -26, 22, 32, 41, 9, -19, -22, -25, 34, 25, 16, 51, -12, -13, -22, -5, 58, -9, 93, -10, 2, -24, -4, -10, 14, 13, 36, -19, -63, -6, -31, 29, 8, 11, 27, -22, 13, 9, 17, 14, -3, 14, -4, 5, -16, -31, 11, 65, -18, -16, -5, 0, -9, -16, 0, -8, -8, -75, -3, -6, -46, 29, 33, -77, -1, 30, -21, -53, 9, 17, 11, -9, 6, 21, 14, 10, 44, -18, -37, 27, 11, -31, -9]
7123iM6n6MRj0L0k9K0J5J4l2Mj3J9m6R6o9j4k7K5Kj2O3mk6J3m4K8J9M4n8J7p5
7156e6K5L3j3Qj0K5kk0pJ2M1k4l3rJ0lQ8n1L1n4J0K7q9P7m8K6K2qK3n2K2k9K4
7189dpO0q9j0K6oK8K5Mm5J5l6L3K6Nn4J4N1o0K0K8mm6J8N0j03L7RK0P5o2O3j07
7222b6%LK9K9k7%k2Jl0J8J4J9k9L2k9M0m0K4K3l0K0m0NL6MOJ7k2l8K6K5l6M1k0
7256B3%k5L8m5K9J4j7Qm0K5l4O1l3J3J2j1l3lmj4N8%J9l7J1q4L7O7m2j2K3m6M6
7289Dk8M0jMl7JJ2m1M3%M1q9L0QNLj4M5lk6m6P6o3N7m1O8j3n1J8j4K5J2Jk3L8
7324D1n9l5K3L3l0JJ7j3k8j2P9%N2p0j6k9j3J00j0LJ1m8%j7L2J7l7J5k2rK5m0
7356c9M6j0L5k5l5J4QL1K4j3l9l8K7j0nK5J4K1o9K3L4l5QoM1o3K5J1o8M0K4L6
$$ y = [-9, 37, -19, -15, -6, -16, 14, -15, 5, 20, 34, 2, 6, -7, 12, -34, 62, -7, -21, -48, -23, -21, -33, 30, 26, 0, 13, -31, -3, 16, 60, 2, 19, -56, -31, 2, -11, -3, -13, 12, 10, -10, -17, -5, 36, 12, -21, -30, -20, -23, 65, 14, 45, -9, 1, 28, -61, 16, -32, -6, 16, 8, 31, -21, 1, -28, -4, -11, 49, -40, -50, -24, -30, -2, 23, 27, -18, -3, -39, -6, 20, 25, -29, -15, 36, -24, -4, 24, 20, -26, -8, 42, -61, -24, -15, 5, 80, 18, 81, -26, -26, -23, 6, 35, 8, 8, -14, -13, -43, -25, -11, 8, -21, 11, -18, 22, -18, 6, 29, -1, 19, -21, -16, 20, 24, 30, 47, 25, -13, 13, 38, 2, 43, 23, 23, -2, 36, -9, 20, 34, 17, 25, -15, 10, -24, 37, 4, 17, 29, 18, -15, -18, -22, -36, 22, 22, 41, 4, 15, -69, -32, 35, -7, -19, 4, -42, 4, -24, 16, 15, 19, -18, -17, -5, -46, -3, -3, 38, -51, -21, -13, -8, -5, -19, 26, 23, -3, -49, 27, -36, 21, -20, 48, 35, -16, 2, -12, 13, 25, 26, 3, 41, -18, -53, -30, 3, -27, -26, -9, -22, -50, -62, 17, 17, 69, -1, -17, -46, -59, 41, 31, 34, 45, -3, -3, -20, 12, 29, -8, 7, -15, -24, 1, -39, 7, -3, 32, 7, -28, -14, -6, 25, 49, 36, -3, -41, -14, -24, -29, -4, 10, 31, -38, -15, 19, -16, -8, -14, 27, -36, -11, 0, -68, -28, -4, 32]
7388C2J4n3LK1p3K1P7m5l2L2J2J2k2K8l4j4j7J4M2k5l1M6m0J2K0NL0k1L0m1J1
7419A4l6pL5NJ1j5k6J9kqk2K5rjl8N4l8O9k8K0l0j5J2K9J2m8K7k6j7K6J7%m0L8
7453Gk2k8O2Jl0L4MRk9NRl6nL3LJ1m0k8L5oJ9K1m1N9p1M5l8PkM6l2L1k3n2N8j7
7489aj8J6L6k2j9K3l5J1R7o7rK4k8o1O1K8n3K9K9j8%k2j3KK9Jl2J5j0L2j6KRq
7523A2l3l8Q5%l3J2lJj7M3l0J7ql5rJ6K4l3R0j00K5K8j6L9m4kN1L4r2J7k1N0J8
7556D8n9k4K8k5L0lk0j4Q5o2m0L6N0k6L7k7k0Ql7N2k5M0k8N4m2n9QO0NNm1N2m4
7589BM0m5J3k3M0ML2m0rjK5k1Rj6l0L5m3J2QJ8k7nk0K5j9J9j9J4k9M0K2j2j3M1
7623B7j00R7K6k7J5K9l0kk9j4M1pk8L2pm7M3j3qM4j1mj1M5p1k6J8qK7j3L4k6l6
$$ y = [32, 46, -7, -4, 17, -56, -35, 42, -3, -35, -3, 9, 21, -1, 27, -7, -21, -38, -24, 18, -7, -38, 8, -32, -20, 0, 5, 35, 14, 44, 3, 14, -22, -29, 6, 11, 22, 7, -19, 0, -2, -10, -32, -7, -16, -17, -55, -1, -39, 30, 2, 22, -8, -23, -11, 18, 30, -18, 9, -17, -34, -8, 9, 9, -31, 7, -15, -43, 19, 20, -10, 24, 28, 37, 8, 13, 22, -14, -19, 14, 17, 28, -12, -40, -5, -11, 8, 29, -12, 47, -24, 21, -17, -10, -12, 34, 2, 33, 10, -42, 16, -1, -19, -3, 33, 11, -8, 15, -20, -9, 88, 21, 12, 36, 8, -53, 8, 36, -17, 12, 41, 23, 23, 1, -12, -10, 19, 20, -12, 3, -7, 25, 9, 11, 20, 12, -21, -59, 26, 26, -7, 5, 2, 3, -14, 29, -1, 16, 8, -27, -36, -20, 4, -29, 61, -39, -14, 14, -2, 37, -7, -9, 42, 76, -16, 1, -20, 30, 48, -11, -35, -7, -32, -2, -5, -25, -39, 46, -16, -56, -20, 30, 4, 41, 14, -6, 2, -35, 17, -8, 32, 4, 58, 16, -43, -35, 25, 30, 35, -6, 46, 2, 42, -3, 10, -13, 27, 31, 63, 23, 14, 13, 38, 17, 26, 10, -20, 15, -28, -16, -8, 10, -17, -22, -42, -17, -36, -17, -36, -22, -51, -11, 11, -1, -14, 27, -73, 24, 50, 23, 38, 67, 37, 35, 6, -8, 33, 26, -2, 30, 23, -24, 19, 6, -2, 42, 31, 27, 16, 61, -10, -36, -18, -26, 1, -12, 22, -4, -40]
7656d0M9rJ8k0J0M7o1L9o6P0l7j9NK1L3m9L5m2L0mKl5L8lm6O5m1Kj0l7P0L8k4
7689B9K5j4l3L8o9J6NK1k5m6L5K1k1N1k6J1n9J6M3Nk9k4k4Q5n6LJ4Rk5j2O1l1
7721fpM3m7N0O1j23K5M6o6J6j2N0n7O2ro5R2n9K3K4j03Q1ok9L1J0P9r7J9p1J1
7752c4M0oN2o0J1p2N4N0j2K4k7j1k1oK1m3R5m9oJ2j8PJ4%k9L9l2J2LJJ2rk0l1
7786c9j6L5j1J2M2k6ROJ6o3M2mn2O0m0J1M4j3m1kP3k8l2k4N2n1N4K9r0K3L4pJ1
7819A4j1j6N0o3M3J4n6K3qj9KOJQ4n6QK7l8J8l6J3J1L5j1l2J9r1N1j2K0qNL4l6
7853a5RjqJ7pj5%nL9o%J5k2M0kj9l4Q8l9j5nn4M9K0o4K1M4K0p4K0L1K8k4q2O8
7888A8l2%K8J0K0q8M9Km3L1k6K0K5k2K0l2M9j8K0k7K6k0%J2o9N4mJ7K8k1k9n5
$$ y = [-40, 9, 0, 18, -2, 8, 55, -6, 33, -33, 37, 0, -19, -14, 7, 40, -9, 26, -16, 14, 10, 12, -23, 15, 12, -34, 31, -10, -8, -18, -55, 15, 53, 29, 54, 40, 7, 45, -24, -8, -3, 18, -7, -53, -18, 3, -18, 33, 7, 18, -41, -25, 18, 23, -6, -30, -54, 31, -25, -22, -8, 1, -24, -36, 25, -6, -13, 30, -17, 33, 94, -29, -4, 42, -24, -8, -20, 30, -27, 35, 26, -39, 53, -6, 17, 41, -62, 19, 13, -16, 15, 25, 104, 7, 26, -45, -34, 6, 0, 52, -8, 3, -69, -15, 35, 23, 47, 20, 9, -12, -18, 3, -40, 55, 6, 0, 12, -6, 1, 15, 15, -14, 25, -7, 5, 8, 9, 21, 12, -8, -39, -55, -20, -31, -19, 23, -3, 6, 12, 28, -35, 7, 3, -49, 11, -29, -18, 26, 13, -28, -30, 43, 15, -17, -41, 11, -40, 14, 43, -47, -24, 10, 3, 14, 3, -13, 37, -26, 17, 31, -25, -2, -10, -29, -27, -21, -20, 64, 8, 16, 43, 5, 23, -13, 0, 11, 46, 35, 3, 22, -69, -18, -30, -10, -18, -13, 21, -15, -6, -7, -15, 2, -5, -20, -20, -25, 14, 8, 8, 23, 1, 41, 39, 20, -14, 74, 35, 20, 15, -39, 10, 30, -34, -13, 31, 51, -23, -3, 28, 56, 32, -50, 18, -14, -14, 14, 24, 44, -44, 5, 7, -36, -5, -31, -11, 14, -8, 12, -20, 29, 11, 31, 4, 30, 10, 10, 22, -47, 7, 3, 20, 48, 27, -2, -57]
7920e7P8pMj5L9j15Q5k8L5n1P5m8RmPK7Jl6Pj4pj2nK7j1N7Kj06J6P5Oo1j6O5p2
7955e0J6K2knk8M8Kj7jK3l9K2P9m5k7PRk9K3L7l8J9j9j0M1k5J3l0j7J6k9P5k7
7988A4lK3o0K8Lk6kk0K2K4KJ1n7L8QK2l4j9L5j2m1L9J1K9Jl0K4j9mMJ9k5J9pK1
8023C8o9M7lj7O0l5k7J9Rpmk2m1N6k6jQk0M7q9K2pNR7J7j8m7J4n5P1Kk8LJ0J3
8058B2m8M8J1k0Ojl8MJ0L0o2L7j8L4k2k1J6rL2lj4m6J9J5lO2m6j6M4j7j9mj0M0
8092A3nk4n2J13j8Rnnn8M7J0k3j9M5j0Mo0JOL4J2k8LK5J8n3O6k4k1k5N8ql1L0
8126B5Lm4Kj4M0n9J8K1mM0m2m1Q5n0Nk1K0J7n3Q7j7j4M3n8R5r3J8M1l3l6LL0k8
8159a4J7K8K1m9j5M3J4pMl6n6N1J3N9n5k3rlm2O8m9J12o3n2N0l9M0J1m5L9j4q5
$$ y = [-57, 21, 14, 18, 3, 42, -73, 12, -16, 19, -32, 43, -5, 4, 0, 7, 34, 35, -1, 6, -8, -15, -27, -32, -5, -16, 41, 43, -63, -47, 28, 34, -27, -43, 22, -50, -34, -12, -14, -19, -47, 1, 3, -14, -15, 8, -31, -9, 70, 25, -2, 5, 14, -15, 8, 45, 7, 26, 7, -3, 38, 13, 26, -4, -21, -5, -34, 41, 14, 11, 34, -26, 2, 5, -21, -23, -43, -21, 3, 5, 16, -41, -3, 5, 27, -7, -26, 9, -3, -44, -5, 6, 35, 36, 6, 30, 11, 7, 11, 30, 5, 24, 17, 38, -31, 16, 13, -4, 56, 21, -6, 13, 22, 15, 11, -11, -52, 4, -22, -23, -15, -35, 12, -77, -55, -62, -57, 40, 57, 39, -8, 6, -49, 22, 24, -4, -1, 9, 22, -26, 22, 33, 13, 19, 18, -20, -16, -6, 24, -38, -1, -19, 15, -7, -28, -12, -21, 11, 8, -6, -52, -33, -18, -21, 41, -5, -21, 23, 6, -13, -17, -27, 13, 8, -16, -68, 45, 27, 36, 31, 26, -32, 15, 25, 2, -17, 28, 18, 22, -38, -37, -31, 3, 15, -13, -10, 15, 33, -20, 46, 22, 1, -24, 34, 26, -5, 25, 28, -16, -14, -28, 12, -47, -29, -8, -12, 28, -14, -55, 30, -20, -15, -36, -16, 1, -52, 35, 18, 4, 47, -11, 84, -9, 9, 50, 17, -19, -16, 14, -14, 3, 31, 52, 3, -12, 31, 45, 38, 42, 6, -50, 1, 14, 73, 18, -5, -14, -17, -59, 9, -40, 72, 9, -43, 7, -32, 8, 19, -26, 13, -1, -86]
8191h6
$$ Imaginary data points
##PAGE= N=2
##DATA TABLE= (X++(I..I)), XYDATA
0@%%%%%%%%%%%%%%qJ6j6J6j6K4l2L2m0N2o0P2q4R2j08J24j40J64j85K08k35K64
36A40k98L33l71M16m63N14n71O31o98P73q52R39j035J140j256J381j523J684j861
55i77K061k289K551k858L219l654M192m873N768o998Q805j1723J7206l0977J29093
70A08546K66465j90884j95362r9762j34986l0730K94197K83469l3682k03528j56625
81i2882j37696k7382J93478K58954Q2952j00229k11649k03682k0063J77564J84239
92A03604J17794K9963j74472k94955p5974J84233J67242R2257R9428p1981l08070
103a30931j82275J39394J90130R3330J02029N963k38418k41443K8678J81352J42891
114I0700J04865J9661j62786k23576p0061J03813J78479J57860K1793j40211j75197
$$ y = [0, 0, 0, 0, 0, 0, 0, 0, 0, 0, 0, 0, 0, 0, 0, -8, 8, -8, 8, -8, 16, -16, 16, -24, 28, -32, 40, -44, 48, -60, 64, -76, 88, -97, 111, -124, 140, -158, 175, -196, 220, -243, 271, -300, 331, -367, 406, -446, 493, -542, 598, -658, 723, -800, 884, -977, 1084, -1205, 1346, -1512, 1707, -1947, 2245, -2628, 3140, -3858, 4947, -6776, 10430, -20547, 108546, 375011, 184127, -11235, -110997, -245983, -276713, 17484, 300953, 267271, 63743, -92882, -230578, -257960, -64482, 194472, 277424, 177195, -34454, -238136, -258199, -80635, 103604, 221398, 251361, 76889, -218066, -294040, -109807, 57435, 149692, 249120, 177139, -130931, -313206, -173812, 16318, 109648, 211677, 217640, -20778, -262221, -233543, -52191, 90700, 195565, 215226, 52440, -171136, -241197, -137384, 41095, 198955, 220748, 80537, -94660]
125i4660j06696M06J54042K21517O5869j31216j56921j05254n8598Q3675K30591
136A02755J41515q5949j62617j11181p5291K5410J89001J84193q137j42549j40510
147h3360r3191L135J39863J78465O3022q6710j58940j31001j7507J12216J58615
158H4607R9126j9396j38243j67488n8277Q8133J45824J15096L0965r4197j72349
169h6199j05050M5113J34253J27794O1494n2021j52149j33909p437J06912J38862
180G7663Q9801k0716j26842j41198n3463O6540J39120J17226J3517r9003j40819
191g8174q7155K4475J21193J35071N2927o4114j32944j12239j5592R4199J36360
202G4007Q2797k2701j12918j29599n2179O3828J27362J01979J3994q4720j32174
$$ y = [-94660, -201356, -200950, -46908, 174609, 240478, 109262, -47659, -152913, -211511, -127836, 102755, 244270, 158321, -4296, -115477, -190768, -165358, 23643, 207836, 199699, 57150, -83360, -176551, -173416, -33553, 144912, 207934, 121224, -37716, -168717, -186224, -74008, 84607, 183733, 164337, 26094, -141394, -199671, -111538, 34286, 149382, 180347, 86150, -86199, -191249, -146136, -11883, 115911, 177405, 125384, -26765, -160674, -168111, -61199, 77663, 167464, 146748, 19906, -121292, -174755, -108215, 30905, 148131, 161648, 62645, -78174, -165329, -140854, -19661, 115410, 168337, 104223, -28721, -140960, -156552, -62353, 74007, 156804, 134103, 21185, -108414, -160593, -96765, 30597, 132576, 146570, 61850, -70324]
213g0324q4400K8097J14635J15937M4732n3918j22453j06530j1239Q9923J25578
224G0038P6015k4711j06593j14158m7290N2453J21740J03712P327q7417j13905
235f2789p1045J4429J00568J20219M3018o3384j10890q5847j5477P3449J21777
246F4028P4770l0060j01891j00665m0490M8487J11759R4892Q233q0204j11419
257f2560o7674K3206R6640J01840M0835m7716j08787r2526o101P8838J02195O2422
269A20612j5060r1382j06985l7506N7129R9740P7793J2677o8673j09316o4480
280a25451K8149R1073R1705L7234m5388j02000q4139n267P2739R9038O0796j9795
292I8694q8755r4663l4348M6496R5255Q0481P722p1072r6437n6097J8969Q3125
$$ y = [-70324, -154724, -126627, -11992, 103945, 148677, 94759, -27694, -134224, -145463, -55540, 70038, 146053, 121342, 14749, -99409, -146699, -94246, 27494, 131206, 138533, 51116, -62789, -133834, -119405, -18837, 101382, 144400, 81016, -29874, -115721, -131198, -57749, 64028, 138798, 108738, 6847, -93818, -134308, -85821, 25938, 120830, 129063, 48859, -62560, -130234, -107028, -10388, 91452, 132287, 84571, -24216, -116742, -122843, -44005, 58190, 120612, 105552, 14170, -92815, -130321, -73192, 26548, 104341, 117018, 48345, -60971, -125451, -97302, -6229, 85476, 122710, 77322, -24678, -108817, -114084, -41345, 57693, 118489, 98694, 9939, -84724, -119072, -72576, 22679, 103160, 110882, 39810, -56627, -112724, -93755, -10630]
304a0630R2369L3871m8853r2563p2946o939O5706R5864N7090k2769q3580q5509
316g8889l1759M3337R1673P5663M519o7357r0115n4122J7682Q0357Q6685L0148
328A07822m4874q6266p0552p236O3073Q9739N2167k0771p6677q0000l0301M1773
340f2103Q6528O9163L236o1912q4368n1343J8376P6911P9977K7344m1837q2225
352b2253o7686n990O0490Q3991M8958j8718p2435p6878k8685M0099Q0813O4658
364H6364M386n7613p9949m7370J8466P1073P4205K6453l9797p8304o2094l665
376h7845N6549P8176M5996j8415p0051p2780k5525L8918P5466O0566N106n4503
388C1658p7452m5088J9199O7320O8127K5602l4672p4125o1011k009N5788P0929
$$ y = [-10630, 81739, 115610, 66757, -25806, -98752, -105691, -39985, 55879, 112969, 90200, 6620, -78889, -110648, -67311, 24362, 100025, 104544, 37187, -52928, -107050, -89368, -9011, 77674, 107822, 62948, -23318, -93870, -101106, -38033, 51706, 103873, 83102, 6425, -73575, -103876, -62103, 24425, 93588, 96824, 34912, -49456, -100799, -82423, -5512, 74465, 101809, 59972, -22253, -89939, -95929, -35439, 48552, 97510, 78792, 6357, -70521, -99206, -59107, 21706, 86364, 90750, 33137, -46812, -94182, -75716, -4643, 69562, 96015, 56218, -22086, -84180, -87845, -31296, 46880, 92876, 74461, 4410, -68370, -93895, -54977, 20489, 81055, 86161, 31658, -45794, -90882, -71683, -4363, 63764, 89366, 54694, -19431, -80442, -82451, -26663, 44266]
400D4266M0699j4365o4161p1585k3764M0452P0233N3318N057n0220p4423m3056
412h7549K0048O4366O3992K3629l4088p0417n6177k020N0905O8919M1231j6450
424F6389o2907o2892k0881L2515O6427N5905K185n2564o5811l5953J4176N8186
436e225O4890K1816l7734o5471m8536l455M6293O8003L9009j8746n8942n8213
448e6311k1236L1736O5167N1284Q94m7103o2091l6934J4357N7667N9302J8302
460G5034l3286o0432m7702l164M5242O3091L5546j8152n6450n3790j8001K8817
472d3247O0596N1011L55m9059n8237k9684J2559N0608N9395K0858l5900n9867
484b0612m1011j583L9801N9120L4829j6272n3496n3397j6820L2248N6361M0225
$$ y = [44266, 84965, 70600, 6439, -65146, -88910, -48458, 21775, 75093, 80150, 29930, -44493, -87549, -67501, -3135, 60857, 84486, 50398, -20019, -76196, -78216, -27311, 41608, 82839, 66389, 3482, -59410, -80291, -47776, 18651, 74556, 76741, 24177, -41634, -77587, -63411, -5225, 59665, 81481, 43747, -21724, -70260, -73715, -27422, 40581, 79590, 60844, 1902, -56311, -77547, -45811, 19356, 70640, 71534, 24431, -37660, -74594, -60237, -2570, 56732, 75034, 41748, -18684, -66386, -69550, -24308, 38783, 74329, 56177, -273, -54063, -72064, -43247, 17349, 68360, 68715, 19656, -38581, -68265, -55706, -5098, 54297, 75155, 39255, -20612, -61623, -63206, -23405, 35715, 70544, 54272, 776, -52621, -69441, -37193, 19168, 59393]
496E9393J888l7733n9500l7402K1462N8190M2658J0728j7805n2955n7312J377
508f7011N7524M9027J6098n171l8924o3385k3008M3772N6858K7094Q91k9046n6974
521c2255l7375K0148N3051M4342J3422k7781n2805l6787Q26L3693N4046L7303
533F9828k1862n8375l5034m317J1163M5305O0200p67o2840m3492m504J195K7471
546a6029O4351K6616m9280n6361j5415J383J8479N3410M1038k2543n4608l6011
558d4970q309K2362M7787L6030j672l2402m9184l3977K1082N5077L0999J816r248
571C5391m0235n7440p9O1549M0438r29j161k1052o1005k7729M9266N4424R903
584D1341l101j3657m8786m0399K2109N3366L1608M860j8924m2504l5445J655L2884
$$ y = [59393, 61281, 23548, -35952, -73354, -51892, 6298, 48956, 59684, 41879, -11076, -68388, -67011, -9487, 39540, 55638, 50467, 11543, -51842, -74850, -31078, 25780, 52874, 53765, 24719, -32255, -69630, -49482, 3569, 47911, 61333, 33552, -19253, -56040, -55214, -21521, 32525, 69828, 47966, -10409, -45443, -49760, -38597, 6708, 66908, 66141, 3301, -40191, -44695, -43500, -16029, 48322, 74938, 25658, -30703, -46118, -44735, -26256, 27154, 68192, 45649, -8959, -44970, -53279, -30917, 16870, 52900, 51228, 18826, -30358, -64335, -43253, 11824, 42823, 44639, 35391, -4844, -62284, -62363, -814, 39624, 38695, 37534, 16482, -44523, -72252, -22986, 31438, 41341, 38240, 24583, -24203, -64602, -42493, 10873, 42481, 47341, 28417, -14087, -49532, -47877, -14993]
597a4993M4647K8419j8731m9206l0121k369J1113L7256N0020m3n4764l8213l94
610c7379L159K0751N4119K4360m4077m9690j0100L384J4491M4592L5576k0343
622C8843m8894k9290l782J7755L8857L3253k373l2641l9933k3416J5509M3392
634G280L0598K978j4611l5168m0906O71M5584L6501N243o735k4008m4762j8141
647e5476L5741M3973J4399l620j8696m0198k8142J8166M2130K7907M730j7853
659B3061l6958l0111L459L1423L5365J8982j2490l7619l1493m321J9005L3602
671A1905L0989q46l5222l5336j1202J0696K8202L5047J1874k6291l8328j9835
683c8347L632K3542L5167K0584j4608l5398k8139o086J8902L4697K6099l566k8848
$$ y = [-14993, 29654, 58073, 39342, -9864, -39985, -42354, -31241, 6015, 56035, 55992, 1228, -36985, -37379, -34220, -13469, 40650, 65010, 20933, -28757, -38857, -35473, -20982, 23610, 59186, 38843, -10051, -39341, -43123, -25368, 13489, 46742, 44369, 11728, -28205, -51621, -36112, 7280, 37878, 40856, 26245, -8923, -49829, -49158, -3574, 32927, 38170, 31435, 7427, -37335, -55476, -19735, 24238, 38637, 35017, 16321, -23877, -52019, -33853, 8277, 36184, 40914, 23061, -13897, -44008, -40549, -9126, 26239, 45221, 32731, -4888, -36381, -40702, -21697, 11905, 42894, 42048, 6826, -28510, -39712, -29016, -814, 34233, 46107, 19816, -18512, -38347, -34715, -11173, 23994, 44578, 29970, -5428, -33567, -39653, -20751, 13946, 40045, 36479, 7631]
696G631l2288j5840J0895L2453L0979O092k1391l2398k3180J490K6760L3599J5532
709D0334j2851l1280k7674o375J8759L2538K4091l044k7790l1062j3634J1289
721b6699K9237K8632P078k0486l2502k1227L484K5244L0345J4588j1317k9355
733b978k7700o319K0525L1369J9143l348k2481l0019j6735J2832L1680K3716K717
746C2402j5703k7961k4186K406K8686K8440R308j0180k4772k7094p560K0869L0774
759A5429J7385m105k1848k8031j4178J1811K7881K3890M915j8137k8906j8276
771c2170M142K1779K6688J4124j1407k8669k2658k227J6195K5617K0568k108k5539
784D335k6954q753J0885K3162K3811O436j8952k8517j5870M469K0425K5176J2757
$$ y = [7631, -24657, -40497, -29602, 2851, 33830, 39922, 18531, -13867, -37047, -35557, -8797, 24802, 40334, 27483, -3797, -31471, -37846, -19087, 13451, 37542, 34498, 6708, -24354, -37988, -26699, 2538, 31170, 38248, 17762, -14740, -35967, -32483, -7239, 23106, 37694, 26377, -2978, -30678, -36997, -16472, 14897, 34040, 30692, 8211, -21808, -38543, -25711, 5969, 29685, 32402, 16699, -11262, -35448, -33042, -4356, 24084, 33392, 23212, -1560, -28654, -36214, -15345, 15429, 32814, 28709, 6861, -21170, -35348, -23537, 4344, 28234, 33149, 15012, -13894, -32170, -28028, -6249, 20439, 34563, 23156, -5513, -28171, -30398, -14203, 11414, 31982, 29874, 4335, -22619, -31372, -20487, 2675, 26486, 32922, 13970, -14547, -30417, -25948, -5523, 19653, 32410]
797C2410j0897k6325k1884l103J6558K5584J7539l402k2024k4718j0502J0528
809b0236K4465K1716L472j6847k5010j6478L198K1315K4544J0049j0838k3633
821d283k0678l804J6213K5070J6138m090k0718k2965j0125R859K3758K0625K490
834B7490j6002k3309j5766L070K0969K3084Q838j0456k1935j9733l833J6176K4316
847A2909J4186m503j8908k1713j0322J0003K3473J8816J658j4887k2013j5304
859b6605L406K0272K1669Q051r877k1155j8726k819J5401K2378J3823l936j8895
872B987k1066q396J0016K1107J7767K619j4898k2093j3443M403J8256K0004Q643
885B5906r472k1311j7570j485J4581K0570J3243l401j8464k0265p464J0011J9713
$$ y = [32410, 21513, -4812, -26696, -29799, -13241, 12343, 29882, 26480, 4456, -20262, -30764, -20236, 4229, 25945, 29417, 12570, -12440, -28918, -25720, -4405, 20139, 30188, 19350, -4283, -24961, -28765, -12552, 12518, 28656, 24566, 3848, -19117, -29242, -19383, 4375, 25000, 27490, 11488, -11821, -27587, -24517, -3548, 19536, 28374, 17918, -4017, -23750, -27583, -11407, 12909, 27095, 22592, 3684, -18029, -28351, -18348, 5125, 23941, 25599, 10712, -11301, -26605, -23199, -2927, 18742, 26793, 16916, -4239, -22965, -25784, -10383, 11995, 25818, 21882, 2987, -18079, -26475, -16459, 4648, 22415, 25034, 10136, -11957, -25400, -20997, -2741, 17263, 25906, 16434, -4877, -22447, -23932, -9351, 11219, 24462, 21061, 2597, -17668, -25132, -15121, 4592]
898D592J6645K547j4339k1148j2569M596J7549J8857P760r155k0278j6548j202
911b2693J4065J9583J2491l598j7919j9022o682R553J8793J5933K079j4037j9982
924a1436j1441M274J6696J8184P169r430j9038j5265j261J3376J9233J1532m399
937A8194j6787j7377o638Q874J8730J5157Q09j3618j8100j0969L772J6506J7603
950A6156O036r454j7710j4260j275J3007J8404J0655m512j6081j6425o000Q860
963a2599J7699J4031O70j2962j7516j0239M217J5819J6431N350r151j6623j3631
976a8504j281J3113J7841R149m873j4513j5395o473Q748J8051J2909r02j1967
989E903j5438j0344L406J6212J5985L857r125j5283j2690j044J2405J6687R103
$$ y = [4592, 21237, 23784, 9445, -11703, -24272, -19676, -2127, 16730, 24490, 15335, -4943, -21491, -22693, -8628, 10955, 23446, 19848, 1929, -17093, -23775, -14222, 4571, 20504, 22583, 8546, -11436, -22877, -18603, -1907, 16277, 23446, 14016, -5022, -20287, -21548, -8172, 11061, 22593, 18194, 1407, -15970, -22608, -13734, 4996, 20153, 20962, 7344, -10756, -21725, -17953, -1447, 16156, 22192, 12738, -4972, -19232, -20507, -7500, 10904, 21559, 17047, 966, -15459, -21459, -12599, 5100, 19131, 19801, 6839, -10677, -20916, -16699, -880, 15551, 20901, 11750, -4873, -18504, -19785, -6672, 11169, 20318, 15445, 932, -14463, -20936, -12188, 5863, 18772, 17870, 5903, -9535, -19879, -16473, -261, 15724, 19581, 10456, -4827, -17517, -18561, -6156, 10531, 19634]
1002A9634m526j5129j4883l878Q489J4761J2632J808j3076j7723o989O152J1991
1015g37J3234P542p971j8991j1728L574J0761J2167J0290j701j6643j6009j592
1028a7804R549J2870J0975J767j1426j6347q502N275J4709J3056K571p560j2811
1041c678j2370k280J3471J7485M648p170r230j1311r167P571K0387R940o060q993
1055C243r304j0936O27J7306J5536n09r557j0586r879k320J0904J5899P471n636
1069A2259j3931j1905j560P292J1021J1655L037j3630j7496k691Q020O990R747
1082H808J0239p320k1002q485P842P572P112J1110J41j7701j4793K283R236Q480
1096C522R392K912j1121j5273n810N621J2328J1223J523p622j0250j0095k797
$$ y = [19634, 15108, -21, -14904, -18782, -10293, 4468, 17100, 18908, 5832, -11891, -18880, -12728, -737, 12497, 20039, 12068, -6923, -18651, -15077, -4316, 7851, 18141, 16440, -203, -16212, -17804, -8255, 4615, 15590, 17357, 5931, -10416, -18918, -13643, 1066, 14122, 16693, 9133, -3678, -16048, -18328, -4857, 12628, 17276, 10106, 876, -10435, -19602, -12031, 8356, 18296, 12236, 3243, -6061, -16997, -16370, 936, 16472, 15963, 6406, -4180, -14059, -16379, -5475, 10424, 17895, 12259, -1672, -13577, -15137, -7845, 3176, 14831, 17868, 4238, -13258, -15949, -7929, -939, 8808, 19047, 11727, -9275, -17760, -9918, -2346, 4766, 15876, 16017, -1684, -16477, -14194, -4958, 3522, 12914, 15826, 4705, -10568, -16378, -10757, 1571, 12794, 14317, 6695, -3555, -13650, -16447]
1109a6447J2518J6689K351q263o549q426r422O505K0031Q134q236p327n854j0431
1123a4727m28J7131J3943l030q763p314q934k934J1140J4520M398n690j0637j0367
1137a1692k327P731J0768Q423J290j0640j4705l482P484P964P842O664n976j6844
1151g500q206O372Q265O488Q070n69j4672j2519J805Q412P869P860J790j0214
1165C251j3186m122N671R839R294K537p221j1197p409N52R268J2101M369n851
1179G896r405q196l550O205J2985P684l396q860q568n565K774J1521J0358L86
1193A2269p470r508p124L64R209J0849M266m573r805q991j765O910J0508O856
1207A1995j341q641j0189m455M468R939Q603J467o693j0109o797J170Q684J0241
$$ y = [-16447, -3929, 12760, 15111, 6848, 299, -8127, -17549, -11044, 8987, 17121, 8885, 1558, -4296, -14727, -15155, 1976, 15919, 12889, 4126, -3188, -12122, -15056, -3916, 10604, 15002, 9312, -1325, -11692, -14019, -6288, 4480, 12903, 14193, 3553, -11152, -14634, -7150, 814, 8656, 15320, 9344, -7500, -15706, -9334, -1069, 5419, 13489, 12920, -1752, -14271, -12466, -4054, 3815, 11675, 13465, 3251, -9935, -14057, -8386, 1453, 10747, 13284, 6063, -5134, -12543, -11991, -2723, 9378, 13747, 7896, -1509, -9705, -13255, -7050, 5935, 13619, 10223, 1363, -7205, -12770, -9996, 1525, 11883, 12269, 4799, -4709, -11833, -11469, -2260, 8589, 12855, 8282, -1523, -10514, -12279, -5369, 5139, 11995, 10654, 2013, -8176, -12631, -8163, 1776, 10379, 11846, 5153, -4956, -11753, -10583, -1899, 8342]
1221H342L995m783r309p976j997O181J0779O920k384q511q620m269L310R846Q979
1236A0503R93p030r469o029J240P949R364M324m085r806q142o54O580Q759O110
1251A0607m17q276j0334l357N400Q347O671K326n393j0827o561L045Q155P478
1265F864L708k771r195q711p53P108Q699N164j184p257q907m074M176R339P429
1280I635K19o033q096n826N72Q151R518K690m977p692o496j959N530R883N814
1295A0933k736p613p309l428L145Q619P801O20o557q334m880J480P035Q228L463
1310A0467l976q692o899j17N789P683N502j048p807q458k432M381P376O481J408
1325I658n722q962m960K308P025P131L265l459q297o787k19N717P807M923j529
$$ y = [8342, 12337, 7554, -1755, -9731, -11728, -5547, 5232, 12152, 9768, 1257, -7363, -11632, -8322, 1524, 10503, 11496, 4466, -5003, -11032, -9792, -1843, 7521, 11845, 7760, -2046, -10188, -10842, -4262, 4497, 10607, 10190, 1914, -8420, -11777, -6377, 1970, 8641, 10967, 5574, -5253, -11814, -8769, -614, 6864, 10572, 7801, -1394, -10105, -10858, -3750, 4949, 10113, 8929, 1672, -7235, -11309, -7133, 2206, 9635, 9854, 3821, -4275, -10101, -9529, -1378, 8140, 10830, 5853, -1839, -8335, -10294, -4764, 5119, 10933, 8197, 584, -6725, -10153, -7008, 1611, 9412, 10032, 3475, -4859, -9739, -8259, -1224, 7004, 10467, 6491, -2201, -9100, -9217, -3428, 4255, 9757, 8709, 902, -7556, -9988, -5607, 1769, 8250, 9658, 3936, -5026, -9986, -7678, -653, 6478, 9743, 6284, -2013, -8800, -9019, -3302, 4505, 9428, 7899]
1340G899p144p595k742L799P882O415M13n675p754m802J599P008P581K540m007
1355E417p474o035q27N521Q065M571k050o692o908k777L523P844O105O8n422p204
1371d275m554J457O945P212K168l959p063n708p31N447P746M166k072o410o667
1386f298k618L676P386N752J23n263p032m315J672O672O586K154l531o965n741
1401g742j74N403O897L928j703o231o750k155L898O798N141L59m900p183m046
1416h460K116O242O048K209l263o995n450Q0N121O522L762j456o232o318j892
1431g966L600O414N041L36n000o779l565J926N783N942K170l482o686m909R6M711
1447b368O392L764j727n946n931j694L273O206N012J67m954o305l246J657N471
$$ y = [7899, 755, -6840, -9582, -5783, 2099, 8514, 8927, 3252, -4502, -9304, -7705, -697, 6884, 9424, 5417, -2057, -8092, -8919, -3398, 4667, 9238, 7188, 496, -6412, -9189, -5666, 2178, 8283, 8351, 2929, -4275, -8829, -7372, -427, 6785, 8953, 4994, -2069, -7777, -8508, -3061, 4685, 8851, 6779, 369, -6298, -8916, -5240, 2146, 7898, 8021, 2758, -4274, -8589, -6917, -245, 6341, 8495, 4964, -2001, -7742, -7916, -2513, 4384, 8312, 6609, 378, -6372, -8527, -4629, 2169, 7310, 7669, 2769, -4414, -8460, -6344, -102, 5946, 8155, 4892, -2103, -7553, -7473, -2352, 4170, 7932, 6476, 244, -6074, -7966, -4366, 2048, 7089, 7425, 2425, -4354, -7919, -5993, -210, 5732, 7902, 4420, -2266, -7175, -7079, -2368, 4024, 7788, 6061, 115, -5816, -7510, -4237, 1969, 6981, 7148, 2194, -4111, -7357, -5700, -229]
1462b29N889J907l569o197m504o8M478O256L499j909n714n427j616L097O116M869
1478F878j45m808n828l169J594N479N599J480l290n810m489l6M650N842K953j702
1494E198n131n477j707L483N921M004k44m017n810l269J728N768N051J100l036
1509C562n349m446j34M563N848K761j990n016m668j703K661N906M550p25m594
1524A226m858k464R70M932N615J386l854n318l241NL570N644L246k049n320m636
1540e146r06K869N064L766L18m021n958k732K588M803L503J616j688n924n044
1555f892J383N222L587J712M1m307o378j132M742M624K067N27k753n996l252K575
1571d230N093L749J000k580m841l568p8L563N610K742k717m810k767j179J043
$$ y = [-229, 5660, 7567, 3998, -2199, -6703, -6771, -2293, 3963, 7462, 5553, -161, -5588, -7204, -4107, 2009, 6878, 6733, 1925, -3903, -7072, -5478, 1, 5600, 7080, 3790, -2020, -6509, -6545, -1895, 3947, 6900, 5198, 67, -5410, -7117, -3634, 2287, 6291, 6047, 2030, -3780, -7049, -5321, 447, 5498, 6598, 3562, -1787, -6233, -6367, -1804, 4044, 6805, 4815, -201, -4869, -6572, -3911, 1995, 6545, 5820, 1226, -3632, -6096, -5126, -194, 5421, 6807, 2953, -2365, -5606, -5601, -2031, 3613, 6859, 4810, -510, -5146, -6052, -3183, 1881, 5647, 5965, 1944, -4014, -6746, -4158, 645, 4148, 5764, 4076, -1848, -6892, -5509, -287, 3300, 5012, 5053, 746, -5632, -6764, -2022, 2602, 4669, 5196, 2443, -3553, -6805, -4230, 863, 4612, 5612, 3032, -1809, -5377, -5455, -1892, 3718, 6460, 3743, -1067, -3834, -5013, -3970]
1586c970N358N451j488n680k883p91o45L516O815J216n463m306r91p30J927N970
1602C306L552l052n097k917p00J834M677L653k74l566m903k414K335M610K728
1617C772P94r32m857n153J247N621K819L73N64l045o420j386N229M314P07M27
1633D074j664n557l382K891M934K678M30j617m267l541L78L565M332K115k024
1648C345m194k817o20J277M397M383j153m818k976o86O1L104N367J188m406m062
1664b610j187k05K056M884K788k411m331k759n59J887M048L028l74l234l996j894
1680d869J648L998K885N08j642l932l707Q27M051L191J094p01l269m240q59L267
1696a750L818J919Nk654m242j989J954L558K914R13k151m087k475N89K792L494
$$ y = [-3970, 1388, 6839, 5351, -329, -3212, -4003, -4648, -1132, 5683, 6899, 1436, -2870, -3861, -4591, -2664, 3306, 6858, 3806, -1291, -4208, -4908, -3074, 1603, 5256, 4982, 1416, -3487, -5901, -3566, 1044, 3772, 4566, 3634, -1223, -6376, -5129, 492, 3311, 3684, 4248, 1203, -5217, -6603, -1374, 2940, 3647, 4074, 2410, -3147, -6529, -3638, 1296, 3974, 4404, 2787, -1480, -5021, -4643, -1078, 3254, 5369, 3345, -849, -3666, -4286, -3009, 1388, 5771, 4618, -200, -3176, -3862, -3801, -697, 4670, 5858, 1452, -2610, -3797, -4002, -1946, 2938, 5726, 3315, -1016, -3775, -4334, -2447, 1601, 4629, 4255, 1021, -2975, -4869, -3221, 777, 3662, 4170, 2528, -1404, -5111, -4284, -233, 2958, 4052, 3351, 82, -4158, -5017, -1750, 2068, 3987, 3992, 1338, -2904, -4893, -2939, 619, 3533, 4446, 2295, -1792, -4267, -3678, -886, 2608]
1712B608J969j389l928l046l12K059L438K877l14l402l521j318J304L374L264
1727C663O01k266l654k457L13L107L599J302j353l104l098j049K352L975K062
1742C993o92k557l131j913J214L653L154J39k337l063k151M0K763L782J560j856
1758B598l346k419n71J673L498K801n87l419k878j004R28K721L355Q35k621l513
1774a949j681N08K335L122J638j200l377k831l09K378L025J812j16k377l629j583
1790d234J846L368J988K92j222l255k845N77L394K673N21n68k537l287p56K710
1806a335L189J425l89k106l093j583J507L135K383L22k011k998j908M59K412K963
1822B372J494j487l192k194j84J432K867K543m70l112k549o17Q60K347K923O84
$$ y = [2608, 4577, 3188, -740, -3786, -4098, -2039, 1399, 4276, 3962, 560, -2961, -4279, -2975, 399, 3663, 4264, 1998, -1656, -4113, -3800, -693, 2906, 4208, 2855, -249, -3347, -4396, -2044, 1931, 3993, 3301, 744, -2387, -4300, -3086, 567, 3721, 3860, 1523, -1540, -3691, -3651, -888, 2894, 4454, 2598, -748, -3167, -3738, -2065, 1433, 4234, 3647, 228, -2650, -3654, -2726, -5, 3350, 4185, 1564, -1949, -3630, -3122, -787, 2335, 3973, 2773, -604, -3435, -3744, -1366, 1659, 3471, 3355, 978, -2651, -4234, -2388, 980, 2968, 3260, 2038, -1217, -4062, -3485, -91, 2582, 3103, 2535, -2, -3289, -4045, -1335, 1854, 3279, 2890, 784, -2309, -3892, -2385, 750, 3133, 3455, 1444, -1554, -3462, -3003, -591, 2372, 3866, 2379, -813, -3007, -3191, -1759, 1108, 3651, 3181, 69, -2480, -3097, -2237, 110, 3033, 3717]
1838C717k430l051j268M47J999K801J473j416l094k041k39J648K805K057m68k602
1854C38k654j127J173K781K281K96j755k717j854M03K420K683R17j157k395k330
1870b697n26K004K800J510n56k106k463j322J288K769K048J43j637k598j786L89
1886b740K429K506Q47j055k344k275l95J812K692J464m80k028k441j080J167K523
1902F02K040J45j624k515j614M87K174K350Q80j020k505k044k36J726K475J558
1918B879l70k111k395r18J106K264K001L81j657k484j453M71K027K148R35j015
1934A809k410j914j03J589K312J479m56k089k259p68J097K207J936K41j629k315
1950a273j401N26J895K090R15j021k251j799j47J535K157J381m55j978k117o89
$$ y = [3717, 1287, -1764, -3032, -2585, -586, 2215, 3688, 2272, -822, -2863, -3102, -1454, 1351, 3408, 2940, 338, -2316, -3443, -2270, 511, 2792, 3088, 1333, -1384, -3238, -2835, -415, 2268, 3185, 2028, -367, -2697, -3223, -1219, 1581, 3091, 2535, 429, -2034, -3356, -2068, 701, 2749, 2892, 1255, -1343, -3129, -2740, -311, 2195, 3042, 1987, -357, -2632, -3027, -1215, 1477, 2941, 2461, 433, -2008, -3088, -1921, 602, 2642, 2787, 1163, -1352, -2966, -2479, -305, 2045, 2925, 1905, -600, -2644, -2880, -1154, 1321, 2879, 2509, 398, -1997, -2915, -1809, 455, 2456, 2837, 1180, -1304, -2757, -2286, -259, 1889, 2824, 1809, -601, -2515, -2618, -1029, 1283, 2762, 2306, 217, -2042, -2810, -1713, 494, 2430, 2671, 1042, -1273, -2674, -2148, -253, 1837, 2752, 1731, -520, -2319, -2466, -931, 1226, 2607, 2152, 174, -1943, -2632]
1966b632J041K050J808J91j600k148j229M16J899K060P41j036k113j697j27J441
1982i35K179J326n41j852j907p23Q96K072J719Rj464j993j122L13J783K020O38
1999B418j071j926j504j81J417K030J251n09j788j796o99R21J971J561J00j371
2015H24j940j191M45J719J781N40q46j812j566j52J438J943J003n34j429j736
2031a513q41R86K074J399j60j192j709j305L48J889J776L79q86j649j515k28J409
2048g38J871R00l86j596j645n06Q69J632J424K42j380j983p04O40J228J509R32
2065B309q72k214j228M21J009J266J351m0k047j744r1R10J302J290M06j339j872
2082a183q47N85J427J443M17p04j496j393k35J480J851N14o81r43j397j070R09
$$ y = [-2632, -1591, 459, 2267, 2458, 858, -1290, -2519, -2103, -204, 1856, 2597, 1561, -552, -2249, -2376, -935, 1244, 2570, 2029, 177, -1730, -2453, -1557, 515, 2234, 2243, 779, -1214, -2336, -2023, -240, 1780, 2418, 1347, -579, -2083, -2264, -847, 1183, 2434, 1925, 137, -1659, -2358, -1437, 534, 2095, 2195, 824, -1116, -2307, -1862, -143, 1638, 2178, 1332, -480, -2046, -2198, -760, 1183, 2186, 1652, 223, -1513, -2354, -1368, 706, 2105, 1945, 753, -956, -2261, -1913, -24, 1752, 2131, 1245, -404, -1919, -2147, -738, 1133, 2033, 1647, 51, -1594, -2100, -1231, 401, 1825, 2067, 687, -1296, -2000, -1360, -132, 1377, 2309, 1437, -777, -2005, -1584, -575, 691, 2042, 2002, -45, -1789, -1880, -970, 332, 1622, 2028, 689, -1183, -2030, -1445, -18, 1425, 1842, 1138, -358, -1751, -1986, -506, 1345, 1859, 1178, 235, -1162, -2232, -1323]
2099a323K292J012o22q65j056j364r0K037J788j07r71j047j147m61J186J871P82
2116A915n34j409j307l05O45J372J298K69j418j848l53O68P61J261J191r19k240
2133i53r49P16P52Q96J321O8j985j568K08Q14R28J195L58j218j618o33M62J291
2151H5J203L70q33j152j143l84J331J802M00q28p14j090j047Q00K155Q54p47o62
2169D00q73j254J4J910J387j55p38q88j174l00J186J553N11l91j160j317l35Q50
2187g74J208R19K00j023j656o19P96J011R10O72n08j817j008N16R30P81R32p2
2205A398j450j399N7P44R87J019Q9j138j302n34M75J006J200M05r06j215p16l6
2223a316Q12J385Q05o88j190q04m38N65J281J072j37j036j145n42L33J066J084
$$ y = [-1323, 969, 1981, 1359, 494, -562, -1926, -2016, 21, 1809, 1702, 731, -316, -1463, -1924, -738, 1133, 1915, 1381, -28, -1335, -1640, -995, 377, 1675, 1944, 526, -1322, -1675, -1007, -246, 1015, 2206, 1287, -953, -1902, -1186, -434, 462, 1783, 1851, -134, -1702, -1494, -680, 248, 1443, 1801, 583, -1035, -1668, -1206, 85, 1288, 1658, 825, -327, -1470, -1854, -523, 1279, 1679, 851, 137, -953, -2000, -1200, 955, 1809, 1062, 400, -473, -1727, -1713, 197, 1584, 1429, 691, -197, -1371, -1671, -485, 1068, 1579, 1188, 28, -1289, -1624, -774, 434, 1353, 1553, 530, -1126, -1745, -949, 62, 972, 1644, 1136, -681, -1689, -1173, -243, 538, 1470, 1398, -52, -1451, -1394, -650, 337, 1356, 1445, 307, -995, -1529, -1054, -48, 1152, 1557, 651, -564, -1280, -1316, -504, 881, 1686, 998, -192, -996, -1434, -869, 412, 1484, 1347, 311, -834, -1376, -1043, 23, 1107]
2240A107L82p73j287q35J69R61J040N99l36j086j193k22Q87J131P03Lq45j250
2258h45o68M69J204R92J45o49r59r07j33R39J412M06o55q65p84m94N52J412Q56
2277A428m29q74p62n97J41J186J173Q2q28r95o12j52Q62J255N56m60j131r32j17
2296a206O32R32P55J12q89j288m18O89P64P33M64m63j367q29M22R05O52N89r6
2315A093j136j175j7Q82Q07N45J23p78j110n97N58R97P94J72o36r42p13J8Q42
2334b73J041M41n14q15p32l06N35J142P16k85p93p99m63K30R72Q91J50p09q96
2353d67o21J28O93R68M96m10r40p61j17N07Q97P73j40p47r69l59L69Q40Q19J46
2373A105n71j022n85J78P13Q54M44l38r32p41q1M93Q59O45p2p83q73l24K91Q83
$$ y = [1107, 1489, 716, -571, -1406, -1237, -276, 764, 1363, 1027, -59, -1252, -1474, -587, 544, 1247, 1250, 405, -845, -1513, -1044, 160, 1152, 1297, 648, -311, -1218, -1351, -412, 1000, 1406, 751, -114, -898, -1392, -840, 572, 1428, 999, 125, -637, -1234, -1093, 93, 1266, 1348, 520, -475, -1087, -1239, -377, 878, 1434, 974, -157, -1089, -1206, -574, 358, 1113, 1225, 336, -952, -1370, -681, 83, 816, 1280, 817, -550, -1379, -957, -52, 600, 1189, 1093, -43, -1218, -1235, -353, 454, 999, 1122, 344, -766, -1363, -805, 192, 986, 1158, 522, -420, -1133, -1115, -273, 768, 1209, 695, -120, -852, -1158, -623, 519, 1235, 950, 157, -642, -1105, -875, 97, 988, 1138, 429, -467, -1088, -960, -267, 701, 1197, 787, -153, -914, -1031, -524, 373, 1146, 1006, 259, -710, -1069, -700, 140, 959, 1105, 534, -488, -1073, -895, -182, 672, 1116, 778, -154, -895, -976, -483, 376, 1021, 949, 166, -707, -1031, -740, 143]
2393A43P64J74o44p79o52Q4P53Q51L77l52q51p51j75N64R11N55q5o92q57m33M51
2414f44Q36O63J73n89p41o97J32P06Q39L09l26p08p57k07N78Q46N51j88o66o74
2434e64m32K90Q65O61Q9n32p61n30%P92Q04L26l65p24o95j28N29Q06M50q0o15
2455A86q42k76L58P08N62J90m54q26n55K35O26O53L55k93p75o27r8N57O31N27
2475H42o1o28p74l05L62P03N92K19n28p87m86J04N73O59M31l46p16n64j00M36
2495c74O50N91j10o86o12k63K40O56O62J21n04p25m21O5N83P13K90l83n97n37
2515f41j51L91O91M80p6n80n75l50K57O19O65J8m00o42m40M6N99O50K17k81n70
2536g3o17j54M42P51L97q6n00o46k89K05P13N66k4l46n77m90M6N52O57K29k48
$$ y = [143, 907, 1081, 437, -342, -994, -910, -157, 694, 1071, 719, -132, -883, -1058, -494, 417, 972, 887, 195, -662, -1095, -644, 192, 855, 1028, 439, -302, -999, -867, -161, 678, 987, 661, -47, -804, -1011, -433, 413, 964, 776, 110, -564, -996, -706, 159, 820, 909, 377, -384, -914, -914, -122, 682, 1008, 643, -81, -776, -904, -375, 431, 881, 801, 186, -656, -932, -574, 134, 696, 886, 432, -394, -949, -714, -88, 565, 920, 627, -148, -775, -873, -316, 315, 842, 781, 153, -621, -926, -564, 139, 731, 950, 422, -365, -851, -747, -174, 485, 916, 570, -146, -710, -810, -374, 276, 867, 757, 71, -541, -804, -564, 92, 754, 875, 371, -354, -775, -710, -127, 586, 876, 493, -104, -641, -792, -401, 290, 770, 694, 114, -461, -811, -554, 65, 730, 748, 348, -294, -734, -688, -89, 561, 778, 497, -73, -690, -844, -402, 349, 746, 660, 160, -486, -775, -570, 143, 709, 685, 339, -238, -728, -682, -130, 527, 756, 508]
2557E08n73n55j24L96P08L87j36n26n31k94J49O59N88J08m66o16l64Q3M66O33
2577E00L17l53n72m58q1K87O18M27K6n85o28k13K80N73M21K07l58p27m34K10N44
2598AL79K75m1o47o76j6N61M21K46J74m04p34l39M05N38L06J30k12n68n34J36
2619e99N23M77K10k20m70m28j72L21O92L96j77n43l76j08j31N44P61O5o64l79
2639b78j11j66J89Q32L72m60n75j30k01R8O59N67k46n22m01j66P7M78N77J6k98
2660C11n73l87R2N24L77J60Jm52o54j35O60L58J39J08k11o88m58M78N82J31R1
2681D54m8n70n81J63N72L94J59j23m07n06j53L83M72L51l6m52m82j84J17N03N02
2702E28J50m58n24j52j5K45N71L55l17n38k94k3J13N30L63l5m21m82k12J75N14
$$ y = [508, -65, -620, -744, -348, 360, 747, 611, 85, -446, -740, -591, 68, 656, 764, 298, -318, -682, -599, -133, 500, 817, 464, -108, -566, -647, -360, 258, 685, 711, 126, -502, -715, -435, 138, 559, 766, 408, -319, -753, -543, 1, 380, 655, 614, -33, -709, -725, -164, 257, 503, 677, 273, -461, -800, -395, 143, 449, 579, 367, -201, -735, -599, -76, 401, 611, 391, -79, -507, -679, -358, 334, 730, 553, 10, -366, -474, -605, -61, 700, 765, 101, -278, -389, -555, -366, 466, 838, 378, -197, -327, -528, -430, 229, 796, 550, 28, -373, -539, -462, 16, 593, 609, 311, -262, -649, -557, -33, 344, 504, 505, 53, -601, -736, -76, 282, 421, 529, 318, -370, -828, -350, 232, 363, 454, 406, -164, -745, -582, -10, 384, 543, 420, 13, -493, -646, -263, 209, 560, 524, 72, -410, -594, -477, 26, 528, 678, 220, -304, -456, -471, -226, 345, 700, 383, -155, -449, -472, -359, 171, 534, 499, 78, -404, -616, -441, 73]
2723G3L40J43k50n22l37M4M26M01K02p9m30m90j21L98M39K56ql50m68k75K06M41
2745C9L96J14l13m32k58K3K65M57L44j89n74l03m8J86L97M17P7n16m66j18J77
2766c25K72L97K16l03m62l56R5L50L97K02j08l46m59j47L50M84J93Kk48m88l24
2787f08K18N42L03n2r8l29m83j0M26M43J16j94k79l19k23K60M54L13m3l71l05
2808b39k05O9L26M96J26m12l90j60n2K48M55L50k61m08l30j8K22K40L69M9l55
2829A20m52j14J16L57K77J19q1n42l40J17M15K23J75L4l98m50j19L93K63K64k0
2850C57j11n11k84K49L32K92R1j42l99l19L6L54K80K41j20l37l42n0J83L01L41
$$ y = [73, 413, 556, 306, -216, -553, -509, -83, 318, 520, 441, 11, -479, -600, -202, 237, 493, 485, 135, -333, -608, -402, 39, 435, 549, 236, -196, -454, -431, -166, 291, 635, 446, -128, -431, -479, -293, 104, 521, 598, 82, -384, -502, -325, -53, 344, 560, 257, -205, -561, -466, -116, 281, 483, 375, 29, -430, -577, -227, 257, 450, 452, 204, -284, -608, -390, 152, 455, 403, 305, -24, -507, -517, -91, 352, 468, 274, -5, -324, -547, -287, 167, 480, 437, 66, -239, -444, -375, -49, 447, 573, 161, -229, -389, -441, -193, 262, 612, 351, -57, -387, -405, -183, 57, 426, 475, 120, -332, -446, -330, 27, 304, 423, 342, -200, -540, -423, -8, 215, 390, 424, 26, -424, -543, -150, 113, 377, 357, 246, -265, -549, -300, 32, 324, 415, 273, -126, -445, -409, -55, 225, 466, 346, 9, -333, -383, -200, 101, 442]
$$ [...]
8191B8
##END NTUPLES=NMR FID
##END=
