##TITLE=1H_CPA2002
 D2O
 8 sc, 
 21.2.2023
##JCAMPDX= 6.0         $$ Bruker NMR JCAMP-DX V2.0
##DATA TYPE= NMR FID
##DATA CLASS= NTUPLES
##ORIGIN= UXNMR, Bruker Analytische Messtechnik GmbH
##OWNER= root
$$ XWIN-NMR		Version 3.5
$$ Tue Feb 21 14:13:05 2023 Russian Standard Time (UT+4h)  she@DPX200
##.OBSERVE FREQUENCY= 200.13135
##.OBSERVE NUCLEUS= ^1H
##.DELAY= (6, 6)
##.ACQUISITION MODE= SIMULTANEOUS
##.ACQUISITION SCHEME= undefined
##.AVERAGES= 9
##.DIGITISER RES= 18
##SPECTROMETER/DATA SYSTEM= spect
##.PULSE SEQUENCE= zg30
##.SOLVENT NAME= D2O
##.SHIFT REFERENCE= (INTERNAL, D2O, 0, 15.7039)
##AUDIT TRAIL= $$ (NUMBER, WHEN, WHO, WHERE, WHAT)
$$ ##TITLE= Audit trail, XWIN-NMR		Version 3.5
$$ ##JCAMPDX= 5.01
$$ ##ORIGIN= Bruker BioSpin GmbH
$$ ##OWNER= she
$$ F:/spectra/data/she/nmr/H-F/1/audita.txt
$$ ##AUDIT TRAIL=  $$ (NUMBER, WHEN, WHO, WHERE, WHAT)
(   1,<2023-02-21 14:12:02.20 +0400>,<she>,<DPX200>,
      <created by zg, POWCHK disabled, PULCHK disabled
       terminated by command 'halt'
       configuration hash MD5:
       00 E9 B6 7A A2 85 ED C7 34 08 36 98 17 FE 4E 26
       data hash MD5: 16K
       1C 4D F5 E6 42 8C 3B F6 E9 0D 78 C7 42 EB 44 52>)
$$ ##END=
$$ 
$$ hash MD5
$$ 8D 88 60 1A 6E 39 AD F4 F4 BD 20 E6 02 9D D5 2F
##$RELAX= 
##$RELAX= 
##$RELAX= 
##$RELAX= 
##$RELAX= 
##$RELAX= 
$$ Bruker specific parameters
$$ --------------------------
##$DU= <F:/spectra>
##$EXPNO= 1
##$NAME= <H-F>
##$PROCNO= 1
##$TYPE= <nmr>
##$USER= <she>
##$AMP= (0..31)
100 100 100 100 100 100 100 100 100 100 100 100 100 100 100 100 100 100 
100 100 100 100 100 100 100 100 100 100 100 100 100 100 
##$AQSEQ= 0
##$AQ_mod= 1
##$AUNM= <au_zg>
##$AUTOPOS= <>
##$BF1= 200.13
##$BF2= 200.13
##$BF3= 200.13
##$BF4= 200.13
##$BF5= 200.13
##$BF6= 200.13
##$BF7= 200.13
##$BF8= 200.13
##$BYTORDA= 1
##$CFDGTYP= 0
##$CFRGTYP= 5
##$CHEMSTR= <none>
##$CNST= (0..31)
1 1 145 1 1 1 1 1 1 1 1 1 1 1 1 1 1 1 1 1 1 1 1 1 1 1 1 1 1 1 1 1 
##$CPDPRG= <>
##$CPDPRG1= <>
##$CPDPRG2= <>
##$CPDPRG3= <>
##$CPDPRG4= <mlev>
##$CPDPRG5= <mlev>
##$CPDPRG6= <mlev>
##$CPDPRG7= <mlev>
##$CPDPRG8= <mlev>
##$CPDPRGB= <>
##$CPDPRGT= <>
##$D= (0..31)
0 1.2 0 0 0 0 0 0 0 0.06 0 0.03 0 0 0 0 0.0002 0 0 0 0 0 0 0 0 0 0 0 0 
0 0 0 
##$DATE= 1676974321
##$DBL= (0..7)
120 120 120 120 120 120 120 120 
##$DBP= (0..7)
150 150 150 150 150 150 150 150 
##$DBP07= 0
##$DBPNAM0= <>
##$DBPNAM1= <>
##$DBPNAM2= <>
##$DBPNAM3= <>
##$DBPNAM4= <>
##$DBPNAM5= <>
##$DBPNAM6= <>
##$DBPNAM7= <>
##$DBPOAL= (0..7)
0.5 0.5 0.5 0.5 0.5 0.5 0.5 0.5 
##$DBPOFFS= (0..7)
0 0 0 0 0 0 0 0 
##$DE= 6
##$DECBNUC= <off>
##$DECIM= 32
##$DECNUC= <off>
##$DECSTAT= 4
##$DIGMOD= 1
##$DIGTYP= 9
##$DL= (0..7)
0 120 120 120 120 120 120 120 
##$DP= (0..7)
150 150 150 150 150 150 150 150 
##$DP07= 0
##$DPNAME0= <>
##$DPNAME1= <>
##$DPNAME2= <>
##$DPNAME3= <>
##$DPNAME4= <>
##$DPNAME5= <>
##$DPNAME6= <>
##$DPNAME7= <>
##$DPOAL= (0..7)
0.5 0.5 0.5 0.5 0.5 0.5 0.5 0.5 
##$DPOFFS= (0..7)
0 0 0 0 0 0 0 0 
##$DQDMODE= 0
##$DR= 18
##$DS= 0
$$ [...]
##$SUBNAM2= <"">
##$SUBNAM3= <"">
##$SUBNAM4= <"">
##$SUBNAM5= <"">
##$SUBNAM6= <"">
##$SUBNAM7= <"">
##$SUBNAM8= <"">
##$SUBNAM9= <"">
##$SW= 18.05172834244
##$SWIBOX= (0..15)
0 0 2 0 0 0 0 0 0 0 0 0 0 0 0 0 
##$SW_h= 3612.71676300578
##$TD= 16384
##$TD0= 1
##$TE= 0
##$TE2= 300
##$TE3= 300
##$TEG= 300
##$TL= (0..7)
0 120 120 120 120 120 120 120 
##$TP= (0..7)
150 150 150 150 150 150 150 150 
##$TP07= 0
##$TPNAME0= <>
##$TPNAME1= <>
##$TPNAME2= <>
##$TPNAME3= <>
##$TPNAME4= <>
##$TPNAME5= <>
##$TPNAME6= <>
##$TPNAME7= <>
##$TPOAL= (0..7)
0.5 0.5 0.5 0.5 0.5 0.5 0.5 0.5 
##$TPOFFS= (0..7)
0 0 0 0 0 0 0 0 
##$TUNHIN= 0
##$TUNHOUT= 0
##$TUNXOUT= 0
##$USERA1= <user>
##$USERA2= <user>
##$USERA3= <user>
##$USERA4= <user>
##$USERA5= <user>
##$V9= 5
##$VALIST= <valist>
##$VCLIST= <CCCCCCCCCCCCCCC>
##$VD= 0
##$VDLIST= <DDDDDDDDDDDDDDD>
##$VPLIST= <PPPPPPPPPPPPPPP>
##$VTLIST= <TTTTTTTTTTTTTTT>
##$WBST= 1024
##$WBSW= 4
##$XGAIN= (0..3)
0 0 0 0 
##$XL= 0
##$YL= 0
##$YMAX_a= 864380
##$YMIN_a= -966917
##$ZGOPTNS= <>
##$ZL1= 120
##$ZL2= 120
##$ZL3= 120
##$ZL4= 120
##$ABSF1= 10
##$ABSF2= 0
##$ABSG= 5
##$ABSL= 3
##$ALPHA= 0
##$AQORDER= 0
##$ASSFAC= 0
##$ASSFACI= 0
##$ASSFACX= 0
##$ASSWID= 0
##$AUNMP= <proc_1d>
##$AZFE= 0.1
##$AZFW= 0.1
##$BCFW= 1
##$BC_mod= 2
##$BYTORDP= 1
##$COROFFS= 0
##$CY= 11.3945322036743
##$DATMOD= 1
##$DC= 2
##$DFILT= <>
##$DTYPP= 0
##$F1P= 2.36226072786647
##$F2P= -0.459571619588291
##$FCOR= 0.5
##$FTSIZE= 0
##$FT_mod= 4
##$GAMMA= 1
##$GB= 0.15
##$INTBC= 1
##$INTSCL= 1
##$ISEN= 128
##$LB= 0.24
##$LEV0= 0
##$LPBIN= 0
##$MAXI= 10000
##$MC2= 0
##$MEAN= 0
##$ME_mod= 0
##$MI= 1.114404
##$NCOEF= 0
##$NC_proc= 0
##$NLEV= 6
##$NOISF1= 3.799351
##$NOISF2= 2.8
##$NSP= 1
##$NTH_PI= 0
##$NZP= 0
##$OFFSET= 15.70392
##$PC= 1
##$PHC0= -19110.1
##$PHC1= 12.40078
##$PH_mod= 1
##$PKNL= yes
##$PPARMOD= 0
##$PSCAL= 0
##$PSIGN= 0
##$REVERSE= no
##$SF= 200.130013532006
##$SI= 16384
##$SIGF1= 3
##$SIGF2= 2
##$SINO= 400
##$SIOLD= 16384
##$SREGLST= <1H.CDCl3>
##$SSB= 0
##$STSI= 0
##$STSR= 0
##$SW_p= 3612.71676300578
##$SYMM= 0
##$S_DEV= 0
##$TDeff= 0
##$TDoff= 0
##$TI= <>
##$TILT= no
##$TM1= 0
##$TM2= 0
##$TOPLEV= 0
##$USERP1= <user>
##$USERP2= <user>
##$USERP3= <user>
##$USERP4= <user>
##$USERP5= <user>
##$WDW= 1
##$XDIM= 8192
##$YMAX_p= 0
##$YMIN_p= 0
$$ End of Bruker specific parameters
$$ ---------------------------------
##NTUPLES= NMR FID
##VAR_NAME=  TIME,          FID/REAL,        FID/IMAG
##SYMBOL=    X,             R,               I
##VAR_TYPE=  INDEPENDENT,   DEPENDENT,       DEPENDENT
##VAR_FORM=  AFFN,          ASDF,            ASDF
##VAR_DIM=   8192,          8192,            8192
##UNITS=     SECONDS,       ARBITRARY UNITS, ARBITRARY UNITS
##FACTOR=    0.0002768,     1,               1
##FIRST=     0,             0,               0
##LAST=      2.2672688,     0,               0
##MIN=       0,             -966917,         0
##MAX=       2.2672688,     864380,          0
$$ Real data points
##PAGE= N=1
##DATA TABLE= (X++(R..R)), XYDATA
$$ [...]
2618A579M432J580k047m393m877l543n8L892N401L937J626j871m672m835k874
$$ 1579 6011 7591 5544 1151 -3726 -7269 -7327 -3435 1966 5903 7529 5658 986 -3849 -6723
2633f723K22K678N217M396J747j807m427m914l444J78L838M744L596J911j533
$$ -6723 -6501 -3823 1394 5790 7537 5730 1303 -3611 -7055 -6877 -3039 1705 5301 7212 5679
2648E679m283n041k860K29K552M740M596J815j842m218m814l327L50L077M435
$$ 5679 1396 -3645 -6505 -6276 -3724 1016 5612 7427 5585 1367 -3447 -6774 -6424 -3347 1088
2663A088L799K087j305m190m805l019j88K601M905M575J454j871l850m235l105
$$ 1088 4887 6974 5669 1479 -3326 -6345 -6533 -3932 973 5548 7002 5131 1281 -2954 -6059
2678f059k70K716M429M017K013j005m112m751l234j32K660M906M122J216j434
$$ -6059 -6329 -3613 816 4833 6846 5841 1729 -3022 -6256 -6388 -3728 1178 5300 6516 5082
2693E082l132m341l642l93K708M198M105K168r26m180m496k906l37K356M346L807
$$ 5082 1950 -2391 -6033 -6426 -3718 480 4585 6753 5827 1647 -2849 -5755 -6092 -3736 610 4417
2709D417J489n51l030m699l545m04K635M359L975K029j234l942l820k976o23K058
$$ 4417 5906 5355 2325 -2374 -5919 -6323 -3688 671 4646 6675 5441 1499 -2321 -5297 -5920 -3862
2725c862M023L992J845l83l131m825l616j66K700L693L989K152j082l609l583
$$ -3862 161 4153 5998 5615 2484 -2341 -5957 -6123 -3423 270 4259 6411 5329 1720 -1863
2740a863k915j297J901M246M065J873m80l168m685l151k68K305L532L530K230
$$ -1863 -4778 -6075 -4174 72 4137 6010 5530 2362 -2323 -5474 -5742 -3437 95 3625 5855
2755E855o16k989l826l233j198J963M009L974J762n30k737m517k811n68J796K985
$$ 5855 5239 2250 -1576 -4809 -6007 -4044 -35 3939 5701 5171 2434 -2083 -4894 -5462 -3666 -681
2771f81L903K553n40k846l823l143j348J871M144L652J522k76k433l979l051q09
$$ -681 3222 5775 5235 2389 -1434 -4577 -5925 -4054 90 3742 5264 4988 2555 -1424 -4475 -5284
2787e284J312L309M029K400m96k895l637l375j060J934L632L111J968J43k336
$$ -5284 -3972 -663 3366 5766 5270 2375 -1262 -4637 -5697 -3763 -131 2980 4948 5091 2755
2802B755l803l274r67J246L138M153K284p19k524l353l182q15J367L336L115K119
$$ 2755 -1048 -4322 -5289 -4043 -905 3248 5532 4813 2289 -1064 -4246 -5061 -3694 -358 2757 4876
2818D876M35k339m166l114p40R76L227L880K216m60k482l056k892j405J022L168
$$ 4876 5311 2972 -1194 -4308 -5048 -4072 -845 3035 5251 4791 2309 -747 -3639 -5044 -4022 -854
2834h54L377K310L13k488l613k916r18Q08L397L254K031l15j826k880l358j459
$$ -854 2523 4833 5146 2658 -955 -3871 -4789 -3981 -584 2670 4701 4386 2560 -320 -3678 -5137
2850e137J333K806L460K185K40k334l255k838j182R13K869L302K063J81j508l274
$$ -5137 -3804 -998 2462 4647 4887 2553 -702 -3540 -4722 -3809 -940 2362 4425 4606 3098 -176
2866a76l533j107J135K848L033K236L62k078l239k642j237N41K514L357K301K60
$$ -176 -3709 -4816 -3681 -833 2200 4436 4798 2720 -519 -3161 -4398 -3857 -1343 2014 4315 4575
2882D575j688l326k799j379J067K352L003K500L44k008k997k436j532N16K458
$$ 4575 2887 -439 -3238 -4617 -3550 -1198 1805 4305 4649 2641 -356 -2792 -4324 -3808 -1350
2897a350L446K064K46j735k832k890j205P49K286L009K201N10j861k618k718j684
$$ -1350 2096 4160 4406 2671 -161 -3051 -4256 -3507 -1221 1788 3989 4499 2638 20 -2698 -4382
2913d382O45K582K990J986K74j175k746k758j480M86K420K733K062O52j543k510
$$ -4382 -3737 -1155 1835 3821 4095 2920 174 -2584 -4064 -3578 -1158 1575 3637 4289 2746 236
2929B36k803j631O66K232K800K086M19j062k585k923j322M38J996K564K521M49
$$ 236 -2567 -4198 -3532 -1300 1500 3586 4005 2943 358 -2565 -3887 -3449 -1453 1111 3632 4081
2945D081j444k466k577j476N09J802K719K185P84j153k534k858j400L49J961K641
$$ 4081 2637 171 -2406 -3882 -3373 -1571 1148 3333 4117 2964 430 -2428 -3828 -3479 -1518 1123
2961A123K270N79j306k351k600j316J8J828K799K106O31j004k466k274j476Q3
$$ 1123 3393 3972 2666 315 -2285 -3601 -3583 -1755 1044 3150 3781 2777 311 -1963 -3439 -3356
2977c356J702K890J873P02j080k275k461j395RJ882K407K152R29j247k224k582
$$ -3356 -1654 1236 3109 3811 2731 456 -2005 -3400 -3391 -1509 898 3050 3979 2732 508 -2074
2993b074j356K37J446K772K053O46q34k281k450j681K21J625K628J868Q26p87
$$ -2074 -3430 -3193 -1747 1025 3078 3724 2890 609 -1841 -3522 -3301 -1676 952 2820 3646 2859
3009B859k437k203j513J7J436K377K314O12n91k212k418j564L33J319K441J916
$$ 2859 422 -1781 -3294 -3277 -1841 536 2850 3462 2871 659 -1759 -3323 -2990 -1671 770 2686
3025B686J051j044k094k254j454m8J370K271K172P37m78k148k380j516J11J243
$$ 2686 3737 2693 599 -1655 -3109 -3157 -1787 484 2656 3393 2915 767 -1613 -3129 -3018 -1775
3041a775K099K315P38n97j866k384j504j42J197K229K190Q91o32j829k326j415
$$ -1775 324 2639 3377 2780 914 -1470 -2974 -3116 -1919 310 2500 3391 2759 930 -1396 -2811
3057b811k24J279J922K002J191o20j839k130j750j33J191K307K049Q61q17j463
$$ -2811 -3035 -1756 166 2168 3359 2739 900 -1230 -2980 -3113 -1922 385 2434 3295 2478 1015
3073A015k249j386l58J209J858K318R90n17k034k024j634n0J230J846J788R71
$$ 1015 -1234 -2620 -2978 -1769 89 2407 3397 2880 846 -1178 -2812 -2862 -1632 214 2002 2973
3089B973k72j420k259j739j92Q98K186K005J002l91j724j961j738j81J073J777
$$ 2973 2701 1281 -978 -2717 -2909 -2011 175 2180 3182 2791 1067 -894 -2632 -2813 -1740 37
3105C7J882R97r5j523k249j734k12R87J815J982J192n38j486k020j339o62J054
$$ 37 1919 2916 2821 1298 -951 -2685 -2897 -1910 -95 1887 3079 2541 1055 -965 -2304 -2966 -1912
3122a912J842J889J185j75j664k148j494k20O58J916J887J122m81j298j799j491
$$ -1912 -70 1819 3004 2829 1165 -983 -2477 -2697 -2039 -123 1764 2886 2405 1107 -692 -2183
3138b183n34P35J806J833J293l17j626j747j575l43P47J583K065J003j23j268
$$ -2183 -2717 -1982 -176 1657 2950 2633 1007 -740 -2315 -2658 -1911 -328 1737 2740 2617 1349
3154A349j878j662o89R33J890J786R04n1j346j859j355o52N01J771J987J109o3
$$ 1349 -529 -2191 -2880 -1947 -57 1729 2633 2582 1236 -623 -1978 -2630 -2129 -358 1629 2738 2675
3171B675j212j978j570o10P18J734J582J147P5j026j866j576o97L30J825J958
$$ 2675 1463 -515 -2085 -2695 -1977 -243 1339 2486 2561 1535 -331 -1907 -2604 -2274 -449 1509
3187A509J063m2j041j807j531n78O76J227J770J376J82j233k131j329o75M18J721
$$ 1509 2572 2530 1489 -318 -1849 -2427 -1751 -524 1246 2622 2804 1571 -560 -1889 -2564 -2146 -425
3204d25J965P90K7p34j675j653q31M95J316J895J488K18j204j958j418p50M00
$$ -425 1540 2330 2357 1623 -52 -1705 -2536 -2041 -725 1170 2658 2876 1672 -286 -1704 -2454 -2054
3221b054J387K050Q16K40o26j708j943p22O28J412J755J455j13j069j730j202
$$ -2054 -667 1383 2199 2439 1813 105 -1838 -2560 -1932 -520 1235 2690 2577 1508 -222 -1424
3237a424r55M86J325J621J283O7m33j806k071p03O78J116K000J272J1j130j287
$$ -1424 -2379 -1893 -568 1053 2336 2403 1970 164 -1907 -2610 -1932 -816 1184 2456 2467 1337 50
3254E0j624q80L87J445J717J076N24q08j792j881o40M43J447J533J319R7r13j295
$$ 50 -1574 -2454 -2067 -622 1095 2171 2695 1887 95 -1786 -2426 -1983 -536 997 2316 2413 1500 205
3272B05j429j244L80J355J571J363L76q25j713j658n10L42P15J716J394L70n47
$$ 205 -1224 -2468 -2088 -733 838 2201 2577 1752 39 -1619 -2129 -1787 -1072 644 2038 2408 1861
3289A861j541j653j135L32J445J646J059L76o44j658j500p83K02R56J733J519
$$ 1861 320 -1333 -2468 -2136 -691 955 2014 2390 1746 88 -1412 -2195 -1993 -1037 696 2215
3305B215L30p40j507j700j021L14J373J589Q78N66m83j489j455j008J0R78J853
$$ 2215 2545 1805 298 -1402 -2423 -2109 -736 853 1731 2297 1814 325 -1130 -2138 -2128 -1150 703
3322G03J289L65n85j454j427j113L14J019J284J372N00l68j308j940p71j53J105
$$ 703 1992 2357 1772 318 -1109 -2222 -1908 -889 395 1767 2267 1899 591 -1349 -2120 -2273 -1168
3339a168J962J155M03m99j446j486j121J54J008J246J548Q01n82j718j434r60
$$ -1168 794 1949 2352 1853 407 -1079 -2200 -2046 -1038 208 1756 2557 1975 257 -1177 -2137
3355b137J62J058J310J386L29k54j254j658j020l1J105J530J368N75o91j249j620
$$ -2137 -1975 -917 393 1779 2108 1854 600 -1058 -2078 -2109 -1004 526 1894 2469 1778 529 -1091
3372a091p53j04Q03J647J166M72k48j280j461j235m0J115J351J411N61l95j580
$$ -1091 -1844 -1948 -1145 502 1668 2140 1892 612 -849 -2084 -2124 -1009 342 1753 2314 1919 339
3389C39j380q37k70R15J582J208P25k01j418j755j045L9R36J441J221P22n38j259
$$ 339 -1041 -1878 -2148 -1233 349 1557 2282 2081 663 -1092 -2137 -2098 -1162 279 1500 2222 1684 425
3407D25j346p40n32J090J347J259P80k47j420j719p19j38Q47J295J434O97k57
$$ 425 -921 -1661 -2193 -1103 244 1503 2283 2036 616 -1103 -1822 -1960 -1113 182 1616 2313 2056
3424B056j483j225j379j86J045J374J538N89n14j121j711j007K0O65J526J393
$$ 2056 573 -652 -2031 -2217 -1172 202 1740 2329 1815 694 -1017 -2024 -2004 -1339 187 1580
3440A580P17k10j388j452j234k68J118J369J213O59m7j322j461j134m6M40J453
$$ 1580 2297 2087 699 -753 -1987 -2255 -1137 232 1445 2104 2057 735 -726 -1860 -1906 -1466 -13
3457a3J654O25k48j159j497j121l25P77J342J238R44p7j335j538j220j08O51J414
$$ -13 1641 2266 2018 859 -638 -1759 -2084 -1307 35 1273 2217 2140 805 -733 -1953 -2061 -1410 4
3475DJ400Q81k50j205j350j333l32P48J349J352R00M7j295j562j044o46Q48J399
$$ 4 1404 2285 2035 830 -520 -1853 -2185 -1437 -88 1264 2164 2211 916 -646 -1690 -2336 -1488 -89
3493h9J350J024l41r79j334j299n30R00J352J260Q68q7j247j681q87k47K98J688
$$ -89 1261 2285 1944 965 -369 -1668 -2198 -1298 54 1314 2182 2095 848 -833 -1720 -1967 -1669 19
3511A9J274P86rj162j474j328j84M85J541J320J013k24j346j257j018l98M01J358
$$ 19 1293 2079 2070 908 -566 -1894 -2078 -1593 -52 1268 2281 2057 711 -546 -1564 -1962 -1561 -203
3529b03J341R11qr16j536j217l07N67J276J301Q35k5j110j183j236n18M01J471
$$ -203 1138 2049 2041 1125 -411 -1628 -1935 -1368 -92 1209 2044 2019 909 -274 -1510 -2028 -1627 -156
3547a56J432J036l42j050j183j371m27P16J216J283R47l7r51j489j000o48M76
$$ -156 1276 2312 1970 920 -263 -1634 -2061 -1345 -129 1154 2101 2064 1113 -376 -1376 -2024 -1548
3564a548J231J595P46j13p51j409j360l76L59J391J236R77J56j055j367j204n15
$$ -1548 -317 1278 2024 1911 1160 -249 -1609 -1985 -1626 -235 1001 1978 2134 1079 -288 -1492 -2007
3581b007N76J263J268R11m9q86j305j308m99N04R75J727Q86j40q09j418j153m91
$$ -2007 -1431 -168 1100 2011 1962 1076 -229 -1537 -2036 -1532 -557 1170 2056 1916 1107 -311 -1464 -1955
3599a955M21J246J190R92K76q19j493j242n25M62J107J521Q15j47o62j399j215
$$ -1955 -1534 -288 902 1894 2170 1351 -142 -1384 -1909 -1447 -340 1181 1996 1849 1187 -212 -1427
3616a427n68M24J169J371R61J29r12j115j551k25J40J191J572R65k46q63j019
$$ -1427 -1995 -1571 -402 969 1930 2059 1147 32 -1519 -1744 -1604 -413 1159 2124 1878 1015 -4
3633dj438m36L43J108J350J164R5q30j531j135n84K95J247J308R39j32n67j156
$$ -4 -1442 -1878 -1535 -427 923 2087 2182 1352 -179 -1314 -1898 -1603 -356 952 1891 1759 1192 36
3651C6j467n40M95J169J117R42L53j198j060j325l84K44Q66J656J143j28o84j157
$$ 36 -1431 -1971 -1476 -307 810 1752 2105 907 -153 -1478 -1862 -1618 -752 904 2047 1919 1235 78
3669G8j365o86N79O98J683R21J3o51j311j186n93L18R35J624P47L31r16j187j434
$$ 78 -1287 -1973 -1394 -696 987 1908 1921 1270 -41 -1227 -1820 -1502 -567 1057 1804 2135 1219 32 -1402
3688a402m73L01J214J282Q46J71o94j099j255o44J78J005J328J125R7o32j410
$$ -1402 -1875 -1574 -360 922 1768 1939 1245 146 -1109 -1753 -1575 -570 758 1883 1980 1348 -62
3705f2j108r16M95J005J235J105L28q57j232j064q02K72J102J487Q76J01q20j079
$$ -62 -1170 -2086 -1591 -586 649 1754 2082 1225 -7 -1071 -1873 -1601 -499 988 1864 1965 1145 66
3723F6j128q86K44R57J312J174L77p04j320j316p30K31J293J001J167J46m34j287
$$ 66 -1062 -1948 -1704 -747 565 1739 2116 1412 92 -1224 -1954 -1723 -430 571 1738 1884 1450 163
3741A63j205p15K47Q18J537R18L13p10j377j198n69K61Q54J179J140M46o81j254
$$ 163 -1042 -1757 -1510 -692 845 1763 2076 1366 -11 -1209 -1778 -1517 -663 516 1656 2102 1421 167
3759A67j474n21J56Q69J498R86K60r27p89j246r23J60R14J682Q43L31m86j380
$$ 167 -1307 -1828 -1672 -803 695 1681 1941 1014 225 -1021 -1944 -1784 -870 812 1655 1986 1500 120
3777A20j147p29Q0R57J227J241J96o08r90j287r29Q8J181J187Q83N57o23j189
$$ 120 -1027 -1756 -1676 -719 508 1749 1945 1337 347 -940 -1869 -1781 -600 587 1470 2027 1404 215
3795B15j299q53L66P77J195J211J69j91j255j116j036Q4J150J124R87M09m67j230
$$ 215 -1084 -1937 -1571 -794 401 1612 1781 1590 335 -781 -1817 -1733 -583 541 1528 1937 1470 240
3813B40j261p04O8P98J359R36L69m32j032j217p47j07R63J058J062O89p21r82
$$ 240 -1021 -1725 -1657 -859 500 1436 1805 1373 341 -876 -1623 -1730 -767 291 1353 2042 1321 339
3831C39j250o57l8O60J352J157L72o18q12j241q82kR58J046J034N92n91j148j072
$$ 339 -911 -1568 -1606 -946 406 1563 1935 1317 505 -736 -1618 -1620 -662 384 1418 2010 1419 271 -801
3850h01p91k65Q69J392J181L78n58r14j247q49k3P57J082J037P19l63j100j012
$$ -801 -1592 -1857 -988 404 1585 1963 1405 491 -756 -1605 -1628 -871 211 1248 1967 1604 504 -508
3868e08q72k23Q11J237J025K22l67p18j362q70L7N38J438Q20O07l24j050j136
$$ -508 -1380 -1603 -792 445 1470 1692 1325 607 -755 -1625 -1588 -1050 388 1208 1815 1491 441 -695
3886f95p70qN60J055J139N57l18j150j115q74m6O40J304J119M74k48j179j212
$$ -695 -1465 -1473 -913 142 1281 1838 1520 370 -745 -1619 -1665 -1025 279 1398 1872 1624 445 -767
3904g67q02m1P13J170R75M49k07j061j113q19r9P07J041J253L85j08r71j300r56
$$ -767 -1569 -1610 -897 273 1248 1697 1490 429 -684 -1503 -1602 -895 146 1399 1784 1676 705 -595 -1551
3923a551q0O73J118J174M23k00q97j308r53N7P08R67J179N74k82j066j072r75
$$ -1551 -1631 -958 160 1334 1757 1557 660 -648 -1601 -1544 -836 131 1310 1884 1602 536 -536 -1511
3941a511J9M91J213J073N05l95r61j070r21pO64J134R83L97j47q93j135q49j69
$$ -1511 -1492 -1001 212 1285 1790 1395 434 -636 -1557 -1564 -900 234 1217 1614 1467 574 -561 -1410 -1579
3960a579P57J174R27L70j68r13j055j016o1O85R78J151N07l10p80j187q16k09
$$ -1579 -822 352 1279 1649 1481 568 -487 -1503 -1564 -879 99 1250 1757 1447 667 -520 -1336 -1545
3978a545O04R67J086N70j31r48j094j010J21M25J190Q58N88j01j131j059o21l67
$$ -1545 -941 26 1112 1682 1551 603 -491 -1501 -1380 -955 235 1093 1681 1580 449 -610 -1231 -1598
3996a598Q18R87R93M16n6r52j149q67j06N91J022J009N61o3j070j070p60l00P11
$$ -1598 -780 207 1200 1616 1560 608 -541 -1408 -1514 -923 99 1108 1669 1606 536 -534 -1294 -1594 -883
4015h83J056J011N11k60p58j202p47k04M38J047J161N87l74p89j059q15k19N11
$$ -883 173 1184 1695 1435 677 -525 -1272 -1476 -1038 9 1170 1757 1383 594 -465 -1280 -1499 -988
4033i88R25J141N06p4q55j112o74m00O43R33J037N00J98j113j138q14j23M88Q60
$$ -988 -63 1078 1584 1510 655 -457 -1131 -1531 -888 45 1082 1582 1780 667 -471 -1285 -1408 -920 -60
4052f0J059N81N0j101r69r52j66O30R34J200M75p9r57j208p33j40M06R27J278
$$ -60 999 1580 1630 529 -440 -1392 -1558 -928 6 1206 1681 1602 645 -563 -1296 -1436 -1030 -103 1175
4071A175L15N6j054q63q82k34L38J202R84N35j53q14r53r54j57M92J015J076P05
$$ 1175 1490 1546 492 -371 -1253 -1487 -1149 53 1037 1572 1419 605 -348 -1302 -1459 -967 48 1124 1829
4090A829l23r86q19r59j28N81Q01R75N35k07p91p57j075l2L73R71J010M67O5r64
$$ 1829 1506 520 -299 -1258 -1386 -805 -4 971 1506 1299 508 -249 -1324 -1356 -983 -12 998 1465 1530 566
4110E66r70r92j53N27R59J085M99j58p18q90r44k36N67O76J102O70j44q89q77
$$ 566 -404 -1396 -1549 -1022 -63 1022 1521 1363 645 -245 -1189 -1425 -858 -182 920 1590 1446 557 -320
4129c20q76k87N40J120P91M90o4o87j088p48l63N51Q56J082N46M4r90q56q05m69
$$ -320 -1196 -1483 -943 177 968 1458 1394 707 -381 -1129 -1492 -941 -85 997 1543 1587 597 -259 -1064 -1533
4149a533N11J016R34N77P8q23j017q99oL1R32J323M80r7p62j061q44k96O00P90
$$ -1533 -1022 -6 928 1505 1583 760 -257 -1156 -1162 -1131 -199 1124 1604 1507 745 -316 -1160 -1456 -856 -66
4169f6R76N12l8p24r39q72k35L33J054R68N34j70q16o51r65m18N05J071P80P34
$$ -66 910 1422 1384 660 -279 -1151 -1386 -1053 1 969 1503 1333 517 -134 -1099 -1517 -1012 59 839 1573
4189A573k80n41r87o25l59L02P34J231M28r4n78j086q20m00M88Q61J144L91J16
$$ 1573 1293 752 -235 -860 -1219 -917 -183 1048 1476 1382 804 -282 -1102 -1502 -1014 -153 991 1382 1498
4208A498q01q87r62j32K69J006Q02O49l8o31r15r80j94L98Q34J027K78K11r75
$$ 1498 697 -190 -1152 -1284 -1015 -9 793 1442 1404 773 -142 -1122 -1316 -918 -84 943 1221 1432 457
4227D57p52m95n81L03R97P89P73j29o67r95r45R2L03P16Q37O36j20n31q16p18
$$ 457 -295 -790 -1371 -1068 -71 718 1491 1362 695 -300 -1245 -1153 -850 -134 703 1339 1219 688 -128 -846
4247h46l89K74J024P63O23j24o43q14p11l61M72N74Q62N19Q3n57q49p97m01M67
$$ -846 -1235 -961 63 826 1449 1325 682 -132 -843 -1204 -732 -158 704 1223 1306 749 -100 -897 -1298 -831
4267h31Q33Q18L91P7o21q94o29k59J49Q99P86N53P4n56r30p86k66K05R20O24O16
$$ -831 2 820 1211 1288 667 -227 -856 -1115 -966 -67 719 1272 1346 790 -140 -926 -1192 -987 -67 557 1173
4288A173k1m23p47r18j34J14N24J067P35k45m68n91q52l10J67O44Q51N68Qk75
$$ 1173 1152 729 -18 -936 -1070 -956 -432 635 1370 1125 657 66 -786 -1096 -929 -285 566 1134 1142 867
4308H67q98p07l25K13O61O25Q20n3l76q62o17l93P7R65M80Q00J30p66o96p49l08
$$ 867 -31 -738 -1063 -850 -189 436 1256 1203 827 -35 -652 -1045 -968 -3 477 1277 1407 641 -55 -804 -1112
4329a112L60M73P66O74j5l55p42n90o22L40N90R00O12Q9o42p52p86J7J19M41O71
$$ -1112 -752 -279 487 1161 1146 791 49 -541 -1163 -823 -233 667 1279 1368 726 -26 -812 -795 -676 -235 436
4350D36N37K94m51q31r60j15J65Q52O20N08K8l12r06n27j96J62K80J060N04j9
$$ 436 973 1267 816 -15 -975 -1090 -925 -73 547 1055 1083 771 -135 -662 -858 -696 -416 644 1148 1129
4370A129n20n40p68n70P23L21P32N58N7k77r26o46k40K23L42Q91P30j42m06n94
$$ 1129 609 69 -699 -1269 -546 -225 507 1065 1122 845 -81 -727 -967 -744 -402 489 1219 1077 671 77
4390G7r38j33K89L43P18P63R1l26r26o48k86J71M70J023L22n0k63p81n47m83L97
$$ 77 -861 -994 -705 -362 356 1119 1210 884 -42 -690 -976 -805 -335 688 1010 960 697 -84 -631 -1114 -717
4411g17N43O77N50P1m91p38n95j97nN92Q04N28J22n32o34o87l53L00P24M28O38
$$ -717 -174 503 1053 1124 633 -105 -700 -897 -902 -310 494 1022 1144 612 -22 -709 -1062 -762 -38 390 1028
4432A028j2k92q87n02k83J53N33P58M48J24l83m92q17n24M01N87N35N93J45n25
$$ 1028 1016 724 -163 -665 -948 -795 -262 496 944 1068 685 193 -624 -1148 -747 -160 375 968 1113 588
4452E88m96p65j92J27M59O92O27L0l43n30p06l99K16N15P81L18J54m14o44n31
$$ 588 92 -673 -865 -738 -279 413 1040 1070 727 197 -509 -908 -692 -177 604 922 1076 662 18 -513
4472e13l94K1Q22N89L02L83l81p62n93k56K8M58Q51K59K78l79o02p15j48o1O24
$$ -513 -907 -886 -64 525 827 1210 829 67 -526 -782 -754 -296 555 814 1092 713 111 -604 -752 -813 -189
4493a89P02L01J94n49l53o79k41J69N73N53M78J8k45p41l43m61L0P47O47K43J86
$$ -189 513 814 1008 459 106 -573 -814 -645 -72 481 959 977 732 -9 -352 -813 -783 -36 611 854 1040
4514A040m69m26m65n28J81M34O94N35J23o87k37o22n17L80L25M83O02J33k83n64
$$ 1040 571 145 -320 -848 -667 -233 461 996 1119 432 195 -427 -944 -564 -239 244 846 979 696 132
4534A32n63n00K33M26P99M42K0l07n02q64j83K93L69M99N15L61n56p16l48l65
$$ 132 -431 -931 -698 -272 527 969 989 682 180 -684 -867 -574 -205 294 809 1170 614 -102 -450 -815
4554h15J76L58O15N46P1l91n30n25l98M09J49P59O69k27j91n91n38k84K21L79
$$ -815 -639 -281 334 880 951 560 30 -495 -893 -484 -335 424 1093 866 675 84 -454 -738 -517 -138
4574a38N20M49r2K6q55l67m40K48M88N88M43p1l11l01p68j09P3M38N39M69R3n49
$$ -138 382 831 739 765 -90 -457 -897 -649 -161 427 870 799 488 187 -581 -690 -617 -179 360 829 922 373
4596C73k44n70j72o5M91L59N73J03k66m92o52j77J45M06M94L16K39k36m59n74
$$ 373 129 -441 -613 -678 -187 172 745 848 582 90 -562 -739 -594 -188 306 622 861 625 166 -408
4616d08k69p4P12M43K37L66m05m92l82n43K83K88O36M59P6l04n72m94k52J39L65
$$ -408 -677 -751 -39 404 641 1007 602 110 -272 -815 -532 -244 392 851 927 623 51 -443 -695 -556 -191
4637a91M90M34p2j21m26n09l71N8N87N06L66J49m39m07m10j20J0L62L63M99p0
$$ -191 299 733 661 540 114 -395 -766 -708 -121 385 751 900 461 54 -356 -476 -466 -104 259 758 688
4658F88k3n69m63k53N4M70M51L71J49l45m96l55k68J35L97L66L68J33l24l52m72
$$ 688 665 96 -367 -620 -566 -96 355 726 875 530 34 -321 -589 -454 -57 309 677 810 486 134 -338
4679c38l98K34L80M36M06J60k88o00k56l80J31L65M23N63j87j74l77l38l19L36
$$ -338 -736 -502 -122 314 720 880 592 -8 -264 -644 -513 -148 275 838 651 477 100 -238 -557 -221
4699b21J01L44M45j4J2m40n32k70K7N05K22M61m3j26j92o49q5q3M44M50K10P7
$$ -221 -120 224 669 655 667 227 -305 -575 -548 -43 179 640 597 471 279 -370 -455 -538 -94 356 566 643
4721F43k51l44m35n8N6K65M51L10R4k90k96m94j22j13M22M44L04J13j96m34k52
$$ 643 392 48 -387 -445 -389 -124 327 637 731 441 145 -349 -471 -584 -162 282 586 699 503 69 -183
4742a83k31j15L62L89L80l2k16k59n00l6nJ95O14K67nk66k82l18l93J36K93M83
$$ -183 -414 -529 -167 222 602 570 354 95 -405 -441 -446 -251 363 630 625 359 77 -241 -634 -498 -205 278
4764B78L45L7k94j77n51j53J8M89J56M13P2L3n74m16j37O6K73M19L32Rj95l96
$$ 278 623 660 366 189 -362 -515 -497 -8 148 561 633 666 92 -324 -461 -395 -122 297 629 638 443 47
4786D7m71o1M4L06L98L20L13m77m01k80j80R4K83L55K00Q6m7m89m1m11J0J87M77
$$ 47 -424 -485 -441 -135 263 583 896 419 18 -262 -442 -348 -65 290 490 576 529 40 -1 -412 -402 -215 262
4809B62L68j12m9m60k7k89q6M40J53N21j43k30r4n06m29Q6N47J30L92J24k94j83
$$ 262 630 518 469 9 -18 -307 -393 47 200 721 578 348 254 -252 -681 -595 -48 82 474 598 304 121
4831A21l77j96K25J79L58J77o1j50k05k12k31M1J83K74L75M0j44k32l23j42n8
$$ 121 -256 -452 -227 -48 310 487 426 276 71 -141 -372 -331 -148 126 501 541 397 165 -158 -300 -358
4852c58K48L22M17j31j60j67m53j94J74M19J17P1K58k86l86r8j19P9N2L41J65
$$ -358 -110 212 629 498 338 171 -282 -476 -302 117 234 305 563 277 -109 -207 -326 -247 -195 146 311
4873C11K59l19j31k04j40j10L11J53J44K35pl62j44l67j1M14K23J01j20M7j37
$$ 311 570 251 120 -84 -224 -334 -23 130 274 509 502 140 -4 -371 -382 32 255 356 236 283 146
4894A46k70j02Q6q1M44OK11p8k61k12k75Q3L01K52L20k58r0l39K4k88J5L28L12
$$ 146 -124 -226 -140 -221 223 229 440 362 101 -111 -386 -303 -2 250 570 312 222 -117 -93 -381 -366 -38 274
4917B74J77J2k05k39j96j66J97P4K98J37M6j9l95j12j90JL57J06K16R8k65j87
$$ 274 451 463 258 19 -177 -343 -146 -72 226 363 409 390 -5 -117 -307 -306 51 157 373 471 206 19
4939A9j52j76J93J02J16J74J87j56j61m51m5O3L22L06M0P9k62j64r6k38k8M07
$$ 19 -133 -309 -116 -14 102 276 463 307 146 -305 -350 -287 35 341 381 460 198 34 -62 -300 -328 79
4961G9q6M14J14k86k33k43J3J16R4K34K46p3j18j67l24p8l9L37Q4K61M8rk94j90
$$ 79 -7 407 521 235 2 -241 -228 -112 -18 216 462 389 271 104 -220 -298 -337 0 84 345 393 384 90 -100
4985a00j27J06O7K03L14j67l3n2j58l00J99L41mj22n4K17l37r4j04J13J33J93
$$ -100 -227 -121 -54 149 463 296 263 211 53 -247 -48 293 289 167 113 330 -7 -101 -205 -92 41 234
5007B34P0J21l32k6j91k19L75J23R9m5R8N6k67j39k06L00J40j44K98k2j23j17
$$ 234 304 425 93 67 -124 -343 32 155 254 209 307 363 96 -43 -249 51 191 47 345 323 200 83
5029H3k09J02j03K36N3O5J07k74r8P3Nk61L46N9J09J54k44l09j14n0O7L44K8m5
$$ 83 -126 -24 -127 109 162 227 334 60 -38 35 40 -221 125 184 293 447 203 -106 -220 -270 -203 141 169 124
5053A24K34j76r0k03j54K59K97J1l0kj99r8k49J03n8N25p6Q9Q4k61j72j67M0n
$$ 124 358 182 92 -111 -265 -6 291 302 272 270 71 -27 -276 -173 -231 294 218 307 391 130 -42 -209 -169 -174
5077a74K30J72R8m7l08R4l04L6j02M20K34j43K8k01P8k01O7J7R6K34p1j3j37j35
$$ -174 56 228 326 279 -29 65 -239 -203 -305 115 349 206 234 33 111 -90 -23 -6 90 324 253 240 103 -32
5101c2q7mJ62Q4J72l0oj86J2k20k7K10J15J37M3j72j2j57j43Mp0M44o1P1J3n3
$$ -32 -119 -123 39 123 295 265 259 73 85 -135 -162 48 163 300 343 171 159 2 -141 -137 -207 237 176 247 260 207
5127B07l92J74QN4J44J29r8k9k14k6q5N8J27j4J51J18j80j67O5j43K02o5K25N8
$$ 207 -185 -11 -3 51 195 324 226 197 -17 -43 -128 -70 57 43 194 312 132 -35 30 -113 89 24 249 307
5151C07O2k75k1o0j27K9M9J04J62J59p6j98p1o2J27j32k8L10J64k52p3j95j01
$$ 307 369 94 73 13 -114 -85 -36 68 230 389 313 115 44 -18 109 -23 -51 259 423 171 98 -97 -198
5174a98O9J32J40J70K7k68J65k79k48L00k38L02J83q5J21k66j55J32J15k6J5K4
$$ -198 -129 3 143 313 340 72 237 -42 -290 10 -228 74 257 172 293 27 -128 4 119 93 108 132
5196A32J87j72q7k88J79j04L37o8L5n5Q1j36l07J62j4L22j17J72J00j22o5k84
$$ 132 319 147 60 -228 -49 -153 184 116 151 96 177 41 -266 -104 -118 204 87 259 359 237 172 -112
5218a12p0J51p7R1J98J71l36M9k35J25M5l0J83K33j01k99k36K54j52N9K42k4K18
$$ -112 -182 -31 -108 -17 181 352 16 65 -170 -45 0 -30 153 386 285 -14 -250 4 -148 -89 153 129 347
5241C47k55J77k34j59J28j99M96r5n0J32j62l1k14M6p1K23K46l4o3k34P6k1l41
$$ 347 92 269 35 -124 4 -195 301 206 156 288 126 95 -119 -73 -144 79 325 291 228 -6 70 49 -292
5264b92J81M72j60Q5j8r9j19r1Q1j34K01J27K1k10R8j16j49R5Q8O1J13O5o6m10
$$ -292 -111 361 201 286 268 169 50 -41 40 -94 107 234 255 45 143 27 -122 -27 61 122 235 300 234 -176
5288a76pj12J51J53K93j4n2J17k89l1n9o0J66R0O1K79j70l58p7j16L1J58J16K67
$$ -176 -183 -295 -144 9 302 288 236 353 64 33 -26 -86 80 170 231 510 340 -18 -95 -211 -180 -22 94 361
5312C61K6j17k22j55j06Q6J68P0J91J43k04l29P5j3j0q9M02K5J2m6k43j56k28
$$ 361 387 270 48 -107 -213 -127 41 111 302 445 241 -88 -13 -26 -36 -125 277 302 314 268 25 -131 -359
5335c59K21J82N0K16J74j36k81k01l05K41J81K19K35j5j96j88j81j00L5J40M00
$$ -359 -138 44 94 310 484 348 67 -134 -439 -198 -17 202 437 422 226 38 -143 -243 -208 -68 332
5356C32M4m1j61j37k48J4n6K35L36L3J5k03j12l62J94J52j33J55L36J09k09j41
$$ 332 376 335 174 37 -211 -197 -253 -18 318 351 366 163 51 -311 -117 35 -98 57 393 502 293 152
5378A52l68p1LL28J71r2J55l7j88l89qJ46J17J79L42N2k6m46k81l3L2L13J19K01
$$ 152 -216 -287 -284 44 215 123 278 241 53 -336 -344 -198 -81 98 440 492 466 20 -261 -294 -262 51 170 371
5402C71K04n5l72l12k2j5J55K03L18L6n08o6j57O2QQJ88J96J42p9j92l75j24L44
$$ 371 575 520 148 -164 -186 -201 -46 157 475 511 3 -63 -220 -158 -150 -142 46 242 384 305 113 -262 -386 -42
5426d2KK37K08R1l23j61k3j76j98K79L95J05N9m4j83k50k84J08O6M34J71q1j20
$$ -42 -40 197 405 496 173 12 -11 -187 -385 -106 289 394 453 409 226 -24 -308 -200 -134 300 471 390 270
5449B70k03l14r7q3M04L93J1J08l8l30l12M8M8J29J56J32J62p6k33m03P9j51K21
$$ 270 67 -247 -344 -427 -23 370 381 489 451 121 -191 -143 -95 34 190 322 484 408 175 -228 -149 -300 -79
5472g9J89K93O9k35l17j21j09N1R0L09J17K87k20j89l66k72J21L27L04M2J01o9
$$ -79 110 403 472 237 -80 -201 -310 -259 -169 140 257 544 324 135 -231 -503 -382 -55 249 291 392 323
5494C23k09k58m7j58J79M64L36k25n4l70o0l79L59k1J89K84J93k14k19m89KP1
$$ 323 114 -144 -191 -349 -170 294 630 405 351 -19 -79 -458 -99 -120 69 353 546 332 113 -376 -374 -303
5516c03K31K83L53j77k8j97l90J2j36L54L9L15Q9K7l72j72j86J26J30K99K54j11
$$ -303 -72 211 564 387 359 162 -228 -216 -352 2 41 356 445 472 100 -72 -258 -132 -2 297 551 440
5538D40j27k81k20k06LL22K86K53Q0j69k54m41J15k6K63K19J14P2k04Pn42j31
$$ 440 313 32 -188 -394 -391 -69 217 470 550 381 127 -314 -199 -225 38 257 371 443 239 246 -296 -427
5560d27M7L91%N21O0j67m13k86J49j85K48J91J93L2j43n7l97j96K5L43K40J55
$$ -427 -380 11 11 532 592 425 12 -274 -125 -310 -62 129 322 354 211 154 -243 -439 -414 -71 169 324
5582C24J43j47k31l57j46J5K49L25K97J9j29k02l31j50J36j24N40L57oj9n18l04
$$ 324 467 320 89 -268 -414 -399 -150 175 472 491 362 160 -171 -321 -185 -309 231 588 582 563 45 -259
5604b59L3j15P8M54L42l8j84k42l50j87J28L13J98K90j60L7l40k64k50K21K64
$$ -259 -226 -341 -263 191 533 495 311 69 -281 -468 -340 -27 171 461 301 338 -2 -266 -516 -295 -31
5625c1K50J44J59o6l19m21q1J57R8L68J50j1J67n16j46l45l2M16K41K28Q1j14
$$ -31 219 363 522 456 137 -284 -365 -208 -110 258 408 397 564 48 -98 -443 -475 -59 182 410 491 377
5647C77k33k35k78k3J41L16L24J93k62l22m4k02j62K40L68K53R3j19k12m47j54
$$ 377 144 -91 -369 -392 -251 65 389 582 320 -2 -46 -248 -410 -170 198 451 544 425 213 -234 -388
5668c88J63K59K61K49Q1q2l51m55k09J03J70L50R5L37j38k46m79on5L32K78K30
$$ -388 -225 34 295 544 625 543 192 -263 -472 -369 -199 151 246 583 445 199 -280 -286 -341 -9 269 499
5690D99J94m09j28l27l31J50K25K38K83J16j4k54k64l70n0M22K6M28P7k44j93
$$ 499 693 284 156 -171 -502 -352 -127 111 394 510 496 242 -22 -392 -442 -20 6 434 511 267 74
5711G4k64j26n4K76K56K17J70q5k50l69l40K0K74M39J00K30j55k85m51K5O4RJ91
$$ 74 -190 -316 -370 -94 162 379 549 464 214 -155 -495 -475 -201 238 338 568 413 128 -323 -298 -234 -225 -34
5734c4M17K69o7l95k82k60J5J42K97L12J48Lm49k01m04P5M62K23J13J15k02j05
$$ -34 383 652 585 190 -92 -352 -337 -195 102 414 562 565 116 -85 -489 -414 48 271 384 499 297 192
5756A92k67l62J25K62J99L07M6o5l34k38l15P6J43L81L02K34j66n44j59q0k08
$$ 192 -75 -437 -312 -50 149 456 502 437 103 -135 -450 -374 -231 150 452 686 520 -24 -183 -263 -471
5777d71J84K85N28j65J90m18k72k05r3K30K91K74K17N3n19m07J33m00L81K63J88
$$ -471 -287 -2 526 361 551 133 -139 -344 -437 -207 84 358 575 628 109 -298 -165 -565 -184 79 267
5798B67K47K2q8m60k92J02K2K51L08N1Q0l38k07l37R7O4L51J83L31lo26l36m1
$$ 267 514 536 448 -12 -304 -202 -180 71 379 430 510 172 -35 -372 -275 -211 140 323 654 651 25 -311 -352
5821c52o2K93J52M98o5Lk45l89l08N2J35M32J33L95j7n78j78l46K20nL91K93K28
$$ -352 -414 -121 31 529 464 467 222 -167 -475 -423 -288 144 277 672 655 77 -101 -447 -227 -232 159 452 680
5844F80k72j05k60m41OJ74L99L51J15qm19m43k74P4J42L33M04K86k61j57k59k82
$$ 680 408 303 43 -398 -392 -218 181 532 647 639 220 -223 -497 -423 -281 52 456 742 481 324 65 -217
5866b17l48N54J45L38O3j47j74l34j17k06J59K46M01K05l2k35l59m02n5M23J50
$$ -217 -565 -11 134 472 535 388 214 -120 -237 -443 -284 -38 363 568 536 301 -58 -460 -515 -92 58
5887E8K07M14k04j57k21m48r2J21L52M66K27j56m72j33l29m5J40L40O2L47M9o6
$$ 58 265 679 475 318 97 -351 -443 -322 30 496 723 567 95 -38 -367 -412 -272 68 130 477 526 460
5909D60n69m17lL74K07J73K91N9l35k41m92J28kL19M36K31q2k86l17l33M6J20
$$ 460 -109 -526 -529 -155 52 225 516 575 240 -1 -493 -365 -367 -48 388 619 537 251 -66 -399 -353 -233
5931b33K53L10J11o3N4m38l08l02K66K21L89M32N5m71l84j14j57J4L93L33K37
$$ -233 20 330 441 378 432 -6 -314 -616 -350 -129 260 692 747 276 -108 -222 -379 -365 28 361 598
5952E98j7j40n49l22m2K22K09L46K62pl63k13k50m0q8M82J94J37J95j85k68m66
$$ 598 581 441 -108 -430 -472 -250 -41 305 567 560 197 -16 -266 -306 -394 88 282 419 614 429 161 -305
5974c05k43J86K70L34J50J69l09k67j40l47JL96M57K76q8k11m79k31J29j2R6L53
$$ -305 -548 -362 -92 242 392 561 252 -15 -155 -502 -501 -105 352 628 540 329 -150 -381 -252 -264 -168 185
5996A85J04M49l13l57m83j00J54L86J39J71R5j11m13L7m03K36R3J89N65q3j68
$$ 185 289 738 425 68 -415 -515 -361 25 164 335 430 319 -94 -57 -460 -224 -131 58 623 540 372
6017C72l61l02l26K45M84K05J11K4j66k93k31q7j76N63R2M43j28j55k59k80j88
$$ 372 11 -291 -617 -372 112 317 428 452 286 -7 -238 -325 -501 62 154 597 469 314 55 -225 -413
6038d13ML30L26K33J58k28m57j47l31K65L31M3L84Q2j07m29l55Jj19L08K31M68
$$ -413 -409 -79 247 480 638 410 -47 -194 -525 -260 71 114 498 580 473 44 -311 -310 -429 -121 110 578
6060E78p1j15k76m02K5M8j22O94j14K51k13j64k92j95q5J56M22L06K13j81n45
$$ 578 507 392 116 -286 -261 -213 -335 359 245 496 283 119 -173 -368 -453 -297 125 431 644 463 -82
6081h2j95k83M0L96L55K37O8j90j48k81l15J43Q4M32L14p0j86k67o4k83j49L45
$$ -82 -277 -560 -520 -124 231 468 536 346 198 -83 -398 -255 -171 261 575 505 319 52 -12 -295 -444 -99
6103i9J80N71k07M3k07m99j85J28K84K28L90J01l11l41l16l4j13J91N18P3J98
$$ -99 81 652 445 488 281 -218 -403 -275 9 237 627 728 417 76 -240 -274 -387 -196 322 395 593
6124E93j60m28l69j47Q8L03J56L25K21k58l00j91j53o6J30N05K18J40j25k86n77
$$ 593 433 5 -364 -511 -423 -120 36 361 582 324 24 -167 -320 -386 -256 249 467 607 482 196 -381
6145c81l3J35J46K96K08J24k77N7n31j72P0J87M34K61M0j68j82m76k63J28K92
$$ -381 -414 -279 -133 163 371 495 218 275 -256 -428 -358 -171 263 524 564 396 214 -262 -525 -397 -105
6166a05K91J90K41k25m66j46k05N0J11N44L6K97q4m35l28p0q1J87L38M03J77l10
$$ -105 186 376 617 392 -74 -220 -425 -375 -264 280 316 613 529 94 -234 -304 -385 -198 140 543 720 410
6188D10k90k83j20n5J08M80Q1L08j26l04l76k17L3K34L67J60Q1pj98m92j14n2
$$ 410 120 -163 -283 -338 -230 250 331 639 513 209 -167 -384 -351 -117 250 410 491 484 286 -206 -320 -372
6210c72J45L22K72K83k19m09j15j91N8J24K27K83J77p9k57n47J05j63J05L33K48
$$ -372 -227 95 367 650 431 22 -93 -284 -226 -102 125 408 585 506 249 -298 -193 -356 -251 82 330
6231C30L42k39j90l09l49p4K85K97L48P4J01n24k85k56O3K30L61K35K47j99k42
$$ 330 672 433 243 -66 -415 -489 -204 93 441 515 616 92 -193 -449 -386 -156 205 440 687 488 246
6252B46l72j90j05K37L66M23j25J8l07l52k71l2K87M03K59O3o5l05l98k6j70K44
$$ 246 -126 -316 -421 -184 182 605 480 498 191 -161 -432 -464 -177 226 485 548 483 178 -220 -246 -416 -172
6274a72K86L38J32k18Qn62r2j23K72L65J98J98k26k22l11l46J32J68M52J49N5
$$ -172 114 452 584 366 374 -188 -280 -403 -131 234 432 630 404 182 -129 -475 -343 -175 277 426 481
6295D81P4j73n62n7l4o8L96K94P6J4j17n83j02q8J50L08L03K15j31j17m86j56
$$ 481 555 382 -180 -237 -271 -339 57 351 427 441 324 -259 -361 -449 -299 9 312 527 396 279 -207 -363
6317c63k07L86L62N4L55j09k94k49k66j76K65M73J04J64j04j58l36k32j82L79
$$ -363 -570 -184 178 232 587 478 184 -65 -331 -507 -242 231 335 499 395 237 -99 -331 -513 -134
6337a34K56K14K10q9j60l18k42r8K10K97K62J59q4j52l35l69J1J43K87J99L54
$$ -134 122 336 546 457 297 -21 -263 -361 -151 146 408 567 483 331 -4 -373 -362 -219 68 267 621
6358F21K0k94l52k69j07K02J74M69J99M5m67l64k44m0J14L81L22n5J68k85j85
$$ 621 641 347 -5 -274 -381 -179 -5 464 663 708 241 -123 -367 -407 -293 88 410 355 523 238 53
6379E3m31j19J07L85M05J45p8k38r6m55K5J02NM75M01r6k39l65m18p0N1L24O35
$$ 53 -378 -497 -390 -5 400 545 467 229 133 -322 -297 -195 -190 285 686 590 351 -14 -432 -502 -451 -127 508
6402E08J8r8j55l31k76l7J61K22M95P0j32j15l84l44J24j0L18K88K74q7k66l69
$$ 508 526 428 273 -58 -334 -371 -210 12 507 577 445 330 -54 -398 -274 -284 34 322 596 509 243 -126
6424a26j80k55K63J46N34J52L7k35m30j54q1K54N9K84M26k05j8n98j75k27J73
$$ -126 -306 -561 -298 -152 382 534 571 336 -94 -248 -329 -75 -16 268 694 489 471 -127 -302 -529 -356
6445c56M06L83J77r7k26k82k59j82K44K0M92K84j0k54l36l24k19K26N32J90J42
$$ -356 50 433 610 513 287 5 -254 -436 -192 -172 320 604 594 340 4 -320 -539 -313 219 409 551
6466E51n8q5l60l90j00J62K86K93K51P5k80l79k62n7J29L25L17n5J19J3n49k64
$$ 551 493 408 48 -342 -442 -280 6 299 550 625 345 -34 -296 -353 -224 101 418 363 482 495 -54 -318
6488c18j73M06K63K31K52q6l62j55k23k98J89K29L02L08L1k30m09l62l4K35P1
$$ -318 -491 -85 178 409 661 575 213 58 -165 -463 -274 -45 257 565 596 366 -43 -405 -439 -204 -133
6509a33N95M4o1K6l73k90j17k1K79L89L01n8l03k12n10J58p0L55J12M03lj18l08
$$ -133 462 506 445 471 98 -192 -309 -330 -51 338 639 581 278 66 -444 -286 -356 -1 111 514 511 393 85
6532H5m11o0J0K05O08lK26l19l39j15k72J97O4L87L00j77k1k94l46k15l1M06K80
$$ 85 -326 -386 -376 -171 437 434 660 341 2 -113 -385 -188 -124 263 563 386 365 71 -275 -490 -521 -115 165
6555A65L38J49l91k50j57l03n6L87L02M53q3j69k51m32k61K39J15N45j8K41j53
$$ 165 503 652 261 11 -146 -449 -505 -118 184 637 554 385 134 -298 -559 -320 -205 340 322 563 410
6576D10l50k53j70J42R9N03J06kj11l01m47n7J07J82K85L77J32j60m41l83p2l5
$$ 410 60 -193 -363 -221 -122 381 487 485 374 73 -374 -431 -324 -142 143 520 652 492 51 -332 -404 -439
6598d39L82L59K57J3j63k20n23R3qkL80L33J49j29m99q9j62j31M51j8L62J23R2
$$ -439 -57 302 559 572 409 189 -334 -241 -249 -251 129 462 611 482 -17 -106 -268 -399 52 34 396 519 611
6621F11n86k71j79m3M88L74L23M3m25l27k96np2L69J36K31J84m9m71l29j8j82
$$ 611 25 -246 -425 -468 20 394 717 760 335 8 -288 -293 -365 4 140 371 555 506 35 -294 -312 -494
6643d94M05K91J64K06k02k09k51l16p5J10M64M66N7j8o00k09n9rQ7M61J34J26
$$ -494 -89 202 366 572 370 161 -90 -406 -481 -371 93 559 616 598 -2 -211 -270 -279 -192 269 403 529
6665E29k18l01k75j28M4R7L42L30K45k82l36l06j89M5L75P0L74M5K8l71l18j27
$$ 529 311 10 -265 -393 -349 -252 90 420 665 383 47 -259 -448 -403 -28 42 416 461 489 118 -200 -327
6687c27k09K80M41K93j60m0j75k13k94j76M40K61L09J02k3l67n90J53k52K22L70
$$ -327 -536 -256 185 478 318 278 103 -110 -404 -580 -140 121 430 532 509 142 -448 -295 -547 -325 45
6708D5N11N9p6m23l82k46J98N9L30M82k39R0k96l83k70K9L03L19K56J43ol02m43
$$ 45 556 615 539 116 -266 -512 -314 -255 75 557 318 408 112 -271 -541 -512 -209 110 366 509 503 201 -242
6731b42l4j76J13N21M12L9k46k26l09l46R3K35L06K32N88m40k81m75r0j6O0L72
$$ -242 -276 -452 -339 182 594 633 387 161 -148 -494 -401 -166 140 372 960 520 239 -236 -326 -342 -282 90
6753I0K40L48l13j49m01j44m7J64L72M12j23J90n79k15l08N5K32L21J88K89j25
$$ 90 330 678 365 216 -185 -329 -376 -212 160 572 449 639 60 -155 -463 -408 -176 145 333 622 497
6774D97l50k97k72r1J62K34O39K01k20k81l28m24J85J07M22L61J9O8m62l30l76
$$ 497 147 -150 -422 -513 -351 -117 522 723 503 222 -106 -530 -345 -238 184 545 564 632 170 -160 -536
6795e36J37J14L56L08K16n3l80k61k82%J19M96L24k04J54k45l06n16J55J67L08
$$ -536 -399 -285 71 379 595 542 162 -99 -381 -381 -262 234 558 354 508 263 -43 -559 -404 -237 71
6816G1L73J24J6k35l83m25J88R8L02J99J70R6l50k57l52j01J59L14N44M2r1k20
$$ 71 444 568 584 349 -34 -459 -271 -173 129 328 498 594 244 -13 -365 -466 -307 7 551 593 502 282
6838B82j44n75j10L39J88M86K57j11m31l21l25j05K07M16M90K00o8l98l47k67
$$ 282 138 -437 -547 -208 -20 466 723 612 181 -140 -465 -570 -363 53 543 743 675 277 -70 -337
6858c37k08J14M53M11K37j37j75l70m67K0m9N04L50K52j32j74k68k92j42J56K90
$$ -337 -545 -431 22 433 670 533 358 -12 -479 -459 -508 -4 346 598 466 292 24 -268 -410 -254 36
6879C6J90L32N3k98l59m52NJ2L25M89L31K0m38k46l53j97J93K64L37L39j6q8m94
$$ 36 226 558 611 313 -46 -498 -493 -481 -156 333 664 684 246 0 -353 -550 -357 -93 244 583 567 479 -15
6902a5k33l75J48M27M01J88j22k8k97m65m4M3K74M71J65Q0l60l42j88j07m7L82
$$ -15 -248 -623 -475 -48 353 541 419 391 94 -371 -415 -372 -98 373 538 618 258 -84 -272 -379 -426 -44
6924d4M21J59P2k96l87l38k02K68L07M26J43J50k56l75m86l5q7M44N54K58k7k23
$$ -44 377 536 608 312 -75 -413 -615 -347 -40 386 529 679 423 48 -438 -473 -560 -116 438 696 669 446
6946D46m83l74r1k4O47L29L2J63k78j85l85l84O7M05M47K55Qj63l25m13j40KN19
$$ 446 -37 -411 -502 -526 121 450 482 645 367 182 -203 -587 -520 -115 332 587 595 432 107 -306 -446 -444 75
6969G5K70J12J37q5n33l54j51J5M54L81L22m6k72k08n50j9j25M55L75L13K12k97
$$ 75 345 457 594 509 -24 -378 -529 -514 -60 321 643 597 325 117 -433 -452 -577 -122 253 566 778 481
6991D81l61l65l40N9L21O39j01K06k7m20m04j35jK65M31K28K03k87m77k40j14
$$ 481 120 -245 -585 -526 -205 434 333 539 512 92 -312 -447 -448 -183 248 476 679 392 -85 -325 -439
7012d39N5K19L87L43J93j44n14k95k87l5L52N15M66l57j9m46q0l65n7L47K54M19
$$ -439 -384 -165 222 565 758 614 100 -195 -482 -517 -165 350 816 459 440 -6 -86 -451 -508 -161 93 512
7034E12Q7j49m11l80k69L46K43J24M68M2j72k42n50j00P3J17M49N60k8j66l92
$$ 512 599 450 39 -341 -610 -264 -21 103 571 613 441 199 -351 -451 -378 -261 188 748 720 554 162
7055A62m15l07L65K9K95L52J57po02l16q7j24M29L42J35J27j07m29l07r7J38l7
$$ 162 -253 -560 -195 -166 129 481 638 631 29 -287 -374 -498 -69 273 408 535 428 -1 -308 -405 -267 -304
7077c04M50M91Q8l05l48k48k58p3L95L22K06K57j59n51p7k58n1J95N46K21k9m0
$$ -304 146 637 725 420 72 -176 -434 -507 -112 210 416 673 514 -37 -114 -372 -423 -228 318 539 510 470
7099D70l08m93k19J95J43L45K22L80j40l78m67j79j85L21N26L50J91j43m43m41
$$ 470 162 -331 -550 -355 -212 133 355 735 595 217 -250 -429 -614 -293 233 583 774 631 188 -253
7119b53k98r2K81O03M59N5j18m06n25k00J24J47L65M02J5j98k7m95n06O4N25K91
$$ -253 -551 -643 -362 241 700 755 637 231 -294 -494 -370 -223 142 544 559 361 334 -161 -667 -603 -78 213
7141B13L85Kj07k44o47k16J9N50J37O35p6J1l08o50j94J14J75L80K39M40j77n88
$$ 213 598 600 493 249 -398 -614 -595 -45 92 727 651 662 354 -296 -490 -376 -201 179 418 858 681 93
7163I3j02o26J35J45O22K34K61j78m24l73l15M2L16L77L83J50k41k35m40j49k57
$$ 93 -9 -635 -500 -355 267 501 762 584 160 -213 -528 -486 -170 207 590 740 499 264 -176 -325 -582
7184e82L53L99K14L33j17n13k59l46l1K64L33O16L5k75l30k46n13K15J56N07J57
$$ -582 -229 170 384 717 600 87 -172 -518 -549 -285 48 664 699 424 94 -152 -665 -450 -294 213 370
7205C70L24k46l00n02j54Q1J44M38M16J17j19m02k70m49j92N03M05L93J29k2m10
$$ 370 694 448 148 -354 -508 -427 -283 155 571 688 569 167 -103 -552 -744 -241 164 557 686 664 254
7226B54n01j80k12K36L54N01K07k9l64m93k11j96M55K42M56J76K9n09k46n01M0
$$ 254 -247 -427 -639 -403 -49 452 659 630 266 -227 -438 -634 -179 63 519 695 724 215 -31 -532 -492
7247d92J76L29N23K58m3m73m40l84O3O9N63L87Q8q8k10m60l27j66L85N28K90J87
$$ -492 -316 13 536 794 751 278 -162 -546 -483 -414 149 536 624 536 326 -134 -461 -627 -242 286 576 763
7269G63o8m40n34j56k99L66L83K68M60j66k82m54k68j46J30O78L65J29j47k80
$$ 763 695 255 -279 -435 -734 -368 15 283 743 577 295 -159 -427 -573 -443 235 600 729 582 302
7289C02m29m00l9J44M88K30M09p1k54m95n14O7K96K59L76M75k64k94n16j98r7
$$ 302 -127 -527 -566 -422 66 296 705 634 380 -115 -629 -562 -266 -7 369 844 580 286 -230 -428 -525
7310e25L58M12J72K08Mm13l70l59m3J20M72L49J37P8k73n03k03k37L54K33M42
$$ -525 -167 245 417 625 629 216 -154 -513 -556 -436 36 385 522 600 327 -176 -379 -616 -262 -29 413
7331D13K60J6m59k58o24J72L56J61L29L93j91j34n30l48j02K87L04L23M00k11
$$ 413 673 689 230 -28 -652 -480 -124 37 366 759 568 434 -96 -444 -546 -259 45 368 768 557
7351E57k41m47k34k34J00O18M24K71k5m53m64m67M4J82L86L34K90o2l12m22l04
$$ 557 316 -131 -365 -599 -499 119 543 814 789 336 -128 -595 -551 -369 17 351 641 579 267 -155 -459
7372d59n6k4P08L34J07N7j63n28m26o8l1N65M57K56k00j38n37j73l34K57N30M17
$$ -459 -515 -539 169 503 610 667 504 -24 -450 -518 -549 16 473 729 529 391 -146 -319 -653 -396 134 551
7394E51K13rm06m31l51k25K90L44L40K81J27l82l58m01j27K51K13N90J75M5k74
$$ 551 764 755 349 -82 -433 -658 -368 -24 316 597 724 342 -16 -417 -544 -293 -80 510 685 730 456
7415D56n15m59O5J8O49J6L97J97m80m19m97P6K15K40N22J51R1l32n44k94M5K1
$$ 456 -59 -518 -453 -435 214 230 627 824 344 -75 -572 -496 -281 -41 481 632 723 391 -153 -447 -402 -381
7437c81K68M50K26J88l65l62l24l79K62L28M26M39k50k57m06l03m6p2M45O22P3
$$ -381 -113 337 563 751 386 24 -300 -679 -417 -89 337 776 526 269 -137 -440 -486 -558 -113 509 582
7458E82J26l46m07m38n9J49M43L00K59J03k32m24n35k44J38M31O55J22N3p4o83
$$ 582 708 362 -45 -483 -542 -393 50 350 609 712 480 56 -479 -723 -585 -154 501 623 676 602 -81
7479h1m12j80L12M79L20J83J02l75m29l37o1J26M26L55K26J1j21n94l54k20Q5
$$ -81 -493 -673 -361 118 438 621 723 348 -81 -418 -479 -353 73 428 654 665 544 -50 -404 -624 -539
7500e39M48M72L05m5l29m33k90j78J75M59J61N29l1l98l70l06j33J70R8N53M71
$$ -539 -91 381 686 641 312 -121 -411 -589 -414 45 206 735 704 306 -64 -370 -503 -333 -235 318 789
7521G89j89k54m37l33j72R8L03O95J97j23kp15k54l38J81M02M48L40K2o4o78k74
$$ 789 600 346 -91 -424 -596 -498 -195 500 697 574 572 -143 -397 -735 -554 -152 296 636 658 594 -84 -358
7543c58k87N8N87K82K35J56p1o19n32j83L48K36N82L23R1m77m46l70j86J23L39
$$ -358 -645 -587 0 282 517 673 602 -17 -549 -732 -384 -148 434 757 848 371 -75 -445 -631 -508 -169
7564a69M96L59K80m37n94l82l36M65J93N07L68Qj98m87o27r6P4M51N07K73J70
$$ -169 327 686 966 529 -65 -447 -783 -318 -125 382 750 758 560 73 -554 -650 -576 -125 382 655 825
7585H25k34m88l84l69N2M17L64O16J8l58l40m79k17J74J29O98K80J62m94j53p94
$$ 825 591 103 -281 -650 -598 -181 183 799 817 459 119 -360 -577 -403 -274 424 704 866 372 219 -575
7606e75L8L7L29L88L92J15l35l47m61K0q0L50M23L54J25k35o32k28l32Q8N02M56
$$ -575 -537 -500 -171 217 609 724 389 42 -419 -399 -479 -129 294 648 773 538 -94 -322 -654 -566 -64 392
7628C92M25p9k28n17k07m13K17K37M33M78J35k14n96n29k24J72L15O39K93J20
$$ 392 817 738 510 -7 -214 -627 -410 -173 260 738 873 659 63 -466 -690 -518 -203 436 729 849
7648H49k59m72n76j62N0M47M06M20Q6l39l91m68k92K29L49N85K05R3l84l63m87
$$ 849 590 118 -458 -620 -570 -123 283 703 789 450 59 -409 -701 -472 -123 462 667 760 376 13 -474
7669d74r4N8K54M45M71r0Oo31l42l41L07K10N36K99P4k39k63n17l28K08J44P30
$$ -474 -568 -510 -256 189 660 570 576 -55 -397 -738 -431 -221 315 614 688 449 186 -331 -659 -451 -307 423
7691D23L39P2l23l51m93k36R7L30K26P50q0k75n03k32n56L06L81M23L31J91l03
$$ 423 762 834 511 160 -333 -569 -472 -142 84 834 754 479 -24 -256 -812 -506 -125 298 629 820 517
7712E17m64m05l65O0N40M52L95J52l81o11k87j49j29M49M20M65M9j67l91m17m09
$$ 517 53 -352 -717 -657 -117 335 730 882 501 -110 -397 -546 -675 -226 194 659 708 541 150 -267 -676
7733f76J35K84M03N71J91m63l00m32l24jL95M87K99J75j53n87m69j03qM00M15
$$ -676 -541 -257 146 717 908 445 145 -287 -611 -612 -217 270 569 744 591 4 -465 -568 -576 -176 239
7754B39L82P7j75m59m32k86J11M07M21K59K05l89k38n13k97J59N25L70L31J75
$$ 239 621 698 523 64 -368 -654 -543 -136 285 544 749 360 122 -391 -688 -529 -4 366 697 872
7774H72k62n88k74k76NK71N57K06M01k79m62m83l25J26J90N84N17M9k86m35n11
$$ 872 610 22 -252 -528 -523 -252 305 511 912 633 171 -312 -637 -511 -321 263 780 829 543 108 -403
7795d03l24J36L27M82N56j90K1n10l25l54R1K61O25K48J16q2l38o21l82K00K76
$$ -403 -727 -591 -264 218 774 584 605 95 -230 -584 -493 -232 393 641 757 675 337 -284 -666 -466 -190
7816a90M20M71J46k92m56n14k40L4N73K15L95K13k40k24n44k99R2P0N05M60J50
$$ -190 230 701 847 555 99 -415 -655 -621 -48 167 562 775 535 311 -233 -532 -440 -370 135 595 745
7837G45j08p69j31k69JK12M70M86Qj63k86m89m81K57K39O06M33k6j30l71n42l06
$$ 745 637 -132 -263 -532 -531 -319 151 637 645 482 196 -293 -774 -517 -278 328 761 735 605 234 -308 -614
7859f14R6O8O44M20J42k18n33k70m57R3M39M14M93q0p1l98n62k09p3M81M70L74
$$ -614 -518 -450 194 614 756 538 5 -265 -722 -629 -190 224 717 637 566 168 -394 -603 -676 -195 275 649
7881F49j3j68l66m51k70ON07K01M57L50k85m72n37j92o4L27N29M05J80k95k78
$$ 649 636 468 102 -349 -619 -613 -106 95 552 902 617 145 -392 -584 -648 -321 208 613 793 498 220
7902B20m99l43O7K43P76N8L80l61m24k95m08p8M09L90N47J62j74m41o21k38MM27
$$ 220 -279 -622 -555 -312 464 522 902 541 117 -178 -586 -664 -255 135 682 844 670 229 -392 -630 -626 -199
7924a99L29O20J80k74m67l89m32q7M63L92N06R7j49k60n33k47k12L74M87K89L21
$$ -199 130 750 930 656 189 -200 -632 -719 -256 136 642 739 590 330 -203 -450 -662 -288 199 488 809
7945H09j94l89m90l13m9J97O33K69M60l26m07l78m33p9L27N60M30J75o4o13k91
$$ 809 615 226 -264 -577 -626 -429 204 473 933 607 200 -178 -611 -690 -363 197 627 802 738 125 -166
7966a66m15j9K79N71L54K24k29m40m36k97j65L69O21L69K09k71l11n01l19J7N93
$$ -166 -581 -600 -321 250 604 828 599 159 -277 -574 -739 -370 251 620 829 558 247 -254 -573 -556 37
7987C7K5M94K73k30j48p35l41O1J05M82M59M11k54m80l47k87l2K83L20M90J51
$$ 37 62 556 829 599 451 -284 -625 -564 -459 23 482 893 639 159 -188 -475 -507 -224 96 586 737
8008G37j03l55n05k47k97M80M24N45J58k86k96n05l60J63M5L55Q82Q2l74l05n73
$$ 737 634 279 -226 -473 -770 -290 134 679 837 551 255 -250 -610 -447 -402 -47 835 917 543 238 -335
8029c35j83o4K17N52L68J90on07l89l38l56M48O28J69L89k03l49l06n21O1K48
$$ -335 -518 -582 -365 187 555 745 739 232 -157 -495 -851 -403 225 394 783 580 231 -75 -596 -535 -287
8050b87L02O68R7j54l47n12k69j18M04L01O14M6j55k82m97m60J47L10N26L48M31
$$ -287 15 683 780 626 279 -233 -502 -620 -216 85 699 745 590 308 -189 -649 -502 -192 334 682 1113
8071A113n47k18o38k49q1L77J46P30J35r8l39m60l26j45M87K36M13L49j54n70
$$ 1113 566 348 -290 -539 -620 -243 -97 633 768 670 331 -129 -455 -600 -113 123 536 885 731 161
8091A61m07k74j54L06M68N42L58m41l20n13k04k15L23M35N83J92kp43m49j70k03
$$ 161 -246 -520 -674 -368 100 642 1000 559 239 -274 -478 -693 -370 65 648 840 838 95 -354 -524 -727
8112g27N12K03N80J44q9l40n24l69J77J66L01M68M19l27l91m26n21J31L68L76
$$ -727 -215 -12 568 712 623 283 -241 -610 -433 -267 34 502 921 594 203 -223 -744 -613 -245 131
8132A31N71K20l64j69o54m58J12J38M78N10L27l23j11n34l38j47M08L02M25J83
$$ 131 702 922 558 389 -265 -723 -611 -473 5 515 842 519 408 -126 -464 -611 -203 99 524 707
8152G07j63k77n51k91j07K88N82L45L89l29k90n54j34q3P6N90M66Q4k9m30n50
$$ 707 544 267 -284 -575 -682 -394 188 533 922 593 303 -251 -385 -468 -392 198 664 748 719 289 -261
8173b61m16J2K79M58O02J64k13k69n70m16M9L70K26M44L21nn20l08
$$ -261 -677 -665 -386 72 674 838 625 356 -214 -630 -581 -211 15 459 780 775 255 -53
8191e3
$$ Imaginary data points
##PAGE= N=2
##DATA TABLE= (X++(I..I)), XYDATA
0@%%%%%%%%%%%rJ8j8J8j8K7l6M5o1P0q1R7j15J37j56J80k11K42k78L16l60M11
$$ 0 0 0 0 0 0 0 0 0 0 0 0 -9 9 -9 9 -9 18 -18 27 -34 36 -45 52 -63 74 -82 98 -113 129 -149 167 -193 218
33B18m63N23n89O61p43Q28r24J031j142J266j402J549j709J885k083K293k526
$$ 218 -245 278 -311 350 -393 435 -489 542 -600 666 -736 813 -896 989 -1094 1199 -1327
50a327K786l064L380l730M121m568N072n657O335p133Q101r290J0801j2785J5514
$$ -1327 1459 -1605 1775 -1955 2166 -2402 2670 -2987 3348 -3785 4316 -4974 5827 -6958 8556
65H556j9532K6032l8304O9453k97800p15322K15333L83004L17839M56633M58488
$$ 8556 -10976 15056 -23248 46205 -251595 -966917 -751584 -368580 -50741 405892 864380
76H64380j39945n33933m39569k97982k40447J64965N87852N55409K45477j6097
$$ 864380 724435 190502 -249067 -547049 -787496 -622531 -34679 520730 766207 750110
86G50110m06400o91483m22752J05724K58760K80704M91606M49112r6045m90191
$$ 750110 343710 -347773 -770525 -664801 -406041 -125337 366269 815381 719336 229145
96B29145m23200l14361k54165J24243N95640N88913J76478j59480l32191m28980
$$ 229145 -194055 -508416 -762581 -638338 -42698 546215 722693 563213 231022 -197958
106a97958l56750r8559J78578L94977M76797K95430o5242l40443m50029m21515
$$ -197958 -554708 -653267 -474689 -79712 397085 692515 627273 286830 -163199 -584714
116e84714j67444K60734N19541M18160J57022o5189k63535m10271l75835j45165
$$ -584714 -752158 -491424 28117 446277 603299 538110 274575 -135696 -511531 -656696
126f56696J69837M22476M53734K41017m3707k87666m66461m21052p0844K83295
$$ -656696 -486859 -64383 389351 630368 586661 298995 -167466 -588518 -659362 -376067
136c76067L59673L03435K58254N7327k94081m59211l26541j11453J15408L77383
$$ -376067 -16394 287041 545295 602622 308541 -150670 -477211 -588664 -473256 -95873
146i5873M63855K29614q9768k77177l72301l39102q3545K04152L02816L09982
$$ -95873 367982 597596 507828 230651 -141650 -480752 -564297 -360145 -57329 252653
156B52653K83563N0951l13567m44581k89103r3867J10407L64862M37283J92815
$$ 252653 536216 587167 273600 -170981 -460084 -553951 -443544 -78682 358601 551416
166E51416r6668k28444l09051l32332j39010J60186L18479L33699K63004K3809
$$ 551416 454748 226304 -82747 -415079 -554089 -393903 -75424 258275 521279 545088
176E45088k92950m07066k76019q4056J19010L23675L65802J85522l2782j84985
$$ 545088 252138 -154928 -430947 -515003 -395993 -72318 293484 479006 446224 261239
186B61239l15893l37766j36886J45436L03228L30553K41053o238k75453l46599
$$ 261239 -54654 -392420 -529306 -383870 -80642 249911 490964 484726 209273 -137326
196a37326k37220q7750R6451K91092L35923J90123o826j84142l31359l28257j12439
$$ -137326 -374546 -462296 -365845 -74753 261170 451293 444467 260325 -71034 -399291 -511730
207e11730J49385K91004L16203K19666j6888k42775k97305k33349j26553O9909
$$ -511730 -362345 -71341 244862 464528 447640 204865 -92440 -325789 -452342 -382433
217c82433K91027L35912J87666p06j76717l25206l12475r2436J47477K58874K75398
$$ -382433 -91406 244506 432172 431466 254749 -70457 -382932 -475368 -327891 -69017 206381
228B06381K06756J3118k01434k85860k46857j32696P1625K80553L18264J78270
$$ 206381 413137 426255 224821 -61039 -307896 -440592 -368967 -88414 229850 408120
238D08120n141j76366l03778k75042p6256J25749K27760K63669K12028K2753j98120
$$ 408120 402979 226613 -77165 -352207 -428463 -302714 -74954 188715 400743 423496 225376
249B25376k93461k49753j17890Q3007K67907L01732J77416l383j70731k77336
$$ 225376 -68085 -317838 -435728 -352721 -84814 216918 394334 390951 220220 -57116
259e7116k52071r6159Q6940K19446K76890K11638J6205j88319k77178k41744j12017
$$ -57116 -309187 -405346 -318406 -98960 177930 389568 405773 217454 -59724 -301468 -413485
270d13485Q4514K48519K72860J68531J2514j50080k62671k46495j05099P4646
$$ -413485 -328971 -80452 192408 360939 373453 223373 -39298 -285793 -390892 -316246
280c16246K17848K73802J94794O713j74491k57830k30380j04424Q1929K29485
$$ -316246 -98398 175404 370198 376911 202420 -55410 -285790 -390214 -308285 -78800
290g8800K56338J71631K3923j47310k65051k45956j02736P3520K13405K67010
$$ -78800 177538 349169 373092 225782 -39269 -285225 -387961 -314441 -101036 165974
300A65974J89130J0594j59288k41017k24844j12330O5084K12777K50008J76752
$$ 165974 355104 365698 206410 -34607 -259451 -371781 -306697 -93920 156088 332840
310C32840K8821j42929k53255k32474j00342O6576K02728K51272J77008J6513
$$ 332840 361661 218732 -34523 -266997 -367339 -300763 -98035 153237 330245 346758
320C46758j39967k28153k22246j13622N9693K02675K40229J71909K9141j38414
$$ 346758 206791 -21362 -243608 -357230 -297537 -94862 145367 317276 346417 208003
330B08003k42270k19210r5108O0265J90768K42937J75019K1046j32661k24639
$$ 208003 -34267 -253477 -348585 -288320 -97552 145385 320404 341450 208789 -15850
340a5850k22660j14163N6435J94718K34588J71599L2662j28888k27454k10087
$$ -15850 -238510 -352673 -296238 -101520 133068 304667 337329 208441 -19013 -229100
350b29100r9665M5787J76718K34623J73707K3931j25174k11627k11507j13402
$$ -229100 -328765 -282978 -106260 128363 302070 326001 200827 -10800 -222307 -335709
360c35709N0241J88356K24819J59453L1219j13832k12903k08205j03193M5514
$$ -335709 -285468 -97112 127707 287160 318379 204547 -8356 -216561 -319754 -274240
370b74240J72059K21483J65554L0318j17429k08995k05230j04771M8405J75977
$$ -274240 -102181 119302 284856 315174 197745 -11250 -216480 -321251 -272846 -96869
380i6869K15804J58943L5660j07125k07513k07765j05743M2349J63953K11989
$$ -96869 118935 277878 313538 206413 -1100 -208865 -314608 -272259 -108306 103683
390A03683J65678M0085j08564k03099j96133r9198L6065J54341K07210J63682
$$ 103683 269361 309446 200882 -2217 -198350 -297548 -261483 -107142 100068 263750
400B63750L7951j05849j95204j93525j05714L3271J59320K08560J56380L4569
$$ 263750 301701 195852 648 -192877 -298591 -265320 -106000 102560 258940 293509
410B93509r9957j88891j90723j02072L1825J49099K00980J60037L9408j01823
$$ 293509 193552 4661 -186062 -288134 -256309 -107210 93770 253807 293215 191392
420A91392j89911j88404j01825L1942J52729K01146J52198L6991r1793j81801
$$ 191392 1481 -186923 -288748 -256806 -104077 97069 249267 286258 194465 12664
430A2664j90174j06314K7677J45570J95371J57478M2789r5220j83686j79885r5112
$$ 12664 -177510 -283824 -256147 -110577 84794 242272 285061 189841 6155 -173730 -268842
441b68842K5686J35622J90035J54975M0290r3140j75166j75894j04031J7786J43580
$$ -268842 -243156 -107534 82501 237476 277766 184626 9460 -166434 -270465 -252679 -109099
452a09099K00322J47892K7229q8219j60996j76068j08219K2368J40697J84563
$$ -109099 91223 239115 266344 178125 17129 -158939 -267158 -244790 -104093 80470
462H0470J45429M3088q2939j71880j78029j02347K0816J41314J91536J37676K8000
$$ 80470 225899 268987 186048 14168 -163861 -266208 -245392 -104078 87458 225134 253134
473B53134p0118j47339j86378j23278L0819J48573J64456J29594O4375o3108j85358
$$ 253134 183016 35677 -150701 -273979 -243160 -94587 69869 199463 263838 200730 15372
484A5372j85410p6502L2316J07437J63524J55085N0247q1543j59039j69955j06820
$$ 15372 -170038 -246540 -214224 -106787 56737 211822 262069 180526 21487 -148468 -255288
495b55288K1564J34364J64858J34910O1412o9679j84163j69667o3096J7892Q0099
$$ -255288 -233724 -99360 65498 200408 261820 192141 7978 -161689 -224785 -206893 -126794
506a26794J67525J82732M8020j10067j54435j33660j04895j3258J30050J93846
$$ -126794 40731 223463 271483 161416 6981 -126679 -231574 -244832 -114782 79064
516G9064J30281K5492o3733j37974j62699j03225M974J08040J74161J55437L7613
$$ 79064 209345 234837 171104 33130 -129569 -232794 -227820 -119780 54381 209818 247431
527B47431q8704j37866j37370j11438j0053J35031J84222J08338K0983l7437j18458
$$ 247431 158727 20861 -116509 -227947 -238000 -102969 81253 189591 210574 173137 54679
538E4679j83477j24845K8788J36679J48161J17279N6756n1680j53553j66094q7585
$$ 54679 -128798 -253643 -224855 -88176 59985 177264 234020 182340 28787 -137307 -224892
549b24892J8832J04386J46484J30557N7594m9878j46169j72055r9075K6454J15108
$$ -224892 -206060 -101674 44810 175367 232961 183083 36914 -135141 -234216 -207762 -92654
560i2654J38187J22169O5612m9984j57293j58737p1935J1460P3172J42263J62150
$$ -92654 45533 167702 233314 183330 26037 -132700 -204635 -193175 -120003 22260 184410
571A84410O3565q4967j50465j27606q2270j1381R6677J62190J27148L7006n1865
$$ 184410 247975 163008 12543 -115063 -197333 -208714 -112037 50153 177301 214307 162442
582A62442j23982j49458r7810J212R3547J51574J44648M7643p6694j32390j19982
$$ 162442 38460 -110998 -208808 -207596 -114049 37525 182173 229816 153122 20732 -99250
593i9250r1415k2529R7596J66427J18859L0054l6956j07851j61220j13802J4941
$$ -99250 -190665 -213194 -115598 50829 169688 199742 162786 54935 -106285 -220087 -205146
604b05146J11851J34603J15928N3702m9085j27301j33764q9805j2092Q8210J48911
$$ -205146 -93295 41308 157236 210938 161853 34552 -99212 -189017 -201109 -112899 36012
615C6012J22887M5139l8997j19273j54936r5953J7460R6736J21776J15019O0277
$$ 36012 158899 204038 165041 45768 -109168 -205121 -187661 -90925 30851 145870 206147
626B06147m3112j26135j35630q7911j0025Q3908J44849J26817M5916m7682j19636
$$ 206147 163035 36900 -98730 -186641 -196666 -112758 32091 158908 204824 157142 37506
637C7506j37419q5988K882Q0211J24633J22406N8169m2544j18194j33255r4013
$$ 37506 -99913 -185901 -183019 -102808 21825 144231 202400 159856 41662 -91593 -185606
648a85606r254Q9563J39827J14003M2648l8689j09493j32822q6909l852P3145
$$ -185606 -194860 -105297 34530 148533 191181 152492 42999 -89823 -176732 -180584 -107439
659a07439J23555J25311N8220m3981j15934j29366q8898n894Q4760J29088J07785
$$ -107439 16116 141427 199647 155666 39732 -89634 -178532 -184426 -99666 29422 137207
670A37207M7178l1254j06039j32958q8418o455P2033J25506J25496N3331m7230
$$ 137207 184385 153131 47092 -85866 -174284 -180739 -108706 16800 142296 195627 148397
681A48397j11263j19593q4239j1418P4654J23983J09766N0926k8827j02484j30142
$$ 148397 37134 -82459 -166698 -178116 -103462 20521 130287 181213 152386 49902 -80240
692h0240r0994q139P4945J24926J15084M6937l9980r9720j16509q7283j4128P1106
$$ -80240 -171234 -179373 -104428 20498 135582 182519 142539 42819 -73690 -160973 -175101 -103995
704a03995J19912J09264N3245k8122j02189j27589q6211n422P2553J16511J07428
$$ -103995 15917 125181 178426 150304 48115 -79474 -165685 -171107 -98554 17957 125385
715A25385M8416l0620r4847j18693q9171j3342O9293J16283J10073N3843l0136
$$ 125385 173801 143181 48334 -70359 -159530 -172872 -103579 12704 122777 176620 146484
726A46484j00919j20228q0726q542O3594J10343J07583N2245k6874r2510j17152
$$ 146484 45565 -74663 -155389 -163931 -100337 10006 117589 169834 142960 50450 -66702
737f6702q8033j4212O7402J13735J06046N0748k8635r3980j12812q0902j4357
$$ -66702 -154735 -168947 -101545 12190 118236 168984 140349 46369 -66443 -147345 -161702
748a61702O0102J08756J05779N2571k4301r0650j15676q4592j2426O4222J07544
$$ -161702 -101600 7156 112935 165506 141205 50555 -65121 -149713 -162139 -97917 9627
759I627J01397N0580k3435q8475j11205q2231j5727N7890J06219J04885N2694
$$ 9627 111024 161604 138169 49694 -61511 -143742 -159469 -101579 4640 109525 162219
770A62219k4046q9132j11353q0026j2169N7601J00848J00759N2767k2167q5407
$$ 162219 138173 49041 -62312 -142338 -154507 -96906 3942 104701 157468 135301 49894
781D9894j07155q0607j7834N5636J04471J01883M9358k3487q3089j05142p9298
$$ 49894 -57261 -137868 -155702 -100066 4405 106288 155646 132159 49070 -56072 -135370
792a35370j6183N4417R8964R8499N2497j9994q2485j04713p9305j7753N4441J00572
$$ -135370 -151553 -97136 1828 100327 152824 132830 50345 -54368 -133673 -151426 -96985 3587
804C587R6539M8055j8754p7102j03209q0366j7680N2287R6012R6109N2367j6776
$$ 3587 100126 148181 129427 52325 -50884 -131250 -148930 -96643 -631 95478 147845 131069
816A31069p9636j02893p6469j6814M9412R4015R4334N0879j6190p5705r9996p7746
$$ 131069 51433 -51460 -127929 -144743 -95331 -1316 93018 143897 127707 52002 -47994 -125740
828a25740j8277M8940R2842R4268N0787j6771p5280r7291p5775j9268M7051R1484
$$ -125740 -144017 -95077 -2235 92033 142820 126049 50769 -46522 -122297 -141565 -94514 -3030
840c030R2329N0385j4723p3280r7125p5605j8589M6383Q9897R1380M9090j5108
$$ -3030 89299 139684 124961 51681 -45444 -121049 -139638 -93255 -3358 88022 137112 122004
852A22004p0102r3915p6302k1090M6638Q9141Q8260M9256j0763o9978r6159p3768
$$ 122004 51902 -42013 -118315 -139405 -92767 -3626 84634 133890 123127 53149 -43010 -116778
864a16778j7553M3165Q4348Q9103N1175j3060o8891r1123p3584k1417M3143Q5924
$$ -116778 -134331 -91166 -6818 82285 133460 120400 51509 -39614 -113198 -134615 -91472 -5548
876e548Q5917M9032r457o6749r3038p1778j8667L9777Q1438Q7837N1029j2350
$$ -5548 80369 129401 119944 53195 -39843 -111621 -130288 -90511 -9073 78764 129793 117443
888A17443o6175q8036p2008k2071M1001Q2813Q3642M8507q261o3675q9633p0895
$$ 117443 51268 -36768 -108776 -130847 -89846 -7033 76609 125116 116855 53180 -36453 -107348
900a07348j9851L7801P9257Q5382M9588r757o2737q6411p1209k1115L9074P7573
$$ -107348 -127199 -89398 -10141 75241 124829 115072 52335 -34076 -105285 -126400 -87326 -9753
912i753Q0772N1050n814o4426q7231o5545k1004L1893P6676Q6982M8868j1918
$$ -9753 71019 122069 116255 51829 -35402 -100947 -121951 -90058 -13382 73600 122468 110550
924A10550n9660q1017o9689k4114L6540P6421P9724M9533n887o1103q2927o4517
$$ 110550 50890 -30127 -99816 -123930 -87390 -10969 68755 118288 112401 51298 -31629 -96146
936i6146k3780K8706P8046Q6978M3636j3830n2162p4286p3666k8656L9320P8128
$$ -96146 -119926 -91220 -13174 73804 117440 103610 51448 -22838 -96504 -125160 -85840 -7712
948g712P3357M4222J8n3813q4934o9332j9773L4363P2541P7151M4021n191n0288
$$ -7712 65645 109867 109885 56072 -28862 -98194 -117967 -83604 -11063 66088 110109 104918 54630
961E4630p8758p2844k2855L9599P0715O8422M8203M833n6203q8449o3827j2657
$$ 54630 -24128 -96972 -119827 -80228 -9513 58909 107112 111945 55742 -32707 -96534 -109191
973a09191L0879O1164P4717N3489k422n7716q0066o1065j9141K6963O4522P8066
$$ -109191 -78312 -17148 57569 111058 108636 50920 -29146 -90211 -109352 -82389 -17867 60199
985F0199N2205o343n9799p4544n5965k2079K1325O5167Q0384M9543p623n4748
$$ 60199 112404 106061 46262 -28282 -84247 -106326 -85001 -19834 60550 110093 102470 47722
997D7722p1448n9559k5369K2751O9067Q0868M3480j3381m8564o1267o2610l5761
$$ 47722 -23726 -83285 -108654 -85903 -16836 64032 107512 94131 45567 -15700 -78310 -114071
1009a14071K6426P6739P3241L5818j936m0499p4393o9468k0970L2506O3319O7936
$$ -114071 -87645 -10906 62335 98153 96217 55718 -18675 -88143 -109113 -76607 -13288 54648
1021E4648M3438k139m3343o7268o7499l0818L2609P2218O3028L6219P654l9609
$$ 54648 98086 95947 52604 -14664 -82163 -112981 -80372 -8154 54874 91093 98747 59138
1033E9138q2020o6598r761L0423M7678O4838N6346K958n3704p0904n6825k4123
$$ 59138 -22882 -89480 -99241 -68818 -21140 43698 100044 103002 49298 -21606 -78431 -102554
1045a02554K3882O4064O7004M0711K982m3623p3995n8348j4381J9976M8285P2502
$$ -102554 -78672 -14608 52396 93107 96089 52466 -21529 -79877 -94258 -74282 -25997 46505
1057D6505N7049n012n6021o2369n0881k8571J8648O4819O8857L7042p99l7546
$$ 46505 103554 98542 42521 -19848 -70729 -99300 -80652 -15833 53024 90066 89267 51721
1069E1721o5461o0852k3471K0352N6565P1423M6687o553m6124n8388n5324k9484
$$ 51721 -13740 -74592 -98063 -77711 -21146 50277 96964 90411 44287 -14101 -69425 -98909
1081i8909K1951O2051O1690L7557O466l5297o8997o2234k0920K3241N4725O6438
$$ -98909 -76958 -14907 46783 84340 90806 55509 -13488 -75722 -96642 -73401 -18676 47762
1093D7762M2525l810m0123n7327n7331k8096K2383N6783N9094M2660R290m0604
$$ 47762 90287 86477 46354 -10973 -68304 -96400 -74017 -17234 41860 84520 93810 53206
1105E3206p1051n5517j6582J9180N0204O4808M2477k884l6369n4718n8425l0288
$$ 53206 -17845 -73362 -89944 -70764 -20560 44248 86725 83841 47472 -7246 -65671 -95959
1117i5959K2056N6396N9046M2328P020m1483o6499n0758j7217J4668M7450O4297
$$ -95959 -73903 -17507 41539 83867 90887 49404 -17095 -67853 -85070 -70402 -22952 41345
1129D1345M2181k94l3663n5337o0600k8699K4395N5359N5012M0175P137l9147
$$ 41345 83526 83232 49569 -5768 -66368 -95067 -70672 -15313 39699 79874 87011 47864
1141D7864o2698m7640j9662J0293M5916O5156M3624J060l4389n6904n8352k4676
$$ 47864 -14834 -62474 -82136 -71843 -25927 39229 82853 83913 49524 -7380 -65732 -90408
1153i0408K3500M9955N2560M1032P997l7112n8312m7115k4361Q147M8453O6354
$$ -90408 -66908 -16953 35607 76639 84636 47524 -10788 -57903 -82264 -74117 -25664 40690
1165D0690M0816j496l2810n4042n5440k3524K0679M5842N0869M2662R417l5024
$$ 40690 81506 80010 47200 -6842 -62282 -85806 -65127 -19285 31584 74246 83663 48639
1177D8639n6642m8917k6283J0269N1143O2809L5123k90k8813n1785n4569k3251
$$ 48639 -8003 -56920 -83203 -72934 -21791 41018 76141 75851 47038 -4747 -59316 -82567
1189h2567J8223M2055N1240M5157J0330l6027n6980m7699k4705J1437M9306N7380
$$ -82567 -64344 -22289 28951 74108 84438 48411 -8569 -56268 -80973 -69536 -20230 37150
1201C7150L3331K994k4789n1099n4441k3272J5656M0378N3198M5561P062l7061
$$ 37150 70481 73475 48686 -2413 -56854 -80126 -64470 -24092 29106 74667 81729 44668
1213D4668n3264m4472k4380J0154M6372N4345L3606O226k2962n1686n4716k3095
$$ 44668 -8596 -53068 -77448 -67294 -20922 33423 67029 73255 50293 -1393 -56109 -79204
1225g9204J5367M0843N2924M2727M557l4813m8685m3204k5878Q652M4431N2492
$$ -79204 -63837 -22994 29930 72657 77214 42401 -6284 -49488 -75366 -66714 -22283 30209
1237C0209L5269Q835k3176n3504n3190k0801J5159L8484N0338M0803N134l0872
$$ 30209 65478 74313 51137 -2367 -55557 -76358 -61199 -22715 27623 68426 73560 42688
1249D2688m5825m3634k6840P859M2870N2193L5780Q466k5639n1910m9001j8980
$$ 42688 -3137 -46771 -73611 -65752 -22882 29311 65091 73557 47918 -3992 -52993 -71973
1261g1973J2420L5829M9429M0096N850k8345m3991m5187k7856Q793M3177N0772
$$ -71973 -59553 -23724 25705 65801 71651 43306 -685 -45872 -73728 -64935 -21758 29014
1273B9014L4339P567k5021m9249m5918k0030R523L4557M9412L9673O474k5726
$$ 29014 63353 70920 45899 -3350 -49268 -69298 -59775 -25218 24194 63867 70341 44615
1285D4615m3963m6178k6950J0612M1218M6840L3465R029k3397m7125m4265k0851
$$ 44615 652 -45526 -72476 -61864 -20646 26194 59659 68688 45291 -1834 -46099 -66950
1297f6950P369L3947M9643L8765N948k5340m3308m4771k5134J0461L8111M4497
$$ -66950 -59581 -25634 24009 62774 68722 43382 74 -44697 -69831 -59370 -21259 23238
1309B3238L3966J0830k2778m5651m3342k1985N775L4180M9790L7188M956k3675
$$ 23238 57204 68034 45256 -395 -43737 -65722 -59947 -25767 24023 61211 66167 42492
1321D2492m1113m3603k5167Q735L6035M3450L4743J1251k1185m4254m3095k2565
$$ 42492 1379 -42224 -67391 -58656 -22621 20829 55572 66823 45638 1384 -41711 -64276
1333f4276O075L3479M6964L4999O076k1356l9264m2916k4790P895L4117M3111
$$ -64276 -58201 -24722 22242 57241 63317 41961 2697 -40219 -65009 -57114 -22997 20114
1345B0114L4798J0894k1654m3438m1530k1992N842L2505M4876L4067P880j9683
$$ 20114 54912 65806 44152 714 -40816 -62808 -56966 -24461 20415 54482 62362 42679
1357D2679l8979m2374k4284O528L2719M2648L4981J0078k1109m1002m0193k2733
$$ 42679 3700 -38674 -62958 -56430 -23711 18937 53918 63996 42887 1885 -38308 -61041
1369f1041M888L1594M3329L3140R263j7659l8535m2509k3635P220L0514M0416
$$ -61041 -56153 -24559 18770 51910 61173 43514 4979 -37530 -61165 -53945 -23431 16985
1381A6985L4232J0402k0051l9359l8697k1680L812K9696M2176L3735R541j8367
$$ 16985 51217 61619 41568 2209 -36488 -58168 -54356 -24660 17516 51251 60792 42425
1393D2425l8366m0951k2277O214K8637L9701L4345J1219j9778l8235l6819k1682
$$ 42425 4059 -36892 -59169 -52955 -24318 15383 49728 60947 41169 2934 -33885 -55567
1405e5567J260K7627M3281L4530P785j8955l5162l7538k3927K512K9200M0462
$$ -55567 -54307 -26680 16601 51131 58916 39961 4799 -32739 -56666 -54154 -24954 15508
1417A5508L2417R316j6413l4489l7821k4074J928K9156M0715L1186P827j6230
$$ 15508 47925 57241 40828 6339 -31482 -55556 -53628 -24472 16243 47429 55256 39026
1429C9026l2428l7671k5595L523L0491L8638K8864J0246j2404l4373m1616k3718
$$ 39026 6598 -31073 -56668 -53145 -22654 15984 44848 55094 42690 8317 -33299 -57017
1441e7017O649K8182L4504L0491J3546j4085l6436l8156k0706L701K5144L6064
$$ -57017 -50368 -22186 12318 42809 56355 42270 5834 -32322 -53028 -49327 -24183 11881
1453A1881L1851J2430j4507l5629l8423k0424N103K3655L3324L2940J4979j6469
$$ 11881 43732 56162 41655 6026 -32397 -52821 -47718 -24063 9261 42201 57180 40711
1465D0711l7036l3639j7782l21K0462L8591L5290Q279j8801l0897l1850k2733
$$ 40711 3675 -29964 -47746 -48067 -27605 10986 46276 54555 35754 4857 -26993 -49726
1477d9726o22K5191L7769L0694J0260j4898l2004l3927k1831j053K3415L8966
$$ -49726 -50348 -25157 12612 43306 53566 38668 6664 -27263 -49094 -50147 -26732 12234
1489A2234L1610O989j5363k6415l2686k6726j023K8197L6494K5694R983q960k9766
$$ 12234 43844 50833 35470 9055 -23631 -50357 -51380 -23183 13311 39005 48988 40028 10262
1502A0262l8038k2915L720K4226L2394K8124J1797j0691k9413l4914k3352J734
$$ 10262 -27776 -50691 -46971 -22745 9649 37773 49570 38879 9466 -25448 -48800 -47066
1514d7066K4578L2654K6904J2389r564l1843l6466j9374L792K0543L0086L0585
$$ -47066 -22488 10166 37070 49459 39895 8052 -28414 -47788 -43996 -23453 6633 37218
1526C7218J4956j2582l2051l3058k0171m45K0229L3297L0309J1794j2636k8888
$$ 37218 52174 39592 7541 -25517 -45688 -46133 -25904 7393 37702 49496 36860 7972
1538G972l1164k0405j391J9074L2657L0480J2134j2394k8566l1745k0721j322
$$ 7972 -23192 -43597 -44988 -25914 6743 37223 49357 36963 8397 -23348 -44069 -45391
1550d5391K0278L2643K8602J0522j0943k6302l0213k2281k558K0730L3174K7951
$$ -45391 -25113 7530 36132 46654 35711 9409 -20804 -43085 -45643 -24913 8261 36212
1562C6212R980j0141k6933l1976k1184K11K0345K9991K7434J2872r408k6989l1434
$$ 36212 46192 36051 9118 -22858 -44042 -43831 -23486 6505 33939 46811 37403 10414 -21020
1575b1020k1710k275J9960L1868K7130J0275q808k4848l0868k1115q00J8174K8578
$$ -21020 -42730 -45005 -25045 6823 33953 44228 35420 10572 -20296 -41411 -42211 -24037 4541
1588D541K8212J3219r554k6903l0106k0426j875J8832L0603K5352J0459p247k3778
$$ 4541 32753 45972 36418 9515 -20591 -41017 -42892 -24060 6543 31895 42354 35107 11329
1601A1329l0364k1383j311J7777K8694K7436J2544r672k6242k8747j9731k012
$$ 11329 -19035 -40418 -41729 -23952 4742 32178 44722 35050 8808 -19939 -39670 -41682
1613d1682J8004K8761K5213J2076n573k4180l1587k1114r03J6584K7312K7459
$$ -41682 -23678 5083 30296 42372 36799 12619 -18968 -40082 -40985 -24401 2911 30370
1625C0370J2836r514k4394k6373j9587l468J5903K7936K5373J2489o036k4118
$$ 30370 43206 33692 9298 -17075 -36662 -40130 -24227 3709 29082 41571 35535 11417
1637A1417l0592j9357l87J5331K6567K6512J1726q936k2102k5203k0642n268J6340
$$ 11417 -19175 -38532 -38919 -23588 2979 29491 41217 32281 10179 -15024 -35666 -40934 -24594
1650b4594K8619K4929J1501o123k3373k9414j8541r07J4382K5193K6321J2399
$$ -24594 4025 28954 40455 34332 10959 -18455 -36996 -37903 -23521 1672 27993 40392
1662D0392p470k0620k5837k2222n349J7016K7371K3162J1733m903k1881k7813
$$ 40392 32922 12302 -13535 -35757 -41106 -24090 3281 26443 38176 33273 11392 -16421
1674a6421j7474k046J2299K4106K6182J2731o983k0625k5920k1346l847J6986
$$ -16421 -33895 -35941 -23642 464 26646 39377 32394 11769 -14151 -35497 -39344 -22358
1686b2358K5555K2129J1428m122k0885k6327j7854l596J1472K4550K6716J2057
$$ -22358 3197 25326 36754 32632 11747 -14580 -32434 -36030 -24558 -8 26708 38765
1698C8765p412k0064k5109k0513l250J5776K3801K1250J2687k622k0149k6523
$$ 38765 31353 11289 -13820 -34333 -37583 -21807 1994 23244 35931 33309 13160 -13363
1710a3363j8473m288J1479K4686K5440J1058o778j8394k3686j9548l132J3883
$$ -13363 -31836 -36124 -24645 41 25481 36539 29761 11367 -12319 -31867 -34999 -21116
1722b1116K1604K1108J4240k960k0900k5858j7714l413J1576K4214K3828J0062
$$ -21116 488 21596 35836 32876 11976 -13882 -31596 -35009 -23433 781 24609 34671
1734C4671n747j6743k3070j9631m062J2181K1447K2556J4466l795k1322k4337
$$ 34671 28924 12181 -10889 -30520 -34582 -22401 -954 21602 36068 32273 10951 -13386
1746a3386j6453m216J0841K3341K2664J0046l595j5090k3305k0884m765J2429
$$ -13386 -29839 -34055 -23214 127 22791 32837 29242 14152 -9153 -30037 -34802 -22373
1758b2373K1409K1811J3343m249j9557k2027j5775m732R758K1849K1872J0637
$$ -22373 -964 20847 34190 29941 10384 -11643 -27418 -32150 -22392 -543 21329 31966
1770C1966k503j5377k4450k0306l058J2749K0496K0662J2930l764j8398k1077
$$ 31966 29463 14086 -10364 -30670 -33728 -20979 -483 20179 33109 29345 10947 -10130
1782a0130j5740o321Q671K1947K2277J1305k816j5814k3744j8605l015J1205J8833
$$ -10130 -25870 -32191 -23520 -1573 20704 32009 29193 13379 -10365 -28970 -31985 -20780 -1947
1795a947K0298J3290k762j6451k0368j7031p289Q756K2012K1328J0298k594j4934
$$ -1947 18351 31641 28879 12428 -7940 -24971 -32260 -23504 -1492 19836 30134 27540 12606
1808A2606k2168j7141l112R653J7597K0429J3298k841j6030k0579j7311o841R996
$$ 12606 -9562 -26703 -29815 -20162 -2565 17864 31162 28321 12291 -8288 -25599 -32440 -22444
1821b2444K1436J9782J0164j502j4043k1674j7052m151Q227J7594K0904J3294
$$ -22444 -1008 18774 28938 27436 13393 -8281 -25333 -29484 -21257 -3663 17241 30535
1833C0535k525j5808j9919j6847o367R419J9827J8659J0501l61j2939k1200j7137
$$ 30535 28010 12202 -7717 -24564 -30931 -21512 -1685 16974 27475 27114 14175 -7025 -24162
1846b4162m701P714J7215K0564J2648k986j4616j8988j6147n842R032J8485J7817
$$ -24162 -28863 -21149 -3934 16630 29278 26292 11676 -7312 -23459 -29301 -20269 -1784 16033
1859A6033J0978L74j3535k1248j7036m476P990J7169J9932J2174k044j4064j8642
$$ 16033 27011 27385 13850 -7398 -24434 -28910 -20920 -3751 16181 28355 26311 12247 -6395
1872f395j5909n754P593J6656J8477J2552k23j3924k0360j5049n024O358J6942
$$ -6395 -22304 -28058 -20465 -3809 14668 27220 26997 13073 -7287 -22336 -27360 -21002 -4060
1885d060J9618J1630k304j2330j7355j6243o620O998J6635J8575J1911r75j3780
$$ -4060 15558 27188 24884 12554 -4801 -21044 -27664 -20666 -4031 14544 26455 25480 11700
1898A1700j8422j4084n971N769J7645J9431R679k049j0230j7432j7852p022Q788
$$ 11700 -6722 -20806 -26777 -21008 -3363 16068 25747 23698 13468 -3964 -21816 -28838 -20050
1911b0050J7006J6529J1292Q13j2351j8661j5018n535N844J6187J8176J0067n43
$$ -20050 -3044 13485 24777 25590 13239 -5422 -20440 -25975 -20131 -3944 14232 24299 23756
1924B3756r808j7967j7708n541R118J4959J4728J2124K195j2430j9278j3837m311
$$ 23756 13948 -4019 -21727 -27268 -18150 -3191 11537 23661 25856 13426 -5852 -19689 -24000
1937b4000M791J3530J8357J2259j075j1968j6776j4846n435O410J4398J6421J2308
$$ -24000 -19209 -5679 12678 24937 23862 11894 -4882 -19728 -25163 -18753 -4355 12066 24374
1950B4374N95j2385j7896j3445n352L731J4249J8658J2030j615j1345j4883j4027
$$ 24374 24969 12584 -5312 -18757 -24109 -20378 -6129 12529 24559 22944 11599 -3284 -17311
1963a7311p258M615J5302J7258J0420o24r798j5664j4719o755N151J4851J6592
$$ -17311 -24569 -19954 -4652 12606 23026 22402 12604 -3060 -17779 -24534 -19383 -4532 12060
1976A2060J0210r6r262j5434j4867o979N362J4694J5906R857N90r205j5659j5129
$$ 12060 22270 22174 12912 -2522 -17389 -24368 -19006 -4312 11594 21451 22041 12836 -2823 -17952
1990a7952o466O123J4338J4763J0309K131r561j7028j4754n021M828J2416J5586
$$ -17952 -24418 -18295 -3957 10806 21115 23246 13685 -3343 -18097 -23118 -18290 -5874 9712
2003I712J1633J175r769j5224j3875o369M622J3127J4887J0712J483r216j6050
$$ 9712 21345 22520 12751 -2473 -16348 -22717 -18095 -4968 9919 20631 22114 12898 -3152
2016c152j3637n128M127J1674J5649J1729N69r846j4057j3178p035L853J2968
$$ -3152 -16789 -21917 -17790 -6116 9533 21262 21831 11985 -2072 -15250 -22285 -18432 -5464
2029e464J5200J0174J075q396j4756j3737n866L841J2023J5138J1207R20r046
$$ -5464 9736 19910 20985 12589 -2167 -15904 -21770 -17929 -5906 9232 20439 21359 12313
2042A2313j3800j3272p052L333J2585J4897R819K023q039j4112j3510n949L385
$$ 12313 -1487 -14759 -21811 -18478 -5893 9004 18823 20846 12807 -1305 -14815 -20764 -17379
2055a7379J1409J4579J0616J131q139j3243j3101p106L632J1939J4154R896J987
$$ -17379 -5970 8609 19225 20356 12217 -1026 -14127 -21233 -17601 -5662 8492 18388 20375
2068B0375p635j3960j2939o064K861J0970J4564J0411J219p548j2810j3165p067
$$ 20375 12740 -1220 -14159 -20223 -17362 -6392 8172 18583 19802 12254 -556 -13721 -20788
2081b0788L405J1806J3207J0200K467p296j3721j2802o150K284J0490J4172J0560
$$ -20788 -17383 -5577 7630 17830 20297 13001 -720 -13522 -19672 -17388 -6898 7274 17834
2094A7834J631p083j2338j2964o684K985J0772J2454J0228K772o859j3474j2402
$$ 17834 19465 12382 44 -12920 -19604 -16619 -5847 6607 16835 19607 12748 -726 -13128
2107a3128n696J887J0151J3631J0465J684o775j1987j2499o871K683J0020J2491
$$ -13128 -18824 -16937 -6786 6845 17310 18994 12219 232 -12267 -19138 -16455 -6435 6056
2120F056J0243L115o859j2866j1900o160J699R761J3502R846J746n725j1541j2424
$$ 6056 16299 19414 12555 -311 -12211 -18371 -16672 -6911 6591 16437 18183 12458 917 -11507
2134a1507p293K495R575J2034J0434L212o743j2148j1215o130J327R101J2843
$$ -11507 -18800 -16305 -6730 5304 15738 18950 12207 59 -11156 -17286 -15959 -6858 5985
2147E985R596J977n279j1096j2480o978K251R462J1827J0183K909o503j1468j0766
$$ 5985 15581 17558 12279 1183 -11297 -18275 -16024 -6562 5265 15448 18357 11854 386 -10380
2161a0380o546P62Q929J2779R383K427n126j0770j2272o836K161Q670J1664R818
$$ -10380 -16926 -16164 -7235 5544 14927 17354 12228 1458 -10814 -17650 -15489 -6819 4845 14663
2175A4663K791n500j0681j0871p371Q29R088J1938Q901K912m170j0877j2082n896
$$ 14663 17454 11954 1273 -9598 -16969 -16140 -7052 4886 13787 16699 12529 1652 -10430 -16326
2189a6326K053P499J0913R911L065n526j0119j0807p149Q01Q943J1561Q298L332
$$ -16326 -14273 -6774 4139 14050 17115 11589 1470 -9337 -16486 -15685 -6742 4819 13117 16449
2203A6449l951j0777j1629n699J377O596J0691J0504L507n629r796j0134p298
$$ 16449 12498 1721 -9908 -15607 -14230 -7634 3057 13561 17068 11439 1643 -8491 -15789
2216a5789K70Q555J1400Q211L185l565j0165j1149n992P18O424J0803J0343K702
$$ -15789 -15519 -6964 4436 12647 15832 12267 2102 -9047 -15039 -14321 -7897 2906 13249 15951
2230A5951m927r161r655p202K87Q029J0626P757L538l251r743j0938n994N87O544
$$ 15951 11024 1863 -7792 -14994 -14707 -6678 3948 11705 15243 11992 2249 -8689 -14683 -14096 -7552
2245g552J0770R571K948m735q562j0041o989J54P619R761Q295M049l080r903j0577
$$ -7552 3218 12789 15737 11002 2440 -7601 -14590 -14436 -6817 2944 11239 15288 12208 2305 -8272
2260h272n756K14O009J0564R287K794l903q152r491p404j58P064R391Q435M260
$$ -8272 -14028 -13814 -7805 2759 12046 14840 10937 2785 -6706 -14110 -14268 -7204 2187 10622 14882
2275A4882l219r478r842n217l93N560J0057R040K588l454p264r854p308J68O603
$$ 14882 11663 2185 -7657 -12874 -13267 -7707 2350 11390 13978 10524 3260 -6594 -13902 -13734 -7131
2290g131R340Q173M299l152q941r350n541o18N029R627Q646L239k809p248r706
$$ -7131 2209 10382 14681 11529 2588 -6762 -12303 -12921 -7892 1735 10381 13620 10811 3563 -6143
2305f143p124j12O459Q807P797M241k734q480q658n890j192M999R587Q454L223
$$ -6143 -13267 -13379 -6920 1887 9684 13925 11191 2711 -5947 -11837 -13029 -8030 1557 10011 13234
2320A3234k535p093r508o789J17N830Q104P930M039k556p712q571o418j083N211
$$ 13234 10699 3606 -5902 -12691 -12574 -6744 1360 9290 13329 10773 3061 -5510 -11928 -13011 -7800
2335g800R356P979L207k047o706r589o671K43N017P678P906M457k256p459q391
$$ -7800 1556 9535 12742 10695 3989 -5600 -12271 -12028 -7011 667 8573 13030 10774 3315 -5076
2350e076o104j206M800Q988P570L362j863o489r344n934l38M475P384Q104M583
$$ -5076 -11180 -12386 -7586 1402 8972 12334 10471 3982 -5362 -11296 -11634 -7159 225 8329 12912
2365A2912k521p424p759n516j680M137Q679P780L214j805o242q452o135r12M202
$$ 12912 10391 2967 -4792 -10308 -11988 -7851 828 8608 11822 10017 3775 -4677 -10812 -11724 -7522
2380g522P841P847M087k271o473p602o031j718M220Q189P462L107j331n658q136
$$ -7522 319 8166 12253 9982 3509 -4093 -10124 -11842 -7622 567 8029 11136 9805 4147 -3989
2395c989o274j421M667P452O806M171j327o185p942n870j398M438P067O608M248
$$ -3989 -10263 -11684 -7017 435 7241 11412 10085 3900 -4042 -9912 -11310 -6872 195 6803 11051
2410A1051p05o329q171n609j128L745O888P284M150j103n935p904n898j184L706
$$ 11051 10346 4017 -4154 -9763 -10891 -7146 -258 7026 11176 10073 4138 -3766 -9664 -10848 -7142
2425g142O462P373M453j174o175p427n039j525K724O889P502M087j723n462o775
$$ -7142 -680 6693 11146 9972 3797 -3630 -8669 -10194 -7470 -581 6921 11008 9285 3823 -2952
2440b952n859j815L399O728P155L733r87n463o928n337k100L069O894P015L591
$$ -2952 -8811 -10626 -7227 -499 6656 10389 9402 3939 -2989 -8326 -10426 -7357 -463 6552 10143
2455A0143j250m374o941o243j946L624O639O314L707k01n022p135n659j748K916
$$ 10143 8893 4519 -2422 -8665 -10611 -6987 -348 5966 9673 9472 4450 -2685 -8344 -10092 -7176
2470g176O341O662L886n53m538o973n989j644L203O156O009M004j21m593p437
$$ -7176 -835 5827 9713 9160 4622 -2351 -8340 -9984 -6781 -625 5384 9388 9267 4674 -2763
2485b763n133j539K538N727O599M153o38m521o632n645j710K651N454O554L996
$$ -2763 -7896 -9435 -6897 -1170 5429 9582 8944 4423 -2209 -7854 -9564 -6913 -1459 5095 9091
2500I091l9m755o387n232k061K385N816O276L957l73m278o341n277k010K344N451
$$ 9091 9052 4297 -2090 -7322 -9383 -6998 -1182 5094 9051 8678 4400 -1941 -7218 -9228 -6884 -1433
2516a433O340L940k77m171o153n236k111K153N636N893L891P2l882o214n265k114
$$ -1433 4907 8847 8570 4399 -1754 -6990 -9101 -6948 -1312 4581 8472 8544 4662 -1552 -6817 -8931
2532h931K058N186O056M172J6m241n987m883k247J991N181O085L620K66l661n956
$$ -8931 -6873 -1687 4369 8541 8557 4316 -1671 -6554 -8801 -6810 -1629 4456 8076 8342 4681 -1275
2548a275n399k013J998M978O020L885j36l784n557m789k450J710M953N828L747
$$ -1275 -6674 -8687 -6689 -1711 4309 8194 8058 4274 -1283 -6072 -8522 -6812 -1859 3969 7716
2563G716M56l397n834n293j916J813M570N731L898K22l324n396n028k592J710
$$ 7716 8172 4775 -1059 -6352 -8268 -6455 -1885 3846 7744 7966 4642 -754 -5782 -8374 -6664
2578f664M842N655L735L94l365n482n026k035J475M517N338L917M94l001n210
$$ -6664 -1822 3833 7568 7962 4597 -885 -5911 -7946 -6471 -1954 3384 7301 7795 4794 -416
2593d16n260k458J646M435N441L698P29l120n352m790k191J195L955N484M221
$$ -416 -5676 -8134 -6488 -2053 3388 7086 7815 4695 -657 -5447 -7638 -6443 -2488 2996 7217
2608G217M14k978n286m694k278J230M289N169L723N46k814m836m755k182P79L758
$$ 7217 7631 4653 -633 -5327 -7605 -6375 -2086 3083 6806 7352 4538 -298 -5053 -7235 -6456 -2698
2624b698N762M235Q9k815m826m856k065J060L869M730L839Q70k328m919m612k676
$$ -2698 3064 7299 7388 4573 -253 -5109 -7174 -6114 -2245 2485 6324 7194 4866 -53 -4665 -7341
2640g341P60M193N417L718J36k497m314m654k541J084L745M582L846J181k392
$$ -7341 -6581 -2388 3029 6747 6883 4386 72 -4582 -7123 -6039 -2294 2288 6134 7315 4923
2655D923n175m454k347R37L830M825L628M79j948m075m711k980Q78L689M557L982
$$ 4923 -252 -4706 -7053 -6116 -2286 2539 6167 6646 4698 623 -4088 -7068 -6190 -2501 2056 6038
2671F038J288k647m721m231k298P46L225M630L546R86j791m053m705k886P77L534
$$ 6038 7326 4679 -42 -4273 -6571 -5825 -2600 2030 5576 6562 4771 718 -3987 -6873 -6096 -2562
2687b562M538L951R52k592m093l864k317o1L042M779L678J118j659m105m807k565
$$ -2562 1976 5927 6879 4287 194 -3670 -5987 -6048 -3006 1773 5451 6569 4910 805 -4002 -6567
2703f567P71L279M344L574J011k203l608l956k652j68L307M561L434J486j591
$$ -6567 -5796 -2517 1827 5401 6412 4209 601 -3355 -6007 -6175 -2868 1693 5127 6613 5022
2718E022m326m374k255N33K633L763L958J323j703l587l995k915l22L217M673
$$ 5022 696 -3678 -5933 -5400 -2767 996 4954 6277 4574 987 -3008 -5923 -6245 -3028 1645
2733A645L534R99j448l915m192k248L73K312L672L932J713j538l722m187k777
$$ 1645 5179 6178 4730 815 -3377 -5625 -5252 -2940 732 4664 6377 4839 1117 -3070 -5847
2748e847K9L022M251K947J191j024l175m364k414j89K205L956M141J456j681l330
$$ -5847 -5818 -2796 1455 4402 5593 4569 1394 -2970 -5384 -5573 -3368 588 4729 6185 4504 1174
2764A174l982k763R2K625L917K846J781o86l755l849k597k07J937M341L685J409
$$ 1174 -2808 -5571 -5479 -2854 1063 3909 5690 5004 1249 -2600 -5197 -5404 -3467 874 4559 5968
2780E968j583l001l694k678j35K172L367L093K051n67l532l872k620k55K126L752
$$ 5968 4385 1384 -2310 -4988 -5123 -2951 416 3509 5560 4993 1461 -2411 -5031 -5286 -3160 592
2796E92L515J241j145k617l372l076n84K133L568L489J816p45l419l855k357k43
$$ 592 4107 5348 4203 1586 -1786 -4862 -5446 -3313 255 3744 5560 4815 1396 -2459 -4816 -5059
2812e059K045L361L262J348m98k384l872k940n40K153L435L090K043r83k891l297
$$ -5059 -3014 347 3609 4957 4459 2075 -1797 -4737 -5277 -3124 311 3401 5444 4461 1570 -1727
2828a727k381o48J475L353L211J956o52k536l886k705l79J852L109L050J997q58
$$ -1727 -4108 -4756 -3281 72 3283 5239 4587 2051 -1835 -4540 -4919 -3067 42 3092 5089 4231
2844D231k709l114k350q11J282L285L545J601m15k587l397k854m71J752K777L068
$$ 4231 1522 -1592 -3942 -4753 -3471 -186 3359 4960 4545 1958 -1439 -4293 -4764 -3012 -235 2833
2860B833J986p40k073l168k569j272J465L650L105J280l38k020l585k576n24J605
$$ 2833 4819 4079 2006 -1162 -3731 -5003 -3538 112 3217 4497 4159 2139 -1446 -4022 -4546 -2941
2876b941K648K861J725nk160l218k788p78J363L185K730J726o2k175l151k786
$$ -2941 -293 2568 4293 4288 2128 -1090 -3878 -4656 -3293 -108 2622 4348 4286 2111 -1040 -3826
2892c826m53J069K456L258K152k08k360l142k489p74J186K452L047J878k6j952
$$ -3826 -4279 -3210 -754 2504 4656 4448 2088 -1054 -3543 -4317 -3131 -679 2368 4246 4220 2268
2908B268l228k486o78O92K644L288J900l87k014k647k454j038R64K570K806J799
$$ 2268 -960 -3446 -4124 -3432 -788 2500 4400 4013 1999 -648 -3102 -4140 -3176 -606 2200 3999
2924C999J31j722l124k386j058R04K457L134J724k69j506k591k835j042Q38K589
$$ 3999 4130 2408 -716 -3102 -4160 -3256 -799 2335 4059 3790 2284 -307 -3142 -4184 -3346 -757
2940g57K574J988K21j708k714k722p84Q72K229K636J998j1j508k658k604j037
$$ -757 1817 3805 4026 2318 -396 -3118 -3902 -3030 -801 1835 3833 3822 2314 -344 -2948 -3985
2956c985Q68K133K698J985J46j531k797k383q87O59K180K570K017J45j618k453
$$ -3985 -3117 -984 1714 3699 3845 2314 -483 -2866 -3753 -3094 -914 1656 3673 3818 2200 -253
2972b53k645r63P08K214K497J844N31j839k444k157j265O21K008K513J960K91
$$ -253 -2898 -3861 -3153 -939 1558 3402 3933 2094 -350 -2507 -3772 -3151 -1143 1370 3330 3621
2988C621j323k519k349j128N87K240K320J957K86j538k276k220j159K54K166K206
$$ 3621 2298 -221 -2570 -3698 -3111 -871 1449 3406 3692 2154 -122 -2342 -3501 -3247 -1081 1125
3004A125K176L26j377k199k373j158L95J866K478J848M85j135k422k190j408L22
$$ 1125 3301 3627 2250 51 -2322 -3480 -3085 -1219 1259 3107 3592 2457 35 -2155 -3563 -3241
3020c241K046K659J782K52j325k143k240j182M43J733K307J899L54p90k269k374
$$ -3241 -1195 1464 3246 3498 2173 30 -2210 -3392 -2949 -1216 1091 2990 3344 2554 285 -2089
3036b089j158J51J889K420J720L64q87k165k241j321K37J715K233J933N42p81
$$ -2089 -3247 -3096 -1207 1213 2933 3297 2410 245 -1996 -3317 -3080 -1365 868 2801 3343 2562
3052B562k487k059j208L79J563K199J688N32o00k264k299j036M1J513K455J918
$$ 2562 75 -1984 -3192 -2813 -1250 949 2637 3169 2569 305 -1994 -3030 -2989 -1476 979 2897
3068B897N38j155k030k072j166M8J513K005K016P83j000j976k091j326J86J525
$$ 2897 3435 2280 250 -1822 -2988 -2940 -1427 578 2594 3377 2377 401 -1690 -3016 -2830 -1305
3084a305K207J686L92n83j849k039j411M6J441K062J688Q84r60j785j926j480
$$ -1305 902 2588 2980 2397 548 -1491 -2902 -2856 -1415 647 2335 3219 2259 474 -1452 -2932
3100b932J24J347J985J943O22p04j708j992j653R7J423K085J790O03o25j930j754
$$ -2932 -2808 -1461 524 2467 3089 2385 677 -1315 -2968 -2871 -1448 637 2427 3030 2405 475 -1279
3117a279j285j45J034J998J901O87o00j377k375j263K38J041J882J778N66n11
$$ -1279 -2564 -2709 -1675 323 2224 2911 2311 934 -1441 -2704 -2466 -1425 457 2235 2801 2290
3133B290j700j722j360p4R14J999J842P37n49j697k090j204j04J218J596J754
$$ 2290 590 -1132 -2492 -2566 -1652 347 2189 2926 2377 680 -1410 -2614 -2718 -1500 96 1850
3149A850R08k61j633k075j148l93Q90K170J673Q24n77j353j919j386j04R66J649
$$ 1850 2758 2497 864 -1211 -2359 -2752 -1862 308 1981 2805 2228 875 -1044 -2430 -2534 -1568 81
3166H1J791J123m80j727j709j501k57J004J924J675N95l80j187j706j758R1P49
$$ 81 1872 2995 2515 788 -921 -2422 -2679 -1675 249 1924 2519 2139 952 -754 -2512 -2421 -1672
3183a672J382K026J101l98j478j794j524k15R31J720J601R01k06j145j927j675
$$ -1672 -290 1736 2837 2439 961 -833 -2357 -2572 -1641 79 1680 2581 2375 1230 -697 -2372
3199b372k47Q03J626J856J098l12j577j628j269m07O49J606J634R77m5j134j954
$$ -2372 -2619 -1816 -190 1666 2764 2452 875 -753 -2022 -2429 -1780 -174 1460 2437 2392 1258 -696
3216f96j644j99O91J730J614J045l46j118j570j526o02P01J744J589J167j31j148
$$ -696 -2340 -2539 -1848 -118 1496 2541 2195 1077 -493 -2019 -2621 -1920 -176 1413 2580 2449 1301
3233A301k158j521j47P11J364J824J207l85q99j676j625o89Q50J550J739R49j04
$$ 1301 -857 -2378 -2525 -1814 -450 1374 2581 2196 1297 -379 -2004 -2693 -1843 -293 1446 2395 2291
3250B291j117j852j246l61K82J536J763J182J28j292j602j505r44R19J752J530
$$ 2291 1174 -678 -1924 -2285 -2003 -467 1296 2478 2606 1314 -288 -1793 -2737 -1818 -66 1464
3266A464R41j58j070j523j351p96N10J453J748J363l39o16k049j658m89P34J838
$$ 1464 2405 2247 1177 -346 -1697 -2493 -1983 -530 1218 2581 2242 1626 -423 -2081 -2570 -1836 2
3283BJ245Q45K85r00j669j484n62K25J566J742J161J14j346j559j484n13L81J559
$$ 2 1247 2092 2377 1477 -192 -1676 -2238 -2013 -447 1295 2456 2570 1224 -335 -1819 -2332 -1951 -392
3301c92J355J303L99j145j838j336p01K58J543J760J031j12p41j631j377n85L19
$$ -392 963 2266 2665 1520 -318 -1654 -2355 -2097 -554 1206 2237 2125 1384 -247 -1624 -2209 -1890
3318a890J112J710J392K58j265j507j412p66M22J285J584R18K89p40j250j604
$$ -1890 -778 932 2324 2582 1317 -190 -1602 -2368 -1946 -661 923 1841 2130 1390 140 -1464
3334a464r53M65J188J747J144K59j060j617j277n61L16R68J637J070L75o11j428
$$ -1464 -2417 -1952 -764 983 2127 2386 1326 -291 -1568 -2129 -1813 -845 792 1862 2237 1626 198
3351A98j859p92N68J199J572R70M80r58j423j095r76Q0J217J673J312Rn62j601
$$ 198 -1661 -2453 -1885 -686 886 1856 2336 1378 -45 -1140 -2116 -2036 -819 854 2166 2175 1613 12
3369A2j609n41L04R85J462J265M90j005j224j235r41j7J185J735J121K25p23j402
$$ 12 -1597 -2138 -1834 -849 613 1878 2368 1363 139 -1096 -2037 -2054 -869 866 1987 2212 1489 87
3387H7j457o44R7J019J488J639R7p01j446j308j039q3J498J458J298J48n28j367
$$ 87 -1370 -2014 -1917 -898 590 2229 2326 1625 179 -1129 -2168 -2251 -753 705 2003 2151 1623 256
3405B56j473q53J95R10J450J589K27p55j299j468r26K35J224J283J098M52k30
$$ 256 -1217 -2070 -1875 -965 485 2074 2301 1546 247 -1221 -2147 -1912 -688 595 1693 2145 1915
3422A915j643j333r90R3Q82J729J382J54n74j453j218r70R6R89J523J270M60o39
$$ 1915 272 -1061 -2051 -1958 -1076 653 2035 2189 1615 162 -1056 -2026 -1930 -941 582 1852 2312 1673
3440A673j287j524r70m5J097J406J400M61n83j137j702q10oJ165J324J174Q09
$$ 1673 386 -1138 -2108 -2153 -1056 350 1750 2211 1628 491 -1211 -2021 -2027 -862 462 1636 2445
3457B445q02j339j443p37j57P80J671J353L60n40j059j485j146J78J020J342J352
$$ 2445 1643 304 -1139 -1876 -2033 -1253 418 1771 2131 1591 532 -953 -2099 -1921 -901 441 1793
3474A793L87n32j220j483r87m9J096J341J398M83n77j223j205j290N0Q71J553
$$ 1793 2180 1648 428 -1055 -2042 -2091 -995 346 1744 2227 1650 427 -778 -2068 -2018 -1147 406
3491D06J238L94l65j142j322j093JO39J560J450M18k21j431j282j172M1Q30J245
$$ 406 1644 2038 1673 531 -791 -1884 -1883 -1244 316 1766 2184 1963 532 -750 -1922 -1881 -1051 194
3509A94J486O47o25j181j333j053l17J074J337J278O11k12j349j637j043J60O54
$$ 194 1680 2327 1702 521 -812 -1865 -2182 -1108 229 1507 2118 1906 557 -1080 -2123 -1963 -1309
3526a309J431J523O01k64j277j530j059j29O26J624J105R15n72r18j602j033o9
$$ -1309 122 1645 2246 1982 705 -825 -1884 -2013 -1387 237 1342 2257 1685 767 -835 -1868 -1937
3543a937P15J259J488P38n73j116j308j182K5N17J506J427N54k86j066j553j082
$$ -1937 -1222 37 1525 2263 1690 574 -734 -1916 -1891 -1374 132 1559 2113 1827 761 -792 -1874
3560a874K6M84J358J455P60l60j377j071j130l93Q88J395J286O24l94p41j768
$$ -1874 -1848 -1364 -6 1449 2209 1849 472 -599 -1729 -2122 -1234 161 1447 2071 1677 936 -832
3577h32j139r0P49J631R68O75k27r55j527j017j54P79J304J036R98j36j345j469
$$ -832 -1971 -2061 -1312 319 1287 1962 1735 780 -747 -1764 -1918 -1139 165 1201 2199 2063 718 -751
3595g51p83l81N99J409J278N61j09j019j484j104j97Q21J124J378R13m11r85j587
$$ -751 -1534 -1915 -1316 93 1371 1932 1823 804 -680 -1784 -1981 -1160 -36 1342 2255 1844 859 -728
3613g28j055j58N56J338J394O60j96j050j172j293l89N91J380J361P95j91j024
$$ -728 -1783 -1941 -1385 -47 1347 2007 1811 761 -411 -1704 -2093 -1502 -122 1239 2034 1843 819
3630H19j337r87m36M45J456J253P26m5r95j337j193l05P51J237J274N84o0j003
$$ 819 -518 -1505 -1941 -1496 -40 1213 1939 1894 899 -438 -1631 -1936 -1185 52 1326 1910 1850 847
3648H47j237j058l89N53J269J309O66k3j069j239j241k95N63J160J275R18j96
$$ 847 -390 -1448 -1837 -1284 -15 1294 1960 1937 868 -371 -1612 -1907 -1344 -184 1091 2009 1813
3665A813q61j352j150n23O63J166J406O69j14p66j573r86k51L76J291J203J030
$$ 1813 952 -400 -1550 -2073 -1410 -244 1162 1831 1717 951 -622 -1608 -1859 -1483 -192 1011 2041
3682B041rj154j142j285l75N47J296J164Q82k97q08j194j255m12N24J193J420
$$ 2041 2032 878 -264 -1549 -1924 -1377 -81 1083 1965 1668 860 -334 -1589 -2001 -1477 -284 1136
3699A136R04M8j281j258r82n52O21J090J217R16op36j328j354l74M45J067J381
$$ 1136 2040 2088 807 -451 -1433 -1985 -1364 -274 943 1859 1853 1117 -211 -1565 -1939 -1494 -427 954
3717I54R75j58p45j376j149m80N95J003J563O55M9p34j581j138l52M21J054J574
$$ 954 1929 1771 1026 -350 -1499 -1979 -1384 -381 1182 1837 1886 1152 -429 -1567 -1919 -1498 -444 1130
3735A130P29j10q27j100j035p30N18J146J254J003N2p08j600j257l30K84J143
$$ 1130 1859 1749 922 -178 -1213 -1943 -1425 -279 975 1978 2030 1322 -278 -1535 -1865 -1581 -438
3752d38J379Q02P9o66j261j263l68K09J026J333R14J36p76j453j096l16L13J031
$$ -438 941 1743 1822 1156 -105 -1368 -1736 -1527 -501 832 1746 1882 1106 -347 -1443 -1759 -1446 -415
3770d15J289R63o9o37j311j257l66K91J053J230J137j23o63j138j167o19K19J068
$$ -415 874 1837 1768 1131 -180 -1437 -1803 -1512 -459 771 1908 1785 1122 -16 -1183 -1802 -1583 -515
3788e15J453R88j32o82j300r70q27M01J107J133J101L7p72r56j213n78m8J185
$$ -515 938 1926 1794 1112 -188 -1158 -1985 -1584 -477 656 1757 1794 1022 66 -1147 -1725 -1773 -588
3806e88J434R48mn65j215j207q32M98R70R85J194M06p30j341j292m95J57J325
$$ -588 846 1794 1790 1225 10 -1197 -2029 -1531 -561 424 1618 2024 1294 -47 -1339 -1834 -1677 -352
3824c52J029J082O6n57j344j244p55M65J058J085R65L97o72j370j054n92L27Q41
$$ -352 677 1759 1825 1268 -76 -1320 -2075 -1610 -552 533 1498 1895 1223 -147 -1201 -1793 -1466 -625
3842f25J400Q72J81p43r05j268p88L73R28J237Q84K41o30j213j151o62L43R78
$$ -625 775 1647 1828 1085 180 -1088 -1876 -1503 -575 662 1546 1787 1157 -56 -1207 -1869 -1526 -548
3860e48J270P26K60o15r49j367m96M34N52J205J265K47p96j060j265o15J60Q61
$$ -548 722 1448 1708 1093 144 -1223 -1719 -1285 -733 472 1737 1984 1188 128 -1137 -1752 -1592 -731
3878g31J360Q91J69k42j267j186p15L64O44J323R00K95m40j057j212q32J59Q66
$$ -731 629 1520 1689 1447 180 -1006 -1721 -1357 -713 610 1510 1805 1365 308 -904 -1736 -1577 -711
3896g11J248Q74L97o23j066j113o76J55Q37J249Q87N62p20r44j367o89Q3R51J188
$$ -711 537 1411 1808 1185 119 -994 -1670 -1515 -678 571 1458 2020 1300 356 -1011 -1700 -1617 -666 522
3915E22J045K15n58j097j119n88l4R58J075R72L98p18r02j021q84K95O28J177
$$ 522 1567 1782 1224 127 -992 -1580 -1614 -656 419 1391 1789 1071 169 -852 -1736 -1441 -813 364
$$ [...]
8191f92
##END NTUPLES=NMR FID
##END=
