##TITLE=1H_CPA-3
 D2O
 8 sc, 
 15.7.2024
##JCAMPDX= 6.0         $$ Bruker NMR JCAMP-DX V2.0
##DATA TYPE= NMR FID
##DATA CLASS= NTUPLES
##ORIGIN= UXNMR, Bruker Analytische Messtechnik GmbH
##OWNER= root
$$ XWIN-NMR		Version 3.5
$$ Mon Jul 15 14:17:25 2024 Russian Standard Time (UT+4h)  she@DPX200
##.OBSERVE FREQUENCY= 200.1313
##.OBSERVE NUCLEUS= ^1H
##.DELAY= (6, 6)
##.ACQUISITION MODE= SIMULTANEOUS
##.ACQUISITION SCHEME= undefined
##.AVERAGES= 8
##.DIGITISER RES= 18
##SPECTROMETER/DATA SYSTEM= spect
##.PULSE SEQUENCE= zg30
##.SOLVENT NAME= D2O
##.SHIFT REFERENCE= (INTERNAL, D2O, 0, 15.7039)
##AUDIT TRAIL= $$ (NUMBER, WHEN, WHO, WHERE, WHAT)
$$ ##TITLE= Audit trail, XWIN-NMR		Version 3.5
$$ ##JCAMPDX= 5.01
$$ ##ORIGIN= Bruker BioSpin GmbH
$$ ##OWNER= she
$$ F:/spectra/data/she/nmr/H-F/1/audita.txt
$$ ##AUDIT TRAIL=  $$ (NUMBER, WHEN, WHO, WHERE, WHAT)
(   1,<2024-07-15 14:16:09.84 +0400>,<she>,<DPX200>,
      <created by zg, POWCHK disabled, PULCHK disabled
       configuration hash MD5:
       00 E9 B6 7A A2 85 ED C7 34 08 36 98 17 FE 4E 26
       data hash MD5: 16K
       EB CB C1 0D 1D 20 6A A2 AF 42 EB 20 20 0F 54 C9>)
$$ ##END=
$$ 
$$ hash MD5
$$ F1 2F E9 92 A6 1E 62 C7 EC 35 29 37 12 9C 2B B8
##$RELAX= 
##$RELAX= 
##$RELAX= 
##$RELAX= 
##$RELAX= 
##$RELAX= 
$$ Bruker specific parameters
$$ --------------------------
##$DU= <F:/spectra>
##$EXPNO= 1
##$NAME= <H-F>
##$PROCNO= 1
##$TYPE= <nmr>
##$USER= <she>
##$AMP= (0..31)
100 100 100 100 100 100 100 100 100 100 100 100 100 100 100 100 100 100 
100 100 100 100 100 100 100 100 100 100 100 100 100 100 
##$AQSEQ= 0
##$AQ_mod= 1
##$AUNM= <au_zg>
##$AUTOPOS= <>
##$BF1= 200.13
##$BF2= 200.13
##$BF3= 200.13
##$BF4= 200.13
##$BF5= 200.13
##$BF6= 200.13
##$BF7= 200.13
##$BF8= 200.13
##$BYTORDA= 1
##$CFDGTYP= 0
##$CFRGTYP= 5
##$CHEMSTR= <none>
##$CNST= (0..31)
1 1 145 1 1 1 1 1 1 1 1 1 1 1 1 1 1 1 1 1 1 1 1 1 1 1 1 1 1 1 1 1 
##$CPDPRG= <>
##$CPDPRG1= <>
##$CPDPRG2= <>
##$CPDPRG3= <>
##$CPDPRG4= <mlev>
##$CPDPRG5= <mlev>
##$CPDPRG6= <mlev>
##$CPDPRG7= <mlev>
##$CPDPRG8= <mlev>
##$CPDPRGB= <>
##$CPDPRGT= <>
##$D= (0..31)
0 1.2 0 0 0 0 0 0 0 0.06 0 0.03 0 0 0 0 0.0002 0 0 0 0 0 0 0 0 0 0 0 0 
0 0 0 
##$DATE= 1721038568
##$DBL= (0..7)
120 120 120 120 120 120 120 120 
##$DBP= (0..7)
150 150 150 150 150 150 150 150 
##$DBP07= 0
##$DBPNAM0= <>
##$DBPNAM1= <>
##$DBPNAM2= <>
##$DBPNAM3= <>
##$DBPNAM4= <>
##$DBPNAM5= <>
##$DBPNAM6= <>
##$DBPNAM7= <>
##$DBPOAL= (0..7)
0.5 0.5 0.5 0.5 0.5 0.5 0.5 0.5 
##$DBPOFFS= (0..7)
0 0 0 0 0 0 0 0 
##$DE= 6
##$DECBNUC= <off>
##$DECIM= 24
##$DECNUC= <off>
##$DECSTAT= 4
##$DIGMOD= 1
##$DIGTYP= 9
##$DL= (0..7)
0 120 120 120 120 120 120 120 
##$DP= (0..7)
150 150 150 150 150 150 150 150 
##$DP07= 0
##$DPNAME0= <>
##$DPNAME1= <>
##$DPNAME2= <>
##$DPNAME3= <>
##$DPNAME4= <>
##$DPNAME5= <>
##$DPNAME6= <>
##$DPNAME7= <>
##$DPOAL= (0..7)
0.5 0.5 0.5 0.5 0.5 0.5 0.5 0.5 
##$DPOFFS= (0..7)
0 0 0 0 0 0 0 0 
##$DQDMODE= 0
##$DR= 18
##$DS= 0
##$DSLIST= <SSSSSSSSSSSSSSS>
##$DSPFIRM= 0
$$ [...]
##$SUBNAM2= <"">
##$SUBNAM3= <"">
##$SUBNAM4= <"">
##$SUBNAM5= <"">
##$SUBNAM6= <"">
##$SUBNAM7= <"">
##$SUBNAM8= <"">
##$SUBNAM9= <"">
##$SW= 24.0689771365484
##$SWIBOX= (0..15)
0 0 2 0 0 0 0 0 0 0 0 0 0 0 0 0 
##$SW_h= 4816.95568400771
##$TD= 16384
##$TD0= 1
##$TE= 0
##$TE2= 300
##$TE3= 300
##$TEG= 300
##$TL= (0..7)
0 120 120 120 120 120 120 120 
##$TP= (0..7)
150 150 150 150 150 150 150 150 
##$TP07= 0
##$TPNAME0= <>
##$TPNAME1= <>
##$TPNAME2= <>
##$TPNAME3= <>
##$TPNAME4= <>
##$TPNAME5= <>
##$TPNAME6= <>
##$TPNAME7= <>
##$TPOAL= (0..7)
0.5 0.5 0.5 0.5 0.5 0.5 0.5 0.5 
##$TPOFFS= (0..7)
0 0 0 0 0 0 0 0 
##$TUNHIN= 0
##$TUNHOUT= 0
##$TUNXOUT= 0
##$USERA1= <user>
##$USERA2= <user>
##$USERA3= <user>
##$USERA4= <user>
##$USERA5= <user>
##$V9= 5
##$VALIST= <valist>
##$VCLIST= <CCCCCCCCCCCCCCC>
##$VD= 0
##$VDLIST= <DDDDDDDDDDDDDDD>
##$VPLIST= <PPPPPPPPPPPPPPP>
##$VTLIST= <TTTTTTTTTTTTTTT>
##$WBST= 1024
##$WBSW= 4
##$XGAIN= (0..3)
0 0 0 0 
##$XL= 0
##$YL= 0
##$YMAX_a= 312183
##$YMIN_a= -355325
##$ZGOPTNS= <>
##$ZL1= 120
##$ZL2= 120
##$ZL3= 120
##$ZL4= 120
##$ABSF1= 10
##$ABSF2= 0
##$ABSG= 5
##$ABSL= 3
##$ALPHA= 0
##$AQORDER= 0
##$ASSFAC= 0
##$ASSFACI= 0
##$ASSFACX= 0
##$ASSWID= 0
##$AUNMP= <proc_1d>
##$AZFE= 0.1
##$AZFW= 0.1
##$BCFW= 1
##$BC_mod= 2
##$BYTORDP= 1
##$COROFFS= 0
##$CY= 11.3945322036743
##$DATMOD= 1
##$DC= 2
##$DFILT= <>
##$DTYPP= 0
##$F1P= 15.6554695791079
##$F2P= 12.8336369535428
##$FCOR= 0.5
##$FTSIZE= 0
##$FT_mod= 4
##$GAMMA= 1
##$GB= 0.15
##$INTBC= 1
##$INTSCL= 1
##$ISEN= 128
##$LB= 0.24
##$LEV0= 0
##$LPBIN= 0
##$MAXI= 10000
##$MC2= 0
##$MEAN= 0
##$ME_mod= 0
##$MI= 1.114404
##$NCOEF= 0
##$NC_proc= 0
##$NLEV= 6
##$NOISF1= 3.799351
##$NOISF2= 2.8
##$NSP= 1
##$NTH_PI= 0
##$NZP= 0
##$OFFSET= 15.70392
##$PC= 1
##$PHC0= -25796.26
##$PHC1= 11.58748
##$PH_mod= 1
##$PKNL= yes
##$PPARMOD= 0
##$PSCAL= 0
##$PSIGN= 0
##$REVERSE= no
##$SF= 200.130013532006
##$SI= 16384
##$SIGF1= 3
##$SIGF2= 2
##$SINO= 400
##$SIOLD= 16384
##$SREGLST= <1H.CDCl3>
##$SSB= 0
##$STSI= 0
##$STSR= 0
##$SW_p= 3612.71676300578
##$SYMM= 0
##$S_DEV= 0
##$TDeff= 0
##$TDoff= 0
##$TI= <>
##$TILT= no
##$TM1= 0
##$TM2= 0
##$TOPLEV= 0
##$USERP1= <user>
##$USERP2= <user>
##$USERP3= <user>
##$USERP4= <user>
##$USERP5= <user>
##$WDW= 1
##$XDIM= 8192
##$YMAX_p= 0
##$YMIN_p= 0
$$ End of Bruker specific parameters
$$ ---------------------------------
##NTUPLES= NMR FID
##VAR_NAME=  TIME,          FID/REAL,        FID/IMAG
##SYMBOL=    X,             R,               I
##VAR_TYPE=  INDEPENDENT,   DEPENDENT,       DEPENDENT
##VAR_FORM=  AFFN,          ASDF,            ASDF
##VAR_DIM=   8192,          8192,            8192
##UNITS=     SECONDS,       ARBITRARY UNITS, ARBITRARY UNITS
##FACTOR=    0.0002076,     1,               1
##FIRST=     0,             0,               0
##LAST=      1.7004516,     0,               0
##MIN=       0,             -355325,         0
##MAX=       1.7004516,     312183,          0
$$ Real data points
##PAGE= N=1
##DATA TABLE= (X++(R..R)), XYDATA
0 0 0 0 0 0 0 0 0 -8 8 -8 8 -16 16 -20 24 -28 33 -40 48 -56 68 -80 89 -104 120 -140 156 -180 204 -228 260
31 260 -292 327 -365 409 -456 505 -563 624 -693 767 -850 941 -1041 1154 -1279 1422 -1582
48 -1582 1768 -1983 2237 -2539 2911 -3379 3986 -4817 6021 -7936 11486 -20307 89798 83210
62 83210 -128050 -179369 -193384 -188461 -233660 -225824 -132076 48863 198084 264973 243120 202011
74 202011 151341 81862 -33867 -157166 -244437 -261054 -226552 -154462 -55297 70153 183619
85 183619 243814 233750 188573 137411 73315 -36813 -178930 -283882 -282725 -187164 -73904
96 -73904 -4107 40936 114931 222474 292223 252875 114663 -35875 -124953 -155000 -177712 -213058
108 -213058 -220288 -150649 -13551 124635 204337 220432 203756 171290 110818 12784 -100676
119 -100676 -189315 -228888 -221644 -176982 -96577 12606 121552 192429 210493 193013 160065 106355
131 106355 13260 -110461 -215223 -247787 -201965 -121587 -51170 6979 79430 169881 237312
142 237312 232600 151063 38710 -53802 -113829 -159301 -197927 -207259 -160226 -60934 52112 138967
154 138967 185140 197408 181594 134400 55235 -40746 -128117 -186082 -205993 -186294 -128031 -39824
166 -39824 56483 134560 178153 188008 170185 124623 47938 -50483 -141972 -194792 -195746 -156502 -97123
179 -97123 -27852 49663 127760 185317 199389 164141 94384 13016 -64241 -130351 -176873 -190878
191 -190878 -162431 -95800 -9189 74843 139399 175397 178612 148178 88462 10164 -70962 -138029
203 -138029 -176910 -179173 -143968 -79110 984 79041 139944 172163 170199 134474 71944 -4975
215 -4975 -80715 -140420 -172310 -169415 -131125 -64831 14544 88497 142038 166983 160823 124548 62284
228 62284 -14936 -89823 -144545 -167692 -157126 -116543 -53461 20974 91739 142910 163536 150883
240 150883 109121 46604 -25508 -93387 -142209 -161052 -147040 -104101 -41158 30929 98569 146163
252 146163 161113 140362 92462 31000 -32973 -92465 -139044 -160286 -145281 -95189 -24823 45402
264 45402 101215 136667 148972 134396 90793 25256 -45893 -104469 -138818 -145538 -125980 -82621
276 -82621 -21087 46858 105509 140761 145712 121541 74206 12601 -51809 -105642 -137147 -141131
288 -141131 -118103 -72519 -11242 54519 109987 140542 139280 109930 62016 5466 -52699 -103764
300 -103764 -136325 -139707 -111261 -58904 2914 60781 105905 131432 132160 105246 55084 -6570
312 -6570 -64723 -107763 -129243 -126703 -100095 -52414 7617 66863 111647 132225 125352 93702 43997
325 43997 -13806 -68139 -108481 -127274 -121123 -91267 -42904 15021 70461 110980 127625 117635
337 117635 84353 35197 -20131 -71497 -108787 -124008 -113767 -80505 -31212 23891 74008 109689
349 109689 123112 111169 76082 25697 -29003 -76836 -108826 -119461 -106892 -73032 -23846 30468
361 30468 78758 110379 118987 103256 67093 18071 -33984 -78887 -107728 -114868 -98953 -63393
373 -63393 -15385 35801 80222 108494 114407 96293 58133 8639 -41450 -82139 -106217 -109495
385 -109495 -91437 -55149 -7447 42147 83342 107455 109445 89222 50817 2560 -45880 -84447
397 -84447 -105472 -105156 -83977 -46591 -344 46100 83690 104584 103918 81719 42615 -4905 -50479
410 -50479 -85203 -102457 -99495 -76926 -38761 7180 51922 85980 102492 98085 73956 34865
422 34865 -11248 -54751 -86746 -100841 -94570 -69825 -31552 12904 54983 86150 99830 93088
434 93088 67375 27958 -16948 -58265 -87134 -97537 -87875 -61210 -23487 18201 57091 85828
446 85828 97587 88263 59692 18936 -24210 -61057 -85698 -94239 -84354 -56643 -16568 26396 62624
459 62624 85360 91707 80987 54440 15733 -27326 -64733 -87511 -91272 -76749 -48159 -10646
471 -10646 29053 63310 85023 89146 75357 46359 7868 -32505 -66430 -85859 -87141 -70746
483 -70746 -41368 -4678 33117 65560 85413 87185 70061 38484 504 -36381 -66136 -83655
495 -83655 -84740 -67762 -36093 2656 39140 66526 81055 80709 64937 35181 -3052 -41019 -69482
508 -69482 -82705 -78853 -59795 -29203 6949 41733 68088 80684 77120 58199 27521 -8909
520 -8909 -43811 -69838 -81208 -75803 -55015 -23377 12463 45301 68827 78486 72848 52872 22160
533 22160 -13561 -46808 -70021 -78303 -70431 -48956 -18336 15950 47537 69643 77130 68371 45924
546 45924 15113 -18168 -48268 -69422 -76471 -67225 -43942 -12019 21489 50314 69129 74139 63953
559 63953 41026 10533 -21457 -49728 -69323 -75260 -64372 -38316 -4643 27106 50584 64665
571 64665 69148 61902 40062 6335 -29709 -56380 -67980 -66111 -54793 -35212 -6558 27395 57007
584 57007 71761 68407 51437 27665 1208 -26663 -52324 -68795 -69568 -54063 -27768 2744 32048
597 32048 55483 67558 64675 48355 24122 -2405 -29043 -53479 -69296 -68585 -48995 -18176 11670
610 11670 33629 49118 60957 65005 53224 23439 -13766 -43016 -56577 -58059 -54549 -45846 -25778
623 -25778 6533 41158 63196 65891 53996 36178 15902 -8099 -34685 -56772 -65419 -58334 -39289
636 -39289 -13674 14439 40605 58324 61804 51527 33422 12479 -10661 -36509 -59274 -67884
648 -67884 -55884 -29334 -1998 18055 33555 49724 62739 60899 37684 1863 -28820 -44209
660 -44209 -48538 -50370 -50050 -39062 -12004 22780 50013 59717 54482 42370 26908 6504 -18840
673 -18840 -42816 -56863 -57374 -46227 -27147 -2403 24601 46661 56274 52350 40043 24335 4912
686 4912 -19991 -46026 -61672 -58073 -38352 -14940 3558 19095 37052 55049 61457 47227 17417
699 17417 -12483 -31189 -39615 -45342 -49589 -45047 -25239 5179 33396 49235 51982 46378 35445
712 35445 18116 -5051 -28870 -46034 -52432 -48782 -36434 -16410 8764 32531 47227 50037 43952
725 43952 32989 17066 -5566 -31574 -51138 -55101 -43673 -25639 -8883 6779 25126 44725
737 44725 56091 50525 29513 3767 -16857 -30340 -40179 -47104 -46175 -32659 -8875 16575 35703
750 35703 45441 46961 41164 27575 7105 -15418 -34139 -45041 -47398 -41224 -26563 -5164 17742
763 17742 35637 44458 44801 38473 25756 6089 -17465 -37800 -47675 -45139 -34188 -19718 -3428
776 -3428 14926 33656 46802 48322 37161 18195 -1783 -19436 -33647 -43183 -45021 -36594 -19343
789 -19343 1794 21260 35745 43395 43177 34283 17839 -2310 -21652 -36164 -43469 -42334 -32652
802 -32652 -15940 4015 22650 36184 42438 40906 31612 15477 -4636 -24013 -37642 -42816 -39228
815 -39228 -28693 -13106 5215 23308 36926 42766 39620 28226 11578 -7287 -24672 -37131
827 -37131 -41950 -37993 -26466 -9967 8227 24798 36542 41094 37382 25965 9092 -9554 -26111
840 -26111 -37201 -40616 -35749 -23865 -7440 10307 26220 36926 40078 34944 22763 6239 -11058
853 -11058 -26363 -36824 -39963 -34550 -21510 -4304 12946 27019 35746 38046 33236 21342 4430
866 4430 -13624 -28362 -36790 -37626 -31269 -19006 -2969 13871 27966 36333 37214 30775 18203 1807
880 1807 -15076 -28729 -36325 -36358 -29341 -16801 -958 15363 28956 36306 35742 28027 15283 57
894 57 -15338 -28580 -36376 -36235 -27865 -13620 2498 17213 28359 34508 34299 27146 13909 -2509
908 -2509 -18033 -29558 -34866 -33479 -25548 -12365 3487 18537 29577 34546 32692 24379 11310
921 11310 -4169 -18868 -29642 -34301 -32093 -23616 -10236 5141 19652 29912 33835 30885 22021
934 22021 9238 -5409 -19468 -29826 -34036 -30855 -21304 -7667 7070 20172 29458 32882 29894
947 29894 20592 7214 -7572 -20695 -29630 -32651 -29168 -19725 -6170 8575 21447 29708 31924
960 31924 27880 18394 5382 -8758 -21279 -29624 -31913 -27562 -17599 -4164 9972 22010 29551
973 29551 31128 26433 16513 3191 -10478 -22104 -29187 -30623 -25977 -15937 -2552 11399 22841
986 22841 29473 30035 24700 14598 1634 -11665 -22645 -29137 -29714 -24300 -13870 -700 12605 23267
1000 23267 29043 28872 23066 12758 117 -12821 -23307 -29066 -28623 -22479 -11788 1025 13595
1013 13595 23558 28825 28093 21551 10688 -2045 -14140 -23276 -28072 -27435 -21194 -10406 2598 14979
1027 14979 24137 28175 26547 19858 9176 -3250 -14992 -23807 -27788 -26222 -19329 -8588 3909
1040 3909 15653 24252 27686 25545 18363 7500 -4702 -15981 -24016 -27184 -25022 -17711 -7025 5116
1054 5116 16387 24251 27129 24453 16872 5914 -5975 -16618 -23893 -26544 -23874 -16415 -5405 6567
1068 6567 17235 24256 26308 23129 15394 4535 -7106 -17366 -23985 -25780 -22516 -14741 -4022 7517
1082 7517 17660 24262 25898 22048 13697 2879 -8253 -17761 -23732 -25095 -21441 -13360 -2542 8705
1096 8705 18238 23983 24887 20802 12472 1636 -9404 -18424 -23712 -24272 -19950 -11832 -1242 9681
1110 9681 18638 23764 24146 19654 11093 328 -10345 -18890 -23548 -23410 -18739 -10386 44 10532
1124 10532 19051 23656 23379 18226 9459 -988 -11098 -19106 -23234 -22661 -17631 -9004 1384 11477
1138 11477 19277 23227 22368 17090 8298 -2154 -11988 -19364 -22845 -21756 -16362 -7673 2518 12208
1152 12208 19504 22856 21588 15850 7036 -3221 -12717 -19576 -22641 -20953 -15148 -6290 3657 12831
1166 12831 19365 22288 20830 14992 5974 -4423 -13685 -19751 -21838 -19848 -14114 -5528 4423 13665
1180 13665 19973 22018 19508 13313 4629 -4934 -13797 -19862 -21747 -19178 -12744 -3940 5524 14017 19831
1195 19831 21462 18632 12228 3539 -5786 -14232 -20059 -21597 -18337 -11207 -2355 6361 13918 19149 21167
1210 21167 18778 11667 1887 -7809 -15137 -19145 -19898 -17360 -11314 -2306 7567 15616 19855 19931 16478
1225 16478 10100 1670 -7433 -15338 -19899 -20061 -16300 -9423 -698 8291 15631 19527 19406 15585 9145
1240 9145 942 -7989 -15957 -20535 -19878 -14740 -7364 481 7943 14702 19534 20341 15869 7371 -2031
1255 -2031 -9785 -15033 -18248 -18670 -15419 -8061 1623 10578 16498 18699 17809 13928 7285 -1374 -10054
1270 -10054 -16454 -19239 -18136 -13617 -6400 2354 10717 16447 18512 17139 13071 6605 -1840 -10800 -17545
1285 -17545 -19737 -16985 -11275 -4695 2310 9629 16394 19889 18178 11842 3514 -4167 -10447 -15360 -18349
1300 -18349 -17713 -12637 -4046 4940 12046 16304 17679 16182 11543 4120 -4406 -11853 -16614 -18109 -16211
1315 -16211 -10995 -3170 5387 12359 16368 17262 15438 10923 3682 -5194 -13169 -17642 -17608 -14169 -9204
1330 -9204 -2979 4425 12158 17651 18582 14827 8353 1195 -5463 -11637 -16409 -18116 -15460 -8959 -745
1345 -745 6928 12684 16286 17033 14431 8613 905 -6718 -12818 -16600 -17213 -14256 -8039 -59 7491 13200
1361 13200 16103 16332 13823 8190 256 -7947 -14000 -16528 -15836 -12657 -7359 -357 7514 14053 17309
1376 17309 16292 12089 6065 -659 -7517 -13363 -16845 -16533 -12411 -5863 1583 8428 13647 16437 15842
1391 15842 11979 5622 -1792 -8639 -13919 -16490 -15851 -11621 -4990 2384 9097 13889 16137 15338 11337
1406 11337 4811 -2816 -9561 -14227 -16027 -14792 -10812 -4560 2889 9805 14607 16146 14503 10057 3810
1421 3810 -3198 -9753 -14468 -16133 -14435 -9914 -3341 3761 10149 14501 15988 14069 9358 2867 -4115
1436 -4115 -10304 -14557 -15827 -13937 -9036 -2555 4473 10579 14638 15617 13460 8654 2113 -4890 -10857
1451 -10857 -14616 -15546 -13213 -8268 -1682 5250 11076 14661 15301 12940 7857 1186 -5617 -11192 -14582
1466 -14582 -15074 -12618 -7564 -882 5925 11467 14758 14980 12248 7082 422 -6217 -11613 -14600 -14783
1481 -14783 -11993 -6731 -123 6566 11985 14763 14485 11505 6296 -223 -6792 -12097 -14787 -14384 -11184
1496 -11184 -5685 714 7068 12092 14761 14374 10914 5330 -1278 -7509 -12166 -14635 -13998 -10618 -5050
1511 -5050 1524 7772 12420 14580 13831 10297 4559 -2010 -8044 -12526 -14451 -13594 -9908 -4273 2324
1526 2324 8394 12666 14314 13221 9516 3890 -2620 -8650 -12834 -14356 -12968 -9068 -3432 2870 8736
1541 8736 12863 14380 12878 8768 2917 -3348 -9019 -12932 -14174 -12624 -8470 -2548 3690 9296 12959
1556 12959 14079 12423 8107 2249 -4067 -9486 -12958 -13941 -12116 -7776 -1873 4378 9697 13068 13783
1571 13783 11750 7420 1469 -4740 -9929 -13133 -13729 -11471 -7004 -1112 4919 10044 13147 13645 11274
1586 11274 6634 759 -5207 -10228 -13168 -13434 -11027 -6337 -398 5541 10361 13205 13273 10705 5974
1601 5974 106 -5862 -10599 -13172 -13082 -10364 -5635 257 6139 10735 13153 12897 10069 5274 -604 -6410
1617 -6410 -10833 -13167 -12802 -9807 -4865 1031 6564 10965 13089 12608 9496 4549 -1369 -6940 -11111
1632 -11111 -13133 -12332 -9149 -4131 1709 7134 11217 13074 12108 8892 3792 -2027 -7499 -11286 -12940
1647 -12940 -11910 -8511 -3411 2379 7661 11407 12905 11766 8193 3052 -2718 -7936 -11531 -12840 -11578
1662 -11578 -7810 -2691 3120 8137 11608 12799 11226 7547 2365 -3402 -8412 -11690 -12651 -11005 -7188
1677 -7188 -1906 3701 8556 11738 12489 10792 6824 1564 -3995 -8777 -11772 -12380 -10552 -6507 -1248
1692 -1248 4325 8952 11770 12251 10263 6224 890 -4585 -9127 -11767 -12147 -9990 -5866 -528 4861
1707 4861 9342 11847 12070 9740 5446 227 -5165 -9497 -11871 -11891 -9436 -5161 166 5446 9590 11875
1723 11875 11691 9178 4820 -508 -5682 -9724 -11905 -11533 -8854 -4537 734 5959 9926 11865 11425
1738 11425 8673 4194 -1108 -6158 -9981 -11778 -11215 -8438 -3893 1455 6346 10076 11731 11045 8076
1753 8076 3516 -1772 -6652 -10160 -11671 -10839 -7716 -3200 2046 6839 10289 11626 10701 7571 2815
1768 2815 -2344 -7068 -10304 -11544 -10410 -7243 -2542 2581 7213 10445 11486 10269 6879 2205 -2927
1783 -2927 -7492 -10471 -11394 -9961 -6654 -1897 3148 7689 10586 11297 9743 6292 1529 -3446 -7889
1798 -7889 -10633 -11261 -9539 -5951 -1159 3802 7974 10607 11095 9414 5763 976 -4072 -8246 -10699
1813 -10699 -10935 -9014 -5329 -546 4266 8289 10686 10886 8938 5072 293 -4611 -8528 -10627 -10696 -8581
1829 -8581 -4814 15 4875 8683 10727 10515 8365 4477 -226 -4925 -8733 -10728 -10563 -8201 -4069
1844 -4069 737 5249 8738 10580 10270 8010 4032 -872 -5591 -9070 -10643 -10187 -7541 -3524 1068
1859 1068 5590 8946 10642 10056 7471 3219 -1534 -5947 -9083 -10499 -9877 -7213 -3093 1683 6223
1874 6223 9317 10508 9574 6756 2787 -1815 -6168 -9386 -10644 -9544 -6483 -2255 2378 6346 9248
1889 9248 10250 9354 6473 2171 -2636 -6846 -9510 -10287 -8938 -6076 -1895 2731 6806 9574 10374 8885
1905 8885 5642 1409 -3190 -6940 -9441 -10110 -8772 -5674 -1209 3507 7372 9643 9931 8189 5110
1920 5110 1081 -3393 -7342 -9855 -10171 -8225 -4680 -390 3862 7255 9504 9908 8253 4805 251
1935 251 -4230 -7740 -9564 -9575 -7720 -4429 -194 4277 7872 9794 9573 7518 3977 -340 -4524 -7744
1951 -7744 -9612 -9503 -7505 -3933 577 4970 8123 9529 9082 6995 3592 -533 -4888 -8257 -9874
1966 -9874 -9288 -6835 -3133 1101 4983 8016 9581 9190 6845 2992 -1349 -5336 -8184 -9388 -8857 -6516
1982 -6516 -2876 1512 5534 8445 9622 8694 6184 2434 -1793 -5537 -8214 -9402 -8680 -6143 -2229
1997 -2229 2149 5944 8531 9283 8263 5765 2088 -2114 -5987 -8667 -9483 -8235 -5428 -1694 2384
2012 2384 6040 8588 9325 8125 5222 1358 -2851 -6273 -8515 -9222 -7891 -5102 -1221 3014 6511
2027 6511 8749 9085 7667 4701 836 -3237 -6554 -8716 -9085 -7619 -4604 -592 3462 6777 8693
2042 8693 8892 7327 4287 419 -3622 -6810 -8737 -8830 -7070 -3986 -105 3870 6967 8749 8738 6910
2058 6910 3796 -223 -4074 -7049 -8629 -8513 -6715 -3520 401 4308 7204 8789 8527 6496 3278
2073 3278 -718 -4400 -7216 -8691 -8256 -6362 -3038 895 4643 7395 8688 8266 6025 2706 -1245
2088 -1245 -4769 -7388 -8638 -8064 -5943 -2452 1455 5040 7607 8587 7948 5630 2262 -1619 -5115 -7622
2104 -7622 -8560 -7767 -5426 -1995 1845 5249 7697 8556 7653 5212 1786 -2154 -5488 -7720 -8370 -7437
2120 -7437 -5063 -1636 2243 5603 7848 8449 7323 4699 1190 -2498 -5718 -7793 -8366 -7196 -4520
2135 -4520 -991 2709 5840 7835 8256 7053 4380 814 -2945 -6029 -7904 -8090 -6740 -4157 -616
2150 -616 3091 6080 7913 8133 6674 3932 323 -3331 -6270 -7924 -7950 -6426 -3683 -153 3479 6336
2166 6336 8021 7950 6246 3374 -112 -3670 -6444 -7931 -7871 -6078 -3190 411 3846 6489 7936 7701
2182 7701 5925 3000 -660 -4109 -6696 -7887 -7567 -5727 -2676 833 4215 6680 7965 7435 5542
2197 5542 2531 -1108 -4503 -6885 -7824 -7367 -5330 -2294 1312 4516 6904 7892 7230 5216 2041 -1431
2213 -1431 -4700 -6956 -7861 -7073 -4987 -1827 1689 4803 6966 7765 6978 4784 1645 -1924 -5055 -7098
2229 -7098 -7741 -6787 -4616 -1407 2071 5155 7132 7716 6736 4380 1232 -2327 -5269 -7242 -7652 -6532
2245 -6532 -4166 -1014 2496 5330 7150 7532 6396 4025 747 -2643 -5515 -7270 -7563 -6266 -3803
2260 -3803 -466 2818 5665 7322 7515 6043 3631 333 -3037 -5753 -7264 -7388 -5997 -3403 -63
2275 -63 3278 5844 7269 7205 5779 3167 -109 -3335 -5917 -7360 -7209 -5613 -2912 369 3535 5995
2291 5995 7358 7116 5435 2725 -541 -3795 -6134 -7297 -6990 -5213 -2532 810 3919 6223 7284
2306 7284 6867 5110 2289 -981 -4057 -6369 -7274 -6759 -4958 -2127 1234 4233 6392 7201 6638 4669
2322 4669 1889 -1379 -4469 -6472 -7270 -6502 -4501 -1676 1594 4582 6517 7224 6415 4325 1446 -1786
2338 -1786 -4656 -6586 -7137 -6310 -4224 -1240 2046 4782 6657 7139 6123 3972 960 -2203 -4974 -6706
2354 -6706 -7090 -6037 -3832 -799 2405 5083 6727 7039 5924 3533 559 -2586 -5160 -6728 -7009 -5832
2370 -5832 -3449 -434 2814 5344 6849 6875 5584 3203 203 -2941 -5320 -6868 -6849 -5490 -3066 61
2386 61 3123 5499 6843 6757 5304 2836 -249 -3194 -5595 -6831 -6761 -5233 -2691 410 3411 5728
2402 5728 6852 6667 5025 2426 -635 -3611 -5823 -6809 -6499 -4846 -2243 810 3755 5933 6798 6443
2418 6443 4655 1932 -1131 -4007 -5955 -6844 -6289 -4489 -1925 1236 4120 6071 6852 6127 4251 1610
2434 1610 -1421 -4248 -6134 -6800 -6141 -4204 -1404 1730 4383 6181 6683 5975 4048 1194 -1963 -4560
2450 -4560 -6253 -6671 -5739 -3823 -1020 2006 4606 6336 6686 5781 3593 701 -2300 -4782 -6308 -6592
2466 -6592 -5548 -3526 -619 2402 4928 6460 6654 5361 3143 371 -2526 -4920 -6522 -6573 -5310 -3037
2482 -3037 -131 2757 5006 6328 6489 5215 2963 -117 -3093 -5254 -6389 -6295 -4968 -2715 143 3087
2498 3087 5400 6534 6411 4888 2465 -434 -3379 -5339 -6440 -6159 -4773 -2439 569 3442 5576
2513 5576 6471 6040 4494 2123 -682 -3549 -5604 -6604 -6114 -4281 -1786 1029 3548 5526 6434 6088
2529 6088 4383 1692 -1353 -3950 -5712 -6380 -5756 -4117 -1539 1335 4028 5736 6450 5732 3907 1266
2545 1266 -1590 -4166 -5828 -6326 -5630 -3835 -1245 1854 4372 5947 6233 5367 3574 1016 -1888 -4458
2561 -4458 -6111 -6410 -5350 -3216 -587 2054 4334 5950 6303 5454 3242 488 -2481 -4704 -5984 -6105
2577 -6105 -5167 -3050 -300 2463 4721 6051 6165 5021 2789 32 -2708 -4827 -6070 -6128 -4915 -2706
2593 -2706 119 2935 4981 6093 5878 4627 2581 -124 -2965 -5125 -6302 -5944 -4443 -2194 489
2608 489 3050 5040 6139 5924 4502 2049 -710 -3300 -5190 -6043 -5703 -4273 -1881 855 3428 5319
2624 5319 6035 5632 4084 1711 -1043 -3563 -5324 -6108 -5639 -4016 -1578 1286 3829 5423 5964 5451
2640 5451 3885 1504 -1379 -3897 -5574 -6030 -5300 -3604 -1111 1551 3953 5535 6051 5282 3426 1004
2656 1004 -1747 -4083 -5585 -6075 -5155 -3284 -766 1943 4278 5663 5923 5082 3085 538 -2063 -4303
2672 -4303 -5582 -5848 -4935 -2993 -369 2322 4478 5714 5750 4831 2822 219 -2340 -4564 -5764 -5869
2688 -5869 -4755 -2622 -53 2632 4638 5757 5724 4559 2425 -165 -2681 -4716 -5826 -5632 -4430 -2317
2704 -2317 311 2938 4809 5784 5584 4157 2048 -585 -3069 -4897 -5825 -5462 -4109 -1946 692 3252
2720 3252 5069 5786 5357 3855 1693 -993 -3303 -5006 -5782 -5392 -3883 -1485 1135 3475 5126 5762
2736 5762 5203 3613 1373 -1246 -3638 -5217 -5695 -5086 -3420 -1101 1431 3786 5243 5714 4989 3330
2752 3330 983 -1620 -3857 -5305 -5670 -4864 -3197 -799 1740 3960 5423 5699 4771 2976 591 -1946
2768 -1946 -4075 -5337 -5572 -4678 -2846 -423 2104 4135 5407 5527 4585 2670 223 -2244 -4291 -5381
2784 -5381 -5446 -4419 -2501 -66 2425 4366 5436 5414 4385 2330 -111 -2620 -4505 -5376 -5241 -4187
2800 -4187 -2226 238 2718 4671 5512 5291 4049 1970 -485 -2848 -4610 -5460 -5344 -3917 -1839 638
2816 638 2968 4645 5463 5132 3706 1616 -808 -3133 -4743 -5366 -4976 -3618 -1498 1022 3293 4896
2832 4896 5441 4936 3493 1323 -1136 -3428 -4864 -5367 -4781 -3307 -1139 1321 3504 4978 5378 4736
2848 4736 3249 930 -1553 -3627 -4925 -5289 -4600 -3018 -781 1680 3724 5066 5283 4574 2796 566
2864 566 -1863 -3863 -5016 -5287 -4352 -2688 -395 2024 3882 5087 5197 4195 2559 199 -2165 -4082
2880 -4082 -5140 -5182 -4083 -2262 -6 2211 4063 5105 5107 4095 2180 -147 -2491 -4220 -5050 -4998 -3925
2897 -3925 -2098 296 2522 4222 5148 5025 3744 1932 -455 -2722 -4353 -5088 -4808 -3620 -1675 620
2913 620 2810 4374 5110 4766 3560 1546 -786 -2963 -4450 -5073 -4712 -3355 -1337 948 3069 4459
2929 4459 5056 4638 3212 1121 -1112 -3148 -4540 -5032 -4502 -3136 -1007 1295 3261 4607 4998 4367
2945 4367 2939 897 -1386 -3421 -4677 -4974 -4297 -2737 -673 1565 3505 4702 4892 4214 2679 527
2961 527 -1706 -3582 -4801 -4905 -4127 -2473 -338 1862 3672 4720 4818 4010 2336 156 -1935 -3690
2977 -3690 -4707 -4775 -3852 -2184 -35 2119 3843 4654 4705 3789 1999 -154 -2267 -3892 -4795 -4652 -3646
2994 -3646 -1861 269 2450 3939 4831 4616 3513 1716 -498 -2464 -4019 -4731 -4491 -3314 -1470 657
3010 657 2575 4105 4666 4395 3186 1402 -721 -2704 -4145 -4715 -4410 -3154 -1217 932 2893 4150
3026 4150 4665 4237 2929 1098 -1028 -2903 -4233 -4666 -4145 -2795 -864 1201 3072 4201 4589 4041
3042 4041 2667 759 -1297 -3129 -4276 -4617 -3965 -2550 -584 1457 3169 4334 4494 3845 2358 441
3058 441 -1597 -3304 -4299 -4453 -3710 -2281 -267 1742 3412 4365 4427 3604 1981 114 -1803 -3444 -4280
3075 -4280 -4393 -3522 -1974 61 2024 3529 4377 4334 3368 1807 -128 -2101 -3614 -4335 -4255 -3281 -1725
3092 -1725 283 2253 3628 4331 4170 3152 1555 -454 -2203 -3676 -4312 -4109 -2994 -1421 537 2413
3108 2413 3786 4327 4076 2861 1242 -696 -2438 -3774 -4327 -4033 -2785 -1089 873 2586 3782 4356
3124 4356 3890 2742 930 -1017 -2732 -3820 -4226 -3824 -2568 -832 1160 2853 3890 4200 3670 2435
3140 2435 687 -1222 -2844 -3878 -4113 -3612 -2339 -537 1319 3028 3983 4098 3428 2135 408 -1422
3156 -1422 -3021 -3982 -4145 -3356 -1992 -197 1575 3035 3951 4067 3326 1859 -31 -1814 -3090 -3889 -3971
3173 -3971 -3155 -1786 23 1823 3240 3960 3918 3043 1649 -159 -1932 -3252 -3868 -3831 -2990 -1533 275
3190 275 2043 3313 3951 3650 2830 1415 -358 -2079 -3336 -3962 -3639 -2706 -1219 505 2056 3420 3866
3207 3866 3678 2610 1059 -718 -2288 -3365 -3810 -3527 -2539 -1023 732 2266 3459 3801 3423 2429 797
3224 797 -952 -2386 -3401 -3806 -3396 -2258 -731 975 2463 3481 3757 3327 2185 638 -1060 -2591
3240 -2591 -3540 -3724 -3168 -1992 -463 1125 2559 3538 3711 3167 1910 291 -1283 -2681 -3483 -3589 -3068
3257 -3068 -1779 -186 1445 2758 3527 3640 2921 1639 64 -1526 -2769 -3458 -3542 -2858 -1599 -72 1581
3274 1581 2855 3466 3452 2764 1493 -121 -1706 -2915 -3456 -3375 -2623 -1363 148 1692 2886 3504 3319
3291 3319 2562 1207 -272 -1824 -2937 -3439 -3274 -2411 -1126 407 1827 2968 3436 3227 2299 1007 -558
3308 -558 -1970 -2977 -3441 -3146 -2223 -869 654 2092 3013 3418 3047 2117 727 -819 -2100 -3094 -3347
3325 -3347 -2946 -2011 -563 856 2154 3085 3318 2897 1961 515 -927 -2233 -3101 -3269 -2764 -1811 -421
3342 -421 1048 2323 3083 3233 2769 1640 290 -1185 -2376 -3105 -3190 -2649 -1632 -189 1233 2427 3022
3359 3022 3093 2531 1486 75 -1303 -2431 -3091 -3087 -2430 -1339 29 1418 2430 3082 3083 2356 1301 -85
3377 -85 -1510 -2503 -3036 -2948 -2283 -1149 220 1580 2507 2977 2896 2218 1028 -299 -1643 -2553 -3021 -2876 -2131
3396 -2131 -938 430 1626 2609 3036 2746 2045 874 -485 -1689 -2574 -2974 -2734 -1921 -784 538 1804
3413 1804 2610 2966 2606 1848 708 -678 -1819 -2701 -2944 -2600 -1710 -550 768 1853 2641 2882 2539 1641
3431 1641 527 -795 -1983 -2653 -2863 -2471 -1528 -312 909 1899 2678 2766 2384 1461 273 -960 -1928 -2676
3449 -2676 -2778 -2302 -1389 -167 1055 2038 2639 2726 2195 1311 72 -1110 -2098 -2671 -2696 -2161 -1145 -28
3467 -28 1145 2129 2602 2639 2098 1182 -13 -1183 -2141 -2615 -2501 -1977 -1050 213 1285 2169 2597 2466 1969
3486 1969 955 -244 -1338 -2169 -2536 -2461 -1824 -892 324 1435 2238 2518 2402 1729 786 -331 -1415 -2253
3504 -2253 -2560 -2340 -1700 -711 384 1471 2212 2492 2277 1611 649 -473 -1529 -2250 -2478 -2231 -1550 -543
3522 -543 552 1596 2269 2429 2159 1479 487 -624 -1560 -2268 -2492 -2177 -1380 -405 746 1708 2274 2349 2070
3541 2070 1303 352 -804 -1672 -2216 -2346 -2034 -1246 -250 873 1708 2243 2328 1948 1180 145 -874 -1744 -2193
3560 -2193 -2300 -1859 -1107 -99 940 1781 2224 2224 1778 1015 16 -968 -1751 -2208 -2245 -1771 -954 37 1010 1795
3580 1795 2191 2134 1718 885 -51 -1080 -1799 -2230 -2129 -1622 -825 150 1130 1847 2190 2078 1553 781 -248
3599 -248 -1197 -1905 -2176 -1993 -1535 -689 338 1202 1883 2168 2081 1435 643 -307 -1149 -1876 -2132 -2001 -1449 -579
3619 -579 341 1298 1855 2107 1974 1309 452 -475 -1317 -1891 -2097 -1906 -1316 -462 471 1338 1959 2046 1862 1246
3639 1246 380 -528 -1373 -1846 -2041 -1793 -1231 -387 602 1399 1907 1994 1793 1135 256 -667 -1369 -1894 -1956 -1748
3659 -1748 -1053 -272 698 1431 1909 2018 1674 982 130 -735 -1446 -1815 -1959 -1586 -960 -129 716 1376 1947 1974
3679 1974 1504 896 72 -870 -1475 -1880 -1857 -1560 -871 -81 776 1481 1895 1890 1503 733 25 -828 -1431 -1816 -1759
3700 -1759 -1387 -730 13 855 1448 1836 1768 1397 696 -137 -922 -1490 -1785 -1726 -1348 -736 141 888 1532 1784
3720 1784 1722 1283 703 -220 -998 -1556 -1732 -1687 -1244 -558 215 993 1600 1759 1649 1188 494 -252 -1092 -1533
3740 -1533 -1802 -1591 -1195 -485 269 1026 1566 1728 1609 1136 426 -389 -1092 -1558 -1656 -1552 -1072 -428 350 1096
3760 1096 1501 1768 1534 1020 298 -475 -1146 -1608 -1614 -1555 -949 -231 478 1080 1548 1709 1465 964 265 -529 -1220
3781 -1220 -1550 -1629 -1426 -880 -205 525 1184 1537 1672 1424 902 187 -568 -1283 -1569 -1578 -1326 -808 -188 553 1198
3802 1198 1600 1623 1349 774 25 -614 -1238 -1596 -1654 -1339 -726 -37 653 1177 1534 1539 1287 784 57 -698 -1250
3823 -1250 -1575 -1582 -1190 -613 14 689 1168 1520 1555 1225 577 -85 -714 -1256 -1492 -1541 -1224 -597 24 773 1298
3844 1298 1558 1444 1142 529 -91 -742 -1329 -1583 -1463 -1077 -552 147 776 1180 1489 1424 1045 599 -176 -838
3864 -838 -1361 -1537 -1408 -1028 -472 217 756 1281 1458 1401 1027 488 -244 -895 -1292 -1502 -1328 -1000 -350 311
3884 311 904 1308 1482 1382 991 368 -274 -906 -1339 -1524 -1368 -906 -315 316 904 1344 1427 1360 896 296 -376
3905 -376 -908 -1433 -1478 -1319 -860 -225 387 950 1386 1405 1220 902 277 -375 -965 -1369 -1415 -1252 -815 -154 465
3926 465 1028 1321 1412 1237 758 140 -462 -998 -1372 -1425 -1203 -728 -137 598 1032 1344 1356 1165 689 129 -493
3947 -493 -1050 -1392 -1482 -1189 -615 -57 548 1120 1352 1360 1162 638 89 -477 -1060 -1362 -1397 -1070 -680 -32 615
3968 615 1086 1359 1336 1074 586 -95 -649 -1131 -1370 -1345 -1067 -589 74 669 1166 1386 1314 972 535 -85 -683
3989 -683 -1089 -1301 -1327 -1022 -482 143 671 1142 1377 1317 961 490 -132 -741 -1145 -1336 -1307 -998 -499 177 755
4010 755 1208 1401 1233 893 368 -240 -727 -1182 -1393 -1297 -972 -399 223 858 1204 1354 1159 820 378 -266
4030 -266 -794 -1227 -1336 -1240 -837 -381 257 846 1204 1334 1184 840 282 -341 -823 -1160 -1388 -1186 -921 -274
4050 -274 355 931 1250 1311 1192 758 210 -372 -941 -1192 -1340 -1136 -688 -223 455 975 1285 1369 1079 682 169
4071 169 -438 -919 -1227 -1314 -1126 -720 -129 445 970 1305 1341 1067 661 101 -487 -991 -1264 -1292 -1048 -648 -113
4092 -113 525 1068 1325 1332 1045 613 29 -594 -932 -1264 -1249 -1042 -645 19 590 1082 1289 1291 1004 556 -41 -649
4114 -649 -1020 -1229 -1268 -1008 -565 70 679 1155 1342 1293 942 437 -110 -671 -1114 -1247 -1194 -944 -519 84 686
4135 686 1100 1305 1242 953 333 -169 -823 -1154 -1326 -1212 -922 -405 111 778 1168 1319 1256 850 308 -279 -801
4156 -801 -1187 -1325 -1154 -836 -333 233 796 1166 1279 1220 810 255 -332 -864 -1219 -1309 -1138 -823 -257 232 868
4177 868 1228 1351 1179 780 228 -441 -869 -1208 -1268 -1079 -726 -187 376 863 1267 1363 1093 709 121 -421 -979
4198 -979 -1260 -1254 -1058 -693 -199 450 895 1227 1279 1108 709 116 -549 -1026 -1248 -1300 -1028 -582 -43 475 915
4219 915 1329 1345 1018 610 51 -581 -988 -1272 -1197 -975 -544 14 583 1052 1288 1250 1077 548 -27 -640 -1065
4240 -1065 -1295 -1289 -919 -488 115 652 1127 1335 1259 967 467 -145 -676 -1129 -1277 -1209 -867 -446 118 632 1102
4261 1102 1284 1205 885 354 -206 -692 -1135 -1333 -1145 -844 -329 277 717 1161 1332 1126 862 321 -244 -775
4281 -775 -1212 -1341 -1156 -785 -275 336 820 1091 1293 1197 811 335 -340 -903 -1284 -1268 -1100 -678 -158 366 797
4302 797 1171 1325 1126 764 115 -425 -903 -1261 -1261 -1094 -660 -93 426 941 1232 1263 1095 643 133 -506 -993
4323 -993 -1290 -1315 -1012 -620 -4 581 999 1220 1228 1022 611 109 -556 -1055 -1302 -1287 -938 -515 50 621 1005
4344 1005 1287 1243 1006 520 -24 -631 -975 -1237 -1270 -950 -459 132 637 1097 1264 1210 961 431 -129 -563 -1096
4365 -1096 -1233 -1201 -937 -382 203 769 1084 1213 1201 849 377 -165 -750 -1177 -1259 -1172 -877 -380 291 779 1111
4386 1111 1302 1114 776 270 -250 -747 -1129 -1256 -1206 -756 -217 350 853 1180 1278 1103 672 196 -288 -795
4406 -795 -1230 -1294 -1129 -760 -136 450 862 1202 1289 1062 718 169 -420 -949 -1232 -1262 -1009 -698 -132 459 900
4427 900 1213 1230 892 618 22 -534 -858 -1161 -1254 -1010 -610 -89 570 957 1199 1199 970 515 22 -566 -960
4448 -960 -1255 -1202 -1001 -464 -5 615 944 1213 1209 912 439 -136 -696 -1081 -1200 -1221 -935 -379 30 650 1073
4469 1073 1305 1164 837 399 -145 -708 -1075 -1248 -1191 -845 -370 193 682 1132 1255 1170 809 305 -250 -735
4489 -735 -1099 -1242 -1102 -770 -263 336 755 1129 1257 1096 747 222 -283 -787 -1123 -1210 -1025 -781 -280 392
4509 392 811 1158 1223 1093 703 122 -351 -795 -1172 -1182 -1031 -706 -140 422 901 1175 1177 1027 623 74 -447
4530 -447 -859 -1174 -1213 -949 -606 -84 425 932 1171 1261 1010 501 30 -569 -922 -1087 -1124 -901 -487 52 474
4551 474 925 1167 1145 887 489 -6 -579 -945 -1189 -1140 -834 -368 30 551 1048 1201 1167 836 454 -95 -622
4572 -622 -977 -1194 -1077 -830 -403 131 614 1037 1148 1120 831 333 -166 -742 -1031 -1226 -1045 -756 -324 169
4592 169 664 1080 1145 1082 769 299 -376 -848 -1076 -1163 -1079 -712 -246 213 755 1043 1114 1028 669 170 -289 -752
4614 -752 -1076 -1195 -981 -667 -116 353 792 1009 1108 1012 638 141 -391 -830 -1130 -1155 -929 -535 -62 455 886
4635 886 1065 1111 941 606 47 -511 -915 -1072 -1103 -900 -531 -17 503 858 1110 1120 911 418 -69 -554 -913
4656 -913 -1115 -1126 -875 -400 28 517 949 1087 1074 812 431 -106 -610 -1000 -1164 -1046 -768 -398 103 591 900
4677 900 1125 1100 786 337 -158 -633 -1042 -1133 -997 -730 -276 147 636 992 1087 986 740 192 -153 -612 -1003
4698 -1003 -1154 -1019 -646 -262 301 701 959 1035 968 678 214 -311 -722 -1005 -1134 -903 -590 -162 287 686
4718 686 1009 1030 916 554 145 -287 -777 -985 -1038 -931 -547 -59 324 855 1042 1030 834 499 120 -405 -800
4739 -800 -1028 -1134 -821 -492 0 440 767 1009 1055 810 478 18 -492 -867 -1060 -1021 -860 -458 56 462 823
4760 823 1014 948 832 398 -41 -517 -783 -1020 -999 -700 -390 124 595 876 1014 1011 688 316 -104 -551 -880
4781 -880 -1027 -919 -672 -229 185 552 863 1000 955 733 303 -191 -501 -891 -998 -961 -664 -244 214 620 882
4802 882 1018 928 638 185 -203 -556 -923 -948 -878 -495 -157 271 683 873 1015 764 576 169 -315 -647 -944
4823 -944 -1000 -870 -611 -72 364 730 886 951 794 497 83 -307 -660 -918 -998 -762 -509 -60 378 696 919
4844 919 960 788 401 10 -347 -653 -866 -962 -733 -430 10 407 785 983 849 700 342 -77 -435 -711 -876
4865 -876 -858 -741 -355 4 499 763 948 864 616 374 -41 -431 -762 -846 -854 -685 -319 88 471 774 932 888
4887 888 612 318 -79 -480 -724 -926 -843 -601 -278 204 543 804 969 820 579 240 -244 -512 -722 -874
4907 -874 -742 -570 -146 178 583 764 895 765 511 236 -231 -506 -702 -891 -787 -527 -183 170 575 779
4927 779 852 730 519 67 -303 -607 -734 -787 -696 -494 -118 196 613 806 861 664 396 71 -281 -585 -787
4948 -787 -785 -718 -437 25 356 642 854 779 664 346 29 -281 -638 -817 -770 -605 -352 27 359 635 839 760
4970 760 629 357 -101 -378 -639 -764 -682 -589 -296 -34 336 690 770 771 505 233 -86 -409 -673 -864 -721 -553
4992 -553 -262 152 415 654 714 706 558 240 -119 -475 -736 -771 -739 -462 -191 154 457 664 825 749 547 199
5014 199 -174 -455 -633 -724 -637 -428 -150 181 483 630 732 633 435 169 -227 -553 -684 -747 -634 -388 -147
5035 -147 261 472 643 691 614 403 86 -248 -563 -641 -783 -623 -366 -108 234 547 623 730 641 335 -40 -262
5057 -262 -574 -639 -650 -562 -275 -61 268 496 651 711 596 347 27 -323 -597 -660 -686 -443 -313 46 291 500
5079 500 694 682 458 293 -27 -286 -523 -784 -610 -510 -285 -2 274 487 701 667 447 238 -19 -370 -596
5100 -596 -660 -637 -456 -175 63 403 578 688 633 467 169 -78 -392 -602 -695 -615 -445 -200 95 393 569 581
5122 581 587 358 162 -153 -385 -594 -661 -571 -404 -202 115 404 550 588 626 399 113 -181 -339 -584 -612 -517 -351
5145 -351 -83 145 435 625 596 559 327 56 -169 -425 -572 -623 -547 -286 -89 138 383 533 588 509 349 68
5167 68 -202 -443 -562 -614 -520 -317 -61 208 420 540 514 480 219 29 -156 -442 -563 -564 -478 -309 -36 254 477
5190 477 578 539 419 257 29 -214 -474 -640 -553 -487 -259 65 296 492 615 574 409 234 -55 -287 -469
5211 -469 -568 -559 -399 -242 61 282 458 518 569 374 160 -23 -380 -504 -541 -588 -403 -188 72 360 432 504 510 407
5235 407 176 -108 -303 -488 -558 -523 -341 -137 144 262 504 588 466 283 74 -146 -363 -467 -482 -490 -350 -104
5257 -104 111 303 551 518 519 298 111 -76 -347 -486 -496 -476 -304 -26 135 340 488 543 413 193 -13 -138
5279 -138 -308 -429 -414 -480 -256 -42 182 391 473 444 404 197 21 -153 -362 -500 -441 -365 -238 -32 236 359
5301 359 490 528 430 264 26 -192 -287 -486 -571 -322 -228 33 269 371 478 477 424 209 5 -202 -327 -485 -472
5324 -472 -424 -221 9 198 374 411 406 381 150 8 -161 -406 -398 -446 -381 -157 -15 255 435 503 460 342 147 -84
5348 -84 -238 -340 -485 -468 -333 -221 57 273 410 422 471 318 86 -35 -226 -294 -464 -448 -272 -148 87 283
5370 283 374 416 418 262 162 -108 -227 -410 -419 -414 -288 -146 110 264 410 429 382 275 66 -108 -294 -367 -486 -313
5394 -313 -334 -100 140 253 409 398 431 232 42 -99 -298 -409 -480 -319 -236 -87 161 249 362 428 341 212 26
5417 26 -85 -302 -415 -396 -379 -202 -35 159 316 392 452 309 227 52 -150 -280 -428 -324 -286 -283 -57 153 364
5440 364 397 441 293 185 -23 -175 -264 -372 -396 -291 -149 -27 131 339 386 393 345 69 7 -185 -313 -368 -398 -302
5464 -302 -172 -26 203 379 389 391 271 163 -50 -232 -373 -379 -404 -303 -207 25 144 333 384 390 321 65 2 -173
5488 -173 -325 -361 -286 -260 -127 10 164 325 331 379 266 137 -26 -245 -312 -316 -377 -216 -118 57 227 380 366 431
5512 431 259 77 -135 -202 -335 -405 -286 -330 -145 111 235 308 364 311 226 13 -158 -269 -337 -341 -318 -235 -70 98
5536 98 239 310 332 306 230 76 -176 -249 -326 -332 -267 -128 -101 84 235 330 412 299 251 95 -122 -253 -363 -340 -328
5561 -328 -174 1 118 195 367 351 244 224 8 -138 -249 -374 -409 -275 -148 25 152 262 307 316 319 271 20
5584 20 -189 -316 -237 -307 -242 -88 -31 63 257 349 376 251 154 23 -100 -241 -353 -308 -248 -84 21 138 318 337
5608 337 322 253 114 36 -112 -298 -337 -371 -217 -159 52 215 232 358 285 312 97 -26 -168 -338 -316 -354 -253 -83
5632 -83 67 176 273 325 243 170 116 36 -181 -341 -284 -318 -206 -83 62 225 281 278 208 221 125 -66 -207 -245 -365
5657 -365 -344 -185 -54 65 201 231 364 233 213 105 -55 -224 -305 -309 -320 -200 -135 101 213 231 245 173 208 60
5681 60 -62 -147 -248 -319 -304 -192 -58 101 204 204 224 212 198 61 -48 -136 -341 -257 -261 -80 17 112 231 279 301 282
5707 282 136 6 -112 -188 -208 -278 -276 -203 43 142 252 342 264 325 191 31 -88 -151 -263 -352 -232 -145 5 103 195
5732 195 261 257 216 180 91 -74 -221 -331 -279 -218 -126 10 139 225 234 276 239 132 -14 -118 -198 -244 -256 -220 -165 -9
5758 -9 185 235 288 266 213 175 -3 -118 -233 -267 -320 -183 -143 -8 198 242 323 233 118 100 21 -131 -237 -279 -285 -213
5784 -213 -149 46 158 237 294 233 122 46 -23 -145 -239 -281 -291 -213 -147 17 118 279 267 281 171 -22 -51 -194 -170
5809 -170 -303 -331 -169 -114 70 202 253 267 228 79 39 -4 -124 -255 -275 -208 -188 -55 115 176 211 247 224 152 50
5834 50 -60 -132 -258 -213 -223 -217 -12 40 193 263 257 125 101 15 -66 -122 -207 -239 -247 -129 -42 95 203 272 270 196 157 36
5862 36 -89 -183 -207 -298 -242 -140 -50 67 202 256 254 232 130 49 -142 -207 -236 -244 -145 -82 -78 79 206 265 268 206 142 8
5890 8 -75 -211 -166 -203 -268 -163 -2 77 224 218 283 196 74 -13 -50 -212 -189 -209 -231 -117 19 125 149 263 280 210
5916 210 111 -20 -203 -279 -246 -164 -187 -71 -40 107 249 196 256 162 26 -51 -106 -174 -206 -312 -208 -68 15 61 252
5941 252 292 252 137 47 -26 -177 -213 -228 -216 -116 -102 27 107 109 240 315 187 94 -75 -202 -196 -169 -200 -123 -32 18 166
5968 166 203 207 203 118 66 -68 -169 -230 -253 -214 -189 -10 -13 138 207 264 185 199 123 -93 -166 -168 -188 -186 -155 -55 32 102 211
5997 211 189 244 139 37 -112 -144 -196 -184 -147 -116 -68 61 163 196 219 246 122 9 -53 -165 -273 -232 -179 -109 9
6022 9 48 75 161 282 228 131 26 -47 -117 -265 -242 -214 -115 -35 56 130 192 226 213 145 11 -103 -188 -181 -170 -192 -77 -3
6050 -3 -8 159 143 279 228 123 90 -88 -152 -230 -228 -126 -99 72 37 178 240 189 168 138 28 -146 -78 -209 -182 -139 -98
6077 -98 44 53 147 187 224 172 141 4 -166 -182 -250 -223 -192 -136 -8 104 135 226 236 172 161 -17 -144 -219 -201 -265 -158
6104 -158 -108 35 131 149 189 218 180 121 -98 -65 -188 -209 -172 -110 -27 25 140 199 162 204 212 108 -43 -95 -202 -201 -221
6131 -221 -136 -34 61 108 173 256 162 190 55 -19 -106 -188 -289 -222 -157 -25 52 169 152 187 185 123 57 -60 -168 -243 -290
6158 -290 -145 -171 -52 130 149 216 204 209 154 72 -115 -107 -136 -191 -153 -114 -54 86 219 235 211 174 151 14 9 -135 -227
6185 -227 -239 -249 -147 -5 96 157 183 145 203 214 110 -140 -111 -200 -254 -223 -148 42 45 166 201 267 219 107 71 -51
6211 -51 -174 -174 -219 -189 -140 -17 143 214 235 205 146 93 -15 -48 -199 -222 -318 -195 -95 -9 106 127 208 187 170 139 -11
6238 -11 -122 -178 -198 -245 -66 -95 -34 174 203 261 197 176 91 -84 -137 -92 -189 -269 -221 -168 -33 46 218 263 208 110 64
6265 64 -30 -11 -218 -256 -277 -106 -55 40 165 203 140 194 154 24 -71 -135 -114 -238 -216 -113 -73 86 106 225 274 230
6291 230 218 98 -37 -106 -154 -218 -246 -165 -68 53 172 138 237 177 130 -8 20 -147 -206 -318 -294 -170 -57 21 119
6316 119 227 252 250 167 61 -87 -188 -205 -221 -228 -203 -16 39 145 212 256 142 103 22 -34 -138 -144 -240 -209 -137 11 138
6343 138 189 231 235 244 92 -21 -82 -165 -217 -262 -254 -80 -31 129 188 202 267 240 97 10 -36 -156 -234 -247 -185 -77 -46 73
6371 73 239 269 205 168 104 -77 -36 -197 -283 -248 -166 -166 0 78 201 312 277 190 86 -37 -123 -202 -197 -308 -158 -116
6397 -116 -24 174 222 342 261 180 108 -16 -141 -227 -182 -242 -162 -143 -6 113 252 276 237 210 66 -36 -137 -246
6421 -246 -261 -210 -134 -79 15 132 196 270 223 233 63 -104 -178 -288 -307 -208 -132 -64 29 164 236 248 234 165 30 -102
6447 -102 -200 -280 -312 -298 -150 -64 47 169 265 284 213 186 0 -91 -177 -236 -233 -229 -101 -4 96 153 269 300 240 146 1
6474 1 -110 -172 -227 -247 -226 -172 51 66 165 215 213 259 82 62 -65 -250 -269 -360 -166 -148 16 100 219 202 261 227 197
6501 197 -7 -159 -189 -275 -271 -146 -117 -15 183 238 312 300 216 65 -23 -102 -248 -349 -300 -198 -127 8 137 265
6525 265 284 284 236 154 3 -209 -238 -257 -298 -154 -3 34 163 178 263 216 131 78 -120 -215 -216 -278 -288 -255 -99 63 183
6552 183 234 272 194 244 43 -88 -248 -282 -333 -287 -173 -29 126 235 197 290 280 164 59 -63 -230 -293 -313 -271
6576 -271 -150 -16 137 179 271 374 250 144 76 -118 -225 -288 -289 -278 -158 -54 146 222 267 246 221 80 81 -28
6600 -28 -199 -237 -349 -265 -83 -9 110 141 267 259 231 155 44 -172 -270 -285 -306 -169 -134 19 134 237 276 253 235
6625 235 98 9 -134 -212 -298 -322 -258 -66 78 145 233 314 318 181 96 -54 -119 -313 -352 -294 -203 -90 73 177 257
6650 257 299 261 189 143 -62 -151 -258 -286 -311 -214 -95 74 187 307 242 208 179 92 -54 -173 -272 -366 -319 -194 -75
6675 -75 89 286 285 274 255 194 -32 -153 -189 -240 -287 -267 -168 25 52 230 312 288 251 146 -8 -145 -198 -304 -270 -240
6701 -240 -198 -5 105 190 255 272 249 91 15 -124 -227 -273 -395 -257 -140 -33 145 211 330 292 239 79 -54
6724 -54 -124 -249 -401 -265 -186 -109 54 152 232 272 271 211 113 -93 -165 -271 -342 -239 -258 -45 33 153 246 270 288 187
6750 187 3 -10 -217 -273 -225 -264 -212 -69 24 183 299 255 283 200 -12 -99 -177 -224 -307 -308 -170 -86 89 215 312 267
6776 267 202 235 62 -99 -224 -248 -306 -289 -195 -22 108 160 353 346 250 146 39 -104 -231 -282 -301 -252 -144 -68 74
6801 74 248 296 321 221 125 31 -143 -230 -221 -344 -191 -101 1 84 214 333 224 248 118 -81 -111 -215 -320 -239
6825 -239 -196 -110 26 120 234 309 238 252 108 -82 -117 -252 -285 -317 -202 -125 19 130 306 363 267 167 46 -47
6849 -47 -191 -217 -282 -260 -170 -86 28 241 297 318 250 210 67 -140 -252 -269 -321 -232 -136 -109 154 165 240 201 287 162
6875 162 52 -80 -265 -236 -275 -253 -153 -65 130 145 256 313 233 91 23 -85 -209 -321 -287 -291 -157 27 91 138
6899 138 242 256 221 193 -44 -137 -234 -248 -237 -236 -118 48 128 209 292 319 219 143 -2 -171 -241 -237 -314 -257 -45 11 195
6926 195 217 263 265 130 160 -61 -166 -252 -327 -278 -189 -55 7 165 176 244 239 196 108 -58 -164 -312 -310 -213 -146 -58 72
6953 72 161 206 247 242 164 103 -113 -198 -248 -259 -216 -218 -17 36 212 257 247 182 152 76 -66 -136 -286 -244 -239 -110 -75 151
6981 151 197 256 225 239 114 42 -52 -185 -265 -261 -242 -92 -7 110 216 240 181 132 181 35 -19 -174 -273 -243 -233 -110
7007 -110 -10 104 219 210 284 159 98 -14 -124 -219 -286 -263 -245 -119 14 96 205 268 237 192 96 -35 -66 -239 -220
7032 -220 -241 -121 -44 73 110 192 294 257 116 93 -42 -154 -230 -256 -221 -156 -28 41 145 246 213 230 178 13 -88
7057 -88 -181 -267 -225 -209 -185 -25 52 157 180 267 221 126 43 -79 -129 -212 -273 -221 -170 -22 80 240 298 235 185 184 -44
7084 -44 -96 -207 -200 -198 -163 -123 -33 65 179 293 303 191 98 -12 -80 -143 -268 -171 -176 -118 -60 91 220 243 224 170 115 -30
7112 -30 -129 -217 -197 -264 -221 -79 27 79 192 192 176 183 103 -43 -140 -184 -308 -212 -206 -79 7 114 136 216 292 117 32 -33
7140 -33 -168 -172 -251 -196 -139 -103 40 187 219 224 224 130 95 -42 -163 -197 -177 -227 -179 -21 53 87 227 223 159 174 11 -74
7168 -74 -183 -244 -248 -185 -110 -27 31 130 222 166 136 56 31 -139 -196 -206 -272 -183 -168 -26 98 194 291 206 189 113 87 -55
7196 -55 -200 -273 -209 -188 -105 13 37 149 207 265 192 64 0 -90 -207 -159 -182 -151 -75 22 73 141 259 231 151 69 -32
7223 -32 -85 -169 -219 -211 -133 -18 -41 115 222 206 153 171 46 -48 -79 -198 -231 -168 -149 -71 24 144 162 190 160 150 55 -37
7251 -37 -172 -207 -208 -192 -168 -97 74 158 201 201 261 95 29 -78 -139 -206 -52 -104 -98 -45 55 147 219 183 164 121 71 -46
7279 -46 -116 -157 -226 -161 -79 -24 17 196 192 152 201 70 13 -48 -162 -212 -139 -129 -80 -20 106 69 209 166 127 39 -2 -59
7307 -59 -177 -172 -260 -104 -50 53 96 172 204 193 122 79 7 -93 -164 -180 -175 -131 -65 7 157 153 167 215 155 81 -54 -113 -84
7336 -84 -209 -188 -80 -84 51 167 123 160 153 132 62 -70 -131 -152 -231 -173 -84 -80 4 88 171 80 176 133 -13 -68 -107 -104 -210
7365 -210 -169 -74 -7 38 108 191 137 167 163 33 -72 -103 -197 -161 -117 -104 52 42 102 131 187 114 79 37 -64 -139 -170 -202
7393 -202 -80 -138 -19 24 110 172 185 167 41 11 -37 -111 -168 -207 -168 -63 18 80 72 165 126 111 75 15 -98 -165 -107 -111
7421 -111 -155 -87 52 70 161 135 142 115 49 -3 -55 -131 -138 -82 -149 -68 -35 131 137 108 115 140 83 -97 -24 -146 -196 -136 -117 -75
7451 -75 -5 135 100 125 166 173 40 -48 -73 -124 -138 -166 -113 -21 45 93 94 88 98 89 29 -37 -101 -139 -156 -128 -83 -40 15 125 93
7482 93 104 109 76 71 29 -115 -141 -163 -182 -85 5 27 142 101 113 183 146 2 -59 -98 -117 -176 -89 -77 -34 62 121 208 171 152
7512 152 102 -2 -45 -34 -114 -139 -147 -89 -27 60 154 88 187 95 51 18 -53 -106 -108 -156 -138 -75 -3 41 133 123 88 73 19 59
7542 59 -52 -81 -129 -142 -123 -12 -23 -13 65 158 119 67 22 -5 -91 -178 -186 -74 -112 -21 72 23 105 81 118 80 19 -11 -84
7571 -84 -48 -115 -78 -77 -86 -9 54 92 81 96 56 99 -24 -58 -19 -96 -109 -119 0 8 -13 116 92 161 103 55 14 -95 -66 -105
7601 -105 -114 -66 25 -25 43 46 126 68 112 52 -45 -64 -179 -133 -127 -64 43 10 115 127 121 149 80 4 -13 -120 -37 -120 -161 -45
7631 -45 -71 10 90 50 128 134 86 15 -29 -28 -136 -114 -122 -50 -8 5 39 71 78 92 50 19 -28 -31 -114 -108 -114 -48 -66 69 84 97 83
7664 83 111 50 20 -49 -74 -66 -74 -130 -98 -31 -29 99 103 93 59 114 29 -37 -75 -28 -81 -136 -82 -10 83 90 113 106 70 40 -32 -91 -114
7697 -114 -92 -89 -120 -119 -18 27 96 162 58 120 50 78 -55 -112 -66 -128 -30 -118 20 41 83 107 83 75 27 33 -41 -100 -139 -68
7727 -68 -146 -105 -7 124 98 87 151 83 48 -14 -33 -73 -123 -89 -75 -51 -20 70 105 88 50 50 67 18 -45 -81 -90 -145 -162 -69 6
7758 6 36 93 102 160 143 43 -15 -75 -135 -107 -112 -82 -46 19 91 132 144 148 50 20 -10 -105 -104 -156 -93 -10 -37 19 34 90 92 126 85
7791 85 41 4 28 -112 -75 -125 -29 -41 -19 13 149 144 86 43 14 39 -46 -172 -73 -49 -14 -11 20 89 82 156 112 76 24 16 -78
7822 -78 -37 -87 -49 -67 -36 51 56 88 112 74 56 10 -11 -35 -95 -102 -74 -142 -9 50 99 141 123 93 74 70 23 -101 -127 -90 -65
7853 -65 -39 23 52 89 76 131 112 27 -24 -67 -120 -151 -159 -110 -28 -22 51 59 59 18 150 41 -12 -48 -118 -46 -97 -74 -30 -43 18
7884 18 76 136 94 125 100 21 14 -42 -87 -95 -71 -20 22 110 73 123 158 119 74 -5 -82 -110 -50 -146 -135 -18 30 105 85 68 100
7915 100 87 20 23 -84 -161 -150 -151 -98 -51 -22 45 147 129 60 83 6 6 -76 -171 -152 -138 -74 -78 3 94 131 132 76 86 48 -25
7946 -25 -89 -156 -124 -89 -104 -53 55 87 126 116 71 131 82 -23 -126 -107 -121 -84 -11 31 50 43 171 146 80 56 12 -89
7974 -89 -99 -179 -104 -128 -125 -39 -1 -20 63 69 100 127 26 -42 -94 -141 -228 -149 -149 30 32 21 35 111 131 71 43 -23 -66 -96 -72
8005 -72 -86 -90 32 40 84 82 108 115 30 32 -114 -93 -93 -192 -119 -35 -21 59 98 93 81 126 43 -61 -21 -138 -133 -101 -87 18 -41 64
8037 64 121 81 53 79 12 -8 -84 -103 -103 -142 -130 -31 -2 3 43 124 92 76 77 -15 -115 -85 -126 -141 -106 -104 16 79 145 130 191
8068 191 11 38 -55 -51 -127 -175 -116 -118 -24 -74 61 162 148 118 74 48 -8 -40 -130 -141 -117 -35 -74 5 66 132 115 111 54 -30
8098 -30 -52 -142 -134 -170 -182 -81 -30 30 63 103 165 149 78 -14 -59 -180 -120 -178 -173 27 7 64 120 96 138 162 47 37 -90
8127 -90 -113 -92 -126 -151 -72 -74 78 130 180 118 182 103 -10 -37 -93 -114 -116 -96 -117 26 55 108 157 127 109 54 19 -43 -170
8156 -170 -170 -110 -78 -66 39 42 105 96 111 79 89 -48 -56 -159 -175 -96 -90 -43 -63 34 137 202 108 80 -11 -60 -7 -118 -180 -110
8186 -110 -58 -62 28 124 126
8191A26
$$ Imaginary data points
##PAGE= N=2
##DATA TABLE= (X++(I..I)), XYDATA
0 0 0 0 0 0 0 0 -8 8 -8 8 -8 16 -16 24 -24 32 -40 45 -53 64 -72 80 -96 112 -128 147 -168 192 -214 243
30 243 -275 307 -347 387 -431 478 -535 592 -656 728 -807 892 -986 1095 -1212 1344 -1497
47 -1497 1666 -1863 2093 -2364 2689 -3093 3605 -4275 5205 -6579 8830 -13169 24714 -122082
61 -122082 -355325 -263037 -162783 -64706 -36139 36459 152162 283784 312183 232419 86667
72 86667 -29435 -110043 -168909 -231697 -257448 -219242 -113146 10199 120541 201283 254620
83 254620 255442 190777 74895 -37579 -116458 -170411 -225983 -262718 -228579 -99310 67421 182590
95 182590 207830 189076 184141 187702 136617 -147 -167152 -266623 -256020 -180021 -110154 -63544
107 -63544 -922 105393 219379 271486 230216 130020 26982 -54948 -127041 -194342 -233707
118 -233707 -216417 -142736 -41512 59404 147588 213469 236240 199544 115264 19805 -59386
129 -59386 -125080 -188390 -234625 -224607 -138008 -7087 105438 161514 175943 182213 182710 144294
141 144294 45160 -85497 -186058 -217441 -192056 -147134 -98232 -31549 62675 161062 220415
152 220415 215979 159398 80637 -749 -79875 -151404 -198658 -203601 -162898 -88904 391 89728
164 89728 163345 202818 195280 144851 70932 -7540 -82086 -149005 -195763 -201192 -153678 -66492
176 -66492 28702 104525 153218 178252 178442 144299 72218 -22190 -109744 -165973 -184363 -170106
188 -170106 -129003 -62798 21516 106035 167482 189566 170429 119078 47907 -30709 -103903 -157766
200 -157766 -180658 -166912 -119014 -46354 36148 110749 161529 178128 158203 107222 35818 -41951
212 -41951 -111111 -157996 -173146 -153496 -103175 -31961 46641 116657 161963 172359 146637 92810
224 92810 23433 -49360 -113842 -157826 -170022 -145465 -90042 -17583 55930 117349 155967 163733
236 163733 137719 82835 11990 -59462 -117925 -153167 -158534 -131628 -77230 -7128 63191 120043
248 120043 153498 157096 128199 70718 -2076 -71876 -122508 -147124 -146221 -121138 -71935 -3025
260 -3025 71177 129182 155052 146082 110420 57956 -4186 -68489 -122510 -150966 -145310 -108304 -51472
273 -51472 12152 72529 120456 146074 141399 105863 47784 -18511 -79167 -123414 -143437 -134715
285 -134715 -98511 -42762 20334 78767 122681 143614 135192 96839 36881 -28754 -84424 -120865
297 -120865 -135053 -126316 -93273 -38618 27006 87009 125966 136669 120616 82982 30132 -30193
309 -30193 -86198 -124240 -134903 -117168 -76957 -23570 33704 85809 122265 134155 117225 75285
321 75285 18282 -41070 -91015 -122229 -128881 -110050 -69435 -15919 40530 89298 120907 128298
333 128298 108886 66327 10456 -46328 -92386 -119287 -122725 -102002 -60686 -7061 48113 93058
345 93058 118771 120617 98505 56458 2565 -52051 -95743 -119137 -117816 -93186 -50695 1201
357 1201 52979 94736 117888 116954 91558 47364 -5902 -57198 -96266 -115557 -111739 -85743 -42717
370 -42717 8561 57777 95245 113688 109370 83022 39386 -12761 -62275 -98295 -113257 -105039
382 -105039 -76221 -32979 16140 62227 96334 111488 103939 75070 30816 -19670 -65772 -98339
394 -98339 -110580 -100233 -69739 -25633 22898 66260 96205 106989 96771 67150 23553 -25201
406 -25201 -68786 -97777 -106195 -92906 -61127 -17813 28661 69353 96419 104000 90422 58406
418 58406 14689 -31892 -71823 -97219 -102742 -87203 -54126 -10463 34458 72096 95369 99833
430 99833 84425 51773 8464 -36461 -73775 -95991 -98493 -80657 -46206 -2818 40004 73651
442 73651 92536 93932 77530 45021 2084 -42270 -77385 -95142 -92728 -72439 -38915 2036
454 2036 43477 76844 94134 91087 69505 35199 -4789 -44001 -75662 -93033 -90801 -68610 -31997
467 -31997 9986 48258 76345 89557 85439 64318 29743 -10826 -49011 -77268 -90128 -84522
479 -84522 -61019 -24851 15751 51761 76769 87032 81056 58986 23820 -17136 -54328 -78905
491 -78905 -86795 -77900 -54682 -20541 18548 54818 79218 85949 74900 50022 16644 -19837 -53532
504 -53532 -77673 -85619 -74927 -48141 -12161 25172 56774 76887 81849 70424 44805 10357
516 10357 -25982 -57236 -77147 -81578 -69248 -42577 -7189 29409 59546 77249 79186 65294
528 65294 38699 4777 -29735 -58680 -76214 -78377 -64092 -36288 -1436 32870 59918 74957
540 74957 75585 61019 33537 -1052 -34933 -60818 -74302 -73341 -58256 -31219 2898 36641 62432
553 62432 74775 71886 54959 27324 -5726 -37542 -61419 -72730 -69986 -54106 -27200 6876
565 6876 40634 65225 73570 65748 46752 21796 -6691 -36855 -62808 -75408 -68872 -45837 -15511
578 -15511 13557 38805 59161 71123 68313 47743 14922 -18918 -44877 -60141 -66025 -61818 -45303
591 -45303 -17075 16375 45806 64099 68732 60441 40162 11185 -19977 -45433 -60093 -64162 -58561
604 -58561 -41761 -13193 21878 51653 65561 62470 49688 33324 12383 -15920 -47324 -69078
616 -69078 -70135 -51611 -25207 -1409 19140 40657 60888 69719 58323 29551 -3626 -29576
628 -29576 -46139 -56095 -59845 -52541 -31631 -1669 28077 50055 61485 61380 48683 24606 -4582
641 -4582 -30023 -46746 -55424 -57764 -50613 -29316 3851 36574 55410 57073 49510 40341 27236
654 27236 3416 -29955 -58527 -67286 -54621 -32675 -13393 2771 22642 46811 64164 62678
666 62678 41394 11672 -14196 -32531 -45855 -54665 -54342 -40537 -16176 10878 34160 50641 58174
679 58174 53571 35812 9912 -14956 -33236 -45539 -53715 -54258 -40595 -12400 19823 42040 49245
692 49245 47339 43715 36713 18435 -12018 -43051 -58974 -54836 -39359 -23519 -9431 8539 32300
705 32300 53367 59814 48100 25226 1412 -18541 -35280 -48103 -52657 -45059 -26897 -4020 18569
718 18569 37865 50888 53461 42991 22529 -291 -19657 -34875 -47063 -52972 -46304 -24866 3523
731 3523 27015 39292 43191 44233 41301 28209 3074 -26130 -46311 -50859 -43715 -32272 -19235
744 -19235 -2026 19912 40967 52209 49050 34750 15547 -4369 -23411 -39581 -48369 -46514 -34344
757 -34344 -15870 4659 24587 40855 48865 45513 31867 12846 -6430 -23971 -38893 -48105 -46753
770 -46753 -32889 -10849 11419 27906 37900 42944 42355 33181 14160 -9896 -30936 -42730 -44535
783 -44535 -38908 -27736 -11414 8862 28710 42292 45750 39480 26296 8668 -10826 -28930 -41208
796 -41208 -44602 -38843 -25320 -7141 12388 29781 41247 43793 37222 23379 5670 -12902 -29587
809 -29587 -41022 -43985 -37130 -22079 -3182 15349 30225 39650 41886 35760 21851 3163 -15944
822 -15944 -31544 -40486 -41499 -34123 -19731 -1396 16990 31700 39827 40092 32583 18614 778
835 778 -17254 -32057 -40149 -40095 -31660 -16848 1143 18629 32232 39333 38675 30363 15910 -1934
849 -1934 -19389 -32478 -38911 -37741 -29404 -15029 2814 20432 33573 39132 36479 27071 13035
862 13035 -3370 -19763 -32835 -39145 -36908 -26684 -11343 5605 21121 32616 37754 35364 25670
875 25670 10787 -6085 -21678 -32961 -37811 -34775 -24497 -9119 7493 22336 32760 36948 33920
888 33920 23634 8182 -8563 -22959 -32505 -35937 -32804 -23153 -8055 9273 24522 33828 35698
901 35698 30665 20468 6593 -9051 -23513 -33379 -36044 -30944 -19691 -4875 10636 24260 33066
914 33066 35131 29929 18555 3863 -11426 -24478 -32717 -34449 -29115 -17825 -3055 12066 24941
927 24941 32809 34052 28263 16528 1727 -13061 -24943 -31974 -33038 -27532 -16229 -1175 13944
940 13944 26021 32349 32268 25955 14618 432 -14088 -25812 -32174 -31983 -25405 -13766 503 14783
954 14783 26149 32173 31489 24381 12385 -1709 -15356 -25888 -31251 -30623 -23760 -12032 2206 16097
968 16097 26615 31475 29965 22568 10615 -3403 -16589 -26446 -30919 -29204 -21628 -9869 3830
981 3830 16847 26735 31021 28898 20805 8550 -5045 -17546 -26509 -30236 -27877 -20082 -8079 5476
995 5476 17965 26854 30231 27314 18860 6683 -6580 -18368 -26515 -29455 -26641 -18329 -6185 7246
1009 7246 19019 26819 29224 25802 17273 5241 -7966 -19527 -26805 -28494 -24668 -16139 -4546 8071
1023 8071 19470 26968 28820 24526 15268 3151 -9321 -19852 -26505 -27826 -23654 -14622 -2732 9693
1037 9693 20157 26545 27665 23137 13828 1782 -10462 -20519 -26338 -27006 -22131 -12965 -1166 10779
1051 10779 20588 26251 26666 21772 12269 389 -11546 -21029 -26176 -25969 -20696 -11397 119 11712
1065 11712 21011 26094 25805 20249 10541 -1080 -12367 -21257 -25789 -25139 -19386 -9860 1623 12691
1079 12691 21172 25598 24803 19023 9311 -2355 -13523 -21612 -25236 -23878 -17848 -8424 2782 13504
1093 13504 21549 25202 23685 17461 7702 -3526 -14118 -21791 -24931 -23058 -16539 -6736 4169 14231
1107 14231 21531 24613 22640 16134 6330 -4740 -14765 -21928 -24513 -22093 -15200 -5370 5377 14955
1121 14955 21555 24024 21634 14820 4852 -5917 -15498 -21793 -23702 -20890 -13914 -4128 6391 15651
1135 15651 21772 23471 20447 13402 3583 -6920 -16129 -21861 -23197 -19819 -12499 -2811 7409 16097
1149 16097 21627 22757 19418 12144 2365 -7859 -16583 -21818 -22560 -18820 -11343 -1644 8397 16692
1163 16692 21511 21993 18149 10883 1418 -8441 -16943 -21955 -22080 -17727 -9774 -322 8900 16656 21311
1178 21311 21705 17577 9606 -240 -9652 -17042 -21211 -21133 -16926 -9071 606 10105 17304 21170 20808 16247
1194 16247 8409 -1187 -10370 -17317 -20842 -20492 -15982 -8052 1771 11221 17953 20575 19299 14918 7893
1209 7893 -1307 -10902 -18414 -21562 -19630 -13848 -6140 2236 10553 17479 21117 19844 14113 5586 -3495
1224 -3495 -11382 -17337 -20355 -19207 -13975 -5558 3833 11999 17874 20270 18596 12954 4706 -4205 -11948
1239 -11948 -17441 -19980 -18765 -13353 -4421 5456 13337 17720 18752 17057 12685 5121 -4556 -13749 -19251
1254 -19251 -19698 -16256 -10623 -3725 4342 12610 18788 20380 16969 10230 2169 -5657 -12669 -17820 -19516
1269 -19516 -16869 -10502 -2158 6281 13500 18230 19237 16105 9407 1377 -6336 -12867 -17613 -19366 -16792
1284 -16792 -9736 -341 8154 13895 16840 17505 15665 10205 1476 -8230 -15361 -18232 -17195 -13761 -8647
1299 -8647 -1451 7148 14823 18990 18323 13761 7240 -102 -7552 -14118 -18001 -17946 -13958 -7315 529 8331
1315 8331 14792 18318 17595 13100 6290 -1028 -7886 -14096 -18131 -18264 -13663 -5758 2630 9282 13945
1330 13945 16680 17142 13816 6683 -2526 -10489 -15266 -16759 -15708 -12311 -6429 1673 9953 15909 17794
1345 17794 15913 11332 4919 -2436 -9783 -15229 -17416 -15908 -11360 -4736 2935 10405 15751 17481 15404
1360 15404 10428 3960 -3099 -10010 -15458 -17743 -15845 -10222 -2936 4191 10230 14796 16974 15810 10652
1375 10652 2891 -5006 -11329 -15094 -16230 -14594 -10157 -3134 4839 11666 15692 16588 14195 9104 2337
1390 2337 -5123 -11537 -15657 -16403 -13985 -8960 -1966 5557 11934 15870 16233 13435 8161 1426 -5643
1405 -5643 -11956 -15873 -16343 -13222 -7631 -751 6041 11885 15603 16259 13236 7362 152 -6800 -12258
1420 -12258 -15437 -15611 -12665 -7137 39 7044 12619 15606 15552 12268 6601 -475 -7348 -12711 -15512
1435 -15512 -15245 -11885 -6314 799 7622 12924 15548 15034 11582 5741 -1182 -7958 -13051 -15491 -14891
1450 -14891 -11228 -5336 1580 8201 13127 15398 14611 10860 4906 -1991 -8534 -13358 -15348 -14303 -10380
1465 -10380 -4502 2285 8669 13378 15395 14193 10047 4014 -2757 -9045 -13508 -15201 -13829 -9685 -3645
1480 -3645 3064 9255 13602 15203 13684 9309 3138 -3589 -9527 -13538 -14963 -13443 -9016 -2801 4032
1495 4032 9790 13693 14799 12951 8725 2519 -4293 -10154 -13854 -14742 -12674 -8126 -2015 4537 10218
1510 10218 13900 14638 12445 7829 1617 -4967 -10535 -13973 -14486 -12139 -7315 -1187 5198 10638 13991
1525 13991 14395 11903 6934 704 -5588 -10788 -13885 -14268 -11613 -6625 -259 5935 10912 13825 13980
1540 13980 11315 6353 -32 -6351 -11254 -13852 -13775 -10884 -5896 353 6564 11411 13914 13616 10644
1555 10644 5508 -716 -6833 -11510 -13897 -13458 -10298 -5153 1077 6975 11547 13843 13242 9930 4714
1570 4714 -1388 -7344 -11704 -13857 -13042 -9693 -4310 1797 7633 11902 13816 12885 9296 4006 -2137
1585 -2137 -7868 -11933 -13651 -12570 -9040 -3693 2454 8034 12091 13595 12395 8682 3263 -2828 -8271
1600 -8271 -12198 -13527 -12141 -8331 -2879 3163 8468 12202 13446 12003 8019 2546 -3440 -8782 -12277
1615 -12277 -13348 -11658 -7707 -2122 3779 8978 12309 13258 11407 7261 1751 -4067 -9180 -12402 -13117
1630 -13117 -11231 -6935 -1462 4456 9392 12404 13016 10873 6619 1061 -4757 -9625 -12468 -12828 -10577
1645 -10577 -6315 -651 5051 9744 12485 12737 10348 5858 278 -5398 -9856 -12505 -12537 -10045 -5564
1660 -5564 64 5629 10104 12471 12364 9811 5267 -328 -5882 -10205 -12494 -12225 -9456 -4851 724
1675 724 6138 10368 12435 12085 9222 4496 -1066 -6477 -10440 -12442 -11870 -8866 -4140 1385 6660 10633
1691 10633 12422 11650 8613 3799 -1780 -6929 -10770 -12345 -11470 -8243 -3415 2057 7188 10813 12304
1706 12304 11246 7932 3044 -2446 -7439 -10873 -12167 -10965 -7605 -2700 2734 7612 10990 12138 10880
1721 10880 7377 2406 -3051 -7855 -11040 -12050 -10587 -7036 -2040 3300 7972 11054 11946 10404 6730
1736 6730 1701 -3654 -8192 -11213 -11808 -10149 -6416 -1394 3858 8367 11187 11725 9897 6091 1116
1751 1116 -4161 -8552 -11307 -11657 -9684 -5748 -755 4442 8635 11208 11489 9468 5575 458 -4724
1766 -4724 -8897 -11216 -11342 -9103 -5102 -109 4969 8944 11200 11204 8930 4933 -132 -5170 -9084 -11306
1782 -11306 -11054 -8614 -4517 542 5465 9288 11245 10930 8420 4243 -887 -5728 -9349 -11208 -10763
1797 -10763 -8154 -3865 1162 5991 9558 11197 10539 7843 3526 -1442 -6162 -9675 -11181 -10555 -7563
1812 -7563 -3141 1814 6396 9633 11015 10147 7279 2920 -1986 -6565 -9865 -11025 -10011 -6954 -2630
1827 -2630 2410 6796 9865 11009 9867 6731 2244 -2651 -6963 -9922 -10802 -9672 -6523 -1997 2975
1842 2975 7207 9991 10769 9274 6145 1712 -3012 -7229 -10127 -10787 -9298 -5886 -1280 3434 7465
1857 7465 9949 10532 9012 5723 1161 -3696 -7762 -10189 -10528 -8698 -5290 -854 3815 7773 10194
1872 10194 10532 8628 5020 381 -4147 -7779 -9963 -10242 -8568 -4967 -244 4497 8270 10252 9995
1887 9995 7959 4479 128 -4382 -8186 -10310 -10160 -7887 -3992 501 4854 8170 10084 9953 7788
1902 7788 3937 -732 -5177 -8527 -10118 -9610 -7309 -3615 889 5169 8597 10257 9655 7109 3075
1917 3075 -1420 -5431 -8470 -9981 -9533 -7122 -3178 1588 5947 8924 9926 8987 6492 2800 -1615
1932 -1615 -5795 -8907 -10150 -9094 -6252 -2315 2073 5962 8822 9968 9039 6213 2101 -2483 -6376
1947 -6376 -8934 -9748 -8649 -5808 -1885 2412 6397 9188 9991 8577 5515 1292 -2925 -6426 -8845
1962 -8845 -9694 -8525 -5613 -1291 3220 6895 9071 9438 8024 5103 1254 -3239 -6971 -9219 -9598 -7889
1978 -7889 -4741 -747 3400 6920 9165 9522 7921 4645 438 -3802 -7113 -9141 -9207 -7504 -4412 -471
1994 -471 3855 7344 9342 9393 7332 3908 -151 -4053 -7259 -9123 -9167 -7317 -3893 313 4471 7478
2010 7478 9122 8916 6976 3678 -475 -4620 -7709 -9156 -8796 -6671 -3296 707 4676 7675 9143
2025 9143 8763 6508 3032 -1124 -4999 -7846 -9079 -8459 -6275 -2832 1300 5055 7915 9128 8434 5986
2041 5986 2490 -1576 -5266 -7874 -9042 -8273 -5876 -2241 1832 5424 8020 8926 8082 5632 1969 -2072
2057 -2072 -5667 -8153 -8854 -7888 -5361 -1761 2265 5735 8150 8912 7757 5184 1479 -2548 -5945 -8170
2073 -8170 -8758 -7503 -4874 -1170 2668 5992 8243 8672 7433 4677 959 -2926 -6238 -8222 -8569 -7142
2089 -7142 -4434 -718 3117 6378 8274 8582 6997 4156 462 -3374 -6520 -8327 -8475 -6936 -3946
2104 -3946 -248 3527 6525 8283 8352 6681 3768 -4 -3804 -6745 -8422 -8249 -6507 -3454 261 3877
2120 3877 6683 8209 8152 6361 3346 -485 -4208 -6965 -8245 -7963 -6072 -3006 659 4298 6963 8272
2136 8272 7868 5867 2779 -865 -4466 -7105 -8390 -7909 -5660 -2527 1229 4612 7078 8146 7572 5459
2152 5459 2328 -1397 -4801 -7263 -8233 -7517 -5187 -1982 1648 4996 7267 8199 7430 5098 1861 -1934
2168 -1934 -5119 -7341 -8099 -7242 -4868 -1613 2140 5384 7422 8003 7043 4664 1358 -2267 -5374 -7522
2184 -7522 -8065 -6934 -4465 -968 2501 5551 7450 7907 6743 4231 911 -2756 -5783 -7565 -7960 -6656
2200 -6656 -3974 -600 2906 5868 7585 7746 6477 3828 410 -3098 -5881 -7590 -7755 -6283 -3588
2215 -3588 -168 3327 6015 7551 7561 6071 3452 -18 -3460 -6150 -7611 -7586 -5955 -3129 308 3585
2231 3585 6221 7628 7446 5778 2986 -507 -3750 -6316 -7667 -7390 -5633 -2763 716 4008 6403
2246 6403 7616 7206 5361 2547 -895 -4069 -6479 -7609 -7174 -5257 -2321 1135 4302 6599 7605
2261 7605 7020 4989 2111 -1316 -4380 -6662 -7565 -6910 -4880 -1905 1464 4576 6691 7542 6824 4629
2277 4629 1678 -1701 -4698 -6750 -7451 -6613 -4509 -1435 1972 4909 6851 7400 6510 4307 1263 -2114
2293 -2114 -5045 -6872 -7379 -6403 -4087 -965 2353 5190 6987 7294 6244 3874 756 -2501 -5285 -6937
2309 -6937 -7286 -6125 -3721 -536 2701 5434 7052 7210 5914 3431 276 -2956 -5550 -7042 -7135 -5758
2325 -5758 -3284 -86 3141 5687 7061 7016 5592 3065 -135 -3300 -5700 -7042 -6987 -5427 -2909 322
2341 322 3461 5847 7079 6874 5282 2679 -569 -3611 -5901 -6998 -6739 -5092 -2456 729 3797 6023
2357 6023 7071 6700 4913 2177 -968 -3972 -6082 -7055 -6526 -4832 -2066 1109 4131 6178 6993 6495
2373 6495 4604 1807 -1411 -4158 -6234 -6977 -6372 -4482 -1727 1524 4302 6326 7089 6304 4272 1357
2389 1357 -1741 -4526 -6386 -6913 -6089 -4080 -1246 1888 4603 6416 6963 5965 3996 1018 -2119 -4792
2405 -4792 -6377 -6863 -5865 -3714 -779 2284 4881 6552 6814 5815 3565 591 -2497 -5088 -6581 -6691
2421 -6691 -5590 -3335 -347 2612 5084 6559 6768 5588 3118 78 -2977 -5300 -6597 -6598 -5299 -3021
2437 -3021 -21 2960 5339 6651 6565 5094 2761 -192 -3159 -5475 -6625 -6449 -4961 -2478 476 3355
2453 3355 5498 6608 6445 4919 2344 -767 -3550 -5692 -6599 -6320 -4601 -2117 819 3623 5697 6585
2469 6585 6237 4597 1898 -1049 -3867 -5742 -6562 -6107 -4426 -1795 1270 3996 5945 6526 5855 4133
2485 4133 1648 -1376 -4141 -6060 -6701 -5894 -3888 -1262 1618 4071 5922 6572 5827 3969 1170 -1856
2501 -1856 -4420 -6119 -6596 -5614 -3634 -909 1851 4404 6064 6552 5568 3486 674 -2171 -4573 -6013
2517 -6013 -6398 -5534 -3438 -508 2539 4872 6164 6224 5170 3204 547 -2443 -4910 -6361 -6374 -5084
2533 -5084 -2826 -148 2621 4898 6237 6312 5026 2773 -33 -2985 -5074 -6295 -6145 -4799 -2635 186
2549 186 2973 5099 6313 6195 4656 2345 -566 -3118 -5126 -6194 -6181 -4720 -2200 734 3508 5336
2565 5336 6082 5818 4388 2174 -658 -3595 -5562 -6408 -5822 -4179 -1722 987 3615 5437 6280 5723
2581 5723 4104 1670 -1306 -3802 -5571 -6286 -5555 -3928 -1517 1369 3913 5705 6264 5528 3703 1111
2597 1111 -1610 -3925 -5627 -6303 -5543 -3703 -996 1857 4244 5611 6022 5262 3503 988 -1928 -4340
2613 -4340 -5847 -6105 -5159 -3248 -701 2062 4405 5889 6004 5144 3112 521 -2282 -4529 -5857 -5993
2629 -5993 -4943 -2951 -336 2453 4655 5955 5998 4773 2649 90 -2517 -4663 -5891 -5970 -4821 -2643
2645 -2643 126 2818 4828 5876 5759 4498 2409 -285 -2911 -4888 -5928 -5710 -4400 -2225 498
2660 498 3112 5066 6000 5719 4259 2025 -684 -3294 -5111 -5943 -5565 -4167 -1852 819 3362 5203
2676 5203 5957 5540 3944 1616 -993 -3481 -5248 -5863 -5417 -3857 -1493 1240 3672 5330 5985 5310
2692 5310 3668 1266 -1383 -3773 -5296 -5860 -5246 -3514 -1077 1656 3962 5476 5877 5100 3336 910
2708 910 -1818 -4044 -5406 -5849 -4937 -3121 -699 1976 4182 5571 5837 4881 3027 505 -2126 -4293
2724 -4293 -5558 -5695 -4680 -2863 -408 2274 4398 5573 5644 4645 2587 165 -2458 -4456 -5572 -5645
2740 -5645 -4422 -2434 42 2614 4639 5682 5574 4279 2262 -236 -2727 -4706 -5692 -5438 -4188 -2132
2756 -2132 436 2827 4695 5635 5433 4107 1888 -662 -3110 -4822 -5590 -5226 -3997 -1803 730 3151
2772 3151 4852 5587 5239 3790 1575 -985 -3299 -4957 -5650 -5106 -3598 -1388 1061 3395 4985 5591
2788 5591 5033 3467 1225 -1302 -3589 -5109 -5555 -4898 -3259 -1002 1479 3596 5071 5573 4882 3199
2804 3199 910 -1680 -3807 -5094 -5484 -4738 -2991 -700 1777 3845 5237 5417 4622 2847 481 -2056
2820 -2056 -4075 -5256 -5353 -4498 -2762 -327 2113 4086 5235 5322 4335 2545 126 -2221 -4184 -5291
2836 -5291 -5278 -4226 -2325 13 2444 4231 5180 5218 4024 2251 -283 -2598 -4387 -5299 -5118 -3956 -1932
2853 -1932 335 2699 4442 5271 5008 3779 1829 -550 -2882 -4511 -5251 -5001 -3691 -1665 731 2917
2869 2917 4566 5231 4854 3581 1492 -964 -3144 -4626 -5263 -4849 -3417 -1299 1091 3283 4657 5166
2885 5166 4670 3291 1144 -1215 -3343 -4785 -5235 -4621 -3081 -965 1434 3446 4798 5112 4508 2921
2901 2921 858 -1489 -3542 -4825 -5126 -4411 -2893 -572 1689 3643 4833 5043 4247 2654 453 -1769
2917 -1769 -3701 -4845 -5083 -4212 -2495 -253 1957 3876 4842 4919 4040 2350 107 -2147 -3906 -4927
2933 -4927 -4910 -3923 -2231 16 2260 3978 4909 4842 3778 1988 -210 -2428 -4057 -4924 -4785 -3739 -1843
2950 -1843 394 2520 4153 4895 4758 3580 1621 -548 -2669 -4255 -4945 -4571 -3489 -1522 708 2807
2966 2807 4250 4908 4541 3335 1409 -816 -2816 -4301 -4875 -4506 -3216 -1209 1032 2987 4423 4830
2982 4830 4354 3019 1084 -1145 -3078 -4393 -4845 -4362 -2942 -924 1282 3241 4402 4765 4111 2735
2998 2735 719 -1455 -3314 -4516 -4730 -4108 -2629 -624 1574 3448 4504 4727 3953 2469 399 -1698
3014 -1698 -3465 -4494 -4630 -3843 -2339 -240 1833 3590 4604 4588 3731 2175 4 -2007 -3631 -4518
3030 -4518 -4560 -3679 -2038 60 2088 3669 4558 4459 3530 1859 -220 -2232 -3732 -4539 -4455 -3425 -1750
3047 -1750 378 2336 3917 4537 4353 3276 1539 -506 -2484 -3873 -4554 -4263 -3178 -1449 685 2575
3063 2575 3971 4471 4172 3025 1198 -827 -2651 -3982 -4441 -4095 -2894 -1161 955 2868 4019 4434
3079 4434 4035 2695 904 -1036 -2827 -4045 -4430 -3868 -2657 -816 1146 3029 4124 4427 3813 2490
3095 2490 594 -1405 -3048 -4143 -4348 -3756 -2367 -552 1451 3054 4148 4306 3693 2219 323 -1639
3111 -1639 -3228 -4099 -4238 -3582 -2189 -239 1672 3323 4191 4166 3348 1978 118 -1812 -3332 -4243 -4152
3128 -4152 -3252 -1792 90 1932 3420 4147 4073 3190 1650 -211 -2046 -3403 -4147 -3987 -3080 -1501 338
3145 338 2080 3500 4110 3957 2978 1329 -584 -2265 -3569 -4067 -3828 -2933 -1231 607 2381 3612 4024
3162 4024 3764 2674 1129 -727 -2487 -3648 -4123 -3666 -2492 -975 827 2452 3605 4042 3587 2457
3178 2457 858 -991 -2581 -3652 -4087 -3566 -2295 -695 1065 2681 3679 3989 3453 2169 534 -1285
3194 -1285 -2716 -3625 -3922 -3388 -2196 -414 1381 2840 3692 3839 3255 2038 314 -1428 -2916 -3764 -3743
3211 -3743 -3181 -1913 -236 1518 2967 3755 3728 3097 1734 73 -1664 -2955 -3710 -3685 -2963 -1597 19
3228 19 1665 3012 3694 3684 2823 1499 -181 -1857 -3094 -3738 -3632 -2763 -1304 420 1899 3088 3646
3245 3646 3508 2661 1340 -450 -2046 -3193 -3687 -3463 -2471 -1057 548 2101 3183 3630 3385 2486 939
3262 939 -641 -2163 -3236 -3699 -3235 -2289 -896 766 2246 3251 3565 3173 2156 699 -862 -2312
3278 -2312 -3265 -3555 -3179 -2101 -573 1011 2361 3172 3482 3052 2029 512 -1086 -2372 -3281 -3519 -3025
3295 -3025 -1822 -356 1201 2447 3249 3357 2923 1816 222 -1242 -2550 -3326 -3335 -2832 -1670 -76 1367
3312 1367 2610 3268 3333 2603 1445 83 -1479 -2629 -3263 -3215 -2535 -1417 91 1557 2682 3264 3175 2505
3330 2505 1306 -246 -1581 -2710 -3268 -3173 -2390 -1119 298 1682 2729 3247 3042 2295 1013 -399 -1757
3347 -1757 -2760 -3269 -2978 -2256 -966 506 1804 2779 3180 3025 2097 861 -542 -1907 -2792 -3177 -2852
3364 -2852 -2014 -745 723 2033 2855 3158 2827 1856 629 -786 -2046 -2916 -3103 -2725 -1776 -503 888
3381 888 2121 2839 2998 2630 1716 410 -949 -2106 -2906 -2990 -2581 -1626 -332 972 2140 2854 2974 2499
3399 2499 1518 148 -1165 -2187 -2874 -2918 -2407 -1488 -109 1182 2267 2901 2817 2346 1310 64 -1266
3416 -1266 -2325 -2839 -2846 -2316 -1225 71 1370 2260 2776 2801 2107 1124 -99 -1384 -2278 -2794 -2764 -2121 -1058
3435 -1058 230 1496 2357 2806 2664 2002 883 -381 -1474 -2365 -2767 -2630 -1915 -927 441 1599 2379
3452 2379 2775 2497 1841 741 -530 -1602 -2357 -2729 -2559 -1758 -618 548 1698 2473 2682 2404 1679 519
3470 519 -642 -1692 -2435 -2686 -2326 -1581 -554 681 1720 2492 2649 2332 1568 485 -693 -1772 -2449
3487 -2449 -2622 -2221 -1443 -379 834 1802 2497 2569 2121 1309 265 -936 -1866 -2460 -2538 -2127 -1262 -231 928
3506 928 1926 2429 2499 2060 1165 90 -1040 -1909 -2432 -2442 -1983 -1122 -99 1045 1995 2383 2431 1883 1035 -47
3526 -47 -1076 -1960 -2411 -2384 -1834 -975 110 1199 1991 2415 2308 1755 872 -180 -1234 -1984 -2307 -2270 -1744
3545 -1744 -855 275 1296 2066 2408 2247 1717 729 -360 -1336 -2051 -2333 -2215 -1612 -663 385 1326 2047
3563 2047 2379 2102 1499 572 -438 -1418 -2087 -2330 -2056 -1424 -545 495 1440 2059 2220 1997 1384 482 -574
3582 -574 -1451 -2115 -2249 -1939 -1322 -337 613 1491 2150 2241 1943 1252 275 -715 -1540 -2068 -2104 -1823 -1138 -292 750
3603 750 1525 2047 2138 1783 1134 116 -774 -1595 -2022 -2074 -1733 -1041 -155 836 1571 2006 2075 1689 1037 39 -890
3624 -890 -1639 -2029 -2060 -1683 -922 8 909 1618 1966 2045 1657 920 -57 -936 -1661 -1984 -1939 -1506 -756 91 955
3645 955 1667 2008 1975 1501 724 -136 -1049 -1633 -2013 -1918 -1400 -655 181 1078 1636 1987 1923 1400 694 -246 -1146
3666 -1146 -1677 -1963 -1746 -1279 -560 308 1123 1686 1966 1822 1370 527 -389 -1212 -1793 -1926 -1717 -1227 -467 291
3686 291 1179 1688 1858 1757 1196 391 -454 -1188 -1778 -1899 -1668 -1111 -312 451 1206 1747 1920 1653 1097 297
3706 297 -542 -1274 -1721 -1862 -1561 -1073 -292 549 1221 1707 1797 1575 1017 197 -595 -1334 -1749 -1780 -1504 -893 -200
3727 -200 686 1310 1730 1847 1520 932 95 -693 -1327 -1727 -1694 -1448 -893 -6 689 1285 1718 1701 1481 787 40
3748 40 -699 -1411 -1718 -1728 -1378 -758 69 718 1331 1679 1660 1418 772 -11 -812 -1368 -1656 -1659 -1223 -658 113 771
3770 771 1364 1666 1568 1260 568 -135 -826 -1381 -1689 -1599 -1202 -577 233 916 1426 1665 1581 1210 590 -182 -877
3791 -877 -1417 -1670 -1556 -1113 -518 264 866 1336 1610 1495 1102 514 -268 -964 -1436 -1566 -1527 -1076 -431 327
3811 327 993 1449 1587 1455 968 396 -265 -991 -1431 -1587 -1468 -1012 -269 403 1041 1437 1498 1415 1000 305 -332
3832 -332 -1054 -1400 -1572 -1391 -956 -290 456 1047 1424 1568 1370 870 310 -454 -1037 -1442 -1581 -1356 -871 -187
3852 -187 558 1128 1373 1513 1241 788 195 -489 -1033 -1472 -1594 -1317 -838 -114 574 1102 1428 1539 1255 779
3872 779 131 -527 -1047 -1533 -1481 -1227 -712 -147 553 1138 1490 1517 1218 676 43 -599 -1134 -1365 -1480 -1213 -652
3893 -652 -51 707 1243 1448 1457 1063 564 -26 -661 -1193 -1471 -1410 -1158 -622 52 777 1219 1358 1407 1040 557
3914 557 -105 -744 -1189 -1461 -1413 -1114 -537 75 712 1149 1462 1334 960 488 -160 -713 -1154 -1392 -1318 -1045 -441
3935 -441 168 820 1300 1389 1280 925 371 -204 -724 -1189 -1357 -1385 -981 -383 209 824 1226 1396 1298 900 349
3956 349 -187 -825 -1206 -1404 -1331 -942 -370 229 817 1250 1324 1266 868 297 -338 -859 -1253 -1378 -1295 -870 -307
3977 -307 306 872 1282 1383 1194 745 225 -377 -928 -1243 -1330 -1270 -847 -256 403 934 1330 1445 1149 769 141
3998 141 -382 -950 -1287 -1326 -1231 -750 -221 404 980 1363 1388 1160 720 139 -498 -989 -1324 -1299 -1174 -711 -95
4019 -95 475 1019 1316 1336 1085 652 12 -557 -1022 -1251 -1295 -1104 -636 -11 575 1064 1305 1284 1030 590 -61
4040 -61 -609 -1035 -1288 -1279 -1094 -560 49 602 1040 1381 1310 968 516 -39 -662 -1024 -1312 -1233 -994 -464 57 659
4062 659 1072 1377 1274 1046 455 -161 -744 -1184 -1282 -1261 -1002 -410 120 726 1116 1294 1269 943 408 -199 -790
4083 -790 -1204 -1351 -1258 -884 -416 167 785 1125 1346 1269 921 365 -281 -825 -1173 -1248 -1192 -823 -282 171 821
4104 821 1223 1273 1250 849 263 -340 -847 -1142 -1328 -1139 -773 -290 251 877 1273 1392 1124 755 190 -395 -897
4125 -897 -1262 -1309 -1107 -716 -131 461 851 1259 1366 1231 742 205 -470 -1024 -1294 -1311 -1106 -663 -67 457 893
4146 893 1266 1275 1076 645 108 -496 -1017 -1310 -1300 -1044 -615 -30 474 977 1248 1328 1066 575 49 -637 -1088
4167 -1088 -1311 -1260 -938 -495 -4 594 961 1285 1255 1020 545 -74 -604 -1025 -1275 -1247 -937 -412 82 597 1007
4188 1007 1196 1231 946 480 -83 -667 -1100 -1346 -1240 -961 -442 160 689 1086 1338 1270 909 435 -226 -685
4208 -685 -1122 -1325 -1218 -871 -346 282 757 1130 1321 1238 820 353 -228 -801 -1165 -1287 -1171 -863 -266 258
4228 258 838 1227 1261 1197 754 282 -234 -862 -1181 -1278 -1088 -753 -193 382 920 1100 1249 1092 809 254 -356
4249 -356 -890 -1246 -1294 -1112 -702 -163 418 951 1213 1268 1028 675 155 -488 -899 -1352 -1311 -1061 -679 -10 453
4270 453 1032 1197 1270 991 609 27 -528 -1023 -1306 -1297 -1037 -575 8 584 1016 1291 1232 957 535 -3 -542
4291 -542 -973 -1245 -1254 -1006 -531 55 693 1058 1263 1221 973 486 -72 -644 -1090 -1327 -1263 -932 -435 137 725
4312 725 1100 1268 1254 783 361 -209 -673 -1111 -1251 -1252 -879 -363 222 767 1177 1345 1165 841 324 -224 -778
4333 -778 -1115 -1317 -1155 -834 -262 368 821 1144 1288 1170 798 243 -359 -811 -1177 -1243 -1132 -723 -197 336
4353 336 882 1223 1238 1066 701 154 -388 -850 -1187 -1269 -1076 -775 -243 401 1000 1212 1189 1029 638 91 -505
4374 -505 -967 -1243 -1321 -1113 -597 -66 561 949 1197 1261 1058 579 22 -532 -979 -1229 -1188 -1016 -530 -46 589
4395 589 1035 1266 1251 869 452 -80 -571 -948 -1271 -1249 -959 -560 35 706 1097 1308 1215 888 468 -139 -668
4416 -668 -1041 -1254 -1233 -873 -428 138 654 1032 1212 1208 902 309 -273 -746 -1089 -1227 -1146 -790 -314 223 762
4437 762 1206 1282 1167 794 313 -271 -738 -1075 -1244 -1139 -774 -289 315 815 1199 1314 1089 768 230 -320
4457 -320 -857 -1189 -1227 -983 -653 -169 290 828 1150 1313 1083 698 118 -448 -935 -1173 -1222 -1010 -674 -172 426
4478 426 879 1160 1247 1002 594 62 -554 -969 -1237 -1258 -993 -523 0 511 919 1226 1166 945 583 -28 -585
4499 -585 -1012 -1174 -1190 -951 -486 56 510 993 1208 1207 988 436 -87 -617 -1035 -1209 -1173 -886 -407 88 609
4520 609 1043 1226 1157 876 344 -200 -614 -1086 -1170 -1134 -852 -355 151 730 1072 1230 1095 798 324 -278 -776
4541 -776 -1079 -1218 -1093 -754 -247 243 709 1092 1239 1012 795 266 -278 -830 -1086 -1219 -1026 -698 -206 330
4561 330 831 1131 1190 1117 716 145 -384 -832 -1135 -1233 -1013 -604 -171 385 777 1120 1176 1021 571 149 -454
4582 -454 -888 -1151 -1142 -972 -498 -72 514 892 1131 1109 912 598 68 -541 -964 -1162 -1139 -962 -472 60 527
4603 527 928 1079 1064 867 514 -7 -548 -957 -1208 -1101 -804 -405 36 640 1012 1118 1055 804 455 -120 -635
4624 -635 -954 -1166 -1069 -792 -298 201 711 966 1150 1093 771 355 -206 -662 -1009 -1143 -1038 -719 -281 245 677
4645 677 1037 1146 940 655 268 -265 -755 -1009 -1085 -1081 -689 -181 241 733 1024 1076 996 625 223 -321 -752 -1053
4667 -1053 -1162 -987 -626 -127 376 829 1007 1091 957 576 129 -363 -774 -1088 -1108 -958 -571 -75 397 864
4687 864 1010 1105 895 542 26 -475 -867 -1082 -1096 -868 -481 29 534 860 1100 1004 815 482 -14 -495 -834
4708 -834 -1112 -1046 -789 -436 92 529 868 1054 1026 798 461 -60 -553 -909 -1020 -1057 -800 -295 89 594 932
4729 932 1040 955 701 348 -200 -552 -849 -1057 -971 -723 -294 242 702 949 1077 967 653 249 -157 -630 -894
4750 -894 -1048 -968 -654 -206 228 589 926 1056 858 608 171 -245 -707 -874 -1015 -920 -588 -215 330 773 883
4771 883 1058 893 526 84 -314 -712 -986 -1023 -858 -599 -154 348 718 1001 1034 816 538 117 -391 -754 -957
4792 -957 -985 -799 -486 1 475 797 930 1010 802 404 33 -400 -722 -918 -955 -784 -392 -32 430 776 1040
4813 1040 1002 690 370 -55 -449 -779 -942 -924 -738 -375 28 514 790 969 935 607 306 -111 -513 -812 -953
4834 -953 -970 -687 -345 56 507 855 1023 828 650 222 -209 -554 -833 -987 -889 -612 -271 202 543 882 931
4855 931 875 589 255 -222 -598 -848 -962 -788 -639 -189 205 589 797 901 817 563 135 -273 -640 -936 -906
4876 -906 -768 -466 -160 261 572 839 916 758 419 102 -278 -663 -873 -824 -753 -434 -6 296 681 824 857
4897 857 702 381 48 -343 -680 -856 -797 -616 -372 -38 347 755 889 892 676 383 -91 -398 -708 -826 -840
4918 -840 -646 -233 62 389 701 839 856 592 319 -58 -499 -695 -869 -808 -566 -275 107 493 723 859 817
4939 817 616 287 -117 -532 -696 -906 -759 -625 -304 113 454 694 842 718 505 186 -173 -492 -710 -830
4959 -830 -761 -536 -220 208 453 726 833 784 478 179 -202 -564 -740 -810 -745 -422 -69 229 510 746 821 703
4981 703 433 116 -284 -528 -712 -781 -694 -436 -96 246 518 713 772 639 362 102 -253 -607 -756 -738 -653 -393
5003 -393 -9 293 578 697 751 584 367 93 -298 -640 -800 -692 -512 -332 7 280 609 717 710 634 290
5024 290 -12 -362 -512 -705 -667 -519 -270 82 409 640 670 660 497 241 9 -320 -601 -719 -738 -501 -243
5045 -243 92 405 583 654 672 547 218 -68 -422 -662 -714 -681 -476 -208 134 383 648 745 631 480 233 -103
5067 -103 -414 -648 -676 -646 -464 -200 163 403 640 653 560 357 187 -177 -439 -572 -703 -559 -425 -87 184
5088 184 417 580 630 550 374 129 -161 -549 -690 -696 -486 -404 -101 182 483 606 649 569 333 33 -173 -515
5110 -515 -636 -670 -557 -316 -58 271 536 633 585 543 330 43 -295 -452 -657 -620 -516 -314 -17 223 581 620
5132 620 629 494 274 4 -249 -399 -600 -639 -475 -293 63 326 586 596 596 373 192 16 -219 -489 -606 -597 -420
5155 -420 -179 22 361 464 584 544 431 177 -80 -314 -571 -600 -636 -386 -120 63 247 550 623 581 415 173
5177 173 -74 -380 -512 -635 -527 -386 -173 103 379 506 569 572 335 98 -116 -353 -501 -513 -482 -304 -62 175
5199 175 415 500 567 485 361 139 -146 -336 -537 -570 -508 -339 -92 153 400 530 494 493 230 83 -199 -388 -551
5222 -551 -551 -491 -254 -70 190 458 501 542 423 311 -44 -208 -400 -464 -516 -465 -283 -9 181 380 524 522 463 185
5246 185 -16 -221 -382 -476 -507 -440 -240 44 256 464 522 508 403 245 -6 -171 -387 -546 -455 -396 -149 -22
5268 -22 193 483 548 498 406 227 -21 -288 -462 -484 -514 -357 -213 48 281 435 522 483 324 149 -123 -232 -442
5291 -442 -565 -473 -328 -154 85 285 413 519 449 385 164 -75 -327 -454 -458 -425 -319 -62 96 307 509 540
5313 540 491 378 112 -64 -313 -398 -509 -438 -260 -171 62 301 490 494 393 228 89 -109 -313 -463 -508 -401
5335 -401 -294 -73 104 275 412 493 472 284 53 -199 -334 -440 -470 -317 -266 -97 74 295 450 486 432 297
5357 297 50 -172 -284 -418 -440 -379 -172 -58 140 333 393 438 385 216 85 -179 -371 -424 -411 -322 -205 -32 130
5380 130 346 453 491 322 199 33 -160 -358 -400 -361 -329 -192 2 152 401 394 365 336 165 -31 -169 -368 -357
5403 -357 -400 -332 -173 -25 234 408 449 403 321 166 -67 -205 -425 -407 -396 -259 -157 -35 173 280 412 399 328
5426 328 76 6 -184 -382 -391 -405 -246 -138 61 231 334 397 408 320 132 -82 -220 -394 -319 -321 -282 -120 73 254
5450 254 398 438 435 301 88 -131 -231 -448 -421 -382 -277 -87 59 246 292 408 313 273 86 -128 -245 -329 -403
5473 -403 -373 -233 -68 126 213 351 392 340 190 81 -80 -266 -322 -324 -314 -193 -38 138 256 374 402 355 197
5496 197 70 -159 -258 -336 -415 -349 -216 -59 141 266 389 377 245 194 36 -178 -291 -387 -421 -336 -125 -20 150
5519 150 336 347 357 298 193 -7 -210 -277 -339 -335 -246 -172 13 146 335 392 340 283 156 57 -147 -223 -340 -386 -291
5544 -291 -73 71 153 291 364 294 242 163 -2 -204 -346 -370 -286 -230 -75 62 169 287 380 308 173 169 -31 -221
5568 -221 -315 -391 -330 -241 -85 48 153 310 331 305 162 84 -41 -169 -336 -336 -364 -217 -123 72 197 273 398 316
5592 316 270 90 -39 -216 -355 -392 -362 -233 -56 117 240 293 348 303 199 28 -88 -195 -284 -291 -335 -213 -63
5615 -63 86 267 305 297 266 224 67 -45 -216 -311 -367 -310 -173 -34 190 226 269 346 290 202 20 -69 -201 -364 -322
5640 -322 -301 -163 12 157 208 267 335 227 153 61 -101 -270 -255 -302 -239 -175 -25 189 236 311 318 229 139 101 -113 -223
5666 -223 -271 -308 -224 -153 -3 106 266 302 317 275 118 -36 -79 -244 -298 -317 -210 -211 -34 119 271 330 298 212 63
5691 63 -33 -138 -221 -286 -337 -260 -231 27 220 219 396 258 197 108 -45 -104 -222 -258 -231 -221 -120 106 138 290 321 326
5717 326 194 46 -94 -215 -168 -249 -296 -202 -78 73 205 327 333 344 194 122 -58 -158 -293 -272 -253 -224 -98 45
5741 45 178 240 265 269 152 90 -82 -257 -266 -304 -222 -217 -107 74 208 271 297 213 169 34 -74 -191 -197 -287 -268 -232 -56
5768 -56 81 195 301 261 265 183 46 -73 -149 -238 -311 -235 -192 -32 99 234 282 332 256 110 58 -152 -266 -221 -246
5793 -246 -263 -154 -30 104 199 282 310 210 124 -7 -84 -208 -241 -217 -253 -85 -27 113 201 311 297 233 118 -58
5817 -58 -68 -164 -255 -249 -159 -102 18 99 188 226 303 180 132 -61 -126 -173 -223 -297 -172 -72 6 22 217 254 268 216 208 -26
5845 -26 -171 -208 -270 -211 -143 -113 22 109 167 301 257 206 116 -45 -129 -218 -273 -251 -197 -99 44 116 200 284 199 250 157 -15
5873 -15 -89 -254 -287 -240 -124 -44 63 117 218 254 190 211 111 -57 -147 -254 -237 -193 -54 -30 23 146 243 252 228 115
5899 115 73 -15 -197 -206 -268 -243 -149 -21 92 78 203 246 225 129 93 -97 -169 -244 -284 -209 -142 -74 76 153 248 239 281 203
5927 203 69 -36 -164 -206 -294 -133 -146 -37 60 167 194 203 241 174 17 -65 -186 -204 -218 -223 -86 28 33 148 273
5952 273 256 219 160 59 -25 -176 -266 -231 -204 -151 1 51 162 214 218 231 92 -7 -132 -170 -164 -217 -189 -174 -20 87 133
5979 133 200 232 195 192 71 -114 -201 -236 -257 -247 -73 41 105 141 221 138 227 109 -29 -92 -182 -238 -257 -98 -80 28
6005 28 139 134 248 226 227 84 12 -87 -181 -258 -307 -172 -9 26 139 149 250 208 151 95 20 -112 -201 -185 -239 -129 -99
6032 -99 6 88 140 185 167 166 104 -68 -99 -183 -244 -205 -173 -62 63 150 222 196 198 174 94 -3 -33 -198 -191 -229 -155 28 68
6061 68 149 269 228 203 104 27 15 -168 -186 -260 -225 -191 -72 69 218 183 224 181 70 67 -32 -128 -194 -233 -244 -108 -51
6088 -51 53 160 230 227 201 105 78 -45 -140 -205 -204 -201 -82 -71 69 194 209 149 140 118 44 -10 -142 -202 -274 -233 -127 18
6116 18 96 215 200 244 159 97 110 -38 -149 -250 -273 -133 -142 -33 121 179 236 248 154 109 -25 -8 -169 -221 -170 -157
6142 -157 -114 -96 136 275 228 208 169 74 35 -32 -146 -223 -228 -161 -136 11 122 205 200 197 139 135 24 -92 -217 -237 -245 -196
6170 -196 -50 26 127 201 159 208 167 41 63 -113 -179 -257 -151 -157 -134 23 140 204 279 225 186 26 26 -57 -195 -202 -199
6197 -199 -201 -97 56 166 182 220 242 109 61 20 -196 -255 -232 -207 -113 -108 -25 79 217 215 274 153 28 -55 -163 -203
6223 -203 -242 -239 -195 -78 -13 132 253 255 159 122 65 -86 -136 -173 -223 -288 -223 -20 15 134 203 158 222 112 18 -65 -171
6250 -171 -168 -250 -208 -185 -68 49 184 135 254 222 39 65 -145 -94 -199 -215 -214 -97 -73 63 167 187 246 248 87 60
6276 60 -45 -173 -207 -243 -212 -82 -39 21 174 278 302 248 135 16 -114 -215 -189 -197 -177 -102 1 68 201 212 213 203
6302 203 93 31 -61 -204 -236 -209 -153 -165 -32 54 202 290 165 140 66 -21 -191 -172 -262 -201 -166 -47 -14 113 198 200
6328 200 214 191 168 -84 -199 -207 -238 -236 -173 -83 -7 80 221 235 274 194 97 -46 -120 -232 -238 -205 -134 -91 47 118 266 291
6356 291 248 163 100 -98 -131 -212 -233 -194 -134 -69 35 142 187 241 225 122 37 -112 -145 -167 -238 -207 -183 38 66 156 250
6383 250 245 233 209 24 -128 -161 -296 -267 -215 -165 0 32 201 251 271 230 180 40 -82 -227 -227 -200 -167 -110 12 52
6409 52 184 178 193 221 167 62 -117 -180 -302 -269 -195 -231 -8 91 234 267 231 222 147 17 -117 -144 -227 -263 -179 -150 -14
6436 -14 119 153 207 248 210 97 31 -138 -231 -225 -290 -201 -96 13 131 205 268 237 203 133 39 -158 -165 -341 -253 -148 -110
6463 -110 81 106 149 326 189 169 87 -19 -121 -241 -255 -266 -176 -120 -4 152 280 218 245 181 74 -51 -144 -264
6487 -264 -234 -333 -242 -117 54 115 199 243 154 157 98 -77 -124 -279 -209 -257 -164 -28 110 164 207 220 230 209 97 -18
6513 -18 -165 -298 -285 -240 -187 -34 89 197 251 322 240 132 67 -39 -184 -264 -358 -242 -173 -14 140 225 224 247 179
6538 179 118 31 -62 -296 -322 -342 -276 -141 -59 171 195 257 264 215 99 0 -98 -216 -292 -290 -181 -136 -54 139 263 310 221
6565 221 111 135 -7 -69 -192 -268 -309 -220 -83 11 201 223 316 249 203 125 5 -174 -265 -313 -258 -201 -159 -11 126
6590 126 284 281 336 81 20 -57 -208 -274 -249 -246 -293 -87 102 216 294 276 222 177 68 -77 -207 -269 -235 -247 -225 -130
6616 -130 129 207 284 300 248 120 42 -101 -160 -209 -298 -225 -102 -68 134 218 281 314 258 191 106 -58 -199 -311 -249 -220
6642 -220 -116 -13 115 181 295 338 146 149 4 -159 -207 -325 -318 -199 -147 -68 98 186 288 343 215 117 35 -216
6666 -216 -202 -310 -292 -208 -140 -61 99 208 319 301 195 91 -80 -145 -216 -237 -283 -254 -134 -9 155 238 284 313 227
6691 227 85 -23 -237 -193 -169 -251 -188 2 52 177 312 319 322 117 76 -51 -210 -261 -207 -281 -205 -93 58 147 274
6716 274 308 280 177 104 -93 -206 -298 -313 -297 -211 -68 80 230 298 316 281 217 -21 -65 -243 -313 -241 -271 -158 32
6741 32 98 230 252 299 282 153 13 -145 -295 -317 -246 -199 -127 6 150 167 223 372 258 212 -41 -75 -278 -341 -282
6766 -282 -230 -99 -2 91 203 254 370 225 110 2 -175 -260 -341 -321 -228 -51 -39 132 200 206 214 253 119 -36 -188
6791 -188 -267 -362 -256 -136 -58 19 161 287 357 295 233 72 -46 -207 -254 -330 -221 -175 -136 48 173 240 307 316 117
6816 117 100 -112 -213 -314 -348 -239 -219 4 128 210 229 283 202 117 35 -76 -240 -237 -299 -251 -111 -4 38 189 291
6841 291 293 211 205 56 -99 -185 -281 -214 -236 -104 -12 78 189 257 256 224 158 56 -83 -229 -271 -260 -238 -107 59 136 181
6868 181 265 235 198 108 -21 -132 -235 -298 -286 -221 -57 67 117 190 254 267 223 81 -51 -169 -300 -244 -302 -240 -109
6893 -109 10 121 248 268 213 172 60 -18 -72 -214 -280 -245 -204 -37 153 261 222 313 211 141 70 14 -145 -281
6917 -281 -303 -233 -194 -42 95 154 248 321 230 204 31 -95 -194 -254 -305 -274 -124 -54 51 236 277 247 195 127 -7 -164
6943 -164 -215 -273 -308 -205 -155 -54 121 211 280 237 184 157 -17 -130 -232 -286 -315 -218 -184 26 163 224 272 293 213 96
6969 96 14 -132 -244 -241 -252 -187 14 -11 146 225 277 303 148 80 -47 -176 -241 -279 -203 -140 -32 27 166 198 265 211
6995 211 135 20 -31 -161 -262 -237 -258 -160 -105 13 70 269 228 283 117 -11 -105 -117 -220 -227 -212 -194 -13 101 191
7020 191 258 266 270 112 -7 -109 -167 -276 -260 -188 -160 -11 69 200 304 265 255 133 -78 -146 -174 -207 -221 -251 -114 -33
7046 -33 35 236 217 249 169 125 -12 -50 -222 -197 -328 -206 -101 -32 112 193 278 216 221 125 -8 -157 -179 -176 -242 -180 -125
7073 -125 50 146 177 249 247 173 115 -58 -82 -215 -266 -214 -189 -50 10 138 165 249 220 225 96 -59 -151 -227 -289 -230 -73
7100 -73 -30 23 178 178 229 261 127 44 -162 -187 -252 -244 -210 -171 -40 59 160 261 257 265 60 -4 -111 -172 -256 -285 -224 -114
7128 -114 -19 58 181 226 243 245 177 5 -55 -166 -241 -181 -219 -43 14 89 184 243 199 156 76 -6 -156 -176 -214 -202 -162 -119
7156 -119 39 54 176 233 220 126 112 11 -160 -206 -224 -254 -206 -66 -22 122 183 150 233 146 87 36 -124 -134 -186 -225
7182 -225 -138 -48 3 109 258 195 209 169 59 -55 -120 -162 -139 -187 -158 -45 106 159 246 200 217 186 49 -60 -145 -159
7208 -159 -295 -161 -78 -17 85 179 182 227 178 67 74 -107 -145 -209 -174 -231 -166 -54 45 139 189 210 216 80 5 -57 -156 -135
7236 -135 -289 -193 -108 -81 59 154 207 216 161 172 -33 -65 -116 -212 -165 -247 -112 43 116 162 171 210 146 116 -34 -137 -145 -220
7264 -220 -212 -122 -97 37 121 70 244 176 222 69 -35 -63 -190 -157 -179 -131 -65 22 144 168 156 193 199 -10 -22 -177 -101
7291 -101 -223 -134 -168 -21 11 112 223 160 175 115 -3 -43 -51 -181 -157 -207 -170 -92 -30 56 220 207 222 117 69 -60
7317 -60 -141 -172 -109 -125 -87 -50 21 105 123 159 183 40 14 -83 -150 -133 -155 -170 -75 -76 66 117 133 197 111 113 30 -61 -113 -112 -172
7348 -172 -155 -73 -19 53 146 162 154 151 22 23 -80 -120 -211 -173 -141 -89 -52 56 166 156 184 155 97 -60 -83 -106 -175 -196 -113
7377 -113 -18 10 98 198 194 143 190 51 -37 -51 -127 -188 -195 -147 -69 68 65 67 97 121 101 88 -11 -80 -166 -153 -180 -92 -41 33
7407 33 48 132 192 168 86 -5 -18 -105 -137 -162 -109 -141 37 71 119 135 170 147 131 79 -56 -85 -204 -123 -106 -105 44 59 9
7436 9 84 137 189 44 -19 -64 -51 -85 -144 -115 -133 -25 84 135 144 145 113 81 49 -20 -128 -212 -132 -107 -75 13 94 165 129 171
7466 171 74 94 -43 -17 -105 -166 -141 -96 -64 -5 81 115 151 134 133 69 11 13 -65 -91 -90 -84 -50 -3 26 180 118 141 100 107 35
7497 35 -94 -111 -101 -86 -10 -74 -61 62 142 106 127 46 40 21 -86 -108 -122 -101 -89 -83 58 128 143 122 123 78 29 -34 -103 -127
7527 -127 -63 -128 -91 -66 30 96 92 132 136 158 27 -16 -132 -149 -87 -105 -97 -61 -1 111 121 81 120 44 43 -22 -92 -128 -144 -71
7557 -71 -44 -72 39 140 175 112 104 17 75 -72 -92 -92 -109 -23 -137 3 -33 40 99 67 129 70 44 5 -108 -135 -100 -97 -91
7586 -91 -72 30 112 109 83 126 59 21 -91 -114 -150 -124 -56 -87 -4 96 79 89 163 98 71 13 -73 -85 -79 -93 -100 -68 -36 76
7616 76 91 90 146 114 66 43 -137 -125 -106 -135 -82 -65 68 17 89 107 82 23 17 24 -23 -90 -97 -45 -132 -61 -48 41 25 144 99
7647 99 108 49 -38 -82 -143 -118 -162 -121 -15 9 76 44 136 173 116 38 -32 -30 -77 -149 -154 -84 16 -38 21 122 97 60 102 69
7677 69 -14 -72 -88 -72 -99 -42 -53 28 74 70 77 102 100 -15 5 8 -70 -154 -26 -112 -75 -7 25 68 113 163 67 45 10 -67 -92
7708 -92 -25 -131 -111 26 64 102 143 88 111 85 36 -7 -44 -81 -74 -89 -93 -46 66 112 99 102 106 111 -36 -84 -25 -116 -151 -105 -103
7739 -103 -9 -19 38 77 92 69 80 60 -60 -81 -142 -118 -100 -103 -17 -1 9 44 120 85 106 41 6 -55 -78 -106 -105 -108 -6 9
7769 9 84 122 38 138 114 3 -16 -58 -154 -183 -7 -97 4 22 30 106 173 142 64 18 -75 -97 -132 -39 -138 -50 16 32 55
7798 55 67 88 123 28 29 -44 -120 -108 -157 -54 -68 -28 74 73 102 106 105 95 26 -24 -98 -122 -131 -50 -42 -35 76 68 62 43 115 32 6
7831 6 -2 -62 -178 -72 -100 -38 -3 43 63 131 112 32 37 -23 -47 -85 -138 -89 -69 12 32 -1 81 91 102 17 59 -24 -48 -136 -125
7862 -125 -125 -76 -69 10 58 22 143 112 83 -25 -12 -90 -63 -163 -129 -25 -19 -20 82 106 192 94 95 79 27 -23 -51 -85 -126 -89
7892 -89 -22 14 76 124 141 104 71 -40 -25 -30 -75 -124 -159 -122 -37 -14 12 75 122 108 90 -2 -57 -45 -137 -140 -117 -108 -23 78 126
7923 126 119 70 96 86 46 -31 -19 -143 -162 -156 -96 11 86 38 135 119 95 107 -31 21 -75 -91 -127 -99 44 -80 104 92
7951 92 120 130 114 106 10 -38 -99 -170 -151 -109 -29 12 76 155 113 74 87 67 -36 -60 -108 -106 -87 -74 -83 15 31 111 98 148 46
7982 46 20 -42 -77 -148 -188 -97 -68 -44 -32 98 82 116 116 168 59 19 -43 -97 -174 -110 -99 -98 7 58 138 60 39 79 73 37
8012 37 -168 -141 -131 -101 -135 -42 27 102 157 174 113 40 13 -24 -24 -134 -200 -85 -132 -32 21 65 165 104 116 48 -52 -49
8040 -49 -100 -191 -131 -140 -81 -15 61 60 135 129 165 8 -10 25 -48 -165 -102 -137 -38 -45 64 111 159 136 136 40 46 -33 -90 -137 -138 -112
8072 -112 3 40 2 71 93 127 78 73 -36 -53 -151 -192 -125 -102 -34 -24 57 131 88 89 79 62 38 -9 -165 -142 -170 -88 -90 37
8102 37 43 58 183 150 183 36 28 -72 -74 -145 -116 -101 -70 -11 62 114 108 168 152 91 -29 -89 -135 -149 -135 -65 -53 11 21 195
8132 195 221 59 155 -4 38 -77 -149 -132 -143 -152 -57 -43 51 94 168 128 69 0 -67 -101 -55 -187 -162 -154 -63 10 91 126 145
8161 145 166 88 -40 -82 -61 -144 -123 -74 -42 -25 29 146 102 142 159 105 -22 -50 -70 -152 -132 -102 -63 20 56 109 184 143
8189 143 142 52
8191E2
##END NTUPLES=NMR FID
##END=
