##TITLE=1H_CPA-2
 D2O
 8 sc, 
 10.7.2024
##JCAMPDX= 6.0         $$ Bruker NMR JCAMP-DX V2.0
##DATA TYPE= NMR FID
##DATA CLASS= NTUPLES
##ORIGIN= UXNMR, Bruker Analytische Messtechnik GmbH
##OWNER= root
$$ XWIN-NMR		Version 3.5
$$ Wed Jul 10 13:51:59 2024 Russian Standard Time (UT+4h)  she@DPX200
##.OBSERVE FREQUENCY= 200.1314
##.OBSERVE NUCLEUS= ^1H
##.DELAY= (6, 6)
##.ACQUISITION MODE= SIMULTANEOUS
##.ACQUISITION SCHEME= undefined
##.AVERAGES= 8
##.DIGITISER RES= 18
##SPECTROMETER/DATA SYSTEM= spect
##.PULSE SEQUENCE= zg30
##.SOLVENT NAME= CDCl3
##.SHIFT REFERENCE= (INTERNAL, CDCl3, 0, 15.7039)
##AUDIT TRAIL= $$ (NUMBER, WHEN, WHO, WHERE, WHAT)
$$ ##TITLE= Audit trail, XWIN-NMR		Version 3.5
$$ ##JCAMPDX= 5.01
$$ ##ORIGIN= Bruker BioSpin GmbH
$$ ##OWNER= she
$$ F:/spectra/data/she/nmr/H-F/1/audita.txt
$$ ##AUDIT TRAIL=  $$ (NUMBER, WHEN, WHO, WHERE, WHAT)
(   1,<2024-07-10 13:50:33.28 +0400>,<she>,<DPX200>,
      <created by zg, POWCHK disabled, PULCHK disabled
       configuration hash MD5:
       00 E9 B6 7A A2 85 ED C7 34 08 36 98 17 FE 4E 26
       data hash MD5: 16K
       5A 82 29 CA FA A7 04 62 61 89 8A A9 F5 AC 0E 8E>)
$$ ##END=
$$ 
$$ hash MD5
$$ 49 3F 66 8F A7 F7 3F 98 BA C8 8E A0 8E C1 79 78
##$RELAX= 
##$RELAX= 
##$RELAX= 
##$RELAX= 
##$RELAX= 
##$RELAX= 
$$ Bruker specific parameters
$$ --------------------------
##$DU= <F:/spectra>
##$EXPNO= 1
##$NAME= <H-F>
##$PROCNO= 1
##$TYPE= <nmr>
##$USER= <she>
##$AMP= (0..31)
100 100 100 100 100 100 100 100 100 100 100 100 100 100 100 100 100 100 
100 100 100 100 100 100 100 100 100 100 100 100 100 100 
##$AQSEQ= 0
##$AQ_mod= 1
##$AUNM= <au_zg>
##$AUTOPOS= <>
##$BF1= 200.13
##$BF2= 200.13
##$BF3= 200.13
##$BF4= 200.13
##$BF5= 200.13
##$BF6= 200.13
##$BF7= 200.13
##$BF8= 200.13
##$BYTORDA= 1
##$CFDGTYP= 0
##$CFRGTYP= 5
##$CHEMSTR= <none>
##$CNST= (0..31)
1 1 145 1 1 1 1 1 1 1 1 1 1 1 1 1 1 1 1 1 1 1 1 1 1 1 1 1 1 1 1 1 
##$CPDPRG= <>
##$CPDPRG1= <>
##$CPDPRG2= <>
##$CPDPRG3= <>
##$CPDPRG4= <mlev>
##$CPDPRG5= <mlev>
##$CPDPRG6= <mlev>
##$CPDPRG7= <mlev>
##$CPDPRG8= <mlev>
##$CPDPRGB= <>
##$CPDPRGT= <>
##$D= (0..31)
0 1.2 0 0 0 0 0 0 0 0.06 0 0.03 0 0 0 0 0.0002 0 0 0 0 0 0 0 0 0 0 0 0 
0 0 0 
##$DATE= 1720605032
##$DBL= (0..7)
120 120 120 120 120 120 120 120 
##$DBP= (0..7)
150 150 150 150 150 150 150 150 
##$DBP07= 0
##$DBPNAM0= <>
##$DBPNAM1= <>
##$DBPNAM2= <>
##$DBPNAM3= <>
##$DBPNAM4= <>
##$DBPNAM5= <>
##$DBPNAM6= <>
##$DBPNAM7= <>
##$DBPOAL= (0..7)
0.5 0.5 0.5 0.5 0.5 0.5 0.5 0.5 
##$DBPOFFS= (0..7)
0 0 0 0 0 0 0 0 
##$DE= 6
##$DECBNUC= <off>
##$DECIM= 24
##$DECNUC= <off>
##$DECSTAT= 4
##$DIGMOD= 1
##$DIGTYP= 9
##$DL= (0..7)
0 120 120 120 120 120 120 120 
##$DP= (0..7)
150 150 150 150 150 150 150 150 
##$DP07= 0
##$DPNAME0= <>
##$DPNAME1= <>
##$DPNAME2= <>
##$DPNAME3= <>
##$DPNAME4= <>
##$DPNAME5= <>
##$DPNAME6= <>
##$DPNAME7= <>
##$DPOAL= (0..7)
0.5 0.5 0.5 0.5 0.5 0.5 0.5 0.5 
##$DPOFFS= (0..7)
0 0 0 0 0 0 0 0 
##$DQDMODE= 0
##$DR= 18
##$DS= 0
##$DSLIST= <SSSSSSSSSSSSSSS>
##$DSPFIRM= 0
$$ [...]
##$SUBNAM2= <"">
##$SUBNAM3= <"">
##$SUBNAM4= <"">
##$SUBNAM5= <"">
##$SUBNAM6= <"">
##$SUBNAM7= <"">
##$SUBNAM8= <"">
##$SUBNAM9= <"">
##$SW= 24.0689651099613
##$SWIBOX= (0..15)
0 0 2 0 0 0 0 0 0 0 0 0 0 0 0 0 
##$SW_h= 4816.95568400771
##$TD= 16384
##$TD0= 1
##$TE= 0
##$TE2= 300
##$TE3= 300
##$TEG= 300
##$TL= (0..7)
0 120 120 120 120 120 120 120 
##$TP= (0..7)
150 150 150 150 150 150 150 150 
##$TP07= 0
##$TPNAME0= <>
##$TPNAME1= <>
##$TPNAME2= <>
##$TPNAME3= <>
##$TPNAME4= <>
##$TPNAME5= <>
##$TPNAME6= <>
##$TPNAME7= <>
##$TPOAL= (0..7)
0.5 0.5 0.5 0.5 0.5 0.5 0.5 0.5 
##$TPOFFS= (0..7)
0 0 0 0 0 0 0 0 
##$TUNHIN= 0
##$TUNHOUT= 0
##$TUNXOUT= 0
##$USERA1= <user>
##$USERA2= <user>
##$USERA3= <user>
##$USERA4= <user>
##$USERA5= <user>
##$V9= 5
##$VALIST= <valist>
##$VCLIST= <CCCCCCCCCCCCCCC>
##$VD= 0
##$VDLIST= <DDDDDDDDDDDDDDD>
##$VPLIST= <PPPPPPPPPPPPPPP>
##$VTLIST= <TTTTTTTTTTTTTTT>
##$WBST= 1024
##$WBSW= 4
##$XGAIN= (0..3)
0 0 0 0 
##$XL= 0
##$YL= 0
##$YMAX_a= 423810
##$YMIN_a= -389853
##$ZGOPTNS= <>
##$ZL1= 120
##$ZL2= 120
##$ZL3= 120
##$ZL4= 120
##$ABSF1= 10
##$ABSF2= 0
##$ABSG= 5
##$ABSL= 3
##$ALPHA= 0
##$AQORDER= 0
##$ASSFAC= 0
##$ASSFACI= 0
##$ASSFACX= 0
##$ASSWID= 0
##$AUNMP= <proc_1d>
##$AZFE= 0.1
##$AZFW= 0.1
##$BCFW= 1
##$BC_mod= 2
##$BYTORDP= 1
##$COROFFS= 0
##$CY= 11.3945322036743
##$DATMOD= 1
##$DC= 2
##$DFILT= <>
##$DTYPP= 0
##$F1P= 15.6554695791079
##$F2P= 12.8336369535428
##$FCOR= 0.5
##$FTSIZE= 0
##$FT_mod= 4
##$GAMMA= 1
##$GB= 0.15
##$INTBC= 1
##$INTSCL= 1
##$ISEN= 128
##$LB= 0.24
##$LEV0= 0
##$LPBIN= 0
##$MAXI= 10000
##$MC2= 0
##$MEAN= 0
##$ME_mod= 0
##$MI= 1.114404
##$NCOEF= 0
##$NC_proc= 0
##$NLEV= 6
##$NOISF1= 3.799351
##$NOISF2= 2.8
##$NSP= 1
##$NTH_PI= 0
##$NZP= 0
##$OFFSET= 15.70392
##$PC= 1
##$PHC0= -25827.16
##$PHC1= 9.98748
##$PH_mod= 1
##$PKNL= yes
##$PPARMOD= 0
##$PSCAL= 0
##$PSIGN= 0
##$REVERSE= no
##$SF= 200.130013532006
##$SI= 16384
##$SIGF1= 3
##$SIGF2= 2
##$SINO= 400
##$SIOLD= 16384
##$SREGLST= <1H.CDCl3>
##$SSB= 0
##$STSI= 0
##$STSR= 0
##$SW_p= 3612.71676300578
##$SYMM= 0
##$S_DEV= 0
##$TDeff= 0
##$TDoff= 0
##$TI= <>
##$TILT= no
##$TM1= 0
##$TM2= 0
##$TOPLEV= 0
##$USERP1= <user>
##$USERP2= <user>
##$USERP3= <user>
##$USERP4= <user>
##$USERP5= <user>
##$WDW= 1
##$XDIM= 8192
##$YMAX_p= 0
##$YMIN_p= 0
$$ End of Bruker specific parameters
$$ ---------------------------------
##NTUPLES= NMR FID
##VAR_NAME=  TIME,          FID/REAL,        FID/IMAG
##SYMBOL=    X,             R,               I
##VAR_TYPE=  INDEPENDENT,   DEPENDENT,       DEPENDENT
##VAR_FORM=  AFFN,          ASDF,            ASDF
##VAR_DIM=   8192,          8192,            8192
##UNITS=     SECONDS,       ARBITRARY UNITS, ARBITRARY UNITS
##FACTOR=    0.0002076,     1,               1
##FIRST=     0,             0,               0
##LAST=      1.7004516,     0,               0
##MIN=       0,             -389853,         0
##MAX=       1.7004516,     423810,          0
$$ Real data points
##PAGE= N=1
##DATA TABLE= (X++(R..R)), XYDATA
0@%%%%%%%%NnOj2J2j2J8k4K7l3L9m5N7o8P4r2J12j24J42j65J85k11K42k69L04
33A63l44L80m26M81n33N91o61P32q09Q97r90J095j216J346j489J654j843K057
51A085k305K594k935L355l868M501n295O191o369l802l58810K8569M15202J83492
65B61605j8962k21822l45169j4076M76901K85333k71184l86094p7484J98882L20041
76B07971J34539k69205l77097p359L38207K96558n2139l65947k67726J75367L71713
87A84882J24682j78347k93324j77032K07747M30414N2257m03577k63553J21619
97a94232K40713J99384J4760l34812l15666K07696M32502N2133k68887k25131
107a91540o4480J71658L34880O3754l56854k88463J32977L17473J59738j14291
$$ y = [0, 0, 0, 0, 0, 0, 0, 0, 0, 5, 0, 6, -6, 6, -6, 12, -12, 15, -18, 21, -24, 33, -35, 39, -53, 59, -65, 77, -88, 97, -114, 128, -141, 163, -181, 199, -227, 254, -279, 312, -349, 383, -426, 471, -519, 576, -640, 706, -783, 871, -972, 1085, -1220, 1374, -1561, 1794, -2074, 2427, -2868, 3323, -3046, -6848, -365658, -337089, 78113, 261605, 242643, 20821, -324348, -338424, 138477, 423810, 152626, -233468, -310952, -112070, 207971, 342510, 73305, -303792, -311151, 27056, 323614, 271475, -94472, -362198, -186831, 184882, 309564, 131217, -162107, -339139, -131392, 299022, 351279, -52298, -315851, -194232, 46481, 245865, 260625, -74187, -389853, -182157, 250345, 302478, 33591, -191540, -256020, -84362, 250518, 314272, -42582, -331045, -198068, 119405, 279143, 164852]
117A64852k97147j72823J83237L29458Q5069k35546k95774l5906K86698K75302
127B87420p2815k98864j75646Q5216K64223K05161j32241l60202j08181K69110
137c6819K59268p677j94234k28621m4790K71642K80507j04141l32133j28543J57036
148a08505K39486J20423j39025k96906r1485K48981K69140k1915k50433k05404
158b35643M5710K59215J89184j05041k76659j33760J51372K70460Q6627k04558
168D6907k55649r866K26465K05306k2515k33333k02237P6841K79936J40203j54049
179I8009k46356p6398J58140K37508N9781k09381k39121K0895K43075J78303o8285
190A56170k32291j51899J00893K50744J11362j58337k40155n1527J86289K15349
$$ y = [164852, -132295, -305118, -121881, 207577, 292646, 57100, -238674, -274580, 12118, 287420, 214605, -84259, -259905, -174689, 89534, 294695, 162454, -197748, -305929, -36819, 222449, 214772, 20538, -208083, -252873, 18769, 299276, 195135, -136998, -265541, -108505, 130981, 251404, 112379, -184527, -276012, -27031, 242109, 220194, -30239, -235643, -189933, 69282, 258466, 153425, -123234, -256994, -105622, 164838, 251465, 46907, -208742, -218608, 7857, 213163, 190648, -42685, -244922, -168081, 111855, 252058, 98009, -148347, -224745, -66605, 170903, 230684, 21303, -217818, -196923, 46152, 224455, 156170, -76121, -228020, -127127, 123617, 234979, 76642, -163513, -215040, -28751, 186598]
200A86598O651k10723j91984M3664K28694J55635r1550k34721j13428J34441K29991
211A43268O7796j68944k16117j9991J98120J91933k8176k13469j61304P0427K25752
222H9295J26272j18081k24444p6624J49912K07307L8001j76119j96597R244K05237
233C3403J62790o0562k09428j26365R4903K12991R2355j35478k08746m5563J66121
244b3579J91313K333j89686j66327M4384K00455J33358p8199k06081j05314J20944
255g6399K09769N3749j55678j82025j4348J64993J70453j7592j97241j46225P6620
266a13924K00090R5487j02659j88461p3453J31835J95082K8424j70982j67296
276a65857K0354J77727J41242n0004j90657j16409R2137J94721P7170j24123j85885
$$ y = [186598, 193249, -17474, -209458, -165794, 62900, 218535, 126985, -107736, -221164, -86723, 143268, 211064, 42120, -173997, -193988, 4132, 196065, 167889, -45580, -206884, -136457, 89295, 215567, 97486, -126958, -203582, -53670, 153637, 191638, 15519, -181078, -171834, 33403, 196193, 135631, -73797, -200162, -105259, 107732, 200087, 64609, -144137, -189700, -23579, 167734, 170067, -19619, -185946, -141562, 58893, 192251, 114052, -92029, -197343, -76399, 133370, 187119, 31441, -150584, -164932, 61, 170514, 152922, -44319, -190544, -113924, 86166, 181653, 78994, -109467, -182920, -51085, 143997, 172421, 1439, -165857, -145503, 32224, 173466, 123462, -67195, -183604, -91467, 103254, 180424, 56301, -129584]
287a29584l9327J51938J69889k781j68020j45992L5926J81410J24055p8914j91068
298i2468q1736J13926J75808M7809j32200j72113j5833J65016J53998l4215j75560
309d7568j18847O3191J76915R7850r5516j84246n9868J31141J69177K0000j47569
320D660j51903J2516J65490J31745n1727j75136j00625Q5277J74344O8193j14980
331D7854j68103l2424J38615J53614l060j56997j34927L9939J69159J06800p3930
342H6540j70310p7103J02073J68157M4930j29331j56685p348J47860J37050k5856
353A19977j59430j14844N9469J66749Q5437r1290j63876n2828J16213J54935J9921
364A40433j38148j40655J5437J53271J17859m8988j60187r2353P8747J62100O3035
$$ y = [-129584, -168911, -16973, 152916, 150135, -17885, -163877, -127951, 53459, 177514, 98600, -92468, -174204, -60278, 115530, 163339, 31139, -140974, -156807, 8209, 162207, 127992, -47568, -166415, -103224, 73691, 171541, 76025, -108221, -168089, -36948, 132229, 152229, 4660, -147243, -134727, 30763, 162508, 110781, -64355, -164980, -79703, 94641, 162834, 47854, -120249, -152673, -14058, 139556, 136496, -20501, -155428, -115489, 53670, 160470, 86540, -83770, -160873, -58800, 109357, 154287, 24956, -131729, -139077, 8783, 145833, 119977, -39453, -154297, -94828, 71921, 157358, 66068, -97808, -150636, -34423, 120512, 140433, 2285, -138370, -122933, 30338, 148197, 99209, -60978, -153331, -74584, 87516, 150551]
375A50551j07045j55758k9387J28422J42135k498j44171j24134L5634J55201R9349
386A48299o7191j56839p0627R3833J53051M0634j17876j43238p257J35950J25536
397A34275k5169j46905j04621N5166J53141P8633q4343j51958m8674J08069J43123
408A10737J8428j26460j30067J2871J41118J10089m4266j47109q4900P1098J47915
419G9454N9117r6797j43120k7790J17869J29769l016j31629j13171L2333J41754
430D4773R1534o2086j44895o4980Q7038J41038L6860j08461j31899p103J24389
441F208J16846k1548j36097r7556N1886J40992P0817p6161j36799m6506R6954
452c0964J33385J7711j18778j17870J5318J26812R7884l8052j34547q0941O7632
$$ y = [150551, 43506, -112252, -141639, -13217, 128918, 126420, -17751, -141885, -106251, 48950, 148299, 81108, -75731, -146358, -52525, 100526, 141160, 23284, -119954, -127211, 8739, 134275, 109106, -37799, -142420, -87254, 65887, 144520, 60177, -91781, -140455, -32386, 110737, 129165, 2705, -127362, -114491, 26627, 136716, 92450, -54659, -139559, -68461, 79454, 138571, 41774, -101346, -129136, -11267, 118502, 115486, -16143, -129314, -96981, 44773, 136307, 74221, -70674, -135654, -48616, 92422, 129282, 20821, -111078, -118181, 6208, 123054, 101506, -34591, -132147, -80261, 60731, 131548, 55387, -81412, -127918, -30964, 102421, 120132, 1354, -116516, -101198, 25614, 123498, 85446, -49101, -130042, -62410]
463f2410J38820N0435r2030j28214k4343J05801J20433j022j23881j04964L2395
474h8980J30804Q2243n6473j32114o0357Q0134J29720L3306r9213j20155o956
485a08041J15220J07183k2455j25057q5651M7238J26825O6611o9760j29848m1181
496a18916R4374J19910J2020j06208j07341R918J18681R4634l9118j27002o9897
507a18945O2826J23518M8341q1229j21281k3594J01066J10239m125j12033r4412
518a09629K8318J19959P6660n3338j22394n3703P4703J18919K9797r2381j11003
529i4092n227J06472R8654k0569j16413q0419M5050J18289N9856o4307j18237
540g0943l9643Q5857J13387J1064j00710r7123J1368J06816Q6237l3060j17899
$$ y = [-62410, 76410, 126845, 34815, -93399, -117742, -11941, 108492, 107470, -16411, -121375, -88980, 41824, 124067, 67594, -64520, -124877, -44743, 84977, 118283, 19070, -101085, -108041, 7179, 114362, 91907, -33150, -118801, -71563, 55262, 121873, 52113, -77735, -118916, -24542, 95368, 107388, 1180, -106161, -96243, 22438, 117072, 77954, -49048, -118945, -56119, 67399, 115740, 34511, -86770, -110364, -9298, 100941, 96816, -15217, -109629, -81311, 38648, 115308, 61970, -60424, -114127, -39424, 79495, 109292, 16911, -94092, -99319, 7153, 105807, 85238, -31175, -111594, -66544, 51745, 111601, 47294, -70943, -110586, -24729, 88658, 99722, -988, -98111, -86743, 20073, 106310, 73250, -44649]
551d4649o6665O0757J15716M0866p5867j08964k2054R2115J03274l642j05580
562a4693q8077K7654J12172P0351n1328j12710m7934O6941J08434L2054q5108
573A7756j08756k475J04589Q5599k3539r9043p2921L2054J13056O3957o8171j15034
585g2928k4382Q0850R2645J4170q3706r9261N821J10976P9768m2058j05183n4421
597i7709M9859J04331M4669p1184j06033j8413Q7016R4667k902r9307q1857K9922
609f6941J01668N9422m0698j00427n5148O3243J13851K1227r1132q5244M326P7521
621A668Q1874j891j04894q3027N0560J11281L5950n8994q5742l7069O0791J06177
633G6684J7724r8415q6953K1297R1038O5414k5477r6213o0971M9814J01842L6994
$$ y = [-44649, -111314, -50557, 65159, 106025, 30158, -78806, -100860, -8745, 94529, 90887, -14693, -102770, -75116, 37056, 107407, 56079, -56631, -104565, -37624, 70810, 102864, 17756, -91000, -93475, 11114, 96713, 73174, -25869, -98790, -66736, 46320, 110277, 42106, -72928, -97310, -16460, 76185, 90355, 6649, -92612, -86791, 24185, 103953, 61895, -43288, -97709, -47850, 56481, 101150, 29966, -76067, -94480, -7464, 87203, 84301, -15006, -96863, -66941, 34727, 94149, 53451, -46976, -102124, -38881, 74970, 96197, 5065, -80179, -75853, 1668, 83542, 81651, -23243, -106270, -55710, 55571, 91521, 32527, -53215, -90284, -29493, 76684, 94408, -4007, -90960, -69663, 21375, 86789, 61312, -34901, -95872, -46058, 55784, 92778]
645I2778o6241r6679j8986Q4685Q7820j1190q6603o6997J5715Q9852P3306m2289
657E5171j13083l6127P3964Q1721J4820n6254q7716k2187R3032R2773l1330j00327
669c5543m6285L5988P8434N4382m1208j05183l4608Q0224Q7966l5p5747p3583
681g5198N121Q6191P0220k9463r2712n1611M4800R5061L6681o8228q8483p086
693g4707P0286P2406N533p8366q2632K2855J03014M8268n1893p7451l2742L9847
705c5582Q8569L6580p6764r2982J0246Q4458N7282j5110p3082o4722K5706R6773
717D1372M6574n8510q5796k0016O0474P8833J1175p3820p4428J0448Q0488O2383
729G9177k5018q8668m9368M9510Q4806K4054n3828p5392k1232O6130Q4005n424
$$ y = [92778, 26537, -70142, -89128, -4443, 83377, 72187, -14416, -81413, -65698, 24154, 97460, 55171, -57912, -94039, -20075, 61646, 76466, 20212, -67504, -89691, 3341, 96114, 64784, -35543, -81828, -45840, 32594, 86976, 45768, -59415, -94023, -13799, 74167, 74132, -1615, -75198, -70077, 16114, 86334, 56871, -35841, -87452, -42652, 52409, 89090, 20862, -67621, -74707, -4421, 67985, 73518, -4848, -87480, -64625, 38389, 86657, 34764, -42687, -75429, -35582, 52987, 89567, 12803, -80179, -69933, 14525, 71807, 56697, -16385, -81107, -55401, 41372, 87946, 29436, -56360, -76376, -15902, 62931, 74106, 286, -74142, -63694, 16794, 79177, 54159, -34509, -83877, -34367, 50439, 74493, 20665, -54727, -75959, -9829, 74176, 68752]
741F8752q7272n8070K8948P3250M7464k7515q5083m4720N8084Q7412J0847o6815
753E282o7032k892O7209O9740j1925q4013n4851L5897Q0758L7266m5295p9627
765d9483k4549N9397P5204O806o7877o8181Q462P7956N7388k9625p8668l9484
777g2654L8831P6257L2006n3060q0089j1043O9082O5710p277o8316n8035J6428
789e2160P7883M9966l8031p9684k9577M9521P2439J7864n8348p1063j470O9929
801G269O0647j5939p3396m9343K9747P6064L6309m4201p4241k1455N5141P0245
813E6847O327o5032o2861J0510P0777N1668k4504p3552m0338L8812P4009K5662
825F8325n1039o9981j0700O0534O3749m799o7712n4087J9589P1090M3289l3385
$$ y = [68752, -18520, -76590, -47642, 25608, 73072, 45557, -39526, -84246, -26162, 61250, 72097, 5282, -61750, -64642, 2567, 72307, 60382, -23631, -78482, -42585, 38173, 75439, 30144, -49483, -74032, -14635, 60569, 67375, -502, -68683, -60221, 17735, 75123, 45498, -33170, -72654, -33823, 42434, 74440, 21380, -58709, -69752, -670, 65040, 57763, -10553, -68588, -52160, 25723, 75689, 37658, -42026, -71603, -22082, 50357, 68221, 9873, -61190, -62660, 7269, 67916, 51977, -21419, -70762, -41015, 35049, 71358, 27157, -47084, -68539, -13398, 56847, 63174, -1858, -64719, -54209, 16568, 68236, 43732, -29820, -70158, -31346, 42663, 68325, 17286, -52695, -63395, -2861, 60888, 56089, -11623, -65710, -46121, 24969, 68258, 34873]
837C4873p3046k9607M6815O9883J4519n6262o4176m53O4171N6471j4696o9194
849b0702m5831K8999P1125L2965m1950o8813j9186N1487O5055N934o1283n8741
861f0941J0830O6925M6802k3973o7310l7219L5425O9776K4281m9928o5191p544
873e8067N6322N7819m086o2632n1604J8864O8123L9267l3007o6712k6676M2839
885a9550O5047J3944n2967o0140L67O0146N2512j4328o5061m1737K7789O5284
897C1306L0263l8215o4668j8625M9474O1318L185n7451n2270R567O0662M5095
909E9641k1624o5445l4169L5931O3832K0302m4636n9664r133N2804N5710n045
921D8504n9894m6270J8578O1872L6353k9841o2775k5044M0913O0566J2102m9548
$$ y = [34873, -38173, -67780, -20965, 48918, 63437, 7175, -57001, -57454, 6717, 63188, 48492, -20702, -66533, -37534, 33591, 66556, 24606, -44207, -63393, -11906, 53149, 59083, -2200, -60941, -50111, 16814, 63616, 39643, -27667, -64886, -29461, 40315, 64596, 14668, -50523, -58067, -1745, 56074, 51988, -10644, -62248, -43384, 24739, 64006, 30999, -35713, -62389, -19550, 45497, 59441, 6474, -53666, -53299, 6847, 59359, 45031, -20030, -61767, -33978, 31306, 61569, 23354, -41314, -59939, -10465, 50853, 54038, -3413, -55683, -46116, 14546, 59641, 38017, -27428, -61597, -25666, 38166, 58468, 13832, -45832, -54965, -2161, 53549, 48504, -11390, -57660, -39082, 22790, 59143, 29302, -33473, -58517, -17604, 42962, 55064, 5516]
933E516n5757R50N6161M8188j3847n9777l8868K5524O1415K8226l6842o0360j5458
946e4929M5847N5743L389n2593m9890R050N7993M1299k1777n9741l0556L2223
958b3942N9147J9505m1951n6291p211M9950N0499n439n4824m2855J7115N7984
970B1687L3462k8584n8335k2400L8397N5804J0819m6157n1453J115N2465M4565
982E1385j3450n5813l5446K4184N6851K5794l4485n5876j4124M3288N1423K328
994D6059m9186m5628R046N3658L7961k0588n5664k7885L0718N4754J7344l9349
1006A1240n1913o139M6417M6613n209n1399l9623J6736N3981L0348k7055n3610
1018b9613k0448L5618N1960R694m3577m7474K145M8717M0546j2656n1678l2944
$$ y = [5516, -50241, -49291, 6870, 55058, 41211, -18566, -57434, -31910, 29505, 57731, 20889, -39471, -54929, -9082, 46661, 50050, -2543, -52433, -43383, 14610, 55909, 34132, -25609, -56165, -23942, 35205, 54710, 12759, -43532, -50743, -793, 49706, 44267, -10557, -53412, -36297, 21687, 55149, 26565, -31770, -54170, -15773, 40031, 50850, 4693, -46760, -45645, 6820, 51385, 37935, -17878, -53324, -29140, 27711, 53505, 19020, -36856, -50980, -7692, 43731, 46059, -3127, -48755, -39709, 13949, 51910, 31322, -24342, -52227, -21509, 33245, 50589, 11240, -40673, -46812, -395, 46218, 41009, -10390, -50013, -33277, 20704, 51052, 23997, -29613, -50061, -14443, 37517, 47211, 3634, -43840, -41695, 7022, 47568, 34912, -16766, -49710]
1030d9710K2891N3367K3136l2947n1242j2364L9928M7843J732m6179m2175R344
1042c6376N0230L4352j9968n1297k5507K9061N0864J5431l7090m8075m694M3489
1054D20M2898n867m7923l5976J6298N0166K7610k5873n0148j8074L4189M7876
1066C5596P846m1052m3437K603M5747L7282j2743m8609k9705K2625M9304K0361
1078D5818l1037m7581j0747L8180M4118M57m3627l8358R588M6890L1352j9122
1090B5931m8302k2947K8119M7390J3079l5116m4225l606M0902L9607o383m5226
1102a0777l2770J6152M6709K4889k4646m6669j6200L2529M4535O466l8701m0230
1114c8713L393M2813L4490j2786m5524k6954K1831M5711J8494k9507m4354r357
$$ y = [-49710, -26819, 26548, 49684, 16737, -34505, -46869, -6941, 40902, 42634, -3545, -45720, -36376, 13854, 48206, 28238, -23059, -48566, -19505, 31359, 46790, 9700, -38375, -43069, 420, 43318, 37451, -10472, -46448, -30150, 20016, 47626, 21753, -28395, -46469, -12280, 35596, 43442, 2390, -41047, -38444, 7303, 44585, 31842, -16767, -46472, -23847, 25457, 45818, 14781, -32800, -43547, -5367, 38751, 39208, -4419, -42777, -33189, 13701, 45053, 25931, -22371, -45318, -17199, 30191, 43270, 8154, -36071, -39677, 1225, 40832, 34449, -10777, -43547, -27395, 19314, 44203, 19557, -27112, -43312, -10783, 33752, 40218, 1517, -38713, -35320, 7493, 41983, 29197, -16327, -43281, -21450, 24261, 42755, 13248, -31106, -40463]
1126d0463L6018M0940k67m0833l5502R526M4013K8687j8628m4896k0762K6614
1138a5553M3925J2052l3463m1096k692L8652L6584o622m2222l0298J5533M3737
1150A8537K2822k3633m3391j4441L0562M1321N652l6574l7329L736M0260L1767
1162C9289j2428m2572k4905K0675M2974J6907k8059m1274q104L3995L7738q50
1174C3386l8063l2854R057M1234K6965j8187m2396j8438K5618M0323J0588l0794
1186F439l8612k488L7054L4092p540l9568k7223J4860M0425K1410k2409m1220
1198b4780j2940K9624L8314M095l4006l4344L650L7903K9312j2081l9831k2928
1210c8012K0005M0396J5004k7242l8030o438L1384L4829l98l6109l1526J0105
$$ y = [-40463, -4445, 36495, 36228, -4605, -40107, -30581, 13432, 42119, 23491, -21405, -42167, -15553, 28372, 40424, 6961, -34135, -36827, 1825, 38409, 31787, -10435, -40733, -25200, 18537, 41359, 17726, -25665, -40106, -9544, 31777, 37429, 855, -36474, -32738, 7522, 39289, 26861, -15711, -40616, -19941, 23033, 39940, 11881, -29393, -37497, -3502, 34236, 33386, -4677, -37531, -28474, 12760, 39725, 21538, -20858, -39296, -13678, 26645, 37233, 6439, -32173, -34661, 2393, 36485, 28945, -10623, -37846, -22986, 17439, 38849, 16440, -24780, -37720, -8096, 30218, 34313, 307, -34037, -30387, 7516, 36828, 24747, -15084, -38012, -18007, 22389, 37393, 10151, -27879, -34317, -2933, 31896, 31498, -4611, -36137, -26032]
1222b6032L9539K3275j7890l7883j7103K2697L8833J0537l1180l6076K21L4403
1234C341K9763o285l6278k6384J4129L9329J8844k2422l7454j1058K7237L5403
1246B8165L867l2262l1880M270L5323K7142j1750l7906k0574J9912L6783J2730
1258C3820k4333l5050p351L0361L4003k615l5222k6426J0066L4337K2176j4840
1270A8926l7419j6822K4417L6021O588k8250l1308j137L1146K9872o572l5874
1282a0412k3390J4920L5414J6764k0256l5053j0291K5978L2975L006l0106k9756
1294c0207M142L4198K4532j2712l4168j7867J7235L3990J3595k3966l4712l960
1306b9900K9615K8475k802l0056k5772P845L4457K1223j7223l4548j2452K1684
$$ y = [-26032, 13507, 36782, 18892, -18991, -36094, -13397, 25436, 35973, 4793, -31283, -31062, 3341, 33104, 26819, -9459, -35843, -21714, 17615, 36459, 14037, -23417, -34475, -7238, 28165, 32032, -230, -32110, -27840, 7483, 34625, 22875, -15031, -35605, -15693, 21090, 33820, 9487, -25563, -32914, -2553, 31450, 28835, -6387, -32813, -22747, 11590, 33766, 18926, -18493, -35315, -10898, 25123, 31711, 3461, -27847, -28984, 2162, 32034, 25462, -10412, -33802, -18882, 16532, 33296, 13040, -22013, -32304, -6326, 26649, 29655, -451, -30207, -26065, 8133, 32665, 19953, -14215, -32082, -14847, 19143, 32738, 8772, -25940, -29900, -285, 28190, 25388, -4668, -30440, -22595, 11862, 33085, 15862, -18686, -31138, -9454]
1318i454L1876P583k6005l1259m5L0966K6205p436l2366k1271J3740L3336J5339
1331C1209j9809l2312q951K4436L0913K247k9354k7121N655L0991K1778j0839
1343A8843l2100j8050J7835L3452R919k3596k9692l740K6089K7932k153l0549
1355e810k4004J0168L1853J7504j5357l1376j2569K0723L1009N857k5809k7803
1367b5614Q45K8573K4274p295l0647j9512J3708L0942J4001j8910l0746p816K4133
1380d064K8400O63k6871k4760M846K9286K1274j1433l1027j5151J7327K9851R219
1393B7560k1337k8646l524K5924K5833l400k8428k1389R131K9658J6972j5050
1405A3304l0060j0956K0041K8572N217k4209k6258J215K7185K2429p246k8816
$$ y = [-9454, 22422, 30005, 4000, -27259, -27304, 3662, 29867, 22431, -9935, -31206, -17466, 15870, 31209, 11400, -20912, -29863, -5427, 25486, 27733, -1621, -28742, -23087, 7904, 29682, 18843, -13257, -31307, -13472, 19980, 29899, 6303, -23389, -27129, -1040, 26892, 24739, -5810, -29814, -19646, 12207, 29711, 14354, -17022, -29591, -8868, 22141, 27998, 2189, -25614, -24769, 3804, 28078, 20783, -9864, -29376, -15668, 15274, 29275, 10365, -20381, -28197, -4064, 24336, 24999, -1872, -26632, -21786, 7500, 28774, 17341, -13686, -28837, -11510, 18341, 27560, 6223, -22423, -25947, -23, 25810, 22410, -6018, -27407, -18276, 11382, 28354, 13304, -16756, -27712, -7671, 20901, 26118, 1909, -24349, -23134, 4051, 26480, 19234, -9582]
1417i582j8027J3020K9394J2835j8466k8401o756K2314K6444J062k5766k3530
1429b5459N309K7955J9091j1116k8906j3964J6407K8268Q682k1049k6571k732
1441b4085K4434K3857l292k6928k0028R181K8033J5441j4580k7943j0125J9061
1453f974K6844M301k2807k4441J547K5657K0849p090k7281j6587J2556K7602J1726
1466B5902j7542k6703o111K1403K4666M11k4385k1680N472K6231J7694j0791k7061
1479a2494j2915J5608K6507P789j9816k4922k177K2949K2422l550k5106j8795
1491b4500Q789K6331J4344j3809k6181r362J7958K5280L875k1660k2749J647K4061
1504D024J9461o924k5441j5558J2072K5857J0631j6440k4983n503K0138K3060
$$ y = [-9582, -27609, -14589, 14805, 27640, 9174, -19227, -25983, -3669, 22775, 23837, -1929, -25459, -20150, 7805, 26896, 15780, -13126, -27090, -10683, 17585, 26267, 5218, -21353, -24085, 349, 24206, 20914, -6014, -26042, -16861, 11172, 26613, 12033, -15910, -26035, -6974, 19870, 24171, 1364, -23077, -21530, 4127, 24976, 17886, -9395, -25982, -13426, 14176, 25902, 8360, -18343, -24454, -3051, 21615, 22026, -2359, -24039, -18567, 7664, 25358, 14567, -12494, -25409, -9801, 16706, 24495, 4679, -20243, -22420, 529, 22951, 19401, -5705, -24500, -15711, 10620, 24964, 11155, -15026, -24388, -6430, 18850, 22725, 1065, -21684, -20037, 4024, 23485, 16561, -8880, -24438, -12366, 13491, 24122, 7682, -17301, -22804, -2666, 20394]
1516B0394K04k3016k0102N104K4685J6466j0212k5365j2001J4830K4729P089j8628
1529D177k3309j702K1577K0833l486k3559j7426Q440K4659J3109j2997k4633q499
1542b2816J7258K3327L241k0233k1109J732K2612J7976o558k4034j4186J1444
1554a1346K4163R584j5360k3303m925J8885K1400Jk1601j8765N306K2992J5048
1567B2079r747k3729j0831J4037K3227O190j7500k1730j350K0306J9291l578k2235
1580e570j5829Q194K3023J2037j2576k2900p505J5995K1845K828j9121j9572J936
1593a7215K1159J6851o776k2298j3115J1091K2516Q649j4630k1727m297J7842
1605a950K0172o61k0094j7321M985K1781J3829r361k2205r867J3314K1730N488
$$ y = [20394, 20598, -2418, -22520, -17416, 7269, 23735, 13523, -11842, -23843, -9013, 15716, 22805, 4177, -19132, -20834, 743, 21576, 18090, -5469, -22895, -14455, 10204, 23313, 10316, -14317, -22816, -5558, 17769, 21010, 777, -20332, -18600, 4012, 21988, 15430, -8604, -22790, -11346, 12817, 22401, 7041, -16262, -21187, -2302, 19098, 19099, -2502, -21267, -15961, 7031, 22079, 12332, -11397, -22228, -8191, 15036, 21226, 3726, -18004, -19354, 952, 20243, 16665, -5570, -21399, -13205, 9818, 21855, 9279, -13621, -21126, -5131, 16714, 19542, 421, -19151, -17215, 3944, 20795, 14019, -8279, -21394, -10303, 12213, 20862, 6232, -15495, -19792, -1950, 18222, 17561, -2533, -19854, -14869, 6912, 20741, 11380, -10825, -20692, -7378, 14352, 19840]
1618A9840j6809k0180r35J9288J7877l757k0925j4584Q065K1475J1128j2066k1446
1631a3029o673J5350K0309K283j8193j8275K213K0079J5509o709k1052j1916J0764
1644i340K1062P944j4157k0285l750J7136J8472o83j9110j6081N069K0393J2943
1657A9613r264k0806r058J2858K0323M892j5867j8833p33J8417J6398l462j9839
1670e361j3727P781K0405J0185j1598k0144o138J4779J8997J978j7290j6995K342
1683a4786J8843J4400o394j9842j1172J0203J9997P226j3530j8920l430J6284
1695a121J7298p89j8064j5041M916J9224J2151q825j9631q458J2257J8929M569
1708A7415j5046j7594n99J7287J5477l527j8587j2690P368J9288R234j0826j8941
$$ y = [19840, 3031, -17149, -18084, 1204, 19081, 15324, -5601, -20185, -12120, 9355, 20483, 8417, -13029, -19702, -4352, 15957, 18240, 47, -18228, -16015, 4064, 19573, 12864, -8188, -20104, -9340, 11722, 19666, 5509, -14776, -18526, -1390, 17082, 16399, -2711, -18792, -13723, 6670, 19613, 10349, -10457, -19515, -6657, 13666, 18558, 2691, -16142, -16875, 1542, 17940, 14478, -5361, -19088, -11307, 9098, 19283, 7685, -12459, -18597, -3818, 15179, 17157, -133, -17128, -14786, 4057, 18457, 12063, -7779, -18951, -8748, 11249, 18475, 4945, -13975, -17405, -1121, 16177, 15388, -2676, -17717, -12801, 6423, 18574, 9749, -9882, -18340, -6083, 12846, 17415, 2369, -15225, -15824, 1463, 16940, 13413, -5174, -17864, -10496, 8792, 18026, 7200, -11741]
1721a1741n658J3898J7738J725j6155j6068K209J8005J3298n963j8652j0351R615
1734h100J8833O595j2689j7980k912J5367J6158r19j7089j3910M696J8111J1279
1747A7440q340j8563p699J1522J7806M109j4214j6600j48J6185J4543l556j7552
1760e067j1738P065J7981Q586j0149j7832n041J3046J6768J430j5543j4729K302
1773a2921J6914J2359n928j7626r444R208J7567O004j2019j6669k559J4383J5186
1786A4455j048j6015j3152M629J7222J0158q020j7153p051J0748J6752L945j3784
1799A686j5568J92J5465J3324l653j6125j1138O738J7077P915r924j6700m629
1812a5340J2658J5473J132j4387j3889K266J5728J1757n614j6801q696R100J6209
$$ y = [-11741, -17399, -3501, 14237, 15962, -193, -16261, -14052, 3953, 17251, 11288, -7364, -17715, -8100, 10733, 17328, 4639, -13341, -16253, -886, 15272, 14353, -2736, -16646, -11950, 6161, 17440, 9100, -9463, -17162, -5640, 12166, 16275, 2061, -14539, -14687, 1498, 16041, 12485, -5067, -16805, -9740, 8241, 16827, 6678, -11154, -16195, -3149, 13619, 15049, -494, -15223, -12921, 3993, 16352, 10424, -7202, -16646, -7438, 10129, 16133, 4114, -12555, -15114, -731, 14455, 13407, -2608, -15760, -11131, 6091, 16249, 8229, -8924, -15975, -5227, 11525, 15470, 1686, -13882, -13690, 1775, 15099, 11446, -4679, -15817, -9079, 7998, 15913, 5989, -10711, -15340, -2682, 12791, 13923, -464, -14353, -12087, 3641, 15398, 9784, -7017, -15713, -6613, 9596]
1825I596N511j1254j5590k605J3639J4679j395j5735j1591M792J5613R361p090
1838G931j6483o837J0732J5968K883j2846j4141J1J4248J2674l255j5559j0324
1851a4998O615J6126P275r688j5411m021J1626J4346J284j3627j3336K290J5589
1864D070J0469n953j5286p507P775J5107N973j1089j5434j492J3610J2582j658
1877A1167j3581j1204L718J5407R462p944j5608n577J0114J4319K956j1757j3603
1890a2131q3J3857J1940l350j4892r593O705J4945O490q934j4212m266J0935J4340
1904A1751Q66j3855j1930L355J3392R563m490j4348q907Q418J5611M060j1105
1917B381j2909j370J1203J2565n27j3856j1190M819J4590P795p239j3935n583
$$ y = [9596, 15107, 3853, -11737, -14342, -703, 13976, 12581, -3154, -14745, -9953, 5660, 15021, 7931, -8552, -15389, -4657, 11311, 14194, 1348, -12793, -12782, 1466, 14140, 10885, -4674, -14998, -8383, 7743, 15018, 5330, -10081, -14102, -2476, 11870, 13154, -473, -13809, -11519, 4070, 14539, 8586, -6700, -14207, -6432, 8675, 14648, 3559, -11875, -13367, 243, 12825, 11167, -2414, -13618, -9900, 5507, 14969, 7025, -8583, -14160, -4046, 10273, 13229, 1472, -12131, -12214, 1643, 13583, 10233, -4659, -14252, -7547, 7398, 13888, 4954, -9258, -13524, -2589, 11751, 12617, -1238, -13168, -9813, 3579, 13142, 8652, -5696, -14603, -6185, 9426, 13486, 2381, -10528, -11898, -695, 11870, 11343, -2513, -13703, -8884, 5706, 13501, 6262, -7673, -13256]
1930a3256R385J3891K804j1599j2855J16J3306J1201l796j3909q209N709J3717
1943F505O928q201j4680l660J1657J2632k27j1788j0762J374J3185J0493n323
1956H133j4856o362Q183J2964M190r043j3179k193J2101J2080j815j3161r535
1969a2493M212J3409P584o475j3602n346Q962J3192K709j1260j2180Q10J2455
1982A977R752k948j2586q969N559J4112O014q988j2748k543R517J1730J237j1620
1996e04j1486K582J3182Q454n094j2727o728O927J3168M463r623j2470j231J1095
2010HJ0963j232j2235r380M160J2500P412o227j3069n062Q824J2571J887j0492
2024F28j0820L01J1236J0042k913j2682p870N971J2382N414p584j2210l293R671
$$ y = [-13256, -3871, 10020, 12824, 1225, -11630, -11514, 1792, 12993, 9197, -4712, -12921, -7212, 6505, 13433, 5232, -9448, -13108, -1451, 11181, 10954, -834, -11596, -10222, 2963, 13456, 8133, -6723, -13085, -4902, 8062, 12252, 3209, -9970, -12163, -62, 12018, 10203, -2958, -12493, -8281, 5128, 12712, 6237, -7365, -12711, -3749, 9443, 12152, 892, -11288, -10478, 1977, 11729, 8781, -3805, -12774, -7215, 6897, 12911, 3923, -8825, -11368, -1851, 9879, 11116, -504, -11990, -9408, 3774, 12228, 7134, -5593, -12321, -5394, 7774, 12237, 2614, -9856, -11087, 8, 10971, 9739, -2496, -11876, -7716, 4784, 12196, 5969, -7100, -12162, -3338, 9233, 11120, 628, -10192, -9891, 1345, 11387, 8474, -4208, -12078, -6107, 6275, 11689, 4105, -8105, -11398, -1727]
2038a727J1592M29j1235r973K289J1875Q382m726j2395o141O956J2123L822q818
2052B453j1482j310J0498J0393j478j1530q775L997J2017O797o145j2175m536
2065a1276Q199J1662J954r871j0502L64J0982R258k890j1709p530N453J1957N054
2079A1105p456j1321k963Q933J1032L66j0549r508K180J1432P476m419j1455n826
2093a0973O415J1722L546q492j0959j051R878R687j350j0634q247L371J1430O587
2107A0930n966j1550m053P896J0633J828q852j0076R4J0823Q685l201j1131o489
2121a0429N131J0643N141o735j1253k713R003J0182n0r947q531J873J0495P469
2135A0279m110j1141n368O164J0985L138q032j0131p85R133Q951r95j0230p991
$$ y = [-1727, 9865, 10294, -941, -10914, -8625, 3250, 11632, 6906, -5489, -11630, -4674, 7449, 11271, 2453, -9029, -10339, 159, 10552, 9074, -2456, -11231, -7234, 4783, 11580, 5435, -6740, -11276, -3077, 8585, 10539, 668, -9834, -9470, 1512, 10770, 7880, -3829, -11359, -5906, 6051, 11105, 3649, -7672, -10635, -1702, 9330, 9696, -853, -10361, -8181, 3251, 10727, 6308, -5147, -10973, -4558, 7164, 10710, 2218, -8741, -9792, 86, 9773, 8423, -2211, -10458, -7087, 4343, 10930, 4964, -6586, -10639, -2743, 7890, 9718, 866, -9210, -9116, 1707, 10392, 7191, -3940, -10429, -5298, 5345, 10486, 3751, -7502, -10215, -1212, 8970, 8920, -1027, -9558, -7685, 2810, 10279, 6169, -4972, -10340, -4176, 6809, 9947, 1915, -8216, -9001, 132, 9083, 8088, -2142, -10133]
2149a0133L650J0985N599n734j0416l624O982J0364J833r020r482R23R995P424
2163I346k593j0140o566M626J0812M523o971j0144k102Q145R282J81r298q311
2177i210K022J0046O867m170j0403m943O062J0283K774p478r627r50R115Q567
2191H955j435r809p105L576R925N560n098j0387l887P322R787J276q326q609O04
2206g651R161P641k755r970n935M782R993M031o506r426k256P789R079R7r030
2221i56p806K106R558O371l895j0001m682N844R645K765p289r093p65Q402Q099
2236H303j267r190o698L158R683N096n054r588l410O697R182J294p875q350P37
2251g282Q877P127k695r383n558M361R572L978o155r250k024P522Q367N3q344
$$ y = [-10133, -6483, 4502, 10101, 4367, -6049, -9673, -2691, 7673, 9506, 486, -8996, -8073, 1922, 9346, 6753, -3387, -9953, -5327, 5485, 10008, 3037, -7107, -9209, -1064, 8218, 8399, -899, -9210, -7188, 2858, 9725, 5555, -4848, -9791, -3729, 6554, 9328, 1850, -7777, -8727, 388, 8955, 7520, -2289, -9394, -5818, 4107, 9667, 4569, -5818, -9705, -2383, 7404, 8680, 354, -8255, -7651, 1510, 9151, 6396, -3574, -9509, -4727, 5266, 9297, 2791, -6635, -8891, -1102, 7977, 8074, -956, -8762, -6656, 2902, 9273, 5378, -4623, -9305, -3461, 6184, 8949, 1660, -7433, -8198, 204, 8303, 7036, -2154, -8852, -5694, 3989, 9085, 4031, -5557, -8967, -2270, 6912, 8206, 331, -8019, -7282, 1595, 8722, 6027, -3356, -8914, -4553, 5019, 8997, 2842, -6408, -8432, -910, 7457, 7510, -834]
2266h34p411J653R204O220l834r414m336N552Q997K629o857q685o56Q126P646
2281H000j332q835o340L214R063M957m818r285l101O500Q700J235p588p876N78
2296f928Q442O643k390q907n285M143Q950L765n870q676j765O981P999N3q092
2311i37p025K008Q501N720l536q906m062N066Q638K618o675q120n67P568P336
2326G627j212q390o015K845Q716M565m594q445l059N824Q325J300p149p370N10
2341f522P800O374k273q233n293M075Q506L574n495q247j777O761P486J66p648
2356g46o726J681Q282N288l196q407m082N030Q083K303o105p537q24P194O694
2371F932j039p829n753K787Q285M352m320q058k815N553P657J211o657p092O81
$$ y = [-834, -8245, -6592, 2612, 8832, 4998, -4416, -8752, -3200, 5797, 8426, 1569, -7116, -7772, 354, 8000, 6668, -2167, -8507, -5293, 3770, 8727, 3909, -5376, -8477, -1977, 6723, 7958, 370, -7506, -6928, 1514, 8157, 5767, -3140, -8425, -4282, 4668, 8433, 2563, -6113, -7878, -897, 7102, 7155, -937, -7962, -5954, 2547, 8267, 4731, -4175, -8237, -3171, 5467, 8085, 1410, -6710, -7277, 291, 7627, 6415, -1975, -7990, -5145, 3571, 8136, 3542, -4903, -7962, -2138, 6187, 7487, 338, -7032, -6522, 1278, 7652, 5379, -2854, -8147, -4072, 4434, 8008, 2513, -5734, -7511, -750, 6736, 6902, -746, -7472, -5791, 2491, 7779, 4583, -3824, -7906, -2876, 5207, 7510, 1405, -6132, -6956, 238, 6932, 5893, -1936, -7689, -4902, 3383, 7735, 3415, -4643, -7458, -1905, 5752, 6963, 306, -6786, -6105]
2386f105P321O027k053q022m678L611Q062L395n231p740j529O170P109J5p095
2401g43o280J655P658N062l206p806l678M558P658K143n712p267n25O730O442
2416F689j171p281n391K654P651M034l891p694k681N292P396J013o439o397N49
2431e667O867N597j914p576m524L756P547K972m943p073j596N707O766J14o964
2446i31n755J654P269M540k859p238l636M291P440J981n628o779m70O555N853
2461F287j213o673m897K155P296M026l995p464k149N200O513P99n487o355K28
2476e729O936N557k419p228l712L395O627L163m274p203j686O097O400m26o343
2491h45n207J290O718M548k737p073l358M268O901J827n456o290j46N771N432
$$ y = [-6105, 1216, 7243, 5190, -2832, -7510, -3899, 4163, 7558, 2327, -5413, -6942, -772, 6337, 6352, -743, -7023, -5368, 2290, 7352, 4146, -3660, -7338, -2780, 4878, 7021, 1309, -5958, -6483, 247, 6689, 5518, -1763, -7154, -4500, 3151, 7185, 3294, -4400, -7081, -1789, 5607, 6620, 181, -6216, -5667, 1200, 6797, 4883, -2693, -7217, -3461, 4086, 7058, 2115, -4958, -6554, -847, 5919, 6033, -931, -6686, -5032, 2237, 6777, 3918, -3320, -6956, -2665, 4775, 6756, 1128, -5651, -6121, 434, 6287, 5074, -1599, -6496, -4341, 2955, 6981, 2986, -4478, -6627, -1427, 5086, 5885, 398, -5957, -5729, 1207, 6764, 4345, -2883, -6595, -3200, 3427, 6590, 2316, -4887, -6573, -476, 5924, 5498, -845, -6052, -4762, 1956, 6504, 3767, -3306, -6664, -2396, 4505, 6332, 876, -5414, -5560, 211, 5643]
2506E643o13o544n308K744P356L240m161o093k317M141O698J448o061o298J214
2521d911O389M381j793o184m184K926P076K853m744o521j011N214N754l6n911
2536g02n224J366O571M382k854o975k889M199O354J497m598n931q96N698O009
2551F007j199o744m037K664N785L409k820o713k769N214O346J58n270n147M52
2566d664N501M944j567o699l676L373O277K217l814o180j367N113N526O0n578
2581e34n121J290O412L905k854o198k497L423N843K220m709o307r7N815M697j104
2597D184n486m206J588O397L628l665o369j554M168N503Q72m751n505L75N928
2612A107M480j729o115l472L007O025K229l800n760j187M647N410Q5n628m651
$$ y = [5643, 5030, -1514, -6822, -4078, 3278, 6518, 2357, -3736, -6053, -1912, 4786, 6234, 173, -6125, -4911, 1478, 5859, 4066, -2118, -6302, -3376, 3700, 6553, 1809, -4712, -5723, -509, 5245, 5209, -702, -5926, -4560, 2011, 6393, 3539, -3436, -6325, -2126, 4228, 5725, 1127, -4804, -5700, -2, 6007, 4808, -1936, -5973, -3309, 2476, 5885, 3065, -3648, -6417, -1203, 5143, 5301, 31, -5116, -4664, 837, 5781, 4214, -2485, -6161, -2788, 3489, 5706, 1892, -4288, -5655, -542, 4984, 5044, -534, -5655, -4365, 2047, 5952, 3098, -3100, -5597, -2174, 3669, 5889, 1180, -5127, -5224, 591, 5288, 4184, -1302, -5508, -3920, 2477, 6105, 2440, -3929, -5483, -1315, 4188, 5060, 309, -5196, -4821, 1107, 5587, 3858, -2257, -5729, -2722, 3303, 5532, 1732, -4028, -5215, -568, 4842, 4927, -701, -5352]
2627e352J539N724L501k303n795l153L747O033J449m667n262k34M873M920o49
2642D371n788m071K201N793K870l065n619k055M095N449O87m844m855N25N351
2657A045M156j688n630l339K838N691K246l572n655j170M674N065j05n213m417
2672e074J181N476L758k371n609k639L349N539J527m279n213j58M788M497p97
2687C975n138l968J978N606K758k941n567j725L897N109P81m670m902N92N163
2702I48M040j671n314l059K655N183K171l351n325j141M308N042l82m787m016
2717d699J182M995L558k148n691k312L476N142J243l834m919m75M520M501p59
2732C780n208l448J993N025K666k617n206j911L753N001P72m537m441M85M895
$$ y = [-5352, -3813, 1911, 5412, 3109, -2686, -5839, -2092, 3941, 5390, 723, -4539, -4773, 100, 5020, 4371, -1417, -5488, -3287, 2506, 5376, 2311, -3308, -5363, -1268, 4181, 4868, 24, -4831, -4306, 1045, 5201, 3513, -2117, -5456, -2618, 3073, 5319, 1747, -3908, -5078, -404, 4661, 4556, -657, -5074, -3893, 1583, 5341, 2970, -2639, -5278, -1929, 3610, 5137, 858, -4355, -4513, 275, 4772, 3975, -1163, -5131, -3153, 2453, 5211, 2270, -3297, -5022, -1125, 3984, 4765, 95, -4807, -4215, 948, 4988, 3317, -1997, -5056, -2401, 2782, 4953, 1602, -3723, -4864, -556, 4486, 4104, -683, -4699, -3517, 1478, 5036, 2888, -2803, -5115, -1639, 3503, 4746, 912, -4007, -4482, 38, 4539, 3780, -1428, -4876, -2883, 2142, 4808, 2191, -3015, -4926, -1173, 3828, 4600, 63, -4378, -3893, 1002]
2747A002L605j496m899l025K339N268K052l468m983p40M002M281J01m504m017
2762d482R30N216L085k275m907k264L011M879J454l945m785j62M540M137j020
2777C412m585l530J843M911K710k699n032j652L585M648N71m044m302N21M478
2792H35L606j347m888k882K464M946J686l081m621r56L719M504k0m528l841J273
2808c131M635K918j920m802k350L011M664J283l679m385k05M210L938p61m588
2823a162l200J637M703K514k627m735j460L314M489N41l989l990L18M491L402
2838D246j389m661k576K122M855J741l081m473r31L779M153j97m046l654J015
2853c097M571K830j855m699k016K721M491J179l454m214k05L893L924p63m374
$$ y = [1002, 4607, 3111, -1788, -4813, -2474, 2794, 4846, 1378, -3605, -4345, -343, 3938, 4039, -465, -4482, -3552, 1664, 4749, 2474, -2433, -4697, -1686, 3193, 4647, 702, -4083, -4245, 295, 4432, 3412, -1173, -4703, -2860, 2051, 4761, 2062, -2970, -4622, -1037, 3611, 4182, 138, -4164, -3643, 835, 4441, 3094, -1794, -4676, -2212, 2734, 4420, 1339, -3282, -4238, -519, 3985, 3965, -563, -4404, -3131, 1504, 4422, 2502, -2300, -4650, -1639, 3025, 4308, 629, -3756, -3961, 249, 4187, 3426, -1162, -4362, -2725, 1978, 4492, 1865, -2870, -4330, -1016, 3473, 4014, 25, -3965, -3647, 844, 4246, 2857, -1804, -4380, -2258, 2597, 4338, 1257, -3216, -4147, -368, 3785, 3588, -458, -4112, -3097, 1474, 4304, 2449, -2250, -4266, -1545, 2946, 4125, 671, -3543, -3748, 145, 4069, 3306, -1068]
2868a068l133J570M417K436k432m513j393L154M225M35l658l867M39M156L289
2883D057j363m367k608K332M443J592k758m383q78L516M062k23l854l488J024
2898b896M234K694j782m351j990K560M329J201l357m032k34L874L418o30m105
2913a067k920J632M200K312k518m106j410K965L964O09l589l679M66L874L134
2928C867j347m034k388K045M143J635k819m052o36L191L862k42l790l238R97M228
2944A422K483j859m072j839K512M197R77l260l734k21L560L403o15m001k791J535
2960b303M154J988k317l855j329K736L896N18l398l448M43L661K918j179m030
2975a545k280K093L997J397k553l902o52L133L605k03l658k922Q79L938K365j711
$$ y = [-1068, -4201, -2631, 1786, 4222, 1790, -2723, -4116, -962, 3263, 3698, 40, -3827, -3388, 768, 4057, 2694, -1673, -4281, -1949, 2494, 4086, 1328, -3055, -3933, -417, 3645, 3422, -432, -3920, -2896, 1338, 4032, 2250, -2101, -4091, -1531, 2798, 3999, 642, -3390, -3624, 250, 3668, 3038, -1067, -3987, -2355, 1845, 4157, 1639, -2467, -3877, -912, 3052, 3661, 72, -3607, -3141, 733, 3867, 2520, -1514, -3902, -1857, 2286, 3921, 1102, -2950, -3586, -395, 3467, 3225, -565, -3803, -2806, 1422, 3905, 2046, -2026, -3865, -1353, 2844, 3821, 561, -3173, -3394, 166, 3569, 2954, -1047, -3838, -2303, 1851, 3839, 1522, -2333, -3662, -926, 2970, 3488, 90, -3358, -2915, 746, 3664, 2485, -1545, -3825, -1732, 2265, 3662, 1109, -2793, -3445, -312, 3293, 3090, -568, -3490, -2611, 1327, 3692, 1981]
2991A981l933j754K493L772R94l046l554n2L290L117o84l718k473J403L879J918
3007C633k273l716j176K798L676K59l246l332M78L623K757j237l758k017J832
3022a699L847J490k659l692m69L059L218j32l506k837Q45L763K178j608l569j803
3038c574K453L617Q07k863l317j28L149L135o51l643k361J194L810J801k017l704
3054b292j068K637L418M01k964l264M63L441K551j120l715k001K035L535J216
3069C273k329l545n95K973L342l64l317k775J066L392K388j765l561j605K353
3084a069L484O86k629l250q3L130K955o63l607k218J353L538J709k071l371j065
3100c171K567L249L34l058k946M17L420K348j142l365j864J583L617J464k584
$$ y = [1981, -1952, -3706, -1213, 2559, 3553, 507, -3047, -3099, 191, 3308, 2624, -1094, -3567, -2164, 1715, 3633, 1360, -2356, -3532, -734, 2942, 3201, -45, -3377, -2899, 724, 3481, 2244, -1514, -3531, -1699, 2148, 3638, 979, -2713, -3182, -123, 3095, 2963, -543, -3380, -2535, 1228, 3406, 1798, -1771, -3574, -1121, 2496, 3303, 440, -2877, -3005, 144, 3279, 2628, -1015, -3376, -2182, 1628, 3429, 1412, -2292, -3360, -723, 2695, 3096, 132, -3132, -2669, 772, 3323, 2203, -1512, -3513, -1478, 2057, 3273, 944, -2601, -3196, -223, 3119, 2755, -562, -3337, -2271, 1121, 3509, 1744, -1817, -3422, -1069, 2415, 3101, 472, -2778, -2861, 269, 3224, 2561, -1046, -3264, -1911, 1627, 3336, 1265, -2106, -3171, -604, 2645, 2979, -79, -3025, -2608, 812, 3160, 2018, -1347, -3211, -1628, 1989, 3453, 869]
3115H69l526l77K873K925k19k919k841J003L431K005j617l359j243K119L134Q44
3131C102k701l215m9L190K719q66l193k070J317L366J435j890l358q26K465L157
3147B583K77l046k594L64L057K342r42l488j794J936L250J037k221l019n82K499
3163c41L126p4l271k525J047L285J687j259l220j491J987L283O50k521k905j06
3179b648K980K600p33l214j850J119L134J633j861l236p82K385K867O8k509k608
3195b655K92L000K226j042l173j544J688L002J081k092l018o16K824K665l49k785
3211d96k226P54L047J862j517l063j244K010K914O68k350k894J65K645K306n41
3227B040k948j960J159L243J308j799l056o31K196K662L91k749k545N38K971J931
$$ y = [869, -2657, -3034, -161, 2764, 2545, -374, -3215, -2212, 1219, 3224, 1607, -1752, -2995, -876, 2258, 3102, 401, -2814, -2863, 327, 3046, 2180, -1013, -3083, -1766, 1600, 3035, 1145, -2213, -3039, -574, 2583, 2860, -186, -2780, -2416, 641, 2983, 2041, -1447, -3241, -1305, 1945, 2982, 761, -2258, -2840, -341, 2785, 2711, -560, -3085, -2038, 1247, 2934, 1675, -1545, -3036, -1049, 2234, 2884, 363, -2542, -2648, 332, 2932, 2199, -1015, -2865, -1746, 1388, 3021, 1160, -2076, -2858, -473, 2394, 2462, -47, -2655, -2363, 637, 2863, 1821, -1352, -2896, -1208, 1794, 2875, 783, -2235, -2851, -27, 2638, 2289, -496, -2722, -1968, 1079, 2941, 1424, -1639, -2883, -873, 2041, 2709, 359, -2535, -2370, 275, 2581, 2040, -908, -2868, -1709, 1534, 2842, 1043, -2013, -2644, -448, 2214, 2605, -144, -2689, -2151, 820, 2751]
3243B751j115k890j579J585L055R52k109k766l81K451K468j78k826k211R42K883
3259A032J629j216l026j184J958K796N42k315k503P5K638K140o03k829j965J393
3275a438K866J245j666k758q44K201K675J12k575k412O05K797J808r93k970j401
3291b748J579K910R07k019k762k59K318K415k55k693j926Q86K795J468j337k832
3307a553j058J917K573M83k259k347O3K480K237p11k696j787J299K743J157j633
3323I08k780o84K179K558N4k382k301N95K663J681j003k752j332J589K643Q07
3339B443j933k529l17K427K105j40k542k124R57K819J297j343k656r33J786K546
3355A863M70k163k415J21K491K062p39k594j463J092K620J358j934k554n95K163
$$ y = [2751, 1636, -1254, -2833, -1248, 1807, 2759, 650, -2116, -2497, -46, 2422, 2244, -582, -2793, -1851, 1032, 2661, 1445, -1581, -2765, -807, 1989, 2531, 216, -2287, -2212, 426, 2566, 1963, -866, -2831, -1438, 1428, 2673, 1007, -1751, -2595, -394, 2281, 2393, -182, -2594, -1989, 808, 2616, 1623, -1347, -2748, -1169, 1741, 2648, 629, -2133, -2392, -74, 2341, 2086, -607, -2533, -1647, 1148, 2616, 1279, -1553, -2611, -694, 1879, 2362, 103, -2244, -2181, 299, 2536, 1825, -871, -2658, -1359, 1384, 2541, 908, -1872, -2556, -377, 2181, 2235, -147, -2448, -1853, 810, 2491, 1488, -1264, -2596, -1007, 1636, 2443, 510, -2019, -2336, 91, 2196, 2056, -486, -2610, -1653, 1166, 2463, 1120, -1536, -2469, -683, 1863, 2333, 170, -2245, -2124, 367, 2429, 1690, -904, -2367, -1275, 1345, 2703, 769, -1785, -2380, -217]
3371b17K348J9k313k087M06K480J866j206k470j319J558K543P46j799k503k57
3387b205K218K237l60k479j771Q11K580J383j271k660q40J654K496N63k293k191
3403b128K48K332J779n69k597j436J038K651J063j658k357o58J997K383j4k329
3419b55k077N76K574J534j043k434j214J408K465P62j913k332j16K193K031l67
3435A792k481j550Q37K415J391j380k434r19J741K345L37k080k160L83K170J799
3451B206q04k377j360J129K406J135j599k471l97J870K209K1k232j845M54K434
3467G79J390r62k362j111J432K372N63j668k272j25K079J779j70k212j681Q15
3483a354K279J307j286k297q78J763K138K26j831k019K17K207J642o51k237j479
$$ y = [-217, 2131, 2150, -163, -2250, -1844, 636, 2502, 1296, -1174, -2493, -935, 1608, 2354, 555, -1948, -2205, 13, 2250, 1890, -589, -2360, -1549, 1031, 2414, 1143, -1517, -2357, -703, 1793, 2356, 63, -2128, -1880, 452, 2231, 1662, -935, -2371, -1333, 1318, 2381, 723, -1634, -2292, -295, 2088, 2074, -255, -2332, -1756, 818, 2352, 1309, -1125, -2339, -931, 1534, 2296, 383, -1949, -2065, 128, 2159, 1792, -689, -2239, -1402, 1013, 2404, 1024, -1410, -2329, -588, 1757, 2094, 14, -2146, -1763, 407, 2206, 1402, -975, -2335, -1206, 1200, 2335, 736, -1735, -2132, -262, 1947, 1968, -264, -2109, -1655, 779, 2169, 1207, -1155, -2266, -834, 1538, 2101, 433, -1839, -1964, 115, 1894, 1724, -488, -2169, -1354, 925, 2232, 946, -1351, -2229, -466, 1672, 1898, 67, -1952, -1735, 472, 2114, 1463, -774, -2253]
3499b253J224K278Q81j347k355m87J871J946l7k008j816N29K271J402r87k178
3515a066j146J502K108O67j656k118j83K015J828k85k308j466O89K389J128j278
3531H20k150o54J538K005L73j893j914J75K144J475n93k203j198R84K308Q95j474
3548F38k281l39J843J966j85j945j604M17K257J233q73k235q80J302K110N00j714
3565B10j791k86K008J857m29k227j256O50K258R63j132k119o21J492K028K94j934
3582c5j724K11J968J521o23k141j180J125K081Q75j641j932k65J569J874m6j948
3599c11j528N71J945J236r59j977j074J483K146L63j728j840nJ838J677m24j912
3616d99j346P38K083Q57r66k206o05J613J801K67j803j603J44J976J460p53k058
$$ y = [-2253, -1029, 1249, 2130, 783, -1572, -2059, -188, 1758, 1721, -287, -2103, -1574, 697, 2099, 1112, -1066, -2212, -710, 1398, 2065, 409, -1709, -1892, 123, 1951, 1666, -642, -2108, -1419, 970, 2098, 820, -1330, -1984, -446, 1559, 1932, 39, -1875, -1700, 444, 1919, 1326, -877, -2075, -1091, 1217, 2112, 638, -1643, -1982, -139, 1827, 1642, -303, -1907, -1490, 767, 2000, 1127, -1108, -1988, -686, 1424, 1924, 210, -1581, -1867, 141, 1998, 1569, -658, -1914, -1264, 994, 1957, 825, -1294, -1915, -423, 1605, 1899, -35, -1759, -1548, 420, 1941, 1318, -823, -2003, -878, 1203, 2078, 437, -1495, -1760, -191, 1683, 1637, -311, -1839, -1268, 677, 1913, 954, -1023, -2097, -614, 1532, 1895, 167, -1673, -1678, 160, 1837, 1413, -499, -1845, -1107, 976, 1833, 867, -1339, -1944, -331, 1470, 1737, -66, -1669, -1525, 451, 1911, 1158, -900]
3633i00j073J135J960O76j238k018l14J655J798k33j766j524M68J992J225r06
3649I37k014p99J305J870M67j581j757QJ774J605m50j953j291P79K135Q50j077
3666H08k049o22J583J784J45j689j639L15J840J353p06j867r50Q82J850P25j222
3683E41j943k88J636J605o4j817j423O48J720J220r67j905p62J237K023K27j539
3700A49j664J4J726J450m31j781j238P37J937R29j273j719n59J450J609J87j567
3717d4j500J70J791J315p76j796r47J056J767P23j284j875j52J531J524p5j697
3734b69j446N12J875J076r16j764p45J206J726L65j448j554j54J759J307l51j817
3751f38j113Q00J880P00j035j680n94J249J814J17j661j406K64J703J196n08j726
$$ y = [-900, -1973, -838, 1122, 1798, 560, -1458, -1772, -117, 1681, 1448, -318, -1842, -1374, 618, 1843, 937, -1077, -1876, -571, 1299, 1766, 185, -1572, -1564, 210, 1815, 1365, -588, -1879, -1100, 1035, 1885, 808, -1241, -1863, -280, 1504, 1649, -40, -1679, -1364, 476, 1829, 1123, -744, -1694, -812, 1038, 1763, 541, -1402, -1690, -54, 1551, 1487, -330, -1753, -1105, 615, 1835, 868, -1037, -1799, -562, 1461, 1688, 149, -1515, -1501, 225, 1675, 1244, -537, -1775, -1038, 899, 1828, 555, -1164, -1723, -273, 1336, 1523, -44, -1544, -1374, 417, 1732, 956, -840, -1787, -731, 1036, 1759, 475, -1400, -1552, -21, 1503, 1428, -269, -1715, -1203, 672, 1748, 832, -932, -1677, -471, 1255, 1620, 172, -1382, -1536, 223, 1530, 1179, -638, -1751, -951, 929, 1629, 594, -1086, -1680, -431, 1383, 1500, -161, -1567, -1303, 400, 1596, 1088, -638]
3768f38r91R30J849M52j270j711j18J406J561n0j655j375M93J840Q64p28j792
3785i33o58J079J677M58j404j733M8J652J395m78j693j007P37J700Q52j125j734
3802a167m23J312J518J33j487j368K60J595J286o30j844p68R62J720M90j249j492
3819a152l64J416J476j44j523j298N62J641J011q53j710n20J011J661K59j314
3835A59j576J11J592J155k90j584j065O85J580O84r10j591l46J124J510J66j527
3852a23j478M11J538J111n77j685p30Q87J673L49j061j569j16J428J374j61j588
3869c17j164N03J598Q04o82j639o15J094J596J81j298j515K07J448J203l75j604
3886e75j018Q85J619M71q10j681k30J072J503Q3j343j345K64J497J065o45j513
$$ y = [-638, -1629, -699, 1150, 1602, 332, -1379, -1497, -91, 1470, 1420, -235, -1610, -1117, 723, 1587, 859, -933, -1591, -512, 1165, 1623, 219, -1514, -1466, 186, 1581, 1103, -590, -1597, -860, 840, 1692, 567, -1167, -1590, -278, 1240, 1373, -114, -1482, -1222, 373, 1659, 1029, -815, -1583, -621, 1099, 1589, 340, -1152, -1516, -100, 1376, 1232, -291, -1589, -1027, 614, 1625, 772, -938, -1458, -447, 1214, 1473, 159, -1417, -1306, 286, 1441, 1151, -433, -1498, -813, 767, 1451, 541, -1050, -1396, -272, 1238, 1404, -123, -1601, -1190, 348, 1459, 882, -803, -1533, -646, 1027, 1376, 315, -1254, -1370, 58, 1432, 1271, -317, -1481, -978, 620, 1424, 742, -897, -1512, -418, 1178, 1359, 61, -1454, -1247, 201, 1404, 1029, -575, -1593, -708, 911, 1382, 572, -1109, -1339, -267, 1236, 1319, -24, -1369, -1105, 392, 1457, 812, -701]
3903g01p75Q91J636M23j141j496j78J371J299k45j516r22M16J564Q09p71j502
3920h38p36J239J419J16j112j319j15J466R37l0j687o77O31J488O15r09j480k96
3938a288J117J429j4j362j386M81J449R98n83j563o68Q84J459M51j120j508KJ358
3956A36J128k51j313j103M98J621O44n47j731l74R60J339K34j203j279R8J241
3973I8J325n40j375q47O57J386Q22j150j444k03J015J442r3j218j177K61J480
3990D39Q62n05j479o05O94J566L20q63j491q8J107J315k33j257j171O28J280Q62
4008A381r98j030q35J294J053O15j563j085M9J407J124o15j095j339J182R45R24
4025A414j168j197j68Q76J477l47q79j202J75J691L77k04j456p99J228Q61M96
$$ y = [-701, -1476, -585, 1051, 1474, 333, -1163, -1341, 30, 1329, 1084, -432, -1354, -938, 626, 1435, 664, -838, -1574, -335, 1084, 1200, 88, -1231, -1346, 120, 1057, 1027, -660, -1337, -706, 782, 1397, 488, -992, -1288, -171, 1258, 1244, -118, -1504, -1023, 426, 1424, 841, -722, -1390, -506, 953, 1404, 284, -1224, -1222, 136, 1264, 1013, -300, -1403, -905, 716, 1360, 813, -918, -1292, -332, 1007, 1241, 38, -1241, -1143, 98, 1423, 883, -492, -1339, -682, 704, 1526, 376, -1068, -1271, -256, 1186, 1093, -125, -1302, -1041, 439, 1301, 796, -683, -1288, -594, 972, 1292, 429, -1062, -1150, -43, 1272, 1039, -218, -1389, -761, 519, 1381, 383, -647, -1482, -188, 865, 1480, -83, -1168, -1119, 288, 1412, 797, -298, -1637, -455, 490, 1414, 246, -951, -1119, -243, 1234, 887, 8, -1194, -1019, 672, 1049, 845, -611, -1410, -182, 679, 1175]
4042A175p45j742K89J178Q96K08j686r79Q51Q26J011o01j719j55J152R78K17q85
4060B69j586K50J514O59m42r50j006M26J743O55j347j121l3P00J214K97j249j421
4078a428N92J374O02n45j238m28O25J109N22p42j573j08J347J092l33j390n77
4095a099N20J059M88m61j180l79O34J286K92r89j196j86J456J118m31j534p81
4112a383Q35J474L28r54j361o7J265J149l72j195j006N47J362P16p84j329m11
4129a186R84J272J20j171j277K13J323J094l81j423p31L11J435P77o16j374n92
4146a222Q51J083K49q18j028J12R17Q20l91j159m67O69J318L97j048j254k81R28
4164c24J417j87r79q85K66J019O79n39j217m15Q39J201K95q60j139MP81Q77j45
$$ y = [1175, 430, -1312, -1023, 155, 1051, 1259, -427, -1406, -555, 271, 1282, 681, -1038, -1193, -41, 937, 1154, 269, -1317, -1067, 447, 1106, 664, -286, -1292, -866, 877, 1532, 185, -936, -969, -269, 945, 1242, -7, -1428, -836, 538, 1140, 595, -643, -1071, -446, 663, 1185, 443, -1130, -1238, 109, 1201, 868, -522, -1099, -579, 480, 968, 507, -673, -1052, -418, 868, 1160, 171, -1025, -1211, 245, 1363, 932, -602, -1383, -548, 926, 1254, 300, -1061, -1128, 137, 1286, 914, -281, -1287, -740, 622, 1338, 554, -775, -1186, -202, 1070, 1190, 19, -1258, -1045, 278, 1372, 991, -432, -1163, -852, 583, 1360, 744, -630, -1222, -371, 712, 961, 143, -885, -773, 144, 964, 573, -586, -1053, -384, 934, 1331, 283, -971, -1252, -324, 1093, 906, -73, -958, -692, 327, 1006, 467, -750, -1165, -326, 875, 1170, 310, -829, -825, -44, 833, 688]
4183F88j187o69M89J356N97p18j188l78Q32J010J2j008j053K42J097R54k60j151
4201c35n90O13J259K42r61j080k50R18R21j1j069q74K56J282P95n30j081m44O97
4220b42J233K46r32j238O8R97J003l49j140p47L45J181O09q06j132l13P43J075
4238F01K52j006r77K95R96Q24l71j139o29N98J264L84q47r03k13R70Q30P7j011
4257er28L16J108O28m78j069n00P44J066K15q67j014M7R14Q56j87j078o70L74
4276e28J095N39o40j001m26P76J116j9q67r14K00R20O70k65r57p83N98J092K33
4295H39o66j106o2Q39J021j70q59q65J51J096O19m35r86l92Q64R27K29q00j017
4314g73O1R70P57k01r45p49L48J056M18o69r61m02P28R33R0p78q93J33R71Q07
$$ y = [688, -499, -1168, -679, 677, 1274, 556, -632, -1010, -178, 832, 844, -164, -1217, -975, 122, 1076, 816, -335, -925, -312, 947, 1189, 228, -852, -1102, -184, 737, 726, -343, -1217, -961, 321, 1116, 586, -495, -939, -242, 991, 1237, 305, -933, -865, 132, 1135, 786, -354, -1101, -756, 425, 1034, 228, -904, -1217, -474, 601, 853, -153, -1130, -835, 161, 985, 614, -525, -1154, -556, 708, 1092, 245, -658, -871, 99, 929, 1006, -5, -933, -617, 491, 1119, 641, -428, -928, -184, 882, 1097, 230, -784, -737, 177, 1033, 846, -232, -902, -528, 567, 1106, 466, -535, -961, -185, 931, 912, 45, -869, -669, 251, 921, 656, -301, -1084, -486, 606, 839, 173, -933, -995, -156, 865, 695, -164, -1029, -878, 218, 837, 402, -584, -976, -112, 815, 1044, 244, -773, -712, 258, 1015, 814, -131, -880, -532, 524, 942, 273, -688, -1090, -362, 571, 661, -117, -1010, -877, 94, 901]
4334I01k84j073m00N29J036M04q42q36k60P88Q53j88r70p10L76J004N52n40r29
4353e89l22P75R40K94q25j037J20P11P10k55q05p82L28J086M59n15r38j9O38Q91
4373H65K9q69q64J14R24O17m05r58l88M97J084L15o27q37j94P72P55j64j017o67
4393a018M33Q57M64j77r53k79N60R24N2q41p45p9P79P23q1r74m19M12Q64M06n76
4414C32r85k24O45Q12N1p25n42K7Q57P39n06q91m13K61J085K83p05p85M7P21P47
4435H31r8r05p60K86Q83N33l94p37l64O14Q62K2p64q76K5R03P50k12p28o58M17
4456c70Q41M14p03q35l31Q88Q86L0p88n97m0O84N79k22p31n69N90J014J28p05
4476A63q97k2P12O79n0p66o08L80P79M09m39r84k03P66P94K13p82q90m6Q08P21
$$ y = [901, 617, -456, -856, -327, 709, 1113, 271, -565, -825, -37, 816, 628, -342, -1052, -676, 328, 880, 340, -589, -911, -136, 804, 1098, 273, -764, -644, 67, 777, 522, -283, -1065, -737, 349, 808, 293, -645, -664, -26, 865, 894, 25, -839, -725, 199, 816, 411, -547, -935, -438, 646, 961, 334, -503, -697, 75, 830, 666, -351, -1018, -585, 272, 736, 559, -394, -673, -113, 811, 863, 22, -723, -802, -23, 700, 619, -355, -774, -362, 502, 908, 332, -653, -877, -232, 580, 631, -94, -636, -609, 248, 987, 481, -410, -823, -562, 523, 806, 101, -684, -637, 84, 831, 733, -172, -932, -646, 237, 770, 376, -361, -725, -111, 751, 773, 9, -867, -842, 61, 811, 599, -129, -787, -370, 471, 885, 182, -653, -984, -96, 790, 820, 32, -565, -605, 79, 658, 436, -295, -864, -274, 740, 868, 163, -734, -756, -44, 635, 585, -181, -789, -409, 370, 779, 340, -644, -847, -81, 713, 926, 144, -746, -792, 16, 737]
4497G37l11n72n21M21P38L94o81r80k6P18Q75m5o71q05q7R65O27m00p44l50M84
4518b34Q12J33o33p07r8P43O93o6q56n30J95P96M90k98r02j51N14O24P6p18p15
4539h32J90P41P22k83q23n66K90Q83M24n15o73k16N38P75j04o92n88J88R35L59
4559G53l51r03k82N28Q37J78o62o76m7O83M73k8p48l86L13O44K53k78q87p7O15
4580d8P71n2o61o86K6P49O01j16p64m72L39P00J61l00o85p7N46N09m1o88n94K98
4602d84Q69L49k92q93l04M33R00R5n07p79j44P66N32j18m90n07K63O53L65n17
4622A90o15j85O16O67j31n08p52K40O20N68q4r53m62M70P48K28l98p41j43M87
4642a38O32J5n34n54K04M83M55l06n27l58M72N31K21o80n19K5Q53M31k24o86n76
$$ y = [737, 426, -146, -667, -246, 492, 886, 205, -775, -801, -83, 792, 747, 76, -729, -816, 149, 776, 376, -368, -718, -234, 578, 711, 78, -629, -727, 16, 709, 643, -213, -743, -548, 248, 738, 440, -462, -613, -99, 525, 601, -117, -832, -642, 99, 821, 538, -285, -851, -561, 322, 746, 231, -442, -658, -120, 655, 551, -141, -729, -541, 394, 753, 402, -501, -783, -255, 582, 760, 98, -578, -625, 58, 531, 503, -245, -631, -318, 326, 579, 301, -586, -663, -48, 723, 671, 10, -676, -650, 99, 700, 584, -180, -652, -313, 387, 548, 248, -437, -514, 32, 541, 500, -188, -782, -484, 385, 734, 442, -451, -755, -322, 578, 673, 166, -613, -757, 9, 541, 423, -67, -574, -311, 342, 707, 190, -425, -610, 6, 673, 542, 34, -718, -478, 142, 710, 626, -327, -789, -319, 429, 657, 259, -482, -625, -138, 494, 509, -25, -579, -375, 108, 563, 257, -270, -628, -156, 375, 596, -84, -603, -578, 275, 706, 482, -204, -780]
4663g80L36Q08K91l36o79k66M12O07K05n32o45O2N28O23k86n90k37J71O61K98
4683F51n31n55rM46O21j97n18o03L23P09L06l17q07k22M94O41K57n87o58j29O05
4704h0N85N1o54m74J93O34L49m30n24j72M19O17o8m12m84O7N17M10l36n53k70
4725f15M62O86P7m09o71j44N96M56J31p84m01J79O97M22l34p04l22M65O65J05
4745E57m87n74rM85O69k71n53m00L44M63L25l50n31p1K41N79j2m37m43N8O07L99
4767E89j79p32l39M78N49K89n41p23N8N91N47j67n49n65K64P40L08l12o19l79
4787f92M50N11L04m94n37r0N80M93l3o47l95J75M95L61k94n01j23K69M45K05n02
4808b0m85P2O32L57k42n88k48K75N58L61o88m22k2N66L95j1n92l82K23O21K64
$$ y = [-780, -444, 364, 655, 319, -360, -626, -214, 393, 598, 66, -579, -517, 11, 634, 348, -242, -479, -308, 353, 651, 120, -435, -444, 2, 623, 426, -92, -695, -372, 337, 643, 326, -481, -703, -209, 432, 689, 102, -556, -685, -80, 505, 556, -98, -572, -379, 255, 604, 174, -350, -522, -103, 514, 446, 34, -450, -383, 134, 544, 208, -345, -615, -153, 533, 610, 201, -470, -614, -18, 438, 569, -215, -616, -437, 260, 682, 348, -356, -678, -213, 452, 557, 70, -504, -513, -28, 641, 370, -183, -583, -239, 224, 549, 199, -332, -403, -162, 417, 405, -32, -475, -417, 190, 589, 410, -322, -661, -183, 366, 655, 114, -609, -551, 40, 587, 420, -129, -694, -430, 310, 618, 306, -313, -692, -242, 269, 573, 79, -458, -548, 32, 525, 492, -155, -550, -375, 120, 481, 187, -314, -437, -168, 277, 482, -20, -505, -433, 199, 556, 314, -274, -522, -247, 311, 672, -16, -438, -460, 106, 501, 490, -102, -484, -261, 360, 624]
4829F24n08n60j70M67P40M8n86o52J16O97M01j62o79m58K84O87K77l40o57k04
4849f35M43P02l9m64m99L4N71L95j65m75k70J70M61J95k24m43k38L95M40N5m83
4870g4l74J90M81K34k77m85k12L64O31Rm43m68P9L79M16k45m72k33K55N29K07
4891D91m25n07l1M98L68J23p49k84J18M77N18k86n28l43M25N81J39n06n26j16
4911e63N65N19j28o08l73J10P40K82k72n84j84K57O59Q4m44n35o1N37L74O0m95
4932f0m42J11N55K99k09m99j84K91N29R8n17l64l2O30K48k06m47k23J77O41J13
4953E09m83k33k52N13K31l0k25m80J62N76J98m52k52j76L05M14Q5m60l22O1N07
4974A96K75k21n43j45L36L94J15l65l29r6M42M28j51m74m13K50N16K98k83n29
$$ y = [624, 116, -444, -614, -147, 593, 641, 55, -597, -481, 216, 617, 455, -224, -682, -398, 289, 566, 226, -431, -635, -192, 510, 471, 7, -492, -458, 113, 508, 343, -132, -402, -232, 229, 424, 200, -243, -481, -86, 354, 409, -74, -448, -258, 223, 457, 180, -305, -517, -153, 478, 487, 44, -424, -345, 34, 450, 205, -267, -500, -245, 284, 491, 66, -441, -472, 26, 394, 517, -232, -516, -398, 79, 597, 311, -217, -560, -135, 446, 585, 79, -447, -563, 2, 521, 393, -215, -588, -478, 262, 544, 272, -312, -496, -239, 420, 504, 60, -475, -536, 1, 375, 435, -60, -502, -391, 164, 463, 254, -245, -429, -138, 391, 489, -28, -392, -424, 206, 454, 248, -199, -422, -245, 396, 509, 26, -207, -459, 54, 285, 255, 30, -450, -288, 288, 486, 34, -218, -394, -89, 325, 410, -50, -372, -311, 196, 471, 250, -293, -438, -102, 292, 407, 42, -287, -383, 59, 487, 336, -138, -551, -301, 215, 513, 230, -299]
4994b99j68L07O14l8m89k62o7M63L85p7n84m05L83N20L16m47n04pL45M39R2o41
5016a24j45j41M34N81k05o02k98L25N02J92l93m24j71L59O10q2m58l67J16M90
5036A99L37j83n74l35L62N67J05m40m37o2M92L91o8l36l68K11K96K22j01n82j53
5057d57K50M95J08l20m51j3M57K80O4n91k15J79N03J40l76m03o2M04L79N9l61
5078F9m80J00M98K24k63l42j25J46M76J36m02l55jL46K85j8l22k99J36N16L6k67
5100I4k44j54K57L40j0l76k47R2L88K47k42l97q5K14M45Mk01m44O6L11L90j64
5122B84n05k33J99L77J76j54l73j23K28M72O3l70n16J18M90L86l36m12k53K35
5142b47M62K06k87m84O3L52L38k7m40l66O5N19K62k07m86r1K06M09J61l72k41
$$ y = [-299, -467, -160, 454, 416, -73, -335, -402, 61, 446, 369, -215, -620, -237, 283, 599, 152, -352, -359, -14, 425, 517, -124, -269, -410, 24, 605, 400, -202, -500, -175, 327, 519, 126, -298, -469, -110, 500, 418, -40, -407, -291, 199, 536, 353, -221, -556, -194, 373, 478, 38, -399, -461, 31, 422, 354, 18, -350, -139, 157, 379, 278, -304, -457, -207, 288, 396, 76, -375, -388, 69, 349, 413, -178, -393, -214, 289, 429, 53, -350, -412, -8, 371, 430, 69, -411, -311, 187, 411, 148, -194, -319, -173, 303, 439, 37, -318, -319, 27, 312, 294, -28, -327, -191, 325, 361, 94, -150, -304, -47, 293, 283, -93, -340, -248, 140, 387, 145, -252, -337, -123, 322, 326, 125, -319, -253, 58, 448, 284, -221, -454, -255, 122, 298, 144, -229, -352, -124, 348, 411, 41, -475, -357, 133, 519, 183, -229, -482, -247, 215, 421, 134, -350, -287, 65, 403, 376, -64, -430, -365, 154, 416, 209, -277, -368, -162, 247, 408, 36, -205]
5163b05j07L62M60j21m91l93J69N87J62l30l61k30L13N36J24n07m29J42L78L35
5183C94j15m82k64J88M44L08l66l77j20L18M10J34n56k02O8L20M22k28m37k27
5203c68K29L40J59k70m75J9M18L58l4m73m05M0O06L52l07m66j84L35M54K03m98
5224C3k61j72L99L51jn24k93K17M18L39l19m04j98M29M01j13l15l42m9M49K03
5245B48j3l90j12P9M11J30r0o21L6K98L93j48j82m56J49L33K56j25m43q0K06L42
5267B21J69m13k16j71L50M10n7l83k87J88K96K05m0m04j85L27K16P9l47k06j17
5288c65M04L35j12n02j00K39L80J22l33m06Q8J99L26K4l50k63O5M21J28k09k86
5309a95j24K93J85J81m11q9q4K20K04R5m23o5R1L16J80k91l77k6K81L05l2k08
$$ y = [-205, -312, 50, 510, 389, -102, -495, -326, 261, 423, 93, -268, -498, -185, 351, 475, -32, -461, -319, 59, 394, 279, -203, -467, -279, 165, 473, 107, -270, -390, -72, 338, 472, -84, -286, -218, 102, 524, 296, -141, -368, -139, 201, 360, 90, -385, -366, 52, 410, 376, -97, -502, -462, 144, 496, 189, -277, -461, -126, 328, 531, 33, -228, -400, -1, 350, 349, -175, -468, -251, 167, 506, 187, -217, -415, 14, 415, 302, -13, -355, -404, 45, 248, 235, -155, -267, -188, 223, 353, 263, -358, -322, -24, 369, 221, 39, -417, -268, 65, 321, 196, -247, -327, -121, 221, 390, -23, -239, -410, -60, 350, 293, -90, -377, -189, 107, 312, 272, -132, -317, 10, 226, 305, -42, -248, -365, 39, 374, 262, -240, -340, -101, 279, 401, 68, -338, -250, -51, 275, 299, -51, -314, -249, 172, 300, 91, -195, -319, -26, 159, 340, -71, -160, -244, -24, 180, 275, -148, -213, -122, 194, 374, 83, -294, -320, -39, 266, 234, 26]
5331B6k81P2K54K07m2m07j84K48M07k7j79l74PK15L68j08k61j71M1K55K48k54
5353F0k00j46K35K69j2l16j75Q1L71J21j29l12j72K52K17R6k42k18KO0M14j33
5375A23j83j99Q9K93O4j18k61J1R4K74O4k01k87LL85N5ok64j90M3L43N6j62k40
5399b14m5K80J81p8j75j31PL07Q2k00j59k30K88K56Q9k12k86j9L42K30j49k47
5421h3j14o1M16J36l71j08j20L58J61O0k47k28l9L98Q7k7l57j03N8M15J4j91k89
5444b35l5L54J95k2k90k09J25J82K70k77l74L6K74K69O0l11l00J6K73L65l05k31
5466a70j86K85K64K1j14m08j0K56L64Kl22k23M4L29J74k68k11j70L53J37J34j89
5488I2k14q4J98K35J5k65j55J3K95J75j73k85m2J14L39k7j55l48%M32K12j37l84
$$ y = [26, -255, -183, 71, 278, 236, -171, -355, -107, 300, 273, 94, -280, -273, -58, 310, 202, -59, -230, -189, 66, 314, 60, -140, -286, -51, 218, 206, -110, -285, -204, 167, 288, 159, -153, -325, -73, 144, 240, -2, -220, -218, -158, 256, 123, -60, -259, -170, 123, 187, 69, -192, -181, -87, 187, 251, 50, -237, -234, 151, 206, 200, -64, -254, -211, 132, 188, 26, -214, -259, 21, 202, 124, -51, -182, -175, 132, 214, 14, -145, -375, -87, 169, 258, 46, -240, -259, 83, 313, 164, -83, -197, -258, 158, 294, -77, -185, -305, 53, 214, 274, 27, -201, -240, 158, 245, 218, -139, -242, -184, 231, 245, 54, -235, -270, 84, 279, 257, -33, -242, -117, 65, 335, 58, -316, -280, -6, 263, 323, 12, -288, -272, 1, 366, 61, -170, -356, -71, 193, 214, 100, -308, -318, -62, 302, 304, -18, -241, -197, 132, 306, 38, -173, -343, 10, 147, 281, 92, -122, -206, -8, 227, 242, -23, -178, -165, 130, 305, 132, -153, -195, -81, 258, 231, 76, -272, -272, 160, 372, 235, -149]
5511a49k37L12K23K03j87m09r9L47L25j44k52o1L6J67J30m6l15j54K02L69K8k35
5533E4j68j94L82K15kl75k75K76J87J94j38k79j81L23J91L9l76j83LL08L53j67
5555A87k63k45K32K94J08l28l37J29K94K26o1j71m26P8L68J91k18k76n8K50J67
5576A41P9j27k99j7K00L48m3l83k19K14J84L49m00j67p8J58K35K12m03j85n2K32
5598b1K06P6m05j77J62L28J21k32k06r1K12L00l2k13l31O7K42L49k03l83o2J38
5620a55L66J02k82k94J1J66L39M6m92j67J58K32L38k42l61j62L88K82R4m50k26
5641c09Q2K15K53j43j41j74L4L73O1j32k50q6K9M10l6k82j74o4L51K36m6l56j66
5664c15J72K81J74k01l18O6N3L66J01m65p8l6K42K29j20l35n0J80K13K04k78l58
$$ y = [-149, -386, -74, 149, 352, 165, -244, -343, 4, 329, 185, -67, -128, -92, 75, 205, 159, -156, -310, -108, 261, 289, 54, -114, -308, 74, 289, 287, -88, -363, -87, 100, 294, 156, -123, -304, 19, 210, 249, -127, -310, -307, 1, 354, 187, -76, -321, -89, 205, 313, -15, -352, -223, 71, 297, 236, 65, -361, -283, 85, 276, 58, -218, -276, -26, 141, 220, 93, -206, -223, -23, 325, 282, -101, -320, -106, 78, 427, 27, -140, -218, -60, 175, 387, -16, -201, -253, -21, 185, 261, -144, -321, -159, 169, 290, 58, -148, -239, -27, 273, 241, 28, -303, -236, 6, 355, 152, -231, -293, -155, 211, 313, 31, -263, -252, -86, 253, 299, -193, -360, -202, 30, 368, 126, -235, -397, -9, 273, 367, -83, -309, -227, -12, 241, 98, -43, -217, -183, 190, 251, 119, -131, -217, -188, 222, 186, -96, -270, -334, 17, 253, 207, -149, -315, -143, 138, 312, 111, -207, -141, -88, 278, 379, -86, -164, -200, 42, 271, 151, -184, -234, -54, 159, 363, 85, -273]
5686b73P9K47K76j38m47o5O8M17K21l62k98k4K25L22q2j85j62lJ81L39j78k61
5708a03j50J17L82m2j00k58j79K94K22nj39l73K36K82Q6j50l17lJ16M16p5k28
5730B9j97p2K60J91r3j86k29J27L27J08j59k20j16K40J93O0l19k30J05K72J34
5751B25j37k45j58K83R4K01r5l67k0J50L20Ol36q5n2L02J53j48j39j59K42Q6O3
5774A84j87l51M9L98K70j41l05k05K40J05J13K4m55k8K98L01k5l02k37K9K37K28
5796B40q1k45k07J53L30m6m3l62M7K44K30N5m07j72M9L06J65j32j22k87J45K72
5818A32O0j86k50J1J89K48M6l73j52J61L06lp6l02l2K06K04Q6l40j82Q8J79K64
5841B84j04l26q1k8L46K01j87k13j48L22J71n1k79j76J11K60R8k8l71m0L10J15
$$ y = [-273, -194, 53, 329, 191, -256, -321, -253, 164, 385, 23, -275, -299, -74, 248, 166, -19, -181, -184, -3, 336, 158, -103, -253, -136, 246, 204, 104, -154, -333, -39, 183, 178, 39, -334, -98, 184, 270, 120, -197, -200, -84, 332, 257, 29, -168, -240, 20, 211, 118, -68, -297, -170, 157, 265, 106, -114, -230, 10, 203, 263, -56, -286, -181, 91, 225, 88, -157, -315, -32, 62, 263, 168, -199, -219, -69, 251, 257, -79, -164, -216, 86, 239, 91, -48, -207, 35, 121, 184, -3, -354, -305, 93, 363, 222, -83, -288, -48, 57, 170, 194, -261, -289, 9, 310, 285, -17, -254, -225, 12, 240, 159, -86, -293, -140, 190, 144, 101, -261, -214, 30, 260, 315, -92, -264, -215, 91, 256, 124, 2, -285, -140, 132, 192, 6, -244, -233, -44, 204, 250, -123, -275, -114, 192, 189, 113, -189, -221, -15, 189, 275, -65, -247, -159, 20, 284, 180, -146, -227, -255, 91, 292, 105, -108, -256, 66, 237, 186, -93, -269, -158, 102, 200, 172, -199, -239, 71, 186]
5863A86M8k52k08J6K33J16k5j88j71O7L70K7j44k57l9K14J79J42l00k47R9J46
5885A2J86J9l30k45K67K87N4k52k09k6K52L31j83j65j66P0K30M7j25j52j32J42
5907h8K09O1j58j70j71K62L12kl99j00J57J10J53p6k60oJ00J80J02j94l60R8L04
5930F4J98k01k39R2K2K05P4l15K3k09J68K59N3j94k00J04J02K87k13k34k33K98
5952h9K57m6j80j89Q0K08J74qk94l1N8J88O6j91j58rJ03K26N1k51r1%J30K87k09
5977H2j37l06K12L30m8j41k39PK40K37K0l15k06J48J79J9qj63j00J15J91O6j28
6000E5j71o1J74Q4Ok11q5O6K75R4q3k17o1Q2K69o2k91j1o2K23J22lk21j96K60
6025b5K34J29k91j87j3J68Q2l4o6k24J11K33R0o9k27j37J92M3J97j79j07j85L24
$$ y = [186, 234, -18, -226, -210, 23, 139, 114, -74, -245, -178, 192, 219, 75, -182, -221, -7, 172, 314, 14, -233, -134, 12, 198, 217, -113, -358, -91, 196, 250, -2, -211, -237, 15, 346, 163, -2, -168, -98, 132, 179, 54, -98, -230, -88, 121, 182, 24, -146, -317, -55, 257, 255, -144, -244, -87, 23, 176, 100, -160, -166, -66, 114, 216, 22, -338, -240, 64, 262, 61, -178, -86, -64, 141, 215, -100, -77, -286, -118, 141, 194, 0, -200, -96, 6, 293, 80, -154, -387, -89, 168, 122, -58, -247, -167, 41, 215, 207, -87, -118, -60, 128, 194, 3, -155, -164, -61, 165, 216, -35, -126, -126, 4, 291, 82, -55, -361, -149, 181, 133, -8, -247, -240, 0, 237, 257, -58, -264, -116, 63, 82, 74, -89, -189, -74, 117, 183, 55, -116, -177, -3, 81, 87, -124, -209, -143, 132, 226, 143, -74, -135, -53, 216, 154, -137, -148, -210, 13, 135, 132, -89, -285, -25, 209, 338, 47, -140, -153, 15, 97, 63, -3, -227, -116, 117, 207, 138, -89, -226, -34, 9, 206, 27, -80, -265, 59]
6048E9Q1m5j93j10Q7K40Q8k29j65j6J80K17N9l56j48Q8L52M6j70j66j52J32K48
6071A27O5j69j55q9K50J85m1l34JP9J71m9j8k62J03P1Q7J27j56j91j7K27J74j57
6095B9j55j56J79J71q6Q6j56j12K68M7m1j00j45M2K02Q8k5k28p9J21J60N5j84
6118a9j08o6J43J15Oj92j39J04J62J86j45k42m7L10J91j62l7k09O3K01K23k47
6140I1q8k88K11K19Or0m5j47KJ77J49k32j04j2K04O9R5k98p1R8J98M1j94j57J5
6165a51K54J54r0j59j83Q7J88K1l3j44k23K42J20J18j85j15M3Q5J92r4k00QJ0
6188e5J65J23r6m29K03J42j8L5k39k3O9K49j1k6k36R0J7K85n1j05k51K1J35K31
6212B25J4l35n3J16J63r1O7k30l6Q6J99m7j03j04kJ74J46n8k50j20J81K58l3j99
$$ y = [59, 140, 95, -98, -208, -121, 119, 207, -22, -187, -203, -23, 194, 253, -103, -251, -163, 189, 235, 65, -101, -253, -121, 127, 192, 23, -132, -221, 29, 214, 173, -161, -160, -81, 90, 41, 23, -239, -136, -65, 22, 149, -7, -198, -215, 12, 186, 29, -126, -282, -103, 68, -18, 68, -88, -200, 68, 115, 74, -26, -171, -129, 73, 161, 136, -92, -171, -50, 110, 165, -19, -127, -193, -50, 65, 71, -121, -260, -156, 6, 192, 47, -195, -242, 68, 259, 97, 60, -149, -86, 115, 338, 91, 3, -285, -74, 145, 151, 61, 16, -131, -129, 48, 197, -35, -139, -151, 53, 122, 217, -81, -152, -54, 144, 185, -9, -166, -151, 103, 257, 167, 8, -175, -88, 100, 121, 88, -56, -279, -37, 83, 201, 16, -99, -56, 29, 221, 127, -73, -65, -55, 110, 233, 137, -292, -89, 53, 35, 70, -169, -192, -123, 126, 115, 89, -147, -57, -40, 245, 194, 89, -162, -141, -6, 225, 239, -96, -149, -33, 130, 39, 106, -124, -160, -74, 125, 78, -25, -129, -131, 43, 189, 131, -119, -239, -58, 200, 167, -32]
6236c2j81P7K8K89o0k95M1J04K10j11Mj72p5J13K14M8j80j78L6J88M6O9k35j10
6260a62K0K96J5r8l31L9K08K33m0k76r6q0L57J08l5j37j11J18Q1O8j32k66J80
6283d1M3J58p6p3k14L8J23J90j15p3o4M3J98m1m4k53Q0Q2K26j1k19j07N0J03J64
6308A67q8k90JK29J06np0k44N6J35J55r0k20O4R0O3Q9p6l42K3K85J63r5o6q0l3
6334g3J40J5n1k05j8K49J07J9k34j33P8J21J39J2j35j28Q4O1O9j42m3o1J30J39
6358A40j9j40j15lK75q0J32j35k03P5J91K5j28j08j8J39J02n4j38j75N7K61J20
6381B01j98o0j71K10J10k8j22n1K3J65J09r9j65J7j1J27R6j73o1j13K24L2J24
6404A86j93j23J36R5Q5q1j28j55J01K28m7l5j97M5rJ96J04k36j29N3J76R4j75
$$ y = [-32, -213, -136, -108, 181, 121, -174, -133, -29, 181, 70, 74, -98, -173, -60, 154, 202, 22, -156, -120, 68, 114, 183, -52, -162, -142, 154, 169, 71, -260, -221, -13, 220, 180, -96, -192, -272, 85, 193, 158, 21, -90, 28, 109, 177, 45, -221, -41, 2, 160, 84, 11, -203, -165, -42, 148, 33, -40, -104, -61, 137, 96, 52, -201, -121, -39, 187, 176, -43, -150, -100, 3, 167, 79, -211, -210, 19, 125, 120, 50, -194, -138, -3, 152, 62, -158, -94, -4, 59, 148, 72, -270, -247, 38, 201, 106, 40, -40, -73, 67, 82, 31, -174, -192, 57, 164, 183, -51, -184, -106, 15, 154, 166, 31, -97, -13, 48, 117, -25, -68, -129, 1, 140, 121, -19, -134, -137, 138, 58, 190, 55, -148, -73, 118, 143, 15, -93, -111, 28, 130, 76, -62, -237, -180, 81, 201, 3, -57, -228, -18, 92, 64, -58, -109, -86, 79, 188, 89, -76, -59, -70, 57, 153, -20, -81, -194, 30, 62, 186, -7, -130, 6, 101, 186, 105, -23, -178, -77, 151, 104, 69, -128, -83, -92, 104, 208, -28, -157, -104, 72, 166, -9]
6427im5j04J83O3m1j14o0J36N8J63j67j05ll0J96m8R4l42P2J43R9j05l3p3j58
6452b30L10l2mpj52K01RK0r4j46O6J8K38j17k16o7J50J53jm2k02l6J49K90j54
6477A04n3j33j19J34J77N6k44o6J39M2L9kk05J34K8J46j25o6j26nJ99j2J09l12
6501a61j26L12J75Rk07j56O0J0K30m3j80m2o0J91J68n5k27j7J6J69M6j49j32J01
6525f8J67N9p1j24PJ98p6J18k19r0R9P3P5o2j35j26J5M3L08j91j73J15j10K44
6549G6J61k17r9p4J70M3k6Jj36R3R5Nj44j40P5P8J45o9k18RJ03J48J1N9k56j13
6575b20J32J40k8R7k37l6K31P4lk23j27J14J52K7m6m4q2J6J59J11j75j43n8K97
6599A28mj81O2j21J85n9O3n6n2n6Q7J87j11j92jQ0R9L6m7r2j69J77J73q5m1j43
$$ y = [-9, -54, -158, 25, 88, 47, -67, -127, 9, 67, 230, 63, -42, -45, -75, 121, 73, 167, -175, -103, 40, 139, 34, 1, -72, -230, 80, 48, 44, 37, -115, 86, 95, 115, 21, -125, -59, -41, 197, 80, -136, -203, -53, 100, 99, 57, -145, -181, -32, 258, 104, 51, -82, -201, -67, 110, 166, -78, -144, -5, 37, 76, 74, -131, 3, 31, 177, 52, -14, -140, -145, 54, 42, 151, -161, -287, 25, 200, 209, 2, -154, -94, -84, 146, 103, -77, -119, -179, 12, 180, 125, -102, -119, -103, 66, 112, -37, -169, -68, 99, 158, 87, -37, -30, 168, 92, 210, -9, -99, 0, 73, 148, 86, -49, -175, -160, -117, 191, 0, -173, -58, -168, 76, 237, 20, -79, -153, 17, 60, 34, 35, -101, -8, 87, 92, -52, -192, -117, -39, 106, 37, -181, -172, -69, 79, 90, 149, -107, -220, -88, 52, 24, 121, -116, -152, 79, 153, 150, -73, -200, -86, 66, 93, 47, 3, -79, -63, 96, 207, 32, -111, -169, 128, 124, -57, 5, -116, 69, 10, 73, 17, -35, -91, -4, 183, 72, -120, -121, -41, 58, 94, 47, -45, -214, -37, 136, 51, 10, -133]
6625a33r1K71J09p5q5j82M5K55O4j38j37l9J33J36p4j1r0j12J06J06J32k46j29
6648a85P3K52K7o4k36p7K14P9L9j62j3r0K08J08l0j16j99J92%P0j0k30L5J39J13
6673A37r2j26r4R6K22r2Q9k32l0J68L7O5n5k73L9J57J31m5q0j84P4K70q8k3j42
6698g1j60K64J86j00q3j03k3J84J17r6p0j11K7J31L5j14q9o4O9K66k65q0J4kK37
6723I9nj09K8j57P8J58N0j96r3j1K25M6p8K7p3l3m8K37j60L5l8K1K37j25j93N
6749g3P6O5J3K0j55J7O0J28L6j54p0k74K76K43j62lr6m6J75k4Pj30q7J89J09k2
6775A18j3j64LM6J21n0j50j24J81J86j33Jj07q6J51J50n2j11K6l6R9O2m5k03N7
6800g3PQ7M4q4j10K0R4J78k16L5j25R8Q7L1o3l7j26J61M3O5j50j37J16M4J64o7
$$ y = [-133, -224, 47, 156, 81, -4, -186, -141, 114, 178, 40, -97, -136, -3, 133, 59, 48, -42, -154, -48, 58, 190, -56, -185, -112, 140, 167, 103, -133, -210, 4, 83, 122, -40, -53, -143, 65, 173, 143, 27, -172, 20, 20, 90, 80, -150, -115, 24, 137, 45, -81, -175, -79, 143, 51, 140, -92, -122, 46, 83, 148, 93, -180, -141, 16, 147, 102, 22, -162, -88, 182, 94, 71, -71, -231, 33, 219, 119, 36, -67, -90, 94, 211, 115, 45, -66, -39, 92, 127, 13, -76, -140, -71, 195, -70, -150, -136, -138, 99, 94, -15, 13, -144, -66, 92, 142, -54, -147, -158, 67, 113, 35, 62, -11, -44, -92, 145, -15, 20, -18, 3, 240, 115, -78, -73, 3, 68, 81, 101, -54, -37, 23, 151, 187, 33, -37, -311, -35, 208, 46, 43, -53, -99, 76, 52, 59, -71, -158, 31, 140, 118, 105, -59, -56, -10, 111, 61, -89, -213, -32, 154, 21, 22, -85, -171, -20, 130, 78, -33, -7, -43, 56, 118, 73, -130, -73, -66, 21, 65, -19, -129, -109, -15, 163, -53, -18, -143, -45, 42, 73, 10, -27, -153, 8, 51, 116, -34, -171, -55, -11, 153, 86]
6826H6j60q1O3J70nP4j60m4N4J5N0j05m1L7J53Rq2j30NQ6J5J30j07p4k3J07N3
6853I5m9j55J6L2N7J07q1j69J48p7J05J30j50j27N5K32l0l6k20j16J98J17o8O2
6877G6j59PJ02O6N0j51j31j3J73K09k41j02m2O6K45j0j56o9O2L0J56q7j08j52
6901a79J58j03L23j56j12j2O6J33M8k30k6L1mJ41kj71L6MJ02K03j55k12Pl9J84
6926C5J32k81k2J38J5J77k20P6q3K4P5l1o4p7Q8o0J74Jn3l1o7P0R8o6r4rO3M2
6954E0l6n2q4rJ66J06j48n3l9J18M4%m6j51N1K4J04K5p1j22J2K21o0N0j09j17
6980a26J16J08m2m0o7K5J28j12K9p9k0K3J58j8n3j66M5J26R4j21J8r9J27M4n3
7005D5j55J03p7O4J66j13L9j58K%J78l0q7p4N4J93ro5k19J14M9N3J4n2j80L7J62
$$ y = [86, -74, -155, -92, 78, 73, 147, -13, -57, -3, 12, 62, -43, -84, -47, 106, 115, 33, -97, -92, -6, 9, 139, 32, -42, -65, 42, 95, 46, -109, -93, -61, -4, 103, 22, -147, 1, -76, 29, 159, 9, -118, -63, 169, 139, 103, -117, -233, -35, 82, 14, 76, -83, -76, 26, 92, 142, -9, -140, -153, 20, 229, -12, -114, -156, -90, 155, 145, -11, -80, -18, 12, 168, 81, -27, -179, -21, -124, 199, 43, -69, -81, -15, 118, 166, -64, -90, -59, -63, 78, 76, -95, -59, -55, 47, 250, 95, -117, -110, -149, 35, 167, -114, -136, 2, 17, 194, -26, 50, -33, -9, 66, 35, -29, -106, -18, -78, 96, 97, 44, 13, -54, 16, 114, 48, -46, -55, 8, 50, 14, -38, -122, -131, 35, 141, -7, -60, -99, 19, 63, 63, 17, -134, -83, -59, 45, 70, -1, -123, -111, 110, 50, 100, -9, -126, -10, 98, 56, 16, -51, -26, 102, -10, 19, -60, -80, -57, 101, 83, 30, -136, -91, 35, 129, 8, 26, -73, 54, 98, 45, -110, -7, -84, -20, 146, 33, 72, -86, -84, -84, 94, 64, -23, -97, -43, 150, 141, 76, -143, -29, 20, 73, 87, 35, -145, -108, 54]
7032E4L5q4j21j28J80J76o1Nj32QL1J90q8j06m9o2J98oj5j24J5J7J33L4j29m3
7058g2p9K08R3j44Q9j19m9J66M4k29l5j08K42J37l5j07o3MJ13N5p7j07l0J2K30
7083A39Mj81p2K3J42K4J1j70p8n1M43j47n4k9o5M2J49k0p2o8r1P7J22Qo9k8n3
7110f4P8J22j02p3L5J14m7j13qj8O6P4RJ55l07p6J11P1R9j15j53O6jJ49M1q3m1
7137a1r3J44J7o3M5j81J47J31k1j48p2L2J45O8j5k60J7n1J97J44j31j23o1K00
7161E7l9NJ3j77O9J64m7m8m4l4O7P7l2r8K7J8o3J31l4n0m8MJ13K3lj44j1LJ19
7190A8O0p5pj7K4Q4m7o0k2O1J52j5k54j1o6K47L8p5M7j96L7J26J07n7r4j35P9
7217e1J23K4j25m5N0J44o3m6l5j3R7NJl7k0j44J20J18j05J52j36l0P3M2p4J1k9
$$ y = [54, 89, 5, -116, -244, -64, 112, 51, 56, -76, -68, -37, 153, 65, -41, -90, -152, 46, 40, 25, -99, -84, -67, 66, 100, -29, -72, -151, 57, 150, 6, 95, -24, -73, 93, 137, -92, -127, -235, 7, 144, 109, 2, -61, -57, 56, 111, 34, -73, -103, -91, 139, 143, -38, -110, -87, 55, 79, 90, -80, -158, -209, 234, 87, 33, 4, -61, -19, 130, 110, 38, -30, -121, -44, 78, 86, 17, -11, -64, 14, 136, 34, -39, -4, 110, 63, -50, -58, -76, -10, 64, 73, 228, -79, -155, -44, 27, 126, 11, -142, -76, -77, 72, 113, 30, -11, -104, 40, 57, -6, 39, -142, 5, 136, 115, -33, -105, -73, 72, 140, 125, -135, -118, -169, 28, 172, 41, -82, -143, 57, 18, 23, 36, -141, -72, 92, 45, -3, -47, -81, -14, 63, 31, -67, -40, -22, -85, 46, 12, -38, -86, -82, 31, 54, 51, -93, -104, -101, 18, 78, 3, -4, -21, 3, 87, 40, -20, -42, 19, 171, 156, -98, -109, -175, 72, 110, 35, 82, -114, -77, 49, 156, 99, 5, -130, -51, 72, 96, -29, -74, -24, 120, 57, 11, -24, -37, 60, 65, 66, 29, 9, -135, -15, 103, -2, 150, 14, -16, 57, 99, 25, 36, 7]
7244Gl8P8KJ1j85O2K0O3J01p2j68O7OM0L9m5o6R0j1J34k04j20J38P7J05l8o0j26
7272i3J07O5R9k20M6l3m0J67r2M8j44M6J12J1O9j28r6R6N4j03J7n6j26K41L7k8
7298E6j5J1l3lN6m5j8p4lJ96Pr8k2l4j9J54r3j26m4N7J97j22Q1M4j28l9J30j17
7326d4Nj8r6J79nN6r7j05M8J36r1K5Jk2M5J11r2m0p0J4O4J65n9j95l5J04N8OK6
7355G4j28p3J15P0k5m0l3m7K7J31p9p2L4RO9O0k0r7j31J74L0j2j2j66J16L3R8
7382A05k2j60P6qJ02J14p0j88L8J3R9m7j08K9J4P8rj29n8J12R0p2m6J7K6o9J82
7409A09l2k2j49P2kN7N5j29p2K2J01J30j10j96N2pJ91j8p2K2m7L7P8l9J4l5%O4
7437G4M1j04n5p6Q1P7K07k73j06Q5J24P2n5j28P6JKl3L5r1O9r4L49k48p7M9m7
$$ y = [7, -31, 47, 49, 60, -125, -63, -43, 20, 121, 49, -119, -52, -46, -6, 33, -12, -78, 12, 1, 135, -69, -189, -51, 26, 131, 93, 33, -93, 14, 79, 178, -42, 4, -29, -69, 98, 6, 54, -90, -44, 68, 79, 148, 20, -76, 20, 74, -29, -12, -68, -194, 47, 84, 56, 41, 52, 19, 16, 72, 27, 9, -65, -68, 128, 135, 37, 15, -19, -38, 116, 23, -103, -147, -90, 107, -15, 66, 110, -18, -57, 73, -44, -39, -57, -153, 26, 21, 77, -20, -125, -77, 59, -32, -7, -6, -28, 17, 128, 36, -4, -74, -60, 4, 169, 110, -85, -120, -16, 42, 48, 74, -54, -127, -12, 58, 33, -7, -40, -87, -60, 71, -8, -80, -46, -37, 32, 92, 72, -25, -156, 18, 48, 36, 24, -142, -26, 7, 105, 83, -77, -1, -9, 93, 207, 137, -51, -13, 0, 99, 52, -56, -27, -13, 65, 56, -73, -131, -19, 71, -1, -47, -30, -4, -73, 109, 77, 55, -94, -22, -24, 33, 88, -41, -113, -91, 10, 140, 30, -166, -114, -121, 70, 52, -20, 2, -45, -8, 70, 31, 45, 10, 10, 74, 115, 11, -44, -120, -39, 38, 245, -28, -134, -49, 75, 147, 92, -36, 40, 41, 43, 10, 45, -46, 23, -71, 278, 30, -47, 2, -45]
7464d5m9J28%r6J4rL3Q0l9n8l4O2N5M5o3j55Q4Q8n9Mp7M7k0J62J6j20k6n9J38
7493D7J3J8q6p3J26M2rr7k1J8P7L5Q2k31o1J49j7J37j02l9j06J03M2k3o4j8J8
7520d0LO3Ko0N8j0k1J89j97p9O6j2N2R8j10k39K49NJ1M5j99P5mJ36r3k3q8Q6M3
7549FJ5n7j0M9K0K5R2o4j17o3M9J44r8K4j47m6K30J20m5q8r8N7J04Mj81M3l0K6
7577c6J90j00j77R3mJ21L1j33o1K4jJ15mq3Mj04P9J37p8J45j83m1J32roj65J03
7604a1RR9Kj58R4%M0J08j32j78L1J46k4J7j30J16P5p0N7k7k7p9n2J40Qqm1j41
7632a36K07l0J00p8j85n7J79O4J11j45m9q5J07M5q8M3k15K02M5P7q6j30n9J15
7656d8K10j80l3P7p9RJ80j32Rj46j4J92J46k20n0J01k3Q3Lj17j27J75K6kM9Nj13
$$ y = [-45, -94, 34, 34, -62, -48, -57, -24, 56, 17, -41, -75, -13, 42, 87, 24, -131, -47, 41, -18, -14, -91, -44, -64, 98, 114, -6, -32, -91, 47, 60, 78, -8, -81, 45, 87, 78, -19, -40, -22, 55, 90, 172, -59, -120, 29, 12, 149, 47, 8, -98, 5, 47, 24, -40, -58, -40, -37, 26, 28, -32, 26, 16, -5, 184, -13, -92, -26, -38, 14, 112, 2, -237, 12, 17, 28, 73, -126, -51, -55, 81, -12, -35, -123, -37, 6, 21, -36, -46, 3, 23, 48, 140, 76, -41, -104, -55, 89, -9, 15, -132, -178, 52, 172, 127, 39, -59, -2, 102, 106, -75, -32, -62, -36, 154, 54, -123, -30, -34, 87, 118, -15, -76, -52, -53, 62, 58, -25, -21, -125, -46, 91, 13, 158, -25, -66, 66, 57, 51, -114, -11, -2, 97, 99, -59, 35, 35, 75, 183, 51, -127, -96, 50, 26, 43, -87, 29, 104, 34, 91, 64, 37, -42, -94, 46, 54, 46, 5, -136, 71, 41, 141, 63, -122, -179, 0, 64, 175, 30, -19, -104, 3, 48, -40, 3, -212, -10, 35, 112, 26, -104, -163, -48, 162, -18, -51, 26, -53, -44, 136, 4, 13, -133, -147, 45, 191, -29, -79, 22, -1, 82, 85, -32, -159, 16, 42, 40, 89, 94, -19]
7683a9K4p3J51j84PL9M1J60j47K2j4r8J40k0k8j18M6J17m7P5j56R1kR9j18L9j58
7710a31J42K6O5k8k06K7P7J23nj20o0J01JJ05j9j27J7q3J29K4k8r2p3J52J47l6
7736A28kk40R5M3M8k0p2M1n3P1O2N3k19k1K4J33l9Jj07N6O7k7N8j67KL7JL0N5
7765C8q0n2Q7K01j04j80K4l6O4J03Mq5J7%P4Qj46OM2N4j3p4k5k6M0R9l3P5j0j41
7795f9Q6m2J28j07jJ0n8J13j0Kj74J02J25P5j56o3n4N6j3J14l1k9j11K50j9p0
7821E4j16lL9P2J5M4j52Q0q2M0j0O0j0KkJ3o5Q4j01m6J9K44j20j21K3n3QJ06k5
7850cq7N7L9J22q9q7l1N7J35j69J3N0j93Q3N5J52r5o3p0J40M7n8Q6k92K22m6J65
7877A40k21J10l1k3J94j64j6L1o9M3J56j68o7L6M3MO4j08o2O9k7k8J65p4k7n4
$$ y = [-19, 5, -68, 83, -101, -94, -55, -14, 146, -1, 21, 7, -91, 49, 29, 1, -117, -71, 46, -1, 74, -82, 9, 7, 106, -12, 27, -131, 11, 37, 102, 74, -132, -105, -28, 95, 90, -30, -90, 11, 12, 117, 98, -29, -12, -95, 34, 58, 30, -62, -135, 17, 164, 128, 126, -114, -19, 24, 72, 52, -20, 21, -32, 39, 101, 154, -65, -86, -62, 71, 32, 33, -74, -18, 49, 22, 80, -87, -85, -48, -47, -17, 38, -42, -94, -7, 194, 90, -90, -66, -102, -38, 65, 69, -16, 1, 1, 75, 83, -63, -57, -15, 39, 26, -48, -73, -99, -59, 40, 7, 82, 72, -69, 17, -25, 103, -4, -5, 5, -53, 60, 50, 52, -122, -20, 105, 180, 24, -39, -93, -37, -50, 64, 33, 4, -107, 143, 124, 54, -62, -65, -26, 46, 61, 105, -47, 33, -49, -9, -19, 41, 31, 33, 31, 44, -21, 63, -38, -84, -65, 179, 59, -62, -39, -92, -84, 22, -3, -90, -33, 6, 128, 39, -48, -79, -22, 113, -56, -43, 7, -186, -103, -48, 104, 9, -54, -124, 16, 63, 5, 91, -201, 21, -25, 140, -81, 29, -2, -25, 169, 5, -11, 20, -49, -6, 150, -18, -85, -49, -6, -2, 62, -46, -108, -39, -66, -94, 71, -3, -30, -84]
7903h4j2J75%k41J97m7R9k4j88j3J05oL5ol3r6R2Q3J03j93j08J81r2K14j05j27
7929i1rJ9j25K65n6o7%J00l7m6n5roJ98q1%lp9O0N1Q7j15q6J1O1J54m1p6l2q4
7959i2J64p5M7j5r8M6L5l0Jl8Q4Nm2m4J08l4m1RK5o5n2J47j98J92r5J23j66K8
7987g1M8N2lO3j71M4P4K8j6j09j3K2O8rOl0J0KJ40m8k07J5M2J16k7j66Q3K0k3
8016f0J57n7M5j29l8J20J5k1j74J12N3r0J41p2P9o0j3J59j61o2k3k5Q5m4J62k28
8042a29k5J74k9qj4j80J27J28%r3J28j20K3L1K4Pj23K7J56Po7l8o5K5R6R1j60
8069gn6L1N2K2q9K3j1n5J49Q0j07k8j17J49RL9j08k6P9J38j52K3j6n4K2q4K31
8096A37q2j05R4q5KN5j6k2k1l0L8P0l2o0K3J16q2M8j17j0K9Q5M7p4o9j10Q9J01
$$ y = [-84, -96, 79, 79, -162, 35, -12, 87, 63, -125, -138, -33, -39, -4, -10, -43, -139, -47, 36, 139, -54, -162, 19, -73, 141, 36, -91, -100, -81, -206, 59, 3, -64, -64, 36, -1, -47, -102, -111, -117, 81, 0, 0, -3, -82, -22, 29, 116, 1, -85, -74, -13, 141, 100, 24, -8, -92, 72, -3, 44, 29, -69, -23, 12, -18, -17, -55, 29, 34, -8, -52, 56, 22, -19, -10, 15, -50, -102, 45, -153, 39, -56, 67, -99, -71, -23, 29, 26, 89, -82, -38, 36, 64, 48, -61, -74, -52, 16, 7, 13, -17, -7, -5, 135, 87, -120, -105, -63, 53, 26, -140, -57, -37, -60, 97, 40, 85, -44, -82, 38, 53, 32, -142, -30, 23, -67, 74, 2, 81, 21, 8, 167, 6, -56, -79, -104, -19, -63, 99, -129, -154, 20, -9, -17, -31, -211, -84, 44, 44, -49, 79, -41, -18, 13, 37, 44, -79, -52, 104, 111, 44, 6, -59, -34, 62, 153, -7, -63, -32, 20, 42, -47, -24, -35, -90, 59, 139, 32, 4, -113, 36, 45, 84, -24, -50, 29, 167, 15, 38, 22, -32, -10, -94, 137, 55, -50, 44, -41, -39, 16, 0, -22, -43, -73, -35, 35, 3, -57, -34, 82, 0, 48, -69, -79, -50, 35, 82, 8, -61, -171, -82, 19]
8124A9j9j18J9L9K05j92R2j07J0L3P2j40J49j39K1Q8J2n5m4j4L9J10K5n5j12k2
8150h4pJ03J1Pj09l6K21j09M5r5pN2O3k8j01P7p5L2L9J00k05L0L3L4Q4o2m1K6
8178bn8M2N4L5j37pQ1J6pL7j53J14%
$$ y = [19, 0, -118, -99, -60, 145, -47, 45, -62, -52, -19, 53, -87, 62, -77, -56, 32, 44, -11, -55, -69, -30, 80, 105, 50, -62, -84, -91, 12, 23, 30, -79, -115, 106, -3, 42, -53, -60, -8, 55, 27, -74, 3, -72, -40, -1, 99, -106, -76, -43, -9, 75, 13, -28, -2, -60, -18, 36, 71, -66, -73, 8, 24, 17, 54, -99, 15, 15]
8191A5
$$ Imaginary data points
##PAGE= N=2
##DATA TABLE= (X++(I..I)), XYDATA
0@%%%Oj2J2j2J8k4L0m2N4o6Q4j02J20j44J66j94K36k78L20l74M34m97N72o57P45
28C95q44R58j076J210j363J523j700J899k112K344k605K890l201L544l920M341
44B283m814N336n923O592p356Q240r279J0516j2018J3899j6323J9577k4221L1421
58A7930m4188P3540k54439q7584N63641M5839k02427k63508j60817J09690M67362
69B65039J47182l97667l79025J08071L17074K35210m2261l27038k87897J52790
79b08522L92002J71267k19107l64005j23944L00020L54867k1794l10588k36170
89b65974L332K83208L30424q6175m56887j78015K83014K87094M9542j32881l00394
100a83712j74486K99824M08190q0645l83167j61803J10150K28785K22389o6313
$$ y = [0, 0, 0, 0, 6, -6, 6, -6, 12, -12, 18, -24, 30, -36, 48, -54, 66, -78, 88, -106, 130, -148, 172, -202, 232, -265, 307, -350, 395, -449, 509, -567, 643, -720, 803, -897, 1002, -1110, 1234, -1371, 1519, -1682, 1862, -2058, 2283, -2531, 2805, -3118, 3474, -3882, 4358, -4921, 5595, -6423, 7476, -8847, 10730, -13491, 17930, -26258, 47282, -207157, -294741, 268900, 314739, 112312, -151196, -312013, -202323, 265039, 412221, 14554, -364471, -256400, 60674, 295884, 253623, -73415, -361312, -208522, 183480, 354747, 135640, -228365, -352309, -52289, 302578, 280784, -29804, -265974, -262642, 20566, 350990, 264815, -192072, -370087, -87073, 200021, 249563, 116682, -183712, -358198, -58374, 349816, 269171, -113996, -275799, -165649, 63136, 285525, 219212]
110B19212l81799j91392K67938L34326J9894k39274k58510l2825K69855K78769
120B86194n6239l14038k10926J10249L22278J73661j97536l20184o0820K14840
130e2521K47951O4586k22341l10386J3511L44971K06293j48451k55222j26438
140b38047Q7593K79599J76364k07759l36266j6356K68458K08577j8327k14539
150a0703k32679K9393L02098J98628j48572k88032j04680J63502K60213Q0593
160B49761k03721k59337j5868K37792K24460l5288k63213j90492J06849K68287
170A19230J21581j38654k44890r9007J73200K66709L5619k39429k15792M1461
180a79972K25983J75899n5822k49127j65277J27334K67059Q8593j72273k29717
$$ y = [219212, -162587, -353979, -86041, 248285, 268179, 28905, -229605, -262430, 7425, 286194, 229955, -84083, -295009, -184760, 137518, 311179, 113643, -206541, -267361, -52521, 195430, 260016, 37675, -272711, -259200, 85771, 292064, 143613, -111609, -238047, -150454, 129145, 305509, 97750, -238516, -254872, 13586, 222163, 203836, -10703, -243382, -213989, 88109, 286737, 138165, -149867, -254547, -91045, 169168, 249761, 46040, -213297, -229165, 8627, 233087, 197799, -65414, -255906, -149057, 119230, 240811, 102157, -142733, -241740, -68540, 198169, 233788, -5641, -221433, -179972, 46011, 221910, 166088, -83039, -248316, -120982, 146077, 234670, 62397, -167320]
190a67320m7565J85941K24113N438k27108j95362N8492K36735J49318r9304k37297
201a13919j10595J41482K34009O2544j77645k16823j2363K05340J91039l6595
211A66474k21793j58086Q2615K30431J18149j25761k25829p4385J57834K15120
221A64769L1044j90924j95496K2307K08317J58253o2179k13513j30400J02879
231a04943K22953Q5778j46911k07167l7001J69213J89184j261j93718j67150M9991
242a41032K08323J31922r0708k11815r4142J29734K04477M9882j55371j88988
252a57718j5078J81565J74856l6897k02901j32106P8118J93445J02997j02056
262H4225k04184p1052J51328J92399J1487j68113j58631J6414J78758J49064n7806
$$ y = [-167320, -214885, -28944, 195169, 200607, -26501, -221863, -163371, 73364, 222682, 123378, -113919, -224514, -83032, 150977, 213521, 35876, -180947, -193310, 12030, 203069, 166474, -55319, -213405, -130790, 99641, 217790, 92029, -133800, -208185, -50351, 164769, 195813, 4889, -190607, -168300, 40017, 198270, 136091, -77422, -207822, -104943, 118010, 203788, 56877, -150290, -187291, -18078, 171106, 169845, -23873, -191023, -141032, 67291, 199213, 108505, -103310, -197452, -67718, 136759, 186641, 31270, -157718, -172796, 8769, 183625, 146728, -56173, -188279, -110161, 83284, 186281, 84225, -119959, -191011, -39683, 152716, 164203, -3910, -162541, -146127, 32631, 181695, 123889]
273A23889k02593j08985J05913J92249O7814j26726j85021l6949J57459J72957
283A60007q105j77323j46447M6562J87821J16630q5903j88326p9981J13575J81935
294A20445M8664j44343j75125j901J69115J43709l6376j71636j22245O5304J87189
305H2800R4146j10113j82982m7586J32783J65198J9255j51867j56657J9924J74998
316C9899J27526o1371j76330r6282Q8907J76585O6489j20839j70758k7332J44293
327i213J53122r358j60788j31657M5746J70645J03547p8622j72730p3223J09597
338e2934J69119L7419j35110j54284j731J51710J36616l1772j65368j12214O7489
349i1060J69494Q0579r6620j65030m9788J21687J56423J4549j43468j38795K1187
$$ y = [123889, -78704, -187689, -81776, 110473, 178287, 51561, -133460, -170409, -12950, 160007, 151902, -25421, -171868, -125306, 62515, 179145, 93242, -95084, -175065, -61490, 120445, 169109, 24766, -150359, -152260, 16855, 160564, 124188, -47448, -169693, -104389, 82800, 176946, 66833, -116149, -163735, -30952, 134246, 153501, 1634, -155023, -135099, 39899, 167425, 106054, -70276, -166558, -77651, 98934, 165423, 44584, -126174, -153506, -9213, 143909, 134551, -26237, -157894, -112148, 58497, 162044, 83422, -89308, -162531, -52934, 116185, 153604, 18494, -135790, -137521, 14189, 150805, 119033, -46335, -158549, -91060, 78434, 159013, 62393, -102637, -152425, -30738, 125685, 140234, -3234, -142029, -120842]
360a20842J55654J15663n3462j63155q9211Q5247J63336N7188j12316j54731k4217
371a40846J33056J41766q685j49601j21629M2951J58173R5755p2758j59223o7779
382a48820R9834J55366L5527j23564j42552k118J39217J24383k9509j50779j02358
393a45373O1370J55222P3786q9327j51799m4257J12454J43564J3003j32055j28160
404a31572J9788J44519J06757m9396j49912q2796P7560J50811N4453j02958j43210
415a05956k2933J21385J29734o889j35876j12647L8231J44931Q7686o7121j45474
426g4929o1343R0931J41864L2853j13343j31494j543J28855J14580k7688j38771
437d0028r3840N6366J42645O9119q1113j40599m2305J04323J32751J0972j20670
$$ y = [-120842, 34812, 150475, 97013, -66142, -155353, -70106, 93230, 150418, 38102, -116629, -140846, -7790, 133976, 125291, -24310, -145939, -102988, 55185, 150940, 78182, -81041, -148820, -48986, 106380, 141907, 18343, -124209, -126327, 12890, 137273, 107764, -43015, -145373, -84003, 71219, 145005, 55678, -96121, -140378, -27924, 115640, 128643, -3412, -131572, -111784, 32735, 139492, 90096, -59816, -142612, -65052, 85759, 140212, 37254, -105956, -128889, -7504, 122230, 115341, -20535, -133182, -94951, 49980, 137666, 70545, -74929, -136272, -45341, 96523, 129376, 16033, -115461, -117004, 11851, 126431, 98743, -40028, -133868, -77502, 65143, 134262, 53149, -87450, -129755, -25432, 107319, 118291, -2379]
448b379j15821J6446J30013J00076m4043j40182p5453P4196J36096M6272r2098
459C3123j29279k3741J12365J21981r330j28293r9632L7395J30517Q0663n9613
470F6156j35806n7706Q6691J31433K7829j04063j19290k444J18258J05963k5999
481I1022j27429q5282N1222J31008O3383p6473j29178l5367R5650J18254J0885
492A07695j09443j09385J5972J24397Q9673m5712j25778o6570O4702J25785M7079
503A18415q7618j23165j7249J05472J07839p823j14147r4177L1942J23571P4684
514A17744n8363j23653n0315P8027J19245K6895r6196j10968m47J09755R6009
525A07733k4953j17532p8511M8457J20856N7737p0545j19597l3304Q9630J10680
$$ y = [-2379, -118200, -101754, 28259, 128335, 84292, -55890, -131343, -57147, 78949, 125221, 33123, -96156, -119897, -7532, 114449, 105119, -23174, -122806, -85411, 45106, 125769, 66156, -69650, -127356, -40665, 90768, 118597, 14534, -104756, -107200, 11058, 117021, 91022, -36407, -121689, -70467, 60541, 123924, 47451, -81727, -117094, -21444, 96810, 107695, -1748, -111133, -95161, 29236, 118909, 73197, -52581, -119151, -54449, 71336, 118415, 30797, -92368, -109617, -4145, 103694, 95871, -18276, -112453, -80511, 43060, 117744, 59381, -64272, -114587, -36560, 82685, 109580, 13384, -97584, -98031, 11724, 107733, 82780, -34752, -113263, -64806, 56050, 113787, 43242, -76355, -109659, -20029, 90651]
536I0651Q277j01514r8944J3742J13339Q5145m1351j18934o0401O2201J13813
547F6024M1669p8121j13171j8623R8949J01417j0744j06522q3812K9925J12109
558C9100O9510n3297j16197m6874P3949J11310K4024r1002j02000J748J00156
569A0427Q7153j9648j07763p7860M5867J18067M9711p0924j03213k7702P3585
580b2300J03254J7318j00420r9054K3701J08476O5918l7043r8951o2759N0480
591e1380J16360M0613q4392j02838p681Q6416Q8821k923r8094q3715K9545J07242
603C7974O2724m9753j07632m4000P1384J02379J6899p9652q8975p419R0832R3299
615I8060k2947j13102o0017N2381R1605M3665m5768j03667m3782Q5606J07063
$$ y = [90651, 98928, -2586, -101530, -87788, 25551, 110696, 69345, -49589, -109990, -47789, 66024, 107693, 29572, -83599, -102222, -3273, 98144, 87400, -19122, -102934, -73009, 39100, 108610, 55313, -60884, -107758, -33809, 77501, 101525, 10523, -91477, -89729, 10427, 97580, 77932, -29831, -107691, -61824, 56243, 105954, 35030, -68183, -95885, -22300, 80954, 98272, -2148, -101202, -77501, 30975, 96893, 59850, -39101, -101860, -51380, 64980, 105593, 21201, -81637, -89318, -2902, 85919, 82996, -15098, -98813, -69268, 37974, 100698, 50945, -56687, -100687, -29303, 73076, 89975, 10323, -78652, -86071, 4761, 98060, 75113, -37989, -98006, -45625, 45980, 89645, 43877, -59790, -103572, -17966, 89097]
626H9097o852r4374o8935J2068Q2793P9226k4919j12978n7794O5611R9029K5414
638H7386o4933r0506j9586Q1653R0450p464r3186p4003K6052J00440N9616n2727
650D3192r7523l1568N7708Q7530L1001p3524j02550K965J02856O6495l2051p8043
662b3512n7434K0603J00127O2536o8099j06557r785P5356P0893J0270o7774q8163
674h1539M480J02199O7754m3460r1178m1551M4979Q9574L5954o4683r0459j1884
686g9814P6200Q1190m518r0168o9798L3171Q8980M4695l6708q4289m8239N6421
698c2877J02087J4739q5122p0901R843O6322O7828l004r1636p0974M7655R7891
710E1851K7037n4785p3421k7558N5752Q9531J0920q5766p3310K0606Q1421N5480
$$ y = [89097, 82245, -12129, -81064, -68996, 13797, 93023, 68104, -44874, -102668, -37057, 61972, 87386, 22453, -68053, -87639, -5986, 84464, 77000, -16186, -90189, -64137, 36303, 95919, 43192, -54331, -85899, -28191, 59339, 90340, 16816, -85734, -82769, 20087, 86582, 54531, -23512, -80946, -60343, 39784, 102320, 34221, -72336, -82121, -6765, 64128, 74398, 6624, -81539, -77059, 25140, 92894, 49434, -41744, -83295, -38316, 51258, 87212, 22529, -67930, -79814, -3614, 77576, 73058, -17110, -86908, -53737, 35243, 79938, 43230, -41059, -89298, -32877, 69210, 83949, -1173, -72074, -62231, 4091, 71919, 68915, -22721, -93695, -46040, 51851, 78888, 24103, -49318, -76876, -21124, 68407, 79327, -6439, -79749, -59143, 22278, 77758]
722G7758k7364q5332m7630M7126Q6121K8629n8814q3602j3423P6135P4871j3456
734F1019p7602n5833J8583P9000N7970l9684r4459k9636O3921P3693J0718n6889
746A0801p3631q964P9435P2769k5557q5389m3996L5295P5307M0452m4483q5395
758e3356k3650O6407P5301J051p0034o5161J1267P7571N5408k9356p9452m1667
770g5671M2422Q1091K7422n9701p5770n794O5608O4523l950p2048o1875K3296
782e0447Q2516M2957m2199p4816k8448M7534P5420J8464o4440p1852M605P1533
794A0827N7042j7480p2941m9298L1472P8213L4691m7576p4533j8706N7294O9792
806E8797L693o6803o1687J2855P1896N0835k7017p5203l8397M1912P4400K2857
$$ y = [77758, 50394, -34938, -82568, -35442, 50679, 79308, 20494, -63108, -76531, -396, 74475, 61019, -16583, -72416, -53833, 25167, 83137, 43453, -51006, -80642, -16721, 56972, 67690, 10801, -62830, -71794, 7641, 80410, 54853, -30536, -74532, -39237, 36070, 76522, 32039, -53356, -77006, -10599, 64702, 65753, -4281, -69442, -58175, 19396, 74804, 45448, -34004, -75671, -33249, 47842, 75264, 15563, -60207, -66001, -393, 64130, 60180, -11868, -73743, -50447, 32069, 75026, 32827, -41989, -70437, -22903, 52517, 70981, 6541, -65311, -60706, 10827, 67869, 50389, -22552, -71850, -40378, 37835, 72526, 24950, -49583, -68289, -10995, 58797, 62490, -4313, -66000, -53145, 18751, 69586, 42569, -32634, -71031, -29119, 45281, 68138]
818F8138n2921o9678q797O2431O3478p235o9416n3276K2209P2656M1527l6176
830C2940p3253k7578M8621O9736J3071n8191o4446K114O6375N5296j7721p0092
842b3128m3953L1072P1367L1771m3827o9925j7396N4622O5219K096o2721n6816
854f1619J2673O7005M6830k5316p0257l5951L9899O9901K0011n0467o3649p205
866e8145N7126N9452o172o6382m9802K3274O7674L6445l3627o6902k6424M5313
878a8170O6517J1306n6096n9011L443O1206N0910j6151o5548m1356K9775O6778
890C3603K9037m1379o5367j5405N1661N9723J293n7628n2701J0758O3576M4500
902F1671k5755o6176l0842L7271O2864J9831m5817o1431p042N6335N4607q648
$$ y = [68138, 15217, -54461, -63258, -827, 62651, 55416, -14000, -67276, -45067, 27589, 69116, 32940, -40313, -67891, -19270, 50466, 63537, 5346, -59100, -56986, 9389, 64685, 46964, -23128, -67081, -36009, 35358, 67129, 23302, -46623, -64019, -9397, 55822, 57918, -4803, -61619, -48946, 18059, 64889, 39573, -30684, -66635, -26736, 43165, 63176, 12709, -50940, -58145, -1019, 58433, 52261, -14121, -63923, -40649, 27025, 63470, 29843, -37059, -63483, -18170, 48347, 59653, 3557, -55454, -52011, 9195, 60105, 43954, -21594, -62950, -33175, 33603, 62640, 21261, -44106, -59511, -7850, 51873, 53166, -4462, -57163, -46405, 17171, 61671, 35916, -30260, -61102, -23831, 39033, 58864, 13047, -48384, -55426, 909, 55516, 46868]
914D6868o0204m4791J9811O2668L5957l2093o4315k2974M3560O0216R988n1060
926C631n5035K501N7645M7722j6041o1126l7913K8018O2237K6455l8965o0178
938d1049j3866M7501N5717J623n4581m9413J1776N9185L9618k3628o0214k9566
950e6897L4185O0003J7886m4287n6122m962N1159M9976p049n6321m2248J9307
962c5370N9123L2000l0664n8557k0851L9946N6160R247m8309n1197L605N3777
974H910M3419j5233n6724l4630K6203N7916K4152l6602n5837j2367M4513N1255
986D4975R77n0708m5441J1239N5047L6642k2676n6088k6694L2237N5300J6034
998E0844m1254n1914m167M8032M5999p449n2124l8835J8589N4524K9420k8723
$$ y = [46868, -13336, -58127, -38316, 24352, 60309, 28216, -36099, -59073, -15513, 44703, 54691, 3631, -51404, -48903, 8742, 56464, 40423, -20703, -58616, -30598, 31639, 58094, 19129, -41049, -54915, -7414, 48303, 49926, -4655, -54068, -42292, 16893, 56511, 32883, -27331, -56897, -22712, 37291, 55177, 10890, -45232, -50194, 965, 50941, 43892, -12429, -54677, -35370, 23753, 55753, 25089, -33468, -54319, -14373, 41787, 51034, 2725, -48472, -44867, 8910, 52329, 37096, -19628, -54258, -28055, 29861, 54013, 17411, -38426, -50793, -6280, 44975, 45952, -4756, -50197, -38958, 16089, 52731, 30055, -26033, -52727, -20490, 34810, 50844, 9590, -42324, -46491, 1541, 47540, 40091, -12033, -50868, -32279, 22245, 51665, 22942]
1010B2942n4348j9212L7751N2163P690m4997m6795L568M9723M0391j4672n2905
1022a8701l1923K5316N3567K1327l3927n1369j1415M1616M7907L7m7797m1352
1034d6714J1183N0795L3469k1129n2267k4541L0820N1510J3828l8826m7733l202
1046d2807M4736M2530p533m9029l5317J8162N0798K6579k7483n0509j6895L5845
1058a0923M7860O170m2200m3043M239M6698L6936j4652m9497k8582K4103M9760
1070B6869J9403l2572m7911r276L9598M3773j038m4567l8010J1275M7643L0692
1082D5879k1068m8771k1544K9475M7426J1981l6487m4241k226M2405L9113q192
1094C3750m5931l1989J7409M7537K4041k6280m7242j4789L4206M4248M866l9736
$$ y = [22942, -31406, -50618, -12867, 39296, 46986, 1989, -44806, -41238, 8485, 48876, 34204, -18701, -50624, -25308, 28259, 49586, 15659, -35710, -47125, -5509, 42398, 42435, -5362, -46714, -35531, 15264, 48733, 27604, -24663, -49204, -18384, 33126, 46954, 8128, -39605, -42807, 1929, 44459, 36926, -12103, -47420, -29258, 21540, 48119, 20636, -29873, -46768, -10923, 36937, 43107, 907, -42136, -37897, 8801, 45737, 31085, -18412, -46994, -22891, 26869, 46272, 13700, -34211, -43487, -3889, 39884, 38846, -5721, -43731, -32456, 15187, 45879, 24811, -23960, -45504, -16029, 31397, 43378, 6891, -37350, -39576, 2829, 41942, 33750, -12181, -44170, -26761, 20776, 44817, 18537, -28705, -43494, -9288, 34960, 39826, 90]
1106I0l9760M555M4043L3965j4539m6298k5934K3325M6302J7336l0983m4594p986
1119d0478L7553M0529j779m1928l4942J1161M4757K7984k0250m5415j9615K8035
1131a4388M4134J0711l4606m1304j122L9906L5911p973m3119k9718J7127M4431
1143A9990K1788k4993m3950j3272L2062M1359M096l7576l6782M994M1212L1205
1155D0133j3946m3294k3933K2299M3167J5612k9346m1226o823L4885L7783k045
1167C3266l9368l2499J0979M2082K5581j9468m2237j7678K6116M1216R834l2936
1179D888l8434l65L7892L2749q363l9665k7350J5823M2082K0327k4631m1113j1083
1192c7243L0348L7612L673l4906l4845N302L9251K8592j4068m0245k1573K1005
$$ y = [90, -39670, -35115, 8928, 42893, 28354, -17944, -43878, -20553, 25749, 43085, 12102, -32492, -40478, -2925, 37604, 35825, -6103, -41045, -29884, 14873, 42857, 22607, -22808, -42423, -14388, 29746, 40457, 5851, -35453, -36575, 3331, 39242, 31269, -11850, -41568, -24441, 19990, 41778, 16785, -27165, -40437, -8375, 32984, 37080, -496, -37278, -32284, 8928, 40133, 26187, -17107, -41040, -18741, 24426, 40038, 10692, -30534, -37357, -2472, 35311, 33266, -6102, -38601, -27622, 14460, 40041, 20573, -21664, -39342, -13226, 27990, 37824, 4888, -33546, -33911, 3981, 36730, 28367, -11298, -38648, -22825, 19257, 39584, 14953, -26160, -37243, -6895, 30717, 34390, -516, -35361, -30059, 9192, 37784, 23716, -16529, -38102, -17097]
1204a7097M0338J4112k7753l8590n894L3379L4951k605l7588k9498J1384L8707
1216A3846K2951j7745l9529j7087K5687L9358P428l1834l4007L04L3744L1070
1228C4186o720l8965k5787J7301L9033J6715k2642l6794j1184K7960L6625K587
$$ y = [-17097, 23241, 37353, 9600, -28990, -34884, -1505, 33446, 30841, -6747, -36245, -24861, 13846, 36797, 19052, -20477, -37564, -11877, 27481, 34909, 3075, -30932, -30628, 3116, 34186, 27466, -11499, -37286, -19985, 19048, 35763, 13121, -23673, -34857, -6897, 29728, 32315]
$$ [...]
8191B0
##END NTUPLES=NMR FID
##END=
