##TITLE=1H_CPA-1
 D2O
 8 sc, 
 10.7.2024
##JCAMPDX= 6.0         $$ Bruker NMR JCAMP-DX V2.0
##DATA TYPE= NMR FID
##DATA CLASS= NTUPLES
##ORIGIN= UXNMR, Bruker Analytische Messtechnik GmbH
##OWNER= root
$$ XWIN-NMR		Version 3.5
$$ Wed Jul 10 13:42:31 2024 Russian Standard Time (UT+4h)  she@DPX200
##.OBSERVE FREQUENCY= 200.1314
##.OBSERVE NUCLEUS= ^1H
##.DELAY= (6, 6)
##.ACQUISITION MODE= SIMULTANEOUS
##.ACQUISITION SCHEME= undefined
##.AVERAGES= 8
##.DIGITISER RES= 18
##SPECTROMETER/DATA SYSTEM= spect
##.PULSE SEQUENCE= zg30
##.SOLVENT NAME= CDCl3
##.SHIFT REFERENCE= (INTERNAL, CDCl3, 0, 15.7039)
##AUDIT TRAIL= $$ (NUMBER, WHEN, WHO, WHERE, WHAT)
$$ ##TITLE= Audit trail, XWIN-NMR		Version 3.5
$$ ##JCAMPDX= 5.01
$$ ##ORIGIN= Bruker BioSpin GmbH
$$ ##OWNER= she
$$ F:/spectra/data/she/nmr/H-F/1/audita.txt
$$ ##AUDIT TRAIL=  $$ (NUMBER, WHEN, WHO, WHERE, WHAT)
(   1,<2024-07-10 13:41:01.25 +0400>,<she>,<DPX200>,
      <created by zg, POWCHK disabled, PULCHK disabled
       configuration hash MD5:
       00 E9 B6 7A A2 85 ED C7 34 08 36 98 17 FE 4E 26
       data hash MD5: 16K
       12 A0 22 67 39 FA C2 36 99 79 D6 F4 F4 5A 05 7C>)
$$ ##END=
$$ 
$$ hash MD5
$$ 76 36 A7 7C 77 58 4F 49 94 20 7C EC 4D ED 8C 82
##$RELAX= 
##$RELAX= 
##$RELAX= 
##$RELAX= 
##$RELAX= 
##$RELAX= 
$$ Bruker specific parameters
$$ --------------------------
##$DU= <F:/spectra>
##$EXPNO= 1
##$NAME= <H-F>
##$PROCNO= 1
##$TYPE= <nmr>
##$USER= <she>
##$AMP= (0..31)
100 100 100 100 100 100 100 100 100 100 100 100 100 100 100 100 100 100 
100 100 100 100 100 100 100 100 100 100 100 100 100 100 
##$AQSEQ= 0
##$AQ_mod= 1
##$AUNM= <au_zg>
##$AUTOPOS= <>
##$BF1= 200.13
##$BF2= 200.13
##$BF3= 200.13
##$BF4= 200.13
##$BF5= 200.13
##$BF6= 200.13
##$BF7= 200.13
##$BF8= 200.13
##$BYTORDA= 1
##$CFDGTYP= 0
##$CFRGTYP= 5
##$CHEMSTR= <none>
##$CNST= (0..31)
1 1 145 1 1 1 1 1 1 1 1 1 1 1 1 1 1 1 1 1 1 1 1 1 1 1 1 1 1 1 1 1 
##$CPDPRG= <>
##$CPDPRG1= <>
##$CPDPRG2= <>
##$CPDPRG3= <>
##$CPDPRG4= <mlev>
##$CPDPRG5= <mlev>
##$CPDPRG6= <mlev>
##$CPDPRG7= <mlev>
##$CPDPRG8= <mlev>
##$CPDPRGB= <>
##$CPDPRGT= <>
##$D= (0..31)
0 1.2 0 0 0 0 0 0 0 0.06 0 0.03 0 0 0 0 0.0002 0 0 0 0 0 0 0 0 0 0 0 0 
0 0 0 
##$DATE= 1720604460
##$DBL= (0..7)
120 120 120 120 120 120 120 120 
##$DBP= (0..7)
150 150 150 150 150 150 150 150 
##$DBP07= 0
##$DBPNAM0= <>
##$DBPNAM1= <>
##$DBPNAM2= <>
##$DBPNAM3= <>
##$DBPNAM4= <>
##$DBPNAM5= <>
##$DBPNAM6= <>
##$DBPNAM7= <>
##$DBPOAL= (0..7)
0.5 0.5 0.5 0.5 0.5 0.5 0.5 0.5 
##$DBPOFFS= (0..7)
0 0 0 0 0 0 0 0 
##$DE= 6
##$DECBNUC= <off>
##$DECIM= 24
##$DECNUC= <off>
##$DECSTAT= 4
##$DIGMOD= 1
##$DIGTYP= 9
##$DL= (0..7)
0 120 120 120 120 120 120 120 
##$DP= (0..7)
150 150 150 150 150 150 150 150 
##$DP07= 0
##$DPNAME0= <>
##$DPNAME1= <>
##$DPNAME2= <>
##$DPNAME3= <>
##$DPNAME4= <>
##$DPNAME5= <>
##$DPNAME6= <>
##$DPNAME7= <>
##$DPOAL= (0..7)
0.5 0.5 0.5 0.5 0.5 0.5 0.5 0.5 
##$DPOFFS= (0..7)
0 0 0 0 0 0 0 0 
##$DQDMODE= 0
##$DR= 18
##$DS= 0
##$DSLIST= <SSSSSSSSSSSSSSS>
##$DSPFIRM= 0
$$ [...]
##$SUBNAM2= <"">
##$SUBNAM3= <"">
##$SUBNAM4= <"">
##$SUBNAM5= <"">
##$SUBNAM6= <"">
##$SUBNAM7= <"">
##$SUBNAM8= <"">
##$SUBNAM9= <"">
##$SW= 24.0689651099613
##$SWIBOX= (0..15)
0 0 2 0 0 0 0 0 0 0 0 0 0 0 0 0 
##$SW_h= 4816.95568400771
##$TD= 16384
##$TD0= 1
##$TE= 0
##$TE2= 300
##$TE3= 300
##$TEG= 300
##$TL= (0..7)
0 120 120 120 120 120 120 120 
##$TP= (0..7)
150 150 150 150 150 150 150 150 
##$TP07= 0
##$TPNAME0= <>
##$TPNAME1= <>
##$TPNAME2= <>
##$TPNAME3= <>
##$TPNAME4= <>
##$TPNAME5= <>
##$TPNAME6= <>
##$TPNAME7= <>
##$TPOAL= (0..7)
0.5 0.5 0.5 0.5 0.5 0.5 0.5 0.5 
##$TPOFFS= (0..7)
0 0 0 0 0 0 0 0 
##$TUNHIN= 0
##$TUNHOUT= 0
##$TUNXOUT= 0
##$USERA1= <user>
##$USERA2= <user>
##$USERA3= <user>
##$USERA4= <user>
##$USERA5= <user>
##$V9= 5
##$VALIST= <valist>
##$VCLIST= <CCCCCCCCCCCCCCC>
##$VD= 0
##$VDLIST= <DDDDDDDDDDDDDDD>
##$VPLIST= <PPPPPPPPPPPPPPP>
##$VTLIST= <TTTTTTTTTTTTTTT>
##$WBST= 1024
##$WBSW= 4
##$XGAIN= (0..3)
0 0 0 0 
##$XL= 0
##$YL= 0
##$YMAX_a= 485249
##$YMIN_a= -548836
##$ZGOPTNS= <>
##$ZL1= 120
##$ZL2= 120
##$ZL3= 120
##$ZL4= 120
##$ABSF1= 10
##$ABSF2= 0
##$ABSG= 5
##$ABSL= 3
##$ALPHA= 0
##$AQORDER= 0
##$ASSFAC= 0
##$ASSFACI= 0
##$ASSFACX= 0
##$ASSWID= 0
##$AUNMP= <proc_1d>
##$AZFE= 0.1
##$AZFW= 0.1
##$BCFW= 1
##$BC_mod= 2
##$BYTORDP= 1
##$COROFFS= 0
##$CY= 11.3945322036743
##$DATMOD= 1
##$DC= 2
##$DFILT= <>
##$DTYPP= 0
##$F1P= 15.6554695791079
##$F2P= 12.8336369535428
##$FCOR= 0.5
##$FTSIZE= 0
##$FT_mod= 4
##$GAMMA= 1
##$GB= 0.15
##$INTBC= 1
##$INTSCL= 1
##$ISEN= 128
##$LB= 0.24
##$LEV0= 0
##$LPBIN= 0
##$MAXI= 10000
##$MC2= 0
##$MEAN= 0
##$ME_mod= 0
##$MI= 1.114404
##$NCOEF= 0
##$NC_proc= 0
##$NLEV= 6
##$NOISF1= 3.799351
##$NOISF2= 2.8
##$NSP= 1
##$NTH_PI= 0
##$NZP= 0
##$OFFSET= 15.70392
##$PC= 1
##$PHC0= -25830.39
##$PHC1= 16.38748
##$PH_mod= 1
##$PKNL= yes
##$PPARMOD= 0
##$PSCAL= 0
##$PSIGN= 0
##$REVERSE= no
##$SF= 200.130013532006
##$SI= 16384
##$SIGF1= 3
##$SIGF2= 2
##$SINO= 400
##$SIOLD= 16384
##$SREGLST= <1H.CDCl3>
##$SSB= 0
##$STSI= 0
##$STSR= 0
##$SW_p= 3612.71676300578
##$SYMM= 0
##$S_DEV= 0
##$TDeff= 0
##$TDoff= 0
##$TI= <>
##$TILT= no
##$TM1= 0
##$TM2= 0
##$TOPLEV= 0
##$USERP1= <user>
##$USERP2= <user>
##$USERP3= <user>
##$USERP4= <user>
##$USERP5= <user>
##$WDW= 1
##$XDIM= 8192
##$YMAX_p= 0
##$YMIN_p= 0
$$ End of Bruker specific parameters
$$ ---------------------------------
##NTUPLES= NMR FID
##VAR_NAME=  TIME,          FID/REAL,        FID/IMAG
##SYMBOL=    X,             R,               I
##VAR_TYPE=  INDEPENDENT,   DEPENDENT,       DEPENDENT
##VAR_FORM=  AFFN,          ASDF,            ASDF
##VAR_DIM=   8192,          8192,            8192
##UNITS=     SECONDS,       ARBITRARY UNITS, ARBITRARY UNITS
##FACTOR=    0.0002076,     1,               1
##FIRST=     0,             0,               0
##LAST=      1.7004516,     0,               0
##MIN=       0,             -548836,         0
##MAX=       1.7004516,     485249,          0
$$ Real data points
##PAGE= N=1
##DATA TABLE= (X++(R..R)), XYDATA
0 0 0 0 0 0 0 -7 0 0 7 0 7 -13 7 -14 20 -21 25 -32 34 -42 53 -61 68 -85 94 -108 128 -144 160 -187 210 -234
32 -234 267 -298 332 -375 417 -462 514 -572 629 -703 778 -856 948 -1053 1163 -1290 1437
49 1437 -1597 1786 -2005 2260 -2567 2941 -3396 3968 -4667 5367 -4829 -14828 -548836 -412032
63 -412032 189188 282042 247535 48585 -395560 -393239 211460 440913 123748 -178095 -322957
74 -322957 -240469 225216 485249 88195 -389936 -364924 11284 400169 375222 -163004 -485887
85 -485887 -133914 254812 265781 151982 -107054 -420585 -196630 372413 402799 -57579
95 -57579 -317751 -269761 -20596 359730 372508 -170292 -497905 -142771 302966 310647 44286
106 44286 -215505 -296435 -77813 263745 330108 7633 -346281 -298788 109002 380505 212199
117 212199 -173160 -367417 -161763 256234 389996 41761 -334379 -279137 59316 279824
127 279824 222520 -42020 -290139 -245188 92866 351869 204629 -206230 -380835 -88869
137 -88869 285428 294517 1421 -269161 -281993 31062 350530 223711 -173567 -290888 -100526
148 -100526 113586 263847 188029 -186093 -375916 -51572 315329 265548 -34877 -273814
158 -273814 -252498 76888 345347 171115 -185352 -275763 -98020 152246 279356 90421
168 90421 -235200 -268011 -3850 226556 242144 -217 -310050 -250413 157378 332523 91500
179 91500 -180996 -243919 -91114 195436 289734 12985 -259956 -197603 37850 215016 215052
190 215052 -39520 -300399 -185910 161375 285687 93611 -181219 -274972 -53590 246491
200 246491 232869 -48466 -230762 -171190 42480 236247 177621 -110242 -265917 -109591
210 -109591 148271 249729 90564 -199797 -269158 4594 260174 192737 -63083 -232097
220 -232097 -163588 96343 257424 110248 -145088 -217442 -79168 140914 241366 57840
230 57840 -223046 -229093 35056 232116 171117 -70770 -250700 -142393 142910 240906 58527
241 58527 -156303 -200753 -47306 176629 214679 -5798 -211482 -171136 43295 221158 171432
252 171432 -98162 -263883 -94557 171872 212066 37402 -160792 -203651 -16715 205451
262 205451 177683 -52164 -199503 -138438 57248 213187 135284 -123928 -238805 -65298
272 -65298 169041 204917 19142 -192508 -186182 40135 208718 135423 -67561 -193511 -121710
283 -121710 96596 219598 84664 -143722 -199682 -41932 162227 200153 2917 -210957
293 -210957 -168322 69027 205245 111282 -91715 -198436 -90112 123532 194555 45677
303 45677 -148559 -182777 -17309 178031 173266 -35856 -200475 -134045 78958 205662 103473
314 103473 -120601 -202638 -47561 149331 173136 19575 -154190 -168956 11167 187110
324 187110 144582 -60848 -191496 -113644 90484 200713 77154 -140721 -188849 -23274
334 -23274 155002 160926 -7907 -173276 -143713 50056 181028 110830 -75191 -183876 -91491
345 -91491 115404 194397 45852 -149246 -169710 -4783 166027 155094 -34436 -183899 -118689
356 -118689 74117 175798 88525 -94701 -180565 -63030 129932 171479 18241 -151733
366 -151733 -155364 13584 172653 133318 -62172 -180939 -93438 91567 174444 66687 -118375
377 -118375 -169926 -27346 142334 153608 -932 -157314 -140396 40762 177207 109158 -78449
388 -78449 -173981 -77825 106089 172149 40075 -136362 -153738 -3193 144494 134907 -24748
399 -24748 -163086 -117377 64013 168842 82984 -91912 -166841 -56237 123573 163440 14146
410 14146 -145450 -137028 19485 153938 121292 -48936 -165125 -91888 82516 161681 63991
421 63991 -105074 -160177 -32922 133117 144934 -6726 -147820 -124467 36739 157357 99002
432 99002 -72582 -159516 -67574 95393 152319 41852 -118520 -147911 -7474 142134 129156
443 129156 -26605 -149745 -106393 56627 158695 82172 -87423 -155802 -47570 111062
453 111062 143403 17815 -126108 -131404 9478 141665 114130 -45160 -152729 -86709 73661
464 73661 149055 58890 -98284 -147575 -29012 123016 133298 -5517 -134457 -113450 32970
475 32970 144262 95120 -60951 -147646 -68404 87434 146876 41282 -112110 -136769 -6187
486 -6187 127276 117289 -20553 -136992 -102136 50441 145311 71535 -79400 -137874 -47437
497 -47437 94508 136048 22294 -121898 -124876 14970 132998 101650 -39870 -138258 -82558
508 -82558 69245 142305 53650 -91154 -131657 -27963 107947 125643 740 -124785 -108083
519 -108083 28548 132261 89420 -55833 -139676 -63573 82904 132284 33743 -101013 -124042
530 -124042 -8032 116810 108770 -20539 -125118 -92026 43501 134207 73291 -73250 -134076
541 -134076 -41871 93478 124837 20083 -109635 -116614 12298 125060 93028 -38222 -123359
552 -123359 -75685 56529 129119 54884 -83200 -126262 -28047 100956 117347 -1152 -119385
563 -119385 -98729 30824 120218 79325 -47967 -128514 -62314 80845 125261 26067 -89527
574 -89527 -107247 -17091 102106 116316 -13771 -131206 -85115 53052 117983 59355 -57677
585 -57677 -121309 -49630 87934 120951 10842 -102616 -99071 6518 106385 91998 -29687
596 -29687 -120204 -73933 54815 123688 53306 -82785 -121621 -16222 98449 96959 525
607 525 -95285 -98298 15195 124335 81189 -58738 -114989 -44105 58426 106670 48746 -82242
619 -82242 -127001 -7197 117644 88661 -30106 -98809 -71893 26215 110794 72001 -62427
630 -62427 -121528 -34494 81958 102578 17367 -88031 -101384 2342 107535 89556 -30359
641 -30359 -116015 -68430 59681 114372 35998 -70789 -94393 -28529 71329 109329 14561 -112841
653 -112841 -95167 38230 104097 54997 -31729 -98312 -72534 60518 130564 23253 -100942
664 -100942 -84927 5213 72379 85095 6630 -103734 -90688 41551 114402 52173 -55073
675 -55073 -101935 -42214 71812 106148 15208 -87498 -90822 1962 98320 84482 -34972 -105833
687 -105833 -48932 43683 85449 55165 -47884 -119885 -35078 102571 95157 -19086 -82393
698 -82393 -67583 1856 94262 87706 -44930 -118285 -35796 67021 82339 29819 -55416 -99264
710 -99264 -23295 91887 92729 -15078 -97554 -71344 32470 101404 52757 -54411 -93896 -33907
722 -33907 58906 95418 23444 -85946 -89885 13675 85931 63213 -12913 -86156 -76398 38255
734 38255 115701 41592 -75994 -88492 -11362 65084 81974 13196 -83530 -84906 19771 95874
746 95874 57754 -36215 -87158 -49092 44938 95980 36387 -70504 -95168 -7792 85573 77047
758 77047 -15822 -85734 -61742 26701 87406 53372 -42382 -93155 -37332 62254 89759 15938
770 15938 -72924 -80253 -356 82737 76067 -21456 -96422 -54671 48074 86806 30929 -49809
782 -49809 -80611 -28607 63527 87452 4447 -82352 -70293 15373 81367 62707 -29158 -94143
794 -94143 -46947 55666 87928 21781 -62595 -78721 -9465 72343 72815 -8471 -77650 -62150
806 -62150 20924 85732 54925 -43351 -90735 -30898 59475 80908 15361 -68669 -77436 4886
818 4886 79814 60279 -22221 -76679 -51377 30677 83844 41172 -51372 -83915 -21737 63083
830 63083 79039 5307 -77257 -69353 19069 80650 51117 -30341 -78330 -41389 43840 80282
842 80282 25626 -55528 -75304 -13273 66854 73543 -7038 -79357 -59080 25769 80333 45866
854 45866 -41792 -82115 -26691 55332 71320 12959 -57842 -70363 -3452 73404 64394 -19866
866 -19866 -77348 -48266 31539 79618 38939 -50401 -80244 -15410 61780 66977 2232 -64843
878 -64843 -62556 11334 72936 51191 -25984 -74472 -42835 39833 80579 25529 -59272 -71973
890 -71973 -5664 62863 64139 -5929 -72970 -54978 26614 72936 38099 -33488 -70654 -32908
902 -32908 46566 76049 15587 -62399 -66588 2867 67694 57932 -17647 -73777 -45063 33754
914 33754 72021 30824 -43433 -70525 -19069 54494 66341 4233 -62480 -60698 9592 71379
926 71379 51128 -28611 -73801 -34668 40991 70099 21840 -50707 -66467 -7558 59407 59666
938 59666 -5903 -65071 -51811 19513 69851 41677 -34214 -72091 -27720 48205 68497 10952
950 10952 -57288 -60506 2819 62483 52830 -16196 -67133 -42483 29187 67861 31558 -40334
962 -40334 -68486 -18837 53524 64216 1919 -60802 -54682 11614 65331 45722 -25846 -67267
974 -67267 -32750 36961 65307 21840 -46517 -63935 -8647 56873 57794 -6686 -63459 -48720
986 -48720 20767 66270 36781 -33757 -65841 -24205 43542 62579 12088 -52304 -58004 1676
998 1676 59061 50358 -14108 -63443 -41926 28052 66684 28608 -40960 -63006 -14882 48973
1010 48973 58318 2574 -56306 -51840 10817 61034 42531 -23293 -62947 -32608 34437 63298
1022 63298 20825 -45880 -60454 -6358 54230 52974 -6965 -58244 -44727 18480 61360 35398
1034 35398 -30603 -62053 -23555 40823 59413 11783 -49579 -55498 1694 57010 47369 -15208
1046 -15208 -60036 -37396 26802 60571 26471 -36921 -58837 -15389 45494 55609 2902 -53330
1058 -53330 -49318 10009 57657 40689 -21890 -60080 -30422 33597 59099 17945 -42279 -55069
1070 -55069 -6666 49457 50506 -5398 -55265 -42682 17742 57832 33270 -28735 -58689 -22423
1082 -22423 39005 56226 9989 -46831 -51059 1979 52241 44101 -13228 -55695 -36050 24316
1094 24316 57737 25487 -35168 -55782 -14050 42880 52181 2900 -50323 -46311 10161 54143
1106 54143 36980 -20428 -55099 -28847 30549 55841 17536 -40096 -52001 -6242 46464 47654
1118 47654 -5461 -52379 -39657 17038 53978 31043 -26664 -54932 -20989 36798 52196 9245
1130 9245 -43043 -47914 597 49391 42551 -13256 -53136 -32655 23364 53072 24183 -32489
1142 -32489 -52953 -13046 41029 48203 2007 -46187 -43323 8413 51118 35722 -19811 -52057
1154 -52057 -26421 28501 52124 16883 -37752 -49375 -5279 44020 43846 -5200 -48441 -37155
1166 -37155 15810 50510 29180 -24941 -51791 -19734 35247 49108 7966 -40315 -44290 349
1178 349 46146 40470 -12844 -50884 -29596 22897 48384 22189 -29209 -49862 -13016 39504
1190 39504 45645 728 -43445 -39904 7956 47972 33210 -19315 -48543 -24265 26310 49275
1202 49275 16428 -37252 -46484 -2192 40578 38272 -2718 -43610 -38579 14758 52011 25227
1214 25227 -27464 -44842 -16490 28429 46852 11535 -41343 -44215 5126 44202 33080 -10998
1226 -10998 -44206 -30222 19774 48441 20728 -29664 -46124 -11610 36758 43698 -206 -41856
1238 -41856 -35280 7576 42458 33160 -16257 -49819 -22577 30101 43276 10633 -29208 -41127
1250 -41127 -9640 38873 43937 -6694 -47312 -29584 17123 41126 24208 -19060 -45935 -19997
1262 -19997 32557 45549 4585 -37509 -36238 1795 37972 34732 -8330 -44771 -29588 20956
1274 20956 46487 18099 -29298 -42312 -8689 33027 38481 2419 -37371 -37208 6772 44806
1286 44806 29104 -19899 -41791 -18312 20827 40623 18670 -30919 -47199 -2111 43026 31798
1298 31798 -9247 -34318 -28912 7244 43701 28696 -25360 -45056 -10970 28467 36456 9447
1310 9447 -31580 -40677 872 41754 31873 -12076 -41046 -25497 19703 42483 15297 -26178
1322 -26178 -36567 -11383 27847 41728 3765 -42340 -33112 13194 36176 23359 -9573 -40428
1334 -40428 -27347 26410 46419 6162 -33053 -30931 -3615 28140 36482 -498 -41730 -30154
1346 -30154 15794 39200 20774 -18636 -40343 -16130 28559 38594 5187 -31644 -35141 715
1358 715 38519 30113 -13367 -36992 -20342 13952 36756 21897 -23769 -43407 -7813 34146
1370 34146 32730 -1013 -31417 -31551 4643 39509 26971 -17854 -38711 -15974 21280 35647
1382 35647 12149 -25842 -36115 -5333 32562 34039 -4296 -38021 -26844 14101 36957 19515
1394 19515 -18468 -37284 -14473 26342 36321 4410 -30311 -30876 890 32637 29311 -8144 -37252
1407 -37252 -23353 16776 38125 16413 -24774 -36791 -6229 29113 31194 949 -30798 -30212
1419 -30212 6158 36389 23127 -14837 -33996 -18062 17787 37527 13341 -28927 -35346 -653
1431 -653 30989 28409 -3613 -33704 -26116 13112 35365 16891 -16999 -33056 -15174 22675 36332
1444 36332 5864 -30449 -30275 1770 31411 28256 -8777 -37063 -20352 18650 33127 12873
1456 12873 -19705 -33045 -9266 27319 31405 58 -29094 -27668 3854 34336 25338 -15437
1468 -15437 -36088 -14313 19912 32232 10724 -24752 -32846 -1519 29737 25628 -3689 -29118
1480 -29118 -25350 8648 35296 19426 -18473 -33539 -12145 22634 33598 5040 -29930 -27924
1492 -27924 4403 28479 23395 -6412 -32404 -21388 16012 32999 12416 -18915 -31075 -10664
1504 -10664 25855 33475 -1009 -32269 -24066 7972 29614 21189 -12152 -33366 -14663 19526
1516 19526 29788 9463 -20960 -31198 -4714 29324 27709 -5351 -29877 -22633 9268 33379
1528 33379 18267 -19536 -31945 -7793 20777 27443 6790 -24488 -29647 1660 30197 22789
1540 22789 -7860 -29666 -20774 13720 33962 13014 -21946 -29616 -5620 23509 28027 616
1552 616 -28376 -23610 6815 27810 20116 -9398 -31445 -17075 18942 31522 7672 -22313 -28315
1565 -28315 -3798 27170 26917 -5904 -29678 -19071 9753 28018 17290 -14642 -31044 -10710
1577 -10710 20945 27973 5712 -23739 -28161 1019 29916 22429 -9623 -28502 -17017 12746
1589 12746 30152 12784 -19982 -28194 -5257 21293 26014 2761 -26407 -25574 6292 29463 18449
1602 18449 -11310 -29153 -15362 17534 30367 6869 -22488 -25185 -2293 23105 24880 -2621
1614 -2621 -28093 -20281 9805 27837 16241 -13541 -29904 -11295 21295 27936 2962 -23479
1626 -23479 -24139 1221 26442 21588 -8398 -27488 -15957 11755 27335 13561 -17468 -29076
1638 -29076 -6297 22698 25050 684 -24810 -23365 5797 28267 17336 -11757 -26473 -13031
1650 -13031 14773 27433 8796 -20377 -25561 -2493 22840 23911 -2132 -27121 -20348 10218
1662 10218 27557 14027 -13922 -27039 -10188 19000 26298 3272 -21782 -22529 62 23717
1674 23717 21957 -6389 -27688 -16175 12633 26545 11861 -16424 -27065 -5945 21957 23405
1686 23405 -388 -22533 -20900 3969 25625 17963 -10604 -26122 -12790 14155 26453 8922
1698 8922 -20085 -25638 -1381 22904 20976 -3044 -24174 -19149 8311 26109 13481 -13158 -24777
1711 -24777 -10066 16394 25765 4907 -21966 -22810 1678 23551 19512 -6226 -25602 -15430 12337
1724 12337 25202 10265 -15341 -24371 -6618 19589 23416 555 -22430 -20372 3917 24363
1736 24363 17600 -9976 -25874 -11895 14515 24087 7547 -17724 -23519 -2476 21419 20602 -2742
1749 -2742 -22731 -17959 7234 25028 14028 -12902 -24611 -8819 16559 23749 4224 -20441
1761 -20441 -21461 1596 22117 18123 -5597 -23503 -15386 10595 24396 10438 -14793 -23716 -6113
1774 -6113 18618 22422 432 -21678 -19004 4461 22724 16030 -9039 -24103 -11465 13687 23048
1787 23048 7321 -16430 -22591 -2840 20581 20308 -2978 -22189 -16694 7129 23381 13106 -12102
1800 -12102 -23428 -8426 15472 22342 4150 -18890 -20564 1071 20912 17400 -5017 -22488
1812 -22488 -15008 10558 24058 9422 -14775 -21567 -5314 16799 21225 1410 -20834 -18557 4797
1825 4797 21743 14455 -7962 -22313 -12125 12688 22923 6976 -16527 -21396 -2529 19379
1837 19379 19031 -2929 -21020 -15373 6359 21602 13501 -11093 -23255 -7883 15660 20307 3647
1850 3647 -16506 -19722 -652 21070 18219 -6702 -22262 -12078 9631 20565 10268 -12559
1862 -12559 -22270 -5866 17605 19961 306 -18938 -17440 3247 20659 14909 -7873 -21643 -11216
1875 -11216 12080 22046 6559 -16179 -19572 -1417 17168 17699 -750 -19904 -17012 7087 22576
1888 22576 10947 -11500 -19774 -7810 12573 21109 5407 -18444 -19876 2297 19443 14345 -4548
1901 -4548 -19040 -14009 7900 21851 9840 -13803 -20595 -4425 15761 18638 1055 -17923 -17062
1914 -17062 3244 20048 14349 -7715 -21205 -10003 12192 19685 5704 -13441 -18945 -3980
1926 -3980 17429 19204 -2877 -20838 -13267 6917 18301 11573 -8322 -21096 -9207 14923 20209
1939 20209 1901 -16100 -16178 -220 16927 16720 -4082 -20808 -12475 9526 19851 8299 -12060
1952 -12060 -19446 -4880 15140 17910 1092 -17191 -16721 2955 19748 12987 -8104 -18761 -9442
1965 -9442 9411 19426 7958 -14616 -20078 -1015 17407 14795 -2137 -16449 -14551 4606 20094
1978 20094 11732 -10582 -19347 -6259 12298 17874 4411 -14918 -17859 360 18019 14922 -4824
1991 -4824 -18840 -11772 8341 18818 8299 -11133 -18272 -5536 14007 18106 945 -17071 -15048
2004 -15048 3308 17217 12742 -5962 -19080 -10340 10931 19235 5042 -13435 -16562 -2295 14859
2017 14859 16235 -1134 -17753 -13758 5691 18325 10433 -8857 -18466 -7427 11928 17920 3602
2030 3602 -14989 -16367 655 16483 13710 -4177 -17290 -11475 7186 18091 8498 -10843 -17922
2043 -17922 -4866 13852 16893 860 -15950 -14725 2934 17068 12291 -6270 -17834 -9075 9867
2056 9867 17463 5781 -12073 -16778 -2864 14809 15665 -1557 -16641 -12912 5084 17410 10130
2069 10130 -8679 -17452 -6484 11403 16402 3390 -13491 -15595 -93 15848 13677 -3834 -16790
2082 -16790 -11049 7126 17608 8168 -10568 -17180 -4210 13084 15420 805 -14772 -13896 2281
2095 2281 16040 11900 -5661 -17078 -9112 9279 17060 5440 -11823 -16005 -2323 14304 14785
2108 14785 -1878 -15966 -11572 5062 15942 9669 -7407 -16657 -6937 10907 16256 3470 -13157
2121 -13157 -15169 92 15249 12896 -3920 -15869 -10358 6641 16438 7356 -10281 -15860 -3780
2134 -3780 11448 14424 1926 -13773 -14345 2481 16313 10819 -6132 -15670 -8369 8483 16456
2147 16456 5345 -11908 -14962 -1518 12757 13450 -617 -14838 -12020 4590 15539 9348 -7073
2160 -7073 -16298 -6974 10868 15861 2315 -12812 -13275 -45 13756 12627 -3413 -15584 -9530
2173 -9530 6641 14845 7546 -8456 -15813 -4866 12328 14725 480 -13556 -12713 2156 14839
2186 14839 10551 -5872 -14978 -7743 7723 14777 5579 -10602 -14963 -2215 12501 13044 -823
2199 -823 -14160 -11860 4677 15548 8347 -7612 -14617 -5890 9577 14619 3109 -11893 -13116
2212 -13116 1 12976 12156 -2624 -14866 -10078 6416 14950 6786 -8846 -14752 -4031 11433
2225 11433 13545 408 -12388 -11663 1579 13479 10658 -4841 -14664 -7672 7514 14388 5433
2238 5433 -10321 -14533 -1637 12853 12085 -1497 -13045 -10596 3817 14379 8478 -7015 -14084
2251 -14084 -5924 8528 14049 3653 -11715 -13451 413 12910 11065 -2930 -13960 -9280 6156
2264 6156 14158 5910 -8115 -13150 -4156 10054 13499 1224 -12444 -11416 1945 13172 10133
2277 10133 -4696 -14552 -7219 8184 13730 4121 -9319 -12939 -2113 11383 11904 -1065 -12326
2290 -12326 -10169 3121 13463 8595 -6605 -14162 -5272 8935 13056 2840 -10792 -12406 435
2303 435 12416 10011 -2814 -12412 -8878 4915 13717 6536 -8053 -13164 -3688 9733 12710 1275
2317 1275 -12187 -11132 2393 12521 8763 -4281 -12982 -7137 6890 12969 4243 -8717 -12371
2330 -12371 -2489 10691 11919 -846 -12641 -9522 3726 12689 7818 -6028 -13247 -5004 8723
2343 8723 12226 2716 -9466 -11619 -547 11662 10395 -2676 -12338 -8411 4684 12991 6290 -7947
2357 -7947 -12814 -3220 9365 11376 1072 -10778 -10639 1683 11871 8461 -3795 -12215 -7201 6489
2371 6489 12956 4445 -9061 -11781 -1636 10270 10953 -745 -11867 -9050 3658 11672 7123 -5246
2385 -5246 -12212 -5464 7779 12009 2561 -9478 -11141 -540 10952 10002 -2909 -12178 -7405 4984
2399 4984 11720 5864 -6803 -11950 -3137 8972 10919 1054 -9904 -10234 1173 11751 8576 -4260
2413 -4260 -11858 -6411 6011 11916 4081 -8403 -11117 -1466 9386 9918 -334 -10776 -9139 3229
2427 3229 11660 6832 -5378 -11595 -5202 7474 11749 2280 -9363 -10232 169 10307 9198 -2247
2441 -2247 -10999 -7356 4437 11304 5833 -6331 -11626 -3305 8683 10555 793 -9642 -9536 1190
2455 1190 10962 8007 -4199 -11233 -5664 5627 10851 4337 -7648 -10995 -1688 9387 9772 -581
2469 -581 -10305 -8575 3007 11316 6415 -5119 -10788 -4773 6803 11087 2443 -8941 -9675 10
2483 10 9104 8762 -1462 -10837 -7730 4714 11107 4639 -6335 -10257 -3333 7676 10525 874 -9585
2498 -9585 -8768 1623 9924 7678 -3160 -10713 -6027 5642 10760 4048 -7176 -10521 -1605 9065
2512 9065 9123 -1005 -9379 -7645 2245 10396 6889 -5034 -10902 -4099 6795 9794 2444 -7703
2526 -7703 -9792 -631 9861 8509 -2504 -10201 -6446 4124 10151 5242 -5771 -10445 -3212 7749
2540 7749 9738 847 -8764 -8525 1146 9550 7403 -3154 -10270 -5709 5467 10435 3393 -7022
2554 -7022 -9537 -1407 8056 8782 -366 -9325 -7963 2832 10370 5848 -4991 -9602 -4130 5905
2568 5905 10023 2750 -8126 -9397 450 9090 7515 -1744 -9098 -6818 3660 10244 4891 -5997
2582 -5997 -9679 -2715 7080 9070 942 -8488 -8327 1282 9280 6927 -3120 -9855 -5333 5261 9694
2597 9694 3302 -6348 -9174 -2017 8059 8965 -664 -9246 -7018 2621 8935 5991 -3875 -9897 -4462
2612 -4462 6428 9381 1789 -7242 -8405 -444 8468 7847 -1751 -9361 -6175 3713 9356 4660 -5362
2627 -5362 -9313 -2696 6881 8612 948 -7797 -8172 1072 9141 6609 -3105 -9060 -5061 4440 9305
2642 9305 3718 -6339 -9055 -1290 7543 7779 -285 -8297 -7210 2230 8932 5529 -4118 -9149 -3987
2657 -3987 5658 8876 2118 -6975 -8213 -334 7883 7344 -1561 -8864 -6076 3503 8979 4503 -4900
2672 -4900 -8852 -2866 6556 8469 756 -7584 -7480 937 8330 6308 -2746 -8788 -4929 4456 8886
2687 8886 3189 -6118 -8559 -1474 7263 7672 -422 -7896 -6803 2080 8652 5334 -3967 -8794 -3850
2702 -3850 5424 8564 2001 -6621 -7975 -347 7659 6924 -1485 -8381 -5641 3331 8480 4095 -4773
2717 -4773 -8506 -2742 6300 8108 763 -7412 -7165 1206 7931 6070 -2672 -8381 -4783 4267 8531
2732 8531 3127 -5695 -8010 -1296 6822 7376 -179 -7615 -6468 2108 8313 5081 -3892 -8243 -3500
2747 -3500 5045 7959 2066 -6381 -7473 -184 7263 6559 -1324 -7969 -5622 3119 8182 4006 -4688
2762 -4688 -8080 -2641 5939 7771 726 -6974 -6679 859 7346 5854 -2423 -8073 -4438 4311 7858
2777 7858 2800 -5339 -7649 -1570 6618 7199 -576 -7391 -5919 2008 7727 4749 -3565 -7847 -3391
2792 -3391 4948 7640 1926 -6142 -7256 -114 7106 6254 -1442 -7416 -5133 2990 7974 3822 -4644
2807 -4644 -7599 -2205 5512 7291 773 -6722 -6661 1047 7245 5484 -2520 -7600 -4322 4116 7779
2822 7779 2618 -5284 -7072 -1355 6303 6814 -393 -7042 -5713 1976 7357 4776 -3362 -7791 -3214
2837 -3214 4843 7376 1623 -5776 -6896 -256 6805 6000 -1603 -7181 -4868 2667 7502 3811 -4410
2852 -4410 -7526 -2061 5355 7002 838 -6359 -6529 1023 7208 5035 -2537 -7117 -4028 3642 7434
2867 7434 2726 -5040 -6964 -1223 5757 6563 -269 -6914 -5726 2068 7223 4201 -3282 -7296 -3314
2882 -3314 4707 7052 1426 -5541 -6461 -239 6405 5909 -1434 -7210 -4671 2856 7146 3593 -4199
2897 -4199 -7255 -2066 5415 6604 565 -6055 -5913 803 6850 5037 -2314 -7043 -3844 3452 7137
2912 7137 2705 -5077 -6866 -924 5749 6186 -359 -6473 -5498 1986 6853 4129 -3283 -6797 -2977
2927 -2977 4306 6906 1579 -5489 -6193 -158 6205 5592 -1403 -6932 -4514 2904 6808 3295 -3867
2942 -3867 -6850 -2077 5148 6401 488 -5786 -5768 711 6498 5071 -2430 -6918 -3655 3536 6677
2957 6677 2571 -4446 -6550 -1004 5616 5769 -199 -6024 -5284 1555 6709 4013 -3221 -6735 -2812
2972 -2812 4097 6729 1605 -5385 -6082 182 5910 5128 -1137 -6505 -4413 2664 6641 3150 -3707
2987 -3707 -6501 -2165 4766 6347 477 -5809 -5306 862 6186 4652 -2127 -6676 -3582 3583 6459
3002 6459 2207 -4299 -6291 -1158 5353 5709 -450 -5979 -4853 1491 6396 4005 -3201 -6500 -2476
3017 -2476 4012 6064 1487 -4971 -5899 -61 5810 4986 -1161 -5985 -4361 2469 6531 3146 -3911
3032 -3911 -6143 -1791 4508 5804 549 -5570 -5234 946 5836 4364 -1949 -6240 -3482 3436 6263
3047 6263 2203 -4299 -5913 -1050 5205 5566 -508 -5754 -4490 1527 5835 3636 -2839 -6315 -2557
3062 -2557 3857 5978 1262 -4627 -5648 -157 5654 4857 -1412 -5813 -3847 2441 6117 2914 -3548
3077 -3548 -5996 -1625 4337 5708 525 -5296 -5087 807 5644 4152 -1925 -5907 -3288 3174 6147
3092 6147 1975 -4327 -5492 -710 4767 5097 -158 -5579 -4414 1724 5745 3375 -2755 -6019 -2461
3107 -2461 3809 5813 1148 -4594 -5228 -134 5388 4732 -1356 -5712 -3612 2147 5726 2960 -3453
3122 -3453 -5960 -1591 4569 5217 391 -4787 -4859 659 5797 3980 -2158 -5658 -2937 2941 5636 2153
3138 2153 -4028 -5392 -840 4761 5055 -333 -5411 -4352 1721 5673 3187 -2613 -5544 -2521 3545
3153 3545 5667 1265 -4660 -4839 138 4889 4412 -904 -5527 -3859 2371 5676 2492 -3354 -5404
3168 -5404 -1505 4199 5229 378 -4992 -4673 944 5230 3842 -2042 -5477 -2725 2875 5473 2038
3183 2038 -3915 -5440 -682 4709 4669 -476 -5026 -3991 1601 5398 3234 -2692 -5482 -2156 3702
3198 3702 5248 1092 -4273 -4802 -62 4974 4295 -1246 -5473 -3430 2446 5302 2418 -3112 -5317
3213 -5317 -1683 4056 5062 366 -4785 -4306 780 5014 3762 -1978 -5543 -2923 3068 5332 1678
3228 1678 -3784 -5090 -665 4510 4511 -541 -4834 -3969 1396 5366 3130 -2633 -5254 -1901 3315 5075
3244 5075 1207 -4209 -4872 157 4862 3821 -1123 -4855 -3432 2177 5362 2406 -3192 -5102 -1418
3259 -1418 3948 4890 342 -4523 -4333 799 4948 3644 -1828 -5248 -2819 2925 5120 1550 -3623
3274 -3623 -4848 -812 4232 4466 -546 -4859 -3705 1543 5063 2957 -2484 -5018 -1979 3371 4918
3289 4918 922 -4011 -4576 56 4665 3961 -1082 -4953 -3213 2097 5016 2424 -2982 -4979 -1201
3304 -1201 3757 4596 318 -4374 -4195 736 4740 3402 -1693 -5073 -2762 2807 4995 1611 -3445
3319 -3445 -4711 -571 4170 4161 -469 -4706 -3672 1503 4813 2913 -2290 -4893 -2050 3230 4708 802
3335 802 -3870 -4455 -37 4434 3903 -1204 -4699 -3060 2039 4887 2196 -2928 -4737 -1203 3738 4467
3351 4467 276 -4231 -4075 695 4629 3404 -1776 -4789 -2394 2560 4732 1611 -3348 -4695 -539
3366 -539 4061 4110 -326 -4408 -3449 1405 4615 2733 -2208 -4730 -1957 3168 4555 936 -3756 -4148
3382 -4148 -1 4259 3664 -1220 -4601 -2995 2032 4636 2130 -2775 -4550 -1146 3549 4151 301
3397 301 -4071 -3939 822 4512 2995 -1800 -4675 -2472 2628 4540 1535 -3352 -4446 -522 3800
3412 3800 3944 -298 -4185 -3289 1333 4556 2594 -2256 -4570 -1815 3036 4251 909 -3634 -3950 75
3428 75 3990 3588 -908 -4316 -2933 1969 4472 2062 -2685 -4534 -1148 3622 4239 47 -4010 -3518
3444 -3518 753 4144 3038 -1595 -4481 -2317 2455 4337 1631 -3118 -4296 -583 3816 3820 -455 -4191
3460 -4191 -3249 1417 4434 2463 -2285 -4389 -1573 2809 4131 1028 -3457 -3974 -14 3936 3395 -996
3476 -996 -4381 -2708 2054 4444 1868 -2752 -4216 -1025 3272 4054 231 -3804 -3522 641 3991 3138
3492 3138 -1458 -4371 -2321 2504 4318 1337 -3013 -4015 -431 3643 3632 -679 -3978 -3115 1295 4127
3508 4127 2528 -2106 -4413 -1659 2820 4125 857 -3474 -3831 131 4063 3091 -1096 -4012 -2582
3523 -2582 1829 4266 1880 -2608 -4040 -1113 3056 3885 413 -3790 -3448 711 4118 2783 -1601
3538 -1601 -4222 -2044 2530 4138 1288 -2934 -3761 -594 3344 3648 -263 -4004 -3089 1196 4176 2604
3554 2604 -2076 -4346 -1468 2991 3932 554 -3330 -3750 76 3754 3234 -877 -3828 -2646 1523 4184
3570 4184 2006 -2609 -4111 -942 3204 3705 124 -3721 -3268 770 3914 2521 -1458 -3828 -2104
3585 -2104 1994 4153 1300 -2998 -3839 -531 3447 3592 -318 -4059 -2951 1391 3927 2075 -1984
3600 -1984 -3976 -1609 2658 3855 690 -3034 -3603 -116 3636 3211 -884 -4074 -2395 1898 3935
3615 3935 1778 -2520 -3806 -838 2972 3469 284 -3285 -3311 346 3846 2784 -1501 -3975 -2104 2184
3631 2184 4076 1233 -3118 -3766 -306 3270 3187 -240 -3619 -2968 1191 3855 2115 -1671 -3879 -1773
3647 -1773 2544 4018 745 -3251 -3463 133 3508 3039 -949 -3847 -2250 1651 3663 1844 -2044
3662 -2044 -3760 -1162 2942 3612 313 -3330 -3286 499 3847 2717 -1643 -3973 -1732 2147 3695 1261
3678 1261 -2637 -3667 -470 3055 3163 -179 -3445 -3043 1044 3991 2100 -2015 -3778 -1550 2401
3693 2401 3690 718 -3047 -3304 223 3146 2894 -627 -3572 -2514 1557 3801 1789 -2174 -3740
3708 -3740 -923 2916 3537 73 -3308 -2908 536 3316 2531 -1253 -3571 -1938 1907 3455 1356 -2484
3724 -2484 -3777 -548 3217 3089 -437 -3424 -2648 1066 3663 2174 -1786 -3479 -1330 2245 3385
3739 3385 731 -2818 -3322 76 3287 2930 -702 -3615 -2480 1662 3721 1546 -2229 -3456 -1031
3754 -1031 2569 3438 280 -3104 -2897 479 3250 2548 -1113 -3616 -2061 2046 3637 1047 -2575 -3348
3770 -3348 -413 2947 3013 -377 -3224 -2485 908 3438 2167 -1703 -3648 -1277 2328 3219 825 -2742
3786 -2742 -3339 48 3469 2620 -913 -3295 -2092 1312 3419 1760 -2094 -3453 -910 2604 3192 371
3802 371 -3006 -3021 472 3379 2325 -1272 -3370 -1896 1819 3331 1025 -2368 -3188 -536 2695 3117
3818 3117 -161 -3265 -2577 968 3384 2002 -1594 -3476 -1379 2291 3266 551 -2625 -2917 -27 2944
3834 2944 2676 -667 -3263 -2239 1303 3411 1639 -2066 -3300 -859 2523 3127 284 -2968 -2860 563
3850 563 3307 2249 -1051 -3222 -1719 1675 3433 1249 -2335 -3327 -537 2848 2828 -214 -3141 -2396
3866 -2396 1076 3249 1898 -1556 -3240 -1415 2128 3280 532 -2494 -2882 -81 3065 2631 -688
3881 -688 -3375 -2012 1464 3261 1551 -1918 -3251 -867 2491 2978 212 -2779 -2720 452 3114 2243
3897 2243 -1098 -3220 -1722 1728 3279 1055 -2372 -3115 -314 2649 2575 -203 -2909 -2557 792 3246
3913 3246 1814 -1593 -3340 -1443 1971 3286 629 -2716 -2922 -26 2915 2508 -658 -3120 -2198 1303
3929 1303 3073 1484 -1814 -3187 -1011 2343 3050 108 -2725 -2585 454 3056 2214 -1061 -3258 -1596
3945 -1596 1715 3014 980 -2152 -2968 -521 2584 2710 -164 -2960 -2447 874 3102 1944 -1507 -3260
3961 -3260 -1216 1943 2977 631 -2531 -2720 -11 2765 2372 -677 -3046 -1982 1227 3132 1440
3976 1440 -1782 -3174 -889 2403 2891 265 -2669 -2457 293 2860 2219 -973 -2989 -1692 1656 2998
3992 2998 1134 -2115 -2867 -423 2411 2671 -258 -2893 -2284 847 2944 1763 -1388 -2974 -1247 1880
4008 1880 2979 723 -2455 -2799 30 2735 2420 -699 -2918 -2011 1298 3016 1356 -1808 -2899 -828
4024 -828 2217 2670 215 -2482 -2520 296 2783 2169 -983 -3037 -1709 1645 2974 926 -2072 -2792
4040 -2792 -404 2486 2498 -296 -2705 -2066 828 2827 1862 -1387 -3093 -1294 1963 2778 652 -2334
4056 -2334 -2650 -35 2674 2264 -691 -2742 -1946 1074 2892 1442 -1627 -2909 -751 2107 2590 410
4072 410 -2559 -2485 333 2800 2014 -934 -2870 -1574 1529 2797 936 -1954 -2719 -460 2281 2486
4088 2486 -76 -2670 -2174 660 2796 1802 -1364 -2972 -1116 1832 2740 484 -2279 -2485 -97 2489
4104 2489 2315 -490 -2702 -1781 979 2780 1464 -1687 -2928 -818 2211 2623 137 -2479 -2413 505
4120 505 2633 1847 -852 -2625 -1433 1321 2939 966 -1960 -2657 -368 2217 2441 0 -2673 -2136
4136 -2136 935 2799 1495 -1279 -2634 -1247 1601 2675 646 -2079 -2378 -110 2492 2240 -584
4151 -584 -2789 -1758 1215 2618 1272 -1532 -2707 -665 2023 2521 91 -2116 -2194 195 2588 2104
4167 2104 -848 -2734 -1451 1429 2636 881 -1964 -2504 -274 2245 2186 -95 -2279 -1894 647 2609
4183 2609 1661 -1158 -2648 -1158 1642 2800 502 -2191 -2409 44 2341 1871 -562 -2608 -1694 956
4199 956 2437 1273 -1376 -2464 -986 1801 2550 249 -2184 -2247 350 2505 1889 -878 -2688 -1335
4215 -1335 1440 2381 819 -1626 -2348 -520 1984 2223 -31 -2258 -2174 549 2672 1582 -1285 -2591
4231 -2591 -941 1642 2483 670 -2003 -2238 75 2171 2004 -330 -2377 -1742 845 2659 1213 -1438
4247 -1438 -2590 -784 1948 2539 64 -2260 -2014 444 2310 1635 -729 -2462 -1376 1265 2500 931
4263 931 -1481 -2545 -620 2184 2247 -297 -2468 -1691 667 2304 1449 -1188 -2351 -983 1477 2222
4279 2222 697 -1645 -2404 -185 2329 1931 -420 -2427 -1670 934 2532 1029 -1506 -2251 -581 1600
4295 1600 2074 309 -2030 -1992 269 2286 1699 -648 -2492 -1466 1298 2664 862 -1809 -2276 -310
4311 -310 1933 2048 -150 -2120 -1722 606 2231 1483 -902 -2427 -1159 1461 2337 490 -1885 -2249
4327 -2249 -82 2316 1820 -615 -2199 -1348 771 2114 1190 -1253 -2434 -711 1667 2176 214 -2004
4343 -2004 -2058 244 2312 1535 -856 -2172 -1141 1267 2298 760 -1486 -2048 -402 1679 2144 135
4359 135 -2280 -1890 550 2275 1433 -1026 -2254 -968 1432 2230 284 -1726 -1958 -102 1830 1892 -407
4376 -407 -2246 -1465 736 2310 1284 -1355 -2480 -577 1727 1955 88 -1883 -1865 228 2217 1532
4392 1532 -853 -1951 -1150 865 2279 900 -1601 -2264 -324 1923 1925 -75 -2109 -1684 633 2221
4408 2221 1152 -1028 -2062 -1037 1139 2034 508 -1697 -2036 -127 1836 1785 -252 -2380 -1526 1117
4424 1117 2078 856 -1153 -2009 -709 1650 1989 254 -1836 -1681 194 1879 1742 -552 -2304 -1135
4440 -1135 1169 2204 797 -1505 -2080 -345 1947 1687 -230 -1880 -1648 423 2351 1300 -1013 -2194
4456 -2194 -897 1191 2228 624 -1780 -2077 6 1981 1529 -378 -2030 -1378 733 2014 992 -1109
4472 -1109 -1984 -791 1432 1939 136 -1868 -1787 184 1977 1561 -798 -2162 -1077 1142 1820 705
4488 705 -1278 -2044 -444 1719 1817 -132 -1909 -1669 448 2130 1353 -1012 -2116 -839 1354 2000 490
4505 490 -1556 -1832 9 1709 1662 -98 -1949 -1534 719 2251 1012 -1255 -2033 -635 1447 2002 178
4522 178 -1791 -1685 313 1698 1308 -613 -1887 -1213 941 2135 852 -1288 -1987 -364 1707 1864
4538 1864 -192 -1916 -1350 550 1870 1128 -963 -1968 -898 1235 1839 621 -1476 -1780 -152 1874
4554 1874 1702 -439 -1986 -1308 818 1979 957 -1229 -1790 -488 1373 1802 277 -1544 -1646 239
4570 239 1888 1397 -552 -2040 -1103 995 2050 627 -1417 -1859 -353 1638 1728 4 -1754 -1351 332
4587 332 1843 1242 -714 -2150 -829 1165 1820 394 -1441 -1813 -169 1692 1432 -371 -1868 -1141
4603 -1141 660 1750 998 -1060 -1863 -585 1321 1857 294 -1569 -1695 268 1886 1351 -712 -1729
4619 -1729 -1131 830 1925 885 -1338 -1813 -233 1380 1583 -48 -1626 -1600 535 1954 1195 -791
4635 -791 -1916 -840 1175 1860 491 -1487 -1724 -55 1654 1465 -252 -1783 -1286 682 1811 929
4651 929 -1098 -1906 -708 1347 1717 108 -1454 -1508 114 1714 1382 -553 -1900 -1071 891 1740 773
4668 773 -1193 -1618 -419 1335 1600 -89 -1671 -1472 517 1747 1116 -839 -1743 -861 1085 1772 415
4685 415 -1372 -1654 -66 1574 1467 -262 -1788 -1197 608 1818 955 -880 -1803 -573 1341 1642 238
4702 238 -1387 -1471 96 1660 1357 -504 -1837 -994 842 1660 706 -1183 -1718 -268 1457 1582 -63
4719 -63 -1632 -1377 297 1768 1046 -789 -1744 -816 975 1716 510 -1301 -1494 56 1425 1383 -299
4736 -299 -1601 -1150 719 1931 702 -1037 -1682 -620 1171 1733 236 -1527 -1522 265 1526 1163 -529
4753 -529 -1734 -984 898 1802 670 -1116 -1759 -420 1351 1381 -161 -1414 -1190 396 1595 1093 -862
4770 -862 -1677 -703 1115 1551 428 -1193 -1605 -78 1576 1382 -292 -1557 -1149 564 1641 805 -889
4787 -889 -1646 -545 1151 1569 202 -1456 -1347 274 1549 1224 -428 -1614 -964 784 1817 647
4803 647 -908 -1488 -384 1301 1545 -79 -1504 -1221 413 1522 989 -796 -1725 -744 947 1591 421
4820 421 -1166 -1616 -94 1516 1304 -301 -1537 -1081 547 1633 859 -984 -1621 -441 1111 1486 325
4837 325 -1265 -1536 228 1513 1210 -483 -1596 -954 839 1590 530 -1127 -1529 -247 1222 1346 -82
4854 -82 -1524 -1237 428 1529 1066 -642 -1610 -698 1000 1649 282 -1205 -1437 -95 1300 1317 -326
4871 -326 -1443 -1009 533 1530 846 -825 -1655 -551 1168 1459 171 -1328 -1432 237 1520 1165 -492
4888 -492 -1573 -760 791 1574 684 -992 -1403 -219 1136 1354 31 -1423 -1253 377 1636 871 -641
4905 -641 -1528 -793 956 1624 393 -1197 -1365 -149 1145 1323 -134 -1533 -1059 626 1496 881 -854
4922 -854 -1594 -195 1129 1418 182 -1294 -1262 112 1397 1068 -598 -1342 -847 596 1559 728 -1046
4939 -1046 -1624 -314 1316 1361 -98 -1420 -1238 379 1481 822 -660 -1501 -702 854 1416 348 -1168
4956 -1168 -1438 -87 1248 1347 -124 -1581 -986 699 1460 554 -640 -1264 -480 1106 1471 193 -1230
4973 -1230 -1245 146 1367 1082 -345 -1519 -855 850 1497 560 -1027 -1369 -180 1227 1183 -139 -1213
4990 -1213 -1173 295 1432 903 -628 -1617 -625 789 1454 487 -1214 -1371 61 1324 989 -299 -1279
5007 -1279 -925 462 1377 649 -773 -1401 -501 1048 1399 145 -1310 -1106 212 1280 1064 -491 -1453
5024 -1453 -722 836 1358 465 -698 -1332 -427 1103 1393 -104 -1293 -1019 382 1457 910 -711 -1558
5041 -1558 -476 833 1257 366 -1130 -1260 43 1238 1129 -196 -1315 -1041 453 1544 751 -954
5057 -954 -1382 -343 944 1263 232 -1247 -1245 225 1234 768 -438 -1393 -822 652 1498 589 -914 -1356
5075 -1356 -297 1049 1269 -137 -1152 -916 337 1284 920 -505 -1480 -664 914 1220 355 -930 -1214
5092 -1214 -53 1292 1220 -231 -1360 -844 485 1195 620 -748 -1315 -338 1046 1092 272 -1121 -1167 129
5110 129 1268 865 -527 -1238 -714 619 1340 345 -1032 -1225 -249 1068 1296 13 -1202 -1017 290
5127 290 1247 718 -551 -1391 -534 802 1357 349 -1085 -1112 -17 1188 1026 -289 -1303 -844 538
5144 538 1108 738 -653 -1401 -456 1008 1331 108 -1201 -1169 167 1282 946 -393 -1340 -681 611 1234
5162 1234 407 -800 -1181 -188 930 1119 24 -1249 -1106 352 1316 687 -571 -1157 -592 812 1396
5179 1396 203 -1000 -1101 -17 1046 1045 -165 -1271 -745 532 1279 603 -619 -1214 -413 940 1198
5196 1198 -25 -1034 -816 -57 1264 1041 -403 -1284 -615 615 1203 440 -818 -1338 -322 1009 1075
5213 1075 -103 -1181 -938 378 1302 714 -654 -1257 -539 715 1210 330 -986 -1066 9 1043 890
5230 890 -247 -1189 -901 449 1327 515 -673 -1128 -464 720 1258 206 -1001 -913 200 1202 875 -434
5248 -434 -1263 -749 664 1133 431 -784 -1109 -300 1071 1126 -58 -1171 -854 290 1117 883 -474 -1261
5266 -1261 -492 785 1085 278 -971 -1100 -43 1061 944 -134 -1102 -815 517 1217 475 -644 -1048
5283 -1048 -301 867 1199 77 -1068 -983 325 1171 796 -209 -1158 -715 595 1227 349 -801 -985 -184
5301 -184 933 1043 -67 -1136 -973 229 1072 806 -598 -1247 -394 754 1118 233 -803 -1044 -86 1076
5319 1076 995 -247 -995 -693 389 1154 712 -709 -1171 -334 919 1174 38 -1089 -1046 171 1095 812
5337 812 -284 -1166 -670 575 1141 472 -841 -1082 -257 865 918 4 -1022 -814 355 1174 567 -468
5355 -468 -1173 -512 682 1230 196 -925 -1000 61 1032 890 -226 -1213 -744 511 1087 632 -677 -1131
5373 -1131 -379 745 986 162 -829 -997 101 1109 801 -425 -1134 -571 527 1085 455 -712 -996 -149
5391 -149 861 1041 -6 -997 -844 135 1090 793 -401 -1028 -543 676 1060 293 -896 -923 -109 922
5409 922 860 -166 -935 -705 405 1078 579 -555 -1162 -324 832 998 45 -1021 -896 79 1019 716 -316
5428 -316 -1041 -448 450 1031 303 -840 -1121 -259 846 947 -10 -981 -890 319 1053 561 -451 -1033 -443
5447 -443 620 983 215 -904 -918 4 885 857 -127 -975 -753 378 1160 429 -655 -1066 -344 796 1012
5466 1012 77 -955 -828 181 1022 722 -370 -994 -537 593 958 360 -703 -1053 -192 1090 833 1
5484 1 -1005 -755 319 1037 752 -531 -1053 -468 538 1055 307 -747 -949 -2 896 846 -195 -985 -622
5503 -622 438 996 478 -546 -901 -252 594 1010 -23 -857 -845 204 1049 803 -227 -1025 -629 596
5521 596 980 281 -661 -1087 -61 624 811 15 -859 -822 132 948 659 -474 -950 -452 553 1035 333
5540 333 -805 -997 -31 866 728 -142 -850 -748 320 1063 557 -585 -927 -380 672 873 83 -796 -872
5559 -872 166 969 676 -395 -834 -563 524 946 301 -634 -890 -258 712 864 -131 -907 -727 237 932
5578 932 558 -283 -1004 -363 780 956 126 -699 -879 8 732 895 -153 -994 -597 270 1016 508 -592
5597 -592 -1069 -254 665 918 45 -688 -903 162 917 690 -329 -835 -474 323 1022 421 -671 -915 -140
5616 -140 706 790 -58 -903 -834 129 950 476 -361 -959 -394 597 899 202 -680 -931 -76 1022 812 -139
5636 -139 -1013 -542 398 903 413 -471 -917 -217 514 828 110 -729 -820 -38 938 733 -159 -841 -659 495
5656 495 1032 365 -641 -759 51 627 679 133 -827 -815 223 781 489 -365 -854 -522 517 929 228 -716
5676 -716 -856 9 651 603 -173 -859 -547 342 638 548 -406 -966 -399 613 800 173 -835 -669 -4 904
5696 904 701 -299 -996 -350 503 798 329 -404 -825 -141 706 721 75 -831 -744 43 1071 589 -366 -900
5716 -900 -353 617 785 166 -639 -787 -30 672 625 32 -737 -655 334 1005 463 -493 -742 -323 545 767 -52
5737 -52 -800 -582 118 630 560 -163 -925 -429 367 867 440 -602 -938 -168 774 729 -105 -808 -574 104 806
5758 806 452 -363 -834 -367 460 750 364 -594 -889 -30 939 668 -136 -893 -568 384 1006 247 -536 -660
5778 -660 -164 460 752 130 -642 -703 173 722 644 -226 -1009 -478 619 880 159 -603 -806 -249 759 736
5798 736 -133 -705 -557 86 674 566 -235 -950 -321 624 812 155 -624 -851 30 773 602 -233 -623 -476
5818 -476 220 688 439 -457 -828 -227 529 850 118 -763 -888 172 789 458 -233 -780 -500 392 823 213
5838 213 -587 -676 -235 460 794 95 -768 -671 184 808 460 -384 -827 -356 514 826 164 -497 -668 -106 706
5859 706 701 18 -610 -560 244 835 524 -493 -881 -156 643 727 0 -716 -661 63 756 552 -229 -670 -417
5880 -417 406 793 240 -624 -846 -133 720 701 -11 -740 -536 348 675 352 -232 -661 -379 502 769 189
5900 189 -569 -596 -125 667 779 -133 -805 -448 382 691 387 -462 -855 -225 499 731 105 -588 -665 -5 717
5921 717 632 -416 -857 -334 373 737 343 -659 -689 -32 662 568 -162 -541 -516 108 624 507 -260 -612 -311
5942 -311 409 896 131 -585 -559 -33 652 566 -26 -662 -455 308 761 344 -258 -849 -316 522 710 89 -716
5963 -716 -665 65 725 491 -188 -647 -445 283 714 179 -429 -688 -220 496 520 -14 -601 -559 161 780 450
5984 450 -383 -711 -241 479 718 250 -547 -573 -33 620 525 -46 -662 -489 270 768 349 -415 -780 -254 563
6005 563 746 -49 -605 -502 10 561 531 -233 -732 -428 363 673 254 -423 -713 -52 725 601 -12 -634
6025 -634 -543 318 587 512 -262 -693 -452 526 604 272 -549 -659 -5 634 507 -41 -579 -379 295 662 324
6046 324 -340 -695 -187 388 542 46 -605 -465 84 702 497 -185 -621 -481 441 759 105 -430 -527 -108
6066 -108 608 534 15 -547 -540 214 616 379 -297 -722 -321 444 723 135 -582 -709 -98 543 450 -79 -557
6087 -557 -513 344 673 225 -427 -719 -214 417 717 4 -564 -591 -46 621 490 -243 -646 -319 288 700 179
6108 179 -376 -659 -232 548 613 -112 -661 -487 199 622 328 -238 -646 -308 476 638 104 -485 -516 51 581
6129 581 429 -125 -556 -377 247 672 332 -340 -474 -237 617 620 -49 -515 -567 63 424 498 -230 -616 -373
6150 -373 217 651 125 -456 -732 22 566 533 -116 -542 -467 140 699 310 -323 -545 -348 397 542 203 -566
6171 -566 -625 -65 523 557 -163 -633 -377 257 621 225 -437 -605 -178 430 578 -13 -494 -495 17 518 423 -259
6193 -259 -639 -222 368 584 132 -364 -477 -8 569 524 -55 -604 -451 193 552 344 -282 -585 -237 317
6213 317 750 116 -451 -595 -31 554 382 -59 -574 -407 93 547 364 -292 -581 -201 432 547 64 -443
6233 -443 -501 82 510 453 -293 -528 -382 254 498 171 -479 -558 -88 451 548 -82 -558 -510 146 592 417 -204
6255 -204 -607 -319 315 554 96 -479 -550 56 541 448 -62 -618 -336 350 626 244 -336 -641 -223 522 630
6276 630 158 -460 -412 166 554 413 -154 -542 -290 283 530 222 -329 -497 -178 419 409 -26 -484 -339 79
6297 79 645 433 -265 -511 -256 336 537 196 -436 -518 -88 620 390 -139 -455 -299 208 475 209 -323 -447
6318 -447 -160 409 507 13 -428 -393 135 488 425 -172 -504 -224 399 633 141 -336 -441 -102 442 510 70
6339 70 -532 -285 115 428 464 -413 -593 -225 341 592 103 -392 -563 11 468 341 -28 -471 -278 108 580
6360 580 335 -321 -546 -84 215 542 79 -488 -432 73 526 447 -253 -430 -190 178 494 106 -250 -528 -137
6381 -137 401 605 -30 -597 -406 294 540 267 -241 -455 -230 293 486 158 -342 -422 0 412 403 -130 -531
6402 -531 -345 153 489 319 -340 -555 -124 359 472 38 -356 -481 19 541 438 -280 -454 -340 213 483
6422 483 228 -483 -573 -70 436 398 15 -503 -336 125 534 185 -245 -473 -209 260 554 93 -420 -552 40
6443 40 420 495 -137 -532 -348 285 424 315 -348 -465 -191 493 402 70 -451 -492 69 379 590 -409 -460 -250
6465 -250 216 563 99 -337 -550 -14 373 353 14 -413 -329 174 542 301 -398 -530 -142 85 580 95 -530
6486 -530 -336 -43 266 443 -129 -470 -364 144 415 362 -297 -445 -150 363 456 43 -486 -363 104 459 261
6507 261 -141 -424 -303 210 521 147 -263 -350 -87 328 398 71 -438 -511 39 571 163 -357 -336 31 165
6528 165 263 89 -165 -373 -133 393 427 -25 -504 -425 258 604 154 -423 -408 8 293 265 9 -412 -280 66
6550 66 187 246 -38 -344 -279 274 367 133 -249 -278 -256 409 368 -188 -382 -266 -20 419 202 -130 -464 -227
6572 -227 231 281 165 -239 -347 -48 444 203 -173 -289 -234 194 477 26 -316 -484 23 318 505 -54 -452
6593 -452 -509 9 427 208 -119 -302 -113 222 324 4 -355 -316 -100 379 532 -46 -463 -386 39 290 230
6614 230 -137 -428 -240 449 475 210 -362 -446 -161 294 258 -52 -394 -182 139 287 269 -261 -498 -232 276
6635 276 443 54 -459 -465 139 525 242 -166 -393 -64 321 345 177 -356 -417 -148 252 243 -15 -431 -382 218
6657 218 329 248 -161 -394 -78 268 443 120 -296 -409 6 308 427 -83 -526 -330 104 358 -59 -387
6677 -387 -474 -254 319 285 -108 -397 -334 -27 319 252 -210 -524 -260 79 368 187 -304 -466 -73 401 418 -40
6699 -40 -331 -245 243 464 160 -120 -357 -108 162 424 165 -270 -368 -1 389 302 -59 -487 -308 159 339
6720 339 294 -204 -501 -171 102 325 -14 -439 -473 -76 262 213 -197 -620 -244 36 345 34 -387 -527 -100
6741 -100 375 310 40 -260 -267 200 509 382 -153 -267 -76 250 485 130 -268 -199 -28 199 296 -177 -384 -396
6763 -396 -3 230 102 -200 -421 -95 311 285 28 -281 -298 142 424 313 -139 -359 -223 285 382 72 -294
6784 -294 -523 -130 290 293 -62 -382 -103 245 458 251 10 -361 -17 312 262 13 -324 -338 -85 255 378
6805 378 -119 -372 -72 322 475 202 -192 -269 -283 193 160 15 -377 -305 81 391 250 28 -161 -165 281 464
6827 464 75 -394 -430 -133 213 381 -118 -414 -298 129 366 224 -85 -579 -231 150 268 -41 -214 -400
6847 -400 -11 427 400 55 -381 -214 109 248 73 -166 -386 6 429 375 14 -357 -365 32 201 199 -124 -363
6869 -363 -45 349 399 111 -212 -393 -230 292 267 -50 -314 -88 151 383 213 -185 -428 -223 144 357 96
6890 96 -205 -347 170 237 272 -149 -366 -349 108 528 319 -210 -348 -148 259 200 44 -350 -286 149 427 271
6912 271 -133 -314 -358 -26 210 191 -197 -248 56 306 195 -67 -379 -385 58 362 358 -87 -354 -151 142 326
6934 326 30 -158 -233 124 385 328 -61 -442 -290 113 440 172 -102 -303 -111 68 208 -79 -256 -368 118
6955 118 444 228 -226 -400 -259 140 372 177 -192 -408 -53 231 288 -62 -230 -218 143 349 237 -75 -446
6976 -446 -171 182 433 55 -228 -419 -51 287 271 -16 -256 4 291 372 122 -290 -377 -116 349 375 12
6997 12 -264 -364 -62 228 260 73 -227 -119 143 330 45 -170 -225 8 343 217 -224 -424 -261 142 500
7018 500 306 -182 -327 -231 165 389 131 -195 -301 49 106 108 -31 -236 -273 178 203 101 -211 -442 -85 350
7040 350 468 101 -441 -286 -68 224 322 8 -213 -139 225 143 33 -201 -230 -31 213 169 -84 -337 -169 164
7062 164 487 186 -238 -421 -284 226 418 223 -272 -376 -120 182 241 92 -259 -318 30 305 184 -212 -222
7083 -222 -78 226 223 -88 -313 -278 148 391 311 -249 -359 -182 140 392 179 -243 -426 -178 259 385 49
7104 49 -250 -190 9 197 186 43 -278 -136 199 256 58 -295 -295 -6 297 167 -217 -302 -190 97 272 209 -170
7127 -170 -340 15 263 323 65 -310 -345 -105 262 243 18 -355 -213 39 366 92 -198 -295 5 198 113 26
7149 26 -262 -135 90 279 91 -184 -242 -131 201 277 22 -344 -318 65 446 329 -204 -330 -233 71 239 244
7171 244 -126 -309 -216 230 223 -1 -244 -374 -14 210 56 -110 -250 -180 56 175 76 -110 -198 20 84 154 -49
7194 -49 -428 -206 187 287 27 -315 -269 -2 309 305 66 -387 -232 -9 239 323 -204 -325 -278 141 373 164
7216 164 -33 -327 -145 156 234 49 -169 -197 20 235 395 67 -215 -237 71 203 149 -163 -302 -140 146
7237 146 190 -32 -141 -181 144 209 142 -46 -196 -85 192 249 6 -360 -251 52 297 207 -7 -341 -73 193
7259 193 367 312 -107 -322 -155 260 192 43 -237 -246 50 327 361 -147 -404 -176 49 290 115 -168 -356 -170
7281 -170 188 313 125 -121 -389 -103 249 224 -29 -238 -96 212 234 85 -209 -209 80 134 16 -31 -129 -247
7303 -247 -30 196 29 -165 -179 -25 133 152 58 -325 -130 105 286 121 -72 -216 -70 343 313 50 -181
7324 -181 -254 -86 202 239 -138 -372 -136 143 344 228 -142 -376 -106 193 395 157 -256 -245 -94 332 295
7345 295 21 -279 -321 -21 230 185 -162 -234 -179 124 267 -15 -212 -277 -108 155 249 35 -188 -166 60 253
7367 253 89 -57 -220 -59 35 205 -12 -238 -56 4 214 112 -43 -105 -150 79 236 112 -236 -167 2 299
7389 299 216 -62 -122 -123 56 140 108 -104 -157 83 286 127 10 -206 -226 107 212 155 -88 -272 -87 207 198 74
7413 74 -204 -250 -38 106 266 -4 -251 -167 84 371 242 -118 -379 -81 275 265 40 -211 -198 38 189 221
7435 221 -44 -256 -218 94 246 71 -71 -361 -205 179 350 8 -245 -185 -93 139 232 -48 -213 -243 78 250
7457 250 252 -52 -292 -61 61 241 -26 -233 -390 -22 252 159 -91 -275 -263 42 176 123 40 -228 -97 95
7479 95 208 85 -264 -129 -38 123 115 -14 -117 -221 177 108 -4 -90 -140 -38 182 91 71 -198 -117 11 195
7502 195 101 -62 -179 -36 23 123 18 -124 -93 38 59 91 13 -155 -94 -57 186 111 -122 -140 -4 226 167 -51
7526 -51 -201 -152 121 184 23 -182 -177 68 192 168 -1 -131 -117 157 218 90 -179 -298 -80 3 230 60 -235
7549 -235 -95 -14 235 105 32 -138 -85 54 195 148 -127 -307 -156 162 189 75 -198 -229 16 221 160 -8
7571 -8 -331 -131 110 307 45 -156 -317 -114 161 144 12 -178 -276 48 236 233 -63 -281 -134 127 277 239
7593 239 -181 -241 -163 75 250 27 -266 -288 173 217 230 -51 -232 -112 109 155 118 -137 -172 -27 219 242 -4
7616 -4 -305 -153 27 268 136 -208 -188 -166 56 263 148 -208 -218 -139 241 214 16 -170 -281 15 205 174 -32
7639 -32 -267 -158 73 230 57 -249 -193 14 88 155 -24 -163 -105 21 126 119 -35 -229 -121 172 216 115 -179
7662 -179 -267 -38 143 95 -105 -146 -207 120 313 38 -95 -225 -9 91 224 112 -102 -178 -22 96 75 -172
7684 -172 -20 -39 34 188 61 -55 -212 4 143 163 -18 -179 -78 44 175 190 -79 -177 -139 61 199 15
7706 15 -78 -137 85 208 26 -45 -165 -103 -25 16 75 -157 -116 -40 134 163 23 -3 36 -39 154 152 -51 -187 -91 86
7732 86 146 -35 -101 -108 -57 104 16 -84 -135 -76 16 87 -13 4 -172 -109 -5 40 39 -107 -250 35 117 83 -36 -147
7758 -147 -184 215 69 -16 -30 -106 -72 76 175 69 -94 -52 86 48 168 -67 -50 6 125 160 -44 -126 -163 -60
7782 -60 152 149 -4 -156 -54 73 90 -38 -56 -52 -7 141 35 -118 -59 -151 -19 120 74 -229 -176 -112 6 112
7806 112 9 -201 -227 96 91 267 -33 -186 -33 20 144 12 -137 -161 -33 111 72 -52 -153 -123 169 102 41
7829 41 -59 -206 -47 19 108 22 -116 -164 -52 88 85 -63 -186 -70 48 170 -31 -145 -115 1 32 204 -92
7852 -92 -147 -130 71 208 32 -76 -224 -27 51 162 50 -180 -99 -71 87 164 -42 -236 -202 177 179 64 -154
7875 -154 -285 -66 59 163 11 -129 -100 40 112 218 -136 -245 -87 -29 148 96 -33 -193 121 138 192 45
7897 45 -165 -246 -49 164 191 -117 -182 -111 18 75 46 -132 -325 32 98 200 -13 -161 -132 118 241 28 -88
7920 -88 -164 -147 83 147 54 -248 -207 4 92 249 -16 -206 -174 67 241 142 -18 -82 -130 194 104 66 -128 -214 -25
7945 -25 299 222 -130 -273 -71 66 206 57 -98 -214 -94 106 98 100 -256 -118 -2 293 49 -40 -153 -85 132
7968 132 182 57 -202 -204 -65 63 203 17 -238 -71 38 225 163 -97 -194 -164 148 310 89 -1 -154 -84 309
7991 309 204 -62 -162 -141 124 218 46 -108 -210 -138 91 101 56 -70 -196 16 253 203 -44 -169 -116 84
8013 84 249 128 -113 -152 -2 109 174 137 -125 -234 8 28 189 -113 -178 -74 38 165 46 -64 -224 -100
8035 -100 160 124 -26 -224 -205 164 261 148 -137 -201 -69 121 219 26 -188 -192 -63 204 58 -44 -173 -84 -26
8058 -26 201 110 -124 -179 -86 239 194 15 -202 -160 -1 202 243 -35 -199 -157 77 138 188 -158 -113 100 146 38
8082 38 -82 -158 -226 -13 170 77 -193 -179 -186 62 241 -35 -194 -99 -130 181 147 -43 -288 -157 52 197 221 -115
8106 -115 -127 -149 10 190 -14 -258 -151 -158 150 83 -85 -152 -235 192 193 19 26 -151 -69 62 230 -25 -70 -64 28
8131 28 248 70 -51 -281 -113 64 97 19 -82 -99 -8 114 146 -18 -81 -236 34 238 59 -126 -220 -46 198
8154 198 226 45 18 -226 -89 202 175 -118 -245 -161 -22 52 109 -114 -160 -25 91 271 65 -182 -201 73 126
8177 126 134 37 -231 -115 112 123 -34 -106 -89 -162 86 84 45 -173
8191a73
$$ Imaginary data points
##PAGE= N=2
##DATA TABLE= (X++(I..I)), XYDATA
0 0 0 0 0 7 -7 7 -14 20 -21 28 -35 42 -55 70 -84 97 -118 139 -164 197 -229 265 -308 356 -406 469 -534
27 -534 602 -685 775 -871 982 -1099 1225 -1373 1530 -1696 1885 -2095 2319 -2568 2845 -3145
43 -3145 3483 -3864 4284 -4760 5307 -5931 6655 -7516 8545 -9810 11416 -13510 16383
56 16383 -20593 27352 -39989 71692 -310288 -392551 439215 355080 68030 -152631 -353948
67 -353948 -254077 348720 452310 -36299 -350120 -248564 -36494 318326 397365 -75831
77 -75831 -484834 -242166 220768 424779 200418 -303074 -476617 9331 406749 234961
87 234961 -55585 -218387 -321778 -41195 437068 327263 -237543 -401361 -125033 167422
97 167422 351252 210922 -295791 -475432 11506 434779 256801 -132777 -296350 -197171
107 -197171 81508 319867 225750 -145429 -372663 -165620 253814 377465 58554 -306729
117 -306729 -321080 7592 345112 304164 -117207 -400176 -183335 212166 313106 95542
127 95542 -183658 -293077 -112539 217111 329289 56699 -309319 -321725 63014 367127
137 367127 215896 -154720 -313410 -156568 168362 351038 110048 -285764 -287533 36498
147 36498 230443 208921 36811 -254275 -308255 77180 379559 174998 -192533 -301071
157 -301071 -123678 193147 330504 52519 -294023 -252034 44145 238906 212155 -35451
167 -35451 -288441 -199870 130029 277455 136318 -128013 -303903 -134346 258184 321972
177 321972 -31886 -281608 -188710 49356 247082 212797 -100983 -305627 -119518 164984
187 164984 232192 98054 -146197 -287498 -79766 254701 258957 -37878 -258988 -205934 68589
198 68589 287980 160307 -161517 -258669 -70829 153049 229768 75643 -193199 -245476 2494
209 2494 232205 200481 -32596 -248748 -197097 113665 292536 105684 -177714 -236965 -58141
220 -58141 181721 234708 8211 -225469 -185504 35658 200753 177300 -49301 -258668 -158298
231 -158298 142329 254642 75934 -167137 -233643 -39823 218037 214099 -43823 -219766
241 -219766 -145472 61273 212638 146944 -101720 -237245 -91033 143168 218138 69599
251 69599 -177837 -240572 1032 239425 170578 -73408 -208956 -136525 79328 227276 107844
262 107844 -143428 -211297 -49275 144032 196369 41867 -187592 -205716 33485 226074
272 226074 150745 -81308 -219378 -113878 129090 220661 55189 -153219 -184262 -29878
282 -29878 162609 189964 -7658 -202965 -158681 56291 200821 133110 -89881 -228401 -95633
293 -95633 153218 206549 24697 -164957 -173828 189 179941 159297 -43085 -190865 -126320
304 -126320 74348 201477 106046 -118447 -206488 -53577 155620 188968 14209 -180712
314 -180712 -170312 39542 195523 123731 -72369 -184047 -105919 92139 197682 73098
324 73098 -138682 -187504 -29892 156251 174046 -7787 -189319 -147767 64561 191147 103732
335 103732 -89745 -185724 -75328 125068 181764 34522 -142472 -163698 -7892 167350
345 167350 158822 -38892 -190653 -119890 79750 186401 88669 -111651 -189049 -48204 142427
356 142427 163767 7902 -151681 -150675 17446 172481 130074 -62241 -179577 -96225 92206
367 92206 182426 66910 -129575 -173985 -17146 151865 149877 -13161 -162597 -131393 50924
378 50924 174340 100994 -80128 -173402 -77613 109994 175987 37451 -142394 -158005 -604
389 -604 154976 138516 -36775 -171781 -108474 73379 166043 77231 -94556 -165688 -50907
400 -50907 126810 159444 11096 -144666 -138334 20641 162053 122459 -60296 -171307 -84197
411 -84197 91673 162349 56882 -113211 -159718 -24383 137254 140877 -10627 -149119 -125169
422 -125169 39748 162466 98706 -77881 -163026 -65967 102304 156810 34879 -127541 -143642
433 -143642 2795 142316 123143 -29423 -150577 -104891 62542 161708 76336 -93420 -155227
444 -155227 -44332 114963 147442 14020 -136955 -132730 21527 147869 106146 -52157 -150841
455 -150841 -83655 75162 151716 57704 -104050 -148472 -23310 125856 131507 -7934 -137273
466 -137273 -114446 39007 150760 90654 -70773 -148607 -59916 93470 144034 34757 -114337
477 -114337 -135026 -4120 130698 119577 -26129 -144280 -99486 58163 146488 68651 -82555
488 -82555 -141916 -45723 103888 137351 11801 -124993 -116736 17698 129738 102285 -40370
499 -40370 -143140 -81144 76347 143787 48743 -95742 -133302 -23580 115664 125341 -8331
510 -8331 -129986 -103427 34945 133447 85397 -60166 -139921 -60944 85014 133379 33454
521 33454 -104932 -127661 -4584 123339 108849 -27066 -129741 -87766 51819 134362 65482
532 65482 -76099 -129973 -39448 94548 126136 16707 -115011 -114976 17400 126591 92911
543 92911 -40855 -130414 -76232 67547 133957 44959 -90823 -121150 -21520 100106 113712
554 113712 -1341 -118382 -100721 30623 126262 80708 -56670 -131344 -54342 83609 122290
565 122290 27344 -93555 -115190 -7638 116457 104547 -29712 -119729 -74707 40918 117066
576 117066 73266 -64929 -136922 -39929 101163 113109 4175 -98474 -101159 4626 116026
587 116026 94270 -42641 -124059 -61646 60547 114698 47741 -76168 -117890 -23824 97622
598 97622 109691 -811 -114114 -96883 36479 122523 64285 -54262 -107923 -54862 62158
609 62158 123262 36347 -101216 -109421 6878 96814 84567 -6741 -105856 -96581 41526 134155
621 134155 53526 -80707 -105003 -24383 70523 102627 24648 -96376 -106492 15518 112963
632 112963 76794 -35418 -106439 -66070 51082 116447 47997 -76595 -113642 -21267 96783
643 96783 101630 -12187 -103309 -73976 23604 93298 75641 -32979 -122546 -60557 82385 110769
655 110769 10644 -76277 -86361 -21500 88822 111487 -20147 -126749 -60955 57685 89261
666 89261 45838 -38018 -105384 -52630 80785 113001 6335 -93511 -86197 6577 96822 82557
678 82557 -31725 -107938 -59141 49577 104641 45715 -73544 -106160 -9251 83559 76212 5502
690 5502 -75598 -96005 8152 122134 72268 -65626 -98872 -28348 48186 91165 46619 -77433
702 -77433 -113144 4514 102051 67106 -20000 -78280 -72193 19235 106031 63276 -59418 -105145
714 -105145 -31624 71494 95925 11696 -86720 -82187 11233 85500 71914 -20069 -100527 -62800
726 -62800 54864 98191 28552 -55568 -83775 -34016 70022 105610 1761 -105086 -72434
737 -72434 34664 86044 52939 -29647 -92650 -54006 57388 99970 21370 -73341 -81334 -7632
749 -7632 74031 80568 -5585 -92307 -72483 34544 99861 47517 -55651 -90631 -26148 62843
761 62843 83717 14825 -72565 -81319 3239 86569 70785 -25520 -90552 -53648 40479 90788
773 90788 42012 -57891 -95396 -18763 79431 78873 -8726 -76616 -62851 12095 80586 64158
785 64158 -33295 -94289 -41393 54269 84428 26220 -61557 -86783 -9557 82938 75070 -18120
797 -18120 -83581 -56350 29541 84503 46139 -45119 -84187 -29776 55278 82168 18387 -71803
809 -71803 -80746 6697 83207 62170 -24480 -83241 -51878 40573 87423 31359 -56611 -76633
821 -76633 -16510 60075 75327 5532 -75333 -69214 16757 81700 55980 -32044 -86577 -41436
833 -41436 53304 83554 18375 -61562 -72435 -6290 68248 67823 -10316 -75984 -56227 23591
845 23591 79029 47899 -41273 -84815 -29050 58101 77343 11210 -67629 -71095 8060 76266
857 76266 55097 -23338 -72311 -46349 30730 80089 37496 -51870 -78665 -15782 60604 71136
869 71136 3945 -72109 -66052 19082 78739 46040 -32813 -73657 -36454 42354 75532 22116
881 22116 -55335 -69985 -9182 63605 68369 -7994 -77389 -54141 29575 74963 39029 -38286
893 -38286 -76218 -27243 55276 71377 6851 -59380 -60863 706 65622 60349 -17457 -76764
905 -76764 -45516 35980 74596 30664 -47488 -73199 -15489 59570 65163 -1574 -64357 -56527
917 -56527 13430 69498 47480 -28097 -71614 -35840 40334 73325 22922 -55348 -69252 -3547
929 -3547 63671 58606 -10391 -67288 -49352 24000 70146 37521 -36385 -69537 -25557 47199
941 47199 67668 12103 -57973 -63160 3638 66785 53458 -20500 -69928 -40013 33304 68481
953 68481 27925 -43775 -66808 -14699 53736 61584 1142 -60417 -55587 12154 67750 46030
965 46030 -28643 -69325 -31613 40092 66876 19115 -50664 -62976 -4080 57972 54522 -8320
977 -8320 -62398 -47733 21241 67018 36899 -35456 -67364 -23312 46774 64026 9047 -55621
989 -55621 -57191 5297 61022 48428 -17538 -64018 -38856 30206 65176 27064 -40691 -63330
1001 -63330 -15361 50991 60318 291 -59696 -51182 14257 62326 40858 -25787 -63785 -30448
1013 -30448 37412 62798 17712 -46886 -58869 -5128 54232 53370 -7566 -60642 -45129 21970
1025 21970 63679 33158 -33957 -61973 -21032 42783 59077 9481 -51198 -54271 3958 57246
1037 57246 46170 -16195 -60626 -37496 28481 62422 25399 -39968 -59818 -12503 48158 54573
1049 54573 -181 -54347 -47447 12130 58051 39421 -23651 -60525 -28947 35158 59437 17151
1061 17151 -44105 -56058 -4801 52260 49815 -8662 -56395 -40803 19836 58202 31776 -30588
1073 -30588 -58967 -20504 40625 55761 8736 -48077 -51096 3552 54322 43691 -16075 -57226
1085 -57226 -34149 27112 57563 23508 -36448 -55562 -12825 44618 52199 645 -51615 -45179
1097 -45179 11696 54808 36680 -22381 -56880 -27289 33610 55804 14975 -41529 -51263 -4746
1109 -4746 47743 47099 -7222 -53381 -38725 18684 54729 29990 -28920 -55613 -19187 38648
1121 38648 52116 7813 -44887 -47847 3122 51047 40801 -15306 -53028 -31821 24368 54182
1133 54182 23375 -34789 -53243 -10995 42437 47741 394 -47652 -42938 10843 52238 34030
1145 34030 -21664 -52507 -25230 30352 52466 15112 -39489 -48781 -3646 44967 43666 -6562
1157 -6562 -50077 -36827 18162 51984 27295 -27321 -51378 -17881 35709 48863 7512 -42059
1169 -42059 -44995 2865 48224 38366 -15022 -49814 -29115 22744 50377 22270 -32857 -50587
1181 -50587 -9364 40913 43670 -424 -43348 -39972 9091 49615 32750 -21572 -49541 -22648
1193 -22648 28569 48993 14074 -37423 -45404 -2684 41707 40847 -5576 -47937 -34984 19241
1205 19241 48544 22739 -24243 -45827 -19695 32546 50019 5759 -43959 -39204 5985 41081
1217 41081 35336 -9595 -48990 -30812 25585 49159 15811 -30658 -43230 -10864 35755 43810
1229 43810 487 -43418 -37084 9902 45911 30794 -20402 -47625 -19790 27751 43532 14147
1241 14147 -32761 -45927 -3547 44105 36890 -10522 -40681 -28983 11267 44648 29342 -25373
1253 -25373 -50307 -12899 35564 39658 4059 -33729 -38989 -327 43559 36222 -15318 -45983
1265 -45983 -23119 21912 41621 18367 -26077 -44271 -11619 36513 41959 -1505 -41823 -33800
1277 -33800 11253 42132 26469 -17052 -42339 -21989 24613 45430 12452 -35795 -39556 619
1289 619 35206 32912 -1630 -39755 -36044 15831 49612 19182 -28703 -37336 -11186 23654 40417
1302 40417 11472 -38280 -40671 7795 40620 26713 -10502 -38203 -27753 18343 45539 17128
1314 17128 -29788 -40420 -7597 33454 37947 -2238 -38342 -29156 8418 36038 29205 -13467
1326 -13467 -46457 -20524 30438 38698 6080 -25850 -35756 -9389 37121 40501 -10991 -43873
1338 -43873 -20991 16205 33474 22212 -16417 -43314 -16226 31793 38429 2931 -32060 -34144
1350 -34144 1533 38394 30407 -12959 -39075 -22452 17991 40956 16475 -28624 -37585 -4054
1362 -4054 28627 31927 4033 -33698 -35913 8759 42678 22729 -19314 -35987 -16996 20315
1374 20315 39425 12189 -31712 -36421 749 33379 28986 -5081 -34516 -26837 11698 38306
1386 38306 21716 -20613 -39896 -12628 28785 35533 3251 -30954 -31754 2265 35488 28197 -12116
1399 -12116 -37202 -19767 17310 35544 15815 -22901 -37074 -8378 30090 34205 -202 -34771
1411 -34771 -29533 10012 36689 20999 -15603 -34704 -17406 20672 37125 9334 -28438 -31704
1423 -31704 -1664 29040 30848 -2600 -36822 -26939 15602 36795 16233 -19166 -34664 -12587
1435 -12587 26099 34256 2338 -29250 -28019 1127 31172 28516 -9466 -37011 -20160 17911
1447 17911 34338 14649 -22268 -36289 -6589 30676 29852 -2930 -29520 -25771 5816 33638
1459 33638 22686 -15143 -33750 -15438 18500 34399 11777 -27698 -34116 463 31200 25950
1471 25950 -5213 -31707 -24265 12829 34922 15425 -18637 -30678 -11966 21272 33710 5845
1483 5845 -29880 -29307 3577 31065 25328 -9596 -35247 -18402 18902 31600 10750 -19568 -31060
1496 -31060 -8262 27024 30155 -2104 -28961 -24268 4760 31574 24222 -14797 -36255 -12848
1508 -12848 22131 29936 7526 -23372 -30500 -1414 29488 24934 -5486 -28287 -22525 9055 33642
1521 33642 18053 -19200 -31977 -9579 21768 30995 4998 -29157 -27863 6158 29412 19822
1533 19822 -7838 -29167 -20053 14676 33137 11771 -21062 -29210 -7182 24108 30293 -295
1545 -295 -31028 -23711 9124 29651 18823 -12641 -31427 -13447 19577 28791 7325 -20931 -28623
1558 -28623 -4108 28053 26974 -6191 -29870 -20029 10344 30722 17005 -18325 -31448 -7516
1570 -7516 21891 26429 4258 -23980 -26872 2124 28878 21629 -8466 -28774 -18625 13871 32239
1583 32239 11859 -21916 -28360 -4346 23059 26340 43 -27887 -22827 8158 27647 17438
1595 17438 -10506 -29304 -15629 18268 30574 6647 -22714 -26411 -2311 25890 25482 -5810
1607 -5810 -29369 -17892 11192 27072 15066 -14367 -29452 -9876 21118 26915 3655 -22990
1619 -22990 -25666 1226 28403 21821 -10006 -28627 -15269 13693 28164 11285 -19451 -27354
1631 -27354 -4200 21880 24077 893 -25005 -23606 6318 28742 17428 -12089 -27791 -13418
1643 -13418 17048 28806 6543 -22252 -24503 -669 22980 22582 -3426 -26613 -19040 9940 27044
1656 27044 14581 -14094 -28476 -9945 20709 26537 2156 -23146 -22837 1990 25575 20320 -8743
1669 -8743 -26799 -14351 12192 25790 12062 -16881 -27529 -5380 22474 23831 -329 -23898
1681 -23898 -21667 5979 27262 16310 -12358 -25579 -11497 14755 25912 7800 -20268 -24667
1693 -24667 -1353 22403 21721 -3100 -25747 -19274 10188 26980 12554 -14457 -25199 -8846
1705 -8846 18121 25195 2963 -21815 -21265 1757 23030 20010 -6427 -26401 -15372 13175 25772
1718 25772 10005 -16519 -25038 -5081 21070 22686 -1157 -22687 -19400 4759 24445 16518 -10508
1731 -10508 -25500 -11617 14638 25014 7463 -19134 -24081 -1048 22532 20185 -3926 -23337
1743 -23337 -17114 8586 25070 12971 -13361 -24142 -8427 16786 23826 3820 -21071 -21579 2212
1756 2212 22878 18105 -6885 -24567 -14399 12245 24233 9191 -15439 -23306 -5424 18971
1768 18971 22057 -110 -21832 -19124 4797 23341 15919 -9940 -24427 -10941 14535 23338 6467
1781 6467 -17555 -22263 -1443 20943 19307 -3519 -21938 -16593 7597 23928 12851 -13245 -23679
1794 -23679 -7723 16198 22147 3362 -19843 -20381 1966 21739 17250 -6357 -22836 -13860 11140
1807 11140 23213 9056 -14431 -22177 -5537 18323 21659 -382 -21568 -17310 5355 21364
1819 21364 14703 -8709 -23469 -11028 14297 22383 5364 -16646 -20567 -2287 19412 19410 -3142
1832 -3142 -21887 -15730 7776 22538 12095 -12419 -22423 -7038 15291 20715 3976 -18091
1844 -18091 -20378 1687 21644 15761 -6738 -20622 -12906 8906 22768 10282 -15437 -22425 -3078
1857 -3078 17603 18269 184 -18545 -18221 3744 22085 14315 -9497 -21641 -9922 12433 21367
1870 21367 6440 -15850 -20266 -1719 18779 18421 -3092 -21223 -14636 8049 20499 10745 -10177
1883 -10177 -20894 -8900 14944 21831 2248 -18872 -17167 1858 18046 16136 -4031 -21954
1895 -21954 -13964 11277 21849 6945 -13412 -18840 -5152 15188 19980 979 -19785 -16887 5135
1908 5135 20259 12894 -8236 -20380 -10139 11822 20652 6111 -15471 -19715 -1365 18636 16618
1921 16618 -3682 -18567 -13860 5298 20045 12775 -11286 -22189 -5970 15314 17686 2563
1933 2563 -14866 -18050 -414 20045 16221 -7086 -19993 -10118 8887 18688 9463 -11777 -20737
1946 -20737 -4722 16782 18003 -564 -17851 -15549 4002 19227 12772 -7970 -19624 -9875 11340
1959 11340 20162 5538 -15489 -17785 -762 15770 15981 -889 -18845 -15534 7498 20897 9081
1972 9081 -10913 -17551 -6779 11816 19317 3955 -17151 -17138 2387 17629 13546 -4424 -18426
1985 -18426 -12441 8570 19923 8025 -12611 -18675 -3999 15138 16994 116 -16716 -14730 3233
1998 3233 17904 13036 -7206 -19543 -8903 11401 18073 5349 -12892 -17704 -2380 16661 16459
2011 16459 -3185 -18047 -12070 6167 17662 10269 -9041 -18906 -7012 12905 17842 2719 -15236
2024 -15236 -16154 738 16907 14037 -4530 -18207 -11143 8591 18237 7416 -11412 -17239 -4016
2037 -4016 13700 16448 798 -16035 -14746 3352 17749 11974 -7183 -18238 -8668 10518 17743
2050 17743 5232 -13168 -16765 -1669 15395 14678 -2313 -16338 -12682 5074 17595 10325 -9131
2063 -9131 -18108 -6376 12201 16825 2822 -14237 -15390 1170 16175 12802 -4489 -16639 -10582
2076 -10582 7468 17502 7577 -10890 -16891 -4032 13249 16071 676 -15868 -14079 3613 16771
2089 16771 10847 -6780 -16840 -8226 9466 16647 5325 -12153 -16055 -1824 14666 14457 -2025
2102 -2025 -16065 -11919 5329 16860 9640 -8911 -17027 -5471 11618 15375 2546 -13121 -14632
2115 -14632 361 15267 12837 -4050 -16305 -10349 7299 16955 7231 -10750 -16140 -3516 12548
2128 12548 14839 483 -14817 -13075 3631 15230 10237 -5345 -15647 -8868 9198 17114 4750
2141 4750 -12462 -14644 -1264 13357 13879 -1825 -15821 -11328 5696 15351 8289 -7544 -15872
2154 -15872 -6402 10825 15404 2552 -12672 -14179 108 15053 12610 -4688 -15751 -8676 7119
2167 7119 15103 7040 -9450 -15543 -3215 12250 13604 558 -13063 -12960 2002 15567 10816
2180 10816 -6658 -15743 -7272 8759 15269 4673 -11567 -14260 -1084 12750 12455 -1231 -14117
2193 -14117 -11291 4765 15213 8412 -7347 -15199 -6219 10383 15159 2138 -12850 -12664 1072
2206 1072 13398 11326 -3500 -14748 -9065 6580 14599 6649 -8744 -15020 -4057 11780 13886
2219 13886 82 -13378 -11943 2645 14603 9778 -6048 -14500 -6762 7888 14089 5016 -10319
2232 -10319 -14022 -1501 12443 12353 -1187 -13654 -10954 4774 15097 7695 -7931 -13981 -5001
2245 -5001 9362 13839 2421 -11852 -12492 601 12512 10983 -2814 -14358 -9565 6545 14590
2258 14590 5970 -8834 -13799 -3459 11132 13104 -146 -12296 -10564 2281 12948 9912 -4905
2271 -4905 -14389 -6996 8045 13735 4542 -9775 -13764 -1556 12592 11604 -2168 -12726 -9512 3935
2285 3935 13611 7881 -7005 -13617 -5021 8583 13081 3052 -11227 -12604 625 12822 10275
2298 10275 -3330 -13239 -8496 6263 13838 5417 -8520 -12481 -3360 9676 12589 818 -12183
2311 -12183 -11073 2300 12744 9199 -4712 -13799 -6964 7961 13104 3677 -9414 -12202 -1587
2324 -1587 11061 11204 -1383 -12158 -9235 3555 12940 7964 -6407 -13579 -4862 8988 12428 2384
2338 2384 -10401 -11572 649 12200 9591 -3329 -12029 -7966 5073 12958 6020 -7938 -12706
2351 -12706 -3250 9448 11909 859 -11683 -10560 2656 12223 8173 -4468 -12347 -6590 6905
2364 6905 12455 3816 -8813 -11634 -1784 10378 11192 -1039 -12176 -9073 4031 12270 7128 -6075
2378 -6075 -12745 -4695 8605 11517 1944 -9457 -10805 -274 11305 9668 -2928 -11971 -7649 4957
2392 4957 12337 5822 -7688 -12278 -2611 9506 10750 541 -10386 -9944 1917 11744 7905 -4381
2406 -4381 -11682 -6320 6284 12240 4008 -8965 -11485 -1238 9960 10117 -1120 -11366 -8522 3812
2420 3812 11363 6373 -5441 -11559 -4989 7698 11488 1998 -9382 -10150 121 10610 9354 -2858
2434 -2858 -11786 -6974 5326 11353 5052 -7033 -11316 -2901 8646 10347 793 -9912 -9724 1534
2448 1534 11225 7740 -4377 -11162 -5785 6029 11456 3862 -8357 -10730 -836 9294 9255 -669
2462 -669 -10195 -8503 3225 11338 6481 -5394 -11072 -4373 7463 11045 1955 -9014 -9733 188
2476 188 9831 8896 -2534 -11066 -6688 4993 10583 4868 -5897 -10910 -3510 8711 10477 7
2490 7 -9715 -8311 1691 10065 7648 -3794 -11130 -5322 6183 10477 3452 -7387 -10240 -1535 9149
2505 9149 9328 -849 -9921 -7956 2965 10941 6058 -5631 -10357 -3807 6497 10017 2538 -8549
2519 -8549 -9785 530 10025 7633 -2342 -9685 -6813 4032 10940 5032 -6855 -10496 -2069 7940
2533 7940 9213 636 -8895 -8655 1505 10045 7178 -3854 -10332 -5348 5570 10079 3350 -7063
2547 -7063 -9753 -1383 8663 8961 -1060 -9717 -7337 3176 9867 5689 -4549 -10179 -4310 6795
2561 6795 10184 1769 -8374 -8680 399 8736 7869 -1797 -10109 -6767 4672 10118 3982 -5960 -9337
2576 -9337 -2857 7034 9478 685 -8947 -8197 1900 9293 6483 -3358 -9752 -5174 5383 9714 3099
2591 3099 -6813 -9334 -1264 8425 8340 -1133 -8967 -6904 2536 9545 6072 -4821 -10146 -3570 6590
2606 6590 8897 1873 -7170 -8892 -225 9103 7659 -2564 -9253 -5815 3818 9367 4700 -5570
2620 -5570 -9507 -2484 7277 8660 624 -8240 -7915 1557 8995 6338 -3264 -9151 -5086 5046 9588
2635 9588 3217 -6832 -8739 -1035 7596 8002 -413 -8663 -7006 2835 9222 5201 -4374 -9017 -3692
2650 -3692 5774 8926 1757 -7193 -8217 179 8219 7185 -1963 -8942 -5800 3782 9080 4337 -5379
2665 -5379 -9047 -2405 6900 8480 425 -7797 -7453 1090 8596 6323 -3231 -8923 -4646 4815 8878
2680 8878 3087 -6376 -8446 -1145 7437 7581 -686 -8124 -6577 2636 8843 5077 -4123 -8673 -3466
2695 -3466 5641 8578 1719 -7045 -7866 35 7814 6838 -1822 -8444 -5572 3560 8525 3968 -5061
2710 -5061 -8541 -2280 6485 7859 521 -7348 -7026 1181 8174 6027 -3084 -8573 -4480 4606 8292
2725 8292 2866 -5907 -8019 -1204 6967 7374 -635 -7874 -6235 2458 8285 4783 -3890 -8272 -3521
2740 -3521 5374 8351 1627 -6705 -7460 153 7293 6410 -1670 -8140 -5418 3555 8265 3700 -4819
2755 -4819 -8046 -2308 6125 7812 524 -7076 -6649 1199 7697 5745 -2837 -8076 -4019 4401 7834
2770 7834 2738 -5544 -7774 -1192 6904 6781 -770 -7326 -5849 2001 7973 4839 -3980 -8124 -3052
2785 -3052 5078 7590 1696 -6238 -7171 81 7149 6190 -1621 -7578 -5194 3359 8223 3499 -4717
2800 -4717 -7555 -2005 5717 7217 448 -6950 -6359 1300 7330 5179 -2579 -7645 -4095 4319 7734
2815 7734 2479 -5508 -7253 -1097 6554 6751 -906 -7196 -5538 2208 7534 4509 -3589 -7641 -2768
2830 -2768 4969 7183 1498 -5977 -6956 59 6915 5993 -1788 -7314 -4846 3090 7583 3461 -4728
2845 -4728 -7337 -1773 5383 6916 572 -6549 -6220 1233 7159 4921 -2664 -7378 -4047 4101 7622
2860 7622 2395 -5425 -6805 -864 6008 6366 -566 -7069 -5216 2151 7118 4356 -3483 -7456 -3038
2875 -3038 4939 7120 1353 -5712 -6393 61 6694 5778 -1892 -7119 -4197 3069 7040 3487 -4186
2890 -4186 -7327 -1891 5533 6547 485 -6370 -5983 1078 6997 4796 -2745 -7138 -3605 3878 7056
2905 7056 2334 -5081 -6742 -853 5801 6095 -410 -6772 -5353 2265 7178 3882 -3490 -6928 -2706
2920 -2706 4692 6778 1302 -5688 -6116 111 6251 5510 -1541 -6946 -4390 2950 6841 3256 -4202
2935 -4202 -7106 -1848 5378 6163 243 -5845 -5654 957 6710 4632 -2693 -6752 -3457 3491 6831
2950 6831 2541 -4996 -6715 -659 5946 5793 -716 -6285 -5121 2031 6856 3855 -3232 -6511 -2784
2965 -2784 4228 6655 1416 -5541 -5895 164 5982 5211 -1407 -6796 -4305 3070 6603 2847 -3808
2980 -3808 -6434 -1799 5008 6351 254 -5767 -5382 860 6230 4781 -2371 -6938 -3341 3663 6412
2995 6412 2162 -4472 -6326 -824 5630 5542 -735 -5913 -4743 1803 6504 3804 -3354 -6579 -2520
3010 -2520 4240 6215 1307 -5323 -5807 386 5756 4894 -1329 -6053 -4315 2655 6465 2890 -3847
3025 -3847 -6066 -1785 4601 6038 385 -5831 -5203 1161 6015 4260 -2202 -6394 -3182 3529 6133
3040 6133 1922 -4459 -5909 -755 5279 5526 -628 -5890 -4482 1733 6255 3730 -3078 -6347 -2230
3055 -2230 4097 5827 1185 -4870 -5667 206 5671 4676 -1580 -5802 -3895 2555 6228 2808 -3891
3070 -3891 -6104 -1476 4525 5568 312 -5548 -4992 1113 5767 4107 -2083 -6056 -3129 3327 5910
3085 5910 1801 -4269 -5609 -797 4976 5249 -709 -5777 -4187 1895 5720 3329 -2783 -6034 -2349
3100 -2349 4000 5596 1069 -4685 -5270 58 5442 4575 -1527 -5768 -3734 2427 5956 2629 -3761
3115 -3761 -5780 -1142 4366 5103 373 -5075 -4893 1018 5771 3814 -2289 -5611 -2986 3021 5852
3130 5852 1913 -4345 -5544 -443 4897 4757 -576 -5418 -4206 1817 5729 3300 -2746 -5771 -2287
3145 -2287 3909 5696 889 -4643 -4845 157 5091 4575 -1380 -5812 -3435 2686 5428 2377 -3139
3160 -3139 -5494 -1543 4451 5362 48 -5223 -4484 1006 5271 3858 -1949 -5695 -2781 3170 5539
3175 5539 1633 -4046 -5223 -544 4659 4724 -480 -5264 -4118 1808 5630 3013 -2812 -5485 -1945
3190 -1945 3685 5229 1038 -4565 -4876 251 5130 4191 -1437 -5368 -3312 2244 5436 2447 -3435
3205 -3435 -5461 -1248 4383 4920 -19 -4660 -4408 903 5237 3755 -2106 -5419 -2598 3063 5378
3220 5378 1690 -3866 -5108 -509 4624 4442 -725 -5050 -3835 1766 5366 2909 -2754 -5149 -2028
3235 -2028 3445 5251 899 -4496 -4674 376 4728 3956 -1229 -5232 -3355 2453 5402 2209 -3294
3250 -3294 -5136 -1197 4029 4786 211 -4763 -4151 954 5103 3405 -1963 -5188 -2482 3053 5093
3265 5093 1621 -3826 -4925 -398 4441 4298 -725 -4865 -3589 1568 5088 2951 -2606 -5238 -1773
3280 -1773 3592 4833 949 -4166 -4530 278 4608 3874 -1315 -4979 -3073 2311 4957 2118 -3212
3295 -3212 -4998 -1174 3893 4554 113 -4520 -4039 950 4848 3264 -1920 -4910 -2464 2864 5015
3310 5015 1471 -3650 -4601 -621 4184 4147 -640 -4721 -3620 1588 4936 2676 -2522 -5117 -1786 3393
3326 3393 4665 789 -4011 -4399 214 4452 3679 -1315 -4884 -2968 2149 4846 2133 -3030 -4865
3341 -4865 -1071 3749 4323 129 -4329 -3824 954 4752 3206 -1995 -4739 -2439 2697 4803 1417
3356 1417 -3560 -4499 -416 4167 3934 -570 -4482 -3530 1479 4804 2626 -2489 -4733 -1681 3235 4506
3372 4506 705 -3812 -4282 257 4403 3686 -1216 -4649 -2771 2125 4642 1943 -2915 -4538 -1130
3387 -1130 3558 4208 10 -4204 -3600 776 4454 3063 -1783 -4805 -2311 2812 4584 1290 -3483
3402 -3483 -4325 -300 3976 3841 -586 -4373 -3234 1577 4481 2576 -2312 -4555 -1706 3070 4458
3417 4458 706 -3793 -3900 207 4179 3423 -1221 -4421 -2592 2158 4404 1891 -2788 -4394 -1062
3432 -1062 3500 4060 16 -4044 -3634 761 4435 2997 -1845 -4439 -2114 2656 4242 1310 -3361
3447 -3361 -4184 -345 3739 3719 -509 -4225 -3288 1503 4547 2434 -2382 -4384 -1618 3039 4167 557
3463 557 -3738 -3716 305 4074 3164 -1021 -4410 -2681 2056 4426 1878 -2887 -4239 -1116 3517 3995
3479 3995 -2 -4092 -3407 911 4221 2840 -1697 -4315 -1959 2427 4107 1302 -3029 -4172 -455
3494 -455 3890 3673 -632 -4211 -2930 1548 4277 2222 -2412 -4267 -1459 2943 3901 743 -3442 -3891
3510 -3891 178 3955 3285 -1110 -4313 -2686 2108 4359 1643 -2819 -4058 -824 3198 3698 73
3525 73 -3732 -3402 695 4085 2795 -1515 -4293 -2237 2621 4250 1061 -3200 -3904 -201 3693 3300
3541 3300 -739 -3744 -2837 1182 4037 2378 -2065 -4283 -1363 2889 4055 744 -3578 -3770 352
3556 352 3999 2989 -1316 -3898 -2381 1823 4052 1702 -2677 -3922 -916 2977 3783 184 -3817
3571 -3817 -3359 899 4025 2689 -1625 -4182 -1815 2483 4149 957 -2822 -3502 -388 3309 3594 -426
3587 -426 -4066 -2917 1423 4110 2259 -2018 -4344 -1416 3044 3699 413 -3263 -3322 313 3601 3093
3603 3093 -998 -3904 -2269 1698 3970 1946 -2591 -4118 -843 3352 3630 43 -3610 -3197 961
3618 961 3871 2409 -1555 -3742 -2022 2074 4000 1319 -2887 -3763 -406 3456 3507 -526 -4080 -2793
3634 -2793 1472 3932 1907 -1949 -3823 -1474 2653 3628 550 -3216 -3313 -12 3623 3213 -1047 -4038
3650 -4038 -2290 1910 3788 1592 -2547 -3912 -730 3156 3251 118 -3232 -3172 423 3664 2706 -1539
3666 -1539 -3902 -1959 2177 3992 1201 -3004 -3603 -202 3266 3024 -449 -3504 -2633 1228 3735 2017
3682 2017 -1800 -3766 -1478 2447 3866 548 -3270 -3298 362 3421 2764 -897 -3708 -2260 1898 3586
3698 3586 1398 -2056 -3502 -1089 2827 3407 30 -3302 -3004 642 3657 2536 -1556 -3809 -1580
3713 -1580 2180 3570 1049 -2621 -3438 -408 3077 3018 -318 -3365 -2814 1048 3883 2083 -2114 -3747
3729 -3747 -1087 2336 3452 548 -2962 -3148 256 3338 2660 -769 -3522 -2327 1480 3742 1533
3744 1533 -2310 -3566 -986 2874 3451 -59 -3248 -2616 677 3279 2435 -1309 -3671 -1761 2114 3441
3760 3441 1083 -2351 -3511 -553 3371 3137 -579 -3435 -2371 1124 3466 1892 -1975 -3477 -1198
3775 -1198 2329 3308 652 -2857 -3348 96 3412 2595 -804 -3406 -2262 1503 3668 1451 -2374 -3359
3791 -3359 -758 2495 3046 272 -3191 -2993 600 3382 2272 -1209 -3429 -1850 2094 3540 959
3806 959 -2586 -3183 -210 3057 2869 -492 -3199 -2383 920 3372 1909 -1660 -3484 -1405 2394 3294
3822 3294 489 -2721 -2964 168 3227 2654 -977 -3357 -1909 1497 3342 1542 -2122 -3277 -885
3837 -885 2459 3127 152 -3060 -2808 771 3243 2175 -1202 -3386 -1826 1873 3381 981 -2567 -3183
3853 -3183 -397 2710 2841 -261 -3213 -2542 974 3354 1951 -1653 -3462 -1277 2270 2994 578 -2622
3869 -2622 -2892 130 3012 2628 -832 -3159 -2054 1213 3346 1545 -2136 -3399 -699 2671 3004 152
3885 152 -2886 -2666 641 3116 2245 -1189 -3122 -1678 1810 3256 1014 -2414 -3130 -360 2721 2848
3901 2848 -263 -3109 -2379 1211 3306 1702 -1513 -3224 -1269 2098 3130 552 -2525 -2825 -21
3916 -21 2838 2617 -705 -3262 -2020 1483 3205 1410 -1905 -3182 -797 2491 2944 29 -2722 -2566
3932 -2566 441 3079 2269 -1266 -3191 -1468 1889 3118 929 -2294 -2989 -329 2776 2639 -328 -2928
3948 -2928 -2222 907 3261 1720 -1608 -3187 -1253 2126 2976 661 -2680 -2770 75 2907 2296 -728
3964 -728 -3051 -1937 1330 3004 1227 -1974 -3045 -747 2404 2874 183 -2724 -2593 566 3150 2077
3980 2077 -1120 -3121 -1489 1687 2988 844 -2160 -2967 -364 2574 2642 -255 -2847 -2274 880 3154
3996 3154 1836 -1579 -3170 -1203 2070 2872 457 -2351 -2587 109 2707 2390 -582 -2961 -1870 1358
4012 1358 2976 1326 -1717 -2966 -802 2261 2792 6 -2742 -2442 521 2876 1999 -1016 -2942 -1575
4028 -1575 1690 2967 938 -2090 -2820 -474 2515 2628 -355 -2772 -2129 850 2879 1583 -1516 -2952
4044 -2952 -1007 1902 2751 579 -2218 -2608 4 2700 2373 -728 -2850 -1860 1320 2930 1354 -1788
4060 -1788 -2721 -536 2172 2726 142 -2446 -2432 503 2730 2002 -1034 -2936 -1523 1588 3038 896
4076 896 -2039 -2789 -345 2359 2363 -278 -2684 -1994 735 2703 1759 -1323 -2846 -1108 1815 2739 616
4093 616 -2314 -2682 -27 2680 2225 -800 -2718 -1588 1070 2806 1317 -1673 -2730 -767 2102 2519
4109 2519 305 -2448 -2473 456 2833 1911 -983 -2706 -1432 1507 2815 887 -2046 -2597 -412 2185
4125 2185 2506 -131 -2558 -2115 847 2767 1536 -1382 -2719 -1030 1854 2777 387 -2137 -2321 131
4141 131 2405 2152 -548 -2615 -1761 1006 2662 1367 -1548 -2783 -718 2224 2449 19 -2304 -2192
4157 -2192 438 2635 1847 -1073 -2553 -1389 1373 2631 995 -1862 -2657 -234 2327 2268 -170 -2493
4173 -2493 -1917 857 2540 1454 -1342 -2553 -958 1710 2526 546 -2133 -2358 -85 2307 2121 -602
4189 -602 -2699 -1655 1312 2713 1096 -1596 -2457 -747 1962 2323 102 -2216 -2081 268 2391 1888
4205 1888 -991 -2596 -1396 1455 2605 883 -1828 -2450 -115 2362 2086 -163 -2222 -1788 610 2523
4221 2523 1552 -1134 -2435 -1135 1609 2583 551 -2064 -2329 138 2393 1914 -524 -2557 -1467 1104
4237 1104 2543 1091 -1458 -2301 -850 1753 2425 114 -2255 -2176 332 2412 1732 -900 -2534 -1209
4253 -1209 1420 2349 680 -1572 -2246 -327 2173 2018 -215 -2275 -1855 509 2611 1595 -1303 -2534
4269 -2534 -646 1605 2314 437 -1978 -2247 191 2120 1776 -418 -2192 -1533 914 2509 1224 -1610
4285 -1610 -2460 -633 1826 2419 87 -2346 -1938 532 2232 1425 -685 -2303 -1349 1219 2433 749
4301 749 -1529 -2315 -471 1967 2217 -309 -2476 -1531 825 2300 1216 -1078 -2337 -840 1459 2104
4317 2104 529 -1749 -2202 -39 2309 1961 -591 -2307 -1593 957 2468 1040 -1546 -2266 -358 1716
4333 1716 1946 248 -1908 -2056 257 2317 1547 -779 -2350 -1471 1282 2401 776 -1814 -2144 -123
4349 -123 1928 1859 -248 -2093 -1507 582 2163 1483 -980 -2463 -1088 1522 2321 408 -1818 -1977 14
4366 14 2226 1764 -679 -2206 -1340 922 2135 1115 -1306 -2297 -747 1555 2140 205 -2053 -1929 457
4383 457 2352 1425 -916 -2206 -1110 1136 2196 755 -1599 -1983 -157 1669 1892 44 -2095 -1757
4399 -1757 798 2265 1244 -1090 -2158 -885 1586 2236 234 -1827 -1790 75 1798 1857 -405 -2227
4415 -2227 -1304 928 2109 1116 -1188 -2358 -690 1842 2012 -6 -1784 -1743 259 1967 1623 -724
4431 -724 -2178 -997 1080 1995 990 -1481 -2298 -290 1960 1909 -340 -2112 -1725 720 2036 1142 -1048
4448 -1048 -1939 -893 1264 2078 479 -1591 -1884 -14 1878 1762 -331 -2123 -1495 966 2168 914
4464 914 -1252 -2020 -567 1514 1858 210 -1807 -1770 164 1877 1537 -658 -2116 -980 1139 2074 722
4481 722 -1477 -2076 -135 1840 1667 -270 -1796 -1532 458 2082 1191 -973 -2134 -806 1191 2055
4497 2055 574 -1808 -1909 167 1870 1542 -466 -2081 -1266 848 2028 816 -1144 -1923 -679 1395
4513 1395 1976 196 -1911 -1768 326 1810 1425 -638 -2123 -1105 1207 1973 649 -1357 -1967 -366
4529 -366 1617 1919 -169 -1923 -1526 453 1983 1248 -934 -2124 -632 1373 1915 294 -1542 -1913
4545 -1913 4 1890 1548 -400 -1807 -1365 711 2092 1025 -1247 -2048 -525 1435 1832 189 -1726
4561 -1726 -1708 355 1914 1165 -623 -1816 -1141 992 2041 717 -1314 -1745 -318 1599 1686 -150 -1860
4578 -1860 -1475 633 1809 1106 -784 -1952 -768 1225 1798 410 -1489 -1780 -98 1793 1582 -408
4594 -408 -1801 -1224 750 1941 959 -1178 -1811 -555 1404 1615 187 -1654 -1610 279 1828 1284 -573
4611 -573 -1890 -1151 1012 1943 713 -1424 -1793 -209 1479 1578 -30 -1699 -1419 464 1837 1117 -803
4628 -803 -1864 -868 1141 1972 332 -1455 -1695 -79 1765 1580 -445 -1896 -1137 737 1834 931 -1088
4645 -1088 -1933 -507 1277 1743 190 -1468 -1475 143 1807 1276 -723 -1817 -877 916 1855 690 -1221
4662 -1221 -1723 -266 1568 1549 -58 -1692 -1376 564 1681 1057 -837 -1853 -761 1260 1747 248
4678 248 -1481 -1608 -31 1484 1418 -329 -1746 -1243 752 1783 763 -965 -1705 -543 1237 1673 186
4695 186 -1646 -1411 391 1688 1262 -619 -1733 -898 924 1833 728 -1267 -1804 -230 1497 1440 -66
4712 -66 -1714 -1402 438 1731 998 -802 -1675 -766 1072 1555 481 -1394 -1549 22 1462 1384 -351
4729 -351 -1630 -1029 722 1711 662 -896 -1651 -499 1230 1671 12 -1442 -1277 246 1647 1185 -502
4746 -502 -1737 -1006 909 1766 610 -1168 -1649 -192 1425 1474 -195 -1591 -1413 393 1658 1172 -878
4763 -878 -1781 -735 1191 1708 423 -1313 -1618 -39 1465 1333 -341 -1576 -1063 667 1781 904 -1055
4780 -1055 -1760 -432 1231 1530 120 -1384 -1357 293 1534 1216 -416 -1731 -858 784 1645 586 -1121
4797 -1121 -1586 -266 1350 1396 -147 -1375 -1244 461 1570 948 -725 -1646 -609 1112 1523 366 -1264
4814 -1264 -1560 2 1560 1316 -252 -1529 -1172 634 1647 817 -967 -1627 -312 1162 1593 -31
4830 -31 -1380 -1393 306 1522 1085 -584 -1657 -974 866 1642 507 -1109 -1622 -322 1400 1445 -129
4847 -129 -1536 -1291 467 1447 920 -643 -1516 -773 1068 1442 307 -1086 -1367 -190 1470 1390 -347
4864 -347 -1506 -1067 597 1598 663 -951 -1538 -451 1171 1373 149 -1294 -1343 171 1600 1074 -494
4881 -494 -1600 -799 733 1601 556 -1194 -1455 -119 1232 1317 -56 -1423 -1198 320 1451 956 -702
4898 -702 -1580 -737 1099 1650 272 -1196 -1317 -8 1343 1242 -282 -1578 -855 647 1447 778 -769
4915 -769 -1452 -620 1045 1519 184 -1330 -1299 172 1445 1022 -560 -1460 -771 736 1497 541 -1046 -1474
4933 -1474 -138 1199 1321 11 -1397 -1211 454 1574 759 -784 -1427 -568 950 1458 304 -1229
4949 -1229 -1257 5 1222 1193 -337 -1444 -1070 506 1461 709 -799 -1532 -437 1132 1347 21 -1356
4966 -1356 -1037 51 1353 1108 -475 -1517 -765 727 1419 568 -981 -1400 -182 1364 1265 -67 -1376
4983 -1376 -1046 364 1414 843 -643 -1272 -647 855 1453 379 -1132 -1262 25 1228 1106 -332 -1398
5000 -1398 -1045 692 1579 513 -897 -1344 -312 1062 1265 98 -1278 -1290 69 1340 984 -550 -1436
5017 -1436 -801 683 1418 455 -934 -1424 -183 1202 1063 -296 -1111 -794 182 1349 1021 -739 -1547
5034 -1547 -480 914 1394 425 -1170 -1294 92 1382 1146 -254 -1249 -961 618 1294 636 -730 -1240
5051 -1240 -511 957 1287 74 -1333 -1209 378 1189 874 -458 -1487 -815 729 1313 356 -1065 -1187
5068 -1187 -312 1100 1346 -88 -1406 -979 393 1391 807 -703 -1426 -472 932 1186 283 -1109 -1320
5085 -1320 -98 1224 1101 -282 -1189 -892 412 1434 889 -887 -1458 -234 1076 1143 50 -1077 -1112
5102 -1112 62 1237 838 -484 -1392 -802 582 1449 408 -880 -1178 -178 1071 1274 -80 -1345
5118 -1345 -884 422 1221 679 -558 -1324 -567 962 1294 240 -974 -1198 -7 1279 1115 -258 -1294
5135 -1294 -808 524 1339 586 -725 -1288 -235 920 1137 83 -1045 -1149 184 1339 849 -465 -1302
5152 -1302 -768 610 1378 471 -954 -1230 -141 933 1072 -96 -1181 -1092 347 1183 673 -531 -1356
5169 -1356 -566 836 1269 174 -1021 -1155 -34 1151 1013 -212 -1190 -785 566 1188 643 -790 -1277
5186 -1277 -273 979 1219 -37 -987 -1141 222 1278 798 -477 -1202 -555 616 1147 546 -875 -1307
5203 -1307 -22 1127 1057 -132 -1200 -991 351 1316 711 -593 -1109 -508 801 1296 270 -1071 -1028
5220 -1028 80 974 1111 -171 -1299 -806 530 1272 560 -715 -1177 -342 964 1171 102 -1090 -880
5237 -880 130 1058 928 -376 -1298 -763 691 1297 507 -815 -1177 -193 1090 1018 -72 -975 -1030 247
5255 247 1299 714 -679 -1212 -349 810 1056 246 -875 -1263 17 1107 962 -313 -1180 -772 463
5272 463 1148 530 -775 -1184 -381 811 1198 97 -1034 -935 193 1141 740 -332 -1160 -609 705 1162
5290 1162 330 -874 -1087 -236 953 1071 -136 -1000 -879 381 1085 742 -631 -1100 -497 686 1170 214
5308 214 -903 -1075 87 1033 840 -312 -1079 -772 455 1259 493 -808 -1081 -236 902 992 60 -1029
5326 -1029 -932 180 1087 777 -354 -1136 -734 710 1130 449 -763 -1062 -190 818 948 -105 -1073 -834
5344 -834 356 1051 697 -467 -1179 -512 738 1041 225 -773 -1084 -89 1067 811 -283 -1052 -652 399
5362 399 1204 573 -757 -1108 -274 861 990 76 -1043 -860 125 1043 701 -355 -1104 -563 626 1188
5380 1188 392 -971 -1053 -151 853 939 -107 -1027 -901 321 1116 685 -506 -1086 -517 731 942 174
5398 174 -913 -983 -119 893 926 -309 -1103 -701 505 999 441 -602 -1129 -307 811 1037 164 -885
5416 -885 -838 244 1034 716 -443 -1119 -565 515 1103 427 -893 -918 -100 962 1075 -40 -1056 -818
5434 -818 240 1073 597 -437 -1042 -416 635 1052 190 -901 -871 -106 834 856 -213 -1167 -645 500 903
5453 903 484 -627 -1026 -260 865 1009 120 -856 -807 135 979 801 -346 -1103 -539 622 1033 428 -675
5472 -675 -1013 -123 818 859 -129 -1028 -824 269 1062 543 -569 -1089 -409 645 1020 185 -719 -985 31
5491 31 941 763 -203 -941 -667 411 1077 534 -725 -1047 -263 839 1086 56 -789 -880 111 902 666
5510 666 -306 -966 -591 500 1007 379 -759 -1016 -215 919 862 -85 -871 -715 298 953 561 -545 -963
5529 -963 -414 619 947 325 -707 -896 -18 837 687 -223 -972 -698 407 1112 371 -566 -894 -240 600
5548 600 974 180 -828 -805 153 946 678 -325 -970 -668 596 974 288 -657 -912 -84 805 853 -177
5567 -177 -832 -675 218 909 714 -447 -1031 -380 680 823 209 -667 -1002 -102 970 721 -260 -900 -498
5586 -498 435 915 529 -503 -985 -315 752 845 172 -782 -808 229 874 660 -326 -949 -370 515 994 215
5606 215 -612 -823 -171 765 740 66 -975 -748 242 1049 623 -411 -968 -351 713 849 186 -678 -910
5625 -910 17 836 641 -189 -808 -495 246 987 659 -630 -1076 -161 739 807 -34 -787 -720 117 897 585
5645 585 -385 -825 -482 318 868 404 -590 -716 -171 733 854 -76 -952 -696 480 745 504 -270 -785 -529
5665 -529 574 982 156 -723 -744 -76 754 910 -242 -1004 -603 444 863 392 -505 -931 -207 636 715 151
5685 151 -633 -768 -17 921 554 -384 -887 -388 389 918 414 -740 -856 82 852 611 -78 -697 -645 78
5705 78 809 541 -414 -820 -438 556 932 214 -827 -738 32 676 654 -158 -857 -529 395 733 410 -417 -800
5726 -800 -438 561 935 5 -699 -757 119 893 665 -423 -888 -279 524 656 322 -563 -788 -86 755 875
5746 875 68 -801 -817 146 967 446 -472 -880 -270 549 761 136 -751 -627 50 714 686 58 -866 -701 339
5767 339 934 418 -499 -788 -266 537 795 -84 -753 -670 179 709 571 -118 -885 -435 376 810 364 -405
5787 -405 -886 -178 710 845 -149 -888 -599 173 782 448 -461 -770 -297 461 606 410 -458 -843 -1 810
5807 810 760 -186 -806 -500 376 814 348 -533 -835 -125 434 718 114 -718 -620 46 738 623 -244 -738 -534
5828 -534 625 833 200 -655 -675 -115 615 766 -42 -645 -509 143 572 615 -317 -819 -371 485 972 121
5848 121 -697 -766 72 846 623 -274 -785 -577 247 659 444 -442 -818 -244 536 744 21 -676 -732 202 889
5869 889 389 -391 -671 -345 500 682 365 -619 -684 -198 535 700 -3 -833 -632 147 858 610 -277 -830
5889 -830 -324 657 642 -22 -520 -598 -68 640 709 -162 -688 -486 312 778 575 -469 -879 -181 645 591 -52
5910 -52 -776 -530 143 732 502 -387 -677 -508 410 835 402 -509 -699 -41 603 622 19 -708 -580 324 651
5931 651 335 -406 -651 -297 459 788 185 -527 -625 23 678 595 -146 -762 -404 292 669 329 -390 -737 -127
5952 -127 534 630 -43 -524 -583 71 723 542 -172 -766 -267 350 573 193 -498 -759 -74 528 508 -39 -612
5973 -612 -479 115 582 394 -155 -697 -199 397 788 157 -606 -641 151 574 468 -135 -678 -397 276 597
5993 597 287 -297 -713 -218 515 771 8 -636 -589 97 698 583 -256 -722 -293 365 657 166 -587 -607 -102
6014 -102 623 617 -31 -638 -665 195 660 298 -423 -586 -364 346 620 88 -559 -674 28 648 435 -249 -664
6035 -664 -510 269 644 451 -337 -680 -240 497 511 -90 -585 -444 153 666 511 -166 -650 -278 437 592
6055 592 256 -468 -715 -205 521 612 -191 -597 -514 148 701 258 -342 -792 -246 440 610 91 -570 -529 -24
6076 -24 670 518 -114 -525 -383 296 511 198 -352 -529 -99 519 607 55 -552 -550 64 558 417 -319 -700
6097 -700 -366 355 716 311 -488 -552 -180 718 500 -73 -571 -429 255 708 326 -245 -564 -206 431 526 78
6118 78 -436 -558 37 657 642 -203 -607 -334 225 582 370 -373 -690 -116 486 680 104 -501 -460 154 539
6139 539 416 -203 -728 -398 382 590 208 -531 -606 -89 591 611 -98 -640 -441 217 721 354 -314 -625 -115
6160 -115 424 741 62 -440 -635 -142 572 536 -215 -582 -377 233 687 209 -448 -602 -145 412 549 110
6180 110 -482 -490 96 578 422 -249 -591 -317 354 458 316 -533 -565 -73 587 648 -71 -572 -451 213 519
6201 519 281 -387 -645 -194 468 622 6 -437 -527 70 506 466 -78 -705 -349 312 550 204 -370 -568 -116
6222 -116 362 575 29 -533 -484 48 679 311 -190 -566 -317 308 602 110 -382 -604 -28 500 449 -22 -523
6243 -523 -614 166 612 328 -228 -621 -197 317 568 90 -560 -505 20 525 371 -162 -555 -342 281 558 244
6264 244 -235 -489 -236 443 592 -7 -525 -382 143 500 378 -222 -526 -163 265 544 144 -449 -440 -107 433
6285 433 531 10 -513 -319 114 569 374 -274 -460 -249 309 538 95 -460 -487 65 460 279 -41 -552 -372
6306 -372 248 609 161 -442 -571 -57 407 559 58 -498 -496 67 541 426 -117 -462 -243 204 557 119 -270
6327 -270 -595 -85 536 549 -109 -626 -279 51 576 313 -251 -489 -350 455 509 186 -379 -464 38 560 394
6348 394 -61 -419 -285 272 550 271 -292 -499 -84 408 563 44 -519 -520 159 424 239 -237 -354 -343 205
6369 205 564 44 -461 -464 76 402 450 -54 -496 -389 248 406 377 -199 -533 -116 520 474 65 -393 -371 -15
6391 -15 529 357 -305 -530 -257 162 401 286 -238 -405 -115 322 538 68 -469 -488 59 544 202 -85 -499
6412 -499 -164 244 339 83 -350 -472 -18 450 483 28 -487 -493 244 563 232 -202 -446 -238 354 509 -60
6433 -60 -262 -318 -60 417 404 -162 -438 -299 188 530 291 -253 -538 -9 449 412 -28 -420 -262 46 532
6454 532 260 -32 -504 -215 41 570 7 -249 -476 -110 505 344 48 -520 -273 265 393 329 -269 -304 -212
6475 -212 161 511 121 -433 -389 -82 459 362 -358 -408 -367 216 473 52 -208 -418 -161 392 406 -191 -332 -294
6497 -294 -79 529 471 -163 -587 -206 345 342 151 -258 -610 105 535 217 6 -430 -378 67 582 388 -361
6518 -361 -494 -81 248 377 115 -270 -308 109 469 266 -190 -520 -260 272 553 25 -342 -330 -227 231 492
6539 492 100 -360 -433 0 422 441 -142 -508 -221 342 430 133 -398 -495 -48 495 492 -91 -414 -326 229 588
6561 588 319 -377 -412 -89 387 332 5 -380 -447 71 544 436 -146 -537 -252 234 707 360 -355 -518 -178
6582 -178 317 409 170 -298 -291 55 270 298 -35 -330 -154 306 274 -58 -423 -454 -68 368 521 12 -534 -349
6604 -349 39 239 179 -12 -329 -6 357 461 98 -518 -562 -154 414 438 -4 -249 -138 229 377 179 -356
6625 -356 -632 -128 268 345 127 -242 -328 134 609 333 -281 -533 -257 202 436 131 -306 -359 -93 417 481
6646 481 59 -333 -97 248 396 244 -247 -553 -290 244 411 -73 -421 -469 6 316 330 -67 -398 -211 332
6667 332 465 326 -53 -294 -27 465 516 -19 -394 -224 180 469 226 -229 -361 -203 129 483 66 -315
6687 -315 -510 -146 232 317 -156 -513 -393 13 290 28 -365 -483 -219 183 201 -98 -384 -432 -41 135 218
6708 218 -289 -648 -325 202 280 76 -360 -663 -275 179 262 -32 -477 -376 -65 373 291 -196 -484 -238 177
6729 177 368 102 -133 -470 67 411 334 97 -348 -185 224 499 436 -140 -327 -154 403 453 -75 -326 -319 -87
6751 -87 434 312 -160 -501 -302 170 173 106 -256 -499 -47 269 347 128 -317 -224 89 360 391 6 -291 -169
6773 -169 252 431 0 -360 -343 -152 219 254 -145 -461 -387 91 422 224 -111 -302 -151 477 448 159 -400
6794 -400 -417 -81 216 205 -173 -423 -343 140 460 205 -135 -368 -62 344 446 -148 -422 -324 2 227 218 -90
6816 -90 -376 -76 307 415 140 -177 -460 -135 163 254 -294 -459 -337 17 331 260 -52 -253 -83 228 297
6837 297 57 -409 -456 -57 270 348 41 -309 -172 224 381 85 -307 -483 -70 146 320 -29 -308 -223 159
6858 159 489 274 -128 -400 -369 85 409 129 -113 -286 -13 354 335 -113 -343 -418 9 262 233 -146 -374
6879 -374 -64 340 288 5 -354 -536 -128 392 420 -39 -190 -223 220 247 42 -186 -377 -78 398 361 120 -374
6901 -374 -413 -18 243 319 -98 -234 -176 321 317 137 -369 -444 14 234 407 77 -185 -246 120 228 71 -253
6923 -253 -393 -78 301 492 104 -253 -389 -15 206 190 -22 -231 -58 282 239 65 -311 -431 -131 349 325
6944 325 91 -244 -339 -80 212 222 -108 -203 -5 232 318 73 -212 -377 -147 297 446 119 -409 -343 69 318
6966 318 171 -97 -233 -151 357 278 14 -321 -294 87 316 334 -131 -382 -252 100 380 222 12 -291 -112
6987 -112 245 219 16 -325 -152 34 323 275 -136 -476 -264 63 442 293 -235 -254 -81 147 227 -116 -270
7008 -270 -124 165 289 22 -158 -333 -211 321 443 89 -409 -438 -38 274 308 -9 -220 -148 87 301 -26
7029 -26 -122 -170 -19 153 270 -117 -320 -260 70 400 375 -86 -466 -243 116 326 144 -112 -221 -154 186 162
7051 162 -23 -219 -280 7 251 151 -197 -263 -71 330 328 -52 -289 -337 58 358 356 37 -340 -346 109 310 163
7074 163 -55 -259 -107 118 305 147 -205 -212 179 262 109 -260 -372 -175 210 387 48 -292 -290 -44 376 375
7096 375 -46 -367 -262 -42 350 225 -56 -417 -164 21 194 62 -199 -85 -42 286 172 -72 -287 -27
7116 -27 99 365 75 -279 -278 46 243 273 -5 -191 -263 106 295 252 -113 -313 -320 103 365 232 -141 -362 -129
7139 -129 68 258 101 -210 -132 20 141 109 -81 -137 -144 157 222 -44 -298 -208 122 296 180 -221 -357 -187
7161 -187 205 354 70 -155 -409 -57 197 173 161 -208 -379 -197 499 281 2 -289 -209 47 244 181 -117
7182 -117 -219 -20 134 123 35 -91 -145 29 197 116 -63 -247 -136 245 220 35 -208 -247 106 390 176 -105
7204 -105 -239 -121 156 326 287 -193 -407 -82 339 331 32 -226 -279 -12 231 140 -41 -244 -224 48 263 175
7226 175 -44 -338 -46 112 226 23 -183 -257 88 197 91 -144 -237 -101 140 177 -29 -188 -158 13 206
7247 206 135 -69 -316 -200 202 312 23 -253 -309 -28 321 246 -36 -214 -119 -34 343 325 -148 -358 -231 114
7269 114 347 222 -105 -313 -60 277 330 -93 -280 -286 -37 203 202 -84 -324 -170 -26 116 213 -94 -203 44
7291 44 157 273 -33 -137 -198 93 247 67 -144 -182 -135 33 241 80 -219 -182 54 151 55 -118 -308 5
7313 5 248 233 128 -311 -201 45 284 118 -89 -352 -164 111 343 213 -104 -348 -186 262 367 26 -349
7334 -349 -358 25 295 284 5 -291 -202 108 281 178 -217 -312 -90 224 333 82 -254 -192 -103 218 212 -23 -297
7357 -297 -165 38 331 218 -43 -265 -89 210 252 30 -137 -206 -84 312 58 -171 -168 -75 48 134 51 -105
7379 -105 -106 -48 171 217 -53 -245 -94 140 165 123 -232 -237 -43 212 144 30 -212 -202 85 228 100 -150 -245 -174
7403 -174 180 338 77 -261 -239 48 201 210 57 -358 -128 48 288 55 -179 -229 -48 178 236 73 -217 -266
7425 -266 56 252 185 -4 -307 -163 147 232 183 -85 -430 -153 247 236 44 -198 -218 -32 326 176 20 -304
7447 -304 -269 57 232 177 -125 -144 -147 70 293 107 -192 -259 -17 272 235 -30 -330 -146 134 205 187 -95 -293
7470 -293 -53 93 253 93 -128 -226 -70 179 137 -86 -31 -135 67 282 22 -112 -155 -39 180 203 -131 -253
7492 -253 -182 15 173 142 -59 -55 -225 135 215 22 -215 -147 -155 100 169 -90 -175 -147 37 127 66 -16 -112 42 191
7517 191 -3 -35 -311 -117 31 175 95 -78 -241 -24 226 211 30 -185 -84 -5 197 106 -90 -153 -104 117
7539 117 66 66 -39 -163 1 168 145 -64 -224 -148 73 146 87 -258 -263 -25 226 241 118 -195 -193 37 318 110
7563 110 -71 -199 -121 90 226 128 -189 -212 0 200 305 142 -182 -212 -18 232 215 -92 -335 -100 177 242
$$ [...]
8191h3
##END NTUPLES=NMR FID
##END=
