##TITLE=1H_CBPAd-1
 CDCl3
 8 sc, 
 14.7.2023
##JCAMPDX= 6.0         $$ Bruker NMR JCAMP-DX V2.0
##DATA TYPE= NMR FID
##DATA CLASS= NTUPLES
##ORIGIN= UXNMR, Bruker Analytische Messtechnik GmbH
##OWNER= root
$$ XWIN-NMR		Version 3.5
$$ Fri Jul 14 15:31:02 2023 Russian Standard Time (UT+4h)  she@DPX200
##.OBSERVE FREQUENCY= 200.13135
##.OBSERVE NUCLEUS= ^1H
##.DELAY= (6, 6)
##.ACQUISITION MODE= SIMULTANEOUS
##.ACQUISITION SCHEME= undefined
##.AVERAGES= 8
##.DIGITISER RES= 18
##SPECTROMETER/DATA SYSTEM= spect
##.PULSE SEQUENCE= zg30
##.SOLVENT NAME= D2O
##.SHIFT REFERENCE= (INTERNAL, D2O, 0, 15.7039)
##AUDIT TRAIL= $$ (NUMBER, WHEN, WHO, WHERE, WHAT)
$$ ##TITLE= Audit trail, XWIN-NMR		Version 3.5
$$ ##JCAMPDX= 5.01
$$ ##ORIGIN= Bruker BioSpin GmbH
$$ ##OWNER= she
$$ F:/spectra/data/she/nmr/H-F/1/audita.txt
$$ ##AUDIT TRAIL=  $$ (NUMBER, WHEN, WHO, WHERE, WHAT)
(   1,<2023-07-14 15:29:40.29 +0400>,<she>,<DPX200>,
      <created by zg, POWCHK disabled, PULCHK disabled
       configuration hash MD5:
       00 E9 B6 7A A2 85 ED C7 34 08 36 98 17 FE 4E 26
       data hash MD5: 16K
       CD 26 6B EE 2E 0F 8B D7 ED 4E B1 24 B7 32 D4 7C>)
$$ ##END=
$$ 
$$ hash MD5
$$ 75 06 8C 71 33 7F 7D C4 31 BF 12 48 94 0E 9F 50
##$RELAX= 
##$RELAX= 
##$RELAX= 
##$RELAX= 
##$RELAX= 
##$RELAX= 
$$ Bruker specific parameters
$$ --------------------------
##$DU= <F:/spectra>
##$EXPNO= 1
##$NAME= <H-F>
##$PROCNO= 1
##$TYPE= <nmr>
##$USER= <she>
##$AMP= (0..31)
100 100 100 100 100 100 100 100 100 100 100 100 100 100 100 100 100 100 
100 100 100 100 100 100 100 100 100 100 100 100 100 100 
##$AQSEQ= 0
##$AQ_mod= 1
##$AUNM= <au_zg>
##$AUTOPOS= <>
##$BF1= 200.13
##$BF2= 200.13
##$BF3= 200.13
##$BF4= 200.13
##$BF5= 200.13
##$BF6= 200.13
##$BF7= 200.13
##$BF8= 200.13
##$BYTORDA= 1
##$CFDGTYP= 0
##$CFRGTYP= 5
##$CHEMSTR= <none>
##$CNST= (0..31)
1 1 145 1 1 1 1 1 1 1 1 1 1 1 1 1 1 1 1 1 1 1 1 1 1 1 1 1 1 1 1 1 
##$CPDPRG= <>
##$CPDPRG1= <>
##$CPDPRG2= <>
##$CPDPRG3= <>
##$CPDPRG4= <mlev>
##$CPDPRG5= <mlev>
##$CPDPRG6= <mlev>
##$CPDPRG7= <mlev>
##$CPDPRG8= <mlev>
##$CPDPRGB= <>
##$CPDPRGT= <>
##$D= (0..31)
0 1.2 0 0 0 0 0 0 0 0.06 0 0.03 0 0 0 0 0.0002 0 0 0 0 0 0 0 0 0 0 0 0 
0 0 0 
##$DATE= 1689334179
##$DBL= (0..7)
120 120 120 120 120 120 120 120 
##$DBP= (0..7)
150 150 150 150 150 150 150 150 
##$DBP07= 0
##$DBPNAM0= <>
##$DBPNAM1= <>
##$DBPNAM2= <>
##$DBPNAM3= <>
##$DBPNAM4= <>
##$DBPNAM5= <>
##$DBPNAM6= <>
##$DBPNAM7= <>
##$DBPOAL= (0..7)
0.5 0.5 0.5 0.5 0.5 0.5 0.5 0.5 
##$DBPOFFS= (0..7)
0 0 0 0 0 0 0 0 
##$DE= 6
##$DECBNUC= <off>
##$DECIM= 32
##$DECNUC= <off>
##$DECSTAT= 4
##$DIGMOD= 1
##$DIGTYP= 9
##$DL= (0..7)
0 120 120 120 120 120 120 120 
##$DP= (0..7)
150 150 150 150 150 150 150 150 
##$DP07= 0
##$DPNAME0= <>
##$DPNAME1= <>
##$DPNAME2= <>
##$DPNAME3= <>
##$DPNAME4= <>
##$DPNAME5= <>
##$DPNAME6= <>
##$DPNAME7= <>
##$DPOAL= (0..7)
0.5 0.5 0.5 0.5 0.5 0.5 0.5 0.5 
##$DPOFFS= (0..7)
0 0 0 0 0 0 0 0 
##$DQDMODE= 0
##$DR= 18
##$DS= 0
##$DSLIST= <SSSSSSSSSSSSSSS>
##$DSPFIRM= 0
$$ [...]
##$SUBNAM2= <"">
##$SUBNAM3= <"">
##$SUBNAM4= <"">
##$SUBNAM5= <"">
##$SUBNAM6= <"">
##$SUBNAM7= <"">
##$SUBNAM8= <"">
##$SUBNAM9= <"">
##$SW= 18.05172834244
##$SWIBOX= (0..15)
0 0 2 0 0 0 0 0 0 0 0 0 0 0 0 0 
##$SW_h= 3612.71676300578
##$TD= 16384
##$TD0= 1
##$TE= 0
##$TE2= 300
##$TE3= 300
##$TEG= 300
##$TL= (0..7)
0 120 120 120 120 120 120 120 
##$TP= (0..7)
150 150 150 150 150 150 150 150 
##$TP07= 0
##$TPNAME0= <>
##$TPNAME1= <>
##$TPNAME2= <>
##$TPNAME3= <>
##$TPNAME4= <>
##$TPNAME5= <>
##$TPNAME6= <>
##$TPNAME7= <>
##$TPOAL= (0..7)
0.5 0.5 0.5 0.5 0.5 0.5 0.5 0.5 
##$TPOFFS= (0..7)
0 0 0 0 0 0 0 0 
##$TUNHIN= 0
##$TUNHOUT= 0
##$TUNXOUT= 0
##$USERA1= <user>
##$USERA2= <user>
##$USERA3= <user>
##$USERA4= <user>
##$USERA5= <user>
##$V9= 5
##$VALIST= <valist>
##$VCLIST= <CCCCCCCCCCCCCCC>
##$VD= 0
##$VDLIST= <DDDDDDDDDDDDDDD>
##$VPLIST= <PPPPPPPPPPPPPPP>
##$VTLIST= <TTTTTTTTTTTTTTT>
##$WBST= 1024
##$WBSW= 4
##$XGAIN= (0..3)
0 0 0 0 
##$XL= 0
##$YL= 0
##$YMAX_a= 189454
##$YMIN_a= -248612
##$ZGOPTNS= <>
##$ZL1= 120
##$ZL2= 120
##$ZL3= 120
##$ZL4= 120
##$ABSF1= 10
##$ABSF2= 0
##$ABSG= 5
##$ABSL= 3
##$ALPHA= 0
##$AQORDER= 0
##$ASSFAC= 0
##$ASSFACI= 0
##$ASSFACX= 0
##$ASSWID= 0
##$AUNMP= <proc_1d>
##$AZFE= 0.1
##$AZFW= 0.1
##$BCFW= 1
##$BC_mod= 2
##$BYTORDP= 1
##$COROFFS= 0
##$CY= 11.3945322036743
##$DATMOD= 1
##$DC= 2
##$DFILT= <>
##$DTYPP= 0
##$F1P= 15.7292609196834
##$F2P= 12.9074282941183
##$FCOR= 0.5
##$FTSIZE= 0
##$FT_mod= 4
##$GAMMA= 1
##$GB= 0.15
##$INTBC= 1
##$INTSCL= 1
##$ISEN= 128
##$LB= 0.24
##$LEV0= 0
##$LPBIN= 0
##$MAXI= 10000
##$MC2= 0
##$MEAN= 0
##$ME_mod= 0
##$MI= 1.114404
##$NCOEF= 0
##$NC_proc= 0
##$NLEV= 6
##$NOISF1= 3.799351
##$NOISF2= 2.8
##$NSP= 1
##$NTH_PI= 0
##$NZP= 0
##$OFFSET= 15.70392
##$PC= 1
##$PHC0= -21002.43
##$PHC1= 18.85272
##$PH_mod= 1
##$PKNL= yes
##$PPARMOD= 0
##$PSCAL= 0
##$PSIGN= 0
##$REVERSE= no
##$SF= 200.130013532006
##$SI= 16384
##$SIGF1= 3
##$SIGF2= 2
##$SINO= 400
##$SIOLD= 16384
##$SREGLST= <1H.CDCl3>
##$SSB= 0
##$STSI= 0
##$STSR= 0
##$SW_p= 3612.71676300578
##$SYMM= 0
##$S_DEV= 0
##$TDeff= 0
##$TDoff= 0
##$TI= <>
##$TILT= no
##$TM1= 0
##$TM2= 0
##$TOPLEV= 0
##$USERP1= <user>
##$USERP2= <user>
##$USERP3= <user>
##$USERP4= <user>
##$USERP5= <user>
##$WDW= 1
##$XDIM= 8192
##$YMAX_p= 0
##$YMIN_p= 0
$$ End of Bruker specific parameters
$$ ---------------------------------
##NTUPLES= NMR FID
##VAR_NAME=  TIME,          FID/REAL,        FID/IMAG
##SYMBOL=    X,             R,               I
##VAR_TYPE=  INDEPENDENT,   DEPENDENT,       DEPENDENT
##VAR_FORM=  AFFN,          ASDF,            ASDF
##VAR_DIM=   8192,          8192,            8192
##UNITS=     SECONDS,       ARBITRARY UNITS, ARBITRARY UNITS
##FACTOR=    0.0002768,     1,               1
##FIRST=     0,             0,               0
##LAST=      2.2672688,     0,               0
##MIN=       0,             -248612,         0
##MAX=       2.2672688,     189454,          0
$$ Real data points
##PAGE= N=1
##DATA TABLE= (X++(R..R)), XYDATA
0@%%%%%%%%%%Qj6J6j6K0k8L2m0M8n6P2q4R6j12J32j52J73k00K30k62K95l35L78
33A99m23M77n33N94o63P36q16R06j002J103j217J341j476J623j784J961k156K372
51A242k608K874l172L507l892M334m847N453o179P065q169R584j1462J4059j7854
66a0065K3861l4604N8772j86079m8219L59187m11465L86738j68747L4875J27169
77A31423k70378K15145j28270K2654N9954n3579Q5907o3822K445M7588j11730
88f2663N5938J5070o1513Q9736m5684M7480j6825o7323R0463p9377n486P0731
100C0547o1774P7855o5886J8239O5122j63842J55020r3543K6283O5020j12621
111e9580J66817j69469Q8029p494q6855J13804r5684Q6557m6308J2697K3876n0094
$$ y = [0, 0, 0, 0, 0, 0, 0, 0, 0, 0, 0, 8, -8, 8, -8, 12, -16, 16, -24, 24, -32, 40, -44, 52, -60, 72, -80, 93, -107, 123, -139, 156, -179, 199, -224, 253, -280, 314, -349, 387, -429, 477, -525, 578, -639, 702, -774, 849, -935, 1026, -1130, 1242, -1366, 1508, -1664, 1843, -2049, 2285, -2562, 2891, -3288, 3777, -4392, 5192, -6270, 7789, -10065, 13796, -20808, 37964, -148115, -196334, 162853, -248612, 138126, -30621, 4254, 131423, -138955, 76190, -52080, -29426, 30528, -23051, 62856, -966, 1479, 49067, -62663, -6725, 8345, -53168, 36568, -9116, 38364, 21539, -45784, 44679, -34698, -40184, 30547, -31227, 46628, -19258, -1019, 64103, -99739, 55281, -38262, -11979, 53041, -59580, 107237, -62232, 25797, 18303, -68552, 45252, -50432, 36125, -10183, 2514, 26390, -23704]
123b3704K2526o875J695k479K3541j7781L8274n6011L1393j416n3069P5160o0805
136b9551N0084j2190k1024N0955p4513M7805j7820j4531M1001m3741N5500l5913
148c938m833L3358o1476N4449l5946K1911J2154l0985N2046o0400L5413j7520
160e767p459K3940k7491L6195k4864J2271p762r79n573R69R708j0935K2712k4896
174i931K9056k7946M939J1395k7852M1383l9417L5005j2961j5590L3678m8931
186b7172M1807k4700M116K3203l7567M4586l6404J0528J0401k8558L5907k9549
198a3402K1590j895j5307K3136k5573J5553o513p66Q118o939M797j649j260m234
212d344P648j2215J4680p580j409J5451k6721K9181k5122R623J0159k5786L7290
$$ y = [-23704, -1178, -8053, -6358, -8837, 14704, -3077, 35197, -20814, 10579, 9163, -43906, 31254, -29551, 20533, 8343, -12681, 38274, -36239, 11566, -6254, -20785, 20216, -23525, 31975, -3938, -8771, 24587, -36889, 17560, -18386, 3525, 15679, -15306, 36740, -23660, 11753, -5767, -13226, 10714, -16777, 19418, -5446, 6825, -937, -1916, -7489, -6520, 3188, -7747, 14965, -9931, 19125, -8821, -3882, 7513, -20339, 21044, -18373, 16632, 3671, -11919, 21759, -27172, 14635, -10065, -5949, 17254, -20313, 24273, -12131, -1603, 8798, -19760, 16147, -13402, 8188, 6293, -9014, 14122, -11451, 4102, -2411, -3177, 4941, -1998, 2799, 1150, -110, -4344, 3304, -8911, 5769, -1811, -3220, 12231, -14490, 14691, -10431, -808, 9351, -16435, 20855]
225B0855l5209K2466k764k0902L3120l5416K7401j0183o450K1701k8649K3827
237I797j4991R95J0479j4225J4834q883L265J434n432K988j086n57J932K162n409
252b697Q859j0168M307Q52q822J5272j4952J2141j954r161J6563k1647J6566p055
266a896l120J4987j8915J8978j3253J634O318j4095J5909j1304O679J509o006
279b575P408q731L943j754k13K667K19Q7O80p57l068L087m826M953j468k46N536
296D942p854O485n740p0L648o129Q279m655K533J719o132N658o757L419J220k799
312b233O314m719L226k523j675J360k306K573K05J001p8L42j812l65r72n22L029
329H45k929N246l155J137L13m449L863m030L910m32l06L426m398K462l453N54
$$ y = [20855, -14354, 8112, 5348, -15554, 17566, -17850, 9551, -632, -7082, 14619, -14030, 9797, -5194, -4199, 6280, -7945, 6889, -1994, 1271, 2705, -2727, 261, -825, -1382, 550, 2712, -2697, 6162, -4006, 301, 1153, -7669, 7603, -7349, 4792, 2838, -6323, 10240, -11407, 5159, -1896, -5016, 9971, -8944, 10034, -3219, -1585, 4733, -9362, 6547, -4757, 1922, 3431, -2575, 4833, -3898, 45, -1709, -1922, 745, 964, 1051, 1731, 974, -2094, 993, -3833, 1120, -348, -594, 4942, -2912, 3573, -2167, -2237, 1411, -4718, 3561, -1094, 1439, 3158, -2974, 2684, -4073, -654, 566, -2233, 4081, -638, 2588, 65, -1610, -250, -2556, 17, 222, 1223, 1145, 1487, -325, -690, -1662, -2184, 845, -2084, 3162, 7, 1144, 1457, -2992, 871, -3159, 751, 319, 13, 3439, -959, 1503, -1950, -1396]
345a396R62j101K909j077J577r92r29l81j033N51L2J265J17J070n48j781J026
362B71k576K073l07P13K320l103L337m021O36N35k886M859l843M402j703q06J858
379A759m192L178k911K006Q94r46K244k378J082j475r0k35N16R70nJ327j834N72
397D82j096j83L37j006K620r07M88O97k495J800k452R57J033j444L637l106K151
414A513j234j801K548l683L595j605J225J251k612K251k622R75l25j83J242m67
430F8N69p6l60m95k25m14P13K13m7J134r99N20o21p50P53j098J125P37r85J606
450A368j791P10l37j520K245j873K317j049r3J567k862K312k292Q52Q22j322J871
467I25j291J073l26j266P70m72M06M61j81O58l68m99N35j109M09K6j57R33n46
$$ y = [-1396, -434, -1535, 1374, 297, 1874, 882, -47, -428, -1461, -910, -878, 387, 504, 1574, 1026, -755, 271, -2305, -232, -539, 174, 2494, -609, 2728, -1293, -657, -122, -3008, 1851, -1992, 2410, 707, -99, 1759, -2433, 745, -2166, -160, 734, -212, 2032, -346, 736, -739, -829, -1064, -548, 422, 417, 1744, -90, 482, -614, -797, -460, -1466, 1154, 247, 735, 1432, -1063, 737, -1715, -758, 275, -1169, 2468, -638, 1513, 279, -1522, 1026, -2657, 938, -667, 558, 1809, -803, 1448, -1174, -199, -524, -707, 535, 68, 637, 561, 201, -294, -519, -933, -220, -7, -54, 1080, 81, 601, -20, -770, -17, -1115, 10, 747, -238, 1368, -423, 287, -50, -1570, 675, -1198, 1119, 70, -23, 1544, -1318, 994, -1298, -446, 376, -946, 925, -366, 707, 381, -885, -115, -587, -181, 280, 99, 757, 389, -110, 425, -684, -275, -249, -406, 527, -19]
486a9Q51o68n76K16m42j31Q15k12O66k80j56O44j536O91n09J14J220r75J368j385
506c04N43k23j159J283n55N75J46r6L59p59pk7p27P80o7N15L89o28P08j141o3
527d58K56m98J195m63O90n9n01M9n86K0O9M7L51J60J22j20j31p34M53n75Q57j4
549A30N50K13r97L20r70J60k9K33P90M8o4L26j061K32m16J01M75m34J570p97r
570C71Q3j087M20k69P36m41Q31J19l91k17q16K01k03P95K02K88N5l78J06j206
590h01L53l14N93L97Q4L92m20l7n37j24l40Q50k92M26J24J74o39m07K56l70O57
611B5k53O72M4j91q9o00J76m27J39N47J70L73m26N2m71j6m79M62M44lN15m30Q9
634C23q79J17L5J32J74M14M1R0j89l55k88k18N26k24O69J2P0j14o28j9j30J19
$$ y = [-19, 832, 164, -412, -196, -638, -769, 46, -166, 500, 220, 64, 708, -828, -137, -646, -532, 688, -287, 1081, -304, 239, 16, -1143, 140, -415, 160, 306, 210, 569, -190, -197, -224, -951, -171, -238, 277, 666, 38, 746, -395, -458, -202, -700, 495, 32, 722, 663, 162, 211, -375, -355, -286, -239, 112, 272, 394, 274, 143, -591, -138, -713, 144, 130, 680, 893, -104, 216, -754, -594, -623, -390, 400, 448, 384, 710, -351, -119, -535, -434, 41, -393, 1177, 380, 371, 454, -633, -213, -482, 254, -187, 644, 763, 372, 155, -661, -460, -663, 132, 334, 622, 677, 299, 405, -801, -448, -762, -169, 228, 312, 704, 284, 247, -290, -414, -754, 96, -196, 230, 354, 528, -111, -518, -262, -632, 25, -228, 444, 488, 297, 208, -392, -216, -643, -504, 43, 213, 586, 160, 212, -259, -275, -754, -292, 152, 149, 664, 234, 323, -556, -439, -404, -272, -98, 316, 357, 447, 258, -97, -385, -603, -77, -301, 368, 380, 450, 336, -292, -311, -441, -322]
656c22O37l32Q24l08k01l25k3l13J06oM56J24o4K57o06K1m83Q2N56K00L93j00
678E73l30k78m32P5Q2J76M80j1K21L6o89K27q15P38l39M29K64j26J02j79l35j84
700c15k2K29L15J16K90m50l95K16n12L53k39N83J96l12P28p76j64K40n99L64j5
721a69O68j49j24j44m37p1J25j74O34K62k33K42n37L21n86k47M18k01P43k12L31
742D60r4o68K62k15L0K79k52P66o1l69J45r94N67K9l01R43m82O28m68q0J27n75
764c23o2L57m2O46n86k8K76o59N81o00K24M00m2M95m84p0m34K3J73l12M66L47
786C46j0O5m13j18P0m07K47L73l31P32m07p9j85l69L15j74M91P0K3M05r19M72
808A97n19p7K70m58R19j65m7R8n31K29j55o5L67j89N76l51P8L8n88o3qJ94M91
$$ y = [-322, 315, -17, 807, 499, 298, -27, -50, -363, -257, -263, 193, 317, 253, 510, -96, -75, -558, -476, 80, 280, 673, 573, 243, -35, -467, -392, -310, -134, 346, 335, 556, 592, -97, 130, -685, 53, -286, 143, 407, 281, 383, 204, -131, -315, -337, -108, 207, 323, 613, 163, -232, -16, -528, -175, -414, 169, 365, 53, 781, 5, -159, 81, -518, -154, -169, 499, 350, 226, 82, -355, -426, -301, -475, 159, 421, 188, 430, -107, 214, -372, -619, -201, -402, 341, 129, 460, 366, -302, -40, -255, -225, 54, -198, 568, 507, 138, 283, -711, -144, -115, -416, 527, 45, 673, 205, 125, 252, -323, -385, -28, -70, 576, -10, -38, 238, -421, 160, -440, -216, 184, 142, 637, 153, 83, -351, -328, -155, -467, -1, 346, 336, 401, -12, -130, -60, -467, -220, 153, -178, 554, 147, 68, -117, -486, -171, -345, 146, 216, 239, 644, -275, 197, -322, -399, -129, -587, 332, 167, 120, 218, -313, -84, -239, -304, 63, -126, 450, 99, 177, 215, -373, -436, -444, -250, 241]
831B41o4J30j34j39k52j90J32O92m12M48k08j44o6j75P5m01K62K76l02Q78m93
852A54k13j1n96N10r6L38M23o40M25l30j72K0j97Q22o72M10J88m38N01m76k67
873c17J26q2N23MK84k41Kn34l1J12J38k70J30N89l39P5m48O0j17m8N77l6p1J08
897A94o8K22n39R6o3l52Q78k33J39k0l61L47r90N43K40k32N73n40L97j64l33R2
919a74k22K62M44l69L86m5l83j84j7R1l1K12M02j90J53m98Jk52K04kL93J09k4
942B66q8J41n07K4J22j66J51K85j28M22n36j69m8l31P38m21P94k53l17J70m38
963b89P7j75J85N01j59L36k27j27J15n17L14k78O8L42j80N32j73l13k21n5J45
984i9L41j0k5k07J94k38k42L25j33k74N81OL61o54o0J99m31L37r5K6L73j39L76
$$ y = [241, 177, 307, 173, 34, -218, -408, -276, 416, 4, 452, 244, 100, 34, -141, -66, -467, -205, 71, -231, 647, 154, -59, -70, -666, -156, -252, 86, 509, -131, 294, -36, -208, -188, -385, 437, -235, 175, 363, -75, 426, -50, -317, -191, -273, 250, 254, 538, 297, 299, -235, -266, -154, -16, -286, -156, 433, 94, 169, -279, -219, -336, -384, 193, 157, 86, 194, 126, 348, -191, -95, -158, -510, 368, 135, 274, 254, -107, 240, -750, -207, 33, -199, 374, -166, 231, 67, -266, -174, -396, -134, 310, -59, 327, 282, -101, -285, -302, -211, -242, -30, 372, 182, 335, -163, -162, -414, -210, -212, 181, 290, 266, 178, 319, -188, -164, -42, -208, -57, 228, 100, 522, -14, -183, -231, -562, 176, -245, 549, 296, -21, 149, -289, -212, -387, -202, 299, 140, 476, 249, 122, 237, -280, 34, -244, -176, 166, -14, 518, 345, 32, -189, -244, -99, 242, 232, 207, 0, 194, -44, -286, 39, -94, -368, 213, 219, 580, -74, -134, 65, -366, -29, -124, -98, 275, 136, 512]
1007E12n87l17L23m45K74N80j12Q6k42P3l66J02K86j28J8J56M0L46k35n90kK81
1029E3k22J85k3K63m91J07l1k66M32k35L56L5Nj27j18L21l48l63L75JM39j62J4
1052B00J08n59K22m6j4O5m6M64l96O2k3j85P6j8J46M7J46J30l25o9q5p7K84l91
1076b84M32L6k9L3j46k10Q0k32J5P9J01K90P4l58n3j40P2L17m51N44n7J66l36
1099e7L1O0j47J5J95j09L72k90J32m04O3P7j2K08k2j66K31j20p7k25j37J18M40
1122A76K34n14J31Q4j60j6j14M9J08k07L88J29k14l21m7j10M59k40K01m0M6J54
1144A76L6m88K15j06J78n4K33k46J75j68r9m0l97N71pP8K68m30M0J58n49M23k70
1167c03N48J25o9j18j95k04P6j45L59l9J57m49N43l78P6k3Qm39M30J89m3K80l93
$$ y = [512, -75, -392, -69, -514, -240, 340, 228, 314, 72, 145, -221, -119, 167, 39, 57, 213, 253, 599, 364, -226, -228, 53, -169, 16, -7, 256, -235, -128, -159, -425, 7, -228, 128, 163, 168, 41, -77, 244, -104, -467, -92, -91, 348, 186, 200, 308, -251, -29, -75, -89, -24, -70, 394, -2, 60, 37, -148, -72, -90, 56, 103, 249, 379, 54, -15, -100, -177, 107, -284, 148, 184, 155, 188, 42, -168, -88, -320, -305, -226, -125, 165, 239, -119, -172, -312, -240, 77, -374, 170, 113, 279, -57, -26, 34, -113, -98, 97, -12, 360, 70, 202, -202, -139, -62, -74, 134, 112, -54, 177, 57, -20, -245, -382, -264, 176, 410, -104, 27, 111, -49, -65, -179, -130, -22, -229, 159, 288, 74, -247, -294, -404, 55, -185, 16, -24, 22, 176, 212, -276, -61, -167, 11, -43, 190, -56, 119, -49, -148, -188, -585, -14, -21, 57, 325, -105, -65, 93, -456, -33, -303, 245, 370, 301, 183, -12, -216, -140, -285, 74, 35, 192, -257, 286, -92, -16, -39, -31, -470, -40, 149, 106, 386, -7]
1190gJ5K1r2J17KR8R3j03k8n94M89j28k1L28k84J42P7k04J49k17j46L55n3Q9J51
1215B49j48j9k57J03k72K00J27J58P7o7j13j29j09J02p2K4M91m15K80j7o39N68
1237A22o36L13L01l47N33k43K75j56j75o2k85J32J79J25l3m6on0RJ37m02L17k7
1260b5M08p3l50Kj27k9j19L31K2j29J02l5j74jO2r8K42K27j02J08j96Oj51L3k06
1285b72J27K62N3o2J19k54p1m9Q2L81l32K31q5J38j66j99rj67L37O1j32J90j40
1308D3m1j41J45k97L56J0J54r1k34L32p6l8p7K2M0n4J8q3j8n0j66K59p1k6M80
1333C96l19j05o3K0r4k3L25l22L91J55L9o04L23N7j72j49L33J1n7J76k29k31j31
1356b73J10J40j03K04J34Q7k78Q2o2l35L61J91k81K71q5m5l82J28j68K03M7K05
$$ y = [-7, 8, 29, -63, 54, 56, 154, 247, 144, 116, -478, 11, -117, -138, 190, -94, 48, 125, -79, 70, -147, -293, 62, 9, 98, 249, 101, 82, -175, -72, -344, -144, -17, 141, 218, 151, 38, -91, -200, -98, -170, -146, 345, -70, 210, 193, -446, 122, -514, -201, 100, -247, 286, 43, 318, 162, -13, -75, -360, -228, -49, 76, 43, -3, -9, -59, -50, 87, -315, 2, -25, 383, 310, -40, -38, -165, -194, -313, 18, 40, -89, 13, -22, -196, -197, -135, -233, 9, 236, 134, 242, 46, 52, -99, -66, -272, -145, 117, 170, 108, 227, -27, -98, -147, -65, 316, -16, 215, 130, 268, 102, -97, -106, -273, 64, 125, -7, 183, 43, 2, -139, 6, -291, 65, 75, 229, 138, -96, 236, 160, 122, 45, 67, 107, 53, 71, -12, -30, -80, -246, 13, -58, -84, 396, 77, -28, -91, -71, -165, -188, 137, -185, 206, 361, 400, -204, 119, 176, 4, -145, 188, 199, 142, 318, 89, -142, -273, -163, -23, -126, 78, 212, 299, 21, 103, 41, -294, 67, 258, -23, 248, 163, 118, -264, -136, -304, -101, -54, 151]
1378A51R2M9j08m53J09K8J18qk02L92o3J21j78k78p1J68o9K09J61o7j44J61j49
1401c1%O0M6R1j84O1M8j28j48O3J01l24N33q7P4l55K22n6m01L31j15K61q2O0J
1426D1l40O8n5K72k03J89K58j53R1k7l71L9J50j17J45M0J38k68J53j46j22J35
1448h3L8j48K68j54K38k47K39m03K96o0o2K56o3l4K08j64j69j96O0J76O3J39j24
1471G4j54%J09k72R4K90k10k51N70k60K44l18J50o4o1J42m9N8k9j17o8R0k7N3
1495fq6J40j21L51k05p7j54J07j23J89k4J69k4k26L18o15L73j37k48L58L33l16
1517b4K05j47N8k46M8J63j84J72K87n66J77o0j96L96j06N4q8K30j73j62J1q6J41
1540i6o2J36K16j67j80L8P2n5lJ45j01K37j22k01J42j21P6j47M44J62n29P5L66
$$ y = [151, 243, 292, 184, -269, -160, -132, -14, -22, -224, 168, 105, 226, 48, -230, -301, -133, -202, 7, 168, 101, -43, 118, -31, -31, 29, 75, 166, -18, 43, 91, -37, -185, -122, -21, -345, 188, 101, 175, -180, 42, -14, -415, -84, -199, 62, -20, 40, 41, -299, -231, -286, -14, -217, -28, 230, 77, 168, 141, -230, -191, -41, -158, -13, 27, 165, -103, 50, -96, -218, -83, -45, -193, 75, -79, 159, -88, 151, -252, 44, -16, -78, 178, 115, 81, 289, 125, -44, -240, -180, -4, 59, 198, 74, -80, -80, 29, -243, -149, 141, -69, -320, 250, -10, 234, -84, 66, 2, -59, 83, 34, 92, 63, -54, -122, -32, -59, -6, -92, 48, -73, 278, 73, -4, -158, -51, -174, 15, -9, 160, 136, -90, 228, -387, -14, -151, -399, -41, 292, -24, 181, 34, 92, -154, -106, 57, -127, 45, 332, -234, -57, -117, -313, 83, -23, 31, -57, 173, 0, -162, -151, -237, -96, -158, -22, 194, 27, -153, -115, -43, -98, -101, 44, -57, 180, 58, -143, -1, -122, -46, -193, 251, 413, -116, -41, 325]
1563C25l92k07K66n8Nj26J89J28k13J04j9p5j18K64K24j4Q4l81j52L21r7k43j2
1586a97K51N8j04n1J25m18L27K7k98L47J32L4q5J7m0m97K19P8j1K19j00j26Ok2
1610a09K70k03k25L10L0L8j68k6J36k45R3J05j6M0r8P6km2j81J2QqN34k96K10
1635B43j04j72q5l6J36k23O23k26jK29k83J16l55Q1QO8J02n9nj26MR6n3L17j25
1660A70L09m43J04q0k14l9M8j30J25J06R9p0N7l3j21Q3J23j83J24k13N0K18k12
1683a22K1Q2j92K39K74k92J60k56J74m5j43K42N0j56J22K3j52p7J98j16j26J77
1705H5j11j21J61Jo5J6k86K14J59L6j92J26J66j50j05J5j20M76k90j14J48J95
1727B44p4k99j88K65K37p5q7J58J07l97q3K04j12Q1j17K22O8j38j7j22Q4j7K85
$$ y = [325, -67, -274, -8, -66, -61, -187, 2, 130, -83, 21, 2, -73, -191, 73, 297, 283, 367, -14, -166, 155, 58, -185, -197, 54, 112, 8, -43, 82, -336, -9, 18, -280, 67, 199, 233, 148, 165, 125, -372, -153, -75, -86, 133, 33, -93, -87, -109, 161, -42, -267, 43, 73, 111, -57, -83, 53, -192, -99, 6, -10, 30, -68, 8, 6, -36, -217, -205, -197, -205, 329, 33, 243, 139, -33, -118, -154, -18, -241, 382, 156, 155, 384, 101, 217, -138, -57, -49, 19, 121, 62, 57, -69, -65, 31, -22, 295, 170, 479, 36, 140, 60, -154, -193, -145, -275, -150, -44, 55, -15, 42, 9, -112, -29, 94, -89, 35, -178, -128, 90, -122, -101, -19, -211, 28, 302, 10, 170, -86, 88, 43, -100, 142, 192, 36, 158, 181, 29, -48, 150, 34, -92, 85, -26, -147, 14, 15, -50, -34, -320, -106, 53, 89, -103, 23, 189, 39, -66, -51, -171, 305, 15, -99, 49, 244, 170, -129, -317, -52, 185, 110, 23, 181, 288, -109, -192, 12, -100, -19, -136, 86, 154, 16, -1, -123, -39, -56, 229]
1750B29r9j53q6J6J4K02k25J15M9k45J60J99k99K6R9r2j57J89J40O2j38m0p4J06
1774bO4J3j69o7K40Jk12K27o3j42O9r4K90q6r2j05R8j98K60k04L22lR3j36j67
1799f3R5N5k67J28K1J24l0L02m33J11P6k14j17J85n7K12j5l6j63K47l63Q6K68
1822A52j50K4j08J21M7k66J09m0j22K65K99k79J09j16k23L9n2L94K5k13m9N3O8
1845H7j36K83l19j0M2r6M44k71l1j35N7p4L8j73J93K20nK1l91J97j74P5K1L26
1869A89K6l18N3j20k7J01J03k61J88RL02N0k81K9J55k18J65k09N5O8M7M3k15J86
1893A20j23m5J32P2l70K93K1Jo8j99K73l00J36N0J91J03k44q7N2q8J76j99J21
1916A8K56k08o2k23M11j66r0Q0l8J06n7k05n1J06jq7L01q5J30l7j66m2J31o7K58
$$ y = [229, 130, -23, -109, -93, -79, 123, -102, 13, 62, -183, -23, 176, -123, -97, 2, -90, -247, -58, 82, 144, 6, -34, -108, -2, 62, 75, -94, -161, 79, 80, -132, 95, 32, -110, -41, -135, 155, 69, -23, -128, -30, -228, 32, -172, 150, 147, 240, 104, -63, 32, 87, -180, -52, -31, 93, 63, 365, -68, 43, 119, -95, -212, -27, -84, 128, 113, 77, -86, 161, -202, -116, 152, 2, 26, -82, 39, 86, -180, -71, -111, -233, 32, 331, 52, 161, 45, -178, -139, -191, 203, 228, 15, -34, 19, 87, -49, 234, -85, -95, -53, -149, 295, 24, -7, -142, -85, -159, -121, -294, -101, 119, 114, 135, -256, -59, -233, -158, -137, 189, 215, -103, -50, -170, -197, -96, 7, -254, -66, -57, 245, 295, 14, 43, 198, -20, 145, -64, -9, 59, 106, 149, -66, 120, -3, -48, 84, 156, -214, 79, 100, 101, 33, -166, 107, -193, -57, -7, 184, 287, 43, -44, 8, -80, 96, -103, 18, 274, 66, 4, -219, 192, 26, -64, 16, -22, 84, 27, -178, -229, -123, -124, -211, 90, 5, 135, 98, -68, -110, 21, -46, 212]
1941B12j38k7PJ63j41m7r4p7L24m3j30j07J69j0k52R3K8l3K82k36l3J72j58K29
1965A53j13r9J98j46j07O9QJ94j55j23l9K74p9j57P8K25o9k72n7K53mk34K15K9
1989D2O8k45K15j49Q6r7J60k4J89l46K45j5j33m3J83m48K48J37j18J13n7l04O8
2012b25R9K64Mj52J61l3j10J51j86j93K96%J58j42j43J25j0j62P8K5r9K21N0o9
2036A08P4k56l28L01J7Kj17L34j46k2o5R7k32QR1O6J4K62k57J33k86K88k34R9
2060d9M7l0n0P6K3j40J17j62L9J98J0R0l15J65Q1j29J05k04J90p1J67n4M9m6l00
2085a93j6o3L11r6k38L97J52r3k45J68l09M7J14l0l6K33k21j07L06j36j14K66
2107I7k09P1J23j10J03j03j24k4K90l51M78qo3j39p9J02P3k15J31j04M1P9k71
$$ y = [212, 74, 47, 54, 217, 76, 29, -65, -142, 182, 139, 9, -98, 71, 61, -191, -98, -70, -103, 179, -57, -90, 82, -76, 153, 40, -59, 139, -7, -114, -45, -37, 157, 2, -121, -160, 114, 35, -122, -44, 181, 112, -160, -217, 36, 32, -202, 13, 42, 110, -135, 80, -69, 17, -80, 80, 56, 245, -101, 144, 129, -4, -47, 136, -312, -64, 73, -45, 68, 11, -293, -225, -126, 138, 142, -10, 151, 118, 8, 159, -27, -220, 76, 76, 234, 92, -51, 74, 64, -98, -20, 5, -94, 127, 177, 108, 182, -74, -402, -101, -84, -82, -199, 135, -11, -33, -98, -1, -233, -225, -134, -68, -54, 208, -49, 84, -202, 86, -148, -49, -2, -32, -82, -6, 17, -123, -6, -168, -129, 69, 79, 169, -146, 19, 100, -29, 76, -128, 62, -9, 158, 104, 153, 107, -193, -209, -272, 39, -57, -295, 102, 254, 161, -84, 84, -225, -178, -64, -94, -130, 103, -118, -225, 81, -55, -169, 97, -112, -41, 82, -28, 75, -28, -152, -176, 114, -237, 241, 233, 170, 31, -48, 54, 127, -88, 43, -61, -20, 59, -212]
2130b12J87K00k18J12N4j6j54lJ12j41M6k2l2J33lj02R1j15m1l04N22k98J20%
2154h4J54q6o5m1M3Q8j85L30k23k8R4M4j04r4R4J33j59J02j07M09l92O8j86K88
2178I3k49K77J3r5j38r8K15M8j15K73l40r3M01k53p9K21j40K5j09K26j79J66P6
2201A46j94J84m94L34L43q3k68Q6NJ83l42J20K8r8J58K9l02j49L14j14k6J86j42
2224i6L14n8j61k20P4J59Nj62r8N74j84J91k28p0l24J64R9M40n68K40N5o5J48
2247B29l03J00j17J15j13K45k92J81K41k40Q3l34K07j11K09Q4Q5k25k69J25j21
2268b21J62J35O8k02j69M09n1l23N7K23j28J03J34l95L08k06K9J86k89K67P7l9
2290A35R4l14k5M87n44L43k62N5K3K11j23j87N3J03k06J34k81M20P4j78N3J83
$$ y = [-212, -25, 175, -43, 69, 123, 107, -47, -50, 62, -79, -33, -55, -87, 46, 43, -59, 32, -83, -124, -428, 94, -204, -84, -84, 70, -16, -81, -122, -79, 9, -176, 154, -69, -97, -3, 41, -63, -157, -63, 70, -89, 13, -94, 315, -77, -9, -195, 93, -156, 121, 134, 39, -99, -197, 18, 66, -49, 224, -116, -209, 192, -61, -140, 81, -59, -34, -143, 83, -96, 70, 146, -48, 136, -358, -24, 319, 236, -32, 54, 59, 242, -100, 20, 48, -50, 108, 137, -165, -314, 0, -114, -140, 46, -96, 218, 160, -1, -221, -147, 12, 17, -145, -243, 331, 147, 338, 110, 40, -284, -120, -21, 419, -149, 91, 146, 81, 229, -74, 26, -91, 24, -89, 156, -136, 45, 286, 46, 129, -205, 2, -109, 100, 184, 269, 44, -225, -100, -221, -59, 76, 144, -58, -227, 182, 131, -192, -135, 88, -40, 63, 197, -198, 110, -96, -67, 119, -170, 97, 174, 135, 229, -85, -110, 377, -167, 176, -86, -31, -8, 203, 80, -107, -54, 49, -157, -23, -304, 116, 190, 12, 65, 248]
2312B48j25j52O8K8m2O7j15Q8k01J75r2R0j0o5o8P7J60k23k4j77M28k88K37j55
2336g1J31j19N9J00j17j11K09j19K42m89J58rK45m27K6L34J1J6P6n7k22j04K28
2359a0p4O8R4m3qj62PM28q4k83J38K18l67j32L29j03J1p6n7Q0n7l2k2l2L05j3
2385A23l20K30J21j50j0R3n4j28J70o2rk17L83k7l23P3J56k64R2R8j79J86L1M7
2409F0p0J78l3j22pl03L79r7M5N5k01l2J90J52k67K29k12j72OJ69J68Nk03j02
2433a85L15K29l13k01M7m2O6K55l91J20J25O0j9N5k89J49N1j59J28j13L2q8J95
2456B7K94m21O9j06L06J32j95j52O8p4o5K58j03R3q1J61j48J04mk76p2L20o2l07
2480b34M1N03k44p3R0P4J64m74K78J6l26M23j55j6l07J97M3P0O1k32L8j72K92
$$ y = [248, 123, -29, 39, 67, 25, 92, -23, 65, -136, 39, -53, 37, 27, -38, -106, -29, 131, -92, -116, -293, 135, -153, 84, -71, 60, -59, 0, 100, -17, -128, 81, -38, 204, -285, -127, -136, 109, -318, -292, 42, 53, 69, 145, 88, -134, -238, -10, -84, -16, 78, 35, 27, -135, -128, 300, 216, -67, 71, 289, -78, -210, 119, 16, 27, -49, -106, -26, -83, -115, -137, -169, 136, 123, -197, 33, 154, 4, -6, 87, 33, -95, 75, 13, 4, -213, 170, 143, -180, -107, 49, -215, -123, -25, -204, -18, 13, 60, -10, 168, 135, 13, 6, -297, 82, -15, 30, 85, -116, -148, 42, 194, -73, 156, -56, -228, -222, -53, 115, 120, -83, -185, 130, 359, 46, -155, -108, -150, -84, 171, -220, -100, 25, 85, 66, 121, -168, -19, 32, -127, 1, -112, -80, -168, 27, 321, -100, -31, -137, 169, 301, 106, -46, 22, -52, -117, 141, 38, 131, 50, 211, 63, 167, 163, -113, -185, 135, 73, -234, -193, 310, 66, -7, 83, 157, 321, -153, 125, 141, -185, 238, 83, 67, -240, -43, 0, 70, 131, -101, -63, -235, 57]
2503E7O7k02M17j85k72K14nJ3p5r4M3j28L54j92m0J73P2m00l7K33j05N2L2J2M0
2528D4J05j34j53q3K33k78M83l86K49o5l22K58j86K93j73J07j56q1J25K48j73
2549d5P5k59L18r0j0M8o4j27J3k61M70K9m9R1j70N1r0o5j82K64K90k95J11Mj12
2574e5J87m05K70j49J67j42J76k10k04M67o9j0q5P0k44L83J1pp7k64P0K34j69
2597e5P9m4m8J59k15rO4K48l46L80j44P3j69k2P2j58L68m40K79K98m58J24m9N
2621hJ68k91K65k08r7O4M17l93n5M1P5j34N3q6L44k36j0J43j34J84j44K20k34
2644e6L8k6k7lJ43J1m6J85k01L6j33K20l2j02l20L66k04J17K20k02m8m8L40j69
2668E9l1m1j07N48j84l65K11o7j39l5J16%P8k1k1j88J77L5j16Q6N0j39K59k92
$$ y = [57, 124, -78, 339, 154, -118, 96, 91, 104, 29, -65, -22, -150, 204, 12, -28, 145, 217, -183, -220, 13, -92, -40, -8, 4, 44, 149, 15, -138, -221, 12, -266, 217, -169, 80, 15, -307, -49, -235, 58, -115, -8, -164, -245, -120, 128, -45, 30, -229, 89, -1, -11, 37, -27, -154, -141, -402, 68, 97, 48, 139, -31, 20, -70, -135, -317, -53, 237, -58, 53, 57, -55, 132, -273, -3, -152, 15, -127, 49, -161, -365, 102, 33, 23, -62, 8, -236, 147, 158, 151, 74, -190, -120, 114, -55, 24, -20, -68, 91, -124, -133, -69, 179, -167, 213, 69, 142, -27, -49, 23, -135, 233, -207, 72, 370, -88, 36, -13, -8, 160, -131, 134, -74, -171, -107, 310, -83, -138, -97, -22, -156, -103, -189, 155, -81, -91, 52, -82, 102, -42, 178, -56, -18, -44, -71, -74, 69, 80, 34, 219, 18, 54, -79, 141, 109, 7, -313, 53, -151, -34, 186, -16, -64, -112, 228, 59, 28, -13, -120, 428, 244, -121, 90, 23, -116, -151, -35, -35, 43, 22, 1, -187, -10, 25, -91, -5, 45, -94, 165, -127]
2692a27M9j93K79k61K73K00j25m5k30N2k6K44k62J84r0K13J84m32n7J17j13J45
2714b1R8l27M69j76o4K7l02J3K61k2j53L22j83J25o8r6L64n27M04Q3r2p3K9j33
2738d2M9J82k30l28L50pk18J47K45J31m84L85k26K95k93J01J07k66K16k18lo7
2760a74l3J35j06Q4j83M04j77j0O5Qq8j89L85j51J56o5N5r3Rk0RNj1j18j13J53
2786f3J65j13j40K62P0j99O0j43m4J53O5j03L08l37m8J45o4J03p9O8j53J26N6
2809I5j04QM6j15qL10m02J33j71K03o1N1j75L45l30kM35k53J79j49j00j50j72
2832c87M13O5J03k00j58K03q2m5Q3j14jR0J8J06k99L34lPJ03l17Q8j66M48m95
2856b06K43j88K21%k91j24M57R6L1k69j41N10k70K2J59k93L6j9m5K94l84m0J45
$$ y = [-127, -78, -271, 8, -253, 20, 220, 95, 50, -180, -128, -154, 90, -172, 12, -78, 135, 319, -113, -170, -53, -166, -21, 77, -250, 219, 43, -21, 6, -296, -283, -22, -44, -197, 125, -58, 67, -1, -97, 267, -260, 144, 227, 135, 62, 91, -42, 7, 189, -41, -369, -19, -26, -244, -97, 148, 279, -205, 180, -46, 249, -44, 57, 164, -102, 114, -104, -107, -174, -207, -72, -178, -94, -277, 127, -50, -60, 5, 13, -75, -264, 121, -30, 126, 61, 116, 23, 32, 12, 21, 26, 15, -103, -216, -63, 102, -11, -151, 111, 181, -18, 42, -101, -145, 8, 73, -30, 278, -59, -107, 38, -26, 77, -2, 66, -87, 39, 95, -9, -1, 45, -70, -78, 232, -170, -37, -208, -5, -66, -15, -190, 155, -175, -177, 258, 5, 184, 35, -65, -215, -387, 26, 91, 194, -6, -164, 39, -43, -88, -5, -119, -120, -30, -12, 94, -205, 129, 126, 133, 236, -81, 7, -159, 289, -206, 37, -151, 70, 70, -221, -345, 112, 208, 239, -30, -171, 339, 69, 91, 250, -43, -7, -26, -71, 223, -161, -201, -56]
2879e6J56k36J84K51n16K73r0rO8Jp8j32L32j33J57m62L74j69n8KJ68k41K31r7
2903h0l4K01j34q7k1K30k10K64k31J02kp4J3R9j09O7N1r7qQ1P7k02J52L3j58j41
2929b18K32J28n0k37J00q9J89J16K8l93J18M4k0K40k90O6j07O2K1J81j26R3j79
2952i1R1M2K36m17K9j22K02Nj70L39l03J55r3J80l67M89j79j06j41J26K14m95
2974c76N21j09J31k56J52p2l07J99o4K37O0o1k10J95p2k3J55m1n4nO8J05j46j17
2998i0K25k00J22J81m01Q9k32K61k2J2L3j04J18J45j83j06K41q3J4R9q4o0J0N8
3022D3K8k33K52j22J21M7j48n5m4P4K9l1r2K59R6K7k93l06M71j87L74k28J6m3
3046E5m3q8KJ39l83J28M9oJ35k5k05K82rj59M7M26l87J90l97J63M0j15J47J11
$$ y = [-56, 100, -136, 48, 299, -217, 56, -34, -43, 25, 26, -52, -184, 148, 15, 172, -290, 84, -85, -143, -141, 27, -214, 17, -80, -114, 87, -47, -134, -155, 75, -135, 129, -102, 0, -2, -76, -63, 36, -73, -6, 45, -52, -60, 21, 98, -104, 48, 81, -77, -218, 14, 142, 92, -145, -45, -134, 55, 171, 199, -194, -76, -32, -52, 188, -102, -36, -143, -81, -60, 121, -5, 88, -91, 0, 42, 278, -139, -110, -232, -30, -25, -195, 144, -159, -4, -97, 83, -284, 205, 26, -80, -221, -95, 119, -376, 145, 36, 167, -89, 63, -9, -316, -117, -181, 56, 116, 55, -155, 40, -32, -55, 100, 59, 5, 0, 68, 173, 27, -90, 135, -65, 57, 238, -163, -74, -306, -45, -67, -55, -22, -126, -8, 137, -46, -152, 89, 6, 20, 119, 35, -25, -15, 43, 71, -162, 90, -32, 89, 136, -12, -67, -111, -37, -8, -39, -131, 128, 224, 251, -42, -348, 123, -64, 310, 82, 98, 55, 12, -76, -74, 65, -318, -190, -141, -147, -12, -37, -242, 40, 31, -128, -81, 345, -42, 148, -249, -86, -46, -161, -14, 97]
3070I7p0j90J8L40k28n9O9j57L29m67J24L40J40l47j14P4J89j94L45J6l62p2K01
3093B2j36K3n9J04J17J89k09M0J1j12P7J34k01j87K40Qk9l6Q4j86J02o8j82J57
3117i7l0j8k5J09K54j68R7l33L25j07k57K97L1j32Nj42j0J65m5J29L7j38J4Q7
3141D8j64K20j79K85P5k99J04m3j84QL80l4m62L09J81j70k56K66K40k89j38K13
3163A11j27p8r0j4J72l25N04j53K2mK34q7q3j73J3K72l64J56j74K58r3J64J09
3186B50k8k36J32j21O9j12Q8K60n11J78K35l26l2Q2K24m01O64l81k2k32L43J91
3208C14l18J10o1L2l49J66J0J58q2j74P0L58k23k8J79ok46J18rN4k4q4J38O4j35
3233C2J2o4j43R3J52Q3o8p6R8j77J22r2M7j16K18O3k06p1K18q4r1J3L01j58n2
$$ y = [97, 27, -163, -145, 195, -33, -92, -23, -180, 149, -318, -194, 146, 286, -61, -175, -101, 88, -106, 239, 255, -107, -179, 22, -114, -91, -150, -46, 71, 260, 51, 91, 102, -10, 67, 201, 0, -187, 53, 61, 32, -4, 80, -106, -4, -72, -254, -97, -127, -145, -170, -61, 193, 25, 122, -211, 114, 7, -250, 47, 78, -54, -49, -191, -201, -36, -81, 48, 85, -53, -39, 48, -116, 104, -75, 210, 285, -14, 90, 47, -137, -129, 251, 217, -245, 64, 245, 75, -181, 85, 325, 36, -102, 111, -16, -94, -184, -198, -26, -351, 153, 0, 22, 18, 252, 165, 82, -91, -78, 194, -170, -14, -188, 70, -23, 141, 250, 222, -14, 118, -3, 66, -46, 42, 302, -209, -31, 204, -122, -154, -72, 152, -249, 415, 34, 12, -220, 123, 314, -4, 106, 45, 77, -272, -106, -96, 62, -20, -194, -124, 234, 11, -17, 162, 156, -90, 28, 19, 73, 49, -35, 103, 167, 32, 44, -20, -163, -70, 82, 165, 97, 21, 119, -58, 64, -28, 19, -97, 121, 184, -22, -93, 125, 41, -50, -37, 264, 106, 54]
3258E4J59j21Q6k11Q9R9jj70J91j36p9J10J4N3k11K64k06J5J03p9o0j52J67K75
3282B53R5M3n88K8J66J33j26j72J41o3K48k74j46M18q3k49L32j07L4J1P9j93K00
3305A80k53P1L1J02j14j23M0L8k5L4J66k75M8J66p5k8o4J03p3K0O5j45l2J17j03
3330a29K75j9N1l63J87M2k93J50K58k56kn1K25k41K49j09j3P5q6j73Q7j73M27
3353A18P6k47j14L55m5j42O6o3k9j60rK73j34K29j10j53O2J3N1M18n44J47j03
3376d5k70N68l93L02k34p1J37J33r2J3J30o4l20J97%J63j27Q7j54K72r4k84L18
3399A72n2j51l00J47K68J59k80J45k08K38r6P9J40l85N4j36L41j43J65j65j50
3420a58J54m7K8p1K2j0M9J27j69rL1k03K26L6nJ58M8j78J12k66K1J1l8J02q5K60
$$ y = [54, 213, 92, 178, -33, 56, 155, 154, -16, 175, 39, -40, 70, 84, 137, -74, 190, -16, -1, 102, 23, -37, -189, -22, 253, 348, 391, -197, -169, -3, 130, 4, -168, -27, -90, 158, -116, -262, 156, 73, -176, 156, 49, 83, 94, 173, -20, 180, -73, -2, 29, 131, 17, -106, -66, -28, -53, -19, 147, -128, -80, 86, 11, -17, -81, 22, -51, -31, 34, -111, -143, -26, -129, 146, 127, 178, -185, 2, 44, -249, -99, 159, -97, -99, -150, 75, -166, 83, -26, -39, 36, -50, -223, -136, -309, 118, 194, -53, -167, 188, 143, 1, 67, 4, -25, -185, -194, 79, -55, 174, 64, -89, -27, -14, 37, 455, -89, 58, -45, -315, 253, -140, 162, -72, -143, -6, 127, 35, 48, 178, 114, -206, -9, -9, 154, 27, 114, -40, 232, 138, -146, 172, 120, -31, -331, -184, 84, 243, -37, 108, -100, 138, 42, 121, 261, -124, -70, -206, 135, -8, 157, -8, -158, -4, -51, -23, -94, -72, -82, -33, 94, -75, -84, -53, -256, -30, 6, 1, 159, 207, 29, 141, -125, -104, -93, -131, -29, -114, 146]
3446A46nk41J18j62L01j68n3R5r0J93J77j86j70J33j8O2k33p1J67K48m02L3R3
3469c3M7k94L84j08J33k20Q8O2J39Q7j42k96J91k38J90lR3m4k00N29n44J10M10
3492C41J9m36L25l83L9K31m4m33L03O3Q7J39l81O1L28k41j26K64k2rn0j0J29k48
3516e4J26k97L22j14j56J01l0J86k88J8J92M2j83J11J11l51J78K05k29j21L40
3537A09n0J45l08M7j66J96L0k1N8n4J54j59J34J47k78J1L0Q2k12l0L51j28J4k62
3561a60K24K91m15l7q2j2J76J7l00M56j92j76J89k30J44L41l00r4K31J60j19j58
3583d6n5M20k20K5j84l7J96j52j15L01j73k5K59n0m5r8j27P8P8j9K05k24J7j8
3607iK01l54P5Q8J28p8k10L5J26nm1O4K37j55Q8N3m03J94Q1R8j20k47O8J25P7
$$ y = [146, 141, -100, 18, -144, 157, -11, -64, 31, -59, 134, 311, 125, -45, 88, 70, 132, -101, -172, -5, 243, -159, -126, -33, 14, -280, 104, -4, 129, -91, -3, 59, 198, 285, 143, -153, 38, -200, -10, -13, 80, 36, -164, 365, -179, -69, 341, 360, -76, 249, -134, -95, 136, 92, -341, -38, 25, 112, 251, -130, -69, 259, 18, -108, 156, 134, 125, 75, 65, 194, -54, 72, -225, 97, -17, -173, -72, -102, 84, -204, -186, 6, 48, -135, -24, 87, -264, -86, 119, -110, -231, 109, 59, 204, -104, -57, -223, -27, 3, -18, 40, -14, 140, -19, 115, 262, -16, -5, 25, 107, -105, -135, 216, 88, 102, -160, 64, 355, -60, -97, -179, -191, -15, 2, -298, 158, -34, -210, -21, -251, -107, 234, -66, -160, 71, 231, 112, -46, -101, 319, 99, 124, -60, -97, 99, -53, -168, 133, -40, -65, 194, 144, 99, 1, -126, -48, 30, 11, 216, -8, 9, -9, 192, -162, -87, 1, 129, 51, -159, -124, 2, -3, -44, 20, 257, 102, 190, 243, -160, 34, 115, 213, 93, -154, -86, 39, 116]
3632A16j17j2l16N45j52Q1k8nl06j35J04R5j09K88o2j38N5j5O6L8K3j25J13l20
3656c16N4Q8J62j43K00O5K9j25k11K61k31R3Km9L09j3j14N4J01j69O9k08J32J31
3680A71j75N1j70K33j57L3j4L6J83k53J35l5j99J42NL7J25o9p6nk8J88l10K69
3704A17R5l3j54O5n4j86J0j76N82j59k4j11J4Q9k9k85L23j70K60l00K31J43k25
3727B3J7Q3j27j0J61j42R7k31J39k27K65j01q9P1j3k85L41P2k73LJ10J93j71P3
3751b1K9J73k15M7N8L6j81r3K85r5n5R0n0Q6j52j09K09N4j45J83J29l18ml41M93
3776I3k6p4K4K2l80M95j40n0k7M7J39j55j53J70o6M22k00l65L65J8M4k36M49m64
3800d8j38L62j82j6K23r1j3k72K48Nj62J86n39J87K08o0N8K80j89j17k4L9L7O4
$$ y = [116, -1, -13, -329, 216, 64, 145, 117, 112, -194, -329, -225, -130, -239, 49, -13, -151, -96, -111, -45, -7, 16, -109, 4, -316, -262, -174, -12, -155, 45, 110, 139, 14, -197, 64, -167, -74, -72, -121, 188, 175, 61, 115, 216, 47, 116, -92, 40, 171, -4, 47, -123, 110, -47, -14, -28, 8, 191, -62, 73, 38, -161, -19, -14, 23, 148, 79, 3, -2, -30, 158, -152, 117, 212, 179, 25, 90, 36, -150, -140, -316, 266, 107, 83, -28, -14, 75, 46, -239, 84, -86, 174, -126, 105, 248, 23, 40, 123, -4, -14, 147, 5, 102, -129, 10, -217, 48, -53, -142, -71, -84, -369, -28, 44, -229, -226, -116, 77, -94, -21, 8, 181, -34, 13, 71, 107, -74, -167, 118, 23, -32, 58, 8, 94, -58, -167, 42, 96, -49, 134, 263, -55, -59, -400, 93, 67, -7, 17, 39, -341, 154, 14, -36, -63, -16, 123, -32, -185, -15, -81, 341, 141, -224, 141, 159, 203, -33, 416, -48, -186, 176, -6, -22, 201, 110, 97, -175, 73, 78, -84, 102, -437, -250, -42, -102, -44, 236, 47, -70, -94, -55, -18, 46]
3824D6j82k6L03j57k43K27J74j57j24K34J53r8l12J66j16mk6K63j26mN1j81n3
3847a92J82j67L36rp3Q1P2J08m12K10mj45k04N43l97K06k72m7K32M2l09K06J53
3870A40m3j85J07k82M15l45K09k2o2J68k8j62J83q4o1K66j89K00k46k17J94J3
3892c1j80J66J01k6J2j86J48J59j59q6j67J56m5L7L06j17k11M58Nn04J78K33j42
3915A05j60Q6j16j46L36j79J62k31N7J34J7q8J09k8r4K01n03L84j20N2N2j89L86
3938B27k35K50j81k28K27q4k03L34k47J43J11k41L0R3k13J55J19J4J55l64K71
3959A33k25J12J53l78J41R1K6J73o30N59o5l18J98RJ56o9J54k34J33j67J33n3
3981C2j47j8M72m19j49L14k71M04l73K87k30J85K8O1r0N4l25J65j27K26q8K8K09
$$ y = [46, -136, -162, 141, -16, -259, -32, 142, -15, -139, 95, 248, 150, -162, 4, -112, -116, -142, 121, -5, -9, 42, -139, -192, -10, -177, 159, 150, 77, 158, 230, 338, -74, 136, 132, -13, -217, 326, -71, 135, -137, -184, 48, 90, -219, -13, 140, 97, -88, 19, -263, 152, -193, 16, -6, -68, 100, 72, -90, 93, 9, -52, 214, 25, 225, -21, -238, -44, -31, -211, -45, 56, 30, 42, -144, 4, 163, 4, -82, -249, -93, -138, -101, 205, 88, -123, 335, 340, -164, 14, 247, 105, -55, 31, -85, -231, 105, -74, 88, -143, -86, 48, 65, -23, 86, 58, -36, 165, -338, 46, -74, -22, 30, -159, 227, -8, 242, 61, -167, 60, -24, -227, 107, -140, 3, 114, -127, -97, -4, -217, -62, 57, 71, 226, -138, 133, -92, 20, 173, -205, -64, 27, 53, 226, -404, 155, 90, -228, -30, -21, 135, 66, 220, -14, 119, -48, 85, 32, -115, -133, 339, -80, -229, 85, -186, 218, -155, 132, -98, 87, 115, 176, 86, 140, -185, -20, -147, 79, -9, 19, 228]
4004B28j59nr8J64k77M39j80K18q7l00rJ46m4J44k08r6L58p1l7l1j01j03m3jK30
4029G7j21M9J7L6k59J97J56j41q9k01L24l37M61N1r0l44J41J08J73m6J5k27K14
4052A64n9j23K13N9n11K48J31k05j07K37l13J34QK90l15L42n0n0oq6j23L03k37
4075e6N8l0O4J08j17j3L66k92j73K2p8j18K35q4o5K39o1r9L83n25J39J23J78k24
4099b0n3o8J99k4PJ5J50k23M9M2O8m9j40j06J5K16n9j28PJ51l7K2j37J04K45l94
4125a48J92Q0m6k49J23r1J74Q2k66J47k29K43J60j2j9k62J7R3J69k43K10j43j16
4148a34K36rn8j59K61R2R6l84j19J9L95k06r6L64m89K03q4j58K78k55K73O6l20
4171a88L55j75j06J73k18J79J20j44k09K20R4q3P1j43q2j5J62J28j07l16L18O
$$ y = [228, 69, 64, -34, 130, -147, 292, 112, 330, 243, -57, -66, 80, 36, 180, -28, -124, 234, 163, 126, 95, -6, -109, -152, -153, 77, -44, 5, 22, 58, -201, -4, 152, 11, -78, -279, 45, -292, 169, 220, 130, -214, -73, 35, 208, 162, 177, -50, 164, 105, -18, 195, 254, -257, -9, 122, -83, -190, 47, -266, -132, -124, 166, -149, 193, 143, 93, 87, 1, -122, 181, -56, 2, -28, 36, 144, 27, 14, 380, 88, -85, -63, -141, -259, -24, -108, -173, 66, 5, -94, 289, -236, -97, 26, 204, -20, -73, -141, 58, 34, 41, 56, 206, -17, 32, 74, 142, 93, -47, -153, -138, 78, 19, -109, -102, 49, 12, 34, -103, 1, 246, -148, 44, 124, 78, -171, -48, -139, 35, 117, -149, -2, -231, 12, 172, 160, 141, -121, -104, -11, 158, -85, 125, -18, -134, 102, 93, 35, -124, 137, 229, 325, -59, -178, -159, 236, 30, -66, 298, -191, 12, -72, -230, 48, -207, 66, 132, -188, 167, -8, -114, 59, -159, 20, 140, -4, -213, 7, 101, 18, 89, -54, -136, -151, 11, 139, 32, -284, 34, 40]
4193D0j53P9j6k55L20Pj27J94r8r4P1q0K25q3j17Q6q4J27j5k18R8J61n8J03k77
4218a64J13Q4k82M42k90K9l7J88N8j05K01l69M62m88p0J30J66j54R9N7mm3j3j31
4242a21J2J3P6j6j4K47k58q2K38m8m9J56P0j47KN5J27k33L12l22j08J34k12K70
4266A02o7r8J39l11J51LP7O7l10m5J41kN3j99M70k34J66R1k46Lj51J69R7n6Rj56
4292a37O6K36l72R7L60k26Jj81J55J56j70J03Rl4K6k73M91l52J23j52j09J67p8
4315i4K75p4m0P0p2p9l6j8N3J8r8J34P0k19P2k7L7J39r0j06j61L42j68k5J18P9
4341A00j53j20K10j61R7L44k68L34n9l50k2J9J90j48l3R3n6N7k59qK99m7L1k06
4365a16J45n2L41k94N7j5Lr9p1N2N9J19k81M6K2P6J00J7j05r2J81j4m87M88k1
$$ y = [40, -113, -34, -50, -305, 15, 22, -105, 89, -9, -103, -32, -112, 113, 30, -87, -1, -85, 42, 27, -191, -93, 68, 10, 113, -164, -51, 33, -249, 193, -97, -68, -105, 83, 141, 36, 237, -132, 330, -158, -228, -98, 68, -86, 13, 70, 66, 23, 10, -121, -109, -96, -20, -36, -50, 197, -61, -143, 95, 47, -2, 154, 224, 77, 79, 134, 261, 28, 340, 18, -90, 44, -168, 102, 35, -63, 76, -235, -84, -81, -4, 63, -247, -292, -151, -153, -100, -299, 171, -63, 103, 194, -52, -49, -200, -31, 66, 10, 19, -137, -71, 165, -207, -110, 250, 24, 25, -156, -1, 155, -15, 88, 97, 63, 89, -184, 307, -45, 78, -74, -183, -16, -94, 181, 107, 67, 137, 65, -14, -50, -68, -15, 3, -95, 39, 109, -110, -38, -65, -28, 111, 21, -85, -246, 96, -72, -97, 21, 100, -53, -173, 37, -124, -27, 317, 49, 383, 324, -26, -48, -29, 161, 13, -20, 73, 17, 74, -185, -193, 106, 59, 90, -116, 29, -23, 318, 24, 81, 66, 69, -30, -101, -49, 10, 129, -152, -106, -84, -8, 92, 109, 4, -88, 93, 79, -408, 80, 59]
4390E9L4j47Q0j01l0J41j74J04r8L34o8p5l7L0j20m3j29J63J42L8k37K52l10R5
4414i7J88j68M4jJ39Om2K9n8QJ18n16K62J9J80K24k49%R9j54j87K37k34l0J91
4439Hr1K19k02o4J82k62M82p7r6J21j65J76m58L17k75K85J50k90pN5k1K48j37
4462I8j56L47l38J58k97K64q7O8k7j00J1j60J59J96r5j13L94l58m5K97j55l65
4484c04L85o2J86N6k50J24k42JJ31L3j5m4L5j15q5J68p4J66n0K0j37L4J23l62
4508b78R4J87L3j16J54Q2r9mk28K42k56k0L90j88j92K08o3J63j22M5j46K36k55
4531a33J24O9l8p8m1l6K65m22L01j84M0J90j34K60j12J36j26J06L8m46K77j8n7
4554a9N5J12k27L4J75j46L5J68k09Q4j0r7J4j23K24L52n47q5Q3L61k22J85N2r8
$$ y = [59, 93, -54, 26, -75, -105, 36, -138, -34, -132, 202, 134, 59, 22, 52, -68, -111, -240, -77, 65, 103, -134, 118, -192, -97, 91, -77, -33, -34, 105, 111, 69, 98, 40, 48, 166, -350, -88, -69, 111, 335, 86, 86, 185, 31, -156, 81, -153, -183, 8, -83, 136, -66, -130, 52, -210, 272, 195, 99, 220, 55, 231, -227, 90, -185, 100, 250, -40, -47, 8, -13, 235, 98, -58, 289, -49, 109, -188, 76, -11, 57, 30, -70, -59, -219, -60, 136, 41, -72, 322, -36, -81, 216, 61, -304, 81, 19, 205, 261, 11, 135, -107, -106, 25, 58, 43, -1, 34, -81, -166, 2, -72, 94, 44, 64, -73, -39, 84, -278, -184, 3, 36, -80, 74, 156, 57, 53, -175, 67, -189, -209, 181, -7, -199, 9, -54, 109, -13, 32, -114, 122, -133, -9, 60, 22, -56, -97, -133, 132, -290, 11, -173, -133, 57, -77, 183, 71, 207, 81, 187, 225, -221, 56, 38, -19, 36, 148, -79, -45, 130, -16, 19, 187, -22, 62, 52, -45, -31, -154, 70, 422, -125, -210, -127, 234, 12, 197, 249, 151]
4578A51o05M94j31K00N0j19l5J0j28R7K02N6j50j0k14J08J72R4l17K32j23l21
4600b87L57j91J9O0J69j36n1j38J47j2M14l22K62l66J96k13J94J9j15K63j84J9
4622A04K0k28L2K44l85J96k7J02J08m05L42k11J23j34l8P6J52km0Po1L02k54Q8
4646A11o0j95K47j67M5r8O6J35q0j4mq8J43M0m42M94J93n36L62j40m8Q9J28l60
4670a79J14J49j60J86o6j33PJ47j51O2n0L3J06j22l6K05k50K46j71P1J30m23N24
4693B39j56R8p0K2r2j55J50N4l0n0j7jJ91l65N50k97k47K60l9%l2q4j6L87j87
4718A13P1k02K2l31L20O4J3PJ13k77Kk7K17k73K01l6p4J80j3j99O0j13J28R1k55
4743a98J59J18q9mK41l26K0J67Jo3j33Q3J37r2O3J37l17J23q2L46l19J72k10p8
$$ y = [151, -454, 40, -91, 109, 159, 40, 5, 15, -113, -16, 186, 242, 92, 82, -132, -24, 148, 242, -75, 157, 34, -287, 70, -121, -102, -42, 127, -9, -60, -198, -51, -63, 351, 29, 291, -75, 121, -92, 102, 121, 6, 269, 85, 104, 124, -104, -72, 172, -213, -17, -44, 58, 166, -239, 103, -108, 15, -119, -157, -81, 71, 69, 29, 36, -25, 277, 23, 111, 51, -144, 103, -64, -19, -117, -51, 84, 4, -10, -14, -102, 41, 81, -361, 133, 326, -210, 152, 12, -36, 53, 181, -179, -65, 84, -76, 110, 44, -89, -82, 65, -86, -24, -74, -41, 65, -57, -93, 112, -138, 108, -63, 8, 138, -285, 239, 83, 181, 111, 133, 41, -114, 36, 90, 60, 10, -7, -8, 183, -182, 368, 71, -176, 84, 45, 45, 13, -71, -87, 300, 113, 184, -18, 4, -327, -7, 57, 70, 77, 190, -87, -85, -112, 105, -168, 33, -3, -77, 103, 90, -109, -49, -162, -34, 57, -198, -39, 79, -10, -14, 227, -99, -79, 88, 89, 26, -107, -24, 113, 21, 84, 221, -96, 27, -55, 291, -28, 144, -66, -144]
4767a44J02Q3k15J34j85J65K35j80K0J16l4k14J72k0l3J57L3k16Q3J69m59J80
4789e1j2K1j74J3J45mN8j98R0j89L48K3J52k25K47k52Q8o8q3J29j54J54j76J30
4813A2J25j31J98r4k70K3P8J76l22J33N8j34L1J72r1O4K20l65J79j87K65j73K43
4836B10j21j78l7K72n1j45m0K62j36J37%l08k5Q0K92P4k50J16q7j13j4Jj97K42
4860a6J0j48K59O6k52k6J36L12k61k5J72j02j73j74J00J68J06l50K42j19q6J56
4882ej11j11J66J65m3J27l82M46k02r4Q7on6k27O7J90O7k10J40J02r6J52j26q2
4906d2K4L9j55oQm2L95j52P3k15J1L1l48N15J27k93J64k03J53N4j45R3m44J15
4930b43K13R0k90M23q6l9m8R2k57n9K86o0j0M5j6J41j98J76J8k06L33m15K66O1
$$ y = [-144, -42, 41, -174, -40, -225, -60, 175, -5, 15, 131, 97, -117, 55, 35, 2, 159, 192, -24, 59, 228, -231, -51, -63, -42, -216, -203, -58, -62, -4, -202, -112, -301, 47, 70, 222, -3, 244, -8, 80, 12, -71, 58, -96, 58, -118, 12, 137, 6, 204, 110, -160, -137, -59, 117, -205, -72, -14, -148, -117, 55, -36, 28, 248, -117, 62, -125, 140, -33, 210, 89, -89, -126, 146, 95, -50, -90, 172, 36, 173, 173, -135, -160, -80, 212, 286, 36, 152, 65, -48, -62, -61, -258, -16, -6, -154, 105, 171, -81, -107, 29, 341, 80, 55, 227, 125, -48, -222, -122, 46, 152, -198, 44, -75, -161, -5, -116, -227, -61, 104, 61, 188, -194, 252, 50, -44, 43, 37, -19, -246, -179, 11, 78, -132, 8, 110, 14, 166, 40, -42, -18, 21, -134, -140, -132, -174, 221, 69, 142, -73, -62, -31, -379, 136, 263, -30, 134, -69, 84, 138, -7, 86, -358, -243, -30, 60, -230, 193, 107, 68, 20, 112, -145, -204, 82, 22, 12, 57, 41, 182, -16, 160, 178, -28, 305, -110, 156, 217]
4954B17n6k34k02L95k2l06NO0L5J43K7j75J25J81j82j61K19j76O2J31m6L1P4J6
4978A61o0O8j19P4j23n6R6J04k97k4L33k13J32k52L01O9j37n0Pk17M09k22j1j4
5002d1p5J28j20J66n5R4j3j35L2P4j07J00N9j63K83q0j81O7O2j9J45k44j45J15
5026e3K4J2j79R6R3j63J72j80M4J81n1J68m45J99M2N1j7p3L84m54J36J84J09o99
5050d19K48K35M2O9l02J12K20l71O1Q4L0j55K38k52J06M5R9J20k81JpJ01j54M6
5074h4kO3j86L18m1j4kk8R6j57m5q2J99o3JJ71p3J08j55k3j95K30l43N85j53j96
5100g1O1K21j07n9p0J27k48J62M8k37J33M7q9J84q8J68j96%p3P8q5O8K08m34K21
5125c1J22n2K66m97J67oJ14P2k20p0K75k67J28j01L98j97k56K46l59K07O0m0O4
$$ y = [217, 161, -73, -275, 120, 98, -208, -203, -143, -108, 35, 62, -113, 12, 193, 11, -150, 69, -107, -45, 86, 40, 71, 145, 161, 101, 169, 50, 124, 1, -55, 41, 145, -152, -176, 157, -56, 76, -176, 125, 194, 57, 7, 14, -203, 206, -16, -27, -41, -116, 12, -108, 58, 3, 97, 84, -51, -19, 55, -52, 48, 107, -56, 227, 147, -34, 33, 95, 76, 221, -23, -168, -53, -29, -17, -196, -100, -7, -170, 2, -178, -134, 47, -4, 164, -281, -82, -40, 11, -6, -79, 305, -149, -13, 171, 280, -419, -171, 64, 106, 175, -127, -15, 205, -166, -105, -21, 9, -146, 92, -160, -54, -9, 90, 210, -71, -70, -77, 24, -130, -84, -86, -23, -209, 109, 68, 54, 52, 24, 120, -37, -82, -164, 35, -28, -27, 144, 71, 179, 24, 1, -194, 36, -307, 278, 125, -71, -10, 211, 104, 45, -25, 102, -146, 16, 64, -173, -40, 7, -82, 102, 14, 182, -14, -14, -87, -9, -94, -26, 182, -252, -31, 91, 39, 305, -192, -25, -31, 83, 155, -65, -135, 140, -127, 1, -100, 298, 101, -155, 91, -268, -61, -1, -41, 23]
5148B3j4m9J63l41K99j57J0J19l29M46r5j09jJ54j55qmO8r6j01J41M5P9k2P8q2
5174F2R7m02J23k3K95j46k20M54j14L1l03L58p1k14RM5J08j26J08j08k4j17L47
5197A69k71K39J3j35P0R5k29l3K9p9PK27J10k55k33P9J00q6K10j35M34k56J59
5220B29n4J02O5m05p4L32k23j62J88q0k52M1L99n2L2j4J92j41n2m1q7MK31l9J
5245A40j04K92m21J7J86L0l41K09k7L6l0j09M3K28j64j0J13K21m65J37o8N5Q1
5268D9L9J02j13j71J32O9L8k05l4K66k05lJ28q1n5J19mL7j89K03o9l09J66L9L05
5293B54j05j98J24m7J08l09N6J38M2l05K50K8K6l63K26MJ32m9r3M3J8J19j1r3
5317eR8k39L7J15Mm04M20J19k33j44J51J58J56k58K1O2p7M5rJ7Q6Mp0J12j19m0
$$ y = [23, 9, -40, 123, -218, 81, -76, -66, 53, -276, 170, 75, -34, -35, 119, -36, -44, -48, 20, -76, -177, -36, 9, 88, 66, 144, 62, 159, -243, -120, -143, 152, 6, -214, 240, 126, 157, -146, 212, 141, -73, -64, -19, 89, -37, 71, -37, -61, -178, 169, -102, 137, 150, 15, 85, 180, -49, -82, -53, -132, -125, 102, 212, -43, -276, -197, -97, -183, 27, -108, 326, 70, 229, 175, 277, 342, -63, -137, 195, -28, -190, -2, -82, -334, -293, 106, 54, 86, 72, 264, 123, 71, 30, -57, -53, 178, 139, 140, 36, 328, -93, -76, 110, 140, -201, 8, -19, 17, -13, -122, -79, 149, -15, -25, 88, 309, -156, -19, -87, -32, 49, 88, 190, 77, -94, 38, 107, 145, -60, -94, 172, -33, -36, 92, 11, -44, 75, 71, 108, -81, 122, 53, -256, -90, -51, 254, 149, -49, 75, 28, 136, -173, -117, 21, 63, -242, 8, 36, 62, -301, -75, -71, 61, 12, -81, -38, -20, 99, 88, -5, 93, -146, -109, 6, 10, -394, 26, 145, -88, -232, -81, 77, 233, -25, -4, 58, -19, 26, 17, 34, 120, 124, 54, 166, 47, 7]
5343Gq1J88q1J06k89L18p6k7L3J13k01j98J59l2K5j1Q2p5l2N3j29J66j83K51j18
5368c2P6P6o7j52J03q1R6J05k34K75k55j08K9kL85j58j52J56j90Q2o0J5J49j63
5392a07j07K78k55K97j02o3J22m0R3k54J4J58q6J81l48K19P5K51l36n1j9J38K42
5415C00j98Jk67R4K24l81J4N1L07m9N9p3j43L58k56J76k90j5M24o10K11n9J42
5438B0k12J48p1J67j96L27m60N05k98j45K71n6J5N7M4l2R9j25K2j15M2M8j28L3
5462d0l92L45L01j43K70l50j6q0K35l25K15p8k74K19j6n1j2J73J73j13J85j54
5484G2Ll22M38k63J52o6K75n87L01L1n7M5K68j93k63K34l1k5J53l34K02K4j69
5507a12K55l34K74j22j23K12J38k77O6Q6j52r6L48j02q0q3R0p4J84j38M0j07j89
$$ y = [7, -74, 114, 33, 139, -150, 168, 92, 65, 98, 211, 10, -188, -29, -61, -36, -47, 35, -40, -72, -19, -148, 18, -165, 86, -32, 44, 120, 53, -99, 4, -77, 19, 124, -110, 165, -90, -198, -169, -171, 214, 56, -96, 60, -130, -48, -108, -93, 56, -107, -214, 64, -191, 106, 4, -59, 63, 23, 116, -138, -124, 34, -52, 129, -219, 0, 75, 326, -10, -61, -80, 58, 300, 102, 103, -164, -70, 154, -227, -213, -162, 145, 96, 155, 82, -61, 297, 41, 217, -73, -88, 336, -274, -63, -122, 20, -192, -44, -115, 52, -144, 183, -277, 228, -70, -215, 56, 0, 15, 72, 116, 84, 183, 58, 80, -35, 7, 55, -73, -40, -432, -87, 214, 71, 341, -9, -25, -105, 130, -195, 20, -58, -332, -113, -129, -180, -192, -19, 154, 41, 226, 72, 75, -247, 191, -72, 80, 14, 289, -298, 3, 34, -23, 22, 290, 97, -166, 68, 37, 12, 165, -169, 33, 57, -112, 143, -191, 83, -39, -162, 50, 188, -89, -23, 63, -89, -185, 163, 61, -19, -102, -12, -86, 98, -40, 0, -107, -296]
5530b96K18j26J51n0K92k69P7q3L23j23k61K64j26j35M07j78J15m97N02j92O8
5551H1q1k01O9K14k43J37J33k30K42l18J98J74k20Q4O2k39o2K66l2j38J78J25
5573A99J4k50o7J15K51j85j29K9J11o8kj15L5k58K58J22l21M09k58K83l24o6J31
5596h6rJ41j7R9k08K13O8K9m84N10l31L35l50K6J00K49j37l16K75k17J90k6k37
5619a83R0N1J59l6k07r8J59n1OL20k10j69K06j76K68N8m30L46K28k97k98L72j53
5642d5N4J90r7k85MK79r6J8j18j34J52J84J2j17J60k06p9K47r3J14k31l0J68o9
5666a8M9j07j62K34J71l09L86j30l5p3j02r1N33k00p7j86L02k79Q5j17Q5P8R2
5689A29j17L6k21L06j42P2Q4Pk6o3K96n23J3K39r2p2n2P8NQ8j57K17k28J5n2J57
$$ y = [-296, -78, -204, -53, -103, 189, -80, -3, -86, 237, 114, -147, 117, -9, -144, 263, 85, 200, -297, 205, 13, 81, 0, -201, -132, 82, -161, -24, 109, -121, 121, -197, 1, 175, -45, 39, 101, -138, -200, 66, 34, -104, 74, 199, 213, -37, -104, 11, 262, 77, -52, -23, 88, 20, 18, -97, -62, -320, -62, 60, -261, 148, -110, 173, -151, -217, -86, -95, 46, 29, 128, -80, 133, 201, 230, -254, 256, -75, 260, -90, -64, 36, 285, 148, -168, 107, -110, 80, 54, -183, -93, -42, 117, 81, -126, -224, -65, -116, -110, 210, 0, -169, 37, -139, 129, 187, -243, 103, 331, 34, -264, 108, -45, 9, 199, 102, -183, -179, 100, 4, 22, -96, -230, -78, 106, 118, 1, 161, -45, -124, 123, 30, 144, -87, -117, 51, -18, 31, -76, -238, -4, 167, -142, 244, 114, 79, 6, -96, -187, 346, 146, 69, -117, 185, -94, -9, -126, -41, 37, 129, 12, 48, -173, 133, -9, 63, 147, 154, 128, 65, 361, -162, -149, 90, -2, -74, -126, -48, -43, 45, -112, 105, -123, -108, -160, -3]
5715cL08j57k48L2K96l78J99N6o7O9k51K03k43M77n06J58k2K96k35k06L34k97
5737a85J76Q0j83M7o1J75j5k8J09k8k36r2L45n32M76j64L1Q5J2p1L3J14R2Pl97
5762b10L27j41K8Q2q6j60L61k25m9K60j41j28N7N8l01N41l79Q1j64L81j66j27
5784a01R6J83k40J55R2k36O9j45L93k86j4j18J49k6p6R4M3N9k10J28K4n8K17j28
5808F4om7j16J15m1J42N6J3l79K18p4mJ52k44K74k40J70J2k7Q3j42j01K75l2k49
5833a28J88jk65K35n7nO7k12K02j22J14l1o0k9K38R7l18Q7pp5l93K74K62l0j15
5858h4J96j10N8o5J07O0lj92mJ67k89J63l6q6j13J94K80j35O8j50n2q7J35N6q6
5883hj57J01J8J22o1NJ22k39L93l62O2L79m30J60O7n0j65Q2J04n3o5J35m39K43
$$ y = [-3, 305, 148, -100, -68, 228, -150, 49, 105, 38, 107, -144, 59, -184, 293, -213, -55, -77, 219, -16, -222, 112, -185, -9, 71, -112, -65, -126, 49, 34, 6, 115, 87, -149, -241, 104, -428, 48, -116, -85, 0, 12, -59, -26, 88, 180, 187, -210, 117, -24, 4, 86, 0, -160, 201, -24, -73, 187, 46, -82, -25, 33, -268, 273, -106, -25, -189, 192, 26, -101, -5, 178, -62, 93, 185, -51, 18, -127, 266, -20, -34, -152, -3, -29, -105, -11, 32, 91, -119, 9, 33, -25, 192, 64, 58, 11, -105, 10, -31, 111, 167, 180, -199, 19, -55, -59, 93, -151, 123, -117, 53, 65, 38, 121, -21, -122, 153, 121, -128, 60, 59, -206, 29, -28, -33, 34, -178, 24, -98, 16, -15, -75, -104, 134, 231, -87, 0, -7, -82, -475, -201, 61, 31, -84, 112, 2, 60, -5, 102, 162, 159, -33, -37, 130, -159, 4, -32, -118, -231, -37, 243, 108, 176, 26, -26, -113, 22, 78, -8, -165, -64, -46, 76, 15, 20, 142, -97, 296, -66, -4, 375, -55, 105, 172, 122, -43, 39, 143, 90, 25, 160, -279, -36]
5907c6J53l40M17j40J91k77K41j63n5ol13K98JK49k85K44j67M5k16K85l78J62
5929i0K02k13L21j56j4k9N8kRJ4L23o60j6M14l93K38L3O6l8l41N6L54l24pK75
5954H0k91K26k72L86j38roL9nk00L04j13m0R1N9j35l5m1N2m0J87j63J75q1j16
5979h6L9K99m84O39m76k1J49j08O5k59L40l7k57J20Q0Q4j83Q4J72j88j37L61k18
6002b2K2Nj90J61j57K12P8j50j01J92M5j87j08Q8K62k21R0K3J00j68JN6K7M1n3
6027D6o8j50L16J61k71j66N6K64k46L1pJ10M1k87J21L2RJ38P7m31L23k29N2J54
6051G6J49l26K55k40J21o7j63Q2K74n72L77k8J29J83k43j8O9p3MJ08k20J39j66
6074a50K46j84O3Lk2Q2rJ09K0m48K26J43j36j38oR5M3J74m01M09o2R7Qp5O0n3
$$ y = [-36, 117, -223, 194, 54, 245, -32, 209, 46, -9, -15, -328, -30, -29, 220, -65, 179, 12, 57, -159, 126, -252, -90, 112, -101, 220, 64, 50, 21, 79, 77, 86, 100, 423, -237, -253, 161, -232, 6, 39, 105, 67, -274, -218, 136, -188, -195, 80, -211, 15, -257, 129, -9, -18, -24, 15, 10, -190, 114, 1, -39, 52, 111, -24, -59, -100, -48, -88, 99, -64, 111, 30, -86, -47, 252, -232, 407, -69, -90, 59, -49, 16, -243, 97, 60, -197, -77, 3, 87, -96, -12, 160, -28, -165, 196, -22, 0, 5, -185, -24, -181, 31, 109, -41, -142, 50, 95, -92, -200, -112, 150, -71, 19, 42, 142, -26, -25, 31, 58, 99, 46, -22, -172, 144, 305, 34, -132, -76, 188, -58, -27, -34, 76, 117, -170, -49, -17, -8, 130, 207, -224, 99, -130, -78, 76, 225, -101, 154, -86, 35, -32, -195, -113, 161, -411, -34, -62, 67, 250, 7, -11, 58, -15, -11, 97, -123, 16, -150, 96, -88, -25, -22, -44, 38, 29, 138, 158, -290, -64, 79, -57, -195, -201, -106, -63, 111, -290, 119, 57, 154, 162, 87, 147, 94]
6100I4l8q9o7L85l61j3J35j16J07j26K22N5k24n4K42k51m7K73k03J95j65m3L19
6123B30k53j11K71R1j63K6P4j41J40j37k88P0m4K61j57J91j7k15K14O1o0J50j26
6146F7j75J28j0K02j38M6o9J4j65K22M5l39M5K08J27k30j9K29l80J55q6M10k98
6169a1k84P6K30j31L5k01J31J89r3k37K51M0N5n9l8Q3N3j27k7N9K9N0P4K9o19
6194d43N20p9J12k48L97o8q7j53P0K84p5j30m63L48j02K07j2j17l6Q7l49N70j48
6217H5J0k63M37m97K42j73K35n9q4l4K2K3J94J58k39k6L55o01J12J30O2j03K6
6240A2J25Q0l28J6P2jQ1j33J07M7q3Q6J08l20M5J84j99j57M7J96J55k89K08j23
6264f4k6J24k66M36k80M3J38j93L40l02J3j4L5M9K8J53l32O5O5J47j03j3j23P3
$$ y = [94, 56, -33, -100, 285, -76, -89, 46, -70, 37, -89, 133, 188, -36, -90, 152, -99, -146, 127, -76, 119, -46, -89, 230, -23, -134, 137, 228, 65, 91, 165, 24, 164, 27, -261, -191, -235, 26, -131, 60, 43, -172, 42, 103, 43, 193, 67, -108, 20, 10, 212, 74, 120, 51, 65, -100, 122, 167, -172, -127, 81, 208, -22, -41, 188, -192, -37, -123, 287, -11, -295, -219, 11, -120, -85, -286, -155, 34, -59, -296, -45, -5, 50, -9, -47, 36, 89, -38, -65, -6, 23, 73, 147, 176, -443, 77, -2, 110, -138, 259, 191, 104, -49, 21, 305, 230, 100, -363, -15, -117, 90, 78, -39, -75, 12, -337, 233, 85, 95, -168, 269, -228, 14, -159, 76, 17, -67, -101, -79, -56, 138, 296, 57, 31, 386, -215, -103, 27, 89, -14, 12, 137, 217, -111, -95, -23, -24, 57, -76, 31, 78, -5, 81, 189, -131, -86, 98, -101, -258, -211, -15, 140, -149, 59, -64, -90, 34, -232, 204, -76, -33, 105, -88, 252, -50, -37, -51, -16, 33, 61, 214, -118, -53, 12, 159, 56, 43, -80, -7]
6288gJ72k71J79q8J75l23J41J50k13J33J77m48R7K02j05k6J52O7k06m3o5J39M4
6311C3j98J32K93l16K5p3L69n2J15j66oj83M7K01k01J45j25p1n8J71M4l2J2M7
6335A53k72M01l96j11K90k28J04Q0j14j8J94k65K02K03k63L18l03l1O2k17N8n1
6357b04L38k32j77L08r4k27K99j02J36l79L35J30j31M9q8k25L71o7p5M9k17L42
6379A39m1k51K70qp8R5k82J49j38Q0J15k61L63ok05k40Q0L14r7M0j48L49k83j72
6403b16L43j46Qj8J00j84L37j56k86L17LJ9l1j5o7k0k0j38K59k8l5R9J8o8j63
6428h8J87j89n7R8L2J82M0k71j5J1m0k3R6n1O4J71j65J09l2k50J46p5J30L2L0
6453G2Mn0k95J55K17l74M49L8l21L23L7l09pJ90Q9j41J10k62J75q6L7o1K27k92
$$ y = [-7, 165, -106, 73, -15, 160, -163, -22, 128, -85, 48, 225, -223, -126, 76, -29, -55, 97, 164, -42, -85, -150, -11, 33, -165, -33, 260, -56, -31, -104, 265, 213, 328, 162, 156, -27, 20, 221, 20, 165, 40, -31, -89, 82, 126, 94, 106, 153, -119, 282, -114, -225, 65, -163, -59, 21, -93, -111, 83, -182, 20, 223, -40, 278, -25, -56, 6, -211, -153, -204, 134, -98, -275, 33, -61, -288, 11, -91, 45, -334, 1, 131, 0, 49, -39, -264, 107, 40, -35, 14, -203, 139, 98, -153, 117, 109, 31, 126, -156, -7, -145, -65, 50, -211, 152, 146, -59, -299, -219, 95, -2, 38, -110, 239, -44, -216, 127, -19, -11, -29, 71, -113, 224, 68, -218, 99, 102, 121, 90, 75, 8, -12, -32, -170, 89, 61, 26, 125, 143, 75, -88, 99, -90, -147, -49, -17, 165, 205, -66, -81, -70, -110, -133, -37, -88, -24, 147, -18, 91, 59, -191, -45, -120, 10, 42, 72, 76, 26, -269, -114, 103, -271, 178, 216, -105, 218, 255, -54, -61, 129, 218, 77, 187, -75, 100, 14, 51, -10, 217, -75]
6477g5J85j30J17Oo2O0q8Q8j40O7K3j8L2J67k85l15N15mk06k13J31J4J47L1J09
6502A56j89n8J37j01J50j15QJ14J9j47P8K35l49r9R7J19k79K19Q5j06rn0j44J89
6526d0Kj4k0K47l8R6o6k78j4k0R8J3K33k58K10k97K41Ll00K64p8o6J82j88J42
6551E4j30K50k98K59k03r3N1n5L08j90J10k23J92J00o88N83k6k63J29K15k59J43
6573c4L7k23J70r7J63P0k4j57q6K89j01j76J97j7J29j92K73j94k29J48K02K3j83
6596a2J93l09K42k73n7K19J82Qk56j69K61n4j4j16L8K34j74J93qq4k45J46j27
6619a82J41O9R5q2j84K20L0K9j83o8L5p9P8R1Q6j41J86j16j7j2N8L66m61n9J01
6644AK04j42L6l05O6L28l41j27L33m8J31q6O8j95J00r1J77k23Q4j5N4k2k21Q9
$$ y = [-75, 110, -20, 97, 103, 41, 101, 13, 101, -39, 28, 51, 33, 65, 232, -53, -368, 147, 143, -63, -276, -145, -131, 16, 47, 156, -33, -91, 46, -55, 95, -20, -12, 102, 121, -26, 52, 287, -62, -161, -64, 55, -224, -5, 80, -26, -35, -85, -229, -40, -38, -52, -72, 175, 137, 233, 167, -111, -125, -145, -47, -34, 199, -59, 151, -146, 95, 98, -202, 62, -16, -82, 100, -88, 54, -76, 174, -124, 135, -68, -161, -110, -165, 143, -47, 63, -160, 32, 132, -556, 27, 1, -262, -133, 82, -177, -34, 3, -220, -50, -147, 16, 86, 62, -95, -181, 108, 7, -169, 28, 11, 140, -52, 221, 27, -202, -54, 148, 171, -12, 181, -128, 114, -159, -216, 3, 185, 193, -63, -232, 29, -25, -39, -155, -117, 117, -57, 136, 128, 44, -201, -55, -182, -41, 28, 123, 41, -143, 77, 107, 136, -47, -115, -80, -159, -81, 10, 96, -45, 141, 25, 8, -4, 54, 420, -41, -100, 1, 205, 63, 99, -206, -140, 188, -153, -280, 53, 5, 136, 50, 118, -77, 23, -68, 109, -114, -30, -45, 9, -13, -234, -145]
6668a45MR6K03j82J25j41J12j08M1Q1L4k56j03L8K95j87l01M83r8R4k95K91J83
6691B64k61k0j99J31o3j9KM48l19J69K3m03J68K21M5j56R6k01l4k3R7K16k54N1
6715b1p3j16J96r5J99m17M34k76k5K86j20R5j06k2O2N6P5J5J1k96Q1O6j29J56
6739C6Rk50K15J52j39M9N9q7J72l76J07J15Pj55L47n3k66Q8j05J3j12K45O9q2
6763E8M9o7j55K89l63J1k7J86j39pK61j50J34o3j3K93n39L41q7j07M5L7O6N6j23
6788a4j0j03J39j09p7K6J06OJ86k20J17o2k14K97j25Q5J22k1q3j34k5p3J26K25
6812A65p5R2k02PO9nk28Q8k6J76K1j4N1m16K46l63K90M0pO9K8l5O1K44k77QNj30
6840a18L7Q2k45K53O4j50j4J9p1LM1J63M4k46n9K39N1j91K16j89Q0n7k4k1p7L02
$$ y = [-145, -141, -45, 158, -24, 101, -40, 72, -36, 5, 86, 120, -136, -239, -201, 94, -93, -394, 89, -9, 85, -210, 81, 264, 3, -17, -216, -85, -148, -167, -165, 283, -36, 133, 156, -247, -79, 142, 187, 31, 127, -74, -108, -131, -34, 182, -72, -21, -94, -210, -14, -109, 90, -327, 107, -169, -194, 92, -28, 67, -39, -61, 1, 57, 132, 147, 158, -138, -57, 9, -120, 36, 45, -205, 10, 162, 23, 72, 131, 44, 216, -160, -53, 62, 69, -86, 261, 208, -58, 30, -75, -62, -174, 71, 140, 58, 107, 40, -115, 174, -189, -178, -205, -19, -158, -165, 96, -54, 80, 17, 4, 297, -242, 99, 12, -95, -50, -13, 53, 109, -14, -24, -127, 12, -97, -174, -148, -42, -36, 150, -70, 47, -15, -229, 68, -57, 28, 150, 129, 46, -88, -113, -186, -60, 165, 90, 182, -20, -13, 56, 51, -177, -89, -115, 61, 82, 68, 119, -297, -51, -414, -124, -84, -91, -22, 6, -29, 32, 276, -1, 7, 12, -118, -81, 1, -244, 9, 73, -77, -91, -72, -143, -140, -99, 64, 108, -138, -197, 42, 93, -98, 118, -71, 9, -48, -72, -93, -170, 132]
6866A32j14j0j24L5K18j18K56l79n5K41j16l57L57q2J11m6o7J19j34J36K77k0
6888B60l27pj19L53l6j05Q2R7j68L51k46l78K01J17k06K76J4O4l76k8K00p3n0
6911a04Q8j8J68k76%K86l67K49j39J00j72J61J63j8k88J91n0r4p7J71J17J05l30
6934a34R5R4J5K36m63K30k31K87j63J24nQ7k50N8J77k4k36N3j11K38J45k94J6
6957e6j29K10L28k42K5j63J41k78K26j37J16m9p3j12K21j53N8P7Q9oj21j88K87
6980G1j27m6J95J4NJ29k42O5k9J5L5m2J11k95K65k41Q1%k92K75O2qJ81j37k49
7005b04J95O0j96K12L1k7m2r7n8L42k08j27K25j23oj32J84k27K13j8j58J31L9
7028Ik00L08k49K16j64K39l77Q8J18j3O6n6j27O9m2L57l09j75J09J89j29n1J10
$$ y = [132, 18, 8, -116, -81, 137, 19, 275, -104, -159, 82, -34, -391, -34, -116, -5, -51, -118, 1, -133, 3, 280, 260, -67, -74, -193, 160, 124, 19, 101, 198, 30, 381, 135, -243, -42, 75, -131, 145, 159, 223, -153, -181, 19, -54, -104, -16, -34, 134, -142, -142, 144, -223, 26, -113, -13, -185, -24, 139, 121, -167, 24, -26, -120, -197, -26, 91, 196, -134, -39, 55, 70, 306, -157, 73, -158, 129, -34, 90, 85, 172, -78, -20, 157, 133, -103, -50, -161, 77, 222, -72, -56, -185, 25, 353, 111, 136, -27, 114, -164, 62, -75, 41, -8, -81, -193, 28, -125, -67, 10, 99, 93, -28, -216, 71, -56, -102, 93, 107, 112, 241, -1, 64, 35, 50, 85, 43, 154, -141, 124, -117, -36, -36, -328, -53, 9, 1, 182, 45, -204, -9, 51, -145, 67, 98, 71, 29, -68, -126, 216, 8, -119, 106, -17, -23, -155, 29, -198, 15, -3, -161, -30, 9, -191, 117, -132, 84, -80, 159, -218, -130, -12, -25, 41, -15, -142, -73, -115, 242, -67, -242, -133, 56, -73, -124, -14]
7051a4J62j11J4J7j71J24J30j73p5P9n8L22k81K50k79n1O0J96l5L5k92J07J48
7074A04k03L1K89k21n0K68p2p9nk08j36J09O9J56n9J22j39K60j38Jl86K72J94
7097A79k82K45k35J9q3K41o4L41j88k9Ll38L39l77L97k29N9N9jj67J22j89J81
7120Cn4m2L86Rk15j08J32k24K81N6l49J51j44K30j62L9K9m8J30n3J47j18j63o0
7144a47J81r4K9j2K13m92L63J15j46o6QR6Oj6k39j48K26M11k06m5Nl22K41j11
7168a50J9J21L9j76K50j66j9R8p4K13m2k60pJ66M3J45m01L71j66l3J38l16M06
7191A99J7m00J11J34j84J98m6k88M46j4l8k21J64k21L20j15J62k60l2J46M8l25
7213a99K14j02K92k14N5L9k04N9q2J41j16M25k20Q9N3k39L87p9j96q6J7m5Op0
$$ y = [-14, 148, 37, 51, 68, -103, 21, 151, -22, -97, -18, -76, 246, -35, 215, -64, -115, -55, 141, 106, 141, -151, -44, 104, -99, -68, 221, 0, -50, 218, 146, 67, 62, -146, -282, -173, -104, 52, -7, 115, -24, 236, 98, 99, -287, -15, 179, -103, 142, -93, -74, -157, 84, 20, 361, 173, 144, 147, -191, 148, -229, 168, -61, -2, 57, 56, -111, 11, -178, 3, -51, -93, 293, 302, 87, -21, 111, -113, 168, 224, -125, 26, -118, 112, -50, -11, 18, -30, 100, 47, 194, 76, -87, -147, 34, -60, -31, -43, 170, -322, 41, 156, 10, -56, -48, 48, 54, 38, -201, -349, -123, 288, 82, 37, 42, -280, -39, -150, -131, -10, 29, -147, 103, -63, -82, 16, -58, 155, 113, -147, -154, 12, 55, 200, -201, 170, 4, -29, 109, -207, 199, 216, -184, -73, 61, -123, 75, 29, -259, 187, 173, 135, -86, 78, -143, 177, 62, 224, -36, -68, 78, 126, -199, 15, -87, 205, -9, 46, 85, -119, -60, -142, -1, -117, 308, 88, 177, 230, -9, 378, 299, 103, 17, 34, -11, -5, -75]
7237g5M6J97n4J89p5j13j55jr8J09oJ61m9J81r6r2p0k6K3J76k51KK80j79O6j22
7263c2L7m6J58K20l57P8j0k08J28K3p6R2j43j33M37j09R4j93J94q4j42o7J32K09
7287B02l10j36K11j8m1J79o9J71n9q7l9p1RL09k18J9o1k0j0r3M7m2P0K9m4K16
7313A44l8q8J08O6r7m0P5j96M1j33K8K06o1j62K98m04K53n9J07LN9j90k6O3l8
7338h1K58j48n8k22K31Q1l1j55L21j23k40K38P5K36l34O0j16k63J83M4OJ41r7
7361FJ42k13K82k21K73l40J86l9n8J19k49J77l9k75J17J43j92J93R6k00M4p9j34
7384b61J96J8o6J7k4M70l80J01q0J39n4o8j0K9R4j78P9O5O1O0q7k24J47Qj38R2
7410FMm3K66j72J27k12j3j32J24R2k66K53P7k76K77m2R1l49K20j04N8lK20k27
$$ y = [-75, -29, 168, 114, 303, 228, 115, -40, -41, -139, -30, -36, 125, 76, 257, 161, 69, -1, -27, -4, 172, -79, -77, 203, 24, 90, -32, 5, -41, 117, 337, -20, 58, 48, -160, -32, -9, -85, 7, -136, -269, 168, 59, 153, -40, 154, 70, -72, -139, -7, 202, -108, -244, -33, -51, -92, 87, 18, 189, 130, 43, 4, -67, -58, 251, 33, 52, -9, -29, -39, -132, -85, -127, -57, -28, -72, 144, 106, 18, 126, 192, 95, 55, 130, -66, -25, -158, -130, 76, 15, -147, 151, -253, 0, -59, 48, 51, 110, -80, -106, -43, -81, 177, 29, -29, -251, -20, 61, 30, -125, 196, 73, -167, 71, 146, 382, 48, 108, -8, -271, -88, -44, -38, 103, 6, 148, -65, 217, -4, 269, -71, 115, 76, 18, 137, -112, 65, 26, -249, -132, 11, -181, 12, 108, -92, -48, -127, -261, -65, -47, -113, -96, -120, 350, -30, 71, -9, 130, 76, 8, -2, 27, 121, -57, 22, 87, 148, 208, 121, -103, 44, 52, -86, 6, 10, -33, 233, 61, 188, -24, -37, -169, -45, 47, -219, 34, 111, -165, 112, 70, 161, -188, 32, -72, -14, -17, 203, -24]
7434b4k22OJ4J04O3J60l9K40j83K1J87k94j65L6K31j71K95k66J92j12j24J78j28
7457aj06K4J00k92L20m3O0K4o3KJ29m0m94M28J20k25n7L9m1M04j30l05L6J73k48
7482a86K73l2M3l1jj38P1J14n0j27J43K1k00K26l61K35K02l79K71k03j48J65J16
7505B4l8J82l54L37o9P0j68k11K89J66j72l4K4J0m8J57N4j36k04J53J00j1k10
7528h9o7L52P3k72R4k0k48M14k57K30j68k32j56J43J71K2QP0Po3M3r5l53M01j3
7553eP1k64K25p7N6K33j77l13R1K27j21L4L6K34k26N1j53J61n8j23Q1K6j38J87
7577E8J98nl7j89j73L26j21j11J45j14L9j23P0L4j54J09j95L15j45R0KJ54m21
7600b48J38j02L14k25L68m3m1l01M6J83J12k12k14K50M5L0oj7Prk4J14k68O8J37
$$ y = [-24, -246, -240, -226, -122, -59, 101, 62, 302, 119, 140, 327, 33, -132, -96, 135, -36, 259, -7, 185, 73, -51, 127, -1, -107, -83, 17, -275, 45, 2, 62, 86, 23, 25, 154, 114, -380, 48, 168, -57, -114, -75, -116, 288, 158, -147, -111, 62, -186, 87, 55, 98, 67, 66, -72, -1, 113, 63, -64, 79, 100, -100, 126, -235, 0, 202, -177, 94, -109, -257, -92, 24, -14, 168, -186, 151, 82, 152, -16, -227, 62, 228, 56, 22, 46, 56, 8, 165, 219, 83, -121, 32, 132, 121, -89, -156, 196, 269, -3, 91, 71, -177, 237, -20, 210, 42, -190, -346, -203, -32, -10, -2, 68, 75, 12, 55, -40, -393, 8, -5, 66, -198, 27, -50, 6, 239, 62, -251, -160, 67, -54, -20, 16, 250, 24, 75, -78, 83, 25, -98, -17, 9, -129, 58, 256, 251, 214, 25, -148, 178, 57, -54, 91, -23, 16, -107, -37, -3, -157, -48, -243, 72, -73, 17, 19, 173, -248, -110, -212, 102, -123, 245, 202, 161, -140, -94, 89, 201, -11, -225, 25, 70, 100, 94, 77, 84, 75, 51, 165, -103, -35, 102]
7625A02o5q8j36K54P4k82K60R4l53P3p9M9M46l75l31K21j26K91n1j71J53m4r3
7648a77L1K57j02j05N2J47k04R2j85K21j37Q8K7L2J06p3m2rk9p6P5k8p1p7K21
7673C4O1l60O6J45K17l66K71j4Q9k46L37k90K8j59m6K50OK31m31K80k37M2P6j63
7697a79Q3k4K21j78m5K32j03j88M55k19j34L90j81N4l28r1J02q0K98m2P5m64L04
7720d2P8l52J66K75k19q2O7J29J99k44J79k96N2K46j37J88j33J58m60K23O8q5
7742b2J1J41k31J89n1j86K3J18J50o1K9j48K1R7k81M21J25r7k97j04K74O3m24
7765b40P8L65k34Om3J15O9j03j00j46K43k8Kn9J82k4o6k05K52l86L32j01J19j63
7789a35K05k38J54l3p8L80k14K69l17M3K34k06j17J11j11n7K36j9j9N2Rk8j7j16
$$ y = [102, 37, -51, -187, 67, 141, -141, 119, 213, -140, -67, -146, -97, 349, -26, -357, -136, -262, 29, -22, -193, -40, -84, -177, -146, 111, 9, -96, -44, 103, -101, -9, -194, 27, -110, -22, 5, 37, 143, 70, 28, 19, -10, -86, -11, -39, -110, -187, 34, 95, -265, -199, -54, 163, -203, 68, 54, 143, -103, 234, -56, -28, -187, -233, 17, 23, 254, -177, 103, -134, -92, -16, -179, -96, -120, 101, -77, -122, 110, 7, -181, 274, 55, -79, 311, 130, 184, -144, -235, -133, -213, 85, 43, 118, -346, -42, 36, -316, -150, 125, -94, -176, -109, 20, 219, -25, 154, -142, -90, 156, 19, 207, 74, 232, -228, -5, 63, -22, -11, 130, -101, 88, 37, -149, -126, -8, 142, 81, 110, -38, -17, 80, -201, 220, 345, 248, -49, -153, 121, 184, -240, -162, 203, -31, -25, -68, 47, 116, 13, -87, -233, 10, -18, -16, -75, 107, 83, 17, -188, 64, -322, 10, -91, 28, -135, 70, -168, -14, -47, -125, 255, 41, 310, -7, 36, 270, 64, -53, 58, -53, -110, 126, 107, 88, 140, 149, 121, 104, -12]
7813a2M9K6j27J14N7k3J25l44k9K62q3m6oj60K70j21J67R8p4l08J97pl4J06m9
7838D8j1jm0K0O3J9k16PK84J8J10k80n2Q3j25J19j68O1j16L94J0M2l00o3L5O3
7864Dj5J89j88J7j94J82J01L8j22p0oK00J6j70r7O5J85j28j18J47j64p1L51k01
7888d9Q1K1j47J46kj4N0m9J60m59L40L2p0L9J01l00J95K4J5j06j45N6j3K15o3
7913E8J13R2l06l6J12q7J91k0k12L41p5m8j22l52M29j38p9R5r1n0M59j95j18j46
7937a85K51l1r5M9j24n6K74J84j75j05J23k63L02j47j96L68r4j62J33j74N4Q3
7959A4J35l8Pj88J03j02j52J6J55lk02K71j29O6NJ05j50P8j47N7k32N26O7n64
7983c02K68J92M8j56O9j98j32K02n4L03K37n78R2J06m3l1j05Q1O9o2QP6q0J16
$$ y = [-12, 37, 63, -64, 50, 107, 84, 209, -135, -164, 98, 15, -31, -37, -197, 73, -48, 119, 217, 143, -165, 32, 25, -9, 97, 48, 37, 36, -4, 16, 79, 98, -118, -111, 173, 191, 301, 21, -31, 52, -73, 46, -122, -61, -177, 217, 227, 269, -31, -94, -59, 4, -11, 178, -10, 7, -187, -5, 96, 134, 12, -58, -64, 136, 152, -18, -115, -50, 135, 7, -111, 36, -128, -199, 152, -49, 32, 53, -94, 52, 50, 36, 86, 37, 197, -262, 78, 110, 40, 79, 180, -120, 75, 99, 114, 8, -137, -81, -94, 121, 58, 171, 263, -43, -79, 33, -54, 137, 117, -95, 246, 171, 123, 1, -351, 78, -60, -139, -44, -135, -185, 274, 79, -39, -185, 66, 35, -60, -11, -135, -191, 83, 267, 92, -13, 110, -153, 149, 2, -194, 174, 80, -82, 51, -123, -69, 14, 149, 111, 118, -70, 33, -69, -221, -205, -50, -53, -255, 16, -113, -47, -42, 63, -87, -9, -156, -99, -331, 195, 262, -302, -34, 158, 206, 50, 119, -79, -211, -9, -63, 240, 477, -101, -9, 97, 54, 23, -82, -1, 68, 6, 14, 90, 10, 126]
8007A26j00K19j25k49M12l70j7M3o4o5J77j91qK61l32L43k25N6K19j79r2j23J82
8030a02N4j72J38K27j25k21J53k38J90O9M0J04j7m0J8k58K65l5Qn9J10jk93M2
8054a43JJ20K22j75k20J0l3L21r4j34L76k10k65L57o3j13o1J79o4M6M6l13L73
8077A63K93o17Q6J56J0N3K4m21J14M6K68O5n40M28j03J22m7j60j81Kj68L02j06
8100b11L10l8l1O8j44J49p7j77k1K47j79o6Q6K41l29J60K6j03J93k5j34K14j30
8123B9j37J65N8p7Q4j17l11L58K2j68J69j39J17M0j68L18k14j17J54k36K25j54
8145i9k2j29M10m70M55j33J19K3j90m3Mj97J96J15k55J64O9k27J11K00K2k20J44
8168D7P5m33M34j74k5K87k09k13j07M13m7K51l84J15j65J47j78P4J71Q0j5m03
$$ y = [126, 26, 245, 120, -129, 283, -87, -104, -61, -125, -190, -13, -204, -212, 49, -283, 60, -165, -109, 110, -69, -161, -284, -102, -48, -220, -82, 145, 20, -201, -48, -286, -96, -27, 13, 117, 100, 60, 78, -180, 85, 50, 58, -1, 109, 108, -185, -143, -142, -22, 200, 25, -195, -185, -218, 103, 9, -125, 251, 41, -224, 133, 70, -43, -104, 75, 11, 57, 103, -210, 163, 456, -161, -75, 81, 91, 144, 168, -253, -139, -93, 175, 240, -300, 128, 25, 147, 100, -60, -241, -239, -407, -105, -211, 99, 61, 30, 98, -46, 103, 26, -151, -172, 75, -104, -170, -84, 157, -172, -12, 14, -89, 104, 79, -55, 159, 29, -108, 57, 115, 38, 122, 5, -306, 52, 74, -94, 75, -64, 53, 93, -75, 243, 29, -88, 66, -170, 55, -99, -121, -250, 160, -310, 145, 12, 131, 154, -36, -79, -75, -272, -76, 39, -216, -52, 17, -210, -99, 101, 123, -97, 47, 122, -311, 123, -51, -76, 211, 2, -211, -318, 95, 48, 299, -85, 30, -135, 12, -166, -92, 79, 159, 144, -259]
8190b59k4
$$ y = [-259, -283]
8191b83
$$ Imaginary data points
##PAGE= N=2
##DATA TABLE= (X++(I..I)), XYDATA
0@%%%%%%%%%qJ6j6K4l2L6m4N6p2Q8j06J30j60J92k24K64l12L64m24M92n69O53
31C48p45Q49r63J092j235J388j559J748j955K180k423K692k986L305l652M033
47B117m450M903n399N940o538P200p928Q738r643J0661j1817J3139j4670J6468
61H721j8612K1221k4477K8676l4333M2439n5262P9993k09457L06345j87759J8460
73b4045K13499l36272L26030l19912J39605L8617j05246J38256p5155L3226o406
84B2197p0971Q0547p9875P716Q5024p9027O1312N831m0978M1688r6576P6163j0266
97B785n9180J03352m4934O511J7874p6061J15414j35369O2547O0152j18142J56938
109I1887j43352R6398m2124p4584J42959j61480J29726m3608R92L8489o7996O7778
$$ y = [0, 0, 0, 0, 0, 0, 0, 0, 0, 0, -8, 8, -8, 16, -16, 20, -24, 32, -40, 48, -58, 72, -88, 104, -120, 144, -168, 196, -228, 264, -305, 348, -397, 452, -511, 581, -654, 734, -825, 923, -1032, 1148, -1275, 1417, -1569, 1736, -1916, 2117, -2333, 2570, -2829, 3111, -3427, 3773, -4155, 4583, -5060, 5601, -6216, 6923, -7747, 8721, -9891, 11330, -13147, 15529, -18804, 23635, -31627, 48366, -161091, 145254, -42505, -24045, 189454, -146818, 179212, -140700, -1095, 37522, -67724, 70532, -4623, 28603, 22197, -48774, 31773, -48102, -40386, 44638, -34389, 26923, 32754, -8224, 33464, -63112, 13051, 2785, -56395, 46957, 2023, 8534, 26408, -49653, 65761, -69608, -7061, 53091, -65051, 91887, -51465, 44933, 2809, -71775, 71184, -90296, 39430, -4178, -3186, 35303, -32693, 35085]
121C5085o4297K1612R181j20j667J8997j4379P033j4691k4234N5427p3409O5636
134B0174j2566j9054M7317o8525N9007m6450Q43M1950n2084N5212l0408J0829
146F245J3315n3830N9601n0099K1911J9397l3008N0879n4849M0187k7094j2336
158a9681L6626m3543M6540k9456J9271l320j6276J5593j7544J2585r457K0923
170A2261j5854J5371j2046K77N726k7576L9337l4688K9397r672r519K8733m8621
183b6874M4026l1610Q481K0957l5104M5168l9079K0058J537k9234M1109l7327
195a7892K6619m307j1989K5277l3059K4202j3270j940J3627j4883J5186r151K370
208G90p00j232l529O131k943Q46R170j7491K1564k1604R793N210k0845L3217l2946
$$ y = [35085, -29212, -7600, 1581, 1461, -206, 18791, 4412, 11445, -3246, -27480, 27947, -45462, 20174, 7608, -11446, 35871, -32654, 26353, -20097, -19254, 22696, -29388, 25824, -4584, 6245, 19560, -34270, 25331, -24768, -2857, 16540, -16468, 34411, -20438, 19749, -7345, -19681, 16945, -26598, 19942, -9514, 9757, 6437, -9839, 5754, -11790, 795, -8662, 12261, -3593, 11778, -268, 9, 5735, -21841, 17496, -17192, 12205, 2533, -6986, 21747, -26874, 17152, -14458, -5977, 14980, -20124, 25044, -14035, 6023, 7560, -21674, 19435, -17892, 8727, 4420, -7569, 17708, -15351, 8851, -4419, -6359, 7268, -7615, 7571, -1580, 790, 90, -1142, -4671, 1460, -1483, -637, 8533, -8958, 12606, -8998, 795, 6005, -14840, 18377, -14569]
223a4569K4302p390j4537L0470l9458L3327j5554l387K1790l0746L0266k1884
235g370M711R811j9324K2856j5965P960J013q150Q673q253L628O91n22N29L183
250C471n572L649j311n972J0724j1884J1928l941m610J2864j9733J7354j0919
263c952n58J3287j8780K0938j4950M157N373j5937J8182j5461J0080L33o363J0695
277G044j1929P062l824j324M444l218M007p89k81j224M39l339L139j413Q27M262
293C883o033O628o145M38K011n946Q227n293L950J571n651O330q043M059o57k021
309b692O582n371M692k428j778J949m683L767j091J429J066l19k52p12j104q69
325a814J541j463L672j955J900j5l886L499n395M087p53J13L663m381L978l941
$$ y = [-14569, 9733, 2343, -12194, 18276, -21182, 12145, -3409, -6796, 14994, -15752, 14514, -7370, -2659, 7152, -12172, 10684, -5281, 2679, 3692, -4458, 4215, -4038, -410, 281, -241, 288, 3471, -2101, 1548, 237, -5735, 4989, -6895, 5033, 1092, -3518, 9346, -10387, 6967, -3952, -4510, 8777, -10003, 10935, -4015, 142, 5515, -10422, 7760, -7701, 2379, 2712, -3651, 7044, -4885, 2177, -1647, -2971, 1473, -1745, 2262, 1473, 1192, -32, 407, -2932, 207, -1206, -379, 3883, -2150, 4478, -1667, -1229, 782, -5164, 3063, -2230, 1720, 3291, -2360, 3970, -4073, -14, -671, -2692, 3890, -1481, 3211, 783, -995, 954, -3729, 38, -1053, 376, 1442, 1123, 871, 159, -945, -1814, -273, -1736, 1936, -19, 1881, 1866, -2020, 1479, -3916, 171, -582, -469, 3194, -1187, 2791, -1150]
341a150J9N65k121L868j755K314l72q49J32k619R84m68J270O45O99K25j137L28
359E78k182R82o22P76J908j761K961l118M72j62k635L955l291M037j031p58K394
376B503n103L694l285J269J467j402L481k768J754k250j35J99j153J950l06J428
392A343q33L60r49p07M04j217J721l19J382K26j981J559k587J080J48q58K888
409A660k391K457j339j501K272l823L567k007Q37K193k862L087l361J313o17q47
425a362J871j136J535n37J65o19q8o21N08j14L18J177j085Q47o49l67J71j017
443a003J308n21M71Q62j254Q20n74q22J097j798K205p87J20J618k839J931k210
460a376J114M78j444K358j720J243q6j029P62j184Q12n7o9N44j7j00j19p57M79
$$ y = [-1150, -1131, -566, -2687, 1181, -574, 1740, 1368, 519, 651, -1968, -984, -1452, -182, 463, 1162, 1387, 250, 578, -1604, -622, -1244, -468, 1440, -321, 2640, -478, -6, -168, -2803, 1152, -2139, 1898, 867, 109, 2503, -2600, 1094, -2191, -922, 545, -857, 2624, -144, 1610, -640, -775, -576, -1729, 221, -85, 1343, 510, 870, -79, -786, -382, -1599, 122, -197, 1185, 1411, -570, 989, -1598, -518, -370, -1228, 1660, -731, 1726, 387, -1114, 1158, -2665, 902, -1105, -268, 1925, -937, 2150, -1211, 102, -515, -1362, 509, -627, 908, 371, 536, -83, -171, -792, -284, -398, -80, 1097, 12, 859, 210, -157, 14, -1003, 305, -216, 255, 1117, -137, 683, 109, -713, 384, -1414, 791, 4, 124, 1742, -1097, 834, -1376, -262, 216, -1228, 1130, -590, 653, 567, -462, 300, -884, -72, -129, -198, 346, 329, 229, 110, -647, -168]
479a68l17O4J022o56R22n80l70J95r50N12L00j36Q16l10p5K57p90K74l62k67J097
500D78j276J622q90L73k24q64J141j707J259M68l27O55p65M46o77m90O65l32L58
519h7O72o05R01j047r8l9n44J099n05P06j5k41J84q65K92o05L31K95N24K80k65
540C68R3q63L45r97R88j01M02N75p30N89j181J09j84l26J110L44K70l76k26k13
560dp41l3O30j06P90j89n4K36r37L74r22P54Q8J60P94m58L43j124J9j96L16M22
582A62L4O96m80N5q63N8m20j7P76Q2P83l80M9p51l65L34k64L46O38J98k02j92
604B77k18k49o84M54j7N43M74l28O03q80j16m64m2L87K23N76k38M21l81o46l90
625f95J88M25J00P29l22J29n25j59k83j96L43L96L71l5J35k56m88j43J1j84N91
$$ y = [-168, -485, -421, 601, -55, 867, 287, -83, 112, -838, -326, -26, -162, 654, 344, 269, 526, -264, 10, -352, -619, 478, -798, 824, -66, 307, 83, -781, 360, -1347, -88, 380, 53, 708, -57, 389, -288, -778, -113, -445, -87, 585, -20, 881, -166, -264, -303, -847, 252, -253, 453, 438, 197, 381, -484, -192, -797, -466, -171, 353, 633, 368, 461, -402, -57, -1054, -66, -167, 235, 810, 80, 669, -512, -403, -587, -913, 197, 541, 811, 435, 209, -4, -745, -778, -148, -254, 536, 347, 293, 529, -408, -34, -956, -202, -114, 46, 840, 382, 725, -399, -380, -576, -260, 162, 196, 892, 412, 467, -396, -338, -758, -775, 1, 83, 866, 486, 535, -216, -581, -247, -511, -165, 473, 671, 469, 277, 59, -190, -874, -420, -437, 106, 580, 252, 855, -25, -141, -605, -647, -260, -37, 539, 301, 722, 341, -305, -695, -507, -82, 18, 747, 425, 554, 29, -130, -413, -609, -266, 130, 501, 466, 601, 345, -143, -286, -275, -459, 132]
646A32K90m6K01q63L66o78J87RM9Q28n4M5j69m88k59j80J9P26K00J32J42o19J82
669A52o69J23LQ7P53j6K60m73l62k04k18L96k01M47L96j12k53jp90K53K45r3Q09
692E32m62P14o19j20l61k35L48l5M26j1J16K47l22n92J31j69L36P3r7P93n94J42
714B41m73l45N73l60O09n2J54j32k05k76P5k92L34J18K01O61p20Qj77m05Q0k19
736f02P96J92K47j70n07K74p08N4M78k23J12L76j25J65n11N9j65r4N27qM41l31
758B77k59Q1o15N08m75M79K29j08K16o7l81J67l81K42QQ1N18m92L92m36l01l5
780c52j78J90L52K28L20o50K27l41m44L82K30LL02p0M32p06k10P8l49N89J44J25
802C02K28p25J76k62j02K42j56P58k27r6L13n45J25l16j91N99j31M09k98J82L0
$$ y = [132, 422, 376, 577, -286, 80, -598, -411, -402, -353, 475, 421, 466, 297, -191, -450, -630, -611, 115, 315, 447, 589, -30, 152, -517, -394, -391, -304, 449, 433, 693, 220, -142, -346, -564, -168, -369, 78, 474, 362, 109, 108, -682, -429, -184, -277, 532, 70, 784, 165, 45, -316, -551, -203, -238, 188, 177, 293, 540, 218, -374, -243, -412, -76, -3, -100, 693, 99, 241, -232, -577, -4, -364, 245, 193, 347, 215, 10, -266, -191, -483, -149, -31, 170, 831, 111, 119, -58, -463, -383, -602, 194, 386, 633, 463, -44, 230, -478, -424, 54, -169, -57, 319, 194, 359, -152, -93, -258, -352, 175, 167, 608, 277, 18, 99, -516, -8, -483, -4, 225, 117, 333, 266, -115, 52, -329, -87, -79, 2, 520, 28, 420, -16, -317, -352, -530, -340, 12, 240, 560, -90, 137, -204, -648, -266, -36, -33, 269, 199, 631, -75, -285, -207, -556, 33, 177, 302, 530, -195, -19, -281, -383, -141, -297, 461, 234, 138, 451, -94, 31, -285, -476, 123, -8, 401, 103, 285, 315]
823C15l74P4l55J07L19L5J12p6N6k93j54M2J30l24N77O4J40j49k30o9m42K57L17
846G9m18R79l82j36j71l96L57k03M1N26k50N44k68m69J49n30N30k4nL53j47L61
868E20o92J77j93l35N50j02J93K30o1j91m25j00L35l09N06J50J72L9m40k20r4
889b90j12M19j4L12J04k05n1l80K25k31j71L85L4J82P0k60L39p27L82n0r0P29
911F00m36R7j66m5j36o29R44k42K85J89l72m9r3k96J02o8K66L62J9p3l73J91l05
934b28M5l0L31M3k13J55K34n04j61K11k00J22L89P0L33o37J65k45k08L11j83M24
956B24j69j11L47l92M31n02j02M87k37M63l54l8K51n08L26o56L49L13k77O05j00
977C50n7k69k98j61M25Q9O3l7K1J15l02p7n9j42M34l54R18n91l8M9m88K17k71
$$ y = [315, -59, 15, -340, -233, 86, 121, 233, 157, 213, -80, -234, -192, -62, -386, 191, 255, 395, 246, 16, -53, -495, -238, 79, -339, 640, 258, 122, -49, -445, -88, -291, -250, 276, 26, 570, 302, -167, -18, -548, -18, -42, -47, 306, 159, 520, -172, 5, -188, -523, 27, -75, 118, 348, 287, 96, -329, -429, -94, -403, 103, 253, 425, 464, 24, -196, -290, -402, 17, 3, 315, 419, 214, 163, -217, 8, -223, -394, -9, 25, 207, 277, 17, 356, -371, 11, -39, -129, 600, 164, 261, 95, 50, -86, -715, 229, -13, 272, 461, 89, 40, -53, -349, -247, -315, -49, 313, 332, 259, -114, 77, -228, -183, -213, 118, 161, -52, 103, 337, -167, -328, -117, -317, -195, 194, 264, 597, -40, 125, -120, -328, -17, -200, 224, 55, -56, 291, -101, 330, -172, -274, 213, -24, 439, 85, 47, 298, -210, 116, -540, -191, 122, -155, 450, 350, 293, 24, -274, -435, -10, 79, 142, 105, 126, 241, -61, -138, -197, -339, 95, -259, 659, 68, 30, 79, -409, -192, -463]
1000d63M65K47k52L25l50j07Rl63L71j88j8P94n95K53j08k95k7J02L46j24K15
1021B37K30m87J06l73J92l1k76M10L66k32K00m2l77k53J5K35j89M91Q9k42J42
1042B11m79J83r3j23M44n5J75n90J91K17n68L46O9J2L45K5k94J34j93J1m62K35
1064b59K02O8M64l01m1k76j45L25m63M81K72n8k07K32j95j15j05jn6K10K04l3
1086B03k78K4q8M7J22q6L48J08j37k66j17K50l67R6j23L55J43j40P5k97j24O8
1108a84LQ1J05K22R2j86j63j20J43k85J59J57l2M18n1l98j07j5M9l17N12J54N1
1131B88j45P6r6n46K13j62M74m7K84q6m18M00m01P3K26j80L99k55K38l12k8J65
1153A60m31L2J74mL91j76m28J64n6k76K24N37k84K96k7m54K62n95K42J57l9J80
$$ y = [-463, 2, 249, -3, 322, -28, -135, -126, -489, -118, -306, -324, 470, -125, 128, 20, -275, -302, -200, 146, 22, 237, 467, -20, 86, -287, -95, -126, -402, 8, 374, 142, 342, 300, -77, -330, -315, -80, -269, 222, 311, 69, 211, -268, -85, -178, -301, 143, 88, 263, -327, -136, 81, -487, -141, -72, -60, 285, 310, 16, 150, -43, -32, -494, -259, -57, 11, 475, 174, 133, -143, -288, 37, -426, 55, 327, 269, 62, 294, 99, -16, -121, -122, -178, 32, 236, 203, -75, -51, -139, -92, 30, -56, 292, 400, 263, -3, -120, 130, -237, -141, -264, 91, 234, 94, 169, -128, -252, -184, -181, -100, 5, 227, 319, 133, -30, -150, -7, -292, -133, 24, -8, 410, 359, -39, -146, -161, -112, -429, 83, 237, 288, 143, 219, 123, -423, -210, -372, 102, 55, 339, 253, -165, 235, -166, -93, 133, -47, 352, 97, 335, 23, -5, 160, -271, -239, -65, -69, 322, 146, -282, -118, -174, -450, -226, 311, 27, 323, 296, -158, 104, -491, -249, -92, -131, 49]
1175D9m8P2j31r8R9Qk61L57N7L22r2k73j45N1n1P0j22M96q8k50J59%q4l07J75
1200c5J06N6K73r3r2o0l52rL5N5K16k1J24j28K9k49Pj37J57J76M0J03k37J36N1
1225A51j44l43N5L16K1o0J59M7K3k04q6Q0M9K22p4P2j34m99K90q4J38k1K02N5
1249B31l33K50j36O4l35L9K01L4P2n7J05l37j1O0j58J76L6J28J46M8m38N1q9J72
1273h1M2K28N0j5j79K01n15j71J51J93P2K58L5j02jk63k6o3Q4j8Q0J66J8M3l85
1298a98M72l83J22l29L34K0j60J36o2J63k57R0J14K00j22J59l88m3K47j41j09
1319a35N6L88j25K9l4n7l43J35L8k6K41J21k70p3j4j00J40j05L6K31K2Q6m6l98
1343b03J87J30m38K51M56k45o1O4j89n3J8j59J62j20M34j14n5M1j69J92l87J66
$$ y = [49, 1, 73, -58, -156, -57, -49, -310, 47, 104, 426, 334, 61, -84, -33, -84, -14, -136, 360, 272, 22, 181, 181, 97, -210, -35, 71, 127, 400, 307, 215, 155, -197, -206, -171, -116, 100, 79, 203, 75, 104, -145, -138, -275, -118, 58, 98, 201, -36, 100, 151, 7, -336, -281, 35, 56, -4, 155, 202, 225, 21, -65, 15, 64, 286, 212, 284, 150, -349, -59, -143, -5, -26, 176, 231, -102, 148, 12, 76, -259, -220, -19, 15, 87, 30, 135, -202, -213, -153, -311, -135, -99, 29, 175, 223, -215, -164, -253, -81, -39, 189, 239, 224, 45, 246, -269, -440, -289, -96, -24, 234, 269, 167, 166, -97, -123, -186, -102, -120, -40, 126, 144, 187, -198, 274, -109, 13, -316, 18, 38, -122, 14, -48, 115, -142, -52, 62, 262, 140, 299, -89, -132, 115, -26, -135, -79, 309, 184, 213, 179, 122, -221, -86, -48, -74, 167, 288, 18, -55, -69, -169, -29, -134, -98, 133, 155, 241, 195, -203, -16, 114, -324, -73, 383, 138, 77, 141, -48, -101, -83, -242, -80, -200, 234, 120, 65, 106, -63, 129, -258, -92]
1365i2L71o3m26N42l06j96r7K60k59L31MK7J95n62K71qj11j90J42M62l17N3N8
1388H9j96j2j74L45Q1j09J23j35Q5j7k78K03J16j00k19L13J47k09J50l38l2L08
1410A41k67J60j2P6o7l2j5j13j40L22j46J40J34n5k9J32j94J53k54O0J11J8J27
1433B50kl29m0m17M75P9l5J49J49k22l46R4L43k21L7J66J44j39r2j39j96J28k5
1456a89K55j02L86k64qj18r9J55P9N0N2q8j91K39m47J04P2j12L13J35m2J49k08
1479A21k47r5n4J81K34k20K52k05R1K37n44J34l0J35K11k38N34m34l11J90O6l05
1501b97J98J80r4n9J45Q8n44L07J66k04K50j77k9O2j18k56M66l84K17M5K8P9j62
1524i3j70R8K78k09J71K26k27r2j34L18q8l17L96O5j6J80l42k0O4k47J72r9J25
$$ y = [-92, 279, 216, -210, 332, 26, -170, -267, -7, -266, 65, 69, 96, 291, -271, 0, -8, -119, -309, -167, 295, -22, 31, 89, -107, -119, -293, 52, 133, 24, 147, 12, 97, 80, -198, 5, 121, 21, -198, 115, 262, 53, 203, -135, -167, 141, -126, 34, 22, 98, 31, -1, -16, -129, -269, 53, -93, 47, 181, 126, 97, 229, 35, 188, -66, -6, 105, 123, 250, 248, -81, -121, -538, -63, 16, -19, 130, 279, 57, -289, -195, 148, -73, -36, 130, 274, 135, 43, -96, -292, -164, -189, 66, -36, 350, 86, 78, -40, -139, 16, 95, 145, 197, 109, -82, 157, -290, -186, -114, -226, 87, 222, 180, 329, 121, -126, -221, -275, -94, 140, -80, 172, -33, 58, 295, -249, -115, -145, -10, 201, -37, 497, 63, -248, -58, 8, -297, -99, 81, -13, -72, 73, 161, -383, -76, 90, -114, 136, -41, -70, -8, -126, -382, 84, -300, -83, -38, -10, 69, -93, -263, -165, 113, -96, 75, 301, 74, -18, -152, 166, 78, -239, 157, 222, 206, 386, 44, 24, 88, -159, 13, -86, 39]
1547C9p4K97k90J9k7J17k15K4L3J88j04Q0J02j27j55R6m5O9J34J91j65l00K49
1570A36k1j00l87K65J08P9J15r3J71k11n0k40J34K6Q2j44J98j37K06K7l08m7M
1593a87K33J76k42o2K11l50L3K61k66N59m92L51k50L79j11m28J46n9M1R5J79j94
1615B3j48J45k16O5J14Q4l9Q8R9k92Q7K03k26M1M7j14J02J9Q1j77r3J6R3J22K4
1640A48k53l8K43O0l49N1j06K72M1k2r6K2k7j72J9M1l6J27J54K07j37r7M4n0m9
1665ck60N6J02M4L8NQ2k73L2L00J29l80O8R0j85P8j8R7oj08K00K85l03k14J68
1690B4j20L05k77P2K90j74o4J66l45n3L15n48L95m5J24J17k95N3n3L68l64q9J29
1713f9J87j04j49j03J33r6K8J09Q8P1r1K3k83K90j11j1O5K43l40j75L97k35N5
$$ y = [39, -35, 262, -28, -9, -36, 81, -134, -110, -77, 111, 7, 87, 189, 62, -93, 3, -42, 27, 161, 352, 187, -113, 136, 115, 15, -372, -107, 1, 80, 195, 102, 273, 62, 12, -228, -94, -68, 14, -130, 68, -69, 137, 164, -144, -191, -187, 46, 222, -20, -82, 129, -221, -188, 73, -193, 366, -126, 225, -25, 354, 243, -185, -39, -98, -57, 38, 217, 23, -125, 20, -196, -131, -17, 67, 28, 116, 215, -77, 10, 213, -13, 28, 75, -39, 63, 82, 163, -14, -107, -91, 2, 124, 148, -105, -143, 100, 160, -189, -138, -244, 28, 69, 47, -49, -27, -54, -226, -207, -166, -202, -75, 79, 286, 149, 52, 96, 46, -3, -263, -207, -105, -61, -23, -18, 64, -209, -177, 123, 252, -128, -60, 30, -155, -77, -95, 2, -4, -112, 88, 373, 70, -144, 24, -96, 209, -68, 4, 294, 120, 56, 222, -123, -176, 139, -409, -14, -59, 65, 182, -113, -60, -113, 255, -109, -198, -69, 118, 14, -135, -238, -105, -201, -173, -64, 24, 95, 4, 27, -256, 34, -77, -88, -23, 220, -120, -295, 102, -133, -78]
1736g8rN6O0j97J91p1M2K48k63j25K09j91K46m8l8j58J16Q2r7j12j20N5L34J98
1760C30l75mK52k18r7J57p1K18p1j31j92J14J4j90mK63J7K70k71j49j68K01J42
1783C7R5n5L6j32J60p9r0L8k00J49m8K57j22K4j53J45r3j42j58J69K47o2J27k44
1807i4K02m5j16K1j06K72M1l14J55j26P3j37J2J9M6J89K4l4J13l09Kj38K32J90
1831A72j78Oj63K57J2p2j12q6K02l1q5q2K54l02J72J43j60k97L38K29l18J48j49
1854a02n5r6L46K49l35j08J70k82J73k03M10R8l0l44J58l1m3M7J6j60M3j45M20
1877A96%j39J14l84K01n00N69r5R0R1m7K21j44l43j78M24j5J25j16M0k19K68k16
1900e7k15J42m1J04M1Q9M4j55O5J97l11K78l12J78nR3J3j07J17k7k79K86j21J62
$$ y = [-78, -87, -31, 29, -168, 23, -48, -6, 242, -21, -146, 63, -128, 118, 70, 32, -126, -10, 72, -25, -137, -257, -202, 132, 330, -45, -49, 203, -15, -112, 45, -26, 192, 121, -10, -202, -88, -74, -264, -268, -5, 12, 282, 11, -138, -306, -105, 37, 132, 77, 113, -19, 141, 62, -28, 10, -190, -41, -89, 168, 46, 70, -83, 62, -31, -173, -331, -162, 85, 23, 150, -94, 108, 63, -53, -32, -138, 134, 175, -139, 16, -110, -37, -174, -162, -143, -97, 92, 116, 82, 195, -114, -112, -250, -18, 172, -6, 0, -163, 94, 106, 34, -78, -164, 38, 7, -78, -160, 94, -208, -36, 107, -53, -350, -12, 217, -101, 47, -102, -157, -253, 93, 342, 7, -101, 69, -213, -40, -243, 167, 265, 235, -109, 49, 18, -25, 22, 38, -122, -79, -224, 196, 196, 57, 171, -213, -12, -512, 57, -38, 52, 143, 96, 317, 173, -170, -348, 76, 61, 186, 70, 110, -109, 159, -57, -272, -130, -171, -67, -26, 63, 107, -48, 17, 214, -97, 181, -131, 47, 42, 135, 148, 41, 158, 131, -148, 138, 17, 179]
1924A79q0m8N3l82J36K90j67J48kl7l20J23n8O5P9Lj80K56K5o9J33j0k10l22M97
1949A02l13N12j36qq0n4k68J7K49N2R1k4k55KR5j6j1J55o7j63J50Q5r6p7J5M8
1975Ej13L7J10L81n72L08k3k63l9K30l6j86J70M6k0k8k37L31N0k70r9J92K63k14
1999B3m3Q0l22K24P9P8k59j17M01j24j82L0K20p5J62Q0k25k28r6j35M16j56l9
2022b08L18kRk47R7j69M7r9pJ76J22N4k31J44j83O4K25k39P2j21K35J42j98J52
2046A53p8O8j32j36K71j37Q8r3j58k71M30j29J1K65j74j11K51q6k4q0mK03j21
2069FJ6P7l3l00j22K14L91Q5l35R6k17K83m01K46M1l49L65J9j18j82L05Q4j71
2092@o3p1L08k06J27j20j86J93k6j00L53k33M01o06K39j6j22J05j24ORK47M6l1
$$ y = [179, 99, 51, 104, -278, -142, 148, -19, 129, 127, 90, -230, -107, -165, -100, -21, -18, -198, 58, 83, 14, 147, 137, -73, -395, 102, -211, 301, 165, 157, 77, 23, -245, -228, 21, 73, 164, 140, -115, -113, -18, -34, -45, 110, 43, -120, 30, 115, 19, -58, -43, 5, -108, -71, 39, 420, -152, 156, 133, -130, -169, 61, 25, -161, 9, 55, 35, 7, -230, 101, 151, -119, -218, -26, 237, 23, -20, 60, -262, -38, 41, 119, -140, -257, 144, 20, -162, -132, 88, 13, 175, 255, 30, -198, -294, -429, -13, -169, -208, 110, 108, 117, -130, -33, -202, -155, -254, -261, -85, 37, 91, -140, 4, -179, -115, 110, -129, -57, -178, 57, 199, 1, 153, 75, 143, 11, -125, 146, 9, 97, 4, -154, -425, 5, -124, -113, 152, -22, -133, 118, 32, 8, -72, -76, 127, 6, 22, 99, 66, -234, -356, -142, 249, 334, -1, 95, -122, 161, -240, 6, 47, -302, 63, 82, -36, -218, 87, 171, 0, -63, -134, 174, -32, 95, -25, -211, -18, -44, -144, 209, -24, 377, -229, 10, -6, -128, -23, -147, -141, -132, 115, 161, 130]
2116A30l48K08n6K2R7N7j53l0L09l34N6K40l21R5J07j0j95L07j41k5L4k13P4R5
2140Er4J92p5j47L87l04K11k56J29j03J98j13K44l88K76o8j64M4l2L46k08j49
2162f9J21J23M9k63q0L25o7k78J15K72l45L3O3K2j66N7K81Q3l70j01K01o8m5j6
2186a23J4m3K49q0j01j1J83q8J55l58L77j61j04R5o9J97j82K66k8q2o9O5j51L4
2210a5j39K99J6l6j12j78J68n9J2R1j30J53j75J57m1L1j28J9J58j92j46J36L52
2233B41l84J56l0k7n1K8r1M06k09rK4K05l71M2J27J16j81J28n2p3J74j86J78k65
2257a04P5L25l43J93k35M2K7K8j26k2J72o8m6K08j44j86M41j73j82k47M39k1j0
2280D3N3J03j19l03lJ93R7k96J36L05k03M8n0N8k04J6r9J39Q8nn8J14O5k76L53
$$ y = [130, -218, -10, -66, -44, 53, 110, -43, -73, 236, -98, -42, 198, -123, -28, 79, 69, -126, 181, 40, 15, 49, -164, -90, 5, -89, 103, 28, -119, 268, -36, 175, -81, 48, -55, 143, 30, 274, -114, 162, 94, -70, -26, -58, 288, 80, -69, 52, 175, 224, -39, -119, 206, 139, -139, -24, 248, -97, -64, -1, 21, -145, -88, 193, 276, -94, -195, 6, -62, -107, -123, -109, -152, 97, 17, -84, -95, 88, 0, 155, -203, 174, 13, -91, 4, -65, 132, -50, 216, 188, 106, 37, 102, -49, -15, -154, 145, 161, 125, 13, -165, 3, -56, -44, 47, -83, 70, -105, 52, 11, 42, -86, -67, 91, -101, -247, -111, 241, -143, 13, -17, -44, -95, -67, -158, 248, 39, 30, 54, 259, -112, -70, 57, 173, -8, 120, 68, -5, 169, -17, 161, -104, -29, 296, -47, 146, -89, -47, -20, 8, -118, -140, 32, -36, -82, 126, -18, -204, 237, 64, -118, -365, 74, 53, 43, 96, 199, 80, -223, -226, -33, 64, -232, -96, 209, 6, 54, 4, 62, -142, -126, -225, -86, 2, -3, -61, 53, 118, -158, 195]
2305A95p3m3k06K43k74N9K70j33K04l60N2R7j18J86j32K9%J1K57j51j11n3J89
2328A38k59J2L52N7j46k32K4m8m7J74k0o7k33M97j65n6K8K4l44L58Q2k62K46k01
2352h8L91l25L9J01j79L10l34J81p5K39k66O6L9j04K3l1Q7O1l83J69k3J16j12
2375i8J76m1kNn5j25K42J5j15J46k71J81M0L5k08K65J0o7l38M91k12k44K11M2
2399H3j84n5J35n8L0Q8q0J5Q1o3K4m16M20k96J70Q4j70Q1K2%pJ57j91J95R7l39
2425a77lL79j41O0j10m6r7K20J01n7J27k91j10k2N8K96k44Jnk4K7L9m3J2j7m5
2451a12J82l70K53Q9R9o0j52J99k15j5j22M62k59j94O6K23k76J54k23M64j98Q1
2473G6l69K07MPj18K4L13p0N1p9R7l24J58N4j47L01P2k61o3J7R1j13q0K54r8j54
$$ y = [195, 122, 79, -127, 116, -158, -99, 171, 38, 242, -118, -66, 31, -87, 99, -33, -4, -4, 7, 264, 113, 2, -51, 138, -121, -109, 243, 300, 154, -78, -54, -102, -149, 25, 5, -62, -295, 202, 37, -19, 9, 33, -311, 47, 129, -133, 113, -88, 303, -22, 17, 118, -61, 249, -85, 96, 21, 260, -6, 60, 99, -5, 18, -13, 74, 135, -248, -79, -102, 14, -98, 78, 37, 35, 40, -15, -140, 102, 117, 2, 148, -123, 58, 98, 133, -75, 190, 200, 133, -205, 286, 74, -170, 41, 83, -101, -156, -21, -79, -49, 39, -41, -26, 55, -8, 16, -400, 20, -276, -106, -22, -192, -111, -89, -89, -96, 61, -130, 65, 162, -177, -180, 199, 58, 118, 8, -38, -135, 85, 186, 129, 256, -35, -145, -167, -109, 187, -57, -56, -61, -85, -58, -19, -62, -50, -67, -112, 70, -300, -47, 42, 141, 81, -71, 128, -87, -102, -224, 238, -21, -215, -149, 74, -202, -48, -271, 193, -5, 76, -293, -86, -82, -75, -193, -169, 144, 74, 125, 46, 143, -181, -23, 31, -116, 185, 257, -4, -67, -50, 41, -72, -152, 102, 4, -150]
2499a50R8K08j91J44j31M33j86n4j97j07MK95r9Q5k55K41p7J19j94P5k35K41p3
2522fK17p1j26l9K6J42k26M0nj3O9N6j61J78l88J46J92k7J40k66M89o23L97q0
2546F1k39N2N0J22J53m13L29j29k64N9O4O3L21k98K8J88j21l16L70k08j03R9l3
2569a65M36k17j16L51l85j6L55j43k39K87p8J0r8J20K1l58J10M53l78kJ75k03
2591h0J10r2k8Q8N5k5p2J03J35l36K40k14J57j3J2K17k70j26J91k11K06q0J02
2614F9j45J44M2m7M8J28j30jm32J85J3J41j32J36k37L08j01r3J99j1l45K58J10
2637A07j75J29M1j72r3K17j13J9j57J30k27J76J37J41ok13k7Q3K9j24Q8r7L14
2660B07k33M5J9k53M31o3m9l01L67j69L0J36j93k0r6J54J35l32L15l08K10j98
$$ y = [-150, -52, 156, -35, 109, -22, 411, 225, 171, -26, -133, -129, 166, 67, 152, -103, 138, 61, 180, -14, 61, -174, 67, -6, 211, 140, 14, -25, 1, 143, -83, -43, -48, -61, 8, 64, -97, 81, -307, -161, 31, 4, 144, -122, 367, -256, 141, 61, -178, -126, -76, 46, 199, -214, 115, -14, -278, -219, -155, -92, 229, -69, -41, 147, 26, -290, 80, -128, -231, -132, -165, 271, 54, -62, 289, -96, -112, 243, 100, -139, 148, 70, 80, -18, 102, 123, -235, -125, 328, -50, -52, 123, -80, 30, -62, -90, -2, 53, 28, -44, 59, 194, -142, 98, -116, 41, 28, 40, 257, -13, -139, 52, -159, 47, -33, 69, -76, 68, 110, 63, 111, 239, 109, 108, -324, -139, -126, 15, -117, 19, -218, 90, -11, -104, 95, 84, -261, -3, 107, -68, 61, 102, -70, -163, 54, -59, -40, -197, -67, -294, -118, 19, 160, 154, -59, -86, -3, 26, -98, -10, -107, 207, -26, 19, 38, -215, 216, 153, 104, -197, 170, 1, 31, 167, -26, -46, -142, 12, 147, -185, 130, -178, 32, -166]
2682a66M67n06J09Q8p2L2n9J85m7K30k43k10n8K25nk0J85l76K29k08O4J79p4P3
2706B2j89J78J19K4j32J60m47L4K91p5j34K22j04k38J88j53J83J07j1M1jJo4j57
2730a35k6M42k58K0Q8j69K6O8k97K00J71m7j42o8J71m5mk06L14kk47rK92m9j31
2755d3j19J53j69J15n8K14k9j23K64r9k41L43j98O7nJ02k98M8J87M7N4j92k74
2778b54K26P9Op6J54k15o6R0J19k77J76J35k47k8L29p1J97k80n9K38j74J29L6
2801A67L4k19j08L21L0m2l06K86j21j0K0q0L6m5jK82j03p4l27J90J91n6L4j16
2825a7J1n8j0M8QJ24j36J61j21j25J31r2r2JK2L25L6lk44Q4j23J05j48o6J7L09
2851A47l44J24k25K78K35p4q6K1l9Kk15J18K42k84k93L48J6n1L07j71J8O3q2p6
$$ y = [-166, 301, -205, -96, -8, -80, -48, -107, 78, 31, 261, 18, -192, -250, -25, -30, -50, 135, -241, -12, -220, -156, 23, -51, 22, -167, 11, 130, 154, 22, 182, -265, -231, 60, -15, -149, 73, -31, -269, -81, -234, -51, 56, 45, 86, 85, 86, 22, -135, -161, 281, 23, 43, 131, -38, -12, 56, -241, -41, 130, 83, -59, -127, 44, -1, -5, -211, 103, 101, -146, -155, 137, 88, -43, -162, -9, -178, -63, -121, 93, 64, -59, 205, 106, -135, 208, 10, 77, 72, 174, -124, -76, 111, 158, 212, 20, -254, -28, 51, 57, -19, 135, -80, -146, -56, 63, -214, -38, 97, -150, -178, 151, 80, 277, -3, -62, 176, 2, 131, 167, 201, -18, -126, 195, 225, 183, -123, 163, 42, 32, 52, -28, 8, -37, -38, 244, 141, 67, -260, -70, 121, 65, 99, -17, -6, -64, -74, -26, -18, 106, -30, 131, 10, -115, 16, -76, -168, -167, -145, 180, 216, 213, -31, 53, -70, 35, -113, -179, -162, 147, -197, -73, -298, -20, 215, 141, 55, 76, 37, 39, -176, -58, 184, -100, -393, -45, -29, -80, 227, 56, 74, 137, 55, -21]
2875b1K06k53L25N4k00n9J00n0r2O7o5J49l46q5J34K00N3j79j76L42n5l4L3K8
2899G6J34j85R3k54L76j85r6Q5n4P4l03P4K39j22LN4J8q8k0m9j13K69l90K75J12
2924B3o5J50J2p3J89j28k30K70l68K78k04k26K38K28J85l01J99j47O1j29L1oM5
2947C2k13J34L08l06K2M7M3j32K97l08N2j02K59j15J5j45P3r9L29j13J25l4j66
2970CJ21l5l92J16J99K57k56M2k0J02r6l3Km8K19j16M6j21P1K7j1J04m14P8J31
2995b4j9O0j26L13j89n7J29p5R9m5j9J09j36Q6k27J75q8M9q0L6J36j82Q9J21j0
3020A25Qk78Oj00M18j52N4j60k52L63o6j7K38r0j84R6N7l9j86J99p9NJ43j18J41
3045A32L5M7l24L01k80p9J67k6n0J76nn5K8n6k41M64k71j6K00j17P7j5k08J55
$$ y = [-21, 185, -68, 257, 311, 111, 52, 152, 102, 10, 77, 12, 161, -185, -270, -136, 64, 117, -62, -238, 104, 49, 15, 48, 76, 210, 25, 118, -136, 240, 55, -41, 44, -10, 64, -239, -165, 74, -48, -45, 9, 27, -61, -81, -130, -243, 26, -364, -89, 23, -42, 108, 120, 47, 236, 108, -122, 148, -220, 58, -146, -372, -134, 94, 279, -22, 177, 30, 91, -38, -7, -13, 32, -181, -47, 261, -45, -23, 24, 67, -65, 232, -76, -24, -126, 133, 18, 33, -112, -39, -138, 191, 78, 203, 169, 3, 124, 89, -303, -187, 12, 269, 13, 55, 35, 137, 41, 8, 10, -38, 181, 65, 111, -10, 61, 88, 77, 181, -233, -155, -24, -43, 17, -109, 204, 15, -42, 87, 12, 111, 66, 47, 156, 20, 106, -121, 54, -34, 15, -65, -29, 107, -75, 14, 135, 125, 133, -145, -139, -239, 179, 27, 81, -79, -331, 32, -34, -51, 187, 97, -87, 9, 66, 27, -159, 40, -39, -34, 109, -9, 132, 167, 214, -110, 191, -89, -168, -1, -27, -77, 99, 94, 39, 67, 11, -230, 234, -37, -53, 147, 30, 107, 92, -116, 39]
3069C9M3l56K44J53N4l42q0J36M6l1pk2J59Q9n9k22o2J41p6K58m4l0J58l37J66
3094A8J18k38j73K40K47l57L14k83m2K23p0l47K90J15j42Q7N8M6j74J1j02j75
3116c36K62K80m56J49JM4M1j10P5J29lj13o0K12l1j21J49j45P1J8J62j69j51n3
3140a55J39J5J47J2j38q5K10p5K5j39J60PK5KJ03j48n4l1J5K1j90J87P1k01Q0
3165Ck5n4L15m86J97j99J45R2l7M7j08J17j29o1K39L6k2l44P4L31l19J83p5K53
3189A73m2j6l38J57RJ05J53n22K41K3k88K61K9j8N7j5J96j74J23j38k7j16N3J68
3213E4k67L04l4Q9k98M8J41l02K12q0L10m26K73Pj48O8L9P3j98L74j13j70K7j27
3237a44K8Q1R3k45R2L7J19l28R5MJ62o7J61j4o9k12J59j50P2L90o15N02j86K48
$$ y = [39, 82, -274, -30, 123, 177, -165, -245, -109, -63, -94, -101, -123, 36, 125, 66, -156, -218, -77, -153, 105, 61, 31, 189, -148, 18, 136, -102, -275, -35, 212, -145, 169, -114, -156, 67, -3, -350, -60, 55, -87, 0, 58, 104, -70, -59, -161, -336, -74, 206, -250, -101, -100, -56, -15, -125, -50, 79, 76, -37, -97, 115, 84, -37, 112, -33, 38, 56, 218, 49, -102, -155, -16, -1, 146, 158, 20, -65, 145, 70, 95, -44, 116, 123, 148, 150, 253, 105, 51, 20, 35, 56, -134, 53, 124, -77, 3, -22, -76, 239, -247, -50, -249, -104, -12, -49, -2, -110, 7, -122, -183, 56, 92, 70, -274, -200, 131, -188, -5, -80, 173, 131, 115, -223, -66, -57, 48, 201, -321, -80, -57, -345, -84, -55, -73, -16, -31, 165, -9, 114, -24, -51, -167, -114, 54, -213, 91, 57, 146, -152, -104, 37, -265, -53, -133, 177, -249, 24, 31, -117, -49, -10, 63, -135, 239, 126, -44, -17, -144, -116, -35, 58, -187, -95, -58, 61, -267, -172, -168, -6, -73, 88, 74, 5, -207, -48, -198, -126, 264, -351, 151, -35, 213]
3261B13J1l98L66k00p4J40n24P83k65K10l06k08K71L8l5j72Q9j05L05r9K21l12
3283e1J34j41K42j22k0J47l53R0k66M07p3J73r2j91Q0N2j0l5o0K5j76K18K60j82
3307E6K38l75j37K61k62K80J2j27K15k02k2K18k35K19M6k42k21J32JP4K22j30
3329B1K67j95j06J20l9J71o0l6k59Q0M0l00M16k30j61K47R1j4J58k67j18M28r7
3352A57k60K80j73M1o6j30L73m43J85J45j97Q1j80M1J73k25J9K1k5K11J8j35L7
3375e2P0k2K82k28L6L4j36J21M0j4k77J24n2q3L28j8k64K11j04j64M17k09j16
3398g6J01J05j54O1p9j30J05K33j11K3j11K74k06r0J66J51p0o5r1p4k2j23K76
3421I3k3M6J4j65Rl83N12j21q7p6O6O1M26q0m36K03m2j04R1Q3k94K47k55K39K71
$$ y = [213, 224, -174, 192, -8, -82, 58, -466, 317, 52, 262, -44, -252, 19, 57, 22, -150, -61, -166, 139, 40, 261, -51, 83, -58, 184, 62, 42, 189, -164, -74, -340, 67, -6, 167, 75, -116, -36, 16, 6, -29, -89, -64, -240, -22, 238, 56, 294, -81, -218, 43, -219, 61, 73, -54, 161, -41, -63, 155, -80, 139, 185, -57, -278, -146, -145, -71, 151, 21, 288, 93, -13, 107, 68, 239, 179, 143, -116, -36, 4, -296, 120, -110, -271, -24, 67, 53, 211, -56, -174, 254, 157, -103, 177, 4, 45, -21, -151, 222, -221, -36, 109, -88, -7, -187, -146, 27, -198, -179, -158, -183, 28, 46, -89, -52, 18, -4, 278, 50, 86, 120, -16, 105, 145, 131, -146, -22, -74, -157, 171, 153, -111, 100, -4, -168, 249, 40, -76, 25, 130, -24, 37, -42, -172, -67, 166, 55, 78, -33, 241, 35, -55, 111, 262, 192, 127, 36, -38, -60, -183, 93, 70, 116, 130, -35, -26, -409, 103, -18, -105, -181, -115, -54, 372, 292, -144, 59, 17, -87, 4, 87, -207, 40, -215, 24, 295]
3446B95j67o8j56o3L60M9k16J77j92lk6M2k91J97P4j09o8O12n52n0J77Q8j17j5
3470b2K0oP7n7k50O8PJ62J40k63J0J82O8o6k49K35q4J09k28j2m4j24M91l72M11
3495B03k63K25k46J79j33r2Q1K75j48j13l5M2O8n1m3J8n3jJ74n0j10J81q4j5q
3520Ap3N8o9J04k62K86j35J97j6P2l91J33L04l27L20N4j43j88K44k11R3N2l51
3543b48K65j76mJ09L28l84KJ81R6l80K00p1K21o5j11K9M1n4J44J64j16n4k2l8
3567E7k9O3k59m5J22J11j73K82p4K93r7j44k3j36K39j9k58n9J20J14j45m9M1R8
3591C0L7j08J52k78K74k08M48l44j4J06O0l23K64P9k63O2R5q1q5k7Q9J7K17j16
3615H3k67N01j80o6j28k04K10L5O7Pm2J68m1r4J14m03K60K18l80L73k04j10n2
$$ y = [295, 128, 60, -96, -159, 201, 250, 34, 211, 19, 16, -10, 32, -259, -62, 12, -97, -165, 447, -105, -155, 22, 110, -7, -22, -2, -8, 69, 12, -238, -170, -163, -1, 139, -124, -114, 68, 136, 70, -179, 56, -28, 81, -147, -159, -203, -327, 164, -208, 203, -60, 165, -81, 98, -35, -127, -46, 229, 81, -32, -67, -25, 43, -8, -51, -33, -86, -87, 87, 37, -73, 108, 24, 9, 1, -72, -14, -83, 21, -241, 45, -90, 107, 91, 163, -228, -95, 209, -118, 202, 256, 113, -75, 169, -42, 51, 103, -248, 17, -159, -163, -54, 274, -110, -108, 73, 169, -211, -11, -82, 139, 74, -37, -8, 33, -21, 123, 287, 171, 117, 95, 57, 28, 91, -168, -213, -91, 20, -153, 129, 55, 348, 251, 107, 84, -52, 187, 168, -90, -149, -29, 85, -60, -109, -68, 30, 67, -41, 111, -167, 107, -101, 347, 3, -11, 95, 155, -168, 96, 175, -88, -26, 69, -12, -97, -124, -35, -18, 199, 83, -184, 317, 137, 71, -57, -261, -51, -16, 51, 58, 16, 184, 143, 49, 163, -240, 20, 238, -142, 231, 27, -83, -135]
3638a35J51K08k35k8q5N8L63j69j87Q7o6j43J36k2Q3J6L81n3m06k80L81q9k30
3661b64L29j65j5K62l20J78J70r7p9p5J24j42oJ35K05l93J91m0j21K02k5K8J36
3684B18o4j03J87j78M3m7J04k87J18J46j42L8J01k72K64n4j31j80J78k09K81L08
3706C19l11J91r5J59m9k91N4J96n80N31j12O6l36J48J25k57K64L3p2k39L69l00
3728a87J49N8k47n0K87M0j47J5L14l99R1J06rJ68k48m3K33k23K04m5Oj17J58l74
3752b60R0K17j64M6J70k66L27l28L65l27L13l86J9J79J18j38L7oQ6J99j68k62
3774a39L8K30J45l55K30K1o2o2j83j6K00j25J19J88j85j23j62J55l11L01k2k8
3796a46J65L2j2J21j70K96k70j10Q2J6o3J38o5K1M5k69K31j03j27J62J52j49r2
$$ y = [-135, 16, 224, -11, -39, -124, -66, 297, 128, -59, 28, -38, -181, -45, -67, 16, 32, 413, 360, -46, -326, 55, -34, -264, 65, -100, -115, 147, -173, 5, 175, 78, -1, -76, 48, -94, -100, 35, 240, -153, 38, -2, -123, 79, 54, 82, 218, 154, 51, 238, 60, 103, 56, 160, -127, -9, 137, -5, 33, 134, -138, 126, 72, -59, -239, -61, -270, 11, 319, 8, 199, 104, 263, 214, -77, -23, 173, -407, 124, 12, 78, -258, -110, 15, -242, 22, 55, -17, -256, 113, -187, -38, 20, -227, -277, 10, 50, -97, -82, 232, -167, -76, 30, 21, 189, -59, -102, 131, -92, 112, 67, 73, -44, 114, -260, -170, 47, -117, -71, 99, -167, 160, -168, 197, -130, 183, -203, -184, -5, 113, -25, 12, 6, 92, 291, 123, -139, -101, 129, 274, -81, 149, 170, 108, 46, -137, -153, 47, -78, 41, 229, 44, -79, -241, -86, -397, -96, -118, -146, 19, 51, 39, 160, -10, 286, 16, -94, -12, 4, -59, 79, 14, 35, 80, -189, 42, -61, -188, -26, 126, -23, -115]
3819a15J90l66K33L9n9M01l51q3R4L7j0K6m37L63O5j41o3Q3J06j64l6J66q8L0
3843h0M5J5j49L17j08k0J6n3J08k4J05r0M2L7j70q9j42N52k48j49Q2L0j1L1l0
3868A7O8pl35N02m12J33K33k57pJ91j13j58q0L89R9k07K8q1J29k07kN5k73L46
3892E1n5q1J36J25o0j57k8J72j48P5N3J6j33O0MJ09j65J26P9l01J63P6l58L61
3916A20q1J94k89o8K3J04O5J17k44N0J12k55K26jk9N2n8j06K3o2j7o0l4K47O3
3941I2j73K36r9o8J61j2l36K67J37k44Q9j2J32j21j51J60m3k76K09J48j57J72
3963A11N6k4l4N1l6l70J64n7J23N3k7j16K64m57K28l6qJ65K55j64l00L9Q0K58
3987B18k89K0MJ77o2k13K60M9N5j82K6J90m34L89l7m05K72Q1L1l48J26L06j89
$$ y = [-115, 75, -291, -58, -19, -78, 323, -28, -111, -17, 20, 10, 36, -401, -38, 27, -114, -177, -94, 12, -152, -188, -22, -110, -80, -35, -20, -169, 148, 40, 20, 36, -17, 91, 67, 172, 82, 124, 161, -9, -98, -240, 312, 64, -85, -3, 27, 16, 47, 17, 85, 78, -257, 245, -167, -34, 199, -58, -65, 126, 13, -145, -225, 164, 263, 56, 84, 3, 132, -75, -77, -22, -295, 51, -4, -85, 51, 176, 116, -41, -69, 103, -45, 30, 83, 99, -34, 26, 30, 139, -26, 100, 179, -122, 41, 117, -241, 120, 39, 233, -56, -124, -101, 3, 68, 185, -59, -9, 103, -152, 74, 73, 44, 96, 38, -68, -45, -107, -124, -184, -218, 29, 92, -81, 155, 56, -12, 149, 137, -199, 68, 205, -39, 50, 38, 170, 49, -102, 58, 15, -261, -52, 96, -61, 111, 167, 143, 109, 160, 124, -246, -82, -139, -16, 37, 10, -106, 158, -299, -71, -107, -115, 50, 305, 141, -159, -120, -40, 218, -71, -51, -47, 130, 68, -145, 115, 164, 219, 37, 63, 253, -181, 208, 171, -234, 38, 119, 150, -198, -72, 234, 45]
4010D5Q4k75K60o8o5j57J27J04K2k76L54R1L0m63K27l71K82J74l3l21J32K07k92
4033a82J76l00K78k17L35j50K1J10r5QJ84l49L38j88K34o1j99L0qoQ0K32l00o9
4057i8K0O3J25j53P8k37N17m31J51N7J9j17j75J68m6J85Mn9l8k33L7J86q4J43
4081H2k90K38J15j5k28L0j40L18j13J1M3j42N6L9L22k54k11M2j98M68k97J60P2
4104A08q0L37j81j05J85k25j45p7M48l11L96l34o8L82l35O9P8k45N8K18l00J43
4126A6J52m76M5J96L3O5R7k96j0N2J86M0k91L32O7Kl60P4l9Q1O9j59K41k82P8
4151h7R7J25J4k04K2l5l5q8J86p3J02j95M18m9J8J16k94J45j25R7k83J10K66j69
4175G9k60N14k34j52l0L37j06Q2O9l49j71K11J21r2q2J68R9l7J29l94j24J55Q1
$$ y = [45, 129, -146, 114, 46, -19, -176, -49, 55, 77, -199, 155, 246, 276, -187, 40, -331, -49, 125, 92, -229, -97, 110, -182, -6, -306, -28, -245, 90, -60, -39, 71, -24, -16, 168, -181, 157, -31, 203, 142, -57, -27, -35, -41, 39, 271, -29, -98, -78, -15, 110, -43, 35, -202, 315, -116, 35, 92, 111, -6, -181, -13, -59, 126, 130, 71, 33, -200, -163, 23, -61, 82, -208, 30, 145, 130, -98, -68, -208, 110, -3, 8, 51, -91, -35, 4, 326, 72, -139, -97, -295, 173, -124, 36, 108, 28, 365, 184, 79, 264, 39, -106, -183, 265, -46, 350, 16, -52, 330, -5, 64, 142, -103, -45, 173, -127, 16, 168, -308, -263, -67, -34, 31, 128, -168, -178, -126, 60, 100, -191, 141, 208, 210, -150, -76, -115, -34, 35, -124, 117, -165, -87, 10, 135, 149, -55, -33, -68, -103, -191, -5, -78, 24, -171, 247, 198, 216, 332, 38, 183, 58, 155, -128, -18, 248, 79, -181, 333, 99, -53, -83, 254, 148, 230, 299, -50, -221, -10, 111, 19, -63, 105, 204, 167, 296, -98, -222, -67, 14]
4198A4J67k12o9J60p6R4q0N6j20R1j95J55m2o8K02N2l02K09j50k0K54j32l2j67
4222b11J25O6K15j29K07k16j47n5J5K34L9n4k32O7J91p9J82l82K66q6J7j20J44
4245E7j7N9r9J49k27P5J16o5j90K02K21k46k97J74kj74K06O5j06p0j23K57J03
4268F8J4j14O3K8j42L0J80k58J58j33J92l19J95J18M6l2r7o0n5K85r2j19L8K34
4292B28k23Q7l7J48k49J14j24n3j9L1J99m27N79p3j64M1l02K43j64L90j17l7J01
4315A72j97K52o00L80L8q9P2k00J2K26k3J8J60J3l64J98L3j51R5k85N52l66J50
4338I6k49R8J97k30J65K58m40j67L96q4O2j44Q9j80L18K08n13J39j61K38j16n0
$$ y = [14, 181, -31, -100, 60, -16, 78, -2, 54, -66, 25, -170, -15, -57, -125, 77, 129, -173, 36, -114, -134, 120, -12, -44, -211, -86, -20, 195, 66, 273, 57, -90, -145, -130, 104, 143, 89, -143, -76, 115, 36, 218, -164, 102, 16, 33, -87, 57, 40, 99, 0, 149, -78, -3, 113, 48, -142, 60, 281, 35, -262, -88, -90, -264, -58, 7, -99, -169, -292, -35, 68, 82, -32, 31, 59, -83, -53, 127, -131, 27, -106, 86, -233, -38, 80, 126, 94, -3, -63, -118, 167, 75, -44, -6, 228, 5, 92, 55, 203, -46, 68, -56, -109, -128, -97, 102, -325, 254, 181, 17, 58, -244, -1, -165, 225, 108, 71, 172, -25, 227, -373, 7, 45, -44, 28, -172, -160, 66, 43, 61, 221, 234, -130, 68, 101, -50, 45, -240, 312, -54, 96, -153, -55, 142, -88, 77, 335, -105, -272, 124, 40, 102, -42, 47, -133, 185, 393, -120, 19, -142, 96, -20, -70]
$$ [...]
8191H8
##END NTUPLES=NMR FID
##END=
