##TITLE=1H_B22001K
 CDCl3
 8 sc, 
 20.1.2022
##JCAMPDX= 6.0         $$ Bruker NMR JCAMP-DX V2.0
##DATA TYPE= NMR FID
##DATA CLASS= NTUPLES
##ORIGIN= UXNMR, Bruker Analytische Messtechnik GmbH
##OWNER= root
$$ XWIN-NMR		Version 3.5
$$ Fri Jan 21 11:02:20 2022 Russian Standard Time (UT+4h)  she@DPX200
##.OBSERVE FREQUENCY= 200.131346
##.OBSERVE NUCLEUS= ^1H
##.DELAY= (6, 6)
##.ACQUISITION MODE= SIMULTANEOUS
##.ACQUISITION SCHEME= undefined
##.AVERAGES= 8
##.DIGITISER RES= 18
##SPECTROMETER/DATA SYSTEM= spect
##.PULSE SEQUENCE= zg30
##.SOLVENT NAME= DMSO
##.SHIFT REFERENCE= (INTERNAL, DMSO, 0, 15.7039)
##AUDIT TRAIL= $$ (NUMBER, WHEN, WHO, WHERE, WHAT)
$$ ##TITLE= Audit trail, XWIN-NMR		Version 3.5
$$ ##JCAMPDX= 5.01
$$ ##ORIGIN= Bruker BioSpin GmbH
$$ ##OWNER= she
$$ F:/spectra/data/she/nmr/H-F/1/audita.txt
$$ ##AUDIT TRAIL=  $$ (NUMBER, WHEN, WHO, WHERE, WHAT)
(   1,<2022-01-21 11:00:46.20 +0400>,<she>,<DPX200>,
      <created by zg, POWCHK disabled, PULCHK disabled
       configuration hash MD5:
       00 E9 B6 7A A2 85 ED C7 34 08 36 98 17 FE 4E 26
       data hash MD5: 16K
       CE FF 51 66 B0 23 08 67 0B E5 5D 41 AE 9A D7 43>)
$$ ##END=
$$ 
$$ hash MD5
$$ 7E 1E 96 48 97 9F 69 28 CB 7C 96 A0 9F 4E F5 C2
##$RELAX= 
##$RELAX= 
##$RELAX= 
##$RELAX= 
##$RELAX= 
##$RELAX= 
$$ Bruker specific parameters
$$ --------------------------
##$DU= <F:/spectra>
##$EXPNO= 1
##$NAME= <H-F>
##$PROCNO= 1
##$TYPE= <nmr>
##$USER= <she>
##$AMP= (0..31)
100 100 100 100 100 100 100 100 100 100 100 100 100 100 100 100 100 100 
100 100 100 100 100 100 100 100 100 100 100 100 100 100 
##$AQSEQ= 0
##$AQ_mod= 1
##$AUNM= <au_zg>
##$AUTOPOS= <>
##$BF1= 200.13
##$BF2= 200.13
##$BF3= 200.13
##$BF4= 200.13
##$BF5= 200.13
##$BF6= 200.13
##$BF7= 200.13
##$BF8= 200.13
##$BYTORDA= 1
##$CFDGTYP= 0
##$CFRGTYP= 5
##$CHEMSTR= <none>
##$CNST= (0..31)
1 1 145 1 1 1 1 1 1 1 1 1 1 1 1 1 1 1 1 1 1 1 1 1 1 1 1 1 1 1 1 1 
##$CPDPRG= <>
##$CPDPRG1= <>
##$CPDPRG2= <>
##$CPDPRG3= <>
##$CPDPRG4= <mlev>
##$CPDPRG5= <mlev>
##$CPDPRG6= <mlev>
##$CPDPRG7= <mlev>
##$CPDPRG8= <mlev>
##$CPDPRGB= <>
##$CPDPRGT= <>
##$D= (0..31)
0 1.2 0 0 0 0 0 0 0 0.06 0 0.03 0 0 0 0 0.0002 0 0 0 0 0 0 0 0 0 0 0 0 
0 0 0 
##$DATE= 1642748445
##$DBL= (0..7)
120 120 120 120 120 120 120 120 
##$DBP= (0..7)
150 150 150 150 150 150 150 150 
##$DBP07= 0
##$DBPNAM0= <>
##$DBPNAM1= <>
##$DBPNAM2= <>
##$DBPNAM3= <>
##$DBPNAM4= <>
##$DBPNAM5= <>
##$DBPNAM6= <>
##$DBPNAM7= <>
##$DBPOAL= (0..7)
0.5 0.5 0.5 0.5 0.5 0.5 0.5 0.5 
##$DBPOFFS= (0..7)
0 0 0 0 0 0 0 0 
##$DE= 6
##$DECBNUC= <off>
##$DECIM= 32
##$DECNUC= <off>
##$DECSTAT= 4
##$DIGMOD= 1
##$DIGTYP= 9
##$DL= (0..7)
0 120 120 120 120 120 120 120 
##$DP= (0..7)
150 150 150 150 150 150 150 150 
##$DP07= 0
##$DPNAME0= <>
##$DPNAME1= <>
##$DPNAME2= <>
##$DPNAME3= <>
##$DPNAME4= <>
##$DPNAME5= <>
##$DPNAME6= <>
##$DPNAME7= <>
##$DPOAL= (0..7)
0.5 0.5 0.5 0.5 0.5 0.5 0.5 0.5 
##$DPOFFS= (0..7)
0 0 0 0 0 0 0 0 
##$DQDMODE= 0
##$DR= 18
##$DS= 0
##$DSLIST= <SSSSSSSSSSSSSSS>
$$ [...]
##$SUBNAM2= <"">
##$SUBNAM3= <"">
##$SUBNAM4= <"">
##$SUBNAM5= <"">
##$SUBNAM6= <"">
##$SUBNAM7= <"">
##$SUBNAM8= <"">
##$SUBNAM9= <"">
##$SW= 18.0517287032376
##$SWIBOX= (0..15)
0 0 2 0 0 0 0 0 0 0 0 0 0 0 0 0 
##$SW_h= 3612.71676300578
##$TD= 16384
##$TD0= 1
##$TE= 0
##$TE2= 300
##$TE3= 300
##$TEG= 300
##$TL= (0..7)
0 120 120 120 120 120 120 120 
##$TP= (0..7)
150 150 150 150 150 150 150 150 
##$TP07= 0
##$TPNAME0= <>
##$TPNAME1= <>
##$TPNAME2= <>
##$TPNAME3= <>
##$TPNAME4= <>
##$TPNAME5= <>
##$TPNAME6= <>
##$TPNAME7= <>
##$TPOAL= (0..7)
0.5 0.5 0.5 0.5 0.5 0.5 0.5 0.5 
##$TPOFFS= (0..7)
0 0 0 0 0 0 0 0 
##$TUNHIN= 0
##$TUNHOUT= 0
##$TUNXOUT= 0
##$USERA1= <user>
##$USERA2= <user>
##$USERA3= <user>
##$USERA4= <user>
##$USERA5= <user>
##$V9= 5
##$VALIST= <valist>
##$VCLIST= <CCCCCCCCCCCCCCC>
##$VD= 0
##$VDLIST= <DDDDDDDDDDDDDDD>
##$VPLIST= <PPPPPPPPPPPPPPP>
##$VTLIST= <TTTTTTTTTTTTTTT>
##$WBST= 1024
##$WBSW= 4
##$XGAIN= (0..3)
0 0 0 0 
##$XL= 0
##$YL= 0
##$YMAX_a= 220985
##$YMIN_a= -154910
##$ZGOPTNS= <>
##$ZL1= 120
##$ZL2= 120
##$ZL3= 120
##$ZL4= 120
##$ABSF1= 10
##$ABSF2= 0
##$ABSG= 5
##$ABSL= 3
##$ALPHA= 0
##$AQORDER= 0
##$ASSFAC= 0
##$ASSFACI= 0
##$ASSFACX= 0
##$ASSWID= 0
##$AUNMP= <proc_1d>
##$AZFE= 0.1
##$AZFW= 0.1
##$BCFW= 1
##$BC_mod= 2
##$BYTORDP= 1
##$COROFFS= 0
##$CY= 11.3945322036743
##$DATMOD= 1
##$DC= 2
##$DFILT= <>
##$DTYPP= 0
##$F1P= 2.36226072786647
##$F2P= -0.459571619588291
##$FCOR= 0.5
##$FTSIZE= 0
##$FT_mod= 4
##$GAMMA= 1
##$GB= 0.15
##$INTBC= 1
##$INTSCL= 1
##$ISEN= 128
##$LB= 0.24
##$LEV0= 0
##$LPBIN= 0
##$MAXI= 10000
##$MC2= 0
##$MEAN= 0
##$ME_mod= 0
##$MI= 1.114404
##$NCOEF= 0
##$NC_proc= 0
##$NLEV= 6
##$NOISF1= 3.799351
##$NOISF2= 2.8
##$NSP= 1
##$NTH_PI= 0
##$NZP= 0
##$OFFSET= 15.70392
##$PC= 1
##$PHC0= -15873.52
##$PHC1= 17.40078
##$PH_mod= 1
##$PKNL= yes
##$PPARMOD= 0
##$PSCAL= 0
##$PSIGN= 0
##$REVERSE= no
##$SF= 200.130013532006
##$SI= 16384
##$SIGF1= 3
##$SIGF2= 2
##$SINO= 400
##$SIOLD= 16384
##$SREGLST= <1H.CDCl3>
##$SSB= 0
##$STSI= 0
##$STSR= 0
##$SW_p= 3612.71676300578
##$SYMM= 0
##$S_DEV= 0
##$TDeff= 0
##$TDoff= 0
##$TI= <>
##$TILT= no
##$TM1= 0
##$TM2= 0
##$TOPLEV= 0
##$USERP1= <user>
##$USERP2= <user>
##$USERP3= <user>
##$USERP4= <user>
##$USERP5= <user>
##$WDW= 1
##$XDIM= 8192
##$YMAX_p= 0
##$YMIN_p= 0
$$ End of Bruker specific parameters
$$ ---------------------------------
##NTUPLES= NMR FID
##VAR_NAME=  TIME,          FID/REAL,        FID/IMAG
##SYMBOL=    X,             R,               I
##VAR_TYPE=  INDEPENDENT,   DEPENDENT,       DEPENDENT
##VAR_FORM=  AFFN,          ASDF,            ASDF
##VAR_DIM=   8192,          8192,            8192
##UNITS=     SECONDS,       ARBITRARY UNITS, ARBITRARY UNITS
##FACTOR=    0.0002768,     1,               1
##FIRST=     0,             0,               0
##LAST=      2.2672688,     0,               0
##MIN=       0,             -154910,         0
##MAX=       2.2672688,     220985,          0
$$ Real data points
##PAGE= N=1
##DATA TABLE= (X++(R..R)), XYDATA
0 0 0 0 0 0 0 0 0 0 0 0 0 0 -3 8 -8 8 -8 16 -16 16 -24 24 -32 40 -41 49 -57 65 -79 89 -102 114 -131 147 -169
35 -169 189 -212 237 -267 296 -329 366 -406 451 -498 551 -607 670 -736 815 -896 987 -1088
53 -1088 1201 -1326 1470 -1631 1817 -2034 2290 -2598 2976 -3455 4079 -4939 6201 -8236 12094
68 12094 -22083 109643 220985 128530 109555 55053 27260 3033 23669 27328 17027 -15526
80 -15526 -36497 -69479 -104681 -144528 -154910 -152148 -147318 -137942 -99389 -52468 -2314 43252 85360
93 85360 107104 106661 91527 73826 57082 61920 82130 102862 115971 117765 98652 55257 -7729
106 -7729 -63008 -98563 -120825 -133571 -128284 -104045 -82402 -79385 -70024 -43909 -26272 -24503 -17452
119 -17452 2501 19177 24509 40894 78602 114446 130272 131024 125449 104192 54995 2351 -25846
132 -25846 -38061 -47187 -47246 -36703 -29801 -42165 -64524 -80750 -92087 -96424 -89478 -71397 -43931
145 -43931 -14143 12497 37723 59332 76282 88067 88284 77909 63984 51544 39649 26050
157 26050 23876 34366 35033 18658 -2150 -23507 -53633 -89192 -107730 -98566 -81389 -66621 -46439
170 -46439 -19254 469 821 -1992 10112 22849 24239 28996 46422 63062 64996 63428 69062 69658
184 69658 53895 30844 8563 -12374 -36089 -55968 -59456 -51802 -44324 -37769 -32820 -32593 -38602 -46633
198 -46633 -48346 -42813 -29013 -4444 20143 38881 55459 66744 66956 57210 46939 42031 32891
211 32891 17570 9236 9021 7425 -1584 -9699 -9971 -16208 -36776 -55383 -60677 -61423 -64333 -57667 -32044
226 -32044 -4841 7995 16113 26984 31871 24649 15769 19551 29845 34321 37157 44890 50369 44299
240 44299 29049 14988 1413 -17021 -34156 -43766 -47513 -45774 -40492 -32553 -23801 -17389 -13562 -14484
254 -14484 -19603 -20352 -14410 -6156 4980 20839 41148 54797 54337 49869 45407 33515 14061 -1011
268 -1011 -3322 -3209 -9868 -12544 -6122 -4235 -14017 -26299 -30448 -33256 -43556 -49184 -39190 -23384 -11892
283 -11892 -679 16249 31867 33537 27559 25360 23118 17231 12424 14905 22418 26017 25608 23907
297 23907 17769 6374 -7975 -22854 -33725 -39809 -40176 -35564 -29480 -20290 -8903 -3302 -3235 -4120 -2428
312 -2428 -1919 -5058 -2151 10781 22239 27233 32434 39894 41141 28741 14155 7684 1031 -11240
326 -11240 -19132 -15408 -8381 -9784 -14048 -10979 -9843 -18128 -27745 -28785 -23686 -21346 -18166 -5354 9419
341 9419 17875 21374 24436 26187 22422 14837 10822 10097 9694 10468 11650 12881 11874 7574 607 -9202
357 -9202 -18500 -23208 -27056 -29717 -26662 -18061 -9817 -6751 -4128 2282 4719 69 -2457 2475 8322
372 8322 9398 11273 20768 28355 24998 18846 17061 14186 3312 -8299 -10267 -7843 -10975 -13873 -10705
387 -10705 -6231 -8285 -14995 -16763 -14851 -16683 -18202 -13402 -4578 3220 7615 12797 18010 18860 17133
402 17133 14524 11545 9807 8870 8253 7562 7641 8678 7004 58 -5959 -9699 -14919 -21739 -25090 -19980
418 -19980 -13587 -12529 -9538 -1786 3154 404 -3228 304 5487 4559 4599 12388 20305 20364 16650 17504
434 17504 18828 11320 1140 -2440 -3532 -8055 -13743 -12943 -7927 -7781 -10447 -10748 -10703 -13233 -17044 -17247
450 -17247 -12472 -6597 -479 7283 13633 17623 18783 17219 13908 10566 10031 9461 7011 6052 8315 7829
466 7829 2886 -1919 -3534 -6001 -14417 -21176 -20674 -19180 -20297 -19157 -10263 90 2008 732 4781
481 4781 7740 4597 747 4993 13460 16536 16257 20051 23004 18253 8900 2968 840 -4253 -11337
496 -11337 -13332 -12381 -13057 -14974 -14692 -11671 -10473 -11218 -11242 -10894 -10111 -7477 -3495 2351 9794 17406 22665
513 22665 22584 19334 17365 13627 7059 3510 4938 6683 3322 -1519 -1804 -3732 -11396 -18113 -18444 -16310
529 -16310 -18743 -21399 -16711 -9595 -7513 -5922 1094 10096 12243 9460 10987 14005 12243 10131 13070
544 13070 18602 19648 15350 11622 7813 530 -8005 -13276 -14556 -14329 -15268 -14876 -14013 -14538 -14395 -13319
560 -13319 -11671 -8304 -3704 821 2684 4809 10307 15152 16007 17477 21154 21619 16012 8910 6390
575 6390 4916 -517 -4768 -3194 -1160 -5941 -13970 -16578 -16372 -20355 -22989 -17771 -9238 -5488 -5335 -1257
591 -1257 5202 6364 6049 9122 14723 16858 14734 14342 16025 14409 10785 9053 8145 5075 -1111 -7362
607 -7362 -12163 -16518 -18336 -17108 -15304 -12307 -9162 -7878 -9101 -9783 -7685 -3838 -1306 3230 11089
622 11089 17292 17804 16189 16943 17748 13181 7809 7702 7546 1790 -4943 -6072 -4285 -7086 -11406 -11033
638 -11033 -9756 -13242 -18911 -19535 -14510 -11124 -8485 -891 8356 12610 11671 10804 11999 10909 8668 9268
654 9268 11659 13001 12140 9618 7159 3848 -788 -4947 -9532 -13349 -15349 -16881 -17753 -16671 -12254 -6605
670 -6605 -4056 -2603 1267 2949 552 -1057 2610 8742 11400 13221 18321 21623 17441 10405 6364
685 6364 4353 -1082 -7924 -8301 -6030 -7743 -11530 -11385 -8323 -9045 -12273 -11772 -9173 -9008 -9354 -6510 287
702 287 6442 10030 14138 17667 17488 14123 9893 7197 5182 3542 3783 3975 2914 1919 -638 -5980
718 -5980 -10689 -13070 -14267 -16266 -16991 -13159 -8504 -6834 -4439 833 6235 6995 5103 7088 9683 8111
734 8111 6092 8785 13962 14183 10846 10313 9888 3539 -4767 -9099 -9468 -10823 -13748 -12515 -8573 -7310
750 -7310 -8787 -8623 -6559 -5248 -5830 -4597 -443 3109 5471 8817 12306 14741 15203 13984 11672 7798
766 7798 4786 2134 -1076 -2546 -1912 -1603 -3309 -6281 -7489 -8787 -12816 -15683 -13873 -9720 -7849 -6218
782 -6218 -889 5105 6099 5290 7255 10087 8948 5944 6846 10109 9842 7184 7569 8717 6397 187
798 187 -4289 -5665 -8993 -13216 -13587 -10936 -8479 -7559 -6117 -3373 -2574 -3572 -3431 -2446 -366 2195 5169
815 5169 8614 11096 13031 13824 11573 8490 6309 3572 -640 -3774 -3746 -2288 -3695 -5604 -4059 -3596
831 -3596 -6518 -10670 -11378 -9143 -9478 -9943 -4986 2000 5238 5649 8001 11368 9802 5273 4283 5876
847 5876 5325 3308 3882 6938 7092 3505 999 -1020 -4457 -9329 -12282 -11988 -10691 -9763 -6911 -3166
863 -3166 -709 880 1037 1114 298 74 1127 2288 3964 7577 10731 11201 10229 9466 7550 2781 -2930
880 -2930 -4771 -5123 -6902 -7926 -5871 -2040 -2092 -4674 -4868 -3784 -5866 -9063 -7879 -3337 -360 968
896 968 4935 10574 11746 9286 7584 7302 5133 899 -724 985 1547 1192 1109 1667 918 -2506 -5882
913 -5882 -8124 -10180 -10917 -10205 -8046 -4567 -913 2419 4177 4388 4736 4488 2538 1427 2494 4669
929 4669 5528 5470 7690 9585 6811 2370 -92 -1922 -5561 -9862 -9561 -6262 -5521 -5988 -3948 -654 -484
946 -484 -3514 -4274 -1958 -1945 -2882 -672 4259 7600 7807 8757 10380 9120 5436 2274 747 -610 -2112
963 -2112 -2892 -1696 -1026 -1500 -2280 -3625 -5387 -6936 -7823 -8234 -7620 -5264 -1544 601 2247 4998 7067
980 7067 6220 4260 4202 4869 3532 1876 3447 5832 5894 3544 2432 2580 -598 -5952 -7956 -6789 -7065
997 -7065 -8579 -6982 -2723 -1342 -2614 -2357 -213 -59 -1277 -1331 1518 4184 4241 5515 8028 8980 7659
1014 7659 5468 4218 2245 -852 -2256 -3037 -3510 -2923 -2171 -2513 -3268 -4058 -4598 -6641 -7862 -6427 -4040
1031 -4040 -2417 -680 2001 5692 6288 4670 4735 5849 4578 1951 1907 4173 3987 2014 2485 3769 2410
1048 2410 -1334 -3986 -4396 -5762 -9025 -9008 -5589 -3094 -2650 -1427 1018 1610 -308 -1115 10 881 1658
1065 1658 2830 4923 6949 7132 6515 5736 3868 2020 -140 -2095 -3711 -4175 -3589 -3092 -3385 -2074 -737
1082 -737 -2253 -4379 -5046 -4180 -4676 -5008 -2042 2396 4349 4667 5827 7237 6117 2272 1010 2309
1098 2309 1980 -111 78 2519 2757 273 -845 -147 -1802 -5167 -6909 -6394 -5374 -5663 -4182 -879
1114 -879 1806 2462 2592 2653 2324 706 -165 830 1816 3130 4932 5562 4795 4216 3026 386 -2431 -3457
1132 -3457 -3369 -4549 -5002 -3838 -1990 -1529 -1919 -1410 237 -707 -3403 -3420 -1219 181 -63 2057 6301
1149 6301 7043 4986 4184 4233 2676 -661 -2291 -676 214 -957 -1090 23 201 -1713 -3434 -3322 -3303
1166 -3303 -4402 -4660 -3559 -2046 -720 899 2491 3650 3860 3702 2478 1452 1085 1265 1517 1802 2779
1183 2779 3722 2916 469 -844 -1311 -2872 -5062 -5042 -3160 -2541 -3784 -2654 -292 166 -1185 -1069 918
1200 918 1301 -311 -257 2158 3672 3011 3110 5149 5374 2646 770 565 -205 -1920 -2754 -1614 -760 -1611
1218 -1611 -2349 -2154 -2317 -3118 -3602 -3216 -2292 -1784 -751 427 1060 2065 3420 3395 2872 2839 3403 2614 823
1237 823 1255 2320 1579 561 446 888 -323 -3306 -4074 -3080 -3312 -4455 -3837 -1516 -158 -1921 -1811
1254 -1811 336 954 -96 -74 2023 3129 2275 2107 3802 4371 3117 2165 2155 1937 60 -1497 -1594 -1446
1272 -1446 -2161 -2246 -2045 -1889 -2383 -2783 -3107 -3404 -2881 -1705 -915 -158 1238 2643 3005 2391 2612 3531 2833
1291 2833 1488 1547 2612 2312 660 339 1469 809 -1474 -2589 -2015 -2362 -4415 -4915 -2766 -1550 -2231
1308 -2231 -1962 129 1140 208 -437 932 1824 1302 1372 2801 3886 3468 2798 2864 2609 1349 78 -1007
1326 -1007 -1545 -2099 -2507 -2551 -2424 -2258 -1721 -1866 -2611 -2190 -1699 -1704 -1934 -869 1351 1944 1719 2717 4303 4114
1346 4114 2189 1551 2369 2080 30 -226 803 796 -904 -1778 -733 -947 -2988 -4033 -3052 -2454 -3203 -3231
1364 -3231 -1327 258 230 546 1819 2620 2230 1715 2097 2615 2052 1931 2236 2134 1902 1130 575 -298 -1465
1383 -1465 -1921 -2593 -3612 -3580 -2538 -2323 -2367 -1969 -567 -62 -873 -357 1070 1376 858 1250 3144 3898 2437
1402 2437 2500 3457 3224 1363 -248 350 51 -1975 -2828 -1908 -1757 -2696 -3323 -2219 -1447 -2378 -2636 -1467
1420 -1467 -735 -479 -256 915 2403 2603 2836 3298 3572 3235 2791 1759 1441 685 -26 -341 -1219 -1396 -1325
1439 -1325 -2023 -2785 -3097 -2683 -2728 -3654 -3216 -1490 -889 -873 -7 2092 3056 2169 2281 3560 3670 2352 1813
1458 1813 2530 2996 1458 417 1186 906 -1027 -2502 -2286 -2391 -3774 -4512 -3493 -2667 -2637 -2065 -1177 257
1476 257 426 352 1220 1708 2135 2227 2684 3172 3496 3610 3237 2294 1589 1175 -28 -1767 -2311 -2219 -2642 -3556
1496 -3556 -3318 -2203 -2059 -2928 -2603 -1594 -886 -1562 -1311 1010 2161 1781 2261 3802 4524 3415 2394
1513 2394 3012 2774 1101 -64 154 277 -880 -1990 -1817 -1749 -2618 -3545 -3262 -2907 -3012 -3127 -2048 -814
1531 -814 1 868 1525 2229 2425 2796 2814 2487 2492 2659 2516 1697 1653 1613 641 -762 -1821 -1603 -2210 -3492 -3613
1552 -3613 -2678 -2249 -2862 -2603 -1018 -192 -846 -647 869 1815 1519 1399 2682 3591 3040 2385 2837 2792 1409
1571 1409 -118 -124 -57 -1096 -2207 -1917 -1592 -2086 -2687 -2727 -2211 -2351 -2157 -1454 -792 183 702 1330 1886 2103
1591 2103 2721 2842 2131 1888 2364 2011 1002 673 1098 676 -841 -1530 -1266 -1757 -3102 -3510 -2476 -1844
1609 -1844 -2095 -1865 -331 540 -11 -227 887 2022 1188 1260 2277 3114 2378 1995 2095 2451 989 -186
1627 -186 -582 -1049 -1738 -2195 -2285 -1736 -1684 -1633 -1521 -1445 -1527 -1575 -1250 -991 -286 822 1779 1971 2471 3220 2883 1716
1649 1716 1381 1529 1009 -106 -481 199 194 -998 -1383 -722 -756 -2283 -3118 -2500 -1894 -2537 -2309 -377 774
1668 774 1124 1152 2020 2302 1654 902 1114 1691 1132 996 1547 1950 1366 687 129 -468 -1396 -2233 -2850 -2557
1688 -2557 -2627 -1945 -1268 -919 -244 6 260 -182 -235 190 313 136 1086 2359 3135 2430 2119 2298 1716 -92
1708 -92 -1025 -834 -732 -1515 -1982 -926 -278 -1052 -1373 -877 -782 -1576 -2281 -1574 -350 -443 243 1348 2511 2427
1728 2427 1856 1641 1766 766 -82 14 324 491 477 425 658 -1 -436 -1019 -1804 -2175 -2111 -1685 -1813 -1156 -110
1749 -110 659 452 565 1087 940 46 -249 613 1050 513 961 1858 2089 1226 442 354 210 -1336 -1974 -1216
1769 -1216 -572 -1094 -1052 -310 481 -290 -892 -632 -192 -635 -929 -398 639 624 951 1460 1656 1356 513 259
1789 259 -37 -385 -514 -252 -224 86 393 84 -297 -455 -570 -807 -1266 -1316 -397 -99 -76 74 868 1072 390
1810 390 64 280 499 -285 -591 162 1093 369 108 781 942 -45 -914 -721 -401 -841 -1028 -324 359 404
1830 404 -19 -6 278 -135 -566 -470 -113 -149 103 433 741 756 608 560 191 -119 -261 -360 -549 -244 269 663
1852 663 180 116 389 164 -865 -827 -451 -128 -476 -533 508 1028 279 36 101 411 -417 -1114 -154 413 160
1873 160 3 640 1198 743 -128 -41 126 -752 -1173 -637 -129 191 84 342 642 144 -208 -413 -684 -799
1893 -799 -612 -286 145 400 951 1077 526 371 337 235 -391 -716 -28 271 13 126 880 923 -2 -720 -464
1914 -464 -665 -1389 -1601 -742 107 101 -160 643 1136 441 -385 37 138 -188 -572 47 1077 922 936 1032 993
1935 993 480 -338 -798 -756 -1025 -1152 -764 -419 -280 3 -35 -55 -516 -651 -745 -901 -521 208 796 1025 1319
1956 1319 1860 1771 722 284 402 297 -491 -610 -27 485 -8 -283 154 48 -660 -1789 -1479 -1092 -1510
1975 -1510 -1507 -319 566 686 511 854 1227 838 121 317 646 779 630 718 1084 1100 844 460 6 -779 -989
1996 -989 -1533 -1595 -1414 -1240 -771 -617 -479 -70 -128 -451 -170 -19 423 223 315 1399 1821 1387 1282 1545 1481
2017 1481 568 -260 -182 -61 -677 -1121 -816 -44 -648 -1239 -1054 -708 -1193 -1517 -1090 -504 -238 -183 533 1293
2037 1293 1281 1129 1199 1202 1040 585 492 674 504 322 376 102 -68 -451 -742 -1184 -1631 -1259 -1207 -1319 -1059 -443
2059 -443 -63 2 -71 463 631 483 287 751 1452 1217 702 1205 1362 762 -94 83 228 -554 -1435 -901 -428
2080 -428 -972 -1267 -973 -638 -638 -1022 -824 -144 -158 -42 232 806 1127 1090 1186 1225 1145 946 421 347 49 65 -102
2103 -102 -289 -488 -610 -597 -1093 -1231 -971 -977 -1181 -1080 -406 181 121 387 848 1147 794 342 804 1248 863
2124 863 604 811 1263 663 -1 -41 -31 -851 -1484 -1329 -997 -1147 -1307 -821 -226 -194 -409 -213 168 21 188
2145 188 364 901 983 1059 1483 1326 1285 1155 789 262 -273 -659 -513 -963 -1138 -593 -629 -770 -1136 -900 -710
2166 -710 -867 -951 -483 76 259 391 999 1719 1380 811 1290 1339 729 263 204 537 223 -388 -157 176 -294
2187 -294 -945 -1255 -1032 -1378 -1539 -1360 -706 -455 -259 155 777 790 700 729 646 858 645 823 852 1041 1066 1008
2209 1008 511 280 -180 -398 -996 -1334 -1213 -943 -1298 -1469 -585 -122 -336 -629 -90 183 -222 -330 419 1037
2229 1037 911 901 1269 1712 1535 539 379 448 -128 -489 -546 -397 -289 -1016 -462 -496 -580 -1013 -927 -678 -722 -723 -439
2252 -439 36 276 702 1150 1054 808 970 1000 337 222 449 493 148 69 66 182 -202 -893 -652 -684 -896 -1278
2274 -1278 -885 -455 -322 -485 223 723 452 150 441 873 469 -36 479 971 825 291 540 583 291 -87
2294 -87 -364 -371 -499 -853 -649 -519 -325 -449 -419 -107 -173 23 30 -34 29 264 375 607 431 837 993 515 119
2317 119 296 113 -164 -521 -273 70 -411 -598 -416 -152 -403 -705 -483 -149 -334 -368 -38 389 374 114 420
2338 420 895 633 291 232 465 446 9 -117 271 133 -259 -389 -327 -412 -477 -649 -435 -648 -278 -194 -118 56
2360 56 254 -14 277 200 318 675 452 182 432 732 258 10 202 340 -410 -507 -297 -86 -692 -644 -484
2381 -484 -142 -328 -725 -168 -64 -229 -329 -144 381 341 201 297 628 741 348 265 428 308 -108 41 198
2402 198 23 -167 -210 -261 -255 -399 -503 -544 -481 -290 -374 -321 -184 139 219 287 147 233 416 128 14 376 573 417
2426 417 280 254 479 98 -319 -135 -91 -166 -794 -471 -177 -176 -482 -206 -10 -141 -535 -414 -13 0 -133 92
2448 92 477 664 426 442 651 471 182 -36 -206 -13 -72 -35 184 79 105 -7 -227 -349 -357 -563 -661 -540 -257
2471 -257 20 -37 73 170 611 349 -209 -121 318 -26 -162 17 445 471 131 330 437 191 -287 -468 -154
2492 -154 -189 -397 -373 -128 55 -106 -70 179 112 -302 -333 -109 -234 4 292 216 514 531 415 260 36 -94
2514 -94 -77 -272 -108 -1 230 84 36 154 211 -194 -607 -299 -344 -420 -334 -52 250 199 -47 274 313 118 -170
2537 -170 -290 284 55 -387 41 466 208 73 -20 239 -113 -494 -401 -251 -209 -269 -117 44 99 205 -161 55
2559 55 4 -195 -152 44 43 91 259 305 249 396 228 -40 -74 41 -147 -266 -510 63 257 176 -168 -22 82
2582 82 -26 -525 -191 92 -47 -145 59 246 378 25 259 236 -89 -283 -131 70 2 22 39 139 -38 -268
2604 -268 -221 -101 -130 -334 -290 -54 -24 -138 -76 100 200 44 234 86 -245 150 190 64 123 274 302 264 -207
2627 -207 -124 20 -235 -557 -166 14 -99 -344 -33 -48 -206 -188 0 125 -77 -105 55 179 538 154 484
2648 484 498 443 -16 34 86 -9 33 -184 -57 -147 -105 -136 -181 -406 -396 -255 -210 -118 -141 18 23 112 256 360 18 52
2674 52 108 263 137 128 343 501 163 91 36 47 -143 -506 -318 -95 -388 -396 -378 169 -173 -291 -246 145 -129 -168
2698 -168 -203 41 191 187 164 651 523 224 182 275 -23 -127 -192 -126 -134 -174 -49 -20 -304 -174 -200 -560 -530 -409 -349
2723 -349 -287 -82 312 318 314 261 210 315 -58 16 131 246 123 103 145 505 220 -74 -370 -34 -376 -570 -510 -197
2747 -197 -104 -425 -114 284 116 -32 -80 -84 -56 -131 -104 269 185 326 339 373 269 234 51 -157 -252 -106 -161 -224 -163
2772 -163 3 128 -34 -198 -203 -129 -238 -430 -198 -60 -19 -83 119 483 368 10 46 8 -66 -199 -36 124 91
2795 91 -13 80 394 159 -71 -122 -85 -379 -328 -140 4 303 57 83 212 322 50 16 29 -94 -52 -18 136
2818 136 191 310 241 110 82 -168 -230 -307 -273 -132 -72 31 -183 -17 237 107 -60 6 71 14 -159 31 254
2841 254 211 152 2 400 42 -187 -174 -69 -174 -345 -255 -100 -43 -129 -24 18 -88 -12 15 -104 35 -69 74
2864 74 133 118 420 155 181 225 5 63 -81 -26 -24 -64 -140 -10 112 68 -269 -274 -389 -133 -246 -7 -139 141 29
2889 29 -152 -8 327 157 -102 15 165 194 13 31 385 271 -109 43 46 33 -258 -327 -167 -13 -50 -132 -168
2912 -168 -208 -180 -268 -164 -136 -17 -148 103 275 92 219 140 341 279 224 266 155 -61 44 77 -137 76 79 -47
2936 -47 -163 -163 -295 -358 -281 -226 -107 -102 -57 -81 238 115 -209 88 308 -10 -100 123 71 274 158 173 160 69 -12
2961 -12 -245 -107 -205 -243 -146 -180 -122 -8 -32 -234 -29 -5 -106 -234 -208 -56 59 297 88 289 409 110 -100
2984 -100 23 26 -43 -179 27 106 195 -176 -67 66 -123 -219 -276 -178 -217 -295 -28 15 194 38 101 330 -8 -15 -8
3009 -8 53 90 109 14 152 259 248 -48 -39 4 -55 -199 -127 -23 -23 -18 5 -71 78 -19 -23 -124 96 -43 -128 -115 219 227
3037 227 200 42 164 195 -110 -199 -51 -125 -130 -210 1 129 107 74 -123 88 40 -124 -168 87 -150 -122 11 364
3061 364 219 108 81 61 -122 -174 -158 -148 -14 -136 -49 5 68 -13 49 -73 -84 -283 17 32 7 11 64 3 156 272
3087 272 206 112 -43 116 -59 36 -10 60 169 118 15 -78 -19 -222 -112 -303 -136 -34 -109 -117 124 -151 236 -52
3111 -52 -28 51 -75 204 -65 -88 209 21 250 87 281 -52 -125 -25 -137 -124 -107 -44 -62 -116 -96 -104 -34 43 -72
3136 -72 -10 228 -58 150 -3 158 111 229 74 178 121 160 -149 -228 -53 -18 -141 34 -35 -91 -240 -128 8
3159 8 -64 -314 -212 -230 112 -70 -154 -84 59 43 110 127 105 135 32 205 63 131 -39 -68 -51 -183 -147 -18 -18 -166
3185 -166 -91 80 -70 15 -61 73 -72 13 16 -41 -179 247 181 221 121 66 124 -22 -37 18 -144 75 215 19
3209 19 -68 117 1 20 -93 -12 -25 -37 -8 15 121 26 15 75 49 -128 -17 136 -108 -64 45 61 -47 -95 215
3234 215 41 76 -32 -197 -48 106 -52 90 88 54 241 224 53 55 -113 -39 -86 -47 -20 -55 -111 -67 60 -68 58
3259 58 -165 7 -62 -182 -129 30 -7 130 174 -30 61 157 118 -72 -73 -61 114 -14 148 213 154 83 96 4 -223
3284 -223 -71 -196 -388 -252 -44 -140 66 138 -8 -16 25 -110 -32 73 9 242 45 172 245 247 138 -29 127
3307 127 102 -29 -181 -252 -30 -27 -342 -136 -79 118 -151 -112 -34 40 -183 -132 87 123 254 124 168 160 144 10 -32
3332 -32 63 29 -89 -66 79 74 17 -11 -275 -30 -182 -108 -136 -191 -96 23 -111 -7 136 144 117 12 74 149 -196 85
3358 85 121 85 136 150 1 36 41 -72 -62 -167 77 -223 -115 69 104 -31 -114 61 130 68 -187 43 91 -30 -7
3383 -7 28 51 13 -43 -52 -148 -8 -148 -143 241 110 -28 -148 99 26 133 -69 30 239 38 -48 78 77 117 -30 26
3409 26 -119 -8 -34 63 -180 -26 53 -74 -67 17 -78 -23 32 -83 -13 26 15 36 180 129 161 51 123 174 -38 64
3435 64 106 78 -10 -112 10 -16 -142 -31 -244 -70 -124 -83 33 -160 -45 -101 83 53 -9 123 130 16 137 114
3459 114 91 202 81 152 172 51 17 -2 -41 -154 -71 -261 -54 -75 -92 -59 -58 -149 -46 -32 -50 -60 113 -57 124
3484 124 139 119 173 150 186 141 198 -45 -143 -6 41 7 -112 -52 -79 -143 -128 -162 -183 -130 -98 -172 -69 93 -52 169
3510 169 133 102 36 -12 123 70 34 79 135 -15 3 99 -36 -140 -48 -28 1 -199 -203 -106 101 111 105 67 101 257 -60
3537 -60 -45 -15 112 48 155 -8 139 26 169 61 89 -8 -100 3 -51 -9 -33 29 -83 104 99 142 -9 -135 -57
3562 -57 -69 0 -35 66 111 136 98 203 97 -143 -126 -171 -71 -114 -146 -68 -196 -25 -83 20 -14 -100 -141 -106 -164 4
3588 4 74 195 158 230 26 174 4 56 -78 18 -216 -133 62 -99 -125 -6 -61 -27 -219 -242 -192 -14 74 -55 41
3613 41 267 4 147 227 128 25 -41 21 82 38 -44 82 1 1 111 160 -179 -137 -13 -185 -72 -221 -115 -234
3637 -234 -46 14 64 -9 49 174 101 9 122 28 130 48 144 -44 189 80 -83 90 -67 5 -112 -148 -271 -139
3661 -139 -165 -131 -117 37 -167 -70 81 -157 72 19 234 176 71 250 124 120 -35 -63 60 -15 -7 182 -109 -181
3685 -181 -114 -78 -150 -160 -100 -38 -132 -151 72 150 -23 84 128 14 177 57 145 197 232 2 -33 22 149 72 -180
3710 -180 29 -241 -39 -30 34 -77 -216 -260 188 23 -52 -107 -44 -12 20 131 20 0 228 85 -92 46 14 -105
3734 -105 -109 43 3 7 -51 74 -33 -26 -29 -31 -143 -127 16 130 -127 -49 80 -5 60 35 51 -130 25 17 4 29 -180
3761 -180 80 109 -9 -86 -6 -31 -23 -5 -85 -50 -70 113 181 159 76 94 98 -104 66 93 133 -43 78 186 -4 207
3787 207 -196 14 -84 -80 -205 -153 -68 16 -36 -29 -25 56 -92 92 -45 -195 8 168 113 -28 -46 202 40 -4 -100
3812 -100 100 68 41 -54 57 -286 -75 -97 -130 -46 -137 -197 -10 -126 -143 -75 -72 115 185 180 224 214 -51 14 125 28
3838 28 -130 -34 -133 -65 -70 -131 152 144 -49 -35 29 -336 -184 -23 -24 -44 29 -74 15 -81 103 46 16 113 -52 106 172
3865 172 -38 -63 119 39 88 -32 43 11 -126 -162 -105 -12 35 -102 121 77 -118 -101 197 1 -80 -130 -37 168 -74
3890 -74 -23 112 13 -84 73 89 -129 73 -107 70 -96 59 -71 133 -25 11 -15 -91 -150 -23 125 -14 -30
3913 -30 -36 69 -21 -176 9 105 22 -142 -90 1 -102 157 40 234 105 3 180 -54 117 -44 92 73 -22
3936 -22 169 200 -14 79 80 17 91 -94 0 -55 6 -61 22 -10 -102 -83 -75 74 13 -89 -51 36 200 37 -151 100 63
3963 63 237 127 100 -11 71 -134 59 22 47 -57 45 -75 -88 25 11 25 -86 -180 -79 70 -39 -64 39
3986 39 -91 -47 -135 35 -35 2 153 174 106 -14 -81 63 138 -51 34 94 121 -143 -111 -190 -190 -256 -85 -158 -82 -49 -11
4013 -11 -36 76 2 19 -16 38 83 116 129 106 204 90 189 160 64 27 -22 -44 -150 108 -43 -111 3 2 32 34 -3 19
4041 19 82 -82 -86 -22 33 21 -51 91 47 -33 64 7 -91 -202 13 6 25 -130 -4 -156 -51 -56 88 104 -86 -190
4067 -190 43 19 13 157 -19 -37 3 -28 91 298 -139 -170 104 23 89 23 126 -86 -181 -45 47 150 27 -43
4091 -43 -18 104 -49 -12 12 -100 83 46 81 110 -97 30 21 -58 29 1 141 -21 20 16 27 6 -74 -48 8 4 27 136
4119 136 173 -23 45 117 59 -21 40 123 -44 -130 -67 29 124 -117 -152 69 -135 61 -58 -69 -133 -99 -97 -39 -12 113
4145 113 118 170 117 56 -20 -20 11 -60 186 145 34 81 77 104 -204 -168 25 -62 -62 -61 40 53 -9 4 89 -3 -4 30 84 1
4175 1 -19 -28 167 72 -56 59 -24 106 -86 121 125 20 -67 -97 61 3 65 -127 -126 -25 -111 39 -30 -100 -40 150
4201 150 207 205 30 13 23 -16 -36 53 7 48 24 24 225 -46 -83 53 -168 -129 -166 -51 -99 -138 86 -69 37 76
4227 76 -169 101 90 36 -171 193 173 25 12 252 55 64 -77 -64 120 -48 -87 5 92 113 -37 138 -137 -207
4251 -207 -96 -29 13 -103 -119 63 47 -84 48 32 -135 74 -137 122 -100 -30 144 160 -33 1 3 -2 -1 -80 91
4276 91 -69 -52 -96 44 216 131 39 130 53 -198 -258 27 -6 60 -6 8 -21 -12 44 62 46 -249 -91 -100 63 263 15
4303 15 -126 28 54 45 7 105 -15 41 81 -120 -185 91 228 -28 -48 -164 -37 -126 -163 -17 -35 69 61 13 66 -193
4329 -193 0 -17 -8 7 -73 49 95 56 67 171 170 82 -40 7 54 -3 -152 58 77 -37 -131 58 42 -6 -212 59
4355 59 -125 -54 87 -25 170 20 130 -11 -2 -142 31 5 -102 46 3 -77 46 -94 2 -11 36 -92 77
4378 77 -35 -113 5 -98 -158 -29 0 -20 21 -214 -77 -63 12 27 -100 -9 46 28 -24 81 20 95 -27 -16 93
4403 93 0 46 121 -99 33 -89 81 -11 -85 34 -38 -97 -149 27 160 77 95 -128 124 -129 -175 14 -61 -19 56
4428 56 -105 20 20 -31 76 -70 -160 -24 9 26 -78 -181 39 112 103 121 167 34 -83 -30 35 -104 -158 -113 -75 -6
4454 -6 61 -105 12 -6 0 -49 84 1 21 11 -10 -67 41 163 -90 152 -46 59 64 69 -46 154 -1 -168 -32
4479 -32 -102 87 1 -164 -75 30 -86 -74 72 262 -126 -57 -83 -52 -44 -52 101 133 -13 29 -31 113 102 81 -15 -111
4505 -111 -62 -127 32 -12 -13 -45 49 156 221 -2 35 -1 -127 107 41 103 71 193 -84 142 -49 87 149 57 -100
4530 -100 -40 180 -45 -156 -76 -5 -96 -143 60 -81 -77 -80 162 48 -70 47 6 120 -81 112 -30 -27 -85 -37 -26
4555 -26 189 -9 -141 -56 105 -25 129 -143 -6 -13 -30 -22 82 -29 -115 1 31 -25 -159 -11 -88 -67 -40 81
4579 81 -80 -39 -69 129 25 -64 15 -7 -136 -112 181 68 29 -75 -28 2 -227 -209 10 78 60 -27 151 101 71
4604 71 -176 -50 -55 2 7 -86 35 71 65 5 60 123 73 80 -88 -68 132 3 -86 -135 -15 71 144 -95 -99 16 -50 -127
4632 -127 151 -22 -69 -30 21 114 63 43 27 137 -262 -52 17 135 -105 -178 106 63 -125 2 -62 -133 72 20
4656 20 212 69 133 -2 108 -141 16 -110 26 20 -102 3 13 -42 -32 57 82 59 -21 -39 113 -76 -40 116
4680 116 -161 146 -42 50 116 -19 51 224 142 115 -109 82 123 -63 186 -9 59 53 -76 -13 3 -3 -54 37 -15
4705 -15 72 31 55 22 53 73 55 -93 -34 136 -60 -30 -177 -41 -85 46 -117 10 18 96 -33 -47 -36 -28 20 98 -64
4732 -64 -8 62 -4 24 -106 -82 18 151 36 -18 29 119 226 -138 -56 155 -20 -32 -75 -22 -25 -103 -110 56 142 -67
4758 -67 -201 90 -96 -53 33 26 25 -14 95 -55 84 -51 -81 -117 -53 -151 97 -113 104 31 -99 -91 -56 -24 80 -57
4784 -57 72 17 -126 109 -108 82 -77 -128 -92 -14 99 72 -44 -36 29 76 -33 -155 9 -54 -46 160 -44 -105 -46
4809 -46 -111 163 -29 -102 -58 121 5 80 -34 -248 -124 85 44 -74 22 -90 -43 -177 -129 107 -57 103 -39
4832 -39 18 -12 -45 -56 -139 114 35 107 138 57 49 -209 -46 -109 -260 20 -104 -93 53 91 -119 -217 -14 -60 -112 -20
4858 -20 122 -108 -113 49 59 -89 16 133 24 -7 -29 82 -40 -104 181 20 37 14 -49 96 -84 83 109 -113
4882 -113 -216 49 -149 -168 -95 33 82 46 -231 -90 -46 153 -69 74 6 133 41 65 20 -48 -76 199 6 -14
4906 -14 24 -12 9 -135 -23 -92 75 -49 37 -31 100 -109 28 -1 -74 21 -83 -27 97 133 -247 -81 -31 -11 -122
4931 -122 -17 -61 56 72 97 21 -33 -148 -5 -113 11 -17 14 31 -7 -1 -74 -73 119 86 -1 131 -126 24 7 -90
4957 -90 72 38 19 43 63 70 -48 77 27 -107 98 -51 159 -18 84 235 20 -81 41 -126 -159 224 7
4980 7 -5 -50 -11 -155 -157 46 -46 -53 20 -82 81 -23 89 86 -93 -11 -163 85 -7 -30 -112 14 176 -115 -60 -19
5006 -19 64 -28 -36 69 -29 -68 -116 84 165 -85 144 135 0 -56 -26 -52 125 -105 -49 90 -25 105 -51 74 108
5031 108 59 83 -47 -39 -66 53 -3 113 -45 30 -119 -146 -151 16 -95 -40 -79 -80 103 63 -97 -11 93 -92 -26 31
5057 31 -88 -76 -26 95 100 0 -108 -49 130 -78 -36 -30 42 -20 -88 -82 -9 -6 -62 -48 76 163 -52 -91 -8 -117 -15
5084 -15 68 3 -101 64 -34 6 22 2 96 82 -164 -60 55 52 2 48 82 38 66 -60 101 137 -12 15 30 24 -25
5111 -25 -17 -35 -17 -83 -113 2 -51 26 150 -13 -29 -49 13 33 115 -163 16 37 -8 -90 -60 133 153 -23 -60 38 -139
5138 -139 -40 26 83 -124 -208 96 22 66 61 27 -74 -163 47 -88 -33 -64 -42 9 -11 -22 73 7 51 -6 -50 160 -86
5165 -86 -41 -11 49 56 -41 98 -1 35 -131 -110 44 -82 136 -70 -209 -62 39 58 -52 168 30 -75 -48 92
5189 92 163 -35 35 -70 208 22 -92 -63 24 94 57 -82 25 98 75 -38 -54 39 -32 -36 -40 -95 -95 -34 -24 58 -73
5216 -73 -106 -58 -48 -41 -27 20 -28 31 -34 -103 21 -68 40 -70 -140 63 133 113 -7 23 -2 95 43 -5 -109 1 77
5243 77 -39 32 87 -144 -121 20 -8 -34 -103 -119 108 -23 -66 -93 75 -48 -66 -39 16 -162 -13 57 -76 -132 15
5268 15 -51 88 -151 -90 -38 -34 -103 -55 -55 -4 -13 -73 -29 41 35 -62 -172 -8 -17 111 -3 -187 -43 -17 59 41 -131 -5
5296 -5 15 -185 24 -158 116 109 70 -105 85 -78 -41 40 71 9 0 33 108 -66 -275 98 32 -11 14 57 -16 -152
5322 -152 -14 37 18 61 -32 -36 166 -19 -144 -49 -48 -59 -113 -43 28 -176 106 49 55 8 -77 -132 84 19 -29 91 97 39
5350 39 52 -12 114 6 201 32 -209 -64 -14 34 -45 -3 27 79 -31 64 -5 51 -83 5 -38 27 18 -49 14 -2 -203
5377 -203 -36 116 -27 -34 18 7 -181 15 -148 -54 -47 166 70 5 -42 131 -1 -47 40 -186 94 -67 28 -63 123
5402 123 -19 -2 -45 -49 -4 25 -171 37 -88 79 44 -51 104 10 -109 -118 98 53 -7 36 57 -69 77 -48 185
5427 185 209 -82 -36 39 58 43 90 39 31 -109 85 -124 -49 -106 92 -16 -37 85 79 -30 -247 -106 -56 23 -80
5452 -80 -32 29 -34 143 43 -71 -72 -55 113 173 -63 83 15 80 7 -74 59 35 33 -42 -8 -39 -35 -200 34 161 1
5479 1 -56 48 58 -39 -160 -41 6 -41 -109 62 -80 -14 9 -26 -4 126 22 75 11 21 -55 -59 11 50 -139 121 -36
5506 -36 5 -43 -69 -43 -52 -10 -40 30 -10 106 102 -129 117 -92 81 31 181 107 45 -63 110 1 41 209 -70 111
5532 111 5 198 75 -136 -88 19 -42 28 -72 27 -93 64 148 -33 -92 3 6 -36 63 -48 135 -22 -111 12
5556 12 125 111 25 127 -133 -133 177 144 -108 -101 17 34 -63 -62 -61 -22 118 -113 56 117 47 -36 -24 -42 67 -29 -27 118
5584 118 -33 -50 4 6 58 7 -173 -81 -37 -110 4 33 68 -143 81 74 -242 53 54 1 -182 141 54 -106 -221 57
5610 57 66 104 -208 -64 85 -44 -7 -16 -129 -25 -124 82 45 -211 -20 -5 14 -72 -132 49 39 -116 51 -135 -24
5635 -24 24 -82 -32 74 -152 -189 20 -85 22 109 -32 39 -59 37 158 35 -62 23 45 96 -152 29 89 -153
5659 -153 -61 142 188 56 -170 -1 -11 -22 -131 -93 44 37 -54 -15 38 15 11 62 -11 -12 -177 -140 289 12 -80 -139 -77
5686 -77 -34 -4 -146 -47 -129 175 -81 -33 -132 -65 90 -39 -153 -24 25 45 -31 -32 169 -21 -3 32 7 45 -183 -75
5712 -75 135 -17 -20 -81 73 -19 -96 86 98 223 -107 -125 137 -45 -39 -81 54 96 -53 -9 -91 -174 -165 52 27 -117
5738 -117 -65 -60 135 -36 -92 -31 17 13 25 34 16 140 -62 -14 -69 -81 -70 -41 100 -62 -7 77 97 -177 -210 -7 50
5765 50 -103 -2 -56 125 -130 108 127 154 -177 14 5 68 70 -40 122 104 130 30 111 25 -8 28 12 51 30 45
5791 45 6 104 146 31 101 -22 -55 -69 22 81 -4 32 -131 50 -109 48 25 -156 56 77 145 179 116 -90 18
5816 18 -69 -143 53 5 -90 15 60 -91 -240 -118 29 -24 -39 87 -3 35 28 -9 -9 -36 67 -169 -15 -48 40 5
5842 5 -40 -72 59 181 -22 45 81 -19 -28 -33 -32 47 -42 -130 34 -27 130 -25 96 27 104 -58 -74 -38 113 18 40
5869 40 -4 -142 -41 89 -136 -124 -125 -37 48 30 -65 44 105 -89 -70 137 35 63 -20 65 71 14 63 -67 1 -26 -137
5896 -137 -56 100 -14 32 76 5 -97 -71 -110 -3 -120 -83 154 87 -100 66 3 -75 -64 -26 -69 -85 11 -107 -24
5921 -24 27 -1 -76 -113 18 -51 -67 62 -104 -66 -80 -89 -134 -73 -120 60 -48 1 5 59 -1 21 89 68 -20 60 34 -40 -20
5950 -20 56 -102 73 129 -66 60 -133 -8 40 -3 86 -20 96 1 -121 -40 -18 -54 75 -95 -25 33 188 -66
5974 -66 -86 -121 2 46 55 28 -29 -103 52 25 -2 -39 -61 90 -79 -20 130 133 -46 198 125 16 50 -61 -4 -46 59
6001 59 -147 -171 243 -96 -92 34 -1 -148 -192 -4 3 -24 30 140 -114 -59 29 29 -42 -97 125 -35 51 -71 -15 49
6027 49 -108 -100 53 -8 151 -82 158 42 19 -25 -151 -1 113 36 37 82 -120 -113 103 -31 130 -54 139 58
6051 58 -20 78 122 -32 3 48 46 -103 -105 32 11 54 49 84 -59 55 48 242 -61 -83 22 -117 125 -29 -87 172
6077 172 -49 -63 92 43 -72 -25 -52 -147 -82 -48 58 31 213 -6 -74 -8 -19 41 -77 -23 8 -62 20 49 -7 95
6103 95 110 -87 180 97 91 -10 98 40 113 -57 -18 -75 -78 211 83 -46 12 11 20 -89 57 157 131 -52 -8 225
6129 225 76 -25 -25 -45 -48 -101 -3 -62 -18 -65 -46 -76 -29 -10 -68 -48 26 -119 -66 40 59 37 133 44 42 171 184 0
6157 0 78 44 108 -4 -166 63 136 -14 33 83 -15 4 -105 -77 59 9 -19 132 -15 -77 -72 -215 74 -120 -92 -105
6183 -105 -13 -100 -18 46 -183 -115 -68 82 89 -165 -96 53 22 103 -15 -25 65 -51 -73 -20 7 -34 48 69 -214 5
6209 5 115 -30 44 -49 -38 -3 52 -126 96 47 -11 125 43 -30 -36 -59 -29 103 -88 44 -87 59 -71 20 37 -39
6235 -39 -77 308 71 34 -10 -65 18 64 -22 -8 -168 -12 8 -134 7 -4 -228 59 96 -80 36 70 86 -117 20
6260 20 -11 85 89 27 3 -40 16 74 -80 118 29 -37 57 17 -31 -68 39 -92 57 -31 111 159 161 56 83 -69 129
6287 129 31 34 157 62 -182 -180 -36 -140 -48 -79 -122 -63 -169 -21 26 4 11 43 164 116 -38 24 -5 13 34 167 55
6314 55 -40 17 -84 24 11 -68 40 -61 69 -78 42 244 -38 -60 -59 -53 -96 -137 50 34 -78 -20 -27 -248 71
6339 71 70 -1 127 4 -248 54 81 -81 -113 31 52 -55 44 -129 115 -120 -1 -76 130 -25 -24 221 -86 -106
6363 -106 18 88 -79 164 73 -47 35 63 -118 188 -88 -77 61 -82 -2 26 -35 -21 -41 -83 21 48 -47 63
6387 63 47 1 -70 129 2 -157 -17 1 120 48 -61 -22 165 52 -161 55 126 -48 -48 75 9 -55 83 -26
6411 -26 0 -56 -2 -21 63 -65 -15 -27 9 -10 -99 66 124 -11 80 -5 -110 -269 -5 -14 -113 43 181 50 -64 19
6437 19 10 60 12 147 60 74 -95 -173 -53 3 -48 6 16 -47 148 55 -39 -60 -31 98 -57 102 27 -86 48 -71
6463 -71 81 116 -45 25 -127 82 99 36 -4 11 -156 26 -128 72 41 73 -91 -115 18 28 40 22 -193 194
6487 194 -61 99 -92 128 83 -12 41 -86 166 -37 29 -2 -43 -33 -74 85 -50 140 45 -28 45 19 -69 37
6511 37 -149 -59 50 -1 14 69 -48 -197 98 113 51 16 -60 -9 -46 -98 -19 13 3 115 27 34 110 -43 183 154 160
6538 160 -32 -149 42 -15 -12 58 152 101 10 -118 67 122 -103 16 23 -2 -129 -203 -158 18 -168 46 -75 -72 -190
6563 -190 54 -130 28 -6 20 133 -2 -28 -199 116 26 -192 -3 178 -120 124 37 -29 171 4 -67 -135 -119
6586 -119 113 173 104 -127 -84 163 -101 -30 -11 114 67 61 -29 -7 -32 74 32 52 242 4 131 41 -64 37 -30
6611 -30 -1 57 -95 54 -57 43 111 -10 -60 -14 61 -4 172 100 113 11 -41 -64 -17 -92 -213 19 -14 -140 -122
6636 -122 145 -71 -86 -85 -180 -21 -4 -53 50 44 74 91 -71 38 -70 -62 4 -60 -62 -5 -169 -53 -8 99 183 -43
6662 -43 27 -65 113 -176 11 16 -16 -55 78 51 -132 53 15 -33 -38 -49 182 -75 -55 -86 143 -109 -61 42 31 -164
6688 -164 12 -25 20 61 -118 58 25 -20 141 61 -24 -25 17 36 5 -100 35 -23 87 43 -200 161 87 77 42 -7
6714 -7 -15 150 -24 55 -12 -29 69 143 19 84 119 29 1 -210 -67 -53 -44 -1 32 46 -50 38 25 -61 -82 -35 86 204
6742 204 -120 -109 -79 -65 33 -68 59 147 -18 -137 23 135 -64 54 -42 184 -43 -101 -61 -122 57 -13 -104 -8
6766 -8 -219 -16 -20 54 123 157 -39 -147 -87 100 35 200 -152 -170 -156 -48 16 -58 -96 -129 -79 102 119 -3 95 -69
6792 -69 53 204 -56 8 26 -82 -119 -4 71 -73 -59 72 2 -106 -109 -261 -49 -63 8 46 101 19 -178 105 -21
6817 -21 -74 75 35 -96 19 45 108 -8 -21 -52 106 9 -80 -91 -200 -34 25 -14 -46 -39 -159 -67 -76 12 -32 84 115
6844 115 -134 -192 -11 -1 -80 -122 -40 -20 -95 -29 102 -36 -56 -49 126 142 3 -58 183 -43 -187 23 -36 8 -2
6869 -2 181 -135 24 -18 -73 -14 22 24 -163 -62 -55 -20 -80 129 20 102 -121 32 58 183 53 -27 -12 -2 -24 59
6895 59 119 109 58 -28 -187 138 -39 -47 37 -28 -139 66 11 -65 30 189 34 -29 103 25 137 59 -36 61 -108 -13
6921 -13 -100 -62 -19 100 -26 -65 -85 66 -54 -122 45 -8 15 -62 -239 -25 -69 -23 -61 113 89 -184 127 70 225
6946 225 -73 59 -62 -184 131 -81 43 3 -27 -36 -33 -55 -226 -51 -8 13 -86 -24 158 -62 -30 89 -34 29
6970 29 -23 80 -12 165 -48 91 -39 105 -157 -68 81 255 -143 33 201 125 31 16 -132 133 -9 81 -108
6993 -108 24 -58 78 127 60 -27 -38 21 -79 -10 -4 26 -218 -22 105 -65 -46 40 63 -133 14 -111 -21 -26 -158
7018 -158 -190 24 -35 85 10 -103 41 -144 133 54 -27 24 -170 -46 110 129 51 -75 5 -69 -112 -133 170 -133
7042 -133 -70 -46 -150 64 -43 -27 -91 149 -11 -38 -60 -74 -83 110 71 -54 -47 0 -136 135 -130 173 -31 -17 -94
7067 -94 6 38 27 168 -47 69 -27 -46 -72 35 -29 52 -31 -64 174 -6 28 -26 -125 86 -65 19 -129 93 47
7092 47 -119 -95 -48 -129 4 -90 39 -115 45 -18 -56 -63 27 -32 -10 -146 -41 24 45 64 -39 125 -49 -62 -56 56
7118 56 -20 -33 -86 37 -53 -23 23 -102 91 32 4 130 90 4 119 -97 45 -36 100 118 -28 57 -42 -7 -40 -176
7144 -176 -39 19 33 -33 50 -22 2 15 -67 -80 91 54 0 127 -54 -71 -54 44 -94 2 -151 -5 -30 121 123 135
7170 135 -8 36 -67 -46 63 30 -29 -105 8 -4 37 -106 2 -87 -144 51 -49 -37 -26 34 -23 138 27 44 -94
7195 -94 71 -50 166 79 36 42 -18 49 74 -2 145 -126 -69 -21 84 -71 3 40 -51 -180 -15 80 -48 63 -202
7220 -202 75 -9 -27 -65 -136 66 -88 75 9 62 -2 -2 1 -90 -6 -33 3 -100 23 -22 20 78 -94 7 -26 99
7246 99 60 98 -113 -25 -60 24 -24 72 1 18 -152 -5 44 -43 -52 -147 18 -13 173 23 218 -56 -83 38 -47 103
7272 103 -164 -67 36 -39 -42 -85 32 98 -91 -220 5 -14 -1 33 129 -136 -9 -169 31 -43 -160 54 -53 -110
7296 -110 -121 131 -52 -104 -29 -84 35 -48 15 -109 -18 89 15 81 105 -126 -27 124 32 -24 -18 25 -26 68 -66 -57 -22
7323 -22 -177 104 4 -78 31 -38 25 -127 180 -30 -16 41 126 -65 -164 -165 39 47 70 -3 21 -35 -156 -15 99
7348 99 -70 -44 -85 -80 137 228 -54 -60 36 63 202 -87 47 -112 -47 -103 -29 -85 -143 -104 -1 7 -32 -34 42 -98 -60 13
7376 13 98 129 -173 -6 -110 -67 10 -14 -229 94 -83 83 -121 21 51 110 16 76 -129 132 65 -74 1 -101
7400 -101 35 24 34 173 -67 37 -73 -46 -98 -32 -53 86 -21 15 -1 185 6 48 -75 -117 36 -37 126 -75
7424 -75 34 -9 -112 95 221 -9 48 -37 154 56 21 44 95 -55 -81 -67 70 -98 59 46 116 -16 -104 51
7448 51 24 -31 -25 -90 61 26 -71 -56 102 23 -6 22 -217 0 -24 -41 104 52 35 -72 -61 -2 45 76 -8 57 -3 54
7476 54 -14 59 65 -53 -104 -2 57 157 1 69 -4 -59 -28 8 -51 -12 -5 -49 -136 -15 128 -88 191 165 14 25 72
7503 72 16 25 106 -102 74 -173 -121 -178 3 -66 111 71 -53 -68 -157 54 161 52 -121 -71 150 25 -36 -18 -118
7528 -118 63 68 77 3 -77 -54 83 27 -73 70 38 147 -67 -120 -3 157 -60 55 -11 5 68 -133 49 28 -86
7553 -86 -82 10 63 39 46 -61 -15 -84 -29 83 -122 -95 110 -57 18 110 -76 85 -43 96 53 60 -238 154 -81 50
7579 50 167 36 155 14 91 38 93 -62 -192 8 -44 -130 -36 8 86 27 16 28 5 -54 -87 -212 68 40 29 35
7605 35 164 61 -270 17 67 -77 -162 76 -29 -112 -35 64 -11 174 169 107 68 33 -18 78 -217 -53 25 30 -51 17
7631 17 -35 -37 212 -107 25 -90 -49 -191 -73 -87 -2 6 -82 28 162 208 45 -169 20 -51 47 -112 41 109 63
7656 63 -166 -24 18 4 67 -87 113 22 -52 21 92 40 43 -141 -46 -7 -59 -25 61 36 89 21 -77 109 64 -77 21
7683 21 20 12 111 4 123 105 53 -206 57 -64 -124 52 42 37 -107 -83 -77 -74 -112 -23 -90 -169 52 36 -49 -81 -100 66
7711 66 -131 14 61 -4 54 -89 26 119 -83 -65 -116 -18 -25 -65 -75 -9 -171 -9 22 -35 0 -13 2 54 72 -2 -59
7738 -59 79 36 30 -90 -60 84 -146 133 -64 16 91 11 -128 122 -10 167 -110 -20 -50 -92 64 31 -24 -59 143
7763 143 -121 206 235 -31 38 45 43 -207 174 153 87 -30 18 -127 54 95 9 -11 33 -5 -31 95 -152 -109 -72 141
7789 141 75 -141 86 -176 -2 34 25 82 101 -121 -112 38 -97 -50 98 -87 97 -125 108 -99 -63 111 -34
7812 -34 50 76 1 140 -60 -19 85 -28 3 76 -53 -1 21 1 96 55 -189 5 -15 -63 16 79 126 -59 79 10
7838 10 26 -6 134 -7 -194 123 125 -175 26 -130 224 -82 -45 -45 103 2 -104 -47 -58 18 -30 67 10 6 13 7 87
7865 87 50 -104 -132 -104 154 -30 -29 -90 74 -35 -66 114 117 145 189 34 118 -38 -46 -97 -90 -36 -114 29 47 75 -1 7
7893 7 74 188 57 -30 12 -3 74 -18 -55 50 164 -21 30 55 -24 29 2 -51 56 -27 -56 -151 1 15 -42 61 27
7920 27 95 114 -140 -33 -110 -64 31 -6 12 -92 -51 -140 -9 -7 -70 -91 -251 -31 26 -41 -14 0 -63 31 -48 -6 -97 -10
7948 -10 45 -170 6 253 -47 111 -12 -78 13 -5 28 -86 -26 119 64 29 70 9 -50 0 48 -53 7 150 -108
7973 -108 -16 65 13 166 116 50 52 -20 70 129 -16 -7 41 -17 -132 60 63 62 64 -27 -35 -73 122 -8 33 -107 63 88 -131
8002 -131 -70 -96 179 -32 -185 92 -82 -21 149 -110 -52 -83 -187 74 77 -27 166 -31 32 -46 84 -178 -98
8025 -98 43 19 33 88 -164 -195 81 63 91 90 3 102 -25 13 -44 161 46 -18 123 134 -14 -11 9 -8 -158 6
8051 6 -71 12 -16 14 -81 141 170 -72 -52 237 -94 145 76 -72 -23 -46 96 -24 -47 -89 -138 -154 -34 -164 155
8076 155 -71 -83 -24 46 -66 -227 -165 42 -62 -163 15 -10 -104 -208 100 99 -85 -25 42 -73 144 32 -212
8099 -212 -3 -89 129 -104 34 -61 -251 171 20 -58 -113 -116 -35 -119 -27 -210 -18 -132 213 -88 115 64 -76
8122 -76 68 76 168 7 143 -223 -50 -75 25 -11 -63 76 29 -83 108 -38 -97 -152 -17 -71 67 -47 -92 -122
8146 -122 -58 90 -94 -82 34 43 89 -134 -156 32 -83 41 68 -64 8 -93 -18 25 -71 -211 -101 -48 46 118 -11
8171 -11 54 -88 54 -12 39 -17 -7 76 83 -192 -104 23 -158 -102 -53 37 -56 -13 -75 37
8191C7
$$ Imaginary data points
##PAGE= N=2
##DATA TABLE= (X++(I..I)), XYDATA
0 0 0 0 0 0 0 0 0 0 0 0 0 0 0 0 0 0 0 -8 8 -8 8 -8 11 -16 16 -16 24 -24 32 -32 40 -43 48 -56 64 -72 80 -90 101
39 101 -114 125 -139 154 -170 189 -209 231 -255 279 -308 339 -374 411 -456 503 -558 619 -688 774
59 774 -872 990 -1136 1321 -1563 1903 -2399 3216 -4788 8949 -44147 -118532 -74692 -33629
73 -33629 18747 73393 140631 174761 169899 140844 118482 88632 53330 18036 2888 -2729 -17539
86 -17539 -36729 -37393 -36424 -45774 -62108 -79582 -102648 -127290 -139459 -127690 -96470 -42656 20901
99 20901 70257 98242 108338 99411 76187 49647 39628 50441 64719 72395 77076 78281 62839
112 62839 22228 -16682 -37382 -62502 -97901 -118444 -115828 -107250 -101374 -80847 -39318 -3709 8418
125 8418 10204 13827 15294 6863 6072 34755 73325 97441 110897 117364 106262 70596 27086 -4614
139 -4614 -26099 -42109 -49710 -50980 -49630 -49660 -54465 -57902 -59291 -59620 -56900 -54508 -50683 -38909 -17558
154 -17558 8699 34064 61889 91205 101639 87690 69393 53535 33653 12825 6630 18075
166 18075 25477 15438 1211 -11027 -30289 -60304 -84154 -84200 -74726 -72263 -62542 -37540 -13264
179 -13264 -1659 6886 24377 38439 37156 32577 34561 39167 41607 44128 53870 63956 60869 45659
193 45659 24589 -549 -27764 -50472 -61322 -61525 -55082 -43196 -33374 -31313 -30393 -28495 -29868 -31234
207 -31234 -24864 -8289 7629 18170 33313 53007 64716 63673 58209 55475 45409 21288 860
220 860 -4161 -6762 -14072 -17703 -9826 -6646 -21164 -38967 -46778 -52440 -60425 -60918 -44120 -19108 -2188
235 -2188 10108 25991 37663 37813 31629 29093 30593 27748 24968 27971 31763 33033 30650 23791 13308
250 13308 -1876 -19230 -36040 -50713 -56073 -51179 -42928 -32922 -20651 -7321 -877 -5101 -8979
263 -8979 -5107 -2277 -1316 6564 24875 41467 45533 46602 50987 46611 28770 10009 139 -6274
277 -6274 -18686 -27037 -21392 -13517 -14777 -19020 -18794 -19125 -28362 -39171 -38048 -30239 -22558 -11727 4974
292 4974 23339 33828 36069 36551 32955 25527 17728 11871 10065 11652 13946 15699 13950 9490 3726
307 3726 -7321 -22635 -33627 -38025 -38954 -39453 -33422 -17738 -5152 -1424 2159 8653 10507 3774
321 3774 -952 5929 14240 16015 19783 30609 38582 33586 22233 16827 10259 -4861 -18271 -21315
335 -21315 -18080 -18219 -20005 -14454 -8210 -10414 -16136 -18687 -18364 -18690 -19122 -12581 -1062 8843 17140 24094
351 24094 27903 27968 24200 18139 11853 6455 5672 5645 3757 4196 6493 4639 -3207 -11668 -15499 -19785
367 -19785 -27991 -30539 -23713 -15412 -11756 -7954 1823 9761 6788 3061 6317 9734 7652 5716 12667
382 12667 21946 21814 18417 19045 18236 9575 -2341 -8322 -9459 -13686 -17779 -15669 -11000 -9202 -11069
397 -11069 -11887 -10870 -12161 -13784 -12611 -8832 -3115 3615 9588 14902 18857 21517 20902 15319 10704
412 10704 9313 6854 2903 1242 4715 6737 1534 -4465 -5443 -9034 -17979 -24498 -22071 -16252 -15692
427 -15692 -14349 -5296 3090 3451 1121 4345 9616 7406 3874 8188 14402 15518 14293 16391 20034
442 20034 16219 7507 1862 -2775 -9221 -15703 -17507 -14073 -11267 -10218 -8692 -8244 -9902 -11630 -12952
457 -12952 -12351 -9449 -3346 3811 8468 12843 19151 21407 18478 15307 14753 13083 6550 915 2007
472 2007 3041 -464 -3514 -1849 -655 -8113 -17696 -19595 -19166 -22334 -23394 -15588 -3907 1123 1890
487 1890 6513 11499 9548 5725 6657 12141 14323 12892 14746 17985 16292 11756 7874 5209 111
502 111 -7518 -13318 -16967 -19292 -19169 -17032 -13859 -10068 -6866 -5690 -7333 -9247 -6602 -3113 -547 5581
518 5581 14553 21632 21617 18935 19560 18622 11522 5565 5065 5175 172 -6148 -6596 -5577 -9850 -15235 -14518
535 -14518 -12357 -15443 -21077 -19973 -13931 -10690 -7585 720 10250 14117 12831 12548 14255 13098 11093
550 11093 12237 15516 16816 14551 10634 6828 858 -5012 -9453 -12723 -14792 -15579 -16787 -18181 -18410
565 -18410 -14790 -10185 -9050 -6452 -1081 2482 1816 2067 7452 14150 15980 17101 21497 23479 17750
580 17750 8823 5256 4899 -211 -5553 -4242 -2245 -6935 -14311 -16967 -15577 -17661 -20272 -16908 -10733
595 -10733 -7248 -6542 -3351 3319 7574 9210 12540 16479 17012 14791 12329 11858 10876 10378 10639 8952
611 8952 5498 1115 -5531 -12771 -17883 -18972 -17226 -16790 -14613 -9897 -6567 -7622 -8400 -5314 -67 1357
627 1357 2130 8608 14398 14554 13028 15962 19937 17519 11742 9313 7309 405 -7847 -10317 -8127 -8133
643 -8133 -10481 -9689 -7535 -10210 -15671 -17829 -15244 -12098 -9225 -2898 4910 10129 12220 13209 14128 14450
659 14450 12997 11918 10323 8511 7414 5766 3397 1711 1102 -229 -5150 -11159 -13874 -16174 -20376
674 -20376 -21121 -15577 -7969 -4023 -2056 2936 6641 4502 1776 3778 8749 10194 9496 13444 17923
689 17923 16256 11036 8703 7853 2886 -4919 -8711 -9515 -12399 -15497 -14525 -10490 -7692 -7880 -7500 -5862
705 -5862 -6621 -7769 -6743 -2746 2664 7951 13156 16908 17539 16703 14549 9835 5925 4118 2842 316
721 316 -2321 -2151 -1947 -5549 -9017 -9409 -9638 -12848 -16649 -15259 -10758 -9566 -7893 -827 7057 9507
737 9507 8376 9352 11936 9573 5591 6727 10523 11547 9129 8389 9216 5436 -1709 -6125 -8139 -10630
753 -10630 -14186 -14895 -12436 -10461 -9695 -7479 -4811 -2766 -2011 -1310 -86 1178 3681 7091 9500 12170
769 12170 15343 15998 13418 9231 6144 3758 -1043 -5051 -4624 -3331 -5051 -7703 -7446 -6422 -9389 -13432
785 -13432 -12188 -9325 -8516 -8486 -4031 3100 6008 6235 8911 12417 11557 8035 6138 7819 7356 4642
801 4642 5231 6842 6086 2484 -1355 -3995 -7373 -11813 -13843 -13116 -11653 -9387 -6769 -4002 -1792 -429
817 -429 608 496 81 2073 4267 5242 7013 10561 13559 12493 9626 8841 7023 1316 -4146 -5783
833 -5783 -4981 -6309 -8522 -5963 -2932 -3980 -7329 -8210 -6559 -7680 -10288 -7483 -1324 2280 3848 7362
849 7362 11751 12603 9146 7075 6875 4889 1724 627 2210 3440 2342 1707 999 -1671 -5152 -8690
865 -8690 -11205 -12188 -11780 -9410 -6588 -3582 735 3784 4116 3368 3479 3680 2464 1208 3683 7400 8237
882 8237 7905 9340 10051 6585 307 -2988 -4053 -7344 -10989 -9862 -5751 -3980 -4810 -3495 -526 -1716
898 -1716 -5139 -5959 -3709 -2195 -1777 1017 6715 10194 10477 10365 10304 8233 4096 598 -755 -1621 -2227
915 -2227 -1873 -1097 -466 -636 -2219 -4663 -7356 -8872 -9069 -9663 -8316 -4108 270 3133 4206 6443 8503
932 8503 6619 3043 3222 3961 3470 2126 3904 7216 6757 3491 2018 1263 -2223 -7747 -10052 -8114
948 -8114 -7919 -8678 -6345 -1969 -77 -916 -1089 669 447 -1266 -1249 1380 4132 5689 7353 9471 10020
965 10020 7929 5589 2720 -28 -2313 -3785 -4210 -4295 -3516 -2285 -3099 -4593 -4505 -4631 -6364 -7782 -6509
982 -6509 -3257 -1599 -359 3435 7430 8107 6365 5656 6580 4952 1179 1371 4003 4020 2003 1980 3190
999 3190 1373 -3854 -6026 -6167 -7240 -9013 -8858 -5659 -2922 -2727 -1731 1005 1943 1173 439 1527 2368
1016 2368 2848 4034 6080 7154 8050 7637 5760 3328 891 -1465 -3820 -5456 -4731 -3315 -3269 -3715 -3578
1033 -3578 -2978 -3741 -6219 -6071 -3595 -2904 -3081 -374 4216 5985 4908 5992 7921 6659 3403 1770
1049 1770 2426 2226 47 47 2469 3039 239 -1962 -2812 -4469 -7937 -9155 -7279 -5313 -4115 -2288 73
1066 73 1882 1994 1604 1699 1680 1785 2195 2738 3545 4876 5919 6191 4808 3929 3132 -527 -4187 -5479 -4851
1085 -4851 -4959 -5453 -3592 -462 -608 -2447 -2731 -2176 -3070 -4781 -3828 453 2834 2779 4130 7173 7742
1102 7742 4730 3316 3753 2297 -862 -1722 -709 77 -565 -944 237 434 -2022 -4436 -5391 -6063 -6462
1119 -6462 -5796 -2928 -33 1589 3558 3877 3392 2898 2414 1568 743 1315 3173 3216 2777 3488 4050 2669
1137 2669 -67 -1677 -1793 -3650 -6574 -6535 -3824 -2461 -2706 -1278 1661 1625 -1289 -1899 -591 -424 -798
1154 -798 97 3701 5461 4923 4499 5031 4285 1629 -573 -681 -721 -2571 -3132 -2209 -1460 -1356 -1599 -1686 -1893
1173 -1893 -3045 -3558 -4038 -3800 -2213 -131 1689 2896 4228 5159 4149 2086 1644 2127 1683 487 976
1190 976 2638 2114 74 -331 387 -1092 -3696 -4600 -3376 -3275 -4829 -4237 -1332 287 -240 78 1922
1207 1922 2266 271 -210 1558 2655 2195 2674 4315 4725 3291 1756 1049 154 -1273 -2218 -2435 -2153
1224 -2153 -2416 -2728 -2303 -2515 -2305 -1918 -2340 -2524 -2036 -714 -409 -356 1292 3887 3843 3135 3338 3963 3171
1243 3171 681 351 2038 1856 117 -335 753 398 -2591 -3875 -2691 -2772 -4362 -4391 -2349 -1047 -1681
1260 -1681 -1657 301 1516 801 589 1718 2776 2182 1809 3043 3766 3364 3036 2517 1847 521 -908 -1722
1278 -1722 -2428 -2649 -2270 -2279 -2548 -2198 -1905 -2234 -3067 -2761 -1339 -855 -1031 228 2225 3147 2272 2649 4316
1297 4316 3896 1927 1400 2316 1780 -90 -588 846 1011 -911 -2053 -1578 -2044 -3834 -4822 -3412 -2484
1314 -2484 -2724 -1990 -410 1005 875 500 1437 1980 1637 1720 2128 2546 2856 2795 2770 2412 1814 1315 176 -1654
1334 -1654 -2387 -2400 -3066 -3534 -3042 -1574 -1579 -2449 -1936 -834 -671 -1497 -1302 844 1822 939 1755 3842 4405
1353 4405 2854 2066 2822 2635 354 -751 85 -172 -1289 -2146 -1286 -889 -2416 -3089 -2672 -2254 -3015 -3109
1371 -3109 -1959 -431 -88 529 1940 2519 2840 2711 2537 2430 2189 1992 1861 1100 1018 1239 575 -614 -1212
1390 -1212 -1308 -1721 -3619 -3789 -2666 -2629 -3138 -2531 -623 318 -454 -132 1805 2358 1346 1136 2872 3530
1408 3530 2112 1725 3113 3093 1751 362 465 182 -1567 -3045 -2866 -2620 -3119 -3581 -2994 -1936 -1750 -1863
1426 -1863 -1187 -510 -219 284 813 1698 2264 2970 3270 3186 3113 3454 2681 1381 666 529 -242 -1865 -2278 -1584
1446 -1584 -1818 -3190 -3216 -2148 -2124 -3232 -3311 -1550 -786 -1242 -376 1527 2803 2476 2470 3835 4124 2828 1869
1465 1869 2400 2458 1071 -227 476 417 -972 -1969 -2233 -2238 -3356 -3996 -3844 -3283 -2951 -2358 -1574 -446 642
1484 642 1382 1838 2082 1966 2830 2795 2293 2589 3431 3056 2119 1426 1696 732 -1356 -2333 -2345 -2694 -3927 -4160
1504 -4160 -2894 -2200 -2903 -2528 -1121 -167 -867 -1006 818 1879 1444 1879 3382 4284 3603 2939 3032 3048 1564
1523 1564 204 -188 -408 -1217 -2187 -2285 -2052 -2591 -2794 -2767 -2905 -2751 -2469 -1901 -1382 -503 872 1730 1982 2666
1543 2666 3230 3082 2480 2123 2550 2635 1210 866 1341 822 -643 -1703 -1341 -1508 -3418 -3811 -2741 -2466
1561 -2466 -2876 -2955 -1185 103 -100 -309 1029 2047 1615 1275 2316 3377 2877 2287 2609 2488 1613 367
1579 367 -300 -572 -1261 -2092 -1925 -2213 -2227 -2235 -2455 -2184 -2117 -1462 -1082 -858 -380 959 1446 1636 2050 2951 3234
1600 3234 1908 1777 2265 1625 560 24 556 548 -790 -1626 -1180 -1477 -2813 -3592 -2566 -1865 -2179 -2196 -690
1619 -690 515 494 378 1397 2113 1574 1156 1639 2328 2105 1715 1834 1942 1637 401 -80 -909 -1868 -2418
1638 -2418 -2702 -2551 -2329 -1503 -1182 -1321 -1215 -439 -423 -796 -569 548 1228 1304 1770 2915 3279 2405 1838 2110
1658 2110 1744 -135 -1127 -689 -514 -1546 -1795 -874 -374 -1276 -2391 -2051 -1848 -2398 -2561 -1260 271 850
1676 850 783 1975 2819 2318 1717 1583 1551 1058 606 756 807 800 881 585 -149 -623 -1233 -2088 -2851 -3145 -2544 -1986
1698 -1986 -1666 -591 513 1147 603 277 794 840 173 210 1443 2280 1707 1512 2369 2379 990 -334 -381
1717 -381 -513 -1800 -2663 -1891 -860 -1207 -1324 -489 79 -817 -1291 -1377 -745 -913 -662 527 1650 1987 2199
1736 2199 2228 2090 1392 583 383 -307 -325 -4 -125 -283 -165 188 -35 -990 -1458 -1381 -1347 -2259 -2041 -864 279
1757 279 158 576 1635 1902 797 8 373 857 177 -135 953 1628 1103 467 631 836 -463 -1437 -1105
1776 -1105 -1096 -1335 -1430 -818 30 15 -164 178 273 -173 -452 -585 -74 175 477 1085 1220 1185 1382 834 161 -437
1798 -437 -279 -357 -754 -695 201 223 -235 -345 -70 70 -941 -1342 -666 -199 -487 -447 482 1246 894 114 795
1819 795 830 -170 -628 -51 338 290 12 644 1087 465 -320 -361 -262 -730 -1053 -788 -134 -4 55 171 409
1840 409 249 -191 -223 -336 -404 -198 157 135 309 1007 856 414 8 -30 -116 -809 -733 62 356 29 -133 855
1862 855 683 -240 -789 -375 -181 -717 -977 44 816 423 45 563 1002 160 -524 -175 13 -258 -380 133
1882 133 901 864 523 405 411 -81 -851 -899 -832 -536 -372 -5 231 511 273 293 -362 -613 -672 -462 -697 -551
1904 -551 463 1141 856 741 1181 1042 59 -645 -325 -18 -488 -542 335 945 301 -204 13 -47 -1134 -1554
1924 -1554 -1098 -601 -633 -719 133 1108 889 466 705 720 224 -418 -151 430 532 419 829 1121 684 515 -154
1945 -154 -694 -1161 -1201 -1257 -1122 -903 -145 61 -78 -179 106 26 -686 -931 -134 249 365 819 1518 2078 1501
1966 1501 873 1105 649 -138 -929 -648 -106 -674 -790 -21 223 -231 -1128 -1133 -956 -1282 -1651 -1133 -212 195
1986 195 622 926 1265 1544 1006 902 795 331 543 518 407 725 713 597 126 -389 -607 -1022 -1863 -1894 -1484
2007 -1484 -1058 -1024 -892 28 305 66 -1 514 655 304 85 925 1483 1049 1225 1577 1863 917 0 -112
2027 -112 -50 -940 -1416 -987 -653 -859 -1140 -810 -292 -785 -1105 -984 -614 -117 -379 300 896 1183 1185 1428 1555
2048 1555 1276 892 682 414 116 379 178 -118 -436 -346 -562 -933 -1512 -1202 -1107 -1461 -1340 -662 294 -32
2068 -32 -49 605 1172 687 369 777 1230 849 532 866 1316 862 125 61 -6 -398 -1113 -1083 -803 -905 -1226 -1102
2090 -1102 -591 -573 -641 -628 -55 -292 110 416 539 1014 1322 1232 1077 1040 996 715 102 -116 -28 -327 -604 -843
2112 -843 -749 -420 -988 -1378 -861 -826 -1116 -1356 -509 260 21 93 750 1333 1182 857 1027 1153 591 99 356
2133 356 866 467 -59 -48 58 -434 -1018 -1367 -1348 -1343 -1333 -1264 -717 -337 -174 47 430 398 662 420 647 703 978
2156 978 1384 1253 841 1348 1060 320 -303 -412 -544 -1257 -1592 -1158 -701 -823 -979 -888 -99 -676 -959 -406
2176 -406 110 -163 115 499 1311 1425 931 1493 1657 1104 459 216 238 -126 -597 -527 -285 -377 -856 -819 -807 -1154
2198 -1154 -1376 -1428 -999 -947 -425 4 299 614 1208 1203 966 982 895 916 645 465 633 858 464 106 283 86
2220 86 -657 -1266 -1131 -1237 -1360 -1590 -959 -224 -490 -405 73 630 263 114 292 984 816 754 926 1407 1205
2241 1205 797 701 648 199 -366 -565 -562 -857 -951 -774 -745 -507 -626 -597 -621 -606 -508 -216 -189 64 517 917 910 794
2265 794 1167 1136 742 166 521 553 116 -489 -128 169 -317 -765 -508 -147 -731 -1181 -892 -345 -478 -535 -158
2286 -158 563 649 359 692 780 838 317 323 554 455 160 327 458 72 7 -270 -356 -621 -570 -652 -1001 -611 -494
2309 -494 -411 -265 -126 185 185 -2 35 457 488 159 517 775 894 563 42 437 392 -129 -461 -364 -73 -454
2331 -454 -790 -417 -125 -314 -619 -279 70 -27 -411 -134 342 276 267 433 743 750 365 388 350 312 -18 -87 -126 -173
2355 -173 -348 -221 -350 -252 -367 -300 -595 -505 -304 -226 -154 -156 283 482 320 310 420 655 380 260 353 706 322
2378 322 48 236 231 56 -389 -477 -168 -370 -761 -481 -132 -180 -514 -336 80 -100 -276 -113 124 242 -30
2399 -30 315 603 526 554 318 517 258 116 -70 41 -396 -67 -8 -161 -250 -244 -246 -393 -641 -496 -196 -286 -453
2422 -453 84 370 376 24 312 701 428 -148 65 361 315 -86 204 580 238 -11 -28 -75 -283 -574 -524 -265
2444 -265 -334 -440 -302 198 30 -186 -67 96 -71 -153 -107 105 385 394 392 689 521 510 341 -41 -144 -39 -134
2467 -134 21 -313 -11 139 -47 -236 -202 -42 -402 -634 -447 -325 -344 -59 212 514 350 51 91 503 186
2488 186 -58 169 431 122 69 182 474 273 -76 -12 -174 -301 -439 -480 -246 -79 32 171 -26 170 -57
2509 -57 -181 -143 -189 -70 56 69 -30 368 641 526 272 98 166 -216 -433 -51 25 -273 -159 66 417 84
2531 84 -286 -156 -18 -437 -504 -251 -13 155 -160 303 486 398 -1 -36 136 8 -170 12 239 64 -20 130
2553 130 248 238 -128 -227 -193 -251 -419 -331 -4 -111 81 228 165 99 17 56 -241 -157 20 312 44 129 328 519
2577 519 242 -124 -28 5 -159 -412 -388 192 66 -326 57 330 -14 -210 -103 64 -112 -229 -78 262 373
2598 373 149 167 287 239 51 -72 -59 -108 -198 -311 38 -60 -32 -43 -176 -211 -149 -294 -156 -110 -61 238 10 15 284
2623 284 228 218 -164 -12 177 245 -166 47 204 132 99 -115 25 -129 -551 -417 -135 -213 -355 -321 112 -52
2645 -52 -87 -77 31 40 -207 -143 269 180 217 187 431 172 230 103 -68 -13 -69 13 -204 -84 -102 -90 -188 -189 -340 -345 -401
2672 -401 -596 -258 -2 74 44 340 499 152 117 464 392 153 -150 120 449 281 104 26 214 26 -404 -545
2694 -545 -201 -371 -500 -262 -62 -84 -42 51 59 -4 -44 -28 99 -118 -34 247 336 663 259 252 329 225 107 -104
2718 -104 -135 -237 -272 -104 -80 -132 -183 62 -227 -432 -308 -211 -380 -419 -17 271 252 -11 301 631 321 53 57
2741 57 253 66 73 120 270 242 89 -21 98 -180 -367 -372 -344 -218 -355 -346 31 212 57 122 -19 109 -82 -59
2765 -59 -84 -44 223 112 307 264 426 171 -9 -90 -203 -122 -196 -241 -256 61 210 -72 217 82 -31 -219 -233
2788 -233 -22 -8 -170 119 369 432 175 259 348 -22 -120 -7 4 43 -182 -81 177 21 -73 -115 -163 -131 -295 -339
2812 -339 -243 -55 -52 120 102 356 259 47 39 -107 -52 -160 -106 -126 152 345 233 32 82 122 -130 -375 -332 -320 -33
2837 -33 -235 7 256 163 -40 152 151 58 -120 -61 318 113 149 181 311 346 97 -9 -74 -228 -164 -394 -204 73
2861 73 -199 -163 259 83 6 -22 -171 84 -86 47 148 83 133 125 241 57 275 37 111 -9 -21 -44 -65 -269
2885 -269 -93 -156 -74 -299 -205 -177 -258 -412 -110 97 15 -28 166 195 207 143 24 198 145 259 160 305 308 270 98
2910 98 212 63 -196 -128 -266 -259 -165 -340 -84 -87 -202 -30 -181 -54 -93 90 -49 128 183 242 343 340 200 273
2934 273 131 -11 -20 72 180 -203 7 63 129 -250 -23 -100 -98 -446 -266 -63 -25 -100 -108 194 292 133 85 241 235
2959 235 68 104 97 214 328 66 67 25 -13 5 -130 -239 -147 -275 -142 -264 -161 -34 -119 15 -66 -88 -244 -164
2983 -164 -154 59 -23 153 394 426 294 81 3 31 19 -143 20 123 -37 -166 -83 249 -44 -96 -189 -21 -95
3006 -95 -353 -214 121 -19 -125 -8 175 166 195 199 -36 -56 138 27 67 -3 99 137 167 -27 21 -48 -205 -163 -74
3031 -74 -84 108 -47 -129 193 167 -77 115 81 -68 -41 63 -2 78 54 215 262 147 -42 123 -103 -144 -340 -181
3055 -181 -68 -18 27 -69 34 -27 -101 -83 23 78 46 -20 39 39 135 223 235 138 -79 -101 -120 -19 -186 -82 -58 -46 37
3082 37 43 -76 -32 -5 -147 48 -308 96 206 154 9 253 330 133 21 -2 -11 -218 -11 -148 33 -91 -343
3105 -343 -125 -15 -92 -313 -202 -242 28 -87 -68 91 35 113 52 181 149 86 201 42 150 200 -12 154 152 165
3129 165 231 19 -94 -39 -206 -313 -269 -275 -3 -72 60 21 107 -3 -40 89 134 34 -21 90 282 144 -36 126
3153 126 57 89 76 -180 157 -34 -116 -163 -178 -88 -204 -166 12 -104 -84 14 -103 -31 25 84 154 187 34 64 -26 -12
3179 -12 -75 55 106 16 19 -26 196 -28 -144 -54 -119 -121 -262 27 -128 -273 99 -22 -39 227 -42 78 -39 -124
3203 -124 -8 -23 165 257 113 108 3 -99 -84 31 -14 -135 -41 106 173 105 16 -111 118 207 -24 -62 -70 -52 42
3228 42 87 21 194 26 -107 135 -130 3 -11 -110 -40 -68 -296 61 34 316 -17 58 -67 -124 -110 127 20 237
3252 237 90 96 48 60 59 -87 -130 -4 15 -180 -108 179 4 -14 36 45 -41 -56 -216 -292 -31 101 77 111 192 203 254
3279 254 206 -77 -14 121 -28 -8 -67 54 -41 -7 -47 25 -156 -132 -156 -71 -134 -207 -122 95 -12 -1 219 320 237
3304 237 -73 -56 -16 -10 47 122 131 339 131 -39 36 -118 -155 -209 -138 -271 -91 11 -11 57 -154 -91 88 10 -151
3329 -151 -25 27 113 23 51 166 159 107 106 12 57 -96 58 19 -189 98 -20 -14 80 -26 54 -27 -8 -127 -30 -18 -84
3356 -84 -122 182 106 -47 6 213 100 -96 -131 -14 76 -17 102 44 8 118 29 98 -71 -213 -63 58 16 19 49
3381 49 173 98 70 12 -92 130 -99 -100 -41 -17 21 202 -93 56 11 -37 -67 -123 -40 -30 -78 -89 287 90 61 76
3407 76 -5 49 105 -15 40 40 -7 107 -31 115 223 -27 -83 -31 -237 -44 -244 -106 -85 -152 78 27 104 34 39 4
3433 4 45 70 -37 125 27 122 159 -34 -6 62 20 69 -91 31 -85 31 13 -28 33 -136 -271 -175 -142 -51 -121 -109
3459 -109 -71 65 161 -19 305 105 138 104 347 136 -25 161 99 34 25 -56 -82 56 -72 -112 -83 -58 -276 -223 -138
3484 -138 -168 29 82 -87 262 -118 108 175 -39 174 205 63 233 171 164 -9 -95 36 42 86 -37 -61 -19 -21 -255
3509 -255 -43 -134 -84 -109 -101 -25 157 15 144 91 172 -114 170 76 -87 -98 -63 -13 -69 328 -145 45 -20 -103 -92
3534 -92 -160 -57 -97 -185 -215 -49 121 105 -1 -28 70 148 -30 54 -148 138 32 -45 109 190 -53 -81 29 -78
3558 -78 -50 -104 -29 56 -6 38 -105 200 5 -129 -25 181 -13 31 118 43 48 96 89 113 -9 -122 -88 -44 -39 -120 -143
3585 -143 -147 -243 25 77 -158 122 -18 82 96 149 -138 28 185 132 237 13 56 61 -63 157 -97 -141 -117 -84
3609 -84 -56 -75 -136 -105 -160 -95 -203 -73 -50 -44 -52 18 101 240 297 184 207 169 107 222 76 28 -65 99 -8 103 -52
3636 -52 -101 -88 -22 -74 -271 -53 -226 -158 -90 -117 118 132 -93 -16 74 73 18 12 186 368 -78 96 129 33 121 61 -124
3663 -124 36 -257 -121 -114 -157 -92 -106 -107 258 -160 -15 -1 -88 124 135 119 122 120 235 194 102 44 -47 -27 122 4 -122
3690 -122 -148 -39 -170 -176 35 -113 -98 -117 -137 -92 -81 9 139 54 84 16 37 -38 -172 80 82 42 -125 51 219 -133
3716 -133 -28 7 77 -33 -138 -76 -48 44 -20 -103 99 25 52 25 36 211 -22 -128 -3 -30 41 -15 -79 34 -134
3741 -134 -174 -142 -63 -108 50 -41 25 35 -19 -40 -130 53 -4 -1 -25 4 167 61 -24 305 -95 6 2 -36 35 -82 -76
3768 -76 13 92 -108 6 -89 -79 11 -161 -74 -77 -113 98 61 72 229 57 125 68 33 101 -10 87 168 59 92 18 -46
3795 -46 -185 -20 -16 -206 -14 -6 -119 -10 -69 172 -149 162 86 275 88 -36 140 242 156 -43 236 96 6
3818 6 -141 67 -123 -21 -86 -104 -123 -102 -49 -154 -7 -170 2 21 -34 -181 -134 -54 -65 81 128 55 109 140 110 80
3844 80 87 -44 26 -159 -112 -113 -23 -127 -156 95 -198 -46 -78 -120 -94 -92 -155 -85 83 5 22 98 97 155 -23 -128 96
3871 96 -14 30 -144 97 147 83 -69 -2 -2 -117 -107 -110 105 -85 2 -79 -31 25 58 26 -29 -72 11 13 56 102 125 4
3899 4 -57 -254 123 147 -133 -97 -189 165 -133 61 122 17 -29 -11 41 60 15 -41 139 119 139 81 117 151 -76 -65
3925 -65 -8 41 25 -152 21 68 13 -230 -141 -136 -89 5 0 -75 -5 40 -70 -209 24 -65 183 118 226 30 -150 10
3951 10 -51 84 -81 -55 -42 149 37 32 -112 5 -72 -87 -31 129 -31 45 39 48 135 64 -43 87 135 47 25 91 -23
3978 -23 -97 -84 66 -49 -165 -162 -125 14 -87 -53 122 88 41 47 15 -29 -12 60 -79 7 50 23 195 115 49 -18 78
4005 78 -48 28 55 -84 -157 -208 -151 45 -151 14 -81 -133 -60 -38 4 -49 101 24 -28 195 -7 -19 169 -63 -100
4030 -100 26 30 92 32 -189 -62 -14 11 110 5 61 137 52 -128 -3 -88 3 267 -78 163 54 69 26 -12 3
4055 3 21 102 74 247 -15 -22 3 -76 -82 -72 13 -92 -51 -55 -1 85 -102 -74 20 -105 -37 -160 -75 99 116 111 26 103 273
4084 273 -48 187 42 14 77 -14 28 -52 9 172 217 35 35 56 -53 -14 -33 -54 -24 42 40 196 139 22 202 50
4110 50 -105 -104 -35 50 -41 -38 135 21 2 -157 122 -93 107 -45 -134 95 160 51 18 58 257 19 6 -109 57
4135 57 21 23 -2 67 -103 -47 61 137 -194 -126 18 -153 -110 -201 -17 -13 39 114 60 -47 28 -21 143 45 -8 -79 176
4162 176 116 -7 144 31 -113 10 52 -122 -108 -183 -28 18 -88 -66 131 31 -72 -9 64 141 49 -20 222 236
4186 236 -82 -74 49 175 -91 -153 149 -50 -86 19 -37 74 -94 -99 -64 10 -119 -62 106 -115 -80 13 106 -24
4210 -24 -63 137 183 -86 51 64 113 92 4 81 -104 154 -30 52 68 29 74 -47 213 -20 -188 -92 -37 -65 18
4235 18 179 35 -122 -190 -41 7 43 -40 -117 266 64 -85 23 69 -76 82 -48 66 -4 -31 94 93 -59 -74
4259 -74 94 -25 15 39 -13 -21 -36 -55 -12 44 -72 82 187 -112 54 191 -28 -74 -45 -66 111 -111 -55 69 65
4284 65 43 -98 -56 96 -127 147 233 90 -103 18 146 -40 -114 -46 58 -10 7 -212 114 150 -132 -135 56 -19
4308 -19 27 19 2 -82 -19 41 147 18 99 -55 -120 -108 -106 154 -31 -13 -22 6 -60 -80 -92 17 -15 -113 -81 10 -11 -2 26
4337 26 62 17 -155 -209 196 55 11 47 9 68 55 57 88 81 -103 73 17 60 0 -33 60 -64 -39 34 -34 -126 -92 -100 -46
4366 -46 58 74 -34 -12 239 -15 -45 130 22 -167 -36 207 67 -64 -70 168 -147 48 -53 2 -2 30 -52 74
4390 74 228 -15 -111 -40 -40 -148 -56 -40 -106 -109 102 -21 -149 -53 -29 50 -145 -23 -101 8 -72 -54 42 -21 -81 75
4416 75 171 89 24 15 2 1 -7 89 -40 -31 -234 11 112 -44 14 51 112 15 87 44 -73 -89 -52 -24 22 -49 -81 25 110
4445 110 94 -56 28 3 -34 -44 246 -28 -55 -230 29 -198 44 -4 -141 88 23 3 -86 104 116 71 100 19 -4
4470 -4 217 133 -136 136 5 148 -27 102 -57 21 18 -88 -69 -40 -135 -209 -198 82 -74 139 -30 -69 -57 -109 98
4495 98 54 1 4 -20 0 107 150 99 -68 69 -17 201 -37 1 183 23 -45 47 25 -11 66 -66 -101 145 -172 -161
4521 -161 -18 115 -24 -36 67 -137 19 65 -43 116 -21 -6 25 83 -10 -128 -3 164 -75 -82 152 73 -59
4544 -59 0 93 -17 73 9 199 -91 -46 85 -82 238 -31 -33 196 29 -81 -88 58 2 169 -104 224 79 -29
4568 -29 3 26 44 -34 134 168 46 172 96 -47 -92 -148 160 69 27 27 245 135 119 144 -9 -7 48 -133 -7 -58
4594 -58 62 -33 80 -25 -19 -115 19 96 21 18 120 54 -62 -33 63 63 -54 -9 6 8 -62 -148 96 -77 -145 60 132
4621 132 55 -138 17 -8 83 -100 -7 -37 75 230 244 27 -130 -147 56 -19 110 99 15 16 -48 -254 51 -7 -143
4646 -143 34 -55 -48 -1 -18 12 111 -30 -60 -65 87 -90 -8 65 153 -14 -66 -100 18 -41 15 -50 -14 10 -56 -116 81
4673 81 4 9 62 16 37 -142 -66 -116 6 37 56 29 119 22 13 18 -96 -4 11 28 -18 218 4 50 16 -38 -75 -78 -148 -6
4703 -6 -51 74 7 -39 -36 80 -161 -56 -48 -150 -101 -59 137 22 59 73 -28 -34 -1 -35 -12 -45 -122 42 -81 111 -8
4730 -8 119 -139 -86 -96 145 -74 -227 101 59 -68 -54 0 -46 -148 -172 -95 202 35 -134 18 69 -13 -91 -21 155
4755 155 -125 -94 0 88 -110 -64 202 148 -39 -16 77 12 20 23 -67 -60 -87 -49 -81 22 -22 96 69 57 -35 -72 16 54
4783 54 -142 -2 79 62 -206 94 142 52 -98 -18 198 -44 -62 42 10 -15 18 194 168 -145 92 36 46 -91
4807 -91 -46 -31 135 -37 -75 -108 -92 -85 -115 -5 126 109 -23 -26 -271 -121 -47 12 35 38 -51 -3 110 -42 -9 -11 -98 103
4835 103 -33 -143 122 -84 -9 -28 61 97 132 54 -76 -70 101 54 38 59 -4 5 88 -112 -177 -93 -86 -145 20 54 -183
4862 -183 40 20 49 -87 -60 -24 82 -8 -6 32 87 2 208 2 103 -8 163 -95 -115 -98 124 -18 36 -27 201
4887 201 110 62 -109 19 18 78 25 -152 40 43 64 -110 129 -16 -51 -138 20 86 -254 58 140 -26 -167 114
4911 114 24 21 -60 27 -83 -151 -141 86 117 -111 -10 -144 76 -32 -50 73 32 -50 50 -56 255 -5 -114 86
4935 86 124 -94 -83 200 -2 -36 84 126 53 -123 -6 15 -86 5 -95 -68 35 -24 81 85 -142 -78 79 100 -26
4960 -26 -78 -28 -47 131 11 -124 186 5 -76 160 210 214 5 81 92 55 -37 104 -21 56 -165 78 -41 -82 -62
4985 -62 -24 1 -56 -87 -2 -74 -53 -73 105 -120 -44 -113 56 -163 -129 -27 114 132 -36 -161 47 37 -148 -20 167
5010 167 55 -97 44 28 128 -49 180 -93 51 -60 102 6 126 -187 53 16 -165 -125 42 131 11 -101
5032 -101 -61 73 -129 149 210 -181 -24 33 103 156 146 67 14 14 -89 96 -60 -115 -154 10 77 -60 -11 298 44
5057 44 -58 -251 -59 51 -78 43 -63 181 -13 108 155 104 -23 83 61 -11 -21 -65 56 25 31 -26 -52 37
5081 37 -38 -3 38 -18 -233 -137 10 65 -82 46 -102 60 55 70 -73 36 -32 -105 53 165 65 -80 112 -154
5105 -154 -111 -85 11 61 73 -96 -159 -10 -90 -82 80 -12 108 76 7 -140 -99 -85 6 41 66 84 -72 106 28 29 41
5132 41 28 22 98 -37 53 12 -14 93 -27 123 -65 -112 -94 -19 -28 -20 -145 -15 -70 28 -152 -22 29 -71 5 9 140
5159 140 -58 -33 -64 -83 -106 10 -26 -37 29 -53 0 27 -23 -148 -117 -81 -24 -25 163 97 -102 -124 25 -24 75 -44 -175
5186 -175 -57 -24 94 50 -116 -111 53 -94 13 42 -5 116 150 -104 -37 91 -142 -67 -115 16 136 45 -27 -23 -52
5211 -52 -8 -36 180 -19 -188 69 103 -15 -17 -91 253 22 -49 28 41 117 -92 -23 -57 107 -90 149 90 0 -24
5236 -24 38 -30 22 93 -139 53 -49 10 107 -70 -124 -98 -4 28 -146 -94 137 2 17 -11 144 20 103 188 79
5261 79 -45 -22 7 117 0 85 59 103 140 -22 129 11 -16 -70 -13 0 -145 -24 151 46 -17 -148 131 -140
5285 -140 42 -35 103 -7 51 -31 -12 -21 -46 60 76 48 -63 38 108 67 14 33 145 -38 -77 -2 -69 -74 -164 102
5311 102 108 -68 -25 118 10 33 -19 43 3 -14 -59 -37 -7 -118 -97 51 57 63 -2 -24 16 -102 -55 87 -53 19 58
5338 58 73 72 85 59 27 -53 32 -50 -48 35 -16 59 33 27 127 65 95 97 71 44 -9 0 13 -29 -99 -132 -93 -53 155 -13 27
5369 27 -128 111 -1 27 92 -122 -12 -144 55 24 -26 35 -52 -39 -40 53 0 -66 3 80 35 -111 -74 -167 -28 -1
5395 -1 -54 17 40 -3 68 -122 0 -98 -43 88 72 -86 -24 -169 132 146 -44 31 -11 77 -85 -48 61 -72 229
5420 229 -189 -98 52 -168 131 95 -1 1 23 107 3 -16 -130 49 -61 -20 69 9 41 6 13 -76 19 -165 14 -36
5446 -36 -57 46 2 -168 2 97 68 -265 -73 146 -96 -4 -118 -181 70 140 -124 -73 185 85 -45 104 131
5469 131 88 -113 42 94 66 -64 -26 -25 16 -115 -36 70 -32 -49 -43 49 -163 -5 18 -118 24 100 121 -35 -8
5494 -8 -196 -92 -57 -18 147 -9 87 -41 -85 -58 92 -13 17 195 -66 -11 -66 135 -142 12 -92 66 126 47
5518 47 24 -7 -145 66 -32 131 -37 -165 -67 -244 -43 -9 -148 149 -72 159 -41 27 -76 141 23 23 -48
5541 -48 -20 -48 -19 -186 -30 71 -77 -7 -18 180 -75 -6 -23 76 -220 26 23 81 -108 -122 7 84 149 145 -127 90
5567 90 103 -56 -80 54 -34 -80 64 -240 67 -150 100 97 -20 -124 -18 36 -127 -185 -12 -23 -61 -77 136 72
5591 72 17 -184 -142 -26 -78 26 80 60 -35 130 78 163 -81 21 -23 4 -51 -37 89 44 52 -122 99 -9 26 21
5617 21 -117 -97 -62 -66 63 149 -153 -26 173 114 -294 3 -53 44 22 100 -35 39 -65 143 -10 112 -57 90
5641 90 -46 12 -68 121 -67 11 95 145 -52 -94 65 26 -12 -184 41 37 -56 -32 -6 -96 59 85 23 52 18 100 74
5668 74 -24 -49 9 -63 14 10 90 0 -113 147 -96 -20 111 -1 -70 33 133 -54 -111 79 -51 -27 0 48 -1 -23
5694 -23 -118 -58 50 -75 7 91 -97 -5 -98 207 -92 -1 -104 -4 -3 -152 -108 78 23 78 8 -50 55 -85 28
5719 28 -73 4 -44 -23 93 -46 -118 -64 37 20 34 110 -9 53 -28 46 154 101 31 -179 -97 -162 -52 74 91 -145
5745 -145 -27 156 -31 -96 76 139 -136 -145 122 68 -133 -30 14 52 57 -70 14 1 0 1 -160 94 57 -122 -67 58
5771 58 76 -91 -24 66 42 -29 -59 -56 -4 80 43 -123 90 0 -1 -21 -108 -30 -120 65 78 -50 -200 -2 -36 7 -129
5798 -129 116 79 134 -90 74 67 -62 -60 70 93 -45 -8 -96 -90 32 116 -17 -106 23 141 -118 97 103 3 -167
5823 -167 -47 94 55 -97 -78 -145 -63 -97 -111 57 72 -32 -3 11 94 102 19 10 -92 -46 -55 11 97 134 24 176 -70
5850 -70 -200 -105 89 35 26 -4 69 -166 189 -149 -44 -12 -103 -74 -173 -25 -151 -150 49 -97 7 -117 -77 -109 -4
5875 -4 -161 112 38 9 -6 -38 -14 -90 25 34 -20 28 71 144 2 116 90 57 93 25 -104 59 -43 -60 38 4 -25
5902 -25 -35 -89 -62 25 55 -72 -96 47 -35 29 -95 32 -1 31 74 20 18 42 -54 59 -150 101 -3 -109 28 160
5928 160 13 -216 -74 47 17 107 45 215 146 14 47 121 127 94 -25 37 -56 11 26 11 -42 -67 74 74 -111 -25
5954 -25 119 -47 -81 -50 -74 178 -115 49 31 39 152 18 154 27 122 47 -25 -58 38 -94 64 -26 -204 -147 116
5979 116 -110 85 49 0 -19 34 -129 91 -18 -65 2 -190 11 101 -142 100 -206 25 75 3 75 -82 3 -23
6003 -23 -14 -44 -100 18 -83 -74 76 37 30 39 45 -146 -23 47 -122 135 39 -186 113 116 -25 -201 -151 33 -83 74
6029 74 -37 -133 -73 4 2 129 -104 -106 102 34 -125 -23 -14 -33 69 -30 46 -199 -20 24 17 12 51 2 118 -63 -69 -119
6057 -119 5 31 50 -156 -16 181 41 138 15 -115 36 17 85 -83 34 -132 112 -98 -116 21 53 9 -28
6080 -28 -124 71 -102 73 69 109 -6 -67 133 -35 -135 60 142 -21 0 44 16 -63 -64 86 112 -116 -130 -69 -110 42
6106 42 -161 16 20 -33 118 -167 96 -79 -110 82 46 -114 -268 -25 3 -124 42 -44 -65 -137 -139 -95 129 11
6130 11 110 105 -49 -76 72 -35 5 159 -130 -111 142 11 -9 -63 -45 -103 58 50 -138 -110 -68 49 -42 24 55 -178
6156 -178 -86 89 93 64 -225 96 -37 8 -42 16 108 145 -107 -154 -47 -53 -130 58 44 26 -123 -61 61 -102 -60 59
6182 59 124 150 -48 -15 -111 0 -11 137 62 -51 -80 -29 -10 -40 -103 63 18 30 -92 -30 79 80 75 18 6 -13 -188
6209 -188 35 -1 99 152 -164 29 -9 -85 88 26 90 -5 -85 69 104 34 283 201 -188 -112 181 109 49 -34 -10
6234 -10 -15 -161 -5 42 37 34 -43 -38 10 -100 -12 37 78 -23 -6 108 43 -40 -54 52 -140 60 38 69 33 68 -2 -46
6262 -46 10 138 152 35 67 -126 -72 -111 121 -96 -116 8 -17 -74 -21 47 82 133 37 -80 -123 -209 -14 -187 20
6287 20 -128 -112 79 121 -77 24 -110 -58 37 99 -9 -27 -87 33 36 -30 168 72 12 36 63 19 10 -40 160 -50
6313 -50 -51 63 50 88 -85 -63 -56 -63 -21 0 -51 52 -148 84 -36 -38 18 -121 93 -184 74 -50 69 25 -50 -93
6339 -93 2 26 66 12 88 180 29 -110 60 56 114 -3 -62 25 37 141 63 -67 112 -143 53 4 95 -13 91
6364 91 49 -107 -65 77 -153 29 114 -111 27 -71 13 25 47 100 73 -88 36 -240 162 119 24 -12 -61 54 -67
6389 -67 34 -19 -52 -105 -26 143 -117 -127 -63 28 -30 -146 -121 -64 -4 -110 129 14 -20 16 -82 -64 30 70 68 -68 42
6416 42 -35 65 85 -18 143 -26 90 -66 -6 -4 10 67 -83 39 -99 98 22 -116 78 106 -66 55 -64
6439 -64 70 136 106 89 -81 2 -31 -47 15 -73 -60 -88 -138 -84 -77 -81 -145 -60 125 87 65 -101 -68 92 -124 54 -19 -40
6467 -40 66 8 50 150 -142 88 -10 57 104 122 50 -4 -114 -14 26 7 74 85 -16 -31 -178 -13 44 -63 -52
6492 -52 -84 31 -291 -54 -65 18 -99 -64 134 -34 31 -33 135 6 -164 -129 -135 169 -51 30 -128 -51 81 -3
6516 -3 67 41 65 -56 113 12 -95 -80 -128 17 -20 70 200 -77 68 -47 -132 -4 -9 -99 52 -63 -168 51
6540 51 -129 44 -27 -15 -76 -40 14 27 24 72 111 -135 132 -16 -2 42 -140 23 92 -171 -104 296 -55 90 -86
6565 -86 -204 -8 -39 20 -81 161 91 22 -23 -41 149 -10 -35 -52 -3 -88 -97 -80 49 -142 -87 -32 -7 -80 -147 110
6591 110 66 17 -11 127 83 -72 69 10 -3 -69 158 88 22 10 -151 -27 -24 -189 -28 -91 12 14 -233 62 48
6616 48 -2 210 -40 -143 54 8 -184 -110 -32 117 -54 114 15 22 -63 142 -5 48 37 -104 9 -81 10 -87 -144
6641 -144 83 -159 81 168 15 114 -82 117 -87 25 -77 -49 -116 -25 104 -133 -23 -82 -36 -124 -88 28 -30
6664 -30 -61 25 -47 -62 77 9 -82 63 -194 -75 124 99 -194 -18 104 -19 -32 -41 102 -124 -102 135 143 -86 -202
6689 -202 101 -100 -134 65 -16 -5 8 36 -26 29 -36 77 -97 -175 -144 95 86 -136 -42 -50 -141 -239 -99 -99 96 -65
6715 -65 148 -62 -164 -69 117 15 -53 -118 -28 9 55 -44 -86 69 -56 72 28 -18 53 -131 34 -54 -132 -2 -34
6740 -34 29 8 45 -67 -13 33 19 97 102 -121 44 66 1 82 -44 -33 35 -40 -36 9 65 -94 -12 -108 1 80 -18 79
6768 79 -41 -105 -24 41 -128 31 -31 18 -23 -47 -2 6 69 -19 -84 30 -34 -44 48 12 85 -37 79 -179 29 -192
6794 -192 -24 -124 17 -51 -202 86 -122 24 139 -162 14 -24 -83 91 -7 33 39 160 -12 24 137 -38 -74
6817 -74 7 79 159 -217 -25 115 -50 -102 67 15 -54 0 -106 96 -76 -174 -15 118 -156 56 136 55 185 -88
6841 -88 -43 129 -13 -44 -29 -50 -86 142 51 68 105 -19 11 78 9 -151 144 54 -56 102 67 83 0 -38 -145 -142
6867 -142 46 -87 -21 -59 55 96 -7 99 -67 -157 -42 -4 -164 141 -61 225 7 1 8 -150 100 125 -23
6890 -23 146 -65 126 -1 -28 57 -77 -3 70 -186 68 -81 -39 -30 49 100 -67 -33 -74 33 -197 48 23 154
6914 154 -4 34 61 -164 -68 -50 -31 -39 -21 28 -24 -8 136 -148 101 -84 -74 180 36 50 74 27 -36 131 -137
6939 -137 -125 -97 66 93 70 -7 97 72 -92 140 -164 -112 146 5 118 -76 44 45 -120 -67 152 -33 -196
6962 -196 170 -81 -42 15 45 67 35 102 65 72 85 -5 22 -72 -17 -14 -85 116 -121 -33 51 42 127 -26 -116 25 -84 58
6990 58 17 -89 -69 -148 -199 -1 30 -44 54 -68 -67 -9 10 125 19 -60 75 82 87 76 148 -138 142 79 -45 34 -94
7017 -94 -62 136 82 209 15 -56 95 69 90 23 -73 64 -31 -64 100 -147 -3 45 30 33 117 105 -64 -74 -56 74
7043 74 107 -7 7 44 128 55 -72 101 87 -26 173 -118 -127 -45 -197 34 48 78 45 64 -65 -104 -89 69 -83
7068 -83 56 105 -140 51 141 -110 63 2 -106 35 30 -38 76 36 66 12 36 -121 37 34 10 113 41 -93 -22
7093 -22 -36 -46 -14 -114 -11 73 -193 0 -46 -113 -49 -54 69 -63 -182 -2 11 -24 -19 46 140 22 -86 106 9 -8
7119 -8 -53 -44 16 166 -79 59 -16 -184 -109 -2 32 -82 -57 92 85 -138 -74 -209 -82 52 110 108 65 -82 -116 -70
7145 -70 -12 -85 -59 74 19 -222 11 6 98 75 -98 -60 -43 79 36 43 -70 22 81 -19 -150 2 78 -8 -115 -41
7171 -41 -33 -63 -2 -84 -1 27 31 45 -19 169 59 3 108 115 -163 0 148 -67 -73 -113 68 -44 -11 -6 99 -16 -98
7198 -98 64 -27 140 -102 -119 67 56 9 34 0 18 -7 12 81 19 -31 -64 84 44 -28 -22 19 57 -6 45 -111 13
7225 13 -39 62 7 -54 -54 95 -52 27 170 -60 45 -185 -34 110 90 65 195 -21 -196 114 -35 47 59 -141
7249 -141 173 26 93 105 -30 51 -21 -54 -85 -36 193 89 29 94 -17 -94 -39 36 -116 11 100 56 15 45 187
7274 187 71 40 17 88 -59 63 -25 206 33 -115 -94 74 -18 -11 -37 -31 -67 195 5 59 119 9 -42 33 -7 -70
7300 -70 -15 35 15 -3 6 122 -97 -16 178 226 32 -27 13 -13 18 140 -154 52 55 38 -211 -3 -25 -92 -83 -23 194
7327 194 8 -57 53 -61 20 52 -245 146 -92 -7 -14 -32 -48 -60 -47 57 54 -63 111 171 -95 -37 -168 -75 -67 16
7353 16 43 55 -62 -194 59 56 233 -12 41 -16 -68 -17 35 -9 145 -23 -140 79 136 112 -71 -10 136 67 -22
7378 -22 -83 142 -42 54 8 14 105 58 -46 -1 30 -18 -28 30 22 -55 39 55 142 -95 74 -190 162 26 -50 81 137
7405 137 -56 50 -43 -140 35 -11 -107 16 -18 68 -3 -37 -47 26 45 64 50 -25 -85 208 -46 24 71 110 29 -104
7431 -104 47 130 -33 -45 -57 17 127 -56 -36 -8 130 242 50 -108 -54 40 -163 -99 -22 -2 79 -9 -121 110
7455 110 332 150 11 103 -5 -74 102 -138 13 -86 1 7 -91 32 147 -37 -89 -126 14 -77 -167 61 -126 44
7479 44 -11 34 130 2 50 48 16 77 14 -39 -121 199 -122 -41 47 -43 -46 -62 -28 92 141 -2 98 -2 -91 12 -103
7506 -103 -37 -105 -17 -145 37 -29 -38 40 70 -71 41 42 112 0 -60 71 238 -76 12 -153 8 -17 -69 34 -85
7531 -85 27 -125 -35 -188 -98 -13 11 -113 -96 75 144 -89 -8 -102 113 -67 -56 31 -20 112 -62 128 86 -65
7555 -65 -69 39 -14 -27 66 136 108 -91 -83 96 98 -88 17 -113 22 -54 -146 -43 -10 20 78 109 -271 -108 -84 -67 -2
7582 -2 -103 -65 106 -38 -89 66 47 11 126 192 15 -64 -48 75 -79 -175 76 91 -59 165 -48 214 133 36
7606 36 -39 12 87 -35 36 52 -42 -25 1 -58 -112 -143 71 21 27 -5 -140 -147 48 -59 57 22 -158 -125 261 73 -76
7633 -76 48 46 126 -24 86 57 54 -59 -59 -19 -17 -112 123 80 115 -135 -57 16 79 -7 -57 99 -41 99 84 -80 -3
7660 -3 -69 56 52 -120 -2 -144 -77 90 -159 -64 -28 27 -189 142 33 -97 -74 -47 125 -42 -38 -51 -12 94 -86
7685 -86 2 24 39 -66 -255 151 -168 -147 36 43 -26 -80 41 -55 31 5 106 -87 24 141 -151 -17 -72 -64 55
7710 55 -17 37 130 50 23 -109 147 2 55 19 30 -74 86 63 126 18 -19 112 58 217 -48 59 198 102 27
7735 27 2 -133 -46 -182 71 30 58 -52 -15 12 -33 -28 33 112 -5 -5 -77 31 -92 -56 -72 -145 52 -79 -71 110 -1
7762 -1 -47 98 40 -22 38 -141 122 -48 52 71 -82 -7 39 -50 97 -26 -93 -68 -7 10 50 -27 141 58 -24 -38
7788 -38 113 -90 19 53 -23 -37 36 10 -27 12 -42 39 95 -70 -40 126 53 -242 105 22 31 81 -5 -5 -34 81 67
7815 67 -75 108 76 -79 163 44 57 132 -171 34 -72 61 14 -40 -35 -52 4 81 156 99 -257 -80 110 8
7839 8 -34 -105 -102 -111 16 17 -20 162 -11 -103 -172 182 -22 -157 76 41 -38 14 97 -70 -98 -2 115 22 208 -69 15
7866 15 27 -98 -59 110 -62 131 -104 -21 154 -113 10 -38 101 80 -45 -53 -72 -6 42 155 -62 107 -67 -76
7890 -76 114 -97 -56 -50 22 84 -92 60 -98 68 -73 67 147 -102 -9 -66 109 67 133 -81 -122 -92 50 20 -55
7915 -55 124 89 -1 -47 -65 54 -7 63 -220 18 -34 99 43 89 -17 49 -104 -143 -33 -15 -89 -25 64 41 -69 136
7941 136 53 -82 143 -92 49 87 73 -87 27 -104 -22 87 -18 -51 6 -59 81 -97 23 11 50 112 39 8
7965 8 64 100 -52 -201 -28 -79 28 58 19 76 -36 -41 98 -78 -55 9 -136 -204 47 243 -31 -7 122 152 -205
7990 -205 -117 45 -17 -79 -36 -36 24 -112 -52 25 129 -120 61 -112 62 28 30 86 -141 -78 -121 42 -78 31 44
8015 44 -101 -67 82 -4 6 -87 -97 -46 -132 21 153 -114 154 151 59 97 -184 7 -14 16 97 19 -21 86 15 -122
8041 -122 -33 21 -102 -20 -115 60 -11 -15 27 -25 -124 -75 97 84 -125 162 -7 -79 23 -38 68 87 -87 10 -108
8066 -108 71 -9 92 11 -21 56 73 -37 43 -31 64 49 11 13 123 -119 148 -46 -86 20 240 -187 43 -57
8090 -57 3 8 19 158 53 -51 -21 -100 -2 34 -152 -97 -115 69 102 86 38 52 -93 4 -116 -122 44 64 1 42 -143
8117 -143 146 55 25 2 -108 39 -184 31 -61 -4 70 -233 -34 15 -96 -67 -4 -37 -174 -29 18 -5 73 -18 121
8142 121 104 29 145 -40 -30 207 -28 -33 22 -49 -18 91 106 66 22 118 134 -16 -169 -53 47 90 -13 1 -124
8167 -124 18 99 115 -53 -83 18 12 -28 52 218 104 63 -28 -70 158 43 66 59 101 -212 112 -59 -168 -18
8191a8
##END NTUPLES=NMR FID
##END=
