##TITLE=1H_Bz1901
 CDCl3
 8 sc, 
 20.1.2022
##JCAMPDX= 6.0         $$ Bruker NMR JCAMP-DX V2.0
##DATA TYPE= NMR FID
##DATA CLASS= NTUPLES
##ORIGIN= UXNMR, Bruker Analytische Messtechnik GmbH
##OWNER= root
$$ XWIN-NMR		Version 3.5
$$ Thu Jan 20 12:03:06 2022 Russian Standard Time (UT+4h)  she@DPX200
##.OBSERVE FREQUENCY= 200.131346
##.OBSERVE NUCLEUS= ^1H
##.DELAY= (6, 6)
##.ACQUISITION MODE= SIMULTANEOUS
##.ACQUISITION SCHEME= undefined
##.AVERAGES= 8
##.DIGITISER RES= 18
##SPECTROMETER/DATA SYSTEM= spect
##.PULSE SEQUENCE= zg30
##.SOLVENT NAME= CDCl3
##.SHIFT REFERENCE= (INTERNAL, CDCl3, 0, 15.7039)
##AUDIT TRAIL= $$ (NUMBER, WHEN, WHO, WHERE, WHAT)
$$ ##TITLE= Audit trail, XWIN-NMR		Version 3.5
$$ ##JCAMPDX= 5.01
$$ ##ORIGIN= Bruker BioSpin GmbH
$$ ##OWNER= she
$$ F:/spectra/data/she/nmr/H-F/1/audita.txt
$$ ##AUDIT TRAIL=  $$ (NUMBER, WHEN, WHO, WHERE, WHAT)
(   1,<2022-01-20 12:01:51.62 +0400>,<she>,<DPX200>,
      <created by zg, POWCHK disabled, PULCHK disabled
       configuration hash MD5:
       00 E9 B6 7A A2 85 ED C7 34 08 36 98 17 FE 4E 26
       data hash MD5: 16K
       30 B6 2E DA 97 6F 1E 9C CF 8B 58 40 C5 BE 1B 60>)
$$ ##END=
$$ 
$$ hash MD5
$$ 0F B9 E1 4F 42 05 72 4E 5F C3 AD CB A4 15 A3 B0
##$RELAX= 
##$RELAX= 
##$RELAX= 
##$RELAX= 
##$RELAX= 
##$RELAX= 
$$ Bruker specific parameters
$$ --------------------------
##$DU= <F:/spectra>
##$EXPNO= 1
##$NAME= <H-F>
##$PROCNO= 1
##$TYPE= <nmr>
##$USER= <she>
##$AMP= (0..31)
100 100 100 100 100 100 100 100 100 100 100 100 100 100 100 100 100 100 
100 100 100 100 100 100 100 100 100 100 100 100 100 100 
##$AQSEQ= 0
##$AQ_mod= 1
##$AUNM= <au_zg>
##$AUTOPOS= <>
##$BF1= 200.13
##$BF2= 200.13
##$BF3= 200.13
##$BF4= 200.13
##$BF5= 200.13
##$BF6= 200.13
##$BF7= 200.13
##$BF8= 200.13
##$BYTORDA= 1
##$CFDGTYP= 0
##$CFRGTYP= 5
##$CHEMSTR= <none>
##$CNST= (0..31)
1 1 145 1 1 1 1 1 1 1 1 1 1 1 1 1 1 1 1 1 1 1 1 1 1 1 1 1 1 1 1 1 
##$CPDPRG= <>
##$CPDPRG1= <>
##$CPDPRG2= <>
##$CPDPRG3= <>
##$CPDPRG4= <mlev>
##$CPDPRG5= <mlev>
##$CPDPRG6= <mlev>
##$CPDPRG7= <mlev>
##$CPDPRG8= <mlev>
##$CPDPRGB= <>
##$CPDPRGT= <>
##$D= (0..31)
0 1.2 0 0 0 0 0 0 0 0.06 0 0.03 0 0 0 0 0.0002 0 0 0 0 0 0 0 0 0 0 0 0 
0 0 0 
##$DATE= 1642665711
##$DBL= (0..7)
120 120 120 120 120 120 120 120 
##$DBP= (0..7)
150 150 150 150 150 150 150 150 
##$DBP07= 0
##$DBPNAM0= <>
##$DBPNAM1= <>
##$DBPNAM2= <>
##$DBPNAM3= <>
##$DBPNAM4= <>
##$DBPNAM5= <>
##$DBPNAM6= <>
##$DBPNAM7= <>
##$DBPOAL= (0..7)
0.5 0.5 0.5 0.5 0.5 0.5 0.5 0.5 
##$DBPOFFS= (0..7)
0 0 0 0 0 0 0 0 
##$DE= 6
##$DECBNUC= <off>
##$DECIM= 32
##$DECNUC= <off>
##$DECSTAT= 4
##$DIGMOD= 1
##$DIGTYP= 9
##$DL= (0..7)
0 120 120 120 120 120 120 120 
##$DP= (0..7)
150 150 150 150 150 150 150 150 
##$DP07= 0
##$DPNAME0= <>
##$DPNAME1= <>
##$DPNAME2= <>
##$DPNAME3= <>
##$DPNAME4= <>
##$DPNAME5= <>
##$DPNAME6= <>
##$DPNAME7= <>
##$DPOAL= (0..7)
0.5 0.5 0.5 0.5 0.5 0.5 0.5 0.5 
##$DPOFFS= (0..7)
0 0 0 0 0 0 0 0 
##$DQDMODE= 0
##$DR= 18
##$DS= 0
##$DSLIST= <SSSSSSSSSSSSSSS>
$$ [...]
##$SUBNAM2= <"">
##$SUBNAM3= <"">
##$SUBNAM4= <"">
##$SUBNAM5= <"">
##$SUBNAM6= <"">
##$SUBNAM7= <"">
##$SUBNAM8= <"">
##$SUBNAM9= <"">
##$SW= 18.0517287032376
##$SWIBOX= (0..15)
0 0 2 0 0 0 0 0 0 0 0 0 0 0 0 0 
##$SW_h= 3612.71676300578
##$TD= 16384
##$TD0= 1
##$TE= 0
##$TE2= 300
##$TE3= 300
##$TEG= 300
##$TL= (0..7)
0 120 120 120 120 120 120 120 
##$TP= (0..7)
150 150 150 150 150 150 150 150 
##$TP07= 0
##$TPNAME0= <>
##$TPNAME1= <>
##$TPNAME2= <>
##$TPNAME3= <>
##$TPNAME4= <>
##$TPNAME5= <>
##$TPNAME6= <>
##$TPNAME7= <>
##$TPOAL= (0..7)
0.5 0.5 0.5 0.5 0.5 0.5 0.5 0.5 
##$TPOFFS= (0..7)
0 0 0 0 0 0 0 0 
##$TUNHIN= 0
##$TUNHOUT= 0
##$TUNXOUT= 0
##$USERA1= <user>
##$USERA2= <user>
##$USERA3= <user>
##$USERA4= <user>
##$USERA5= <user>
##$V9= 5
##$VALIST= <valist>
##$VCLIST= <CCCCCCCCCCCCCCC>
##$VD= 0
##$VDLIST= <DDDDDDDDDDDDDDD>
##$VPLIST= <PPPPPPPPPPPPPPP>
##$VTLIST= <TTTTTTTTTTTTTTT>
##$WBST= 1024
##$WBSW= 4
##$XGAIN= (0..3)
0 0 0 0 
##$XL= 0
##$YL= 0
##$YMAX_a= 643655
##$YMIN_a= -559632
##$ZGOPTNS= <>
##$ZL1= 120
##$ZL2= 120
##$ZL3= 120
##$ZL4= 120
##$ABSF1= 10
##$ABSF2= 0
##$ABSG= 5
##$ABSL= 3
##$ALPHA= 0
##$AQORDER= 0
##$ASSFAC= 0
##$ASSFACI= 0
##$ASSFACX= 0
##$ASSWID= 0
##$AUNMP= <proc_1d>
##$AZFE= 0.1
##$AZFW= 0.1
##$BCFW= 1
##$BC_mod= 2
##$BYTORDP= 1
##$COROFFS= 0
##$CY= 11.3945322036743
##$DATMOD= 1
##$DC= 2
##$DFILT= <>
##$DTYPP= 0
##$F1P= 2.36226072786647
##$F2P= -0.459571619588291
##$FCOR= 0.5
##$FTSIZE= 0
##$FT_mod= 4
##$GAMMA= 1
##$GB= 0.15
##$INTBC= 1
##$INTSCL= 1
##$ISEN= 128
##$LB= 0.24
##$LEV0= 0
##$LPBIN= 0
##$MAXI= 10000
##$MC2= 0
##$MEAN= 0
##$ME_mod= 0
##$MI= 1.114404
##$NCOEF= 0
##$NC_proc= 0
##$NLEV= 6
##$NOISF1= 3.799351
##$NOISF2= 2.8
##$NSP= 1
##$NTH_PI= 0
##$NZP= 0
##$OFFSET= 15.70392
##$PC= 1
##$PHC0= -15868.46
##$PHC1= 10.60078
##$PH_mod= 1
##$PKNL= yes
##$PPARMOD= 0
##$PSCAL= 0
##$PSIGN= 0
##$REVERSE= no
##$SF= 200.130013532006
##$SI= 16384
##$SIGF1= 3
##$SIGF2= 2
##$SINO= 400
##$SIOLD= 16384
##$SREGLST= <1H.CDCl3>
##$SSB= 0
##$STSI= 0
##$STSR= 0
##$SW_p= 3612.71676300578
##$SYMM= 0
##$S_DEV= 0
##$TDeff= 0
##$TDoff= 0
##$TI= <>
##$TILT= no
##$TM1= 0
##$TM2= 0
##$TOPLEV= 0
##$USERP1= <user>
##$USERP2= <user>
##$USERP3= <user>
##$USERP4= <user>
##$USERP5= <user>
##$WDW= 1
##$XDIM= 8192
##$YMAX_p= 0
##$YMIN_p= 0
$$ End of Bruker specific parameters
$$ ---------------------------------
##NTUPLES= NMR FID
##VAR_NAME=  TIME,          FID/REAL,        FID/IMAG
##SYMBOL=    X,             R,               I
##VAR_TYPE=  INDEPENDENT,   DEPENDENT,       DEPENDENT
##VAR_FORM=  AFFN,          ASDF,            ASDF
##VAR_DIM=   8192,          8192,            8192
##UNITS=     SECONDS,       ARBITRARY UNITS, ARBITRARY UNITS
##FACTOR=    0.0002768,     1,               1
##FIRST=     0,             0,               0
##LAST=      2.2672688,     0,               0
##MIN=       0,             -559632,         0
##MAX=       2.2672688,     643655,          0
$$ Real data points
##PAGE= N=1
##DATA TABLE= (X++(R..R)), XYDATA
$$ [...]
$$ plain form
2443 -3278 -5256 -7371 -5905 -1873 -786 -1295 193 1913 201 -2707 -2206 -596 -903 -952 2130 4585
2459 4585 4034 4088 5609 5277 2535 668 682 -55 -1972 -2186 -702 -141 -1792 -2180 -791 -1400 -4796 -5072
2477 -5072 -2793 -2962 -4260 -1666 2295 2632 1269 2286 3336 1989 -37 695 3254 3894 2593 2935
2493 2935 5350 3834 -700 -2128 -998 -3200 -5444 -3396 -937 -1751 -2431 -977 -406 -1670 -2871 -3384
2509 -3384 -2515 -1597 -1173 644 3571 4229 3335 4866 6110 3407 907 949 -869 -3011 -786 1688 755
2526 755 55 1213 975 -692 -2985 -4886 -6000 -6050 -5597 -2891 1634 2807 638 2108 4910 2463
2542 2463 -939 501 1206 -1172 27 4263 5475 3260 1700 1447 1735 838 -2656 -4102 -3113 -4162
2558 -4162 -5094 -950 2149 -1241 -3398 -134 853 -1495 -1290 -470 -1250 -593 2354 4642 5305 3879 1344
$$ packed form
2443c278j978k115J466M032J087n09J488J720j712k908N01J610l07m9L082K455
2459D585n51N4J521l32k742j867J4p37j917k14J484N61j651l88J389o09l396k76
2477e072K279j69j298K594L961L37j363J017J050j347k026P32K559O40j301L42
2493B935K415j516m534j428J130k202k244K048K459q14o80J454N71j264j201n13
2509c384Q69R18M24J817K927O58q94J531J244k703k500M2j818k142K225K474r33
2526G55p00J158k38j667k293j901j114n0M53K706M525J173k169J470K802k447
2542B463l402J440P05k378J199M236J212k215j560k53K88q97l494j446R89j049
2558d162r32M144L099l390k157L264R87k348K05Q20p80O57K947K288O63j426k535
$$ plain form
2575 1344 1018 2287 657 -1598 -189 -21 -2187 299 3785 56 -4735 -3925 -2691 -4409 -3291 -673
2591 -673 -886 -1143 367 2693 4228 2814 -1301 -1841 2152 1863 -584 2455 4900 736 -239 4552
2607 4552 4607 -1600 -4356 -3499 -3967 -4326 -3121 -1762 147 238 -807 1564 3525 -1446 -5976 -2387 670
2624 670 -1205 593 5917 5137 2765 4610 5391 1983 -1116 -2662 -3309 -1937 -721 -1285 105 1019
2640 1019 -1684 -2281 831 -1338 -6010 -4424 -1539 -3152 -2423 2950 3845 1540 3120 5194 3666 1411
2656 1411 331 -290 827 1146 7 1972 4402 533 -2562 497 -206 -6049 -6319 -1758 -2437 -4163
2672 -4163 -998 1337 -343 -1202 -550 127 811 544 338 2982 5117 2400 1904 5168 3597 -665 395
2689 395 1882 -1728 -2731 222 -45 -2319 -1763 -980 -2362 -3237 -3490 -3961 -3226 -2913 -2620 867 4120
$$ packed form
2575A344l26J269j630k255J409J68k166K486L486l729m791Q10J234j718J118K618
2591f73k13k57J510K326J535j414m115n40L993k89k447L039K445m164r75M791
2607D552N5o207k756Q57m68l59J205J359J909R1j045K371J961m971m530L589L057
2624F70j875J798N324p80k372J845P81l408l099j546o47J372J216n64J390R14
2640A019k703n97L112k169m672J586K885j613P29N373Q95k305J580K074j528k255
2656A411j080o21J117L19j139J965K430l869l095L059p03n843k70M561o79j726
2672d163L165K335j680q59O52O77O84k67k06K644K135k717m96L264j571m262J060
2689C95J487l610j003K953k67k274N56P83j382q75k53m71P35L13K93L487L253
$$ plain form
2706 4120 2310 1636 4952 4144 -441 78 2966 680 -996 3091 5629 3242 1320 895 -180 -2019
2722 -2019 -4668 -5667 -3452 -3069 -5272 -2711 2384 950 -2906 -512 1991 -1057 -2662 537 1616
2737 1616 241 1276 4488 5719 4909 2956 2381 2652 423 -3083 -2299 -646 -2921 -3173 785 1430
2753 1430 -2161 -3096 -1476 -3107 -5164 -3292 -1090 -976 -332 1823 3600 3579 1479 784 2740 2532 60
2770 60 1245 4163 2189 -753 1450 2989 -884 -3558 -1828 -1171 -3304 -4019 -1913 -675 -1387 -2359
2786 -2359 -555 1251 -507 -3009 -902 1838 321 -244 3633 5331 3187 2233 3837 2442 -994
2801 -994 -2113 -1201 -944 -1193 -745 962 1266 -465 -1867 -1582 -2524 -4817 -4423 -1772 -1092 -784 1836 3866
2819 3866 2867 1606 2602 2175 98 -1029 126 898 298 357 2585 3290 1324 -392 -45 -965 -4256
$$ packed form
2706D120j810o74L316q08m585N19K888k286j676M087K538k387j922m25j075j839
2722b019k649r99K215L83k203K561N095j434l856K394K503l048j605L199J079
2737A616j375J035L212J231q10j953n75K71k229l506P84J653k275k52L958O45
2753A430l591r35J620j631k057J872K202J14O44K155J777k1k100o95J956k08k472
2770F0J185K918j974k942K203J539l873k674J730O57k133p15K106J238p12r72
2786b359J804J806j758k502K107K740j517n65L877J698k144r54J604j395l436
2801i94j119R12K57k49M48J707L04j731j402K85r42k293L94K651O80L08K620K030
2819C866r99j261R96m27k077j127J155P72o00N9K228P05j966j716L47r20l291
$$ plain form
2836 -4256 -5504 -3224 -2018 -2781 -1346 2134 2474 510 120 1015 299 -1821 -1604 1153 2385 1518 2263
2853 2263 4208 3507 718 -191 385 -897 -2810 -2249 -747 -1193 -1966 -875 94 -963 -1999 -1468 -533
2870 -533 -1366 -1687 167 1393 966 1281 2989 3527 1413 748 1662 1400 -711 -304 1605 1577 -381 -528
2888 -528 404 -1094 -4018 -3986 -2118 -1972 -2886 -1411 1646 1780 -554 -370 1447 587 -1798 -465 2441
2905 2441 2502 1452 2808 4500 3291 659 185 1032 -800 -3190 -2895 -1034 -1174 -2372 -908 789
2921 789 -363 -2041 -1669 -1116 -2965 -3294 -1534 446 1101 2057 3848 4744 3467 1659 1812 1191 -706
2938 -706 -1475 464 1487 216 414 1793 399 -2402 -2758 -1984 -3057 -4282 -3166 -1435 -760 -998 -141
2955 -141 1698 1646 -178 303 2494 1979 -478 1062 3766 2657 1143 2638 2957 542 -1156 -793 -838
$$ packed form
2836d256j248K280J206p63J435L480L40j964l90Q95p16k120K17K757J232q67P45
2853B263J945p01k789r09N76j282j913N61J502m46p73J091R69j057j036N31R35
2870e33q33l21J854J226m27L15J708N38k114o65R14k62k111M07J909k8j958j47
2888e28R32j498k924L2J868J46r14J475L057J34k334J84J817q60k385J333K906
2905B441O1j050J356J692j209k632m74Q47j832k390K95J861j40j198J464J697
2921G89j152j678L72N53j849l29J760J980O55R56J791Q96j277j808J53o21j897
2938g06p69J939J023j271J98J379j394k801l56P74j073j225J116J731O75k38Q57
2955a41J839n2j824M81K191n15k457J540K704j109j514J495L19k415j698L63m5
$$ plain form
2972 -838 -1805 -2398 -2613 -774 -312 -2024 -2285 -952 -2495 -3823 -1577 781 -272 319 2990 2792 1859
2989 1859 2526 1985 370 285 837 1164 1948 2144 726 967 1369 -1014 -2442 -1274 -2866 -5452 -3055
3006 -3055 -51 -1598 -2121 939 1690 -392 148 1106 -447 -1377 -1077 -18 2657 4026 2115 2778 4966
3023 4966 2248 -1478 285 83 -4353 -4338 111 291 -1394 231 638 -1167 -1270 -1565 -2776 -1966 -1623
3040 -1623 -2625 85 3694 1814 426 3727 3311 -280 1205 2928 -887 -2496 963 1255 -231
3055 -231 1150 1247 -903 -823 -1029 -2956 -2136 -1200 -3982 -2199 2155 967 -1844 1667 2936 -1924 -1616
3072 -1616 2684 1267 -835 1659 2969 1749 1666 748 -819 474 -152 -3277 -1291 2116 -1602 -3393
3088 -3393 1602 1521 -3757 -2122 1057 -1720 -2931 75 791 144 2065 2037 1284 2969 2150 -1144 468
$$ packed form
2972h38r67n93k15J839M62j712k61J333j543j328K246K358j053N91K671j98r33
2989A859O67n41j615q5N52L27P84J96j418K41M02k383j428J168j592k586K397
3006c055L004j547n23L060P51k082N40R58j553r30L00J059K675J369j911O63K188
3023D966k718l726J763k02m436J5M449J80j685J625M07j805j03k95j211Q10L43
3040a623j002K710L609j880j388L301m16l591J485J723l815j609L459K92j486
3055b31J381R7k150Q0k06j927Q20R36k782J783M354j188k811L511J269m860L08
3072a616M300j417k102K494J310j220q3r18j567J293o26l125J986L407l718j791
3088c393M995q1n278J635L179k777j211L006P16o47J921k8p53J685q19l294J612
$$ plain form
3105 468 1721 -2194 -2307 2704 1427 -1507 2091 2436 -2818 -3008 -363 -2786 -4399 -1234 -844 -1229
3121 -1229 2032 2359 466 1787 1512 -2195 -242 3114 -620 -2133 3044 3427 -387 1856 4225 -630
3137 -630 -2708 -151 -1286 -2921 -1746 -2523 -2993 185 1043 -1255 647 1669 -3278 -2898 2418 1012
3153 1012 -2185 1372 3535 784 2151 4839 1396 -1051 538 -79 -667 1433 289 -2251 -169
3168 -169 499 -2624 -1693 57 -3910 -4618 810 1008 -2435 -69 2062 -968 -740 3111 1942 -295
3184 -295 681 1240 1447 3639 2523 39 1641 2034 -1854 -1612 1603 -2327 -5745 -1331 1378 -1395
3200 -1395 -1236 1008 -1053 -2498 -1197 -1376 -1617 -431 -997 -111 4171 4588 1185 2147 3895 183 -1608
3217 -1608 1774 1164 -2622 -900 2055 671 -36 653 -997 -2416 -1904 -2959 -2966 -1584 -2547 -3274 898
$$ packed form
3105D68J253l915j13N011j277k934L598L45n254j90K645k423j613L165L90l85
3121a229L261L27j893J321k75l707J953L356l734j513N177L83l814K243K369m855
3137f30k078K557j135j635J175p77m70L178Q58k298J902J022m947L80N316j406
3153A012l197L557K163k751J367K688l443k447J589o17n88K100j144k540K082
3168a69O68l123R31J750l967p08N428J98l443K366K131l030K28L851j169k237
3184b95R76N59K07K192j116k484J602L93l888K42L215l930l418M414K709k773
3200a395J59K244k061j445J301j79k41J186n66Q86M282M17l403R62J748l712j791
3217a608L382o10l786J722K955j384p07O89j650j419N12j055pJ382r63p27M172
$$ plain form
3234 898 2810 266 830 3495 1112 -1820 1004 2184 -584 -293 2585 2815 2101 2058 1163 72 -746
3251 -746 -2497 -2603 -514 -1176 -3694 -1225 1628 -980 -2704 103 199 -2316 -1485 940 873 214 949
3268 949 1446 2256 2202 851 533 1907 379 -1242 596 1610 -861 -1250 1042 152 -2256 -1481 -1011
3285 -1011 -2469 -2350 -862 -349 348 529 795 972 932 -495 -728 735 395 -518 1634 3404 1569 524
3303 524 1791 955 -1609 -1995 -880 -1112 -2016 -1286 84 761 -210 -688 282 389 -1633 -2143 -176 466
3321 466 -1174 -389 2520 2706 1423 1615 2271 717 -1186 -1193 -657 -833 -1186 -306 1214 1109 -211 -423
3339 -423 -125 -1393 -2723 -1567 -150 -573 -476 1307 2080 819 586 1503 1165 -238 -557 913 887 -431
3357 -431 -393 929 1180 -953 -1022 420 -300 -2404 -2239 47 -170 -1794 -962 1450 738 -837 -193 1270
$$ packed form
3234H98J912k544N64K665k383k932K824J180k768K91K878K30p14m3q95j091q18
3251g46j751j06K089o62k518K469K853k608j724K807R6k515Q31K425o7o59P35
3268I49M97Q10n4j351l18J374j528j621J838J014k471l89K292q90k408P75M70
3285a011j458J19J488N13O97J81K66J77m0j427k33J463l40r13K152J770j835j045
3303E24J267q36k564l86J115k32r04P30J370O77r71m78R70J07k022n10J967O42
3321D66j640P85K909J86j283J92O56j554j903pN36j76l53Q80J520j05j320k12
3339d23K98j268j330J156J417m23R7J783P73j261k33R17l38j403l19J470k6j318
3357d31L8J322K51k133o9J442p20k104J65K286k17j624Q32K412p12j575O44J463
$$ plain form
3375 1270 571 -896 198 2688 2150 433 1135 2250 700 -1601 -972 340 -583 -1825 -401 1156
3391 1156 253 -1378 -843 -504 -1913 -2701 -1309 -56 -201 -162 1551 2417 1366 557 1668 1589 -204 -709
3409 -709 772 987 -265 144 1929 1506 -155 -269 83 -1468 -3249 -3160 -1554 -1343 -1658 -516 1865
3426 1865 1624 -160 128 1236 -90 -1744 -218 1820 1312 836 2196 3208 1951 189 301 594
3442 594 -668 -2217 -1519 -61 -950 -2068 -359 441 -1092 -1734 -503 -567 -1761 -1495 -14 438 480 1099
3460 1099 1950 2260 1296 754 1266 884 -404 -134 1371 763 -236 385 983 -1337 -2309 -1280 -1056 -2233
3478 -2233 -1694 -132 192 -266 -371 13 549 -546 -1248 113 1759 731 104 2388 3002 789 368
3495 368 1712 689 -1505 -1094 -283 -555 -849 -636 154 598 -52 -1287 -520 -277 -2680 -2685 50 440 -680
$$ packed form
3375A270o99j467J094K490n38j717P02J115j550k301O29J312r23j242J424J557
3391A156r03j631N35L39j409p88J392J253j45L9J713Q66j051q09J111p9j793n05
3409g09J481K15j252M09J785m23j661j14L52j551j781Q9J606K11l15J142K381
3426A865k41j784K88J108j326j654J526K038n08m76J360J012j257j762J12K93
3442E94j262j549O98J458q89j118J709Q00j533o42J231o4j194K66J481M52M2O19
3460A099Q51L10r64n42N12l82j288K70J505o08r99O21N98k320r72J029K24j177
3478b233N39J562L24m58j05L84N36j095p02J361J646j028o27K284O14k213m21
3495C68J344j023k194M11Q11k72k94K13P90M44o50j235P67K43k403nK735L90j120
$$ plain form
3514 -680 1291 3169 1810 629 1580 814 -777 -867 -212 190 492 600 605 1617 753 -1206 -1095 -180 -1912
3533 -1912 -2913 -433 382 -1738 -911 1780 1260 -311 570 846 6 -452 -283 319 1144 736 -331 1478
3551 1478 2814 -243 -1439 521 -310 -2769 -1370 887 -547 -1340 -70 373 -136 -370 -953 -691 496
3568 496 170 -93 1818 2122 -447 -383 1715 864 -938 227 725 -992 -263 1251 266 -977 -780 -1101
3586 -1101 -1258 -348 -944 -1610 -388 -55 -420 1440 2551 6 -858 1247 1057 -949 -56 1122 -22
3603 -22 273 2020 2189 906 -202 -1549 -1581 -858 -1542 -2595 -636 63 -1308 92 2261 556 -2076
3620 -2076 -874 222 -463 -141 722 463 755 2060 2106 2102 1867 -127 -1080 260 -41 -1599 -1178 -23
3638 -23 -1045 -876 1347 514 -1947 -1766 -993 -1817 -1276 -12 -171 -97 912 1409 1987 2080 438 -730 929
$$ packed form
3514f80J971J878j359j181R51p66j591r0O55M02L02J08NJ012q64j959J11R15j732
3533a912j001K480Q15k120Q27K691n20j571Q81K76q40m58J69O02Q25m08j067J809
3551A478J336l057j196J960q31k459J399K257j434p93J270M43n09k34n83K62J187
3568D96l26k63J911L04k569O4K098q51j802J165M98j717P29J514r85j243J97l21
3586a101j57R10n96o66J222L33l65J860J111k545q64K105j90k006Q93J178j144
3603b2K95J747J69j283j108j347l2P23o84j053J959O99j371J400K169j705k632
3620b076J202J096o85L22Q63k59K92J305M6mk35j994r53J340l01j558M21J155
3638b3j022J69K223q33k461J81P73q24N41J264j59P4J009M97N78R3j642j168J659
$$ plain form
3657 929 1569 -18 834 2266 295 -1240 712 1293 -1166 -2200 -1223 -1018 -1202 -1023 -928 -439 -307 -1314
3675 -1314 -884 1225 226 -1776 -167 1919 687 420 2437 2471 435 545 1350 245 -621 -928 -592
3692 -592 340 500 -214 36 446 -1161 -2480 -1099 -1058 -2700 -1810 685 653 -43 1175 2166 557 20
3710 20 371 648 214 -170 383 1564 1888 361 664 1967 407 -1615 -1065 -255 -2347 -2997 -677 402
3728 402 -930 -493 737 901 -293 -1227 -909 -69 -561 -724 934 2584 1448 379 1720 2151 -73
3745 -73 -911 182 -200 -1164 -660 446 418 -583 -668 -307 -340 -931 -1123 -455 -110 -833 -414 1160 772 -324
3765 -324 449 1455 386 -251 508 631 -196 -140 967 952 -69 -669 -351 -206 -1085 -1569 -508 292 -651
3784 -651 -387 1175 933 -830 -1267 42 125 -771 -40 1471 1291 401 766 1368 757 -805 -1088 -317 -349
$$ packed form
3657I29O40j587Q52J432j971j535J952N81k459j034R77K05j84J79R5M89J32j007
3675a314M30K109r99k002J609K086j232k67K017L4k036J10Q05j105q66l07L36
3692e92R32J60p14K50M10j607j319J381M1j642Q90K495l2o96J218R91j609n37
3710B0L51K77m34l84N53J181L24j527L03J303j560k022N50Q10k092o50K320J079
3728D02j332M37J230J64j194r34L18Q40m92j63J658J650j136j069J341M31k224
3745g3q38J093l82r64N04J106k8j001q5L61l3n91j92O68L45p23M19J574l88j096
3765c24P73J006j069o37P59J23q27N6J107j5j021o00L18J45q79m84J061Q00r43
3784f51K64J562k42j763m37J309Q3q96P31J511j80q90L65O02o11j562k83P71l2
$$ plain form
3803 -349 -1262 -543 672 505 -603 2 858 -432 -1382 -742 -230 -870 -980 529 1411 772 856 1939 1511
3822 1511 -68 -744 -144 -17 -1124 -628 1060 1195 -94 -117 576 -154 -1934 -1777 -510 -666 -1705 -589
3840 -589 1357 931 -401 303 1674 755 -703 43 1219 643 -659 388 1731 875 -381 146 949
3857 949 -453 -1765 -1066 115 -996 -1464 -391 608 -402 -1214 -245 366 -815 -1012 282 1250 336
3874 336 601 1859 1542 208 -295 646 632 -704 -287 1199 877 -394 -125 561 -239 -1910 -1677 -423
3892 -423 -962 -1741 -672 844 223 -614 422 1307 332 -820 -158 851 73 -335 1035 2140 1446 464
3910 464 1113 1235 -371 -1684 -1040 -672 -1288 -1362 183 825 12 -486 -101 -238 -1448 -1645 -792 -125 -413
3929 -413 19 1426 1591 1077 896 1306 738 -153 -176 526 28 -502 390 827 213 -382 112 107 -1140 -1708
$$ packed form
3803c49r13P19J215j67j108O05Q56j290r50O40N12o40j10J509Q82o39Q4J083m28
3822A511j579o76O00J27j107M96J688J35j289k3O93p30j780J57J267j56j039J116
3840e89J946m26j332P04J371r19j458P46J176n76j302J047J343q56j256N27Q03
3857I49j402j312O99J181j111m68J073R99j010q12R69O11j181j97J294R68r14
3874C36K65J258l17j334n03R41j4j336M17J486l22j271K69O86q00j671K33J254
3892d23n39p79J069J516o21q37J036Q85r75j152O62J009p78m08J370J105o94r82
3910D64O49J22j606j313O44L68o16p4J545O42q13m98L85j37j210j97Q53O67k88
3929d13M32J407J65n14j81M10n68q91k3P02m98n30Q92M37o14n95M94nj247n68
$$ plain form
3949 -1708 -959 -645 -1421 -997 57 894 -145 -292 714 657 -716 -524 560 907 316 414 1531 1287
3967 1287 -116 -435 302 80 -826 -543 435 411 -545 -384 70 -296 -1199 -1083 -223 -409 -920 -149 854
3986 854 539 60 382 1108 228 -428 46 582 -119 -317 668 1333 799 347 437 386 -1019 -1561 -699 -393
4006 -393 -907 -812 759 1147 85 -144 619 -223 -1463 -1212 154 409 -452 40 1365 1584 283 6
4024 6 648 186 -1152 -971 467 125 -900 -353 896 893 52 -42 285 -485 -1197 -757 269 216 -302 118
4044 118 1047 863 82 95 146 -879 -1083 -114 914 11 -339 514 523 -110 -383 -388 -484 -799 -602 413 852
4065 852 106 -538 188 519 -188 -298 453 -127 -945 10 1355 746 -193 -118 155 -323 -522 -573 -183 -500
4085 -500 -920 -544 931 825 -351 -329 221 -547 -1186 -260 224 -296 143 1300 1616 1205 328 -2 -367
$$ packed form
3949a708P49L14p76M24J054Q37j039j47J006n7j373J92J084L47n91R8J117k44
3967A287j403l19P37k22r06K83R78k4r56J61M54l66r03J16Q60j86n11P71J003
3986H54l15m79L22P26q80o56M74N36p01j98R85O65n34m52R0n1j405n42Q62L06
4006c93n14R5J571L88j062k29P63q42j240K51J366K55q61M92J325K19j301k77
4024FO42m62j338J81J438l42j025N47J249lq41r4L27p70p12M40J026n3n18M20
4044A18R29j84p81J3N1j025k04R69J028r03l50Q53Ro33k73nr6l15J97J015M39
4065H52p46o44P26L31p07j10P51n80q18R55J345o09r39P5K73m78j99n1L90l17
4085e00m20L76J475j06j176K2N50p68o39R26M84n20M39J157L16m11q77l30l65
$$ plain form
4104 -367 -402 -656 -599 114 -157 -434 762 1054 -138 -737 -131 -677 -1499 -779 -37 -542 -514 506 1068 1023
4124 1023 629 284 143 149 -676 -579 678 389 -416 763 1935 630 -656 256 44 -1372 -1511 -411
4142 -411 -182 -424 -218 6 431 17 -941 -555 465 -51 -1170 508 1566 337 -213 1464 1096 -309
4160 -309 173 1010 192 -341 -185 195 321 10 -458 -199 -165 -981 -1425 29 59 -1390 -509 832 289 -473
4180 -473 696 683 -749 -766 372 714 491 617 681 1238 1166 40 -161 554 -932 -2051 -264 1260 -254
4199 -254 -1135 594 614 -767 -567 -60 -923 -1282 -1126 -185 844 641 -143 534 1789 629 -516 680
4217 680 444 -1495 -985 1140 767 -127 689 839 162 -16 -261 -868 -886 -1399 -1125 89 749 -297 -286
4236 -286 794 192 -865 73 454 -998 -754 1078 1066 112 426 818 261 139 330 272 248 -347 -754 63
$$ packed form
4104c67l5k54N7P13k71k77J196K92j192n99O06n46q22P20P42n05K8J020N62m5
4124A023l94l45j41Oq25R7J257k89q05J179J172j305j286R12k12j416j39J100
4142d11K29k42K06K24M25m14r58L86J020n16j119J678J058j229n50J677l68j405
4160c09M82Q37q18n33J56L80J26l11m68K59L4q16m44J454L0j449Q81J341n43p62
4180d73J169j3j432j7J138L42k23J26O4N57p2j126k01P15j486j119J787J524j514
4199b54q81J729K0j381K00N07q63l59J56R41J029k03p84O77J255j160j145J196
4217F80k36j939N10K125l73q94Q16J50o77j78k45o07j8n13K74J214O60j046J1
4236b86J080o02j057R38L81j452K44J832j2r54L14L92n57j22J91n8k4n95m07Q17
$$ plain form
4256 63 877 -67 -692 304 409 -1120 -623 511 -194 -1208 91 871 397 -8 9 20 29 -370 -372 214 591
4277 591 -19 141 1394 612 -779 -337 -33 -857 -974 390 402 -120 97 743 438 1 -411 -383 -301 -717
4297 -717 -597 357 660 -192 24 1158 965 -525 -474 327 -713 -1466 -234 598 143 -107 623 1084 417
4316 417 -561 -562 -76 -593 -1366 -285 1187 665 -155 556 1195 -37 -1143 -207 -127 -776 -829 45 595 83
4336 83 -97 254 582 -51 -831 -154 126 -630 -920 504 762 65 235 948 709 -402 -277 421 -69 -472
4356 -472 -72 653 529 -116 -326 169 -137 -1066 -699 263 -182 -766 108 824 53 -630 -200 504 -239 -586
4376 -586 173 901 464 -12 565 1105 348 -623 -57 364 -476 -961 -87 675 -69 -245 377 497 -514 -702
4396 -702 -494 -471 -877 -635 199 690 293 537 942 708 -96 -276 73 -207 -603 58 917 666 380 390 634
$$ packed form
4256F3Q14r44o25R96J05j529M97J134p05j014J299P80m74m05J7J1Rl99kN86L77
4277E91o10J60J253p82j391M42L04q24j17J364J2n22K17O46l05m37m12K8Q2m16
4297g17J20R54L03q52K16J134j93j490N1Q01j040p53J232Q32m55k50P30M61o67
4316D17r78jM86n17p73J081J472n22q20P11O39j232j106R36Q0o49n3Q74N50n12
4336H3j80L51L28o33p80O77K80p56k90J424K58o97J70P13k39j111J25O98m90m03
4356d72M00P25j24o45k10M95l06r29L67R62m45n84Q74P16p71o83M30P04p43l47
4376e86P59P28m37m76N77N40p57r71N66M21q40m85Q74P62p44j76O22J20j011j88
4396g02K08K3m06K42Q34M91l97K44M05k34q04j80L49k80l96O61Q59k51k86J0K44
$$ plain form
4417 634 -288 -815 -584 -320 -783 -955 -90 443 43 -187 476 430 -410 -757 165 232 -568 -269 634 985 315
4438 315 237 976 675 -298 -353 -43 115 -427 -279 368 501 -285 -348 241 -243 -1000 -739 72 -247 -369 121
4459 121 817 255 -242 -83 313 -310 -309 89 680 420 67 585 855 55 -996 91 143 -801 -765 373
4479 373 276 -285 18 525 285 -596 -728 -58 101 -623 -643 697 1059 31 147 1215 445 -996 -677
4498 -677 311 -310 -828 128 846 671 427 272 404 -1 -959 -1071 169 185 -873 -167 1111 553 -174
4517 -174 630 682 -716 -801 -72 -237 -377 -209 198 352 601 204 -41 478 -129 -1108 -462 321 -575 -504 1103
4538 1103 924 -231 332 685 -313 -555 -145 -148 -334 91 33 277 695 -254 -968 159 180 -1188 -595 718
4558 718 -113 -739 527 679 -394 -331 435 -48 13 389 82 306 857 197 -188 1040 488 -1076 -212
$$ packed form
4417F34r22n27K31K64m63j72Q65N33m00k30O63m6q40l47R22O7q00K99R03L51o70
4438C15p8P39l01r73n5L10J58n42J48O47J33p86o3N89m84p57K61Q11l19j22M90
4459A21O96n62m97J59L96o23JL98N91k60l53N18K70q00j051J087N2r44L6J138
4479C73r7n61L03N07k40q81j32O70J59p24k0J340L62j028J16J068p70j441L19
4498f77R88o21n18R56P18j75k44j55J32m05r58j12J240J6j058P06J278n58p27
4517a74Q04N2j398q5P29j65j40J68M07J54K49l97k45N19o07r79O46P83q96P1J607
4538A103j79j155N63L53r98k42M10lj86M25n8K44M18r49p14J127K1j368N93J313
4558G18q31o26J266J52j073O3P66m83O1L76l07K24N51o60l85J228n52j564Q64
$$ plain form
4577 -212 548 -727 -754 896 272 -714 401 530 -574 -778 -235 -1014 -693 292 261 365 1078 329 -194
4596 -194 1144 716 -942 -569 557 -263 -443 1266 1244 -501 11 633 -393 -676 -460 -1186 -910 -111
4614 -111 -464 -305 874 253 -1219 368 1233 -747 -1078 417 61 -645 862 1505 531 275 737 138
4632 138 175 411 -814 -902 374 -90 -579 981 572 -1550 -986 655 -579 -1334 249 -2 -1029 164
4650 164 1098 182 58 154 -269 224 964 -32 -305 944 374 -589 970 1491 -696 -1198 437 36 -937
4669 -937 -31 106 -653 -261 163 -211 177 -180 -1409 -777 891 105 -664 951 1177 -307 312 1443
4687 1443 -65 -983 -70 115 -224 551 562 -67 294 405 -707 -281 339 -1310 -1509 522 370 -802
4705 -802 453 1037 -180 -141 851 49 -982 -170 -56 -461 522 715 92 697 733 -354 -84 421 -840
$$ packed form
4577b12P60j275k7J650o24r86J115J29j104k04N43p79L21R85l1J04P13p49n23
4596a94J338m28j658L73J126q20j80J709k2j745N12O22j026k83K16p26K76P99
4614a11l53J59J179o21j472J587Q65j980l31J495l56p06J507O43r74k56M62n99
4632A38L7K36j225q8J276m64m89J560m09k122N64J641j234p55J583k51j027J193
4650A64R34r16j24R6m23M93P40r96k73J249n70r63J559N21k187n02J635m01r73
4669i37R06J37p59L92M24l74L88l57j229O32J668p86p69J615K26j484O19J131
4687A443j508r18R13J85l39P75J1o29L61J11j112M26O20j649j99K031j52j172
4705h02J255N84j217L9R92q02j031Q12J14m05R83J93o23O05L6j087K70N05j261
$$ plain form
4724 -840 -1466 169 599 -569 204 1077 -34 -654 231 -16 -499 -311 -195 -280 292 466 -290 235 804
4743 804 -196 -489 746 -177 -1108 -165 580 -480 -179 655 70 -486 1 -229 -646 -7 80 -203 398
4762 398 795 -109 243 796 -107 -783 338 262 -822 54 1181 81 -535 184 99 -735 -687 -424 -383 109
4782 109 33 -157 728 724 -471 -331 814 165 -812 140 750 -185 -50 1051 732 140 -109 27 -104 -401
4802 -401 -853 -864 -145 50 -396 274 853 -14 -887 -60 6 -719 -504 373 427 233 749 786 693 440 104 83
4824 83 256 -193 -542 226 364 -487 -144 555 12 -1049 -714 -100 -737 -861 -417 -5 118 -110 519 767
4844 767 401 -172 -27 598 300 -161 372 1094 384 -229 347 637 -439 -756 -357 -84 -414 -603 -203 -80
4864 -80 -431 -545 -412 -215 -520 -737 25 454 78 166 699 570 140 191 522 239 -204 -122 288 223 -44 167
$$ packed form
4724h40o26J635M30j168P73Q73j111o20Q85k47m83J88J16q5N72J74p56N25N69
4743H04j000k93J235r23r31R43P45j060L01Q34n85n56M87k30m17O39Q7k83O01
4762C98L97r04L52N53r03o76J121p6j084Q76J127j100o16P19q5q34M8K63M1M92
4782A09p6j90Q85mj195J40J145o49r77R52O10r35J35J101l19n92k49J36j31k97
4802d01m52j1P19J95m46O70N79q67q73Q27O6p25K15Q77N4j94N16L7r3k53l36k1
4824H3J73m49l49P68J38q51L43O99n43j061L35O14o37j24M44M12J23k28O29K48
4844G67l66n73J45O25k98m61N33P22p10o13N76K90j076l17L99K73l30j89M00J23
4864h0l51j14J33J97l05k17P62M29l76Q8N33j29m30N1L31k83m43Q2M10o5k67K11
$$ plain form
4886 167 354 -84 -518 -554 -452 -970 -1225 -555 -7 -118 -156 469 690 1 -271 205 338 -287 -166 572 797
4907 797 547 612 781 515 -295 -568 1 -249 -862 -515 -44 160 -366 -123 374 15 -599 -316 -56 -134 -403
4928 -403 1 573 469 176 572 962 304 -435 81 200 -507 -489 191 313 -110 -83 144 129 -548 -699 -224
4949 -224 -120 -435 -266 329 387 -259 -156 391 311 -325 -237 523 518 -117 174 813 232 -365 -316 193 -78 -700
4971 -700 -445 96 112 -561 -17 551 199 -477 -221 346 -143 -622 -5 592 326 296 760 611 1 -219 -115
4992 -115 -162 -246 -655 -156 531 83 -258 144 161 -607 -625 -76 -130 -781 -122 527 308 230 445 682 381 -154
5014 -154 -86 174 231 -192 -221 590 167 -219 -86 441 -451 -921 -371 -430 -675 -553 -90 222 180 -42 216 274
5036 274 183 -175 35 634 323 -108 654 883 127 25 422 31 -462 -43 -116 -534 -261 -437 -394 -179 -296
$$ packed form
4886A67J87m38m34l6J02n18k55O70N48j11l8O25K21o89k72M76J33o25J21P38K25
4907G97k50O5J69k66q10k73N69k50o13L47M71K04n26K43M97l59o14K83K60p8k69
4928d03M04N72j04k93L96L90o58p39N16J19p07J8O80J22m23K7K27j5o77j51M75
4949b24J04l15J69N95N8o46J03N47q0o36Q8P60no35K91O39n81n97M9N09k71o22
4971g00K55N41J6o73N44N68l52o76K56N67m89m79O17N97k66l0M64j49o10k20J04
4992a15m7q4m09M99O87m48l41M02J7p68j8N49n4o51O59O49k19p8K15K37l01n35
5014a54O8K60N7m23k9Q11m23l86J33N27q92m70N50n9k45J22M63L12m2k22K58N8
5036B74r1l58K10N99l11m31P62K29p56j02L97l91m93M19p3m18K73j76M3K15j17
$$ plain form
5057 -296 -547 -361 -194 -571 -479 456 352 -341 500 1074 397 167 710 503 -372 89 580 379 163 150 -37
5078 -37 156 46 -689 -813 -433 -807 -1066 137 502 -592 -346 490 83 -521 4 96 -256 57 326 526
5098 526 973 686 56 480 738 -273 -593 213 -89 -772 -154 597 -145 -663 -100 -180 -738 -511 -448 -603
5118 -603 -364 -226 -180 699 857 191 240 856 85 -578 494 501 -232 91 838 423 -290 -19 -14 -423 -422 -386 -650
5141 -650 -277 -380 -600 91 426 -384 -658 404 304 -653 83 703 236 90 713 509 149 279 -20 -207
5161 -207 114 -38 -608 158 420 -399 -410 311 -282 -973 -418 43 -529 -221 519 203 63 447 220 60
5181 60 68 -91 -153 400 249 -185 -138 721 273 -241 562 -30 -855 -518 150 -375 -474 -41 164 40 110 83 197
5204 197 12 -348 -481 241 444 -176 83 952 528 -19 295 195 -605 -554 -33 -177 -151 39 30 101 108 -47
$$ packed form
5057b96k51J86J67l77R2R35j04o93Q41N74o77k30N43k07q75M61M91k01k16j3j87
5078c7J93j10p35j24L80l74k59J203L65j094K46Q36m07o04N25R2l52L13K69K00
5098E26M47k87o30M24K58j011l20Q06l02o83O18P51p42n18N63q0n58K27O3j55
5118f03K39J38M6Q79J58o66M9O16p71o63J072Pp33L23P47m15p13K71Nm09JL6k64
5141f50L73j03k20O91L35q10k74J062j00r57P36O20m67j46O23k04l60J30k99j87
5161b07L21j52n70P66K62q19j1P21n93o91N55M61n72L08P40l16j40L84k27j60
5181F0Qj59o2N53j51m34M7Q59m48n14Q03n92q25L37O68n25r9M33K05j24P0k7J14
5204A97j85l60j33P22K03o20K59Q69m24n47L14j00q00N1N21j44K6J90rP1Pj55
$$ plain form
5226 -47 -229 -75 -194 -458 -113 502 38 -114 646 435 -36 206 412 -273 -523 67 143 -88 69 -174 -156
5247 -156 167 -255 -340 -29 -79 -735 -152 570 42 -153 320 515 -115 -92 74 278 81 149 462 647 430
5268 430 -110 -156 317 -194 -884 -338 125 -357 -644 217 448 -344 -478 -89 -142 -374 -400 -93 191 12 142
5289 142 473 838 499 -55 276 367 -289 -309 333 186 -484 -92 569 282 -299 -204 -243 -690 -568 -576 -36 24
5311 24 -104 174 605 174 -221 55 493 -8 -110 349 758 91 90 475 584 -48 -366 -4 25 -225 -596
5332 -596 -336 -90 -145 -518 152 114 -345 -564 105 -29 -204 -84 340 407 249 394 543 445 -86 131 209 417
5354 417 28 161 407 227 -167 -100 128 -448 -583 -365 -179 -237 -337 99 173 -162 -173 81 178 -86 -293 233
5376 233 156 248 204 521 633 6 -115 69 -8 -453 -269 43 -44 -69 -28 262 151 -377 -446 -138 -349 -619 -249
$$ packed form
5226d7j82J54j19k64L45O15m64j52P60k11m71K42K06o85k50N90P6k31J57k43J8
5247a56L23m22q5L11n0o56N83P22n28j95M73J95o30K3J66K04j97O8L13J85k17
5268D30n40m6M73n11o90N46M63m82k87Q61K31p92j34L89n3k32k6L07K84j79J30
5289A42L31L65l39n54L31R1o56k0O42j47o70L92O61k87n81R5l9m47J22qN40O0
5311B4j28K78M31m31l95K76M38n01j02M59M09o67jL85J09o32l18L62K9k50l71
5332e96K60K46n5l73O70l8m59k19O69j34j75J20M24O7j58J45J49r8n31K17P8K08
5354D17l89J33K46j80l94O7K28n76j35K18J86n8j00M36P4l35j1K54R7k64k07N26
5376B33p7R2m4L17J12o27j21J84p7m45J84L12q7k5M1K90j11n28o9L08k11k70L70
$$ plain form
5399 -249 121 64 34 379 612 118 -191 136 178 -164 -274 185 341 -106 243 304 243 54 -217 -56 -72 -438
5421 -438 -449 53 139 -179 -208 293 33 -284 -285 108 100 -481 -280 477 155 -104 238 570 126 -285 -214 280 64
5444 64 -184 -27 381 145 -297 -44 281 -142 -337 -362 233 -17 -170 99 387 54 -256 96 47 -285 -268
5465 -268 -24 241 26 -120 278 332 -115 -1 145 -81 -465 -228 171 331 70 94 352 165 -278 -145 -46
5486 -46 -44 -358 -201 247 137 63 296 454 1 -197 -304 40 -255 -491 -87 91 -45 -124 230 297 -47 -261
5508 -261 -143 -50 -209 -237 205 151 193 156 402 325 -185 -368 61 -7 -422 -72 93 158 127 31 86 -141 -259 -442
5532 -442 57 -97 -240 56 155 199 -75 96 401 -131 -207 149 470 63 79 313 251 29 -86 9 41 -449
5554 -449 -601 -65 109 -184 -162 320 185 -263 -248 138 -34 -385 -187 266 273 42 218 456 225 94 -109
$$ packed form
5399b49L70n7l0L45K33m94l09L27M2l42j10M59J56m47L49O1o1j89k71J61j6l66
5421d38j1N02Q6l18k9N01k60l17jL93qn81K01P57l22k59L42L32m44m11P1M94k16
5444F4k48J57M08k36m42K53L25m23j95k5N95k50j53K69K88l33l10L52m9l32J7
5465b68K44K65k15j46L98N4m47J14J46k26l84K37L99J60k61K4K58j87m43J33R9
5486d6Kl14J57M48j10p4K33J58m53j98j07L44k95k36M04J78j36p9L54O7l44k14
5508b61J18R3j59k8M42n4M2l7K46p7n10j83M29o8m15L50J65O5l1r6N5k27j18j83
5532d42M99j54j43K96R9M4k74J71L05n32p6L56L21m07J6K34o2k22j15R5L2m90
5554d49j52N36J74k93K2M82j35m48J5L86j72l51J98M53Pk31J76K38k31j31k03
$$ plain form
5575 -109 -57 33 -377 -80 345 12 -131 235 196 -155 -557 -189 104 -511 -310 -65 196 83 72 47 361 61
5597 61 -108 65 245 -197 -184 221 579 269 94 359 237 -256 -197 93 -158 -274 -248 -81 53 -5 -261 47
5619 47 21 -392 -510 -40 244 -444 -49 488 271 -33 279 132 182 59 -66 126 247 16 138 167 24
5640 24 -161 -179 344 90 -553 -161 -110 -61 -68 126 24 -255 -86 6 -30 -79 27 -54 330 228 102 436 436 0
5664 0 -254 159 231 -263 -11 294 -76 7 259 -53 -178 -192 -106 -401 -12 -214 -224 42 247 -69 147 300
5686 300 29 -371 65 256 29 -215 239 30 54 292 339 -97 -222 -307 -144 49 -19 -83 -11 225 -60 -132
5708 -132 190 -202 -417 -58 252 -137 20 235 143 -72 203 151 42 141 -266 -184 274 256 -257 -4 194 5
5730 5 -287 110 349 -408 -386 148 13 -44 -33 -40 103 -127 -109 -54 55 74 -335 91 405 -86 -256 264 145
$$ packed form
5575a09N2R0m10K97M25l33j43L66l9l51m02L68K93o15K01K45K61j13j1k5L14l00
5597F1j69J73J80m42J3M05L58l10j75K65j22m93N9K90k51j16K6J67J34n8k56L08
5619D7k6m13j18M70K84o88L95N37k17l04L12j47N0j23j25J92J21k31J22K9j43
5640B4j85j8N23k54o43L92N1M9pJ94j02k79J69R2l6m9J06q1L84j02j26L34%m36
5664@k54M13P2m94K52L05l70Q3K52l12j25j4Q6k95L89k02j0K66K05l16K16J53
5686C00k71m00M36J91k27k44M54k09K4K38M7m36j25q5J63J93o8o4P2K36k85p2
5708a32L22l92k15L59L10l89J57K15r2k15K75n2j09R9m07Q2M58j8n13K53J98j89
5730Ek92L97K39p57K2N34j35n7J1pJ43k30J8N5J09J9m09M26L14m91j70N20j19
$$ plain form
5753 145 -371 -149 215 -79 -300 -42 138 206 30 73 197 118 -192 -399 98 75 -241 -58 284 117 -93
5774 -93 110 280 -297 -403 -24 -75 -282 68 44 45 301 -212 -131 153 25 -495 -128 325 99 -302 347 260
5796 260 36 106 251 62 -115 -78 -251 44 147 -108 102 108 89 -146 -8 -32 -372 -361 39 32 -219 82 -6
5819 -6 6 70 83 130 -182 -9 21 165 230 160 117 260 230 -101 -107 43 -328 -269 -150 5 -349 -78 72 -112 -108
5844 -108 -352 -191 -41 -199 -71 266 343 290 181 174 242 -170 -5 279 223 -90 206 291 82 -337 16 -153
5866 -153 -318 -315 -446 -6 -106 -222 -107 121 59 -44 22 182 -348 -173 246 248 257 -56 356 451 -17 5 84 85
5890 85 -201 -125 2 126 -186 -174 59 -27 -251 -170 -71 -139 -491 53 88 97 -68 170 341 125 10 136 249
5913 249 67 -219 -63 187 248 -161 123 215 -40 -204 -61 158 -319 -220 -85 118 5 -25 -4 80 0 -257
$$ packed form
5753A45n16K22L64k94k21K58J80O8j76M3J24p9l10k07M97k3l16J83L42j67k10
5774i3K03J70n77j06L79n1k07L50k4JK56n13Q1K84j28n20L67M53k26m01O49q7
5796B60k24P0J45j89j77L7j73K95J03k55K10Oj9k35J38k4l40J1M00pk51L01q8
5819fJ2O4J3M7l12J73L0J44O5p0m3J43l0l31oJ50l71N9J19J55l54K71J50j84M
5844a08k44J61J50j58J28L37P7n3j09pO8m12J65K84n6l13K96Q5k09m19L53j69
5866a53j65Lj31M40j00j16J15K28o2j03O6J60n30J75M19KRl13M12R5m68K2P9J
5890H5k86P6J27J24l12J2K33q6k24Q1R9o8l52N44L5Rj65K38J71k16j15J26J13
5913B49j82k86J56K50O1m09K84R2k55j64J43K19m77R9J35K03j13l0K1Q4q0k57
$$ plain form
5935 -257 -31 89 47 -66 215 207 145 -60 193 158 -159 -279 36 4 -242 -164 168 44 -168 -130 9 -119 -224
5958 -224 -121 -145 160 -169 49 346 71 -160 5 8 -250 -255 71 23 95 62 18 316 -25 -200 -57 -3 -60 -272
5982 -272 -10 208 -5 90 321 272 -29 -25 137 30 -249 -189 52 96 1 -81 127 79 -305 -185 -226 -62 -159 -119
6006 -119 182 2 143 172 120 78 10 -7 147 -55 -168 132 277 161 -40 225 74 -100 -303 122 114 -300
6028 -300 -229 296 46 -22 -153 0 -21 -257 -93 -3 176 -69 23 253 166 14 26 336 143 -244 258 432
6050 432 -48 -91 143 154 -128 -225 -203 -54 -249 -335 -166 -30 87 -334 96 419 -33 -156 165 159 -311 -42
6072 -42 350 170 -70 449 266 306 245 -101 -143 -7 -193 -184 248 166 -197 -330 251 45 -307 -325 -33 -341 -273
6095 -273 -62 101 -1 -30 143 170 252 145 -268 276 152 -62 -169 499 166 -152 90 -14 -207 -219 144
$$ packed form
5935b57K26J20m2j13K81qo2k05K53l5l17j20L15l2k46P8L32j24k12L8J39j28j05
5958b24J03k4L05l29K18K97k75k31J65Lk58nL26m8P2l3m4K98l41j75J43N4n7k12
5982b72K62K18k13R5K31m9l01MJ62j07k79O0K41M4r5q2K08m8l84J20m1J64r7M0
6006a19L01j80J41K9n2m2o8j7J54k02j13L00J45j16k01K65j51j74k03M25qm14
6028c00P1N25k50o8j31J53k1k36J64R0J79k45R2K30q7j52J2L10j93l87N02J74
6050D32m80m3K34J1k82r7K2J49j95q6J69J36J17m21M30L23m52j23L21om70K69
6072d2L92j80k40N19j83M0o1l46m2J36j86RM32q2l63j33N81k06l52j8K92l08O8
6095b73K11J63j02k9J73K7Q2j07m13N44j24k14j07O68l33l18K42j04j93j2L63
$$ plain form
6116 144 -223 -219 54 -105 13 100 -213 -185 38 -56 -71 -46 394 -50 14 318 166 -175 62 205 -10 91 60
6139 60 15 -217 130 -3 -30 -22 -131 -377 13 -44 -301 69 217 -14 -197 294 243 -78 101 75 -46 -40 138
6162 138 -91 -99 229 -42 -182 146 105 -384 -47 48 -414 -213 201 20 -202 61 285 -155 -165 70 -127 -166
6184 -166 142 -84 -30 -1 192 -120 275 288 -373 154 268 -115 -220 255 138 -303 83 240 -136 -104 -65 -191
6206 -191 -212 -22 -89 -312 383 91 -305 69 265 -243 -198 278 -47 -375 127 120 -145 -58 245 -65 -138 133
6228 133 -272 -13 211 109 -87 382 239 -270 7 147 -120 -258 53 219 -89 44 52 -98 -88 -60 -207
6249 -207 -79 45 -62 -196 292 225 -177 163 188 -183 -367 60 191 -316 84 427 46 151 71 2 81 232
6271 232 -331 -321 178 6 -245 183 182 -266 -247 196 -159 -282 -81 -6 -152 -130 128 37 180 84 -95 3 83
$$ packed form
6116A44l67MK73j59J18Q7l13K8K23r4j5K5M40m44O4L04j52l41K37J43k15J01l1
6139F0m5k32L47j33k7Qj09k46L90n7k57L70J48k31j83M91n1l21J79k6j21OJ78
6162A38k29qL28k71j40L28m1m89L37R5m62K01M14j81k22K63K24m40j0K35j97l9
6184a66L08k26N4K9J93l12L95J3o61N27J14l83j05M75j17m41L86J57l76L2L9j26
6206a91k1J90o7k23O95k92l96L74J96n08M5M76l25l28N02pk65Q7L03l10p3K71
6228A33m05K59K24j02j96M69j43n09K77J40k67j38L11J66l08J33Qj50J0K8j47
6249b07J28J24j07j34M88o7m02L40K5l71j84M27J31n07M00L43l81J05q0o9P9J51
6271B32n63J0M99j72k51M28jm48J9M43l55j23K01P5j46K2K58r1J43r6j79R8Q0
$$ plain form
6294 83 -62 -364 296 201 -104 182 316 -119 -201 -116 0 -274 12 -98 -337 -108 -58 -28 -99 52 -117 -105 199
6317 199 30 -144 208 162 -98 189 225 177 -137 251 242 -46 -52 -20 149 13 28 -143 -114 9 -205 -155 30 -132
6341 -132 -66 77 2 -30 8 229 161 -76 -170 273 32 -38 193 129 245 201 -56 163 115 -198 -282 52 -83 -200
6365 -200 -77 48 -112 -221 -133 -161 -213 -268 -12 8 -88 42 270 139 262 27 -123 129 144 -174 -27 53 -6
6388 -6 -124 0 309 15 -176 -67 -120 -366 -169 -177 4 170 -187 32 122 -57 -112 109 116 -265 -140 76 47
6411 47 5 31 -73 68 -27 -41 102 64 -132 80 39 154 55 54 229 150 -234 1 110 -113 -20 -95 315 36
6435 36 75 65 33 -102 -129 -133 33 127 -264 2 76 65 -80 144 12 56 -107 -39 -100 38 230 76 169 167 109 -6
6461 -6 22 -151 -256 85 9 40 115 296 -18 -83 -139 151 -115 -208 -16 107 61 -155 221 128 -40 -16 -120 4
$$ packed form
6294H3j45l02O60r5l05K86J34m35q2Q5J16k74K86j10k39K29N0L0p1J51j69J2L04
6317A99j69j74L52m6k60K87L6m8l14L88rk88oL2J69j36J5j71K9J23k14N0J85j62
6341a32O6J43p5l2L8K21o8k37r4M43k41p0K31o4J16m4k57K19m8l13q4L34j35j17
6365b00J23J25j60j09Q8k8n2n5K56K0r6J30K28j31J23k35j50K52J5l18J47Q0n9
6388fj18J24L09k94j91J09n3k46J97qJ81J66l57K19R0j79n5K21Pl81J25K16k9
6411D7m2K6j04J41r5j4J43l8j96K12m1J15r9jJ75p9l84K35J09k23R3p5M10k79
6435C6L9j0l2j35k7mJ66R4l91K66P4j1j45K24j32M4j63O8o1J38J92j54R3kn8j15
6461fK8j73j05L41p6L1P5J81l14o5n6K90k66r3J92J23m6k16L76r3j68K4j04J24
$$ plain form
6485 4 106 -148 69 -79 177 8 195 282 -74 -81 62 -222 -268 -263 -142 -201 -44 -94 -51 239 -193 76 33 -92
6509 -92 -267 -4 237 126 -159 204 272 46 -55 240 80 -29 -101 14 87 7 -53 -102 -2 -198 -158 -153 54
6532 54 -299 -186 152 179 -150 -70 38 -53 -115 44 353 11 86 189 227 253 18 -190 10 26 -137 -127 79
6555 79 -1 -331 -21 129 -242 -51 -6 12 -422 -156 -142 103 191 89 23 252 129 11 -110 281 -26 -68 112
6578 112 183 11 29 147 -14 -63 -70 -120 -232 -89 -87 -255 77 -44 -62 13 112 -154 -55 139 -50 -204 25 137
6602 137 180 191 251 -103 64 25 -262 -81 -55 -152 -180 12 85 -258 -179 134 -187 -192 30 24 -19 -141 95 139 -10
6627 -10 169 -72 145 81 100 67 327 27 -47 132 321 -71 -198 88 -172 -221 -91 89 -50 -26 20 53 46 -51
6651 -51 81 -11 103 -104 -139 266 131 -102 313 95 -275 -110 119 -140 -207 -10 120 -156 7 85 -38 97
$$ packed form
6485DJ02k54K17j48K56j69J87Q7l56pJ43k84m6NJ21n9J57n0M3K90m32K69m3j25
6509i2j75K63K41j11k85L63O8k26j01K95j60j09p2J15P3q0o0m9J00j96M0NK07
6532E4l53J13L38K7l29Q0J08r1o2J59L09l42P5J03L8K6k35k08K00J6j63J0K06
6555G9q0l30L10J50l71J91M5J8m34K66J4K45Q8j02o6K29j23j18j21L91l07m2J80
6578A12P1j72J8J18j61m9pn0j12J43Kj68L32j21j8P5R9k66R9J94j89j54K29J12
6602A37M3J1O0l54J67l9k87J81K6r7k8J92P3l43P9L13l21nK22om3j22K36M4j49
6627a0J79k41K17o4J9l3K60l00p4J79J89l92j27K86k60m9J30J80j39K4M6L3pr7
6651e1J32r2J14k07l5M05j35k33M15k18l70J65K29k59o7J97J30k76J63P8j23J35
$$ plain form
6673 97 -77 -45 68 89 40 -192 33 204 -152 129 160 64 -90 33 126 -142 -30 -174 -47 46 -65 -30 -7
6696 -7 -17 -297 -140 123 67 -152 17 296 -41 -85 72 209 -80 -113 139 168 105 -104 181 169 96 -41 18 10
6720 10 -113 -317 -54 74 -151 -129 -59 -36 -145 -80 90 -96 152 68 -19 151 251 174 198 280 -72 5 46 101
6744 101 -102 -57 180 125 -240 28 -189 -146 -147 -72 -326 14 -129 -51 242 36 -29 -6 237 188 -57 167 210 71
6768 71 114 203 89 -44 67 43 -85 -84 -13 -311 -143 -279 -140 -89 98 39 -118 -45 13 -116 -37 -24 220 -156
6792 -156 71 287 111 150 168 142 46 -138 14 75 101 -11 84 -37 -74 -320 -78 10 -181 -183 -75 4 -298 -93
6816 -93 99 192 -5 38 100 135 42 104 73 45 -16 -13 47 -44 -72 45 27 -137 -116 -76 -10 -48 -105 -52 29 -190 -82 -71
6844 -71 113 78 -55 48 75 74 63 -102 245 61 -62 88 28 148 -53 24 -97 22 -206 -66 82 -51 -215
$$ packed form
6673I7j74L2J13K1m9k32K25J71l56K81L1r6j54J23R3k68J12j44J27R3j11L5K3
6696gj0k80J57K63n6k19J69K79l37m4J57J37k89l3K52K9o3k09K85j2p3j37N9q
6720A0j23k04K63J28k25K2P0K3j09O5J70j86K48q4q7J70J00p7K4Q2l52P7M1N5
6744A01k03M5K37n5l65K68k17M3jP5k54L40j43P8K93k06o5K3K43m9k45K24M3j39
6768G1M3Q9j14j33J11k4j28JP1k98J68j36J39N1J87n9j57P3N8j29P9J3K44l76
6792a56K27K16j76L9J8k6r6j84J52O1K6j12R5j21l7k46K42Q8j91kJ08P9l02K05
6816i3J92R3j97M3O2L5r3O2l1k8o1LO0r1k8J17j8j64K1M0O6l8n7N3Q1k19J08J1
6844g1J84l5j33J03K7jj1j65L47j84j23J50o0J20k01P7j21J19k28J40J48j33j64
$$ plain form
6867 -215 -29 -38 -17 -179 -190 36 -36 65 247 154 -67 94 164 -100 48 -53 150 17 38 -85 117 55 -220
6890 -220 -162 113 -86 -114 -53 108 -40 21 88 89 -70 14 73 9 73 -106 -63 73 73 -137 -92 -110 -123 -273 -15 45
6916 45 -40 67 -157 126 -244 -97 155 -233 -83 84 209 204 169 53 55 302 34 178 84 67 -2 -58 -9 19
6940 19 63 -33 -74 -100 -339 17 -127 -59 -164 -45 67 70 -117 -30 223 -74 -2 -164 -39 -59 61 430 39 2
6964 2 -101 12 -69 -233 70 -151 105 -60 -231 -15 -184 -192 -64 87 80 -158 -101 -9 86 -112 -106 10 90 -12
6988 -12 44 225 -55 -16 -11 42 118 -135 -16 11 -7 -90 -145 -9 -266 -277 -50 -184 -202 -105 -52 -47 -75 112 237 106
7014 106 -51 25 25 28 4 144 225 -120 -35 19 67 86 -80 -93 253 -119 -251 -42 13 -121 -190 -24 69 31 -280
7039 -280 172 259 -11 4 -10 87 -1 16 58 153 160 52 187 94 -30 -115 38 73 -22 -152 124 -59 -95 -154 40
$$ packed form
6867b15J86rK1j62j1K26p2J01J82r3k21J61P0k64J48j01K03j33K1j23K02o2k75
6890b20N8K75j99k8O1J61j48O1O7Jj59Q4N9o4O4j79M3J36%k10M5j8j3j50K58O0
6916D5q5J07k24K83l70J47K52l88J50J67J25nl5j16KK47k68J44r4j7o9n6M9K8
6940A9M4r6m1k6k39L56j44O8j05J19J12Lj87Q7K53k97P2j62J25k0J20L69l91l7
6964Bj03J13q1j64L03k21K56j65j71K16j69qJ28J51pk38N7R2R5j98OJ16Q0j02
6988a2N6J81k80L9NN3P6k53J19K7j8q3n5J36k57j1K27j34j8R7N3Nk8J87J25j31
7014A06j57P6%Lk4J40Q1l45Q5N4M8J9j66j3L46l72j32K09N5j34o9J66R3l8l11
7039b80M52Q7k70J5j4R7q8J7M2R5Pj08J35r3j24q5J53L5r5j30K76j83l6n9J94
$$ plain form
7064 40 -79 -55 -59 32 58 -73 -9 106 110 10 55 207 -36 149 88 -25 -83 -196 -109 -7 -89 58 -42 150 -95
7089 -95 -164 4 -29 -88 84 22 45 -139 138 188 31 34 -174 329 6 -59 179 -5 58 -12 54 77 -15 -109 -157 112
7115 112 -23 -49 153 138 -164 -37 -166 -70 94 -56 -2 207 105 10 -3 -13 -141 -240 -46 86 126 -36 20
7138 20 3 -107 -10 -63 24 -114 -16 84 61 -96 -30 -111 124 -106 56 114 67 -65 -14 -44 102 54 129 -67 -79
7163 -79 -111 -15 67 1 -66 -33 67 82 -72 -80 80 -88 -215 55 76 89 -51 179 64 27 -48 -45 181 12 -33 72
7189 72 86 45 -133 140 155 -62 44 0 -29 -130 -5 52 -41 -55 138 33 -12 19 155 154 98 31 -15 -90 60 3
7215 3 -184 37 -50 -200 105 -142 99 -61 105 -25 -167 -112 -45 -5 -80 -51 -171 129 -34 -162 98 88 14
7238 14 41 -73 329 102 157 37 -65 -5 -167 -7 -102 193 30 41 21 -72 -169 -174 -63 -186 -54 44 -150 -30
$$ packed form
7064D0j19K4mR1K6j31O4J15Mj00M5J52k43J85o1j13n8j13Q7J02q2J47j00J92k45
7089i5o9J68l3n9J72o2K3j84K77N0j57Lk08N03l23o5K38j84O3p0O6K3r2r4m8K69
7115A12j35k6K02j5l02J27j29R6J64j50N4K09j02r5j3j0j28r9J94J32M0j62N6
7138B0j7j10R7n3Q7j38R8J00k3j57O6q1K35k30J62N8m7j32N1l0J46m8P5j96j2
7163g9l2R6Q2o6o7L3J00J5j54qJ60j68j27K70K1J3j40K30j15l7p5LK26j69m5J05
7189G2J4m1j78K73J5k17J06m4k9j01J25N7r3j4J93j05m5L1J36jn6o7m6p5J50n7
7215Cj87K21q7j50L05k47K41j60J66j30j42N5O7M0p5K9j20L00j63j28K60j0p4
7238A4K7j14M02k27N5j20j02O0j62J60r5K95j63J1k0r3r7nJ11j23J32R8j94J20
$$ plain form
7262 -30 84 -9 -91 69 244 -110 -112 30 90 17 103 -61 -135 124 -35 9 135 -35 -115 -131 -1 -170 -33 86
7286 86 8 -99 33 47 13 -124 -35 -99 -2 104 -30 88 77 -6 -127 61 74 23 -33 -17 -11 -195 -82 115 90
7311 90 -160 -81 -32 -128 -70 -66 -25 93 35 -117 11 61 -55 -74 106 266 195 62 126 -14 -68 95 -22 32 37 -77
7337 -77 90 -145 -68 -143 -109 229 -43 -145 67 53 -112 -113 97 -69 -121 69 41 179 123 -48 -55 -12 -75 -40 60
7362 60 11 1 88 172 -126 32 122 7 -83 -202 -10 80 35 49 95 124 17 -160 -85 15 77 10 38 69 23 -35
7388 -35 139 -21 -84 24 -124 173 55 -158 106 -12 -25 96 -41 150 -65 -93 96 -121 -34 -126 -24 37
7410 37 -133 96 186 -14 -88 105 0 71 -22 67 127 147 -14 -39 58 160 -118 7 -26 -108 178 30 103 55 -37
7435 -37 -33 108 84 30 -16 -28 -133 -25 -93 -69 -238 95 -40 -61 -95 -117 43 -152 166 136 38 -129 34 -78 30
$$ packed form
7262c0J14r3q2J60J75l54kJ42O0p3Q6j64p4K59j59M4J26j70q0j6J30j69J37J19
7286H6p8j07J32J4l4j37Q9o4R7J06j34J18j1q3j21J88J3n1n6J6Oj84J13J97k5
7311I0k50P9M9r6N8MM1J18n8j52J28N0j16j9J80J60p1j33O4j40n4J63j17N4Nj14
7337g7J67k35P7p5L4L38k72j02K12j4j65jK10j66n2J90k8J38n6j71pM3o3L5J00
7362F0m9j0Q7Q4k98J58R0j15r0j19J92R0m5J4M6K9j07j77P5J00O2o7K8L1m6n8
7388c5J74j60o3J08j48K97j18k13K64j18j3J21j37J91k15k8J89k17Q7r2J02O1
7410C7j70K29R0k00p4J93j05P1r3Q9O0K0j61k5R7J02k78J25l3q2K86j48P3m8r2
7435c7MJ41k4n4m6j2j05J08o8K4j69L33j35k1l4k2J60j95L18l0r8j67J63j12J08
$$ plain form
7460 30 79 52 88 190 37 26 119 44 -25 -149 67 53 26 -168 -70 -9 -69 -76 11 -92 -141 24 75 176 -129 42
7486 42 161 27 95 76 26 -61 -49 -100 69 -16 -20 171 46 -127 109 17 53 -67 -8 27 19 43 -181 112 308 88
7512 88 5 92 4 122 -15 121 144 133 -130 53 103 40 -152 27 70 -112 -71 60 68 -46 -63 -7 149 -95 -65
7537 -65 3 -105 -106 139 60 14 -61 94 149 161 -48 82 85 35 -239 -89 99 24 -142 67 -98 83 3 -67 -53
7562 -53 -35 10 -142 -83 20 -173 -60 -26 -93 -73 -80 35 -108 -13 -81 105 7 152 156 -7 -127 167 28 -21 37
7587 37 75 22 -79 -16 -174 77 2 70 -193 39 48 -29 -118 132 -90 100 184 74 -153 -111 100 -83 40 -74
7611 -74 30 -6 88 -51 141 87 151 -52 65 -3 -116 116 146 18 -83 131 -26 -206 100 13 17 37 -39 -181
7635 -181 -75 239 -56 -8 70 -74 -203 -69 115 -220 -139 -73 -85 64 33 40 160 27 133 -183 272 87 29
$$ packed form
7460C0M9k7L6J02j53j1R3p5o9j24K16j4k7j94R8O1o0pQ7j03m9J65N1J01l05J71
7486D2J19j34O8j9n0q7J2n1J69q5mJ91j25j73K36r2L6j20N9L5qK4k24K93J96k20
7512H8q3Q7q8J18j37J36K3j1k63J83N0o3j92J79M3j82M1J31Qj14j7N6J56k44L0
7537f5O8j08jK45p9m6p5J55N5J2k09J30Ln0k74J50J88p5j66K09j65J81q0p0J4
7562e3J8M5j52N9J03j93J13L4o7K0pJ15j43R5o8J86r8J45Mj63j20K94j39m9N8
7587C7L8n3j01O3j58K51p5O8k63K32Rp7q9K50k22J90Q4j10k27M2K11j83J23j14
7611g4J04l6R4j39J92n4O4k03J17o8j13K32L0j28j01K14j57j80L06q7MK0p6j42
7635a81J06L14k95M8P8j44j29J34J84l35Q1O6j2J49l1PJ20j33J06l16M55j85n8
$$ plain form
7658 29 -28 101 -39 -44 185 -118 -321 52 80 21 -59 167 25 -184 56 34 4 154 15 18 147 236 45 -84
7682 -84 168 139 -142 143 110 -2 40 -30 50 -99 -11 -142 -105 78 -103 -210 -15 -55 -136 17 100 -5 -156 -53
7706 -53 -18 -83 93 166 -25 68 42 0 119 51 118 -139 236 10 -121 -61 257 -266 -303 64 129 -47 90 -62
7730 -62 -11 -30 73 -21 1 2 45 65 -89 -12 -58 71 40 -5 77 93 -91 -45 84 -134 -171 8 24 -218 -206 47
7756 47 56 -47 144 89 -80 114 108 -150 44 50 -148 -4 91 61 -75 150 137 -119 -105 119 -38 -81 -19 17 -116
7781 -116 31 16 -303 92 -57 -13 -9 30 -53 -74 101 128 -87 -20 87 -9 -32 -22 -66 3 45 -104 -96 102 15 -92
7807 -92 34 99 -208 37 109 142 -167 -51 15 -144 -132 -149 -111 -53 89 -85 82 39 130 -43 82 -75 -135 74
7831 74 95 -38 -45 34 82 -76 155 256 -178 -66 2 -55 -53 136 -43 -239 -25 123 -230 -86 170 -16 -163
$$ packed form
7658B9n7J29j40nK29l03k03L73K8n9q0K26j42k09K40k2l0J50j39LJ29Q9j91j29
7682h4K52k9k81K85l3j12M2p0Q0j49Q8j31L7J83j81j07J95m0q1J53Q3j05j51J03
7706e3L5o5J76P3j91R3k6m2J19o8O7k57L75k26j31O0L18n23l7L67O5j76J37j52
7730f2N1j9J03r4K2JM3K0j54P7m6J29l1m5Q2J6j84M6J29k18l7J79J6k42J2K53
7756D7Rj03J91n5j69J94ok58J94Oj98J44R5l0j36K25j3k56J4K24j57m3O2L6j33
7781a16J47j5l19L95j49M4ML9q3k1J75K7k15O7J07r6k3J0m4O9M2j49QJ98q7j07
7807i2J26O5l07K45P2L3l09J16O6j59J2j7L8N8J42j74J67m3R1j73J25j57o0K09
7831G4K1j33pP9M8j58K31J01m34J12O8n7KJ89j79j96K14J48l53J44K56j86j47
$$ plain form
7854 -163 39 -45 -19 -206 -119 60 153 -77 4 105 72 -59 10 177 43 -19 11 -45 -39 74 -49 -213 -152 -37
7878 -37 2 -158 73 -188 -176 -39 76 55 -106 -21 -57 -85 -214 144 40 -2 127 -28 -113 -102 -108 -109 -23 -17 -27 -24 -61
7905 -61 -137 32 -105 106 39 19 -24 10 -138 30 -16 -74 21 -105 -105 45 145 -199 25 -20 33 95 55 78 7 69
7931 69 30 51 107 -96 -81 98 18 -133 -231 213 1 -137 6 -30 83 -51 -121 -119 62 11 26 -127 131 -93
7955 -93 12 -7 -119 -18 67 124 -103 -126 114 231 -124 -151 -40 -80 0 -4 -19 85 14 -110 -54 98 -20 -216
7979 -216 -142 -23 -73 81 -50 79 -142 33 83 63 42 25 66 41 -53 17 61 53 -24 -36 224 144 -66 37 137
8004 137 58 -96 -73 15 31 -27 152 -119 78 66 78 157 -8 -105 -91 127 146 -64 25 71 71 -117 121 -22 19
8029 19 80 116 81 3 -5 70 -6 123 -63 -9 132 58 -68 21 -38 37 -103 -65 122 -53 79 -54 237 10 11 92
$$ packed form
7854a63K02q4K6j87Q7J79R3k30Q1J01l3j31O9J67j34o2L0n6OJ13j23j64O1J15
7878c7L9j60K31k61J2J37J15k1j61Q5l6k8j29L58j04m2J29j55q5J1ojQ6Oj0Ll7
7905f1p6J69j37K11o7k0m3L4j48J68m6n8R5j26%J50J00l44K24m5N3O2m0K3p1O2
7931F9l9K1N6k03J5J79q0j51r8M44k12j38J43l6J13j34p0KJ81n1J5j53K58k24
7955i3J05j9j12J01Q5N7k27k3K40J17l55k7J11m0Q0mj5J04p1j24N6J52j18j96
7979b16P4J19n0J54j31J29k21J75N0k0k1j7M1k5r4P0M4qp7j2K60q0k10J03J00
8004A37p9j54K3Q8J6n8J79k71J97j2J2P9j65r7J4K18J9k10Q9M6%j88K38j43M1
8029A9O1L6l5p8qP5p6J29j86N4J41p4j26Q9n9P5j40L8J87j75J32j33K91k27JQ1
$$ plain form
8055 92 -58 -29 4 -3 -31 -74 -93 17 -76 23 106 21 -39 32 28 -30 -60 85 -18 142 -163 -101 127 -37 -32 -121 86
8082 86 -76 62 -62 165 -13 -62 45 71 -189 85 -114 -133 -98 -119 -91 84 82 -134 -131 73 -89 33 -30 71
8106 71 -25 -117 152 6 164 -32 -111 71 -87 113 71 -27 35 33 37 -13 -20 5 -17 -104 -138 -27 37 -10 -33 67 9
8133 9 100 -116 75 -173 -7 29 -85 151 -36 -238 -33 -51 -87 -141 -25 -51 17 123 140 134 -58 -2 -27 4 -78
8158 -78 24 -8 71 67 -116 15 26 101 87 30 56 -7 100 36 -75 -109 -67 -13 -106 -94 128 -29 15 -6 14 153 -34
8185 -34 60 -68 240 -58 -2 -66
$$ packed form
8055I2j50K9L3pk8m3j9J10r3R9Q3q5o0P1mn8l0J45j03J60l05O2K28j64Nq9K07
8082H6j62J38j24K27j78m9J07K6k60K74j99j9L5k1K8J75kk16LK04j62J22o3J01
8106G1r6r2K69j46J58j96p9J82j58K00m2r8O2kMn0pK5k2q7l4J11O4m7k3J00n8
8133IR1k16J91k48J66L6j14K36j87k02K05j8l6n4J16k6O8J06J7oj92N6k5L1q2
8158g8J02l2P9mj83J31J1P5j4n7K6o3J07o4j11l4M2N4r3J2K22j57M4k1K0J39j87
8185c4R4j28L08k98N6o4
8191f6
$$ Imaginary data points
##PAGE= N=2
##DATA TABLE= (X++(I..I)), XYDATA
$$ plain form
0 0 0 0 0 0 0 0 0 0 0 0 0 -8 8 -8 8 -16 16 -17 24 -24 32 -40 48 -54 64 -73 85 -98 114 -127 149 -166 191
33 191 -215 244 -274 307 -344 383 -427 475 -527 584 -646 713 -788 871 -960 1057 -1163 1282
51 1282 -1414 1558 -1720 1904 -2108 2345 -2617 2938 -3314 3774 -4342 5069 -6035 7385 -9405
66 -9405 12763 -19355 37166 -189751 -543220 -212082 -68003 -49925 216842 512708 509024
77 509024 559304 643655 533080 341198 169051 -104700 -200252 -56592 -78189 -209316 -77005
88 -77005 1292 -175846 -199045 -96066 -297000 -538067 -466901 -362715 -344844 -147958 73545
99 73545 109424 195614 358194 353899 306423 309150 186883 91086 216317 273983 178502 220465
111 220465 260010 49682 -80466 -3626 -117356 -363252 -369984 -301465 -345353 -295381 -174638
$$ packed form
0@%%%%%%%%%%%qJ6j6J6k4L2l3M1m8N6p2Q8j02J18j37J58j83K12k41K76l15L57
33A91m06M59n18N81o51P27q10R02j002J111j230J359j501J659j831K017k220K445
51A282k696K972l278L624m012M453m962N555o252P088q116R411j1104J3420j6790
66i405K2168l2118N6521k26917l53469L31138J44079J8078K66767K95866l684
77E09024N0280Q4351j10575j91882j72147k73751r5552J43660k1597j31127J32311
88g7005P8297j77138k3199J02979k00934k41067P1166J04186J7871J96886K21503
99G3545L5879Q6190J62580m295m7476K727j22267r5797J25231N7666r5481M1963
111B20465L9545k10328j30148P6840j13730k45896o732O8519m3888M9972J20743
$$ plain form
122 -174638 -164481 -151591 -100727 -119317 -67691 74405 58502 17770 211754 353761 261100
133 261100 271488 382375 266868 94247 116789 115643 -6127 -49070 -39865 -78814 -79277 -80759
145 -80759 -169371 -216404 -215048 -303707 -347675 -231631 -166709 -172028 -31046 134351 135471 155177
157 155177 250759 203547 90479 115463 148428 101078 131276 213589 208668 176766 148300 50021
169 50021 -49156 -110777 -228310 -310184 -247405 -214091 -256834 -168611 -24594 -46158 -93994 -16089
181 -16089 17339 -48643 -44866 26094 69357 121674 184830 225521 280941 292434 189929 108403
193 108403 106083 23111 -112128 -112691 -57580 -100046 -124631 -59777 -56668 -134715 -171676 -179132 -197609
206 -197609 -184742 -143962 -90861 -2521 78834 111583 152569 195495 157953 100882 117672 123364
$$ packed form
122a74638J0157J2890N0864j8590N1626J42096j5903m0732J93984J42007r2661
133B61100J0388J10887j15507j72621K2542j146j21770m2943R205l8949m63j482
145h0759q8612m7033J356q8659m3968J16044O4922n319J40982J65397J120J9706
157A55177R5582m7212j13068K4984L2965m7350L0198Q2313m921l1902k8466r8279
169E0021r9177o1621j17533q1874O2779L3314m2743Q8223J44017k1564m7836P7905
181a6089L3428o5982L777P0960M3263N2317O3156M0691N5420J1493j02505q1526
193A08403k320q2972j35239n63N5111m2466k4585O4854L109p8047l6961p456j8477
206a97609J2867M0780N3101Q8340Q1355L2749M0986M2926l7542n7071J6790N692
$$ plain form
218 123364 74918 87492 139728 111810 61642 65984 38085 -61356 -138344 -163320 -185567 -204480
230 -204480 -192751 -148401 -85544 -49605 -50740 -20565 26693 -1327 -51134 -10144 59148 68628
242 68628 91349 181445 241015 214632 174290 151238 98354 5114 -79992 -103709 -82184 -79658
254 -79658 -88862 -53979 -15644 -48798 -112862 -130816 -136165 -174342 -185033 -122156 -40657 18935
266 18935 77242 141221 180891 173680 141683 116059 88501 47691 23950 38160 58980 61823
278 61823 67913 74067 38984 -26015 -77526 -125292 -183907 -215041 -191526 -142479 -101779 -55105
290 -55105 8487 48492 37160 14335 20487 28693 11353 16761 80251 139346 146541 146791 164837
303 164837 146827 71182 1233 -24409 -47318 -91296 -110074 -80991 -52744 -63847 -79722 -67892
$$ packed form
218A23364m8446J2574N2236k7918n0168M342k7899r9441p6988k4976k2247j8913
230b04480J1729M4350O2857L5939j135L0175M7258k8020m9807M0990O9292R480
242F8628K2721R0096N9570k6383m0342k3052n2884r3240q5106k3717K1525K526
254g9658r204L4883L8335l3154o4064j7954n349l8177j0691O2877Q1499N9592
266A8935N8307O3979L9670p211l1997k5624k7558m0810k3741J4210K0820K843
278F1823O090O154l5083o4999n1511m7766n8615l1134K3515M9047M0700M6674
290e5105O3592M0005j1332k2825O152Q206j7340N408O3490N9095P195K50J8046
303A64837j8010p5645o9949k5642k2909m3978j8778K9083K8247j1103j5875J1830
$$ plain form
315 -67892 -66827 -102251 -124160 -98081 -62046 -44846 -10042 58347 110944 121646 123397 127652 108159
328 108159 65577 37225 35483 36746 34778 46048 60272 48385 11607 -26564 -67185 -121266
340 -121266 -161765 -156122 -127142 -106049 -70792 -9567 29741 20795 9682 22979 17483 -14360
352 -14360 -11357 39579 80008 87964 108224 148966 148708 90318 39440 22947 -14098 -83140 -110004
365 -110004 -73853 -51268 -66462 -52262 -7283 -7120 -54748 -80567 -70892 -75247 -95356 -73059 -2291
378 -2291 55372 75398 98747 134704 128330 73146 38646 37528 16990 -10985 3730 36969 37997
391 37997 21031 14815 -1536 -44972 -86385 -102192 -101344 -101241 -93804 -56497 -10747 1272 2610
404 2610 30090 41863 10047 -1299 33356 45376 26368 47963 96744 100816 72101 60388
$$ packed form
315f7892J065l5424k1909K6079L6035J7200L4804O8389N2597J0702J751M255j9493
328A08159m2582k8352j742J263j968J1270J4224j1887l6778l8171m0621n4081
340a21266m0499N643K8980K1093L5257O1225L9308q946j1113J3297n496l1843
352a4360L003N0936M0429P956K0260M0742k58n8390n0878j6493l7045o9042k6864
365a10004L6151K2585j5194J4200M4979J63m7628k5819R675m355k0109K2297P0768
378b291N7663K0026K3349L5957o374n5184l4500j118k0538k7975J4715L3239J028
391C7997j6966o216j6351m3436m1413j5807Q48J03P437L7307M5750J2019J338
404B610K7480J1773l1816j1346L4655J2020j9008K1595M8781M072k8715j1713
$$ plain form
416 60388 52639 15085 -40212 -68486 -53927 -43623 -63590 -57435 -5941 6457 -42859 -60378
428 -60378 -37936 -60844 -97279 -62586 681 23794 39290 79040 108207 100879 68301 34403
440 34403 19925 9691 -14494 -10434 33384 44496 17242 23129 35942 -8803 -60300 -72495
452 -72495 -94414 -125252 -102406 -53145 -30221 -6616 30746 48022 49188 42740 17917 -3044
464 -3044 -8351 -16778 26 62191 94735 73041 79152 103042 54865 -18121 -34118 -51452 -101750
477 -101750 -104817 -50996 -14408 -10837 -13931 -14622 -8494 -15142 -50714 -63371 -32999 -27799 -33619 30755
491 30755 101237 85030 56812 81206 81157 35878 15645 12189 -13737 -27970 -9633 11439 25973
504 25973 18948 -19343 -41626 -40296 -67325 -96070 -76120 -59817 -66098 -21014 49589 49662 19697
$$ packed form
416F0388p749l7554n5297k8274J4559J0304j9967O155N1494J2398m9316j7519
428f0378K2442k2908l6435L4693O3267K3113J5496L9750K9167p328l2578l3898
440C4403j4478j0234k4185M060M3818J1112k7254N887J2813m4745n1497j2195
452g2495k1919l0838K2846M9261K2924K3605L7362J7276J166o448k4823k0961
464c044n307q427J6804O2165L2544k1694O111K3890m8177p2986j5997j7334n0298
477a01750l067N3821L6588L571l094o91O128o648l5572j2657L0372N200n820O4374
491C0755P0482j6207k8218K4394m9m5279k0233l456k5926j4233J8337K1072J4534
504B5973p025l8291k2283J330k7029k8745J9950J6303o281M5084P0603P3k9965
$$ plain form
517 19697 30690 29279 -1993 2899 31365 32534 31010 51353 74782 89486 71148 12477 -24376
530 -24376 -23279 -50853 -83488 -49500 -16692 -49441 -52822 6417 18538 -28688 -47904 -40902 -47957
543 -47957 -46891 -24661 6494 43137 60437 57678 85355 112995 64997 1194 4863 7089 -32920
556 -32920 -28816 19401 21767 1545 16206 20276 -14471 -49725 -79500 -100534 -88043 -63332 -44489
569 -44489 -4209 34174 28699 27966 54603 39774 -3664 4265 24735 4452 11383 59487 68119
582 68119 44925 47600 47784 15041 -17258 -37305 -53602 -54830 -55654 -61928 -34645 2602 -11501
595 -11501 -29422 -2413 -2288 -47384 -47545 -2546 7798 3012 36905 71231 70926 60387 45598
608 45598 26744 15142 -2487 -17876 2718 23862 2426 -11698 9918 3320 -38972 -51952
$$ packed form
517A9697J0993j411l1272M892K8466J169j524K0343K3429J4704j8338n8671l6853
530b4376J097k7574l2635L3988L2808l2749l381N9239J2121m7226j9216P002p055
543d7957J066K2230L1155L6643J7300k759K7677K7640m7998o3803L669K226m0009
556c2920M104M8217K366k0222J4661M070l4747l5254k9775k1034J2491K4711J8843
569d4489M0280L8383n475p33K6637j4829m3438P929K0470k0283O931M8104Q632
582F8119k3194K675J84l2743l2299k0047j6297j228q24o274K7283L7247j4103
595a1501j7921K7009J25m5096j61M4999J0344m786L3893L4326l05j0539j4789
608D5598j8854j1602j7629j5389K0594K1144k1436j4124K1616o598m2292j2980
$$ plain form
620 -51952 -48772 -69689 -71565 -33583 -7169 967 14766 22445 21574 25842 22354 7734 3079 4233
634 4233 6514 32906 63527 55061 38555 45880 30741 -13202 -29874 -31779 -61915 -80895 -49150
647 -49150 -8835 2522 1578 3089 1683 -9317 -31169 -42417 -28282 -19996 -22863 14078 76286
660 76286 87696 57807 51131 51175 17261 -15400 -14652 -13051 -26516 -26935 -4604 20856 22791 -3224
674 -3224 -24421 -25937 -38173 -61758 -57436 -35723 -33702 -24815 19368 54142 48541 38900 37738 22305
688 22305 3181 1209 7011 8441 12043 24782 42849 46480 21666 -8465 -22619 -39718 -63963
701 -63963 -58875 -30341 -25761 -32582 -8392 20202 9388 -13746 -11964 -4516 -12666 -13701 11236
714 11236 40957 45677 36924 46569 62229 42177 2347 -8800 -2554 -20408 -38919 -18859 5481
$$ packed form
620e1952L180k0917j876L7982K6414Q136J3799P679q71M268l488j4620m655J154
634D233K281K6392L0621q466j6506P325j5139m3943j6672j905l0136j8980L1745
647d9150M0315J1357r44J511j406j1000k1852j1248J4135Q286k867L6941O2208
660G6286J1410k9889o676M4l3914l2661P48J601j3465m19K2331K5460J935k6015
674c224k1197j516j2236k3585M322K1713K021Q887M4183L4774n601r641j162j5433
688B2305j9124j972N802J430L602J2739J8067L631k4814l0131j4154j7099k4245
701f3963N088K8534M580o821K4190K8594j0814k3134J782P448q150j035K4937
714A1236K9721M720q753R645J5660k0052l9830j1147O246j7854j8511K0060K4340
$$ plain form
727 5481 -3984 -16774 -7008 -3648 -28275 -53925 -54055 -42635 -36636 -24363 8059 41001 48489 42257
741 42257 45688 41984 15313 -6076 -2291 4710 5935 18949 39958 42175 25634 11740 -2138
754 -2138 -29797 -56357 -62556 -55063 -49942 -41826 -16202 9212 11561 5153 11237 14308 -3828 -19085
768 -19085 -6095 12775 13725 20652 49666 68023 53881 34385 30568 17463 -18378 -42411 -33850
781 -33850 -22633 -28128 -25538 -3636 5747 -13819 -30971 -28198 -30373 -43857 -40484 -13447 9733
794 9733 16994 26893 44433 46301 30508 21838 22952 17289 7034 10385 21911 20154 11149 10883
808 10883 7021 -12400 -30678 -34636 -36743 -46969 -46679 -26691 -10637 -10226 -5409 9552 11237 -5557
822 -5557 -12520 1885 9825 4449 16178 47117 59406 43951 34341 37199 19197 -18130 -32439
$$ packed form
727E481r465j2790R766L360k4627k5650j30J1420N999J2273L2422L2942P488o232
741D2257L431l704k6671k1389L785P001J225J3014K1009K217j6541j3894j3878
754b138k7659k6560o199P493N121Q116K5624K5414K349o408O084L071j8136j5257
768a9085J2990J8870R50O927K9014J8357j4142j9496l817j3105l5841k4033Q561
781c3850J1217n495K590K1902R383j9566j7152K773k175j3484L373K7037K3180
794I733P261R899J7540J868j5793q670J114n663j0255L351J1526j757r005k66
808A0883l862j9421j8278l958k107j0226K90J9988J6054M11M817J4961J685j6794
822e557o963J4405P940n376J1729L0939J2289j5455r610K858j8002l7327j4309
$$ plain form
835 -32439 -19510 -16673 -27041 -17483 7598 9462 -13495 -24510 -20543 -31341 -52167 -47885 -19180
848 -19180 -2052 1765 21114 48664 50707 33317 26933 26765 10532 -8865 -6138 7191 9677
861 9677 9711 21208 28046 14031 -6113 -17634 -30841 -51161 -58907 -44566 -26847 -17639 -2841
874 -2841 20189 26683 12338 3259 6424 517 -12709 -4971 21058 33029 29909 36738 46807 33297
888 33297 4432 -8843 -8314 -19385 -36692 -31333 -10546 -6236 -16070 -12205 16 -8273 -29211
901 -29211 -28624 -13389 -12789 -16522 770 27143 35055 30554 34449 36376 20743 1362 -3086 1862
915 1862 870 -1283 7913 18430 13515 216 -8802 -21304 -40226 -49465 -40484 -28642 -20581 -4672
929 -4672 13703 18885 15796 14615 11051 -644 -10064 -3661 11804 19712 23221 34270 43612 34529
$$ packed form
835c2439J2929K837j0368R558K5081J864k2957j1015L967j0798k0826M282K8705
848a9180J7128L817J9349K7550K043j7390o384j68j6233j9397K727J3329K486
861I677L4J1497O838j4015k0144j1521j3207k0320p746J4341J7719R208J4798
874b841K3030O494j4345r079L165n907j3226P738K6029J1971l120O829J0069j3510
888C3297k8865j3275N29j1071j7307N359K0787M310r834L865J2221q289k0938
901b9211N87J5235O00l733J7292K6373P912m501L895J927j5633j9381m448M948
915A862r92k153R196J0517m915j3299r018j2502j8922r239Q981J1842Q061J5909
929d672J8375N182l089j181l564j1695r420O403J5465P908L509J1049R342r083
$$ plain form
943 34529 15816 7997 -426 -25521 -45277 -37544 -22744 -20833 -17971 -2018 9382 1883 -10496
956 -10496 -12162 -13945 -26191 -32946 -14544 14144 26060 30086 45514 52725 35545 16529 10846
969 10846 1727 -15135 -18826 -5568 4891 5865 3848 1315 -4994 -17569 -30364 -33472 -33514 -37791
983 -37791 -30921 -9276 4669 6567 16175 26421 18501 9529 16044 17500 7047 6533 18521 26266
997 26266 24838 21362 19042 13005 -4477 -24937 -27815 -20939 -29121 -35121 -14746 1647 -10718 -18681
1011 -18681 -6341 -6337 -23390 -23701 -4782 8271 14056 22574 35606 43606 33776 15638 13985 17386
1025 17386 -156 -14650 674 12726 782 -1875 8979 -722 -22490 -27466 -27159 -35517 -39367
1038 -39367 -34246 -22923 -4297 10838 16131 23140 24917 10109 1898 11980 8726 -4520 7157
$$ packed form
943C4529j8713p819q423k5095j9756P733J4800J911K862J5953J1400p499j2379
956a0496j666j783j2246o755J8402K8688J1916M026J5428P211j7180j9016n683
969A0846r119j6862l691J3258J0459R74k017k533o309j2575j2795l108m2m277
983c7791O870K1645J3945J898R608J0246p920q972O515J456j0453n14J1988P745
997B6266j428l476k320o037j7482k0460k878O876q182o000K0375J6393j2365p963
1011a8681J2340Mj7053l11J8919J3053N785Q518J3032Q000r830j8138j653L401
1025A7386j7542j4494J5324J2052j1944k657J0854r701k1768m976L07q358l850
1038c9367N121J1323J8626J5135N293P009J777j4808q211J0082l254j3246J1677
$$ plain form
1051 7157 27128 27201 30046 41976 29397 -1980 -17335 -20198 -29006 -35187 -33842 -27013 -12766 -2493
1065 -2493 -3622 1488 3879 -17798 -32352 -11390 4247 -7133 -3606 22422 31232 27880 38076
1078 38076 41402 22704 3674 -4377 -2923 3545 -2454 -15580 -8407 5923 -1744 -10049 -3395 -17248
1092 -17248 -46163 -41581 -17668 -14234 -12079 4272 11268 11814 21514 23804 11324 2110 -1096 1375
1106 1375 18128 30295 22300 19208 23154 8546 -5371 819 -10109 -40100 -39185 -13734 -9717
1119 -9717 -14094 -2155 1202 -11164 -12588 -5260 -4894 -9131 -16095 -13868 12623 34840 28358 27042
1133 27042 40940 29068 1351 3598 10372 -14407 -29910 -11259 4753 5576 7962 5462 -5405
1146 -5405 -14921 -26777 -34831 -27561 -24387 -30501 -12824 21572 26525 17512 27439 26453 3104 -309
$$ packed form
1051G157J9971P3K845J1930j2579l1377j5355k863q808o181J345O829J4247J0273
1065b493j129N110K391k1677j4554K0962J5637j1380L527K6028Q810l352J0196
1078C8076L326j8698j9030q051J454O468n999j3126P173J4330p667q305O654j3853
1092a7248k8915M582K3913L434K155J6351O996N46R700K290j2480r214l206K471
1106A375J6753J2167p995l092L946j4608j3917O190j0928k9991R15K5451M017
1119i717m377J1939L357j2366j424P328L66m237o964K227K6491K2217o482j316
1133B7042J3898j1872k7717K247O774k4779j5503J8651J6012Q23K386k500j0867
1146e405r516j1856q054P270L174o114J7677L4396M953r013R927r86k3349l413
$$ plain form
1160 -309 12628 5663 -4759 5862 17159 18137 19811 17271 6247 -4388 -17866 -30051 -24775
1173 -24775 -21965 -34791 -28334 588 5803 -6183 5194 16347 -3698 -16958 -884 8279 1870
1186 1870 6811 22945 33391 32181 21314 13503 13360 756 -19512 -14465 2584 -7112 -19708
1199 -19708 -4257 4429 -14647 -24037 -15271 -17399 -25755 -19923 -7262 1729 7573 10594 15690 23319
1213 23319 18916 7573 10887 15202 4698 2652 17227 18570 8451 11574 14662 -1951 -17477
1226 -17477 -19534 -24477 -32695 -29794 -18379 -8318 -2191 -352 3223 6972 -1845 -14924 -9379 2648
1240 2648 -381 2487 25694 38408 28003 24118 29526 18930 -2434 -11607 -9568 -10341 -14869 -14019
1254 -14019 -4216 2540 -4932 -12990 -8916 -10555 -26565 -31029 -17458 -11358 -11884 1727 20056 23818
$$ packed form
1160c09J2937o965j0422J0621J1297R78J674k540j1024j0635j3478j2185N276
1173b4775K810j2826O457K8922N215j1986J1377J1153k0045j3260J6074R163o409
1186A870M941J6134J0446j210j0867p811j43j2604k0268N047J7049r696j2596
1199a9708J5451Q686j9076r390Q766k128q356N832J2661Q991N844L021N096P629
1213B3319m403j1343L314M315j0504k046J4575J343j0119L123L088j6613j5526
1226a7477k057m943q218K901J1415J0061O127J839L575L749q817j3079N545J2027
1240B648l029K868K3207J2714j0405l885N408j0596k1364r173K039p73m528Q50
1254a4019R803O756p472q058M074j639j6010m464J3571O100n26J3611J8329L762
$$ plain form
1268 23818 21673 24017 22113 12376 3857 1903 4360 6767 8062 12837 17159 10810 -991 -6447
1282 -6447 -12601 -26482 -32529 -22906 -16525 -18170 -10585 2900 3284 -4513 -4130 1778 131 -4507 1389
1297 1389 15227 21126 17704 19707 27946 24021 7335 737 4180 -2949 -16125 -13637 -1697 -1629
1311 -1629 -9404 -7280 -1579 -9289 -22873 -25243 -18851 -17328 -17404 -4974 13744 20445 17799 19753 21613
1326 21613 12276 -229 -1412 3730 3587 4671 14561 21309 16266 7938 2699 -5855 -20290 -28341
1340 -28341 -25525 -22762 -21313 -13096 190 6298 3890 3928 6528 1234 -8512 -8072 258 3635 4759
1355 4759 15174 28778 29226 19997 15653 12279 -1105 -16883 -19731 -12967 -11632 -13144 -4420 6280
1369 6280 3429 -7397 -10822 -10020 -15919 -21931 -15279 -1693 5286 8034 15197 23329 21066 11280 7828
$$ packed form
1268B3818k145K344j904r737q519j954K457K407J295M775M322o349j1801n456
1282f447o154j3881o047R623O381j645P585J3485L84p797L83N908j647m638N896
1297A389J3838N899l422K003Q239l925j6686o598L443p129j3176K488J1940O8
1311a629p775K124N701p710j3584k370O392J523p6J2430J8718O701k646J954J860
1326B1613r337j2505j183N142j43J084R890O748n043q328n239q554j4435q051
1340b8341K816K763J449Q217J3286O108k408L8K600n294r746M40Q330L377J124
1355D759J0415J3604M48r229m344l374j3384j5778k848O764J335j512Q724J0700
1369F280k851j0826l425Q02n899o012O652J3586O979K748P163Q132k263r786l452
$$ plain form
1384 7828 8921 4129 -1937 1127 7041 5683 2135 3903 2692 -5348 -12159 -14765 -17672 -19850 -17183
1399 -17183 -11046 -5078 -734 3125 6808 6419 1287 -1225 2529 3105 1875 10470 21462 19905 14604
1414 14604 16193 13010 -1205 -11202 -11172 -11198 -13128 -10922 -4554 1523 43 -7670 -9856 -7488 -13788
1429 -13788 -21583 -13323 -419 517 3315 17427 24245 18336 14626 14338 8383 1487 -2710 -3180 1170
1444 1170 4221 2844 5804 11079 3054 -10099 -12447 -15722 -27139 -27023 -14824 -10518 -7769 5338
1458 5338 13705 10169 7831 6668 1087 -1891 546 3855 11032 17121 14259 15028 21598 13255 -3666
1473 -3666 -4480 -3069 -16982 -21738 -7935 -4235 -13520 -10741 -2423 -3790 -7430 -10265 -11616 -7055 -4377
1488 -4377 -5842 4974 20741 15717 7306 19715 24857 6748 -1000 6476 1804 -5145 4188 11003
$$ packed form
1384G828J093m792o066L064N914j358l548J768j211q040o811k606k907k178K667
1399a7183O137N968M344L859L683l89n132k512L754N76j230Q595J0992j557n301
1414A4604J589l183j4215r997L0k6j930K206O368O077j480p713k186K368o300
1429a3788p795Q260J2904R36K798J4112O818n909l710k88n955o896m197m70M350
1444A170L051j377K960N275q025j3153k348l275j1417J16J2199M306K749J3107
1458E338Q367l536k338j163n581k978K437L309P177O089k862P69O570q343j6921
1473c666q14J411j3913m756J3803L700r285K779Q318j367l640k835j351M561K678
1488d377j465J0816J5767n024q411J2409N142j8109p748P476m672o949R333O815
$$ plain form
1502 11003 6100 899 -5283 -11798 -11609 -15034 -26115 -22653 -9590 -9509 -6044 11704 12398 -3588 -1202
1517 -1202 7806 -584 -3663 7367 8515 5752 17133 25291 20369 15541 7983 -4088 -4929 -5162 -17853
1532 -17853 -19021 -6909 -10203 -13021 6553 12139 -9747 -17016 -6650 -12645 -20068 -8805 -918
1545 -918 -342 10180 21057 24107 27001 17896 -1894 -1894 7290 -3685 -9800 6725 8822 -4129 4737
1560 4737 15540 -1811 -16765 -14304 -18267 -22421 -12970 -9402 -11357 -1640 6215 4330 11519 14691
1574 14691 -1254 -5894 7161 4768 -1183 12696 17412 4484 9355 22109 9245 -6472 -5137
1587 -5137 -9940 -17870 -10896 -4460 -6345 -2597 -2086 -9228 -3696 1611 -13933 -18447 552 3656 -5012
1602 -5012 10212 24070 10143 3203 13793 10804 -358 -61 40 -1558 5126 5070 -462 5739 5171
$$ packed form
1502A1003m903n201o182o515J89l425j1081L462J3063Q1L465J7748O94j5986K386
1517a202R008q390l079J1030J148k763J1381Q158m922m828p558j2071q41k33j2691
1532a7853j168J2112l294k818J9574N586k1886p269J0366n995p423J1263P887
1545i18N76J0522J0877L050K894r105j9790%R184j0975o115J6525K097j2951Q866
1560D737J0803j7351j4954K461l963m154R451L568j955R717P855j885P189L172
1574A4691j5945m640J3055k393n951J3879M716j2928M871J2754j2864j5717J335
1587e137m803p930O974O436j885L748N11p142N532N307j5544m514J8999L104q668
1602e012J5224J3858j3927o940J0590k989j1162K97J01j598O684n6n532O201n68
$$ plain form
1617 5171 -12309 -13878 -2529 -13044 -25046 -10097 -374 -8475 -435 14965 9489 1702 6175
1630 6175 2371 -4985 -902 967 1118 11452 15257 9325 14001 16399 -1567 -11508 -3712 -11294 -23939
1645 -23939 -10444 3154 -5523 -5812 6018 3507 -5240 -4673 -5985 -8661 -4681 -3528 -1286 12638
1659 12638 17431 5715 9582 21945 9576 -5763 1756 2859 -11335 -9544 3948 3120 -2132
1672 -2132 -638 -2173 -4761 -5069 -12279 -16681 -8434 -5904 -9346 3723 15866 6230 -133 9422 7800
1687 7800 -2685 2084 8105 2276 3131 12529 11437 5696 3402 -2843 -8423 -6784 -8896 -11912 -6268
1702 -6268 -4109 -8989 -2747 6774 -1543 -10292 -3045 -1090 -8728 -4009 6780 6414 5727 12701 17012
1717 17012 15424 10310 1335 -3746 -2077 -4923 -9342 -956 6431 -226 -1625 6223 1778 -12451
$$ packed form
1617E171j7480j569J1349j0515j2002J4949R723q101Q040J5400n476p787M473
1630F175l804p356M083J869J51J0334L805n932M676K398j7966r941P796p582j2645
1645b3939J3495J3598q677k89J1830k511q747N67j312k676L980J153K242J3924
1659A2638M793j1716L867J2363j2369j5339P519J103j4194J791J3492q28n252
1672b132J494j535k588l08p210m402Q247K530l442J3069J2143r636o363R555j622
1687G800j0485M769O021n829Q55R398j092n741k294o245n580J639k112l016N644
1702f268K159m880O242R521q317q749P247J955p638M719J0789l66o87O974M311
1717A7012j588n114q975n081J669k846m419Q386P387o657j399P848m445j4229
$$ plain form
1731 -12451 -15832 -13350 -15398 -13171 -4582 2078 6609 9983 9644 10173 9893 2189 -4185 -479 2117
1746 2117 -378 4706 12552 9659 5583 8906 6525 -4532 -10068 -10536 -14210 -15523 -10273 -4228 -271
1761 -271 944 1504 3437 3353 -3899 -8761 -3667 -201 -2597 3099 15298 15717 8779 9430 11258 3822
1777 3822 -5162 -5646 -2593 -2412 -3912 -1950 3059 2207 -5535 -8073 -4197 -6310 -12821 -10091 -1509 -183
1793 -183 -1637 4086 9402 6898 2782 3426 4374 1913 -759 1261 5783 6907 5416 6688 7382 1523
1809 1523 -5501 -7109 -7472 -11319 -11077 -4242 385 -169 1183 4472 1953 -5192 -7290 -4336 -3508 -4026
1825 -4026 1140 9740 12133 8936 8685 10404 4943 -4278 -6094 -2418 -3585 -7010 -2272 4959 4214
1840 4214 -770 40 1962 -3635 -11045 -10734 -5960 -5755 -5608 1053 8998 9582 6336 6647 7210 1444 -4912
$$ packed form
1731a2451l381K482k048K227Q589O660M531L374l39N29k80p704o374L706K596
1746B117k495N084P846k893m076L323k381j1057n536m68l674j313N250O045L957
1761b71J215N60J933q4p252m862N094L466k396N696J2199M19o938O51J828p436
1777C822q984m84L053J81j500J962N009q52p742k538L876k113o511K730Q582J326
1793a83j454N723N316k504m116O44R48k461k672K020M522J124j491J272O94n859
1809A523p024j608l63l847K42O835M627n54J352L289k519p145k098K954Q28n18
1825d026N166Q600K393l197k51J719n461r221j816L676j167l425M738P231p45
1840D214m984Q10J922n597p410L11M774K05J47O661P945N84l246L11N63n766o356
$$ plain form
1857 -4912 -4395 -537 19 504 5160 8584 5525 788 -850 -3297 -8070 -10022 -7267 -4174 -3401 -600
1873 -600 3339 3557 586 -250 1087 -616 -2822 -493 3541 3829 2986 5580 8063 4698 -166 -431
1889 -431 421 -3345 -6987 -3808 693 -1067 -3037 1025 3013 -2716 -7793 -5364 -3068 -5439 -4411
1904 -4411 2620 7961 7063 5404 6980 6246 -114 -4978 -2400 572 -1007 -285 6201 8112 2883 307
1920 307 328 -4645 -10597 -10313 -7368 -6325 -4557 20 4306 5424 4033 3252 2983 -290 -5453 -3917
1936 -3917 1091 752 819 8200 12594 8181 4599 5790 1180 -8048 -10621 -7498 -5330 -5094 -3236 2270
1952 2270 5947 2004 -3458 -2175 -1964 -9335 -11135 -1103 4490 754 3548 11559 10530 4425 3605
1967 3605 3909 499 -3335 -3622 300 3531 1273 -1374 2322 3619 -3747 -6534 -2992 -6232 -11692
$$ packed form
1857d912N17L858N56M85M656L424l059m737j638k447m773j952K755L093P73K801
1873f00L939K18k971q36J337j703k206K329M034K88q43K594K483l365m864k65
1889d31Q52l766l642L179M501j760j970M062J988n729n077K429K296k371J028
1904d411P031N341q98j659J576p34o360m864K578K972j579P22O486J911n229k576
1920C07K1m973n952K84K945J043J768M577M286J118j391p81k69l273n163J536
1936c917N008l39O7P381M394m413l582J191m610r228k573L123K168K36J858N506
1952B270L677l943n462J283K11p371j800J0032N593l736K794Q011j029o105q20
1967C605L04l410l834k87L922L231k258k647L696J297p366k787L542l240n460
$$ plain form
1982 -11692 -6379 579 -459 -324 4198 4278 1371 1013 449 -940 -418 288 3192 8922 9121 4159 4152
1999 4152 5034 -2676 -7315 -2398 -2480 -8224 -4346 3925 2317 -1529 -802 -1845 -5026 -6530 -6601 -3939
2015 -3939 364 248 -8 7972 12145 4438 1602 6773 2342 -6113 -2994 1867 -1388 -1311 4451 6019
2031 6019 3952 2529 -2319 -5918 -5922 -9031 -11110 -4420 100 -2064 2700 9429 4680 -895 1940 285
2047 285 -6392 -3404 2540 1307 2433 7944 7353 4112 3924 836 -2589 -2498 -4780 -8069 -3248 756
2063 756 -3578 -1456 5753 1417 -5761 -862 2133 -4805 -5788 71 1428 1524 5028 5941 5161 4400 -289
2080 -289 -2774 1796 1098 -5513 -2013 5809 2068 -1948 2265 857 -7684 -7502 -1878 -2174 -2177 345 646
2097 646 1837 4760 2480 -186 1020 -2007 -4927 1212 6677 1780 747 6387 4400 -738 2051
$$ packed form
1982a1692N313O958j038J35M522Q0k907l58n64j389N22P06K904N730J99m962p
1999D152Q82p710m639M917q2n744L878Q271j608l846P27j043l181j504p1K662
2015c939M303j16k56P980M173p707k836N171m431q455L119M861l255P7N762J568
2031F019k067j423m848l599ml109k079O690M520k164M764O729m749n575K835j655
2047B85o677K988N944j233J126N511n91l241j88l088l425R1k282l289M821M004
2063G56m334K122P209m336p178M899K995o938r83N859J357R6L504R13p80p61m689
2080b89k485M570o98o611L500P822l741m016M213j408q541J82N624k96lK522L01
2097F46J191K923k280k666J206l027k920O139N465m897j033N640j987n138K789
$$ plain form
2112 2051 1884 -6769 -9297 -4220 -2251 -1688 302 595 1564 3393 715 -1723 -323 -4363 -10357 -3619
2128 -3619 7086 5349 2304 8354 9500 2556 1110 2648 -2321 -7733 -6990 -2873 2545 4563 647
2143 647 -730 2350 -658 -6001 -3743 -2060 -8748 -8966 1078 5371 2635 3908 5847 3638 2819
2158 2819 3011 650 -1357 -2142 -2295 1731 6873 5028 834 1920 744 -4994 -4833 -2509 -7251 -9356
2174 -9356 -2175 2648 998 1016 1784 -1083 -3239 -1838 -34 1533 1623 645 4304 9345 6587 1311
2190 1311 2482 2743 -2983 -3983 1555 1308 -3864 -2520 2001 1028 -2111 -3650 -4204 -5039 -6110 -5907
2206 -5907 -2049 1173 240 945 6403 7601 2570 451 1797 -1011 -3185 951 4521 3985 4141 5992
2222 5992 5094 1522 -2115 -4784 -6501 -7616 -7386 -3948 -207 -42 -888 2625 2908 -2044 -3825 -1089
$$ packed form
2112B051j67q653k528N077J969N63J990K93R69J829k678k438J400m040n994O738
2128c619J0705j737l045O050J146o944j446J538m969n412P43M117N418K018l916
2143F47j377L080l008n343K258J683o688k18J0044M293k736J273J939k209q19
2158B819J92k361k007p85j53M026N142j845m194J086j176n738J61K324m742k105
2174i356P181M823j650J8P68k867k156J401J804J567R0r78L659N041k758n276
2190A311J171K61n726j000N538k47n172J344M521r73l139j539n54q35j071K03
2206e907L858L222r33P05N458J198n031k119J346k808k174M136L570n36J56J851
2222E992q98l572l637k669j717j115K30L438L741J65q46L513K83m952j781K736
$$ plain form
2238 -1089 -1820 -4229 -1387 4666 5589 3880 5880 8514 6246 1058 -1248 8 -1700 -5818 -4287
2253 -4287 1445 2008 -1800 -251 2870 -988 -7178 -6494 -3455 -4454 -5649 -1302 4105 3998 2015 3241
2269 3241 4917 2015 -1517 153 3396 2176 408 3458 5289 1580 -1098 385 -192 -4130 -4955
2284 -4955 -2480 -1596 -3552 -2827 106 244 -2408 -2332 251 -215 -3218 -1719 2909 3546 1612 3960 7300
2301 7300 4776 -148 202 1691 -1380 -4507 -1683 2870 2265 -569 1093 2452 -1915 -6798 -6159 -3230
2317 -3230 -4544 -5652 -464 4626 3654 1762 3692 4613 505 -2681 -771 990 -551 -417 3053 5301
2333 5301 3641 2127 2900 1599 -3165 -5428 -4399 -4492 -5585 -3544 862 1841 804 1865 2687 -264
2349 -264 -3570 -2570 -960 -1234 -640 3473 6751 5180 3201 3905 3026 -1357 -4298 -2109 -606 -2505
$$ packed form
2238a089p31k409K842O053R23j709K000K634k268n188k306J256j708m118J531
2253d287N732N63l808J549L121l858o190O84L039r99j195M347N407j07j983J226
2269C241J676k902l532J670L243j220j768L050J831l709k678J483n77l938q25
2284d955K475Q84j956P25K933J38k652P6K583m66l003J499M628O37j934K348L340
2301G300k524m924L50J489l071l127K824M553o05k834J662J359m367m883O39K929
2317c230j314j108N188N090r72j892J930R21m108l186J910J761j541J34L470K248
2333E301j660j514P73j301m764k263J029r3j093K041M406R79j037J061Q22k951
2349b64l306J000J610k74N94M113L278j571j979P04q79m383k941K189J503j899
$$ plain form
2365 -2505 -2472 891 2073 -1286 -3146 -1279 -955 -4562 -4933 -1175 810 -760 48 3751 4819 2261
2381 2261 1262 3119 2481 -752 -624 1922 2578 1270 1579 3330 1518 -2352 -3509 -3079 -4851 -6064
2397 -6064 -3741 -238 -60 -104 1764 1966 -1067 -3008 -1536 -430 -1405 56 4375 6557 4736 4283
2413 4283 5764 3927 -1159 -3127 -984 -1430 -4138 -3111 978 1474 -1158 -1466 745 -1309 -5842 -6666
2429 -6666 -3562 -2698 -3900 -1037 4500 5782 4078 4540 6040 3281 -1323 -1869 709 848 -29 1940
2445 1940 4719 4287 997 -468 -677 -3785 -7044 -6361 -3770 -3628 -3624 -722 1330 326 -321 946 1063
2462 1063 -675 -838 1276 2425 2212 2968 5071 5518 3180 2140 2653 1271 -2209 -3223 -846 -1098
2478 -1098 -3388 -2086 370 -1301 -4463 -4167 -2862 -3668 -4413 -2036 1205 2504 1712 2136 4124 3427
$$ packed form
2365b505L3L363J182l359j860J867L24l607l71L758J985j570Q08L703J068k558
2381B261r99J857o38l233J28K546O56j308L09J751j812l870j157M30j772j213
2397f064K323L503J78m4J868K02l033j941J472J106r75J461M319K182j821m53
2413D283J481j837n086j968K143m46k708J027M089M96k632l08K211k054m533q24
2429f666L104Q64j202K863N537J282j704M62J500k759m604n46K578J39q77J969
2445A940K779m32l290j465k09l108l259O83K591J42MK902K052j004o47J267J17
2462A063j738j63K114J149k13P56K103M47k338j040N13j382l480j014K377k52
2478a098k290J302K456j671l162K96J305q06p45K377L241J299p92M24J988o97
$$ plain form
2494 3427 96 -274 2795 2712 1259 3260 5415 3368 597 624 -134 -2635 -4541 -4910 -4078 -2910 -2511
2511 -2511 -1558 87 -36 -1819 -956 151 -1754 -3066 -904 535 697 3848 6992 5764 3872 4200
2527 4200 3152 457 -1733 -2666 -2725 -1901 -1081 783 2607 1277 -2852 -3487 -1684 -4061 -6910 -4176
2543 -4176 -1299 -1690 120 4712 5287 2305 930 1768 2578 1993 -4 -453 1849 1978 886 3254 4689
2560 4689 -192 -4083 -1712 -769 -4132 -4800 -2988 -3025 -2576 380 2094 855 -865 -2492 -1577 1265
2576 1265 1272 16 2418 4267 2781 3533 5948 1901 -3496 -2000 538 -606 -997 854 -345 -2101
2592 -2101 -1493 -567 -998 -2898 -6143 -5331 -51 1266 -886 1754 4528 1243 85 4726 4659 -1532
2608 -1532 -2997 497 1749 1424 2315 2872 2687 1417 -1262 -1400 -1061 -5510 -8979 -4402 463 -976
$$ packed form
2494C427l331l70L069q3j453K001K155k047k771K7p58k501j906l69Q32J168L99
2511b511R53J645j23j783Q63J107j905j312K162J439J62L151L144j228j892L28
2527D200j048k695k190r33n9Q24Q20J864J824j330m129o35J803k377k849K734
2543d176K877l91J810M592N75k982j375Q38Q10n85j997m49K302J29j092K368J435
2560D689m881l891K371R43l363o68J812l7M49K956J714j239j720j627R15K842
2576A265Pj256K402J849j486P52K415m047n397J496K538j144l91J851j199j756
2592b101O08R26m31j900l245Q12N280J317k152K640K774l285j158M641o7o191
2608a532j465L494J252l25Q91N57j85j270k679j38L39m449l469M577M865j439
$$ plain form
2624 -976 -687 3348 2576 -1404 -23 1780 -1111 -2738 -1022 992 3666 5075 4280 3967 4130 1077
2640 1077 -1034 791 -956 -5750 -4455 -261 -1867 -2900 1081 1128 -2788 -2512 -467 -2232 -3810 -2781
2656 -2781 -1171 1388 3214 3033 4379 6036 2876 -525 2207 3236 -1851 -2069 3071 2470 -1337 58
2672 58 1369 -2131 -4364 -3842 -3463 -2958 -2848 -2911 -732 1263 -711 -1455 1940 1989 -1253 686 3981 2138
2690 2138 1417 4786 5259 2055 1711 2316 348 -1355 -1649 -2420 -2312 -1824 -2250 -756 903 -2264 -4596
2707 -4596 -1976 -2056 -5537 -4139 891 959 13 4256 6869 4111 1608 2067 1975 815 -459 -149 2268
2724 2268 2995 587 727 3751 554 -5301 -4424 -1714 -4916 -6922 -2925 -789 -2285 -1265 2072 2690
2740 2690 861 -450 -223 1188 835 -325 1721 4909 3465 2473 5281 4993 -376 -1967 -239 -1730
$$ packed form
2624i76K89M035p72l980J381J803k891j627J716K014K674J409p95l13J63l053
2640A077k111J825j747m794J295M194j606j033L981M7l916K76K045j765j578J029
2656b781J610K559J826j81J346J657l160l401K732J029n087k18N140o01l807J395
2672E8J311l500k233N22L79N05J10o3K179J995j974p44L395M9l242J939L295j843
2690B138p21L369M73l204l44O05j968j703k94p71J08M88m26J494J659l167k332
2707d596K620q0l481J398N030O8r46M243K613k758k503M59r2j160j274L10K417
2724B268P27k408J40L024l197n855Q77K710l202k006L997K136j496J020L337O18
2740B690j829j311K27J411l53j160K046L188j444r92K808k88n369j591J728j491
$$ plain form
2756 -1730 -4231 -2476 -395 -1539 -1988 -1119 -536 -1845 -3746 -3931 -1298 -155 -1323 420 3931 3025
2772 3025 463 2585 4800 1593 -802 1777 3364 1008 -18 1598 2046 -123 -2029 -1429 -761 -3069
2788 -3069 -5553 -3542 -284 -1654 -2498 804 2389 -475 -1434 674 578 -1640 -855 2185 3662 3499
2804 3499 3678 4253 3247 776 -1183 -1110 -1653 -3473 -2755 25 445 -911 28 846 -1477 -3401 -2563
2821 -2563 -1816 -3138 -2687 161 2111 2207 2586 4088 4346 1738 116 555 431 -1932 -2034 1047 2362
2838 2362 644 559 2179 819 -2740 -4106 -3023 -3122 -4212 -2945 310 1713 1032 1099 2510 1806 -669
2855 -669 -571 1183 1234 92 1342 3327 2642 765 1086 1316 -656 -2151 -1707 -1193 -2203 -2845 -1321 -209
2873 -209 -1156 -1428 -413 188 -1524 -1689 397 1169 378 1321 3726 3570 1585 1118 2345 991 -1374
$$ packed form
2756a730k501J755K081j144m49Q69N83j309j901j85K633J143j168J743L511r06
2772C025k562K122K215l207k395K579J587k356j026J616M48k169j906O00O68k308
2788c069k484K011L258j370q44L302J585k864r59K108r6k218P85L040J477j63
2804C499J79N75j006k471j959P3n43j820P18K780M20j356R39Q18k323j924Q38
2821b563P47j322M51K848J950R6L79J502K58k608j622M39j24k363j02L081J315
2838B362j718q5J620j360l559j366J083r9j090J267L255J403o81O7J411p04k475
2855f69R8J754N1j142J250J985o85j877L21K30j972j495M44N14j010o42J524J112
2873b09r47k72J015O01j712j65K086P72p91R43K405j56j985m67J227j354k365
$$ plain form
2890 -1374 -950 1060 1219 -316 -408 1149 -18 -3482 -3720 -2069 -2728 -4248 -2491 868 1288 -325 918
2907 918 2732 1349 -647 -46 1391 1295 95 1193 3867 3447 1746 1972 2379 177 -2592 -2835 -2027
2924 -2027 -3574 -3968 -1822 -89 -156 -417 48 -178 -1579 -2818 -1809 -529 -727 366 3344 4630 3456
2941 3456 2708 3712 2368 -301 -472 825 -263 -1438 -363 878 116 -1341 -1698 -1179 -1971 -3849
2957 -3849 -3621 -1313 -1153 -2984 -1138 2173 1644 21 1625 2885 1078 151 1696 2588 2092 1685 1824
2974 1824 2573 2164 -365 -1655 -765 -1976 -3724 -1657 205 -1380 -2381 -560 -934 -2873 -2263 -1525
2990 -1525 -2037 -1034 1137 1955 2813 3206 2228 2014 2694 1114 -376 1304 885 -1480 629 3314 947
3007 947 -1480 414 -117 -3247 -3494 -2468 -3517 -3934 -2301 -553 1550 2492 530 281 2453 659
$$ packed form
2890a374M24K010J59j535r2J557j167l464k38J651o59j520J757L359M20j613J243
2907I18J814j383j996O01J437r6j200J098K674m20j701K26M07k202k769k43Q08
2924b027j547l94K146J733o7k61M65k26j401j239J009J280j98J093K978J286j174
2941C456p48J004j344k669j71J297j088j175J075J241p62j457l57N19p92j878
2957c849K28K308J60j831J846L311n29j623J604J260j807r27J545Q92m96m07J39
2974A824P49m09k529j290Q90j211j748K067J862j585j001J821l74j939O10P38
2990a525n12J003K171Q18Q58L93r78k14O80j580j490J680m19k365K109K685k367
3007I47k427J894n31l130k47J026j049m17J633J748K103R42j962k49K172j794
$$ plain form
3023 659 -2408 47 2165 -404 83 5004 4993 1564 1665 1720 -1078 -2153 -1911 -2966 -2349 -1383 -2064 -534
3041 -534 2043 -214 -2993 -147 577 -3177 -1736 1507 -768 -1652 2835 4187 1808 2205 2932 349
3057 349 -29 614 -913 -443 612 -1313 -832 2631 820 -3780 -1304 282 -3830 -4223 958 678 -2240
3074 -2240 403 2393 578 304 416 -396 1154 1854 -179 1135 4428 1343 -1880 1976 2484 -3142
3090 -3142 -2800 1118 -1324 -3561 -258 699 -1213 -217 157 -1302 -419 -192 -2442 -1041 2006 -296
3106 -296 -555 4662 4383 -10 2029 3282 -1995 -2772 1093 -248 -2360 471 1551 -435 742 860
3122 860 -2402 -2431 -1608 -4160 -2629 1750 -419 -2235 2768 4185 -231 1124 3899 -24 -2288 1341
3138 1341 1936 -189 898 1257 113 2234 2271 -1501 -1529 -393 -4243 -4613 784 229 -4007 -931 2407
$$ packed form
3023F59l067K455K118k569M87M921j1l429J01N5k798j075K42j055O17R66o81J530
3041e34K577k257k779K846P24l754J441L243k275q84M487J352k379L97P27k583
3057C49l78O43j527M70J055j925M81L463j811m600K476J586m112l93N181k80k918
3074b240K643J990j815k74J12q12J550P00k033J314L293l085l223L856N08n626
3090c142L42L918k442k237L303R57j912R96L74j459Q83K27k250J401L047k302
3106b96k59N217k79m393K039J253n277p77L865j341k112K831J080j986J177J18
3122H60l262k9Q23k552J531M379k169j816N003J417m416J355K775l923k264L629
3138A341N95k125J087L59j144K121L7l772k8J136l850l70N397n55m236L076L338
$$ plain form
3155 2407 -683 -634 2096 -244 -2692 335 1848 929 3009 2867 294 1781 3040 -109 -391 1525
3171 1525 -1468 -2965 1495 2015 -3113 -2303 219 -2775 -3561 49 -395 -3507 -1595 523 649 2216
3187 2216 1970 -557 910 2658 31 -1 3644 1534 -2013 2347 5390 1145 -644 905 -1196 -3677
3203 -3677 -2240 -1772 -2484 -1489 -1388 -1269 1773 1868 -2463 -2361 571 -1230 -2747 1643 2843 -115 1651
3220 1651 5204 3537 1644 2001 811 -1071 -359 -470 -924 -210 -431 -1568 740 1867 -1838 -3024
3236 -3024 -654 -2362 -4827 -1826 815 -1294 -1010 2701 3076 1460 1570 987 411 563 35 312 2595
3253 2595 2379 -255 890 3122 -207 -3257 -902 -354 -3304 -2771 -98 -681 -1754 -1167 -334 -127 -21
3270 -21 -971 -768 1041 737 -428 1646 3301 1181 407 2487 1754 -839 -466 558 -620 -891 448
$$ packed form
3155B407l090M9K730k340k448L027J513r19K080j42k573J487J259l149k82J916
3171A525k993j497M460N20n128Q10K522k994p86L610m44l112J912K118J26J567
3187B216k46k527J467J748k627l2L645k110l547M360L043m245j789J549k101k481
3203c677J437M68p12R95J01J19L042R5m331J02K932j801j517M390J200k958J766
3220A651L553j667j893L57j190j882P12j11m54P14k21j137K308J127l705j186
3236c024K370j708k465L001K641k109K84L711L75j616J10n83n76J52n28K77K283
3253B595k16k634J145K232l329l050K355N48k950N33K673n83j073N87Q33K07J06
3270b1r50K03J809l04j165K074J655k120p74K080p33k593L73J024j178k71J339
$$ plain form
3287 448 305 -324 -464 -1012 -1707 -1742 -2425 -2378 -378 229 -594 1229 2798 966 -631 1028 962 -1015 -1050
3306 -1050 1394 1527 492 1238 2298 1552 145 -1111 -860 -847 -2546 -2981 -688 178 -1179 -536 1766
3323 1766 1558 -614 -631 419 -486 -1814 -635 1055 1435 1363 1904 2735 1900 -216 -805 -419 -1137 -2086
3341 -2086 -1055 489 -133 -641 362 575 -918 -1579 -571 -490 -1249 -984 863 1494 475 420 1732 1805
3359 1805 378 -148 1199 922 -1101 -818 1154 652 -1291 -742 763 -345 -2367 -1849 -174 -817 -1789
3376 -1789 -714 1540 1249 -680 -223 1326 380 -1153 -78 2436 1771 518 1774 2681 853 -1217
3392 -1217 -720 -378 -1582 -2263 -745 152 -365 -986 -76 174 -990 -2099 -960 -569 -1468 -1261 1019 1858
3410 1858 1092 1535 2950 2408 587 192 695 -288 -1384 -793 833 1122 -39 255 1128 -124 -2662
$$ packed form
3287D48j43o29j40n48o95l5o83M7K000O07q23J823J569j832j597J659o6j977l5
3306a050K444J33j035P46J060p46j407j256K51J3j699m35K293Q66j357O43K302
3323A766k08k172j7J050r05j328J179J690L80p2N41Q31q35k116n89L86p18r49
3341b086J031J544o22n08J003K13j493o61J008Q1p59K65J847O31j019n5J312P3
3359A805j427n26J347k77k023K83J972n02j943N49J505j108k022N18J675o43r72
3376a789J075K254k91j929M57J549r46j533J075K514o65j253J256R07j828k070
3392a217M97L42j204o81J518Q97n17o21R10K50j164j109J139L91q99K07K280Q39
3410A858p66M43J415n42j821l95N03r83j096N91J626K89j161K94Q73j252k538
$$ plain form
3427 -2662 -2743 -1449 -2266 -3284 -1204 1230 629 -41 1263 2064 639 -727 34 1400 672 -44 1105
3444 1105 2631 1764 345 1228 1695 -463 -1791 -825 -715 -2119 -2197 -676 -573 -885 -663 -238 -384 -921
3462 -921 -1243 -169 121 -200 526 2183 2102 901 1420 2017 433 -847 591 1324 20 -28 988 498
3480 498 -732 -1283 -1344 -1359 -2042 -2367 -1120 627 -117 -1043 859 1450 -612 -903 1055 849 -778 84
3498 84 1776 1772 1182 1507 1868 1511 279 -1225 -1018 -691 -2080 -2336 312 744 -842 -41 1274 -509
3516 -509 -2062 -1067 -885 -1702 -843 913 1398 1823 1746 1607 1584 1107 -824 -760 694 -492 -1574 759 1584
3535 1584 -866 -822 1322 424 -1869 -1472 -548 -1345 -1574 -673 183 1176 776 -71 1339 2416 -164 -1663
3553 -1663 876 1085 -1165 156 2426 641 -932 188 544 -700 -1288 -1423 -1166 -227 -24 -826 266
$$ packed form
3427b662q1J294q17j018K080K434o01o70J304Q01j425j366P61J366p28p16J149
3444A105J526q67j419Q83M67k158j328R66J10j404p8J521J03l12K22M25j46n37
3462i21l22J074K90l21P26J657q1j201N19N97j584j280J438P33j304m8J016m90
3480D98j230n51o1j5o83l25J247J747p44r26J902N91k062k91J958k06j627Q62
3498H4J692mn90L25L61l57j232j504K07L27j389k56K648M32j586Q01J315j783
3516e09j553R95J82q17Q59J756M85M25p7j39k3m77j931O4J454j186j082K333Q25
3535A584k450M4K144q98k293L97R24p97k29R01Q56R93m00q47J410J077k580j499
3553a663K539K09k250J321K270j785j573J120L56j244n88j35K57R39K03q02J092
$$ plain form
3570 266 744 -1526 -1626 1340 830 -1109 365 1594 655 531 2288 1078 -744 -234 108 -207 194
3587 194 -210 -1069 -365 401 -570 43 709 -1894 -2897 -385 423 -1606 -592 1547 788 770 2467 2267
3605 2267 71 -654 -795 -426 986 948 -238 827 1908 137 -386 1315 -1030 -3596 -2120 -308
3621 -308 -1186 -1271 84 -171 -206 1022 998 505 147 -637 -1245 917 1768 351 892 2165 1462 830 2191
3640 2191 984 -2024 -2010 -407 -1204 -1098 84 -424 -1186 -377 -70 -604 -730 -1778 -2216 -26 1478 167
3658 167 611 2457 1127 -451 1467 2366 -9 -797 1082 1255 343 535 158 -161 -344 -1285 -1462 -161
3676 -161 -1033 -3111 -1397 762 -357 -1222 481 751 -1096 -734 881 556 -79 493 1579 2157 2310
3693 2310 1371 871 900 -448 -1755 -346 106 -1207 -927 1220 699 -1111 -683 -79 -1830 -2496 -1263
$$ packed form
3570B66M78k270j00K966n10j939J474J229r39j24J757j210j822N10L42l15M01
3587A94m04q59P04P66r71O13O66k603j003K512Q08k029J014K139p59j8J697k00
3605B267k196p25j41L69J412l8j186J065J081j771n23J701k345k566J476J812
3621c08q78q5J355k55l5J228k4m93l58p84o08K162Q51j417N41J273p03o32J361
3640B191j207l008J4J603p97J06J182n08p62Q09L07n34j26j048m38K190J504j311
3658A67M44J846j330j578J918Q99k375p88J879J73r12J92l77l19j83r41j77J301
3676a61q72k078J714K159j119q65J703K70j847L62J615l25o35N72J086N78J53
3693B310r39n00K9j348j307J409M52j313K80K147n21j810M28O04j751o66J233
$$ plain form
3710 -1263 -416 -810 -337 588 1719 1827 646 596 1792 762 -1202 -343 1391 37 -796 1271 2258
3727 2258 416 -610 298 -264 -1772 -2427 -1865 -705 -812 -1138 559 1622 417 -984 188 926 -841
3744 -841 -1103 765 1222 227 927 2019 1317 209 -151 338 70 -637 -1042 -349 -96 -826 -516 345 -169
3763 -169 -1296 -754 295 -482 -1046 -9 650 78 73 1203 1266 168 -378 157 551 -89 -356 670 1079
3782 1079 52 -599 397 19 -1571 -2059 -420 -7 -902 -174 1404 802 -251 -192 588 39 -1224 -561
3800 -561 725 903 185 611 1766 1162 -399 -188 346 -980 -2020 -1015 -276 -786 -932 354 994 -186
3818 -186 -437 177 -84 -1149 -1460 -81 611 255 593 2276 2176 255 133 773 16 -1661 -1149 369
3836 369 296 -923 -79 1057 267 -1480 -1003 -56 -858 -1971 -1032 701 155 -577 607 1760 1069 -354
$$ packed form
3710a263Q47l94M73R25J131J08j181n0J196j030j964Q59J734j354q33K067R87
3727B258j842j026R08n62j508o55N62J160j07l26J697J063j205j401J172P38j767
3744h41k62J868M57r95P00J092p02j108l60M89k68p07m05O93K53p30L10Q61n14
3763a69j127N42J049p77n64J037O59n72nJ130O3j098n46N35L94o40k67J026M09
3782A079j027o51R96l78j590m88J639M13q95P28J578o02j053N9P80n49j263O63
3800e61J286J78p18M26J155o04j561K11N34j326j040J005P39n10j46J286O40j180
3818a86k51O14k61j065l11J379O92l56L38J683j00j921j22O40p57j677N12J518
3836C69p3j219Q44J136p90j747M77R47q02j113R39J733n46p32J184J153o91j423
$$ plain form
3854 -354 467 1441 348 -669 305 1317 639 -258 378 1129 -236 -1368 -820 -238 -1246 -1701 -205 483
3872 483 -263 -952 308 192 -1119 -1001 351 700 52 708 2059 1672 450 393 1068 345 -890 -208
3890 -208 790 344 -678 40 1027 -26 -1410 -915 -334 -1461 -2328 -1186 25 -309 -653 772 1802
3907 1802 986 -121 556 853 -204 -840 285 1401 930 841 1726 1804 466 -682 -597 -697 -1597 -1789 -572
3926 -572 -47 -514 -294 449 106 -768 -938 -218 -492 -888 -244 640 604 499 1374 1680 1060 322 584 688
3946 688 -266 -983 8 421 -63 -379 562 600 -692 -1248 -592 -422 -1535 -1285 43 606 -295 -272 564 602
3966 602 -535 -531 617 761 169 390 1470 1079 18 -18 540 -84 -967 -544 251 -13 -613 -350 421 -94
3986 -94 -975 -725 -292 -693 -1234 -359 470 63 13 983 1435 552 -26 311 119 -752 -811 347 763 226 296
$$ packed form
3854c54Q21R74j093j017R74J012o78q97O36P51j365j132N48N82j008m55J496O88
3872D83p46o89J260j16j311J18J352L49o48O56J351l87j222n7O75p23j235O82
3890b08R98m46j022P18R87j053j384M95N81j127q67J142J211l34l44J425J030
3907A802q16j107O77K97j057o36J125J116m71q9Q85P8j338j148Q5j00r00j92J217
3926e72N25m67K20P43l43q74j70P20k74l96O44Q84l6j05Q75L06o20p38K62J04
3946F88r54p17R91M13m84l16R41L8j292n56O56J70j113K50J328N63r01K3Q36L8
3966F02j137MJ148J44n92K21J080l91j061l6N58o24q83M23P95k64o00K63P71n15
3986i4q81K50M33m01n41Q75Q29m07n0R70M52q83n78L37j92q71n9J158M16n37P0
$$ plain form
4007 296 1261 1105 -401 -1024 -535 -700 -1706 -1216 468 775 -222 24 1027 827 -464 -920 -189 -41
4025 -41 -880 -490 1093 942 -288 87 1540 862 -538 -584 3 -548 -1064 -541 601 792 -190 116 741
4044 741 625 -725 -636 -231 -433 -737 339 1217 227 -256 342 576 -84 -437 -246 -248 -358 -115 480 764
4064 764 -127 -915 -129 339 -488 -531 181 123 -611 369 1377 605 -462 -280 330 153 -351 -49 68 302
4084 302 17 217 1124 638 -895 -968 -187 -694 -1305 -477 521 -116 14 873 759 -5 -738 -757 -477 -134
4104 -134 109 319 1056 1138 468 1170 1209 -366 -1073 -128 -169 -875 -266 683 -83 -236 641 474 -190 -588 -1007
4125 -1007 -753 -630 -772 -398 850 969 143 872 1830 308 -1129 -91 599 -455 -505 963 1004 277
4143 277 375 163 131 -421 -1514 -1040 58 -370 -1473 58 967 -389 -902 480 346 -903 -410 884
$$ packed form
4007B96R65j56j506o23M89j65j006M90J684L07r97K46J003k00j291m56P31J48
4025d1q39L90J583j51j230L75J453o78j400m6N87n51n16N23J142J91r82L06O25
4044G41j16j350Q9M05k02l04J076Q78r90m83N98K34o60l53J91kj10K43N95K84
4064G64q91p88P86M68q27m3P12n8p34R80J008p72j067J82O10j77n04L02J17K34
4084C02k85K00R07m86j533p3P81n07o11Q28R98o37J30Q59j14p64p33j9K80L43
4104a34K43K10P37Q2o70P02L9j575p07R45m1p06O09R49p66j53Q77j67o64l98m19
4125a007K54J23j42L74J248J19q26P29R58j522j437J038O90j054n0J468M1p27
4143B77R8k12l2n52j093M74J098m28j103J531R09j356n13J382j34j249M93J294
$$ plain form
4161 884 463 -147 407 749 991 801 143 44 538 -453 -729 650 694 -836 -560 823 -31 -1289 -428
4180 -428 -138 -1490 -1386 221 459 -7 0 80 627 569 -293 -284 454 72 -858 1050 2418 681 -468 977
4200 977 1091 -805 -993 -69 -736 -1122 -310 169 670 175 -930 -263 483 -325 -1380 -605 114 -1158 -636
4219 -636 1658 1428 99 723 966 242 -158 -48 -428 -427 151 364 871 1043 -66 -794 146 -245 -1466
4238 -1466 -730 -13 -985 -1011 943 1059 -299 -90 436 -57 -152 216 308 249 169 -70 561 1354 318 -610
4258 -610 400 629 -960 -745 784 39 -1124 24 966 22 -917 -486 -325 -296 -347 -252 441 770 77
4277 77 175 919 577 -1030 -514 345 -562 -438 993 900 25 -85 659 26 -745 -523 -471 -219 -233 -173 528
4298 528 902 82 -343 842 321 -1058 -1070 76 -290 -1048 240 1262 394 -119 477 597 -268 -1079 -1009
$$ packed form
4161H84m21o10N54L42K42j90o58r9M94r91k76J379M4j530K76J383q54j258Q61
4180d28K90j352J04J607K38m66PQ0N47n8q62RP38l82r30J908J368j737j149J445
4200I77J14j896j88R24o67l86Q12M79N01m95j105O67P46q08j055P75P19j272N22
4219f36K294k30j329O24K43p24m00J10l80JN78K13N07J72j109p28R40l91j221
4238a466P36P17r72k6J954J16j358K09N26m93r5L68R2n9q0k39O31P93j036r28
4258f10J010K29j589K15J529p45j163J148R42r44r39M31J61K9n1R5O93L29o93
4277G7R8P44l42j607N16Q59r07J24J431r3q75j10P44o33p71K22N2K52j4O0P01
4298E28L74q20m25J185n21j379j2J146l66p58J288J022q68n13N96J20q65q11P0
$$ plain form
4317 -1009 -254 -92 -464 286 1507 715 -464 128 882 -412 -1327 -372 365 -143 -297 817 1179 272
4335 272 -216 -135 298 -263 -993 -438 163 -355 -634 509 916 -310 -521 296 284 -736 -421 310 267 -8
4355 -8 404 998 752 5 -73 442 144 -734 -208 705 421 -407 139 843 -337 -1186 -627 25 -525 -713 -10
4376 -10 775 60 -413 117 458 -27 -981 -161 673 325 -287 849 1231 250 -52 294 338 -671 -957 -283
4396 -283 -168 -635 -297 527 435 20 -367 -209 -359 -1027 -947 -376 -87 -184 471 1251 900 191 442 469 -367
4417 -367 -678 -67 445 16 214 693 920 16 -452 -116 40 -987 -1205 -423 85 -453 -496 702 727 -237
4437 -237 -263 379 168 -540 -581 386 481 133 349 976 965 -169 -320 228 28 -721 -366 436 144 -501 126
4458 126 124 -486 -788 -549 -92 -388 -398 101 498 515 -128 271 417 -149 -638 233 658 -300 -100 768 692 -201
$$ packed form
4317a009P55J62l72P50J221p92j179N92P54j294r15R55P37n08j54J114L62r07
4335B72m88Q1M33n61p30N55O01n18k79J143M07j226k11Q17j2j020L15P31m3k75
4355hM12N94k46p47p8N15k98q78N26R13k84q28N46P04j180q49N59O52n50j88P03
4376a0P85p15m73N30L41m85r54Q20Q34l48o12J136L82r81l02L46M4j009k86O74
4396b83J15m67L38Q24r2m15l87J58j50o68Q0N71K89r7O55P80l51p09K51K7q36
4417c67l11O11N12m29J98M79K27r04m68L36J56j027k18P82N08n38m3J198K5r64
4437b37k6O42k11p08m1R67R5l48K16O27j1j134j51N48k00p49L55Q02k92o45O27
4458A26ko10l02K39M57k96j0M99L97J7o43L99J46n66m89Q71M25r58K00Q68p6q93
$$ plain form
4480 -201 2 402 50 -593 -636 -162 30 -371 -484 611 1057 -385 -547 527 59 -1487 -889 586 309
4499 309 -259 461 1337 577 -22 -156 -144 -310 -893 -930 529 751 -30 78 1187 384 -797 81 151 -813
4519 -813 -815 275 205 -159 288 573 379 216 -159 -386 128 -342 -1137 -310 726 -51 -220 1042 672 -591
4539 -591 -386 546 -516 -858 96 398 335 596 417 209 478 -188 -730 158 374 -740 -532 1197 110
$$ packed form
4480b01K03M00l52o43m3M74J92m01j13J095M46j442j62J074m68j546N98J475k77
4499C09n68P20Q76p60n99j34J2j66n83l7J459K22p81J08J109q03j181Q78P0r64
4519h13kJ090p0l64M47K85j94j63l75k27N14m70p95Q27J036p77j69J262l70j263
4539e91K05R32j062l42R54L02o3K61j79k08K69o66n42Q88K16j114K08J729j087
$$ [...]
8191A46
##END NTUPLES=NMR FID
##END=
