##TITLE=1H_Bz1702-2
 CDCl3
 8 sc, 
 18.02.2022
##JCAMPDX= 6.0         $$ Bruker NMR JCAMP-DX V2.0
##DATA TYPE= NMR FID
##DATA CLASS= NTUPLES
##ORIGIN= UXNMR, Bruker Analytische Messtechnik GmbH
##OWNER= root
$$ XWIN-NMR		Version 3.5
$$ Fri Feb 18 10:44:03 2022 Russian Standard Time (UT+4h)  she@DPX200
##.OBSERVE FREQUENCY= 200.131346
##.OBSERVE NUCLEUS= ^1H
##.DELAY= (6, 6)
##.ACQUISITION MODE= SIMULTANEOUS
##.ACQUISITION SCHEME= undefined
##.AVERAGES= 8
##.DIGITISER RES= 18
##SPECTROMETER/DATA SYSTEM= spect
##.PULSE SEQUENCE= zg30
##.SOLVENT NAME= CDCl3
##.SHIFT REFERENCE= (INTERNAL, CDCl3, 0, 15.7039)
##AUDIT TRAIL= $$ (NUMBER, WHEN, WHO, WHERE, WHAT)
$$ ##TITLE= Audit trail, XWIN-NMR		Version 3.5
$$ ##JCAMPDX= 5.01
$$ ##ORIGIN= Bruker BioSpin GmbH
$$ ##OWNER= she
$$ F:/spectra/data/she/nmr/H-F/1/audita.txt
$$ ##AUDIT TRAIL=  $$ (NUMBER, WHEN, WHO, WHERE, WHAT)
(   1,<2022-02-18 10:40:45.48 +0400>,<she>,<DPX200>,
      <created by zg, POWCHK disabled, PULCHK disabled
       configuration hash MD5:
       00 E9 B6 7A A2 85 ED C7 34 08 36 98 17 FE 4E 26
       data hash MD5: 16K
       9A E1 2D 30 E4 42 B4 4E 35 37 01 58 0E ED 2F 31>)
$$ ##END=
$$ 
$$ hash MD5
$$ E4 BC 67 63 BC D6 FE E1 12 43 F1 A3 4E 04 9F 20
##$RELAX= 
##$RELAX= 
##$RELAX= 
##$RELAX= 
##$RELAX= 
##$RELAX= 
$$ Bruker specific parameters
$$ --------------------------
##$DU= <F:/spectra>
##$EXPNO= 1
##$NAME= <H-F>
##$PROCNO= 1
##$TYPE= <nmr>
##$USER= <she>
##$AMP= (0..31)
100 100 100 100 100 100 100 100 100 100 100 100 100 100 100 100 100 100 
100 100 100 100 100 100 100 100 100 100 100 100 100 100 
##$AQSEQ= 0
##$AQ_mod= 1
##$AUNM= <au_zg>
##$AUTOPOS= <>
##$BF1= 200.13
##$BF2= 200.13
##$BF3= 200.13
##$BF4= 200.13
##$BF5= 200.13
##$BF6= 200.13
##$BF7= 200.13
##$BF8= 200.13
##$BYTORDA= 1
##$CFDGTYP= 0
##$CFRGTYP= 5
##$CHEMSTR= <none>
##$CNST= (0..31)
1 1 145 1 1 1 1 1 1 1 1 1 1 1 1 1 1 1 1 1 1 1 1 1 1 1 1 1 1 1 1 1 
##$CPDPRG= <>
##$CPDPRG1= <>
##$CPDPRG2= <>
##$CPDPRG3= <>
##$CPDPRG4= <mlev>
##$CPDPRG5= <mlev>
##$CPDPRG6= <mlev>
##$CPDPRG7= <mlev>
##$CPDPRG8= <mlev>
##$CPDPRGB= <>
##$CPDPRGT= <>
##$D= (0..31)
0 1.2 0 0 0 0 0 0 0 0.06 0 0.03 0 0 0 0 0.0002 0 0 0 0 0 0 0 0 0 0 0 0 
0 0 0 
##$DATE= 1645166444
##$DBL= (0..7)
120 120 120 120 120 120 120 120 
##$DBP= (0..7)
150 150 150 150 150 150 150 150 
##$DBP07= 0
##$DBPNAM0= <>
##$DBPNAM1= <>
##$DBPNAM2= <>
##$DBPNAM3= <>
##$DBPNAM4= <>
##$DBPNAM5= <>
##$DBPNAM6= <>
##$DBPNAM7= <>
##$DBPOAL= (0..7)
0.5 0.5 0.5 0.5 0.5 0.5 0.5 0.5 
##$DBPOFFS= (0..7)
0 0 0 0 0 0 0 0 
##$DE= 6
##$DECBNUC= <off>
##$DECIM= 32
##$DECNUC= <off>
##$DECSTAT= 4
##$DIGMOD= 1
##$DIGTYP= 9
##$DL= (0..7)
0 120 120 120 120 120 120 120 
##$DP= (0..7)
150 150 150 150 150 150 150 150 
##$DP07= 0
##$DPNAME0= <>
##$DPNAME1= <>
##$DPNAME2= <>
##$DPNAME3= <>
##$DPNAME4= <>
##$DPNAME5= <>
##$DPNAME6= <>
##$DPNAME7= <>
##$DPOAL= (0..7)
0.5 0.5 0.5 0.5 0.5 0.5 0.5 0.5 
##$DPOFFS= (0..7)
0 0 0 0 0 0 0 0 
##$DQDMODE= 0
##$DR= 18
##$DS= 0
##$DSLIST= <SSSSSSSSSSSSSSS>
$$ [...]
##$SUBNAM2= <"">
##$SUBNAM3= <"">
##$SUBNAM4= <"">
##$SUBNAM5= <"">
##$SUBNAM6= <"">
##$SUBNAM7= <"">
##$SUBNAM8= <"">
##$SUBNAM9= <"">
##$SW= 18.0517287032376
##$SWIBOX= (0..15)
0 0 2 0 0 0 0 0 0 0 0 0 0 0 0 0 
##$SW_h= 3612.71676300578
##$TD= 16384
##$TD0= 1
##$TE= 0
##$TE2= 300
##$TE3= 300
##$TEG= 300
##$TL= (0..7)
0 120 120 120 120 120 120 120 
##$TP= (0..7)
150 150 150 150 150 150 150 150 
##$TP07= 0
##$TPNAME0= <>
##$TPNAME1= <>
##$TPNAME2= <>
##$TPNAME3= <>
##$TPNAME4= <>
##$TPNAME5= <>
##$TPNAME6= <>
##$TPNAME7= <>
##$TPOAL= (0..7)
0.5 0.5 0.5 0.5 0.5 0.5 0.5 0.5 
##$TPOFFS= (0..7)
0 0 0 0 0 0 0 0 
##$TUNHIN= 0
##$TUNHOUT= 0
##$TUNXOUT= 0
##$USERA1= <user>
##$USERA2= <user>
##$USERA3= <user>
##$USERA4= <user>
##$USERA5= <user>
##$V9= 5
##$VALIST= <valist>
##$VCLIST= <CCCCCCCCCCCCCCC>
##$VD= 0
##$VDLIST= <DDDDDDDDDDDDDDD>
##$VPLIST= <PPPPPPPPPPPPPPP>
##$VTLIST= <TTTTTTTTTTTTTTT>
##$WBST= 1024
##$WBSW= 4
##$XGAIN= (0..3)
0 0 0 0 
##$XL= 0
##$YL= 0
##$YMAX_a= 112896
##$YMIN_a= -89977
##$ZGOPTNS= <>
##$ZL1= 120
##$ZL2= 120
##$ZL3= 120
##$ZL4= 120
##$ABSF1= 10
##$ABSF2= 0
##$ABSG= 5
##$ABSL= 3
##$ALPHA= 0
##$AQORDER= 0
##$ASSFAC= 0
##$ASSFACI= 0
##$ASSFACX= 0
##$ASSWID= 0
##$AUNMP= <proc_1d>
##$AZFE= 0.1
##$AZFW= 0.1
##$BCFW= 1
##$BC_mod= 2
##$BYTORDP= 1
##$COROFFS= 0
##$CY= 11.3945322036743
##$DATMOD= 1
##$DC= 2
##$DFILT= <>
##$DTYPP= 0
##$F1P= 2.36226072786647
##$F2P= -0.459571619588291
##$FCOR= 0.5
##$FTSIZE= 0
##$FT_mod= 4
##$GAMMA= 1
##$GB= 0.15
##$INTBC= 1
##$INTSCL= 1
##$ISEN= 128
##$LB= 0.24
##$LEV0= 0
##$LPBIN= 0
##$MAXI= 10000
##$MC2= 0
##$MEAN= 0
##$ME_mod= 0
##$MI= 1.114404
##$NCOEF= 0
##$NC_proc= 0
##$NLEV= 6
##$NOISF1= 3.799351
##$NOISF2= 2.8
##$NSP= 1
##$NTH_PI= 0
##$NZP= 0
##$OFFSET= 15.70392
##$PC= 1
##$PHC0= -16587.47
##$PHC1= 5.200779
##$PH_mod= 1
##$PKNL= yes
##$PPARMOD= 0
##$PSCAL= 0
##$PSIGN= 0
##$REVERSE= no
##$SF= 200.130013532006
##$SI= 16384
##$SIGF1= 3
##$SIGF2= 2
##$SINO= 400
##$SIOLD= 16384
##$SREGLST= <1H.CDCl3>
##$SSB= 0
##$STSI= 0
##$STSR= 0
##$SW_p= 3612.71676300578
##$SYMM= 0
##$S_DEV= 0
##$TDeff= 0
##$TDoff= 0
##$TI= <>
##$TILT= no
##$TM1= 0
##$TM2= 0
##$TOPLEV= 0
##$USERP1= <user>
##$USERP2= <user>
##$USERP3= <user>
##$USERP4= <user>
##$USERP5= <user>
##$WDW= 1
##$XDIM= 8192
##$YMAX_p= 0
##$YMIN_p= 0
$$ End of Bruker specific parameters
$$ ---------------------------------
##NTUPLES= NMR FID
##VAR_NAME=  TIME,          FID/REAL,        FID/IMAG
##SYMBOL=    X,             R,               I
##VAR_TYPE=  INDEPENDENT,   DEPENDENT,       DEPENDENT
##VAR_FORM=  AFFN,          ASDF,            ASDF
##VAR_DIM=   8192,          8192,            8192
##UNITS=     SECONDS,       ARBITRARY UNITS, ARBITRARY UNITS
##FACTOR=    0.0002768,     1,               1
##FIRST=     0,             0,               0
##LAST=      2.2672688,     0,               0
##MIN=       0,             -89977,          0
##MAX=       2.2672688,     112896,          0
$$ Real data points
##PAGE= N=1
##DATA TABLE= (X++(R..R)), XYDATA
0@%%%%%%%%%%%%%%nJ3j6J6j6J6k4L2l2M0m8N6o9P7q8J04j20J36j53J74j98K22
$$ 0 0 0 0 0 0 0 0 0 0 0 0 0 0 0 -5 8 -8 8 -8 8 -16 16 -16 24 -24 32 -37 40 -48 56 -64 72 -81 93 -105 117
36A17k50K81l13L49l90M36m84N33n89O52p19P94q75R64j064J173j294J427j574
$$ 117 -133 148 -165 184 -206 230 -254 279 -310 342 -377 417 -458 506 -558 615 -679 748 -826
55h26J740j930K147k397K690l040L465l997M681n596O900q921J2513k0851P9843
$$ -826 914 -1016 1131 -1266 1424 -1616 1849 -2148 2533 -3063 3837 -5084 7429 -13422 66421
70F6421M3152o1706J8314j5597l3425l4122J8038J5364j1252l3951o365P048r416
$$ 66421 109573 47867 66181 50584 17159 -16963 1075 16439 5187 -28764 -35129 -28081 -37497
83c7497l9818j2662K2601J6088j2129L941L8198M4728O180o756J9424K5154j5151
$$ -37497 -77315 -89977 -67376 -51288 -63417 -59476 -21278 23450 29630 22874 42298 67452 52301
96E2301l5210m375K8718N767k0163N019K9281n84l8592l2119l743q879l1499k4220
$$ 52301 17091 12716 41434 47201 27038 32057 61338 60754 22162 -9957 -13700 -22579 -54078 -78298
110g8298P523K2877L435j3660J3008L7225J2073j5816J391K6747J2917j6986n254
$$ -78298 -70775 -47898 -44463 -58123 -45115 -7890 4183 -11633 -10242 16505 29422 12436 7182
123G182K9477K7525n840j5211R199J1212k7972m2783j0615P937r987k3327j741
$$ 7182 36659 64184 58344 43133 52332 63544 35572 -7211 -17826 -9889 -19876 -43203 -44944
136d4944K1274O361j8278j0416J4286J5928q203j2270J7062K8038J691j0495J4130
$$ -44944 -23670 -17309 -35587 -46003 -31717 -15789 -23992 -36262 -19200 8838 10529 34 14164
149A4164L2001P953j7425k091J5230l879k8160j9743P467O779j9202j9722O322
$$ 14164 46165 54118 36693 34602 49832 45953 17793 -1950 5517 12296 -6906 -26628 -20306
162b0306R483j4577k2664K054J9209K952j0723M807K4419J5650q548l747K3838
$$ -20306 -10823 -25400 -48064 -46010 -26801 -23849 -34572 -29765 -5346 10304 1756 -1991 21847
175B1847J9823q846j2317J0316J3550j4397k4818m54J1857p269k1548o459J2604
$$ 21847 41670 32824 20507 30823 44373 29976 5158 4704 16561 9292 -12256 -18715 -6111
188f111R47j9947r805J3294J0425j1010j1876J2277J8068k828q490J2388K4656
$$ -6111 -5164 -25111 -34916 -21622 -11197 -22207 -34083 -21806 -3738 -6566 -15056 -2668 21988
201B1988P967j1801r52J5887J114k1497j2328J1429Q520j4785j2927R256Q781
$$ 21988 29955 18154 17202 33089 34203 12706 378 11807 20327 5542 -7385 1871 10652
214A0652j2804j9763k188J0413m723j7194O81J9754J1480o038P57K1416J4736
$$ 10652 -2152 -21915 -24103 -13690 -18413 -35607 -34926 -15172 -3692 -9730 -8973 12443 27179
227B7179j0955j2102O652R751q909j5381P018J9310P54j4224k761J0507l944k4663
$$ 27179 16224 4122 10774 20525 11616 -3765 3253 22563 23317 9093 6332 16839 12895 -11768
241a1768j4092P823M429j0847o087J4809J8557j482r691N880J3314l484j7061
$$ -11768 -25860 -18037 -13608 -24455 -30542 -15733 2824 1342 -8349 -2469 10845 7361 -9700
254i700k328J7099P105q563J759J8188J0907j2402j5693J496K076j6163j8599
$$ -9700 -12028 5071 12176 3613 5372 23560 34467 22065 6372 7868 9944 -6219 -24818
267b4818K336J5712J819r689N217J6778J865j4959r236Q292N438j0789o168J4627
$$ -24818 -22482 -6770 -4951 -14640 -9423 7355 9220 -5739 -14975 -6683 -1245 -12034 -18202 -3575
281c575J8446N57q447O777J3253p915k1041o236Q254l33j3213j998J7113J0863
$$ -3575 14871 15428 6981 13758 27011 19096 -1945 -8181 73 -260 -13473 -15471 1642 12505
295A2505q062q661O042O448j2464j6654L422J3260O74o686O218J8800N924j2346
$$ 12505 4443 -4218 1824 8272 -4192 -20846 -17424 -4164 -3490 -10176 -3958 14842 20766 8420
309H420o739O988J640j4696j2259Q492J2785m275p422Q442J3040l490j5853l390
$$ 8420 1681 8669 10309 -4387 -16646 -8154 4631 356 -7066 1376 14416 10926 -4927 -8317
323h317Q761j386j2330k405J4473J1688n994n380J0948Q273r946j4899P88Q987
$$ -8317 444 -942 -13272 -15677 -1204 10484 4490 -890 10058 18331 8385 -6514 -5726 3261
337C261m666j2198K693J4450M305j0223m356J1091L857j3325r661Q265R709n174
$$ 3261 -1405 -13603 -10910 3540 7845 -2378 -6734 4357 8214 -5111 -14772 -6507 3202 -1972
351a972p182R129J4509j258j0272l10R749l86j4494o063R890M692r796o925Q851
$$ -1972 -9154 -25 14484 13226 2954 2644 12393 12007 -2487 -8550 1340 6032 -3764 -10689 -1838
366a838Q931p964j0948L830R031l830j1379J078J3566L603q687K78J3248O847
$$ -1838 7093 -871 -11819 -7989 1042 -2788 -14167 -13089 477 4080 -4607 -4329 8919 15766
380A5766q444o415Q123O606q266j0349K804Q873l889j2523M55J0541n08j1979
$$ 15766 7322 907 9030 15636 7370 -2979 -175 8698 4809 -7714 -7259 3282 2774 -9205
394i205m355R343L577j1056o205R433R226l293n743Q956J3659j398r213J426R769
$$ -9205 -13560 -4217 -640 -11696 -17901 -8468 758 -2535 -8278 678 14337 12939 3726 5152 14921
409A4921p54j2809l766R709L320r322n962O838O388r115j1948J918O257n877j1167
$$ 14921 14167 1358 -2408 7301 10621 1299 -4663 2175 8563 -552 -12500 -10582 -4325 -10202 -21369
424b1369K656J3725M127n806L019J3086N600q539o472O632O314p150p318O694
$$ -21369 -18713 -4988 -861 -6667 -3648 9438 15038 6499 27 6659 12973 5823 -1495 5199
438E199J0843k149j0622K05O832n243j5233o685N375K178q997l232J2364J0909
$$ 5199 16042 13893 3271 3476 10308 5065 -10168 -16853 -11478 -9300 -18297 -21529 -9165 1744
452A744k549n488O213R294n306j0486K884J1319L169n387K152J2611M186j1262
$$ 1744 -805 -6293 -80 9214 3908 -6578 -3694 7625 10794 5407 7559 20170 24356 13094
466A3094r057J853L59j2286j2292L515Q563k829o674M384J1144O74j0561k621
$$ 13094 4037 5890 6249 -6037 -18329 -14814 -6251 -9080 -15754 -11370 -226 448 -10113 -12734
480a2734Q346K786o956j447J3142J2672j214l073P592O587p675j4137l316M632
$$ -12734 -4388 -1602 -8558 -10005 3137 15809 14595 11522 19114 25701 18026 3889 573 5205
494E205l672j0744j202R371L771r524o071N817K714r728q711N305J0055o3l170
$$ 5205 1533 -9211 -10413 -1042 2729 -6795 -12866 -7049 -4335 -14063 -22774 -17469 -7414 -7477 -10647
509a0647R262J5452M309o063j109P563l97j2285o248O792N227n843o675M761N259
$$ -10647 -1385 14067 18376 12313 11204 18767 18370 6085 -163 6629 11856 6013 -662 4099 9358
524I358q241j3119k731M241l059j0321K80J2171O330l597J229J1716Q578m908
$$ 9358 1117 -12002 -14733 -10492 -13551 -23872 -23592 -11421 -5091 -8688 -7459 4257 12835 7927
538G927n845N481O815l582o823L844J0634J90r507k569M253l553j4041q785L819
$$ 7927 2082 7563 14378 10796 3973 7817 18451 18641 9134 6565 10818 7265 -6776 -15561 -11742
553a1742K556p056n143O588R551j725o312M862J0944K17o686J872J0481M413n395
$$ -11742 -9186 -16242 -21385 -14797 -5246 -6971 -13283 -8421 2523 2740 -3946 -2074 8407 12820 7425
568G425n09R788N674o524q004J398K741r100j1863J9N667k700r116q73Q267J410
$$ 7425 6916 16704 22378 15854 7850 9248 11989 2889 -8974 -8955 -3288 -5988 -15104 -15977 -7710 -6300
584f300p573j979Q260O305l920l435Q136R303j163m125O047R822l79q639j771
$$ -6300 -13873 -15852 -7592 -1287 -5207 -8642 -506 8797 7634 3509 9556 19378 18999 10360 8589
599H589M518k026j0938n873M486L166q166o647M312N119n209p847L224Q244q93
$$ 8589 13107 11081 143 -5730 -1244 1922 -6244 -12891 -8579 -3460 -8669 -16516 -13292 -5048 -5941
614e941o080K429J0210N284l891Q96J0645N712o271o295L288L370p248q931K164
$$ -5941 -12021 -9592 618 5902 2011 2907 13552 19264 12993 6698 9986 13356 6108 -2823 -659
629f59O585k601q468j713N650j196j0122m143N832L731m953k683Q770R891p60
$$ -659 5926 3325 -5143 -6856 -1206 -2402 -12524 -16667 -10835 -7104 -12057 -14740 -5970 3921 3161
644C161k492N827Q166j571q657j102O071jp050j868P607L628p832p012J972Q87
$$ 3161 669 6496 14662 13091 4434 3332 9403 9402 2352 484 8091 11719 3887 -3125 -1153 -266
660b66q017q957J504P648r7m636M059J0551L406n214j440P587K966o854l959O092
$$ -266 -8283 -17240 -15736 -8088 -8185 -12821 -8762 1789 5195 -19 -1459 6128 9094 2240 -1719 4373
676D373O931k225m377M235O457m770j0994m013K831k811r428j900Q290M856l589
$$ 4373 11304 9079 4702 8937 15394 10624 -370 -4383 -1552 -4363 -13791 -15691 -7401 -2545 -6134
691f134k595O518N539m806o266L213O899m51m491L793J0521K596n332j366M546
$$ -6134 -8729 -2211 3328 -1478 -7744 -4531 2368 1917 -2574 1219 11740 14336 9004 7638 12184
706A2184m6r673q244K218L036m665m820M450P365j681p520k0M976j335o800r30
$$ 12184 12138 2465 -5779 -3561 -525 -5190 -10010 -5560 1805 124 -7396 -7416 -2440 -3775 -10575 -11505
722a1505Q607N735k633m46P913O559l807o591J807M008m983q259N14O313O72o242
$$ -11505 -2898 2837 204 -242 7671 14230 10423 3832 5639 9647 4664 -3595 -3081 3232 3904 -2338
738b338j016N845P54q057n889L178L536m250m138O611Q485L31l798K406P139l50
$$ -2338 -3354 2491 3245 -4812 -10701 -7523 -3987 -8237 -12375 -5764 2721 3052 -746 1660 8799 8449
754H449p112j893N498J631n494l139N890M712m670n592J926L346m523q228L0N744
$$ 8449 1337 -556 4942 6573 1079 -2060 3830 8542 3872 -1720 206 3552 -971 -9199 -9169 -3425
770c425K59m665O82P664L902n082k542N283L734m548m945L928O229k438n060K366
$$ -3425 -3166 -7831 -7149 515 4417 -665 -3207 2076 5810 1262 -3683 245 6474 4036 -1024 1342
786A342O187n12p126k432M894J87p557l397M781M332l569l825N039N928k365n361
$$ 1342 7529 7017 -109 -2541 2353 2540 -5017 -8414 -3633 699 -2870 -6695 -1656 4272 1907 -3454
802c454J218N823o22o340k3O428K260m648j978N166L593n386n290K248L548l458
$$ -3454 -2236 3587 2965 -3375 -3398 3030 5290 642 -1336 3830 7423 2037 -3253 -1005 2543 -915
818i15o321J496O625L25m860N09O464J825n836l268M623K873m666l512M211O064
$$ -915 -7236 -5740 885 1210 -3650 -3141 3323 5148 -688 -3956 667 3540 -1126 -4638 -427 5637
834E637j778m905K079N168j840p241k144M569M00n769j246O316M233k882l318
$$ 5637 3859 -1046 1033 6201 4361 -2880 -5024 -455 -55 -5824 -7070 -754 3479 597 -2721
849b721L825M450l823o307J531N205j28m762J418P007J729m901k756L350J212
$$ -2721 1104 5554 1731 -4576 -3045 2160 2032 -2730 -1312 5695 7424 2523 -233 3117 4329
864D329o298n564K861M349k159l502L288O593k16n790m91M182J45n459j920N902
$$ 4329 -1969 -7533 -4672 -323 -2482 -5984 -2696 3897 3681 -2109 -2600 1582 1727 -3732 -5652 250
880B50M407k467j890M620M383l628o780L3L250k908n981K52O195K275m334j084
$$ 250 4657 2190 300 4920 9303 5675 -1105 -1072 2178 -730 -6711 -6459 -264 2011 -2323 -3407
896c407N112J992n356m829K576M219k467l203M488O999P56m066J60M486q53p179
$$ -3407 1705 3697 -1659 -6488 -3912 307 -2160 -5363 -875 6124 6880 2814 2974 7460 6607 -572
912e72l157L263K022m083k689M882M559k845n163Q58L587k477o250N19N960K171
$$ -572 -3729 -466 1556 -2527 -5216 -334 4225 1380 -3783 -2925 662 -1815 -8065 -7546 -1586 585
928E85k461L27O742L606m203l768K250K230l776n230K004N329p62m354M06M468
$$ 585 -1876 -1549 5193 8799 4596 828 3078 5308 1532 -3698 -1694 3635 2873 -1481 -1075 3393
944C393m37o625l295L475J393m441k109N052N762j068k578L326N119j532n572
$$ 3393 2956 -3669 -6964 -3489 -2096 -6537 -8646 -3594 2168 1100 -1478 1848 6967 5435 -137
959a37k79M746M20m789o40N209K241m253m071K427J839m953n759J221L896r23
$$ -137 -416 4330 4750 -39 -679 4530 6771 2518 -1553 874 2713 -2240 -7999 -6778 -2882 -3805
975c805l947J611O803J189l513n39M923K134m102k520M231L921j848l258K690
$$ -3805 -7752 -6141 662 1851 -1662 -2201 2722 4856 754 -1766 2465 6386 4538 1280 3970
990C970M546j976n983r81K607j554o310k128M009J854l838k012M239M053k321
$$ 3970 8516 6540 557 -424 2183 629 -5681 -7809 -3800 -1946 -5784 -7796 -3557 496 -1825
1005a825l634L085M747j083l696J984N723J599l817K89M662J214m972m001J793
$$ -1825 -5459 -2374 2373 1290 -2406 -422 5301 6900 3083 3372 8034 9248 4276 275 2068
1020B068J613n052m869J746L623j696m473Q91M621j85m419n58M274K502k832j128
$$ 2068 3681 -1371 -6240 -4494 -871 -2567 -7040 -6149 -1528 -1713 -6132 -6690 -2416 86 -2746 -3874
1036c874N504N109j457k010K987M082k774n706l33K854j579n035j417L846J399
$$ -3874 1630 6739 5282 3272 6259 10341 7567 1861 1528 4382 2803 -2232 -3649 197 1596
1051A596m720k895K773J756l893m348K743M576p46k177L243O214J887k849n0M301
$$ 1596 -3124 -6019 -3246 -1490 -5383 -9731 -6988 -2412 -3158 -5335 -2092 4122 6009 3160 3110 7411
1067G411M55m664k997K986K584l170l305K730K707k948n476j094K537j899n365
$$ 7411 7866 3202 205 3191 5775 2605 -700 2030 4737 1789 -3687 -4781 -2244 -4143 -9508
1082i508k56N054K559j875k18N565L510k338k803K230L398j466m007K034M947
$$ -9508 -9764 -4710 -2151 -4026 -4244 1321 4831 2493 -310 1920 5318 3852 -155 1879 6826
1097F826K11l470q79L117o39o510l998J641P27l391k569L344M718r48k699J838
$$ 6826 7037 3567 2688 5805 5166 -1344 -5342 -3701 -2974 -6365 -8934 -5590 -872 -1820 -4519 -2681
1113b681L949k13m101J37M813J886k374l2M581L560l069l589J328J181m135n700
$$ -2681 1268 1055 -3046 -2909 1904 3790 1416 1384 5965 9525 6456 2867 4195 5376 1241 -4459
1129d459j68L465o35l713M09M427Q71l966k156K917K217k984j646L967M855K84
$$ -4459 -4627 -1162 -1797 -5510 -5101 -674 197 -3769 -5925 -3008 -791 -3775 -5421 -1454 3401 3685
1145C685k157K612M350r34m423j339K158n84m821j903L280K008k914k887J875
$$ 3685 1528 4140 8490 7556 3133 1794 3952 3368 -1453 -3356 -76 1932 -982 -3869 -1994
1160a994K214l162m581J101L648j05k367J510N750K337k467n56L954J676l383
$$ -1994 220 -2942 -7523 -6422 -2774 -2879 -5246 -3736 2014 4351 1884 1328 5282 6958 3575
1175C575l353K323K484k481l427J558L019r79m681j085K593j158m640j629L472
$$ 3575 222 2545 5029 2548 -879 679 3698 2719 -1962 -3047 -454 -1612 -6252 -7881 -4409
1190d409K415k127q93M226L863j314k429J578L772p07l523M54L773P28l406j251
$$ -4409 -1994 -4121 -5014 -788 3075 1761 -668 910 4682 3975 452 906 4679 5407 2001 750
1206G50L320J065m228l436J063J265k934l945J508L585k08k690J033M533Q41l178
$$ 750 4070 5135 907 -2529 -1466 -201 -3135 -7080 -5572 -1987 -2195 -4885 -3852 681 1522 -1656
1222a656p27L817J756k352j582L311L471j798k665J602K671j861m933q83K351
$$ -1656 -2383 1434 3190 838 -744 2567 6038 4240 1575 3177 5848 3987 -946 -1829 522
1237E22j045m181q11L393K111k636j771L029K281k236k753J547L853l80k377J621
$$ 522 -523 -4704 -5515 -2122 -11 -2647 -4418 -1389 892 -1344 -4097 -2550 1303 923 -1454 167
1253A67M479Q05k864q71K871N12m390k806J630J582k288k678J903L548j285l260
$$ 167 4646 5451 2587 1716 4587 5099 709 -2097 -467 1115 -1173 -3851 -1948 1600 315 -2945
1269b945q0K803l71l917m86L879K184j580p33L709K998j991l137J351K072k208
$$ -2945 -3025 -222 -593 -4510 -4996 -1117 1067 -513 -1246 2463 5461 3470 333 1684 3756 1548
1285A548l654J58L763K08k975m37L341O73l879k617J786J478k632j937K685M035
$$ 1548 -2106 -1948 1815 2023 -952 -1389 1952 2625 -1254 -3871 -2085 -607 -3239 -5176 -2491 1544
1301A544R6k209J241L579n84l896j144K538Q06k932j112L181K296j777k623J306
$$ 1544 1640 -569 672 4251 3667 -229 -1373 1165 1971 -961 -2073 1108 3404 1627 -996 310
1317C10J985k534l931K16K600L40k185M85M346J693k511j433K077J391k787k940
$$ 310 2295 -239 -4170 -3954 -1354 -1014 -3199 -2714 1632 3325 814 -619 1458 2849 62 -2878
1333b878K117K955p58k268J175L417m38l786j319K048r4l582j520K935K979j783
$$ -2878 -761 2194 1436 -832 343 3760 3322 -464 -1783 265 171 -3411 -4931 -1996 983 -800
1349h00j342K772K685j513l311K07K853n91k939L77L501J528k364j125K487J017
$$ -800 -2142 630 3315 1802 -1509 -1302 1551 960 -1979 -1602 1899 3427 1063 -62 2425 3442
1365C442l262l182J058K090j574k617J557L579M15k430l64K915L70l414j299K507
$$ 3442 180 -3002 -1944 146 -1428 -4045 -2488 1091 1506 -924 -1288 1627 1997 -1417 -2716 -209
1381b09J909j705j420K502L020j224k995L55K304j373l845m66L055N41k378q00
$$ -209 1700 -5 -1425 1077 4097 2873 -122 233 2537 1164 -2681 -3147 -92 449 -1929 -2729
1397b729K975K083k373k141J745J926j640k737J156L386J50k276N46L132L29k938
$$ -2729 246 2329 -44 -2185 -440 1486 -154 -2891 -1735 1651 1801 -475 71 3203 3532 594
1413E94j725K053P39l034j815J615K669j012k351J257K797p01l027k40K666M25
$$ 594 -1131 922 1661 -1373 -3188 -1573 1096 84 -2267 -1010 1787 1086 -1941 -2181 485 910
1429I10k613n47L298J955j704j373J886K222k213l188N70J845r52k707n0L349
$$ 910 -1703 -2250 1048 3003 1299 -74 1812 4034 1821 -1367 -797 1048 96 -2611 -2661 688
1445F88L73k453r15K508J198k737k117K176K253j267j517J747L573j48k484O4
$$ 688 1061 -1392 -2307 201 1399 -1338 -3455 -1279 974 -293 -1810 -63 3510 3362 878 942
1461I42K337m78l038j870K156J110k196j354K093J924j431k847O85K103j443k658
$$ 942 3279 2801 -237 -2107 49 1159 -1037 -2391 -298 1626 195 -2652 -1967 136 -1307 -3965
1477c965M66K954J111j453J02L530J604k074j749J228J430k096k515J032K484
$$ -3965 -3499 -545 566 -887 -785 2745 4349 2275 526 1754 3184 1088 -1427 -395 2089
1492B089o14k274K38K223l67l387j463J431P12k279j231K940K786p93j070J786
$$ 2089 1475 -799 -561 1662 1295 -2092 -3555 -2124 -1412 -3691 -4922 -1982 804 11 -1059 727
1508G27K654q17k812J50K500j0k334j90K909J420k334j964J284O22k808l014M35
$$ 727 3381 2564 -248 -98 2402 2392 58 -132 2777 4197 1863 -101 1183 1805 -1003 -4017 -3582
1525c582J992p90k032J242L358O70j985n32K610P43k318j058K144K700q88j472
$$ -3582 -1590 -2380 -4412 -3170 188 858 -1127 -1659 951 1694 -624 -1682 462 3162 2274 802
1541H02J934K368j298k807o74J242j032l237j022K274Q13j646j011K110J851j942
$$ 802 2736 5104 3806 999 325 1567 535 -2702 -3724 -1450 -637 -2283 -3294 -1184 667 -1275
1557a275k011J174K179p02j712J259L711P68j792J70K435M01k867k079J240P70
$$ -1275 -3286 -2112 67 -635 -2347 -1088 2623 3391 1599 1769 4204 4605 1738 -341 899 1669
1573A669k180j822J040K361r77k536K36J928n59k626r21K551J528j408k18L076
$$ 1669 -511 -2333 -1293 1068 91 -2445 -2209 -281 -840 -3466 -4387 -1836 -308 -1716 -1934 1142
1589A142K247j042j300J167J827j494k859N08J861p1k582l37K274L11k627j712
$$ 1142 3389 2347 1047 2214 4041 2547 -312 196 2057 1986 -596 -933 1341 1652 -975 -2687
1605b687R30J153k280j768J483K436J1j168J208K928J87j900l10K224N98k156
$$ -2687 -1757 -604 -2884 -4652 -3169 -733 -722 -1890 -682 2246 2433 533 223 2447 3045 889
1621H89j006K094J362j712j693J005J456j681l070R3J334p71k279RK690J188j577
$$ 889 -117 1977 3339 1627 -66 939 2395 714 -2356 -2263 -929 -1700 -3979 -3970 -1280 -92 -1669
1638a669k72K413J446j325j550J402K142q85j666J017K270J54k136o31J580m94
$$ -1669 -1941 472 1918 593 -957 445 2587 1702 36 1053 3323 3477 1341 710 2290 1796
1654A796k566k160J468O30j718j387J619K268o13j821P70K364k65k120L54K464
$$ 1796 -770 -2930 -1462 -832 -2550 -3937 -2318 -50 -663 -2484 -1714 650 385 -1735 -1381 1083
1670A083J098j275k24K253J569j780j778O79R70j970k806K46J743m83k114K36
$$ 1083 2181 906 682 2935 4504 2724 946 1625 2595 625 -2181 -1935 -192 -675 -2789 -2553
1686b553K182N71k289j122J835R38j454r30J968K534n0j242J434K091k96k343
$$ -2553 -371 200 -2089 -3211 -1376 -438 -1892 -2822 -854 1680 1630 388 1822 3913 3617 1274
1702A274o59J612m24k343p21J544J109j396j965J221J307j713k303L27J709j66
$$ 1274 615 2227 1803 -540 -1261 283 1392 -4 -1969 -748 559 -1154 -3457 -3130 -1421 -1587
1718a587j523J036K665J210j289l03J823J027j882j419J109J486r74j738Q89K015
$$ -1587 -3110 -2074 591 1801 512 209 2032 3059 1177 -242 867 2353 1379 -359 530 2545
1734B545o29k508k50J133o35k398j115J966J131j134m37K140J866q41j483N88
$$ 2545 1916 -592 -842 291 -344 -2742 -3857 -1891 -760 -1894 -2331 -191 1675 834 -649 -61
1750f1J666n82j772K27K357O48j732j81J883K79k017k114P42J096j825j697J064
$$ -61 1605 1023 -749 -522 1835 2483 751 570 2453 2732 715 -1399 -657 439 -1386 -3083 -2019
1767b019K039j72j576O10J927K13k090n17J378J285j519o34K263J527o68j543
$$ -2019 20 -152 -1728 -1118 809 1022 -1068 -1585 -207 1078 -441 -1075 1188 2715 2047 504
1783E04N28J410j070k492j69J417l3j653m80K228P67j378j210J243J142j328j781
$$ 504 1032 2442 1372 -1120 -1289 128 95 -1558 -2038 190 957 -421 -1631 -388 754 -574 -2355
1800b355J080K096m49r25Q63J863M79j931q74J450L23k021j426J289J504j066
$$ -2355 -1275 821 372 -553 310 2173 2652 721 -153 1297 1620 -401 -1827 -538 966 -100
1816a00j501J084J581r34j734M3J638j89j786n8K248J037j057m87J647J227j620
$$ -100 -1601 -517 1064 130 -1604 -1561 77 -112 -1898 -1956 292 1329 272 -215 1432 2659 1039
1833A039j479M09J178n52j946N43J826l0j536m76J397O36k028j228J260J113j080
$$ 1039 -440 -31 1147 595 -1351 -808 1018 988 -548 -1024 373 1009 -1019 -2247 -987 126 -954
1850i54r91J422J880k07j315M81J396k12j861m48J500L39j288p06J441J327j170
$$ -954 -1945 -523 1357 1150 -165 316 1712 1500 -361 -809 691 1030 -258 -964 477 1804 634
1867F34j634O65J287j249j862J24J903J30j433L38K051O04j170j023J176Q41j507
$$ 634 -1000 -335 952 -297 -2159 -2035 -132 -2 -1435 -1097 954 1558 388 -635 541 1382 -125
1884a25j143J126J445m07j400M96J790m08j886l89J172L0j845p00J581J336r03
$$ -125 -1268 -142 1303 896 -504 -8 1782 1374 -512 -901 271 301 -1544 -2244 -663 673 -230
1901b30p57J222J397r22j547J78J415k40j720J36J993P61j463m28J105P41j526
$$ -230 -987 235 1632 710 -837 -659 756 516 -1204 -1068 925 1686 223 -205 900 1641 115
1918A15j701N90J305r05j211P49J941K39j631j66J700J58j715q19J344Q20q72
$$ 115 -1586 -996 309 -596 -1807 -1058 883 1122 -509 -675 1025 1183 -532 -1351 -7 813 -59
1935e9r19J456J402m89j735J59J355q65k036j25J575L60j120j33J639J146j362
$$ -59 -978 478 1880 1391 -344 -185 1170 305 -1731 -1856 -281 79 -1041 -1174 465 1611 249
1952B49j214R98R90r40j642J066J622J37j301L02J503L17j987j077J126J04j233
$$ 249 -965 33 1023 83 -1559 -493 1129 1266 -35 267 1770 2087 100 -977 149 253 -980
1969i80j286J320J293n42r94O50J421m32j693p8J396M25j226K7J788J113p79j338
$$ -980 -2266 -946 347 -195 -1189 -539 882 450 -1243 -1321 75 500 -726 -699 1089 2202 1423 85
1987H5J119Q72r85j817P0J230n66j378L18J552K22j509p30J178M63j327r38J086
$$ 85 1204 2076 1091 -726 -656 574 8 -1370 -1052 500 722 -787 -1517 -339 124 -1203 -2141 -1055
2005a055J325j25r49J206J862n00j143j19J059Mj799n33J419N87j197q16R36R17
$$ -1055 270 145 -804 402 2264 1764 621 502 1561 1565 -234 -767 652 1239 42 -774 162 1079
2023A079j169j637K44J076n32j399N08J633O54j045K02J411O98j054r81J068Q52
$$ 1079 -90 -1727 -1483 -407 -939 -2338 -1830 -197 457 -588 -386 1025 1723 669 -312 756 1608
2040A608q75j067P07J398l74j462R2R58m42j779o15R92K38j089m62J461J020l57
$$ 1608 733 -334 373 1771 1397 -65 27 985 543 -1236 -1851 -859 -621 -1710 -2172 -711 309 -48
2058d8r10Q59J301p35j118J86J509M21j204k50J605O08j249j037O97N28j322j462
$$ -48 -958 -99 1202 467 -651 -465 1044 1465 261 11 1616 2224 975 -62 635 1163 -159 -1621
2076a621L73J113n98j023L00J631J78j302l86J387O58j308m88J204J398o27p69
$$ -1621 -1248 -135 -733 -1756 -1456 175 353 -949 -1335 52 710 -598 -1086 118 1516 889 120
2093A20R81J162n97j385l24R75m23j651k74J098L99j073o22J286O39r49j124N46
$$ 120 1101 2263 1666 281 -43 932 509 -1142 -1416 -318 81 -992 -1614 -328 311 -638 -1762 -1216
2111a216J363l74j057Q64J716J87p92j8J179K77j567q61P67M95r13j092M83J329
$$ -1216 147 -227 -1284 -420 1296 1483 691 673 1852 2129 562 -299 468 963 50 -1042 -559 770
2129G70p40j239J72Q23l0j697j83J346O22p11L0J465J121n24j010Q57Q07o20j512
$$ 770 30 -1209 -1037 -214 -244 -1941 -2124 -778 -156 -867 -837 628 1749 1225 215 1072 1879 1259 -253
2148b53K03J361k07j233j61J112J05j520r07P90L45j078j096J147J115j43p65
$$ -253 -50 1311 1104 -129 -290 822 927 -593 -1500 -710 -365 -1443 -2539 -1392 -277 -420 -1185
2165a185P67J621m6j206r7J298L54j141m75J299N78p11r36P36O63j146j796K50
$$ -1185 -418 1203 1157 -49 -146 1152 1506 365 -110 1189 1767 1056 120 856 1519 373 -1423 -1173
2183a173O56j92j249J4J353O94j084j33Q40J082j071o62R22J117m94o25P07J203
$$ -1173 -517 -709 -1958 -1944 -591 103 -981 -1114 -274 808 -263 -925 -3 1114 620 -5 702 1905
2201A905R6j144m42Q52Nj542q62P03N68j095q34Q91J222p47q96J53J065k74j050
$$ 1905 2001 857 415 1267 1272 -270 -1132 -429 139 -956 -1790 -899 323 -424 -1320 -1167 -102 -376 -1426
2220a426L94J500O26q31j64J270P22r78q39O14M80r26j216M25P75j04j190j16
$$ -1426 -1032 468 1094 263 99 1369 2091 1113 274 888 1368 442 -774 -349 426 322 -868 -984
2238i84J108L5j167o06R69L96o82p29J308J303l33o40N92R76k30j251r0J162q6
$$ -984 124 159 -1008 -1614 -645 -249 -931 -1660 -352 951 618 -22 570 1546 1316 65 -25 1137 1051
2257A051j128k59R63L35q46q96P05L53q01j040K01J019j54p18L64J151N14q29
$$ 1051 -77 -336 627 962 116 -780 -75 278 -523 -1563 -1362 -343 -497 -1215 -851 300 814 -15
2275a5j70R73M82j111m28O97O34l74j026N09J015m10r84l59O32j2j399k14R27
$$ -15 -185 788 1270 159 -269 428 1062 688 -338 171 1186 776 -208 -567 65 53 -1346 -1560 -633
2294f33P26o89n58J210Q72p43o91M35P36R5j211K42J253M7q37l74J097J43j071
$$ -633 93 -596 -1154 56 928 185 -506 -71 665 760 -451 -209 1044 1091 254 -120 977 1120 49
2313D9q92J24O98m72r84K70J439k60p14K22J064j10r31j91R46M00o61l70J051
$$ 49 -843 -719 -21 -493 -1477 -1207 232 -28 -742 -520 544 434 -497 -688 258 658 -3 -373 678
2332F78O68l74o93J00Q27o86j174j29O79K87j199J13R71M10r70n69P70O12p71
$$ 678 1346 972 279 379 1206 520 -654 -783 -104 183 -1016 -903 68 478 -492 -1061 -291 321 -450
2351d50o97O48R78n0p17M89J210k7j079l35P09Q4q91p02R09K77m39p23N92P25
$$ -450 -1147 -499 479 429 -288 201 1411 1384 305 -30 679 763 -128 -830 79 356 -83 -806 -214 511
2371E11n75j005J10P09K4q75K12J107O26p29j48P25N19o10r43N09M88l10r56L63
$$ 511 -64 -1069 -959 -250 -226 -1101 -889 218 844 115 -33 692 1211 601 -342 167 655 345 -611 -248
2391b48Q76Kq33k13P63R3j047o71O90O33m74o01P47J078l82p27K90P45q3j086
$$ -248 628 630 -203 -416 347 440 -607 -1278 -588 45 -429 -1030 -283 795 413 -314 -24 721 638 -448
2411d48K9P92M57r10k61O77O49q38p35M48O13p47j024N07R33j72p13K14J047L96
$$ -448 -419 373 830 -80 -341 336 985 147 -588 -140 473 -274 -1298 -791 142 -30 -743 -529 518 914
2431I14r02m95N75M52m76p09N62Q61k88p86L21N94k41q65l06Q15j11p10j18Q10
$$ 914 12 -483 92 544 68 -641 -79 782 494 -292 29 623 382 -483 -789 26 -85 -795 -913 -103
2451a03O52o61n74R10M20j05r37K77P12mr79J30J019N2o48l97N71J83q53o31N48
$$ -103 549 -112 -686 224 644 539 -398 -121 591 587 -392 -262 757 809 161 -236 335 518 -335 -966 -418
2472d18L12k76o56N21R51j96p33K08Q08N1q26m64R92O32o69m68O28Q97o78p00
$$ -418 -106 -382 -1038 -517 434 238 -495 -287 521 572 -254 -718 274 906 237 -231 397 1294 616 -84
2492h4j8O91o24p09j80Q38j16o77oQ20K37m36o28M80R00m57o23M14R76j25n69
$$ -84 -102 589 -35 -744 -924 -86 -202 -879 -885 -65 172 -264 -892 -412 488 31 -592 -178 798 673 104
2513A04K63P33n2q70m23M60L71q18n18N09O11n15m88K68O73k89r30J0R02J73q63
$$ 104 367 1100 1048 178 -245 215 586 -232 -750 -241 370 -145 -633 -365 308 19 -911 -901 1 174 -689
2534f89J65P77O98n32k81O12K97n23o82j20Q17j12p71Q7O98k4p34l50N34J88p93
$$ -689 -524 253 951 419 138 750 1047 524 -158 -278 539 427 -344 -257 441 417 -317 -667 -133 55 -738
2555g38n78R19M72m36l45P59O80n5q86L9J005j57q30l8O42L49p19l32N27J67m19
$$ -738 -1316 -397 75 -361 -706 53 733 678 -208 -169 836 679 -151 -189 453 802 83 -249 278 445 26
2576B6p29O7M86k78o09J65R13J62n02j24Q44L01o75l28O01M77m79m98N01Q40l70
$$ 26 -703 -636 -150 -428 -1037 -872 41 203 -299 -423 421 722 47 -281 320 797 318 -180 321 1161 791
2597G91q81M0M28l4j069j34N83J28l28m28N68N36j51p33O23N41k69o37L31O79
$$ 791 -90 -50 378 344 -725 -859 -276 -148 -476 -904 -336 200 49 -684 -61 480 211 -426 -95 584
2617E84J55n89J03P74J0p13n72N49K29p15o71J89N65J9q71L79P02j39o12J47M49
$$ 584 739 150 253 1027 1037 324 -248 301 530 -185 -856 -667 -102 -83 -954 -575 127 -12 -624 -477 -28
2638b8K00n02j45P78N72m11k84L98M39k16p10q4M84j91o43j99M69J41n43m11N55
$$ -28 172 -330 -475 303 875 464 180 578 1017 801 91 7 491 300 -343 -542 -73 68 -475 -886 -331
2659c31L15n26m29M15N61j38l72J31Q77J92m41J13L83J91p00k08M36K26n09n47
$$ -331 -16 -542 -971 -556 5 -133 -505 -374 503 695 254 367 750 941 241 33 469 695 186 -361
2679c61L63N05l28q34L7N45j13p75q6P13L57p89L00N53N01l61j94K37N98m42o51
$$ -361 2 507 179 -655 -618 -73 -186 -961 -1047 -334 23 -766 -466 87 588 227 33 270 868 426 -225
2700b25K15P16r9o75J09N88k9q75k89L01K01m89m64L35O41l89k68M41N71M5n60
$$ -225 -10 706 607 -68 41 629 600 -275 -564 -263 -62 -551 -1015 -680 -39 -428 -696 -255 316 361 -199
2721a99n2P63n8m95j23Q15L20o51j86K43M51o85n54K1L48o3r27L60O06J00m86
$$ -199 -251 512 454 -41 -164 651 971 320 134 377 828 143 -411 -390 -42 -105 -1032 -672 -66 34 -452
2742d52q7M35K68n33k02L48P81k72l28K42N10J68q01K25K29m2o63l94L80K91l43
$$ -452 -539 -104 164 -369 -571 -223 558 286 -42 200 710 878 77 302 531 489 -174 -568 -188 103 -240
2763b40k90L91L39l39o17N52K02K8o99K02P74Q4m33J47M92K11n43k68K32K40l77
$$ -240 -530 -139 200 -139 -756 -204 -2 26 -673 -471 303 387 -46 101 593 804 261 -7 225 465 88
2784H8n46K50N14k09n47P6N36k97l48j53M37J87m69j34P62L93k97j33K10M58l30
$$ 88 -458 -208 306 97 -450 -374 162 -135 -483 -636 -199 -12 -481 -615 147 540 243 110 320 778 448
2805D48l84j87N04K4m47j38O20J1n33l76L08K44n73m49K38N87p0l87K97P46M5
$$ 448 64 -123 381 405 -42 -180 440 451 -82 -458 -150 94 -479 -928 -690 -103 -173 -560 -263 483 528
2826E28n27j3L98J13l31m96O13L96l98m56M52K92m26m84j01M14j30m54k46O21
$$ 528 1 -12 386 499 168 -328 285 681 283 -173 279 571 145 -339 -440 -26 -156 -610 -856 -235
2846b35K25n51Q3M80M44n18j72K69N31l82m17J14P27n4l71n7L41J70o57k66J03
$$ -235 -10 -561 -478 2 446 -72 -244 25 556 174 -243 -129 598 544 173 116 457 627 -30 -296 -193
2867a93L27m30l89L30N18q7n97J64N07R6q10J69O01J52l45k29N83L32l04l31K40
$$ -193 134 -296 -685 -355 163 76 -521 -357 150 246 -564 -395 206 358 13 -216 367 699 395 64 304
2888C04K79l31o04J02M35l18l32J79M88L0n61j43M01K60l75k46L52M58j48m15
$$ 304 583 252 -352 -250 185 -133 -465 -286 202 232 -329 -472 -71 189 -186 -432 -80 378 230 -185
2908a85L81K61O2o38N1L64m3l89j37L41J55k13n15M80M84m25o03J87K74J59m90
$$ -185 196 457 519 -119 -68 296 253 -136 -273 68 223 10 -505 -25 459 34 -569 -382 -108 51 -439
2929d39Q2P55J4k94n2K13K11m30l15K38L01k03m96L35L52p5l15l5K22j29j91l74
$$ -439 -357 398 412 118 66 279 490 60 -255 -17 284 81 -415 -80 272 197 -118 -153 69 -60 -251 -625
2951f25N61L75m96j69M12N56l10l60J58N27k93n16J9M54K00n93j79L96J75k95
$$ -625 -64 311 -185 -354 58 614 304 -56 102 629 336 -180 -161 293 493 -100 -279 117 292 -3
2971cm97N02L04o29l62L00L80k3l04J45N37K11n80k42M00K92l88k91N57J72j29
$$ -3 -500 2 306 -323 -685 -385 -5 -28 -332 -187 350 561 -19 -261 139 431 43 -248 309 481 352
2992C52n48K48M40l68n42J8M41j62k63j19M53J79j93l48N34J98l35l08P0O02o4
$$ 352 -196 52 492 124 -418 -400 41 -121 -384 -503 -50 129 -64 -412 122 320 -15 -323 -253 349 285
3013B85m37K89L55Kl78k43L83J59m36o17N27L98n47k91L92N05l85l45N3L94k9
$$ 285 -152 137 492 494 116 -127 256 415 -21 -638 -111 287 -260 -551 -159 346 -39 -384 -331 63 34
3034C4l87K2N96m9k09j15M08K91l16k44K49pk35l51J27L91q3n12j9N06Q4k31m61
$$ 34 -353 -331 265 216 7 -108 300 591 275 31 280 273 38 -313 -186 205 122 -390 -409 97 181 -50 -511
3057e11M39J45k60k82K97L46J00l67J95N43o0p51n6L53l0k54k63O53K9l48l07
$$ -511 -72 73 -187 -469 -172 174 274 -93 102 645 585 -166 -222 131 101 -153 -416 237 266 -82 -389
3078c89J22N15l36l38P7K67J76l10J08L65K09l10k12K74J05j79l85K61L10k98
$$ -389 -267 248 -88 -426 -349 -82 94 -216 -108 257 466 156 -56 218 323 144 -241 20 330 32
3098C2l12p2N49j58k57j68M77q7m45k6K03K46m6j45K20J94K46m34R4K63j10m20
$$ 32 -280 -352 197 39 -218 -386 91 4 -441 -467 -264 -18 -64 -209 11 205 451 17 111 374 264 -156
3120a56J37J91L05m63j72L49J3j90m15K58K47l11l05O7L47N5j58j27M85R6l82
$$ -156 -19 172 477 14 -158 191 204 14 -401 -143 104 -207 -512 -445 -98 -43 -201 -328 157 253 -129
3141a29p9N19J36l17j04Q5M43k84l99J06N20k98o22J85O2Jr2j63K65K19l74n5
$$ -129 -208 311 447 130 26 111 554 270 -129 -23 497 199 -423 -238 -176 -175 -267 -430 -165 54 -320 -375
3163c75K94K76q1m98J80M21K2k88J48K36J32l96k73M95n7k73k77L05J37k14l95
$$ -375 -81 195 114 -384 -204 217 239 -49 99 335 467 71 -202 293 236 -37 -314 -9 128 -86 -481
3184d81K37L57j07l35o9L85m8k11j35N73N4p5j65L02K94l97j90mM07l81j01R4
$$ -481 -244 113 6 -329 -398 -13 -61 -272 -407 166 220 145 -20 282 576 179 -11 -15 392 11 -90 4
3206DJ11J08n13K6M22k3j64l57R7M13k43k57L85L26k42k83K46J66J38m45J5K23
$$ 4 115 223 -290 -264 158 135 -29 -386 -289 124 -119 -376 9 335 93 -190 56 222 360 -85 -70 153
3228A53J50l24j83L23R3k10k64J19J95j32j76j50L72J26m04J68K79lj70j01L35
$$ 153 303 -21 -204 119 212 2 -262 -143 52 -80 -256 -406 -34 92 -312 -144 135 132 -38 -139 196
3249A96J2j43k19K25K55k9l50J14P6q0j65k42M11M6l24l73N71J00j70r0M8K80
$$ 196 208 65 -154 71 326 297 -53 61 137 57 -108 -350 61 107 -217 -590 -19 81 -89 -179 -131 149
3271A49j88j01R3K43Q1m14P7L75J04m26pJ23J58l42m31L15K11k16k69J44L32N4
$$ 149 -39 -140 -47 196 277 -137 -60 315 419 -7 -14 109 267 -75 -506 -191 20 -196 -465 -321 11 65
3293F5l50O9L33pk96j1K08K82m13j6L38J22j2l77M3J65k2l12m7L78k24o7j12K07
$$ 65 -285 -216 117 110 -186 -197 11 293 -120 -136 202 324 312 -65 -22 143 121 -191 -238 140 -84 -151 -263 -56
3317e6Q9j11l39L21M7r3m5j19N27j03q3M9K47J06l92o3J66M2J0m37K09K56k03
$$ -56 33 -78 -417 -96 -49 -142 -187 -306 221 118 35 84 331 437 45 -18 148 190 200 -237 -28 228 25
3340B5l83L07J91j52l05j37L54N7k37K60J85J98k88j30M3K96j29r6j77L88p4k41
$$ 25 -358 -51 140 -12 -317 -454 -100 -43 -280 -20 165 363 75 -55 -12 284 155 59 -118 270 196 -45
3362d5Rk4L64l65nl3K65l25j41J03K70r8l63J99N26k53j55J50R4P1l25j65M26
$$ -45 -36 -60 304 -61 -66 -99 166 -159 -300 -197 73 -25 -388 -189 337 84 -71 79 173 244 -81 -246 180
3385A80K15l94l04N12J25l19m6k14L73o0m16J98N2J36j90K9K24J42l28j03L07
$$ 180 395 1 -303 209 334 15 -31 -245 128 68 -348 -150 -98 38 -152 -123 101 243 -85 -188 119
3406A19Q6k64J12jL30j18l59O3K16k4k96J4K7J98k79o1J79K58k07j02KL71k04
$$ 119 205 -59 53 52 382 264 -95 -32 184 160 -136 -122 -95 103 -176 -237 -58 200 -7 -109 -107 264 60
3429F0l74J76L48q7q2j6J72K85m80N7N5K12l38l55K48J51q4j56O2J82j6j88j98
$$ 60 -314 -138 210 123 41 25 197 482 2 59 114 326 -12 -367 -119 32 -52 -208 -146 36 20 -168 -366
3452c66L47K00k93m5Q8K74n3l43M18O7j45j81Q0J34j23k66NK54L9j64m3J23J12
$$ -366 -19 181 -112 -157 -69 205 152 -191 227 294 149 -32 48 182 59 -207 -202 52 91 -73 -116 7 119
3475A19k03k69K26J87j45j62K12P9J97k32K4K09N6j72k11K97j15l0j18j08L87
$$ 119 -84 -353 -127 60 -85 -247 -35 44 241 9 33 242 298 126 -85 212 97 67 -51 -159 228
3496B28j84k84m4K94M1k54j46M27k00M3j10K71J02j48n2n5K46j57k32R0L10j21
$$ 228 44 -240 -284 10 51 -203 -349 78 -122 -79 -189 82 184 36 -16 -71 175 18 -214 -124 186 65
3518F5o9l7L70j12l50j55L64M6k37k38J17K93Q9l70P4K72l7j71j11K55J64l06
$$ 65 -4 -41 329 217 -133 -288 76 122 -115 -353 -236 57 146 -224 -150 122 85 -86 -197 58 222 -84
3540h4NL62l2j07k2Q2kj31k80j7J92j4l6j55L73j24j4j03J69N2k50k0J38K09k30
$$ -84 -79 283 251 144 122 204 202 71 -209 -226 -34 -48 -84 -239 134 10 -4 -107 62 114 -136 -156 -18 191 -39
3565c9l9P0L48j74k95J68M5j92j21J78J7K13k36J3k1L06l20j10k09L48Op1l2L30
$$ -39 -78 -8 340 166 -129 39 84 -108 -229 -51 -34 179 -57 -44 -65 241 -79 -189 -398 -50 -44 -115 -147 183
3589A83j37k8j27L47Q2l31q1J73Q5j93j92K35N7j62oj23J88Kj94jK63R9k22j86
$$ 183 46 18 -109 238 320 -11 -92 81 166 -27 -219 16 73 -89 -95 -218 -30 -28 -222 -223 40 139 -83 -269
3613b69L15L01k43j41O3J31n1O7k19J32m2j26JJ49N3q6k56J50K23l21l5J6J58
$$ -269 46 347 104 -37 26 157 106 173 -46 86 44 -82 -81 68 121 35 -221 -71 152 -169 -204 -188 -30
3636c0J3k3R7K23r3k29LK81k29M0N6N5J77j45l68L03l3L3j87k52J97K30l65m1
$$ -30 -17 -40 57 280 187 -42 -39 242 13 53 109 164 341 196 -172 131 98 131 -56 -308 -111 119 -246 -287
3660b87L20p6j72K6K76m1J5r7J31M7J2k33P2K03R0l24OP8J27j13j76J49o8j3o6
$$ -287 33 -43 -215 -189 87 46 61 -36 95 142 154 -79 -7 196 286 -38 -32 46 173 60 -116 33 -35 -48 -114
3685a14o0K35n3r1r3K00l2l9l9J67M8l15J77L11o2n8l85K57K25j17l50J22N6j12
$$ -114 -174 61 8 -83 -176 24 -8 -47 -86 81 129 -186 -9 302 240 182 -203 54 279 162 -188 -66 -10 -122
3709a22j3j62L45nn2j97L42j50P2j89K27J85k67j31J38J19r6k7P1j21J32j58q7
$$ -122 -135 -297 48 43 -9 -206 136 -14 58 -131 96 281 14 -117 21 140 44 17 88 -33 99 -59 -146
3732a46M3K35m7j82M5K36k00j69JJ83K4k05J79j8K12j02k93L32N4k3j49K09n3
$$ -146 -103 132 85 -97 -52 184 -16 -185 -184 -1 23 -182 -3 -21 191 89 -204 128 182 159 10 219 166
3755A66O6k99r6L32o1k56PJ86m6k23Q4L8J19o3k23K99Pk0L4J19N5j19n1n2N9J6
$$ 166 232 -67 -163 169 108 -148 -141 45 -1 -224 -140 -102 17 -46 -269 30 37 17 51 170 225 106 55 3 62 78
3781G8J2k6J8jj50j10K89r5k56KK45J78l92R6J15N5J46j95M8R4j69J26k03R8K33
$$ 78 90 64 82 81 -69 -179 110 15 -241 -239 6 184 -208 -112 3 58 204 9 57 151 -18 108 -95 3 236
3806B36k19K9J11M7r6l07OK91k27k5p9L23k2j79j35J46J18m8j79J99M2j43J1J39
$$ 236 17 46 157 204 108 -199 -193 98 -129 -154 -233 90 68 -111 -246 -100 18 -30 -209 -10 32 -111 -100 39
3830C9K05n1q5j06K13q9k20r7J28P0r8n6K45N9j87p7K6J17O6l75J81J90J8k18
$$ 39 244 193 108 2 215 126 -94 -191 -63 7 -91 -147 98 157 -30 -107 -81 36 102 -273 -92 98 116 -102
3854a02O4j2R3J72m04K40K7j58pP3J22k33p4K50J5j56l3M3n8J62j55l6j1K53o8
$$ -102 -38 -50 43 215 -189 51 78 -80 -87 -14 108 -125 -199 51 66 -90 -123 -80 -138 24 -131 -167 -178 75 7
3879Gj20N5L36o3j13j69O1J88q7k67L14N0j84r6L5J85n6l51K05R6l4j10L7K80
$$ 7 -113 -58 278 215 102 -67 -6 182 95 -172 142 192 8 -88 -53 132 76 -275 -70 26 -8 -118 -81 199
3903A99J40k91j01K7J69j83k1j14L74j23j01M2K36j74j31j4K22j30j26m3J58M
$$ 199 339 48 -53 -26 143 -40 -61 -175 199 76 -25 17 253 79 -52 -66 156 26 -100 -143 15 19
3925A9j69l3J73J73j25k18J45K9j46J46j52K43K6k54J11J46J2k00j01J68k7oj91
$$ 19 -150 -183 -10 163 38 -180 -35 -6 -152 -6 -158 85 111 -143 -32 114 126 -74 -175 -7 -34 -40 -231
3948b31J92L0P2j67J21Q0j16j43J38R1O4k69J0K18O8j27J8NM0R5l53J39J43p4
$$ -231 -39 -9 63 -104 17 97 -19 -162 -24 67 131 -138 -128 90 158 31 49 54 94 189 -164 -25 118 44
3972D4j24j99K24K19j42j85P1R0K4k13mL21N7l16J11L90j05j90j30O7J64q3j52
$$ 44 -80 -279 -55 164 22 -163 -92 -2 22 -191 -195 126 183 -133 -22 368 263 73 -57 10 174 91 -61
3995f1J43Kr2k28K56K7Qj91k2J81J5j63J88j25M5l2m4K98k5j20p6K4P8J9k29J08
$$ -61 82 84 -8 -236 20 47 55 -136 -158 23 38 -125 63 -62 -17 -49 -93 205 180 60 -16 8 86 105 -124 -16
4021a6L03j69k20J5K12Oj69j50K69j21r6NP9J71%j60O5j21K47j49j2O3J36j82
$$ -16 287 118 -102 -87 125 131 -38 -188 81 -40 -136 -131 -52 119 119 -41 24 -97 150 1 -11 52 188 6
4045Fq2J25M8q6n1l0O7r3j64J00K31L6k16J93j72J08q2nO6Q4q0j75K18J35k12
$$ 6 -76 49 97 11 -40 -70 -3 -96 -260 -160 71 107 -109 84 -88 20 -62 -67 -1 83 3 -172 46 181 -31
4070c1J29k6r1m6j61J60L6J27j12m4q3K12j41O8R7N8n1j05N9k03K41j49n3L25
$$ -31 98 72 -19 -65 -226 -66 -30 97 -15 -59 -142 70 -71 -3 94 152 101 -4 55 -148 93 -56 -109 216
4094B16j34r2j58K35L6j18j6n6K13j82oJ78m9Mk64R0J81o8q4j7J20K16k45n0J27
$$ 216 82 -10 -168 67 103 -15 -31 -87 126 -56 -62 116 67 71 -193 -103 78 10 -74 -91 29 245 0 -50 77
4119G7J06l5j78J54o5L9m3j55L07j18j95q2J72Nk1k00J54J27N2j56RK54m2k63
$$ 77 183 148 -30 124 59 98 55 -100 207 89 -106 -188 -16 -11 -32 -232 -78 49 101 -55 -46 208 166 -97
4143i7Q1J10J08k11J11J37j06k38N9j00L11j29j90J71J19n5j20n0J7J37k58O9
$$ -97 -16 94 202 -9 102 239 133 -105 -46 -146 165 36 -154 17 136 81 -39 -89 -72 65 -193 -124
4165a24J78J20k66nR1R4l4m9K9k9r7P7j34L78j56r5R0p4K7k55J9J99j4j09k6J62
$$ -124 54 174 -92 -97 -6 88 54 5 34 5 -92 -15 -149 229 73 -22 68 -6 21 -234 -215 -16 -30 -139 -165 -3
4191cK72j14j69J5K55k24l4j00K31j94j49K07Q0l4j10M2m0J34q3k97J94K49n6
$$ -3 269 155 -14 1 256 32 -2 -102 129 -65 -214 -7 73 39 -71 -29 -69 65 -18 -315 -121 128 72
4214G2r9MJ21r5j39o4L37Kj63j17J55o4O9l9q8K21k2j27j8J43k7j46k0K11j22
$$ 72 -27 -23 98 3 -136 -200 137 139 -24 -141 14 -50 19 -20 -108 113 91 -36 -54 89 62 -84 -104 107 -15
4239a5j5nR7J23p3j26J4q1K12j10j22J90M1k00j4J09M7m0k30J37m8M6ml1J19M0
$$ -15 -30 -35 62 185 112 -14 0 -81 131 21 -101 89 130 -70 -84 25 72 32 -198 -61 -109 -63 -67 -98 21 61
4265F1k28R4J15j33L5J9J60nk9j87J84m5P3K5j45Q9L7p5KM2l3j00r4J21J21k34
$$ 61 -167 -73 42 -91 -56 -37 123 118 89 -98 86 41 114 139 -6 83 120 45 47 89 56 -44 -138 -17 104 -130
4291a30J01K2p5P0q5j09L61k2k63K02p8R9j55R4m3J96j28j76K67m2k1p4Q9o7Q9
$$ -130 -29 -7 -82 -12 -97 -206 155 133 -130 72 -6 93 -62 32 -11 185 57 -119 148 106 85 11 100 33 122
4316A22j92m4K1p0J6J16Q9p6J73k59o5K96j15l5O2N7m5l3n5K40j44j6j06J15j6
$$ 122 -70 -114 -93 -163 -147 -31 58 -18 155 -104 -169 127 12 -23 39 96 51 18 -37 203 59 43 -63 52 36
4341C6j95m5K95j58L8j51J04L28l72Q8r9L18j17l5qJ32k84LJ96M7n0j04J86j37
$$ 36 -159 -204 91 -67 -29 -180 -76 252 -120 -32 -131 187 70 35 27 159 -125 -122 74 121 71 -33 153 16
4365A6P0j08K2j7L2L6j46N0L6l0M2j47K18l7L7k48Q7L05j12m2p8l5R5j53n9J29
$$ 16 86 -22 0 -17 15 51 -95 -45 -9 -39 3 -144 74 37 74 -174 -87 218 106 64 -14 -49 46 -107 -166 -37
4391c7m7J14k20L37l8o6k20K06R9k09m4mK71j13M1n9J58p3o8n1J92k01q2Q0pQ6
$$ -37 -84 30 -190 147 109 43 -177 29 128 -81 -125 -129 142 29 70 11 169 96 28 -23 169 -32 -114 -34 -41 45
4417D5k0j02k6J62j48k8K4J26m9m8PJ04J97k78J15L2M3Kk38j7K18j0k72K16m4
$$ 45 25 -77 -103 59 -89 -117 -93 33 -16 -64 -57 47 244 -34 81 113 156 158 -80 -97 121 111 -161 55 11
4442A1J99l29N3J11J40k24m2j03J26j91J52n6K60L6j89j37L60r9j43J40M4J30
$$ 11 210 -119 -66 45 185 -39 -81 -184 -58 -249 -97 -153 107 143 -46 -183 177 78 -65 75 119 249
4464B49l06P2K69k93Lnp1J88j37m4K5M5J83k09j16P2Q3j40P9j14K22k03M4J04
$$ 249 -57 15 284 -9 -6 -11 -82 106 -31 -75 -50 -5 178 -31 -147 -75 8 -132 -53 -167 55 -148 -104 0
4488@Q1q8J9J60r3J57j71j09O4O8k58m8K38L5j64M3j95L27O8k30k7Q2J43m3k10
$$ 0 81 -7 12 172 79 236 65 -44 20 88 -170 -218 20 55 -109 -66 -261 66 134 -96 -123 -41 102 59 -151
4513a51K82l5m7m2n8R6j35n2K5J27P9j99R6J66j09p1O9M8n7j16n3P0J04q7q9J72
$$ -151 131 96 49 7 -51 45 -90 -142 -117 10 89 -110 -14 152 43 -28 41 89 32 -84 -137 -67 37 -50 -139 33
4539C3J16k8j76k5m8N0K4J8M5L5M4q0Q6J36m21j4J88Q9m8j35J46K5r2L2m9M9j18
$$ 33 149 121 -55 -80 -128 -78 -54 -36 9 44 88 8 94 230 -191 -205 -17 72 24 -111 35 60 -32 0 -49 0 -118
4566a18J41l9J50r9j2qQ4M3k10RJ8p4j2J56j03J95j28j53K04k3J65j30l9Mj5L
$$ -118 23 -16 134 35 23 15 99 142 -68 -59 -41 -115 -127 29 -74 121 -7 -160 44 21 186 56 17 21 6 9
4592In8l5J24q7NJ74k4k3j48q2K13p3mj04k4K77p8k9j62K53j5l40J33M8J15k3
$$ 9 -49 -84 40 -47 -42 132 108 85 -63 -145 68 -5 -9 -113 -137 140 62 33 -129 124 109 -231 -98 -50 65 42
4618D2q2J22qn8l7P1J9m3q7J66Ln2j56rK34jl06K83j34o6pJ9J24J6Nj05q0K15
$$ 42 -40 82 74 16 -21 50 69 26 -61 105 108 56 -100 -109 125 124 -182 101 -33 -99 -106 -87 37 53 58 -47 -127 88
4646H8J2k11K18q2%k7K8j04K2J55n1J2O3j57l1J34N1j52n6l7J38Po5p5K05j12
$$ 88 100 -111 107 25 25 -2 26 -78 -56 99 48 60 123 -34 -65 69 120 -32 -88 -125 13 20 -45 -120 85 -27
4672b7P1j38J53k7L8j90J24J86j84j45Q6K19k09p4P8K63n30J82R3J24j64n4K18
$$ -27 44 -94 59 32 70 -120 4 190 6 -139 -53 166 -43 -117 -39 224 -306 -124 -31 93 -71 -125 93
4695I3m1J03j70M8j48K07O7j37j2J16k2L8l87J32J65j70kP8J47j16J0k0Q8Jp3
$$ 93 52 155 -15 33 -115 92 159 22 10 126 104 142 -245 -113 52 -118 -120 -42 105 -11 -1 -21 67 68 -5
4720ep8m1J53r9J45j5K0j26L0L3J93l56K5J78L0j15j6j45L60L2l28q9L02j09M6
$$ -5 -83 -124 29 -70 75 60 80 -46 -16 17 210 -146 -121 57 87 -28 -44 -189 171 203 -125 -214 88 -21 25
4745B5Mk8J57o5j14m1J83m3n6j43J30J67j61k10K82j1k86J47PJ19j95J03n8J31
$$ 25 29 1 158 93 -21 -62 121 78 22 -121 9 176 15 -195 87 76 -210 -63 -56 63 -132 -29 -87 44
4769D4r3m4O2j3K24k77Q8N7R2j15k24K81j61O9J70l8j05k14J10L4K4J1o5n3K01
$$ 44 -49 -93 -31 -44 180 -97 -9 48 140 25 -199 82 -79 -10 160 122 17 -197 -87 -53 -29 -18 -83 -136 65
4794F5jj24m6Q5p5nj06J81M9q9J3O9J1Q4j7j39J0J11m5k09K21l9l3j02J2J95L
$$ 65 64 -60 -106 -21 -96 -101 -207 -26 23 -66 -53 16 27 111 94 -45 -35 76 31 -178 43 4 -29 -131 -119 76 79
4821G9k64J26j7J17n7J0J02J63k65o9R6J06nk34K4J68Qq8K8j8J43k08%O3Pr9j4
$$ 79 -185 -59 -76 41 -16 -6 96 259 -6 -75 21 127 122 -112 -88 80 88 0 28 10 153 -55 -55 8 15 -84 -98
4848i8J01R2l2j39Pj2K31k39K07j41J60j90o6J73J9m6j77K65k04M6m3J18n3j00
$$ -98 3 95 63 -76 -69 -81 150 -89 118 -23 137 -53 -119 54 73 27 -150 115 -89 -43 -86 32 -21 -121
4872a21M0P1n2J61p3M9M2m2m7j01J19L9o2L1j4O2K1P0l43K1L2O1p7M9OPrj2J6
$$ -121 -81 -10 -62 99 26 75 117 75 28 -73 46 85 23 54 40 102 123 193 -150 -129 -97 -36 -113 -64 -58 -51 -60 -72 -56
4901e6L0l6K7J61l34K19o0J26Q4j33r6Q7J24j40n6O0R9p6j54L1J71J0k16J16O5
$$ -56 -26 -62 -35 126 -208 11 -49 77 161 28 -68 19 143 3 -53 7 106 30 -124 -93 78 88 -128 -12 53
4926E3n8j2l8R1M4j0j24P3J72n6j5j81l3J55j72K93j96J1j2J8J16L2k57jn8J38
$$ 53 -5 -17 -55 36 80 70 -54 19 191 135 120 -61 -94 61 -111 182 -14 -3 -15 3 119 151 -106 -107 -165 -27
4952b7j43j4J04jJ29j32J04J5l7j8P8o7J91k67K10r3M5K0k5j06K1j49k4K5K49
$$ -27 -170 -184 -80 -81 48 -84 20 35 -2 -20 58 -9 182 -85 125 32 77 97 72 -34 -13 -162 -186 -161 88
4977H8j52m6J2J15k4q4l3M4K72r4j22k4J90k89K52k14MJ44mK6p1J07j67o1J67
$$ 88 -64 -110 -98 17 -7 -91 -124 -80 192 98 -24 -48 142 -147 105 -109 -105 39 35 61 -10 97 -70 -131 36
5002C6q1J11k5L8l2L2L7j89J41l4l7lO5n0k4j95K31l2l4k9O2M7j02Q6q7J97j60
$$ 36 -45 66 41 79 47 79 116 -73 68 34 -3 -6 59 9 -15 -210 21 -11 -45 -74 -12 35 -67 19 -68 129 -31
5029c1J13j47K37j24q3j51J49J18k67L45J2K8k20m5R4o0MJ5Nn9OM6k39K46nl2
$$ -31 82 -65 172 48 -35 -186 -37 81 -186 159 171 199 -21 -66 28 -32 -28 -13 -8 -67 -61 -15 -254 -8 -13 -45
5055d5o3Q1n8j3K46k01J27l1j56J25k1J40j05k6K3O8L4k67K8o6J12QJ02r0J43
$$ -45 -108 -27 -85 -98 148 -53 74 43 -113 12 -9 131 26 0 23 91 125 -142 -114 -180 -68 -60 42 -48 95
5080I5n9PP2l13J10L3O1l3j23K20P5m1j73M7P0j66J44o2l7K9J57j47j88J68J44
$$ 95 36 43 115 -198 -88 -55 6 -27 -150 70 145 104 -69 -22 48 -118 26 -36 -73 -44 113 -34 -222 -54 90
5105I0j99J3J36k79L93k42O5j17J36n4r8J18P0j03J27n3N2l4j65J28Q1j10N8l1
$$ 90 -109 -96 40 -239 154 -88 -23 -140 -4 -58 -156 -38 32 -71 56 3 55 21 -144 -16 65 -45 13 -18
5129a8P0l5j04J13m7j5M4k54L05m0j95J01j18J11M8N2M3L2j65J09r9K39j30p0
$$ -18 52 17 -87 26 -21 -36 8 -246 59 19 -176 -75 -193 -82 -34 18 61 93 -72 37 -62 177 47 -23
5153b3k1L2J72k67k7R8n9J41j43O5k3q6l4J51QJ19p9k82K31j08K13j17O0J1n9
$$ -23 -44 -12 160 -107 -134 -36 -95 46 -97 -32 -55 -141 -175 -24 -16 103 24 -258 -27 -135 78 -39 21 32 -27
5178b7M0mO2o7o7K6n4J73n1j02L2J05j65J06j31Q9R5j65J30n1N6j16J01O3M7l41
$$ -27 13 9 71 4 -63 -37 -91 82 31 -71 -39 66 -99 7 -124 -35 60 -105 25 -26 30 -86 15 78 125 -216
5204b16N2K04Q7k58J77R3p8Lj73J43P6j31Q5J10j14j1j13L0Q2p7J01r2N3J2o9
$$ -216 -164 40 127 -131 46 139 61 64 -109 34 110 -21 64 174 60 49 -64 -34 48 -29 72 -20 33 45 -24
5229b4K3M6L1mj68M0o9J46j04Q0q8J62m1Jr4N4K2O2N2j20Ko9k7J50m8M6J0p2j3
$$ -24 -1 45 76 72 -96 -56 -125 21 -83 -3 -91 71 30 31 -63 -9 13 75 127 7 9 -60 -87 63 15 61 71 -1 -14
5258a4j63L38j77n5J8P8qj0K0o8j52J44K3PJ39j04r6Q8p3J93m5j27K8l7J34k11
$$ -14 -177 161 -16 -71 -53 25 17 7 27 -41 -193 -49 -26 -19 120 16 -80 8 -65 128 83 -44 -16 -53 81 -130
5284a30J52J38j53R2n2Q8j92J34j55J48j57m0K53l38L5L86l38P9M1j18J16n3L8
$$ -130 22 160 7 99 47 135 -57 77 -78 70 -87 -127 126 -212 -177 209 -129 -50 -9 -127 -11 -64 -26
5307b6Q1P8j97n6J51M8o5m2j74J30J37j00m4P1P8j36J06K5l3m4p7m3J83o7n8J27
$$ -26 55 133 -64 -120 31 79 14 -28 -202 -72 65 -35 -79 -8 70 -66 40 65 32 -12 -89 -132 51 -16 -74 53
5333E3J21k03Jj8P8j52k7O5J30l5jNJ22rk18K4p4J61qj35M8L9j35J36O1J55k43
$$ 53 174 -29 -28 -46 32 -120 -147 -82 48 13 12 17 139 130 -88 -64 -138 23 15 -120 -72 -33 -168 -32 29 184 -59
5360e9J15p9pM7L6k02K46j60o3O7J09j95O1N1P2J27p1o4j52K52r4n6m9nJ47n1
$$ -59 56 -23 -30 17 53 -149 97 -63 -126 -59 50 -145 -84 -33 39 166 95 31 -121 131 37 -19 -68 -73 74 23
5386B3j39J94M3j4j13j34N1Q0j8r2J25l3r2O4J06j25n1J47J66p7j06m6K15q7j15
$$ 23 -116 78 121 107 -6 -140 -89 -9 -27 -119 6 -27 -119 -55 51 -74 -125 22 188 111 5 -41 174 87 -28
5411b8O0j08J05j04M2j68K14K3k00L4J94l7l9j36K12j20J29l6k5J9j87J46j0K9
$$ -28 32 -76 29 -75 -33 -201 13 36 -164 -130 64 27 -12 -148 64 -56 73 37 12 31 -156 -10 -20 9
5435IlK0Q9k68K72r7l0N4j29J85M2j15j79K72l21MJ20J34JLl6J40j4k12J4P5q9
$$ 9 6 26 115 -153 119 22 -8 46 -83 102 144 29 -150 122 -199 -195 -75 59 60 63 27 167 153 -59 -45 30 -59
5462e9M4M1O7m8k90M41r0J0j46j95M3J72ml3l2QJ1l8lJ41J40j89r2J44J36j56
$$ -59 -15 26 93 45 -245 196 106 116 -30 -225 -182 -10 -14 -47 -79 -71 -60 -98 -101 40 180 -9 -101 43 179 23
5488B3J2P9j03o8M2j19J98j78J34N4J2J7j17O2j18j5N4O5j1j9j38m2J12M3O7p6
$$ 23 35 114 11 -57 -15 -134 64 -114 20 74 86 103 -14 48 -70 -85 -31 34 23 4 -134 -176 -64 -21 46 -30
5514c0J76n7r9M0J15r6Q1j16j35J03n5Lm2K9jM9j84J84R3K2j32J72m9pN2j37m0
$$ -30 146 89 -10 30 145 49 130 14 -121 -18 -73 -70 -112 -83 -84 -35 -219 -35 58 80 -52 120 71 64 116 -21 -61
5541f1J65m4j42J27j68J71k11J56J33q1n8k5l1P6r1o2K44j22J81l16K68L0o3Q1
$$ -61 104 60 -82 45 -123 48 -163 -7 126 45 -13 -38 -69 7 -84 -146 98 -24 157 -159 109 139 76 157
5565A57j13M7M0r4kj34P2j17R6M5Q0m9j54j27L33j25k0q0J92J5k74R8RqL2L4J47
$$ 157 44 91 131 37 35 -99 -27 -144 -48 -3 77 28 -126 -253 80 -45 -65 -145 47 62 -212 -114 -105 -113 -81 -47 100
5592A00L1Jj29P3K7n0k06K35l6J9j25q7Q7Q9L0k52R8l0P6L7L1M6k09P4N8J75k67
$$ 100 131 132 3 76 103 53 -153 82 46 65 -60 -147 -60 29 59 -193 -95 -125 -49 -12 19 65 -144 -70 -12 163 -104
5619a04l6J70J50r7j58M6JK4nk13K99M7j26N3m1p2lq0M1K0OJ01Q3q3k09J38P2
$$ -104 -140 30 180 83 -75 -29 -28 -4 -9 -222 77 124 -2 51 10 -62 -65 -145 -104 -84 -78 23 106 23 -186 -48 24
5646B4L5M2m0j35Q9l1K8mL5p0J6J45m8q9j7N5l3j87K49p0j62J34j1L1J6L8J20
$$ 24 59 101 61 -74 15 -16 12 8 43 -27 -11 134 86 -3 -20 35 2 -185 64 -6 -168 -34 -45 -14 2 40 160
5673A60q6o6o7J03J22k21Oj7J50j62pJ97j29%L3kn1mj21K25J59k01n4j72L43j1
$$ 160 74 8 -59 44 166 -55 -49 -66 84 -78 -85 112 -17 -17 16 14 -37 -41 -162 63 222 21 -33 -205 138 127
5699A27k19K47j45k5P9q4l8nJ3o5QN6O4j24M9K1J04j01k1l8M9K8j72J23J14J41
$$ 127 -92 155 10 -15 64 -20 -58 -63 -50 -115 -107 -51 13 -111 -62 -41 63 -38 -59 -97 -48 -20 -192 -69 45 186
5725A86k04M1R5j5j25J35q7J10r6m1j55K22Qk09OJ01q3M1J02M0k3q9J01Klm9j00
$$ 186 -18 23 118 103 -22 113 26 136 40 -1 -156 66 74 -135 -129 -28 -111 -70 32 72 49 -40 61 63 60 11 -89
5752h9J45J00m8m6M3j5j51k0J49j81J13M6j06K4p1K2L1J07k0k8j69J57j%J93k49
$$ -89 56 156 108 62 105 90 -61 -81 68 -113 0 46 -60 -36 -107 -85 -54 53 33 5 -164 -7 -8 -8 185 -64
5778f4L9J39k12J00PMP4Lj14O6n9o8J93Q4j74p9MO3L5q2P9O0k9K8l9r8R9j22R7
$$ -64 -25 114 -98 2 9 13 87 90 -24 42 -17 -85 108 192 18 -61 -57 6 41 -41 38 98 69 97 58 -40 59 -63 34
5807C4m7J25n1l9q9J30l5j38P9lQ9pk35J54J0L7l3k2K9K7k8o6K6Q9k11J49O4q3
$$ 34 -13 112 61 22 -67 63 28 -110 -31 -34 55 48 -187 -33 -23 14 -19 -41 -12 15 -13 -79 -53 36 -175 -26 38 -45
5835d5K2n0j3m1J38m2k55L74k25L8p0K31j75J50o1r5M4K12r2r7N2J8j17O4K29
$$ -45 -23 -73 -86 -127 11 -31 -286 88 -137 -99 -169 62 -113 37 -24 -119 -75 137 45 -52 0 18 -99 -35 194
5860A94J4l24J25q5n3P4j25J7J39j40O8J08M1p9l0R7r5K14o9j45J6L2Ll2K42k64
$$ 194 208 -116 9 -76 -129 -55 -180 -163 -24 -164 -96 12 53 -26 -56 41 -54 160 91 -54 -38 -6 -3 -35 207 -57
5886e7J25q1J20n9j09L5J31j50j7J0p2K15m7j17R5L6r8L3m6o2O3Q4k24J41qJ37
$$ -57 68 -13 107 48 -61 -26 105 -45 -62 -52 -124 91 44 -73 22 58 -40 -7 -53 -115 -52 32 -192 -51 -59 78
5912G8j15m3J69j49j5J4Q8j03QN1N5j05L2p0N6J77p1m8j7Q3M8j36J16N4j75J3
$$ 78 -37 -80 89 -60 -75 -61 27 -76 -68 -17 38 -67 -35 -105 -49 128 57 9 -8 75 123 -13 103 157 -18 -5
5938er4J92p4n5K01j95K09j41jj45J82o7Q6j56N0P5j74K14m6j00p6P7M3KK2q3
$$ -5 -99 93 19 -36 165 -30 179 38 37 -108 74 7 93 -63 -13 62 -112 102 56 -44 -120 -43 0 2 24 -59
5964e9j0K48r0j02j64K62O5m1j78Q3p8Q6j75K21j40Q4R4j19Q1p3K00j70K3q1R
$$ -59 -69 179 89 -13 -177 85 150 109 -69 14 -64 22 -153 68 -72 12 106 -13 68 -5 195 25 48 -33 -24
5989b4J57M0j33j84O7P4j8jN5J1Mj37J11j07K6M7J13j17n9j04R4K8J85J3j25M9
$$ -24 133 173 40 -144 -77 -3 -21 -22 33 44 48 -89 22 -85 -59 -12 101 -16 -75 -179 -85 -57 128 141 16 65
6015F5j72J54L3j04m2K3N8o5j10M9J49n5O8op7J63k74K06K4M8k14J18K1J05k48
$$ 65 -107 47 80 -24 -66 -43 15 -50 -160 -111 38 -17 51 45 -32 131 -143 63 87 135 -79 39 60 165 -83
6040h3Q1L8Q6k20Q5N7k26L55j12PR8j85o2j4J06J29Rj29J39p1r4J04j32P3k1p9
$$ -83 -2 36 122 -98 -13 44 -182 173 61 68 166 -19 -81 -95 11 140 149 20 159 88 -6 98 -34 39 18 -61
6066f1P3K4j7j41J77L2n8j6M1m0N8k39J04L1q3J22j57J57OLk5L8nJj75J70J28
$$ -61 12 36 19 -122 55 87 29 13 54 14 72 -167 -63 -32 -115 7 -150 7 13 16 -9 29 24 25 -150 20 148
6093A48j51K7K1J3J10kk79K43r2j02J1K8J8J13j72J8k3J16r1q6kR1j8j08J03J76
$$ 148 -3 24 45 58 168 166 -113 130 38 -64 -53 -25 -7 106 -66 -48 -71 45 -46 -132 -134 -43 -61 -169 -66 110
6119A10j07P5Km6j35N3N0k9R7l3J04k74Q4J8O8n9k1J12j22m2J06J95k07q6l5R4
$$ 110 3 78 80 34 -101 -48 2 -27 70 37 141 -133 -49 -31 37 -22 -43 69 -53 -95 11 206 -1 -87 -122 -28
6145b8n3mQ0l2J35N8k15K15j44p4J70j48j0j9N6P1l7j2J01j78J44q3l4J83j39
$$ -28 -81 -85 -5 -37 98 156 -59 156 12 -62 108 -40 -50 -69 -13 58 21 9 110 -68 76 -7 -41 142 3
6170CJ36j28o4Q1Q1q6j08K5Q6Lo7m9l1J51j00J31lq4l9n0K55l7m0NP8k0j06J8
$$ 3 139 11 -53 28 109 23 -85 -60 26 29 -38 -87 -118 33 -67 64 61 -23 -62 -112 143 106 66 71 149 129 23 41
6198D1k5l0n9J00l4P3n7K5rL4j74N3QJ46k21J4q6L15j63l7J71q7K01k48J7Q7r5
$$ 41 16 -14 -73 27 -7 66 9 34 25 59 -115 -62 -54 92 -129 -115 -201 114 -49 -86 85 -2 199 -49 -32 55 -40
6225d0P3O6j97p3L37p4j93O2j00J18J90k59O1K5j19M7O7J08j91r2K33lp3r7J87
$$ -40 33 99 -98 -171 166 92 -101 -39 -139 -21 169 -90 -29 -4 -123 -76 -9 99 -92 -184 49 46 -27 -124 63
6250F3N3Mm0J7k2j09mN4M8Jj95P0O0m7p4n2J65M1k7o4J01q0O3n0j48J75P0o4J64
$$ 63 116 120 80 97 75 -34 -38 16 64 65 -130 -60 0 -47 -121 -173 -8 33 6 -58 43 -37 26 -24 -172 3 73 9 173
6279A73j22P2j6jq8j68J0K06j61M5QK4j03K00P7k36J75j25R6j90R8PN7j02M4p5
$$ 173 51 123 107 106 18 -150 -140 66 -95 -50 -42 -18 -121 79 156 -80 95 -30 66 -124 -26 -19 38 -64 -20 -95
6305i5N6J22j74P2Q0Pj13k1P0J3n3j83K57o1r3J38L5L3q3j10O7J02m9J9Kj94J82
$$ -95 -39 83 -91 -19 61 68 -45 -66 4 17 -36 -219 38 -23 -116 22 57 90 7 -103 -36 66 17 36 38 -156 26
6332B6q7K8pj3k2J36r6M1L2k15J55l0N5R7j43R6j69K50r9j25P0R2j37J04Jk15
$$ 26 -61 -33 -40 -53 -75 61 -35 6 38 -177 -22 -52 3 100 -43 53 -116 134 35 -90 -20 72 -65 39 40 -175
6358a75J92O7j42P2O2j24J53r9%j0j59O9p8J22P9J15k21J46J4p9j04M7J05N4l7
$$ -175 17 84 -58 14 76 -48 105 6 6 -4 -163 -94 -172 -50 29 144 -77 69 83 4 -100 -53 52 106 69
6383F9m9n9O1l7j22J77p3Knj8j4P2K3Mj04o8Q8n4m2J12r7L5o2Q8J09k07K01Oo5
$$ 69 20 -39 22 -15 -137 40 -33 -31 -36 -54 -68 4 27 31 -73 -141 -53 -107 -149 -37 -134 -99 -161 -73 36 -171 30 36 -29
6412b9k35M01j68o4K9R8kj2M8r3K8j71J53J65j58p8LNQ3j57K77k28k3J07n2rJ59
$$ -29 -264 137 -31 -95 -66 32 30 18 66 -27 1 -170 -17 148 -10 -88 -85 -80 3 -154 123 -105 -128 -21 -73 -82 77
6439G7j32J7R0M9j62K32j59j63J25J32q6p8Q1O8p5o5N2j0QP0j45J45r0j1o6N0
$$ 77 -55 -38 52 101 -61 171 12 -151 -26 106 20 -58 23 91 16 -49 3 -7 1 71 -74 71 -19 -30 -96 -46
6465d6J56k0j20l2J3R4jP7q2P3j71L6J42l1j38oO5O2p6k7R8r5Q6K1r8L4K4M5j5
$$ -46 110 90 -30 -62 -49 45 44 121 39 112 -59 -23 119 88 -50 -56 9 71 -5 -32 66 -29 57 78 -20 14 38 83 68
6494F8M6j47o3J43j09O4O4j14K7O1L5j35j5Q2M4j25J58m4j69J42p5L8j2n9K54
$$ 68 114 -33 -96 47 -62 2 66 -48 -21 40 75 -60 -75 7 51 -74 84 40 -129 13 -62 -24 -36 -95 159
6519A59j69o1O0Qj54J31J15j86M3J07J05r5r7k3l1J59q4m5J79l20L99k27J39l0
$$ 159 -10 -71 -11 -3 -157 -26 89 -97 -54 53 158 63 -34 -57 -88 71 -13 -58 121 -199 200 -27 112 82
6543H2oJP9q1lk2k06O7P2P7M5j74J54n9j61K14k3J5o7q8R7J49l90J63J8J7N5J24
$$ 82 76 77 156 75 72 50 -156 -89 -17 60 105 -69 85 26 -135 79 56 71 4 -84 13 162 -228 -65 -47 -30 25 149
6571A49j96l2K55q5n5j27P7M2j23M2PJ25Rj46J03m8k4L4k8j7Q8M0j40j8j2O9M3
$$ 149 -47 -79 176 91 36 -91 -14 28 -95 -53 -46 79 88 -58 45 -3 -27 7 -21 -38 50 90 -50 -68 -80 -11 32
6598C2j42R5J5l6Q6L2j90Q9J5Rj30K35kj21j70K52pm9nP9mq5rk5J40q1R3p0l2
$$ 32 -110 -15 0 -36 50 82 -108 -19 -4 5 -125 110 108 -13 -183 69 62 13 8 87 83 -2 -11 -36 104 23 116 46 14
6627A4j5K11l05J21n0P8m3q2J06J3J9p3M7j71J79r2j56L82j59p9K01m5O3k86J72
$$ 14 -1 210 -95 26 -24 54 11 -71 35 48 67 -6 41 -130 49 -43 -199 183 24 -55 146 101 164 -122 50
6652E0j8J6p3J7l2J56m2K9j21R2j09n1K57k00K29q4j26j8m8P2k5kP3k16J30K9
$$ 50 32 48 -25 -8 -40 116 74 103 -18 74 -35 -86 171 -29 200 116 -10 -28 -76 -4 -29 -31 42 -174 -44 -15
6678a5r3P1L9j48K02j11QJ85j26R5m1r0K24q1k10J27l0R5l06Q7O9J28j22J16j22
$$ -15 -108 -37 2 -146 56 -55 -47 138 12 107 66 -24 200 119 -91 36 6 101 -205 -118 -49 79 -43 73 -49
6703d9kK4n1L7L3Q5j19m5J62j26J35j70O3M5n2M5j30J48m4q9P8j44J93P0j12M8
$$ -49 -51 -27 -78 -41 -8 77 -42 -87 75 -51 84 -86 -23 22 -30 15 -115 33 -11 -100 -22 -166 27 97 -15 33
6729C3o0J7J3O6j00K0q3J92l7k09J01KJ11j12n1M7m7K29k76J86n6Q9j25O0N0r0
$$ 33 -27 -10 3 69 -31 -11 -94 98 61 -148 -47 -45 66 -46 -97 -50 -97 132 -144 42 -14 75 -50 10 60 -30
6755c0J05q1K1m0R0j71K77j93n9J22N7r7m5Q3n0M2p1J60k56J72l1KN8j25J88n9
$$ -30 75 -6 15 -25 65 -106 171 -22 -81 41 98 1 -44 39 -11 31 -40 120 -136 36 5 7 65 -60 128 69
6781F9K3m4j36J30R1n3k34J98L3o6J0q6K4j9J3Q5j66J67Qq4J5j06O1J8M2J7j15
$$ 69 92 48 -88 42 133 80 -154 44 77 11 21 -65 -41 -60 -47 38 -128 39 47 -37 -22 -128 -67 -49 -7 10 -105
6808a05J67m2j8J04k32L22p3l41K15j53K88k65J13k5K52q9k89K17m9JK6m6ml0
$$ -105 62 20 2 106 -126 196 123 -218 -3 -156 132 -133 -20 -45 207 118 -171 46 -3 -2 24 -22 -26 -56
6832e6lk8N2J20p6L8j19J46k14M1J28j09k3l3O5J95ln1j24J20m4p3J32j20J43
$$ -56 -59 -87 -35 85 9 47 -72 74 -140 -99 29 -80 -103 -136 -71 124 121 70 -54 66 22 -51 81 -39 104
6857A04p4J09j90K2N8O2q0N2l7J5O8o7Q0j16Q1j9L2j12m0J13L3P8j97r6J64j46
$$ 104 30 139 -51 -29 29 91 11 63 26 41 109 42 122 6 87 68 100 -12 -52 61 94 172 -25 -121 43 -103
6883a03J64K6K3j40J8j28J85j15M3J12o5J9j38Q1P0q7Q5r2l7N3J39o5M0n6j2K5
$$ -103 61 87 110 -30 -12 -140 45 -70 -27 85 20 39 -99 -18 52 -35 50 -42 -79 -26 113 48 88 32 20 45
6909D5K2o0m9M8K1Rj77J69l9k4j58K36j58K48k53P0J72k61K32j33J21r1l2rJ95
$$ 45 67 7 -42 6 27 36 -141 28 -11 -35 -193 43 -115 133 -120 -50 122 -139 93 -40 81 -10 -42 -51 144
6934A44k17j03K23J09j70%j3n1rN4J76k89J03KM4k3J10m2j36N2l2R5o8r0O4j5
$$ 144 -73 -176 47 156 -14 -14 -27 -78 -87 -33 143 -146 -43 -41 3 -20 90 48 -88 -36 -68 27 -41 -131 -67 -82
6960h2K6m6K9j1l8N8O3J4m5J68j77rJ52L2j58R2l3r2J00j26N8j36Q4J77n5K5p9
$$ -82 -56 -102 -73 -84 -122 -64 -1 13 -32 136 -41 -50 102 134 -24 68 35 -57 43 -83 -25 -161 -77 100 45 70 -9
6987iP4O4Or8lM0m6m3J36j06k0l3KM7pP9k46J05j4J34k9J4j27l4P2J27r9J61p3
$$ -9 65 129 135 37 34 74 28 -15 121 15 -5 -38 -36 11 4 83 -163 -58 -72 62 33 47 -80 -114 -42 85 -14 147 74
7016G4j21l0J01j82J19J75j88M4NJ10J3j41p3J13K3r9o1Q5q6J23n6J2J47j05j13
$$ 74 -47 -77 24 -158 -39 136 -52 -8 -3 107 120 -21 -94 19 42 -57 -118 -33 -119 4 -52 -40 107 2 -111
7041a11K1K21j78K36j35r3j22J90o4n5R4j31M9J15p4J32j28J46m8L0j00p4J30
$$ -111 -90 131 -47 189 54 -39 -161 29 -35 -90 4 -127 -78 37 -37 95 -33 113 65 95 -5 -79 51
7064E1l9R3r2%Jj87O7J36j44N6K3J89j54j0Q4j95L06k30m6J59k3Op1M6o7m5N4
$$ 51 12 105 13 13 14 -173 -106 30 -114 -58 -35 154 0 -10 74 -121 185 -45 -91 68 45 51 -20 26 -41 -86 -32
7091c2L4Qp1Q7J8j27P5m2N5J58k56J16j8j63J60o7K2N1J8L5j25L4J8Jo4J23ll0
$$ -32 2 10 -61 26 44 -83 -8 -50 5 163 -93 23 5 -158 2 -65 -43 8 26 61 -64 -30 -12 -11 -75 48 45 15
7119A5M6j80R0J3j72J05J05q8j1L9L3K0N3O5k30j5K52k7j85p6pJ73l4n0q8PL1
$$ 15 61 -119 -29 -16 -188 -83 22 -66 -77 -38 -5 15 68 133 -97 -112 140 113 -72 -148 -155 18 -16 -66 -154 -147 -116
7146a16J30J18j36N1J09j20p2j15N1J03q3N8O9j14K7R4RJ2j73J80L2q3j2k9J1
$$ -116 14 132 -4 47 156 36 -36 -151 -100 3 -80 -22 47 -67 -40 54 63 75 -98 82 114 31 19 -10 1
7171AJ15q0j31l5L16r4j98J59j35m2J46m4j0k98J84K04j5r4p4J16n2LM2K31l84
$$ 1 116 36 -95 -130 186 92 -106 53 -82 -124 22 -22 -32 -330 -146 58 43 -51 -125 -9 -61 -58 -16 215 -169
7196a69J85j19J73K9j13M1o4O6J16k53J76o2j73K15p2p4J35J15q4l7J2L4p4n1
$$ -169 16 -103 70 99 -14 27 -37 29 145 -108 68 6 -167 48 -24 -98 37 152 68 31 43 77 3 -48
7220d8J40p3j38Q9m8N1l8R7r8K15j52J4K2N5k16O4Q8J19j17P8j58R8j25j7R5K6
$$ -48 92 19 -119 -30 -78 -27 -65 32 -66 149 -3 11 33 88 -128 -64 24 143 26 104 -54 44 -81 -98 -3 23
7246B3m6KO3k09J22l5n6R9J52n4L6j05K3j6O4L1q0j03K9J98j65o0M2p4J53k8K0
$$ 23 -23 -21 42 -167 -45 -80 -136 -37 115 61 97 -8 15 -1 63 94 14 -89 -60 138 -27 -87 -45 -119 34 6 26
7273B6m0n9o9L35j13j91J35l8N4M7N0j81O8k4j28K39q3j48K77l41J55M8j01J22
$$ 26 -14 -73 -142 193 80 -111 24 -14 40 87 137 -44 24 0 -128 111 28 -120 157 -184 -29 19 -82 40
7297D0R4l10J47J88k34p4K68k9j64N7k6m5N6%K5J61j94M0J55q7k2m4j08J22o5
$$ 40 134 -176 -29 159 -75 -149 119 90 -74 -17 -43 -88 -32 -32 -7 154 -40 0 155 68 46 2 -106 16 -49
7322d9n2J40p2J94j46q0R9K3j6m2Q1m5Qp6p9J35L1rJ7lo2p1J58j09q5J24j25J31
$$ -49 -101 39 -33 161 15 -65 34 57 41 -1 80 35 43 -33 -112 23 54 45 62 59 -3 -74 84 -25 -110 14 -111 20
7350B0m9QJ2O7L2j41O4l6M1j8M4n3P8k0r5L6n6J11qR0m0j33L9P6J10q0k10Q7J01
$$ 20 -29 -21 -9 58 90 -51 13 -23 18 0 44 -9 69 49 -46 -10 -66 45 37 127 87 -46 -7 69 179 99 -111 -24 77
7379G7j45P1Q6j1J45j58j36K17k98J03K04k10L1J6o0J65k1j4K0j62Q3k8K2J44
$$ 77 -68 3 89 78 223 65 -71 146 -152 -49 155 -55 -24 -8 -68 97 76 62 82 -80 3 -25 -3 141
7403A41n8j31R8o2K9J46q6j62K4R9j34o5K46j42L4P0j12J73j2p8P7K0n1N3j44
$$ 141 83 -48 50 -12 17 163 77 -85 -61 38 -96 -161 85 -57 -23 47 -65 108 96 18 95 115 64 117 -27
7428b7O6J8p4M8p1R8l8p9R8j35O2j06L18j29m8K9k0l7N8j85Q6J57K0pKj32j8L6
$$ -27 39 57 -17 31 -40 58 20 -59 39 -96 -34 -140 178 49 1 30 10 -27 31 -154 -68 89 109 102 104 -28 -46 -10
7456a0K8K3n1m8L0p0J76l7J99k98q2J91j96J67j12j22K25K4R1j17l1P9p4j13J47
$$ -10 18 41 -10 -58 -28 -98 78 41 240 -58 -140 51 -145 22 -90 -212 13 37 128 11 -20 59 -15 -128 19
7481A9p7K0K29j96J63j51J77k04R0q8P3n2Q7m5mk8L3L2j01J61k14J14j01K03k09
$$ 19 -58 -38 191 -5 158 7 184 -20 70 -18 55 3 90 45 41 13 46 78 -23 138 -76 38 -63 140 -69
7506f9J39o8K6j12r4J48o1J78l6J9J05j11M5L6l3Lj08K8o0N8p7O8o5rK52j90j67
$$ -69 70 2 28 -84 -178 -30 -91 87 51 70 175 64 109 145 112 115 7 35 -25 33 -44 24 -41 -50 202 12 -155
7533a55J96jj03O6q8R7n4k4J15K8j57J19j51M3pR8P7o7M0j5mJ9l7r4J87k4j49
$$ -155 41 40 -63 3 -85 12 -42 -66 49 77 -80 39 -112 -69 -76 22 99 32 72 57 53 72 35 -59 128 104 -45
7560d5m2K09j95K1J6J62M3j73K0k3q2J37K8j39Q6J4k25K83m0j33L2J7J04k8J22
$$ -45 -87 122 -73 -52 -36 126 169 -4 16 -7 -89 48 76 -63 23 37 -188 95 55 -78 -46 -29 75 47 169
7585A69j33k23O0J65l8n9L9j28R2J0O8K9j95J70j02J44n5P8pq6lk2J27j47k0O9
$$ 169 36 -187 -127 38 0 -59 -20 -148 -56 -46 22 51 -144 26 -76 68 13 91 84 -2 -5 -27 100 -47 -67 2
7611Bj19O8O4l8j46R5Q2l8L5RJ32l6M2j74J4j44K10j96J10J40k27K58j49K9J39
$$ 2 -117 -49 15 -23 -169 -74 8 -30 5 14 146 110 152 -22 -8 -152 58 -138 -28 112 -115 143 -6 23 162
7636A62j83j28K15j07J88n6r7m0j4J6o6%LJ20q7J90k54J68o5l3J17j44k2J20j5
$$ 162 -21 -149 66 -41 147 91 -6 -46 -60 -44 -110 -110 -107 13 -74 116 -138 30 -35 -68 49 -95 -117 3 -12
7661a2M2N4j14k8o7J05p6N1qL9n0J25l3l4R8j08j2j21K39o9j08J54p3q8R7j74
$$ -12 30 84 -30 -58 -125 -20 -96 -45 -53 -14 -64 61 28 -6 92 -16 -28 -149 90 21 -87 67 -6 -94 3 -171
7687a71N6J69k81K60j6Q1l1j58M0L2L3q8R7j0l5J42j77O0r6K02j23J02%k3M5j08
$$ -171 -115 54 -227 33 17 98 67 -91 -51 -19 14 -74 23 13 -22 120 -57 3 -93 109 -14 88 88 65 110 2
7713BK8M7Q5j52j10J05r3J53n9J20k08o1J76K9p0J0P3p4J63m3j40K9j81P2o7J10
$$ 2 30 77 162 10 -100 5 -88 65 6 126 -82 -143 33 62 -8 2 75 1 164 121 -19 10 -171 -99 -166 -56
7739e6j03K28P7k37J35M8j1o1p0Q9r0K7l8P8n1N1j69J65j37K12n3j13P2o2J10
$$ -56 -159 69 146 -91 44 92 81 20 -50 39 -51 -24 -62 16 -35 16 -153 12 -125 87 34 -79 -7 -69 41
7764D1k70L40o8n3r2J77j01P0j10L0P1J3N6k02K4N4J7J35j41J33j9q2K0j19J13
$$ 41 -229 111 43 -10 -102 75 -26 44 -66 -36 35 48 104 -98 -74 -20 -3 132 -9 124 105 23 43 -76 37
7789C7l7N1O7j18j24l9Q8R7N4n6J01p9o3Ko2j43J44J16r2R4r5k6J62j48J79j81
$$ 37 0 51 118 0 -124 -163 -75 22 76 20 121 42 -21 -19 -81 -224 -80 36 -56 38 -57 -83 79 -69 110 -71
7815g1J16m1M5o7M8R8l30L35k61J88j77J91K9j93P8L7N4O0k37J01K4m4L3O5Q8
$$ -71 45 4 49 -18 30 128 -202 133 -128 60 -117 74 103 -90 -12 25 79 139 -98 3 27 -17 16 81 169
7840A69k21J92k84K18j76L0J23j12P2l6p7J04P8Q2j25P6j30J15q3p0K23k34J66
$$ 169 -52 140 -144 74 -102 -72 51 -61 11 -25 -102 2 80 162 37 113 -17 98 15 -55 168 -66 100
7863A00j34q2M5J04j47P4J37j39k2P1M4m7J12o6j1l2J87j21m7k6o6L8Lm4N7l7
$$ 100 -34 -116 -71 33 -114 -40 97 -42 -64 7 51 4 116 50 39 7 194 73 26 0 -66 -28 -25 -69 -12 -49
7889d9L2M0k6mj26J90m9k4Jr0K01n3j42p1J36K2J13j55K7o9P0m5K36j59o4K12
$$ -49 -17 23 -3 -7 -133 57 8 -16 -15 -105 96 43 -99 -170 -34 -12 101 -54 -27 -96 -26 -71 165 6 -58 154
7915A54j41J22j81k7Q5j55J60O7j15L3l8j04K59j88O2R7n7m3nm2K01k46J62r2
$$ 154 13 135 -46 -73 12 -143 17 84 -31 2 -36 -140 119 -69 -7 90 33 -10 -15 -57 144 -102 60 -32
7939c2rp1J26l2j26L41k87K65m9r4R0K4j35J0N1q3L3o2j01J11l8J0Q7q6nj5M9
$$ -32 -41 -112 14 -18 -144 197 -90 175 126 32 122 146 11 21 72 -11 22 -40 -141 -30 -68 -58 29 -57 -62 -77 -28
7966b8R9p3p8J49qo5l4j7P9O2j3r5O7Km5j04K30j15Q5j48O5O4k6j47J13j8K0J05
$$ -28 71 -2 -80 69 61 -4 -38 -55 24 86 73 -22 45 47 2 -102 128 13 98 -50 15 79 53 -94 19 1 21 126
7994A26J7r9p2j27L23j66j17R7m8J02m6j44J61j8N0j41l4J70K3j80J06J09j6p4
$$ 126 143 44 -28 -155 168 2 -115 -18 -66 36 -10 -154 7 -11 39 -102 -136 34 57 -123 -17 92 76 2
8018BK8l1Jk19Q9pJ43l8K3n2J9J64j21J14j88J23N3j25J40j16q8J15k3j6m2J64
$$ 2 30 -1 0 -219 -130 -137 6 -32 -9 -61 -42 122 1 115 -73 50 103 -22 118 2 -86 29 6 -10 -52 112
8044A12r2N1J3q3j01K01p7j45R0K3r7J15o5J39j89J03L0J9q3o5J37J1rk0K12k00
$$ 112 20 71 84 1 -100 101 24 -121 -31 -8 -105 10 -55 84 -105 -2 28 47 -36 -101 36 47 38 18 230 30
8070C0J29j81M1R4j89PM2R6R0Jj83q9J85j05R0j51J08m3Q4Mm8P1l4k17J02J16
$$ 30 159 -22 19 113 -76 -69 -27 69 159 160 -23 -112 73 -32 58 -93 15 -28 56 60 12 83 49 -168 -66 50
8096E0j20K30k68J34m3Rj7p6J06N4j20J72kj43j8LJ79j53M9J4j0Nj0J8j36Q4o3
$$ 50 -70 160 -108 26 -17 -8 -25 -101 5 59 -61 111 109 -34 -52 -49 130 -23 26 40 30 35 25 43 -93 -9 -72
8123g2K7o3Q5Q1j47P5L8k68K77N9k25K06K3j79q8J68J34j2j26j2R3q1j36J24R7
$$ -72 -45 -108 -23 58 -89 -14 24 -244 33 92 -133 73 96 -83 -171 -3 131 119 -7 -19 74 -7 -143 -19 78
8148G8R4k69J39j10K6L0r6LJ25r2L6kq0J14O1j26O2R6j53r7N9N9J1m6K3L3P6j33
$$ 78 172 -97 42 -68 -42 -12 -108 -105 20 -72 -36 -38 -118 -4 57 -69 -7 89 -64 -161 -102 -43 -32 -78 -55 -22 54 -79
8176g9k3J95n5m4J42j45p9P5j93K59o0rmm1O7
$$ -79 -102 93 38 -6 136 -9 -88 -13 -206 53 -7 -16 -20 -61 6
8191F
$$ Imaginary data points
##PAGE= N=2
##DATA TABLE= (X++(I..I)), XYDATA
0@%%%%%%%%%%%%%%%%%%%qJ6j6J6j6J6j9K7l2L3m1M8n0N8o6P4q5R5j07J22j37J52
$$ 0 0 0 0 0 0 0 0 0 0 0 0 0 0 0 0 0 0 0 0 -8 8 -8 8 -8 8 -11 16 -16 17 -24 24 -26 32 -34 40 -45 50 -57 65 -72 80
41H0j68J86k06K26k50K76l04L36l68M06m48M93n44O01o64P37q21R19j034J170
$$ 80 -88 98 -108 118 -132 144 -160 176 -192 214 -234 259 -285 316 -348 389 -432 487 -547 623
61F23j339J549j822K195k732L580n134Q886l3907m7280N2459L5559N819J1405
$$ 623 -716 833 -989 1206 -1526 2054 -3080 5806 -28101 -75381 -22922 12637 18456 29861
75B9861M8576L4459r601l2532q678J225k0356m4270j9585J4674J886k8547j3235
$$ 29861 78437 112896 103295 70763 62085 63310 42954 -1316 -20901 -6227 -4341 -32888 -46123
88d6123J7978J5239k1761l0364K826J5712j3455j9928J9937N2765K7689l081J8069
$$ -46123 -28145 -12906 -34667 -65031 -62205 -46493 -59948 -79876 -59939 -7174 20515 17434 35503
101C5503L8717M638l1002j6813J4819P742j9524j4424J0434J1530j6064l5235
$$ 35503 74220 78858 47856 31043 45862 53604 34080 19656 30090 41620 25556 -9679
113i679j3022Q476j6069l9249j2986J8737J0002j1967N634M1377L5124l87o879
$$ -9679 -22701 -14225 -30294 -69543 -82529 -63792 -53790 -65757 -60123 -18746 16378 15991 9112
126I112J7838K0708j3772k3673J1627K7074O79j7204j095J3975p162l3135k1890
$$ 9112 26950 47658 33886 10213 21840 48914 49593 32389 31294 45269 38107 4972 -16918
139a6918L213J950k0029k0945Q687J9459o696j5658J1856K8372M730j6664L287
$$ -16918 -13705 -11755 -31784 -52729 -44042 -24583 -31279 -46937 -35081 -6709 -1979 -18643 -15356
152a5356K5030P788j2416J092K5699J9892j0269j3581R245P721k0110k6598k675
$$ -15356 9674 17462 5046 6138 31837 51729 41460 27879 37124 44845 24735 -1863 -4538
165d538J0482r330k3830n799J1790K171j7126q589K0061J7706r940r042J7266
$$ -4538 5944 -3386 -27216 -33015 -21225 -19054 -36180 -44769 -24708 -7002 -16942 -25984 -8718
178h718K0418m444j2004J3774K4598L94j4496R09J5165J69k1796j1797R779K458
$$ -8718 11700 7256 -4748 9026 33624 34018 19522 20431 35596 35765 13969 2172 11951 14409
192A4409j9549j8221M902J0353j0666j5129P799J7427n87j5637j414J8215O359
$$ 14409 -5140 -23361 -18459 -8106 -18772 -33901 -26102 -8675 -9262 -24899 -26313 -8098 -1739
205a739j1708J267K4656J8286o513o824J3378R656j5032j9504j005Q471p443j9384
$$ -1739 -13447 -12180 12476 30762 24249 17425 30803 40459 25427 5923 4918 13389 5946 -13438
219a3438k001J4670J964j5708p828J1762N472j6997j2624J1185J5584j204n238
$$ -13438 -15439 -769 1195 -14513 -22341 -10579 -5107 -22104 -34728 -23543 -7959 -9163 -14401
232a4401J5789K4354K248j3990j207J1165k758k0537p363J4368P737j0347o778
$$ -14401 1388 25742 27990 14000 12793 23958 21200 663 -6700 7668 15405 5058 -1720
245a720J0045Q881j2815j9906j652P046p438j5847K394K1451J0480o945L110J7559
$$ -1720 8325 17206 4391 -15515 -17167 -10121 -17559 -33406 -31012 -9561 919 -6026 -2916 14643
259A4643O863j3575j3237O598R068q187q647J1331J8336L59j4298j881Q241p460
$$ 14643 21506 7931 -5306 1292 10360 2173 -6474 4857 23193 23552 9254 7373 15614 8154
273H154k1909j0229Q380O699q285l235J6378J5757m583j1798L202J0309p786j7400
$$ 8154 -13755 -23984 -15604 -8905 -17190 -20425 -4047 11710 7127 -4671 -1469 8840 1054 -16346
287a6346K146J6640O018p166K133J6746O232j4877j3172K764L484j2446j3911
$$ -16346 -14200 2440 8458 1292 3425 20171 26403 11526 -1646 1118 4602 -7844 -21755
300b1755P808J6415K09q178M128J3138n45j7055p642Q831M060r137m745J4692
$$ -21755 -13947 2468 2677 -5501 -1373 11765 11220 -5835 -13477 -4646 -586 -9723 -14468 224
314B24J5917m681q967O037Q095r001j7756k839J0608K83j0036J281J4847Q955
$$ 224 16141 11460 2493 8530 16625 7624 -10132 -12971 -2363 -2080 -12116 -10835 4012 12967
328A2967r153q446Q005N946j1234j1876N811J2986p65q804N571J4088N24j3431
$$ 12967 3814 -4632 3373 9319 -1915 -13791 -7980 5006 4241 -4563 1008 15096 15620 2189
342B189o638P796J678j4506q001J0464R735n565p539P931J1899m751j2421Q64
$$ 2189 -4449 3347 5025 -9481 -17482 -7018 2717 -2848 -10387 -2456 9443 4692 -7729 -6865
356f865J0156R84j1083r89J4736O934q194m930R174P055j0112j2263L469P285
$$ -6865 3291 4275 -6808 -7797 6939 13873 5679 749 9923 16978 6866 -5397 -1928 5357
370E357n997j1800P64J1872O63j1282j649J1257L844j0009n819J0068Q763o556
$$ 5357 -640 -12440 -11676 196 859 -10423 -12072 -815 3029 -6980 -12799 -2731 6032 -524
384e24n926Q097J2018j476r667K820J1383j548j3445m303P814J263j3068o931
$$ -524 -6450 1647 13665 12189 2522 5342 16725 15177 1732 -2571 5243 6506 -6562 -13493
398a3493Q693O192o992q230N745R919n036j1249K635J1127J088q429J926J4624
$$ -13493 -4800 1392 -5600 -13830 -8085 1834 -3202 -14451 -11816 -689 399 -8030 -6104 8520
412H520O906o918k817Q674N513r575j1832K724O642o558j0676K041J0904k91j1712
$$ 8520 15426 8508 5691 14365 19878 10303 -1529 1195 7837 1279 -9397 -7356 3548 3257 -8455
427h455k509P679k90j1484o091R126R353l177k205J1324J3085j452q850J900Q480
$$ -8455 -10964 -3285 -3575 -15059 -21150 -12024 -2671 -5848 -8053 3271 16356 14904 6054 7954 16434
442A6434l693j2446k206R010L353q660m004Q329L999j0820j2122M33M544p556
$$ 16434 12741 295 -1911 7099 10452 1792 -2212 6117 10116 -704 -12826 -12393 -7849 -15405
456a5405j0192O015J4352M178l830L514J2395L381j0220n476P435N426n679n568
$$ -15405 -25597 -19582 -5230 -1052 -4882 -1368 11027 14408 4188 -1288 6147 11573 5894 326
470C26Q974J0678m166r705m4M350p026j6064o141N924P38p451p88J2564J0176
$$ 326 9300 19978 15812 6107 6063 10413 3387 -12677 -18818 -12894 -12156 -19607 -20395 -7831 2345
485B345m642n559O494O365n588p769N089J3190L430m340L552J0843J369j1993
$$ 2345 -2297 -7856 -1362 5003 -585 -8354 -3265 9925 13355 9015 12567 23410 24779 12786
499A2786r234K793o02j2849r356M370P390l856o685M520R308k544j0438j884Q377
$$ 12786 3552 6345 5743 -7106 -16462 -12092 -4702 -8558 -15243 -10723 -1415 -3959 -14397 -16281 -7904
514g904L261o058K005J5056J1003j993l049O263N523q444j1968n04N356l254j0415
$$ -7904 -4643 -10701 -8696 6360 17363 15370 12321 18584 24107 15663 3695 3191 8547 5293 -5122
529e122j139Q539P7j0690n358N096J495r430p230O539R020m92j629Q904J3806
$$ -5122 -6261 2278 2355 -8335 -13693 -8597 -7102 -16532 -23762 -17223 -8203 -8695 -10324 -1420 12386
544A2386K648p198O89Q022n14r160l424P888M438p331o451L577K773q213j2050
$$ 12386 15034 7836 8525 16547 16033 6873 3449 11337 15775 8444 1993 5570 8343 130 -11920
559a1920q50N333m672r855Q80J0239M103m968J623J1770O783m935l743O524P718
$$ -11920 -12770 -7437 -12109 -21964 -21084 -10845 -6742 -11710 -10087 1683 8466 3531 -212 6312 14030
574A4030l562o149N933Q890j921r256j989N036l062j2412n822M100J120q380o446
$$ 14030 10468 4319 10252 19142 17221 7965 5976 11012 7950 -4462 -10284 -6184 -5064 -13444 -19890
589a9890N679P202l412m426O407R831P7o367K412R572K634n016M48R253N357o440
$$ -19890 -14211 -7009 -10421 -14847 -8440 1391 1468 -4899 -2487 7085 9719 4703 5151 14404 19761 13321
605A3321o376L858K850q575j0234L38M232m776r657K91P337J595o612q35Q971
$$ 13321 6945 10803 13653 5078 -5156 -4818 -586 -5362 -15019 -14728 -7391 -5796 -12408 -13243 -4272
620d272M423o635l466P592P632j669l105P814J0040j371p429q61M873k713j1324
$$ -4272 151 -6484 -9950 -2358 5274 3605 500 8314 18354 16983 9554 8693 13566 10853 -471
635d71m676N114J509p683n098N353N193n423o620K939N506k554o838K248J0829
$$ -471 -5147 -33 1476 -6207 -11305 -5952 -759 -6182 -12802 -9863 -4357 -6911 -13749 -11501 -672
650f72M464k803K993J0070M119p260o263L541J956o728o692L067O825k362q052
$$ -672 3792 989 3982 14052 18171 10911 4648 8189 10145 3417 -3275 -208 6617 4255 -3797
665c797Q6N144k665r937m150N664K267n721j134R828Q928n46k726N386O941m088
$$ -3797 -3711 1433 -1232 -11169 -15319 -9655 -7388 -13109 -14243 -4415 4513 3967 1241 6627 13568 9480
681I480q627R6O553M83o141L14Q129J662q071o579J656Q06q235q184L318O856
$$ 9480 853 949 7502 7985 1844 2158 10287 11949 3878 -2701 -1045 -239 -8474 -16658 -13340 -6484
697f484q67l705M356J0008J547o224n00N955J328n972k762P546P147k736l260
$$ -6484 -7351 -11056 -6700 3308 4855 -1369 -1869 4086 5414 -558 -3320 4226 11373 8637 5377
712E377M249M577n358j0753k389L457l160p552m59P689L791n102k210O165L729
$$ 5377 9626 14203 8845 -1908 -4297 -840 -4000 -11552 -12011 -4322 -531 -5633 -7843 -1678 2051
727B051n305n549L820O985j486l850M993R295J539n469j531M945q83r403n496
$$ 2051 -3254 -8803 -4983 2002 516 -3334 1659 10954 12493 7024 5493 10438 9555 152 -5344
742e344L785L311m699m456N052N642l724o849N54M998j337o808M65Q015L635l016
$$ -5344 -1559 1752 -2947 -7403 -2351 3291 -433 -7282 -6728 -1730 -3067 -9875 -9410 -1395 2240 -776
758g76m74P439M982m725n347K902L523m318o560J257O652o24n900o11N368N00
$$ -776 -1250 6189 11171 6446 1099 4001 7524 3206 -3354 -2097 4555 3931 -1969 -2580 2788 3288
774C288p665m269M591K876m685l385N397P074j551m344L239O516j052o425r17
$$ 3288 -4377 -8646 -4055 -1179 -5864 -9249 -3852 3222 1671 -2673 566 7082 6030 -395 -1312
789a312N702J072o679j797N823L469m439m704L299M141m790o619J148N189m69
$$ -1312 4390 5462 -1217 -3014 2809 6278 1839 -2865 434 4575 -215 -6834 -5686 -497 -966
804i66n616R95P604J871m559j364N204L239n426m750L716M238k816m905K294O648
$$ -966 -6582 -5587 2017 3888 -671 -2035 3169 6408 982 -3768 -52 4186 1370 -3535 -1241 5407
820E407r84o090l27M794k49o861l157N224L173l935k286N427N665k197n154J964
$$ 5407 4423 -1667 -1994 2800 2551 -4310 -7467 -2243 930 -3005 -5291 136 5801 3604 -1550 414
836D14N029k394o633m08O058J426n118o03N924K535n082m961K338L070m628n536
$$ 414 5443 3049 -3584 -3992 2066 3492 -1626 -2229 3695 6230 1148 -3813 -1475 1595 -3033 -8569
852h569K739O442O47m241J970O756P28o122k452L894J742m577l563M942N464k364
$$ -8569 -5830 612 1259 -2982 -1012 5744 6472 350 -2102 1792 3534 -1043 -4606 336 5800 3436
868C436m160K165M381k950p613j244L998j06m716l87O523M670l522k256L937L348
$$ 3436 -724 1441 5822 2872 -4741 -5985 -1987 -2093 -6809 -7196 -673 3997 475 -1781 2156 5504
884E504m219n632J757N571q90l834K134O527J198n625k878L266j72o697m532L470
$$ 5504 1285 -4347 -2590 2981 2091 -1743 391 6918 8116 2491 -387 2879 2707 -3990 -8522 -5052
900e052M632k459l025M373N707j319n370m91M489m70n340k14O219M112k557j908
$$ -5052 -420 -2879 -5904 -1531 4176 2857 -2513 -3004 1485 1015 -4325 -4539 1680 5792 3235 1327
916A327M892L206n037o073M35K594k668n672J147N950J400m220j032M661J515
$$ 1327 6219 9425 4388 -1685 -1250 1344 -1324 -6996 -5849 101 1501 -2719 -3751 910 2425
931B425n871l651L920L600j986k163M453O619k18m334N66L842j329o999k592M098
$$ 2425 -3446 -7097 -3177 423 -1563 -3726 727 7346 7128 2794 3360 7202 5873 -1126 -3718 380
947C80J527m440k022M232L561l735n030J725L442k673m983J132O257J935l135
$$ 380 1907 -2533 -4555 -323 3238 -497 -5527 -3802 -360 -3033 -8016 -6884 -627 1308 -1827
962a827J133O720K270m058l115K958K423m461m122K205M251j707m880M21M303
$$ -1827 -694 6026 8296 4238 1123 4081 6504 2043 -2079 126 4377 2670 -2210 -1789 2514
977B514j413o205k064L380J122m309j853N443M673j439k026L885M815j294m854
$$ 2514 1101 -5104 -7168 -3788 -2666 -6975 -8828 -3385 1288 -151 -2177 1708 6523 5229 375
992C75J074M485k92m732k31M823J264m899l032K454J296m816n448J494L523k506
$$ 375 1449 5934 5642 910 679 5502 6766 1867 -1165 1289 2585 -2231 -7679 -6185 -2662 -5168
1008e168m017K272N716J407l646P54N559J817m159j688M380L561k694k544L308
$$ -5168 -9185 -6913 -1197 210 -3436 -2682 2877 4694 535 -1153 3227 6788 4094 1550 4858
1023D858M095k355n077k59K636k437o565j775L237O46l953j612M650L651k724
$$ 4858 8953 6598 1521 1262 3898 1461 -5104 -6879 -3642 -2996 -6949 -8561 -3911 -260 -2984
1038b984k467L181L887j551l708K526N878R96k793J031M822J406n329l276K148
$$ -2984 -5451 -2270 1617 66 -3642 -1116 4762 5758 2965 3996 8818 10224 4895 1619 3767
1053C767M05n390m273J787L318k266m047J819L900q06m845n21M394J189l288Q4
$$ 3767 4172 -1218 -5491 -3704 -386 -2652 -6699 -4880 -980 -1786 -6631 -7152 -2758 -1569 -4857 -4773
1069d773N824M589j193j479L906L174l187m884k53K571j493m847k93M177M29m393
$$ -4773 1051 5640 4447 2968 6874 10048 6861 1977 1724 4295 2802 -2045 -2338 1839 2268 -2125
1085b125k572K557Q80m809l550K600L665n93j715L548O711P45l028L48L647K06
$$ -2125 -4697 -2140 -1260 -6069 -9619 -7019 -3354 -3947 -5662 -2114 4597 5342 2314 2662 6309 6515
1101F515m846j896L739K212k960k140K468K386l579n623r8J797k293m792J63N130
$$ 6515 1669 -227 3512 5724 2764 624 3092 5478 1899 -3724 -3822 -2025 -4318 -9110 -8947 -3817
1117c817J891k424O80N104K748k747k823K558L266k035k803K659M943j31l855
$$ -3817 -1926 -4350 -3670 1434 4182 1435 -1388 1170 4436 2401 -402 2257 7200 7069 3214
1132C214p1K768j719o009l269J901J170l640k321L823L814j597k767J963M044
$$ 3214 3143 5911 4192 -1817 -5086 -3185 -2015 -5655 -7976 -4153 -339 -1936 -4703 -2740 1304
1147A304j146l821R17M590J615k381L71M847K720l485l223J517R17l703n261J010
$$ 1304 158 -3663 -2746 1844 3459 1078 1449 6296 9016 5531 2308 3825 4742 1039 -4222 -3212
1163c212L112j379l389N67L844O0m262j319L472J520k651j632M286M445q58j733
$$ -3212 -100 -1479 -4868 -4301 -457 -397 -4659 -5978 -2506 -986 -3637 -5269 -983 3462 2604 871
1179H71L222L746j111m204q26K786q89m623j184L047J651l648k792K583J616l415
$$ 871 4093 7839 6728 2524 1698 4484 3595 -1028 -2212 835 2486 -1162 -3954 -1371 245 -3170
1195c170l782J243L515o52k779K005N105J371k232J64L841J691l481k272K338
$$ -3170 -6952 -5709 -2194 -2846 -5625 -3620 1485 2856 624 788 4629 6320 2839 567 2905
1210B905K022k466l156J731L126j778l968o71K431j062m644j331L388J584k439
$$ 2905 4927 2461 -695 1036 4162 2384 -1584 -2255 176 -886 -5530 -6861 -3473 -1889 -4328
1225d328j060L808L776j468k133K463L302j136l572P47L756K53l372n3L607N37
$$ -4328 -5388 -1580 2196 728 -1405 1058 4360 3224 -348 399 4155 4408 1036 983 4590 5127
1241E127l702l213J710Q41l746l031J708K829n20k758J635M169J45l066j18L193
$$ 5127 1425 -1788 -78 763 -2983 -6014 -4306 -1477 -1997 -4755 -3120 1049 1194 -1872 -1990 1203
1257A203J240l172j127L562K837j533k073K281K695k384m437l76J912j054l672
$$ 1203 2443 -729 -1856 1706 4543 3010 937 3218 5913 3529 -908 -1284 628 -426 -4098
1272d098l99L721J486k735q89K525J957k665l106K026L053j137k022J830M482
$$ -4098 -4497 -776 710 -2025 -2914 -389 1568 -1097 -4203 -2177 876 -261 -2283 -453 4029
1287D029M86k878k35K873l86m246k438K147J899k722j627K454L134j363l472O10
$$ 4029 4515 1637 1402 4275 3889 -357 -2795 -648 1251 -1471 -3098 -644 2490 1127 -2345 -1735
1303a735K319j199l467L7L475J964k083j38L822K315k622k870J181J861k410l612
$$ -1735 584 -615 -4082 -4045 -570 1394 -689 -827 2995 5310 2688 -182 999 2860 450 -3162
1319c162J050L673n9k621M1L039M55l890k131J915J472k349j504L002L603p73
$$ -3162 -2112 1561 1502 -1119 -1078 1961 2416 -1474 -3605 -1690 -218 -2567 -4071 -1069 2534 1761
1335A761j714J264K788j129l927p45K887K17k887p31L488K126k528k341J603J911
$$ 1761 47 1311 4099 2970 -957 -1702 1185 1402 -1485 -2216 1272 3398 870 -1471 132 2043
1351B043k873l363O05L170m30j897J202L715J099k538j368K456Q65l069k130K117
$$ 2043 -830 -4193 -3588 -418 -848 -2745 -1543 2172 3271 733 -635 1821 2686 -383 -2513 -396
1367c96K672j162k053J512K885j164l484r87K456m27l396p14L174K008j566j142
$$ -396 2276 1114 -939 573 3458 2294 -1190 -2177 279 -148 -3544 -4258 -1084 924 -642 -1784
1383a784K591K581j919l058J024K275p62k725L80L620Q90k814p62K587O06l120
$$ -1784 807 3388 1469 -1589 -565 1710 948 -1777 -1397 2223 3113 299 -463 2124 2730 -390
1399c90k602J529J883j847k383J775L437p9k823P43L072k19l002j157K809J319
$$ -390 -2992 -1463 420 -1427 -3810 -2035 1402 1323 -1500 -757 2315 2096 -906 -2063 746 2065
1415B065k299j141K681K328j538k733R80J834j781l302r3K614M67k448l94L194
$$ 2065 -234 -1375 1306 3634 2096 -637 343 2177 396 -2906 -2999 -385 82 -2366 -2760 434
1431D34J577k014j604J845J921k007k479J624K830m70j988O50L046Ol130j149
$$ 434 2011 -3 -1607 238 2159 152 -2327 -703 2127 1657 -331 319 3365 3371 241 -908
1447i08J643K55k898k007K166K219j773j398J843K698r11k724K96K487L6k683
$$ -908 735 990 -1908 -3915 -1749 470 -1303 -2701 -858 1840 929 -1795 -1499 988 1024 -1659
1463a659J88K850K004j778j009K224J409k357l014M66J714j740k633O12K621N05
$$ -1659 -1471 1379 3383 1605 596 2820 4229 1872 -1142 -676 1038 -702 -3335 -2723 -102 403
1479D03k394k82K466P03k641j639J888K196j140j460K586L204m71j767J43K211
$$ 403 -1991 -2273 193 896 -1745 -3384 -1496 700 -440 -1900 686 3890 3419 1652 1795 4006
1495D006n84l796r94K014M12k404j055K284J713k090k383Q25J496j345k747O74
$$ 4006 3422 -374 -1368 646 1058 -1346 -2401 -117 1596 -494 -2877 -2052 -556 -1901 -4648 -3974
1511c974L319P94j604R46L356J515k169j496J709J108k127k442J460K400p34k458
$$ -3974 -655 139 -1465 -519 2837 4352 2183 687 2396 3504 1377 -1065 395 2795 2061 -397
1527c97M03J993q21l512j546J880J15k460n94K672K599o87j062K089K275j109
$$ -397 6 1999 1178 -2334 -3880 -2000 -1885 -4345 -4939 -2267 332 -355 -1417 672 2947 1838
1543A838k295L14K467K01k232J94L013O94k051j582R15M85k908l109J004J590
$$ 1838 -457 -143 2324 2525 293 487 3500 4194 2143 561 1476 1961 -947 -4056 -3052 -1462
1559a462q80j672J059L213J29k143n1K330N82j961j062K587K269j026j034J941
$$ -1462 -2342 -4014 -2955 258 387 -1756 -1807 523 1105 -856 -1918 669 2938 1912 878 2819
1575B819K322j517l124j0J241j193l076n17K175R24k274q00K132J257j972j851
$$ 2819 5141 3624 500 490 1731 538 -2538 -3055 -880 44 -2230 -3030 -898 359 -1613 -3464
1591c464J275K190q63j505J442L195O57j572M11K244M7k605j685J331Q45k228
$$ -3464 -2189 1 -862 -2367 -925 2270 2927 1355 1766 4010 4057 1452 -233 1098 1943 -285
1607b85j943J574J778j349k054J18J870p46k642n9K397R28j479j72L079K184j253
$$ -285 -2228 -654 1124 -225 -2279 -2161 -291 -1037 -3679 -3738 -1341 -413 -1892 -2064 1015 3199 1946
1624A946j250J785J473j551k504N17J773m88k235n1J811K90k624j482J559K83
$$ 1946 696 2481 3954 2403 -101 416 2189 1701 -534 -585 1226 1516 -1108 -2590 -1031 -748
1640g48j989j717J563K369q53j041J701K743K10j803R7K332o4k216o04K115R28
$$ -748 -2737 -4454 -2891 -522 -1375 -2416 -715 2028 2238 435 532 2864 2800 584 -20 2095 3023
1657C023j532j625J493J258k028k658o6J203p66k368J88K667N98j331j23K556
$$ 3023 1491 -134 1359 2617 589 -2069 -2135 -932 -1698 -4066 -3878 -1211 -613 -1944 -2067 489
1673D89J339j736j020J499J669r39j461J364K317j74k025j14J488n47l223j307
$$ 489 1828 92 -928 571 2240 1301 -160 1204 3521 3347 1322 1208 2696 2149 -1074 -2381
1689b381J115O24j888j075J778J935r47j652J030K117o86k233N78K466Q20j399
$$ -2381 -1266 -642 -2530 -3605 -1827 108 -839 -2491 -1461 656 -30 -2263 -1685 781 1601 202
1705B02K59K469J278j602j672R81P32k140k200M51J503m68k027O07J921k14k155
$$ 202 461 2930 4208 2606 934 1915 2647 507 -1693 -1242 261 -207 -2234 -1627 294 80 -2075
1722b075q03J528P93j826n88K027K354l84j013J398K213p10k244k21J500l33k087
$$ -2075 -2878 -1350 -557 -2383 -2971 -944 1410 1026 13 1411 3624 2914 670 449 1949 1616 -471
1739d71m79J852R25j867r38J121P02j917k210P09J716o56j244Q95K634Q55j500
$$ -471 -950 902 1827 -40 -978 143 845 -1072 -3282 -2573 -857 -1513 -2757 -1862 772 1627 127
1756A27k21J941M14j969j172J357J399j161j176J486J487o41k383k03J347n68
$$ 127 -94 1847 2261 292 -880 477 1876 715 -461 1025 2512 1871 -512 -715 632 64
1772F4k657n33J867R41j342k52K067J560j306j346R77J248n92j997P47K364N5
$$ 64 -2593 -3126 -1259 -318 -1660 -1912 155 1715 409 -937 40 1288 696 -1301 -554 1810 1865
1789A865j463j19J626M22k095j524R69O82j555j594J186K110n41j246P32J612
$$ 1865 402 283 1909 2331 236 -1288 -319 363 -1192 -2786 -1600 510 -31 -1277 -545 1067
1805A067k33j894m90J857O05j422m04J901J520j079j487Q78J236j288k107O4J527
$$ 1067 834 -1060 -1550 307 912 -510 -914 987 2507 1428 -59 819 2055 767 -1340 -1276 251
1822B51k87j820L5K103O27j429q38J501O49j412j385J187J681l06j217R87K081
$$ 251 -36 -1856 -1821 282 909 -520 -1358 143 792 -620 -2005 -818 863 557 -660 327 2408
1839B408j40j914m07J193M61k232j113J599P91j197r97J036J801r89j803L66J388
$$ 2408 2268 354 -53 1140 1601 -631 -1744 -145 646 -551 -1548 -512 1289 300 -1503 -1137 251
1856B51m03j485m7K137P84j180l59J624J205j503j588P18J216j180j534N18J790
$$ 251 -152 -1637 -1684 453 1237 57 -302 1322 2527 1024 -564 154 1370 190 -1344 -826 964
1873I64n9j547n3J390J73j741j043J191R09j305p93J719J580l75j291O50J482
$$ 964 905 -642 -695 695 868 -873 -1916 -725 184 -1121 -1914 -195 1385 1010 -281 369 1851
1890A851n38j917o7J391J92j517m96J861Q81j268j226P67R91j150j802N38J729
$$ 1851 1313 -604 -671 720 912 -605 -1101 760 1641 373 -853 -86 905 -245 -2047 -1509 220
1907B20j87j257M26K032O50j801m92J199L97j599q27Q95J511o72j211Q55J274
$$ 220 33 -1224 -798 1234 1884 83 -409 790 1187 -412 -1239 -344 1167 495 -716 139 1413
1924A413k38j785n27J253r3j709k18J514J198p32p97J434J405j356j398K40J247
$$ 1413 1175 -610 -1137 116 23 -1686 -1904 -390 808 76 -721 713 2118 762 -636 -396 851
1941H51n15j449L67J686M82j469l60J211M07j664j381Q17J027q19j249J348J865
$$ 851 336 -1113 -746 940 1422 -47 -407 804 1211 -453 -1834 -1017 10 -809 -2058 -710 1155
1958A155k01j369K94J306J85j851m22J293P55r00p25J392J145q88j620K94Q20
$$ 1155 954 -415 -121 1185 1370 -481 -903 390 1145 245 -480 912 2057 1169 -451 -157 663
1975F63p08k092J07J635K05j129j73J757Q35j180r11R85R71j024j064R34J755
$$ 663 -45 -2137 -2030 -395 -190 -1319 -1492 265 1100 -80 -991 -6 965 -59 -1123 -189 1566
1992A566j47j059L58J441p5k111n14O87K65j443j054J328J020p21j166R36J288
$$ 1566 1419 360 718 2159 2084 -27 -541 146 411 -1032 -2086 -758 262 -459 -1625 -689 599
2009E99o07j668L03J458L15j256K03J882Q47r97o15R99R06j399j497L42J098q90
$$ 599 -8 -1676 -1373 85 400 -856 -653 1229 2076 1079 464 1463 2369 970 -527 -185 913 23
2027B3j094J65J377P6j722k71J217K09j540p44J076J300m85n33J277J401k12r69
$$ 23 -1071 -906 471 547 -1175 -1446 -229 -20 -1560 -2304 -1228 72 -413 -946 331 1732 1520 551
2045E51O2J169j93j619m47J483M11j226q94J259N07j269j462M45J048q83j416
$$ 551 613 1782 1589 -30 -477 1006 1417 191 -703 556 1063 -206 -1668 -1223 -175 -1058 -2474
2062b474P55J517K78r09K14J696N59j213n26Q31Q47r18j032R19J424p11j338J56
$$ -2474 -1719 -202 76 -833 -619 1077 1636 423 -103 728 1575 657 -375 544 1968 1257 -81 75
2080G5J160m15j909o10J119J52j203n61J265J317o36q67J099J242o76j159K66
$$ 75 1235 820 -1089 -1699 -580 -428 -1631 -2192 -927 390 -246 -1113 -14 1228 552 -607 -341
2097c41J507J63j279P7J574L66j407q66P75L48j301j441N30J003m91j188O36J599
$$ -341 1166 1329 50 127 1701 2067 660 -206 569 917 -384 -1825 -1295 -292 -783 -1971 -1335 264
2115B64j29j208M1J291M10j401k88J475R49n94o60J169J188q49j500R5P77p16
$$ 264 135 -1073 -1032 259 669 -732 -1020 455 1404 810 150 1319 2507 1658 158 253 1030 314
2133C14j516j73J138L67j228l19J012N77j043j147R30J165o07o95O92J611N87
$$ 314 -1202 -1375 -237 130 -1098 -1417 -405 172 -871 -2018 -1088 77 -530 -1225 -533 1078 1665
2150A665j196K68J367J1j583p15Q05M54j227r25R49Q85o72j376K65P34m34j374
$$ 1665 469 737 2104 2115 532 -183 622 1076 -151 -1076 -127 758 86 -1290 -1025 -291 -725 -2099
2168b099K9J308L24p34J93J432R30n81o60R24P58q01j084M43R66j55j170NJ095
$$ -2099 -2070 -762 -438 -1172 -979 453 1383 802 142 1066 1824 1023 -61 382 1348 1193 23 28 1123
2187A123j47j485p66P18K84j461p62J038J229l94n20Q12J161r4r37j6J153K49
$$ 1123 976 -509 -1275 -557 -273 -1734 -2496 -1458 -229 -623 -1143 -331 830 736 -201 -217 936 1185
2205A185r61k46J278O53r42o13O80N06j073j380N4P42o43r60L13J085L51r65m18
$$ 1185 224 -22 1256 1909 967 354 1034 1540 467 -913 -859 -117 -760 -1720 -1407 -322 29 -936 -1354
2224a354J344K97p50n12P47J203n98n59Q80J183k26j021r5P41j3j780l82P26K64
$$ -1354 -10 287 -463 -975 -228 975 377 -182 698 1881 1655 634 539 1280 1267 -513 -895 -169 95
2243I5p74p14Q51J008r50q93O40P74l68q54K51J279L44p05K31R82N87q75q60O05
$$ 95 -679 -1393 -542 466 -484 -1377 -737 37 -331 -1185 -934 345 689 -16 215 1197 1784 909 49 654
2263F54N51r87r79M29R66l80r58P9Q75R2j331l62Q17L33o45k99Q32J142m68o11
$$ 654 1205 218 -761 -332 634 254 -704 -625 250 342 -989 -1351 -534 -201 -846 -1145 -313 829 361 -250
2283b50P56J188p29j032J13O25O7j123j83J127K45q51p21N43O78r47j121N97P95
$$ -250 506 1694 965 -67 46 671 738 -385 -568 559 804 -47 -768 -225 453 -494 -1615 -1018 -223
2302b23j91o88M43J471Pq16j46J078J48j012n34Q29N58p42n00N63Q14l71j305
$$ -223 -414 -1102 -659 812 819 3 -143 935 1083 71 -463 366 924 182 -318 245 1059 688 -617
2321f17qR28n16r80l39R87M64p39j45J235P81p45p49M24Q84o26q37P27Q90J13
$$ -617 -625 303 -213 -1193 -1532 -545 -81 -820 -965 270 1051 306 -443 -19 865 239 -598 129 1019 1132
2341A132q45j47R90j6j149p72M53N21r22p72P14P71j51o54M24R87j58j068j40
$$ 1132 287 140 1130 1114 -35 -807 -354 167 -755 -1527 -813 -42 -193 -847 -423 564 406 -662 -802
2360h02R84M18p47r1J016O61o70o11L66O30o25j331K72P61l31p21q9J015M59j010
$$ -802 182 600 -147 -238 778 1439 769 158 524 1154 529 -802 -530 231 -100 -821 -910 105 564 -446
2380d46m81R17L11r24m52O12J023l34m97N54R04j84r79j56R46j45j003l64Q48
$$ -446 -927 -10 301 -623 -1075 -463 560 226 -271 283 1187 1003 24 -132 814 669 -334 -698 150
2399A50M64n54p85P62N99n93r91K45Q97l93q64J55J426K54p35l73R35N39r03n35
$$ 150 614 60 -725 37 636 43 -948 -703 194 -199 -1063 -908 518 772 37 -336 599 1138 235 -300
2419c00L45N36m34q40M64R08k14r68J47N87K51j081m31O49N11m10m25Q49Q60m09
$$ -300 45 581 147 -693 -229 679 465 -503 -356 231 482 -599 -1030 -381 130 -280 -705 144 1004 595
2439E95q35K91Q16m03q48M7O96J50o84j37O58L56o21p82N50N76q94n55M19P57
$$ 595 -240 51 867 464 -384 -337 359 509 -175 -312 346 702 81 -701 -151 425 -469 -1024 -605 152
2459A52qp09L45J025M2q99l22Q56J42o63n78P42O33m32p04K84Q21m91j017p5P16
$$ 152 144 -565 -220 805 847 -52 -374 482 624 -39 -617 125 758 326 -378 -94 727 236 -781 -856 -140
2480a40rr41j23J128M37n01l38Q92M23n10o13M27O61k55p76K18Q33J83r15l04
$$ -140 -149 -1090 -1213 -85 352 -149 -487 405 828 318 -295 132 793 538 -238 -20 813 996 81 -223
2500b23N35J51p76n96L78N01n23o34P91P07j92p34L09Q46l22p58J97O90M60o91
$$ -223 312 463 -313 -909 -531 -30 -553 -1187 -396 311 119 -615 -306 540 218 -540 -343 347 807 116
2520A16l59J034N91q08n54K01M60m62r89mR13j61o96p8P85K58n47n05O67N40p12
$$ 116 -243 791 1382 574 20 221 681 219 -770 -774 139 -22 -718 -796 -11 247 -300 -805 -138 402 -310
2541c10m89O55R59k48m84K42Q07o2j106l04O74L7p31l28O17M80m97o13K94O93
$$ -310 -799 -144 815 567 83 325 1132 1070 -36 -340 334 371 -360 -688 -71 409 -88 -701 -407 286
2561B86m93o79JQ08J6m20l6R86L32m89k52N63N23p46p29N15M72m29p50K29P91
$$ 286 -207 -886 -885 -77 -61 -481 -517 469 801 312 60 623 1146 400 -329 186 658 229 -521 -292 499
2582D99j48p24k18M82Q9p63k37O20M75l56k03N94Q21k82q70L65N88r1o43r1N36
$$ 499 351 -373 -591 -109 -20 -783 -1020 -400 75 -281 -484 110 931 649 -221 144 732 641 -2 -93 443
2603D43K49p57j74M99K43o10q13K82M73k90o42L37P19L05o72K23O95K30o69k73
$$ 443 692 -65 -239 260 503 -107 -920 -638 -165 -455 -1097 -760 -41 264 -408 -185 510 740 71 -202
2623b02N03N04l61n55M46P15l64q90L64L40l89q07j39M40J32l67k02L85M21k72
$$ -202 301 805 444 -111 335 1050 686 -204 160 500 111 -696 -835 -395 -263 -630 -832 -447 -26 -298
2643b98n23P07N41k58o66N71P46k02m87R2P36K00q08m47L62L78o38p35K68N63
$$ -298 -821 -114 427 169 -497 74 820 618 131 223 959 1159 351 -96 266 644 6 -729 -461 102
2663A02n31l58R1N97L4n85j55O12K01m15j47Q65N26n35j77O78K54l71o37J09M53
$$ 102 -429 -787 -696 -99 -65 -650 -805 -193 8 -407 -554 311 837 302 125 803 1057 686 49 158 611
2684F11j34p21j4M38m1n07m11O55K15p88k02L87L96j75m51O02O93j45l36J08P24
$$ 611 477 -244 -258 180 139 -368 -779 -124 91 -697 -899 -512 -116 -291 -742 -140 553 408 72 180 904
2705I04J18r24j21M82K70o21m55M22L71l89o39K01N10l11o93j60Q37K41p05O6
$$ 904 1022 98 -23 459 729 108 -347 75 446 57 -582 -381 129 -182 -875 -1035 -198 43 -662 -596
2725e96O41N23m78k02N39J97l74n50N31N81k70n83Q9O36j59p43l10K75K44o78
$$ -596 45 568 90 -112 427 624 250 -300 231 812 542 -41 48 684 525 -218 -528 -253 -9 -687
2745f87l65O11M15l28n9K01O27j92n87L96K10K19o72J2R22N1m77k81J71M97p08
$$ -687 -1052 -441 -26 -354 -413 -212 415 223 -364 32 242 461 -211 -199 723 774 297 16 187 684 -24
2766b4n77J62M65r2q16K68N13K53o72qP61l3m18k50M52N23m84oK26O93l76o26
$$ -24 -601 -439 26 -66 -882 -614 -101 152 -520 -528 233 200 -218 -468 -16 507 23 17 243 936 560 -66
2788f6L2O05k66p34k32O83m2j92m73N02M23l87n21L47M98l27l99K49P55o3l47
$$ -66 -34 571 305 -429 -661 22 -20 -212 -685 -183 240 -147 -668 -321 177 -150 -549 -300 455 392 45
2809D5M8N83L24q25j71L97M6m54k66MN05j73p23L45N67m28o23j9N20K28k50l12
$$ 45 93 676 1000 175 4 401 447 -7 -273 -269 236 63 -660 -315 252 -176 -799 -818 -298 -70 -320 -632
2831f32O96L93j97j75L65K79l66l82j7M73j25m03j9L82L23n22m76K86L34o65m73
$$ -632 64 457 260 85 450 729 363 -19 -36 437 312 -91 -110 272 595 73 -403 -117 217 -448 -921
2852i21L17O24j43l96J60P34j62m51J86N51o9l68k62L70M60n19j30K39M73m52
$$ -921 -604 20 -123 -519 -359 375 213 -238 -52 499 430 62 -200 170 630 111 -19 220 693 241
2872B41l68j50M52l65m97J3N81J12l60k11M25M05l75k62M66K92k27l94R3P64k02
$$ 241 -127 -277 175 -190 -687 -674 -93 19 -341 -552 -127 278 -97 -359 107 399 172 -222 -129 635 433
2893D33n00J93M98k57m86k14L36O4l79k60N00L77l75l99L23L35n8m78J5M68J00
$$ 433 -67 126 624 367 -119 -333 3 67 -312 -572 -72 305 -70 -469 -146 189 131 -347 -332 136 236
2914B36m75mM98K81m16k33K50K55j83m75N5L71j48m35J52N61K6o50M9M25K04n47
$$ 236 -239 -243 255 536 120 -113 137 392 209 -266 -211 160 12 -423 -271 290 316 -334 -285 140 344 -203
2936b03k66M10L56j66j50J99M26l40k99p0L41P7n59j41L65J74l89k01M38J47j43
$$ -203 -469 -59 297 131 -19 180 606 266 -33 -103 238 315 -244 -385 -20 154 -235 -436 2 149 6
2957Fn22K29L65j55k53J40M48P0l82J08L61K15n06m62O10n8No75J87M04N4o25
$$ 6 -516 -287 78 -77 -330 -190 258 328 -54 54 415 630 124 -338 272 214 219 -456 -269 135 189 -436
2979d36M2L98m8m09p3N62P5m65m4N75M89l80k39K10K37j27l94O7M57l06k80K9
$$ -436 -394 4 -44 -453 -526 36 111 -354 -398 177 666 286 47 257 494 367 -27 40 497 191 -89 -60
3001f0L11Rm52j16K43oj74k33K44K72j19j91P4N69o7m77rM74L7k39k53M02L85
$$ -60 251 260 -192 -308 -65 -71 -245 -478 -234 38 -81 -272 -198 371 304 -173 -182 292 329 90 -163 239 624
3024F24m35k76J61K66o4n17l5K03k8k74n7M64J40l69o7L82J24m84j19K33O16l05
$$ 624 189 -87 74 340 276 -241 -276 -73 -101 -375 -432 32 172 -197 -264 118 242 -242 -361 -128 488 183
$$ [...]
8191a09
##END NTUPLES=NMR FID
##END=
