##TITLE=1H_Bz1403
 CDCl3
 8 sc, 
 15.03.2022
##JCAMPDX= 6.0         $$ Bruker NMR JCAMP-DX V2.0
##DATA TYPE= NMR FID
##DATA CLASS= NTUPLES
##ORIGIN= UXNMR, Bruker Analytische Messtechnik GmbH
##OWNER= root
$$ XWIN-NMR		Version 3.5
$$ Tue Mar 15 11:05:48 2022 Russian Standard Time (UT+4h)  she@DPX200
##.OBSERVE FREQUENCY= 200.131346
##.OBSERVE NUCLEUS= ^1H
##.DELAY= (6, 6)
##.ACQUISITION MODE= SIMULTANEOUS
##.ACQUISITION SCHEME= undefined
##.AVERAGES= 8
##.DIGITISER RES= 18
##SPECTROMETER/DATA SYSTEM= spect
##.PULSE SEQUENCE= zg30
##.SOLVENT NAME= CDCl3
##.SHIFT REFERENCE= (INTERNAL, CDCl3, 0, 15.7039)
##AUDIT TRAIL= $$ (NUMBER, WHEN, WHO, WHERE, WHAT)
$$ ##TITLE= Audit trail, XWIN-NMR		Version 3.5
$$ ##JCAMPDX= 5.01
$$ ##ORIGIN= Bruker BioSpin GmbH
$$ ##OWNER= she
$$ F:/spectra/data/she/nmr/H-F/1/audita.txt
$$ ##AUDIT TRAIL=  $$ (NUMBER, WHEN, WHO, WHERE, WHAT)
(   1,<2022-03-15 11:04:01.51 +0400>,<she>,<DPX200>,
      <created by zg, POWCHK disabled, PULCHK disabled
       configuration hash MD5:
       00 E9 B6 7A A2 85 ED C7 34 08 36 98 17 FE 4E 26
       data hash MD5: 16K
       40 8E D6 DA C6 7A F8 34 24 9B 2C 84 4F FC 47 F6>)
$$ ##END=
$$ 
$$ hash MD5
$$ 0C AA 1D F9 54 02 74 A7 85 DE AF 75 21 A0 BF 0A
##$RELAX= 
##$RELAX= 
##$RELAX= 
##$RELAX= 
##$RELAX= 
##$RELAX= 
$$ Bruker specific parameters
$$ --------------------------
##$DU= <F:/spectra>
##$EXPNO= 1
##$NAME= <H-F>
##$PROCNO= 1
##$TYPE= <nmr>
##$USER= <she>
##$AMP= (0..31)
100 100 100 100 100 100 100 100 100 100 100 100 100 100 100 100 100 100 
100 100 100 100 100 100 100 100 100 100 100 100 100 100 
##$AQSEQ= 0
##$AQ_mod= 1
##$AUNM= <au_zg>
##$AUTOPOS= <>
##$BF1= 200.13
##$BF2= 200.13
##$BF3= 200.13
##$BF4= 200.13
##$BF5= 200.13
##$BF6= 200.13
##$BF7= 200.13
##$BF8= 200.13
##$BYTORDA= 1
##$CFDGTYP= 0
##$CFRGTYP= 5
##$CHEMSTR= <none>
##$CNST= (0..31)
1 1 145 1 1 1 1 1 1 1 1 1 1 1 1 1 1 1 1 1 1 1 1 1 1 1 1 1 1 1 1 1 
##$CPDPRG= <>
##$CPDPRG1= <>
##$CPDPRG2= <>
##$CPDPRG3= <>
##$CPDPRG4= <mlev>
##$CPDPRG5= <mlev>
##$CPDPRG6= <mlev>
##$CPDPRG7= <mlev>
##$CPDPRG8= <mlev>
##$CPDPRGB= <>
##$CPDPRGT= <>
##$D= (0..31)
0 1.2 0 0 0 0 0 0 0 0.06 0 0.03 0 0 0 0 0.0002 0 0 0 0 0 0 0 0 0 0 0 0 
0 0 0 
##$DATE= 1647327841
##$DBL= (0..7)
120 120 120 120 120 120 120 120 
##$DBP= (0..7)
150 150 150 150 150 150 150 150 
##$DBP07= 0
##$DBPNAM0= <>
##$DBPNAM1= <>
##$DBPNAM2= <>
##$DBPNAM3= <>
##$DBPNAM4= <>
##$DBPNAM5= <>
##$DBPNAM6= <>
##$DBPNAM7= <>
##$DBPOAL= (0..7)
0.5 0.5 0.5 0.5 0.5 0.5 0.5 0.5 
##$DBPOFFS= (0..7)
0 0 0 0 0 0 0 0 
##$DE= 6
##$DECBNUC= <off>
##$DECIM= 32
##$DECNUC= <off>
##$DECSTAT= 4
##$DIGMOD= 1
##$DIGTYP= 9
##$DL= (0..7)
0 120 120 120 120 120 120 120 
##$DP= (0..7)
150 150 150 150 150 150 150 150 
##$DP07= 0
##$DPNAME0= <>
##$DPNAME1= <>
##$DPNAME2= <>
##$DPNAME3= <>
##$DPNAME4= <>
##$DPNAME5= <>
##$DPNAME6= <>
##$DPNAME7= <>
##$DPOAL= (0..7)
0.5 0.5 0.5 0.5 0.5 0.5 0.5 0.5 
##$DPOFFS= (0..7)
0 0 0 0 0 0 0 0 
##$DQDMODE= 0
##$DR= 18
##$DS= 0
##$DSLIST= <SSSSSSSSSSSSSSS>
$$ [...]
##$SUBNAM2= <"">
##$SUBNAM3= <"">
##$SUBNAM4= <"">
##$SUBNAM5= <"">
##$SUBNAM6= <"">
##$SUBNAM7= <"">
##$SUBNAM8= <"">
##$SUBNAM9= <"">
##$SW= 18.0517287032376
##$SWIBOX= (0..15)
0 0 2 0 0 0 0 0 0 0 0 0 0 0 0 0 
##$SW_h= 3612.71676300578
##$TD= 16384
##$TD0= 1
##$TE= 0
##$TE2= 300
##$TE3= 300
##$TEG= 300
##$TL= (0..7)
0 120 120 120 120 120 120 120 
##$TP= (0..7)
150 150 150 150 150 150 150 150 
##$TP07= 0
##$TPNAME0= <>
##$TPNAME1= <>
##$TPNAME2= <>
##$TPNAME3= <>
##$TPNAME4= <>
##$TPNAME5= <>
##$TPNAME6= <>
##$TPNAME7= <>
##$TPOAL= (0..7)
0.5 0.5 0.5 0.5 0.5 0.5 0.5 0.5 
##$TPOFFS= (0..7)
0 0 0 0 0 0 0 0 
##$TUNHIN= 0
##$TUNHOUT= 0
##$TUNXOUT= 0
##$USERA1= <user>
##$USERA2= <user>
##$USERA3= <user>
##$USERA4= <user>
##$USERA5= <user>
##$V9= 5
##$VALIST= <valist>
##$VCLIST= <CCCCCCCCCCCCCCC>
##$VD= 0
##$VDLIST= <DDDDDDDDDDDDDDD>
##$VPLIST= <PPPPPPPPPPPPPPP>
##$VTLIST= <TTTTTTTTTTTTTTT>
##$WBST= 1024
##$WBSW= 4
##$XGAIN= (0..3)
0 0 0 0 
##$XL= 0
##$YL= 0
##$YMAX_a= 194544
##$YMIN_a= -131784
##$ZGOPTNS= <>
##$ZL1= 120
##$ZL2= 120
##$ZL3= 120
##$ZL4= 120
##$ABSF1= 10
##$ABSF2= 0
##$ABSG= 5
##$ABSL= 3
##$ALPHA= 0
##$AQORDER= 0
##$ASSFAC= 0
##$ASSFACI= 0
##$ASSFACX= 0
##$ASSWID= 0
##$AUNMP= <proc_1d>
##$AZFE= 0.1
##$AZFW= 0.1
##$BCFW= 1
##$BC_mod= 2
##$BYTORDP= 1
##$COROFFS= 0
##$CY= 11.3945322036743
##$DATMOD= 1
##$DC= 2
##$DFILT= <>
##$DTYPP= 0
##$F1P= 2.36226072786647
##$F2P= -0.459571619588291
##$FCOR= 0.5
##$FTSIZE= 0
##$FT_mod= 4
##$GAMMA= 1
##$GB= 0.15
##$INTBC= 1
##$INTSCL= 1
##$ISEN= 128
##$LB= 0.24
##$LEV0= 0
##$LPBIN= 0
##$MAXI= 10000
##$MC2= 0
##$MEAN= 0
##$ME_mod= 0
##$MI= 1.114404
##$NCOEF= 0
##$NC_proc= 0
##$NLEV= 6
##$NOISF1= 3.799351
##$NOISF2= 2.8
##$NSP= 1
##$NTH_PI= 0
##$NZP= 0
##$OFFSET= 15.70392
##$PC= 1
##$PHC0= -16947.4
##$PHC1= 13.40078
##$PH_mod= 1
##$PKNL= yes
##$PPARMOD= 0
##$PSCAL= 0
##$PSIGN= 0
##$REVERSE= no
##$SF= 200.130013532006
##$SI= 16384
##$SIGF1= 3
##$SIGF2= 2
##$SINO= 400
##$SIOLD= 16384
##$SREGLST= <1H.CDCl3>
##$SSB= 0
##$STSI= 0
##$STSR= 0
##$SW_p= 3612.71676300578
##$SYMM= 0
##$S_DEV= 0
##$TDeff= 0
##$TDoff= 0
##$TI= <>
##$TILT= no
##$TM1= 0
##$TM2= 0
##$TOPLEV= 0
##$USERP1= <user>
##$USERP2= <user>
##$USERP3= <user>
##$USERP4= <user>
##$USERP5= <user>
##$WDW= 1
##$XDIM= 8192
##$YMAX_p= 0
##$YMIN_p= 0
$$ End of Bruker specific parameters
$$ ---------------------------------
##NTUPLES= NMR FID
##VAR_NAME=  TIME,          FID/REAL,        FID/IMAG
##SYMBOL=    X,             R,               I
##VAR_TYPE=  INDEPENDENT,   DEPENDENT,       DEPENDENT
##VAR_FORM=  AFFN,          ASDF,            ASDF
##VAR_DIM=   8192,          8192,            8192
##UNITS=     SECONDS,       ARBITRARY UNITS, ARBITRARY UNITS
##FACTOR=    0.0002768,     1,               1
##FIRST=     0,             0,               0
##LAST=      2.2672688,     0,               0
##MIN=       0,             -131784,         0
##MAX=       2.2672688,     194544,          0
$$ Real data points
##PAGE= N=1
##DATA TABLE= (X++(R..R)), XYDATA
$$ plain form
0 0 0 0 0 0 0 0 0 0 0 0 0 0 0 8 -8 8 -8 8 -16 16 -16 24 -24 32 -33 41 -48 56 -65 73 -86 97 -112 126 -143
35 -143 159 -179 200 -224 248 -279 308 -343 378 -419 464 -511 564 -621 684 -754 831 -915 1010
54 1010 -1117 1235 -1372 1529 -1713 1928 -2188 2506 -2908 3436 -4161 5225 -6946 10216 -18707
69 -18707 94002 194544 117617 87604 32473 15477 2496 15791 11880 3904 -20344 -45366
81 -45366 -84398 -108870 -125017 -126988 -127377 -117423 -100670 -74097 -45376 -2058 42446 76810 93248
94 93248 95047 80470 58969 41116 44330 61539 82969 102364 108180 86734 43177 -10126 -57522
107 -57522 -94137 -111928 -106977 -90879 -76449 -62994 -53518 -47905 -44380 -37880 -25973 -15464 -8354
120 -8354 2791 17173 33875 56692 84160 108695 117909 108736 85894 48736 6912 -22287 -34340
$$ packed form
0@%%%%%%%%%%%%%Qj6J6j6J6k4L2l2M0m8N6o5P4q9J04j21J38j59J83k09K38k69
35a43L02l38L79m24M72n27N87o51P21p97Q83r75J075j185J305j438J585j746J925
54A010k127K352k607K901l242L641m116M694n414O344p597R386j2171J7162k8923
69a8707J12709J00542p6927l0013n5131j6996j2981J3295l911p976k4248k5022
81d5366l9032k4472j6147j971l89R954J6753K6573K8721M3318M4504L4364J6438
94I3248J799j4577k1501j7853L214J7209K1430J9395N816k1446m3557n3303m7396
107e7522l6615j7791M951J6098J4430J3455R476N613L525O500J1907J0509P110
120h354J1145J4382J6702K2817K7468K4535R214r173k2842l7158m1824k9199j2053
$$ plain form
133 -34340 -32200 -21980 -10229 -6200 -18493 -42983 -66800 -86672 -96735 -90753 -71313 -45477 -19912
146 -19912 3260 24975 39772 49746 58790 62337 58991 51058 42838 37656 34928 38371 47692 51277
160 51277 43708 25512 -3451 -39466 -72717 -92428 -94007 -83720 -63579 -38991 -21775 -14719 -14195
173 -14195 -16215 -16613 -13328 -2020 16413 34234 50523 65441 74673 77302 73734 64714 49725 26584
187 26584 2402 -17548 -34046 -42494 -40967 -34517 -28925 -29311 -35198 -45811 -60544 -69362 -66052 -52284
201 -52284 -29082 -209 28042 49425 59700 62276 59532 51035 42917 37835 33805 30830 27855 25794
215 25794 21732 13007 2167 -11312 -29804 -49363 -65198 -74937 -75737 -67918 -49859 -27732 -9284
228 -9284 5254 13577 14378 11572 10503 14641 23955 36023 50825 62864 66285 62371 51095 33967
$$ packed form
133c4340K140J0220J1751M029j2293k4490k3817j9872j0063N982J9440K5836K5565
146a9912K3172K1715J4797R974R044L547l346p933q220n182k728L443R321L585
160E1277p569j8196k8963l6015l3251j9711j579J0287K0141K4588J7216P056N24
173a4195k020l98L285J1308J8433J7821J6289J4918R232K629l568r020j4989k3141
187B6584k4182j9950j6498q448J527O450N592l86n887j0613j4733q818L310J3768
201e2284K3202K8873K8251K1383J0275K576k744q497q118n082m030k975k975k061
215B5794m062q725j0840j3479j8492j9559j5835r739q00P819J8059K2127J8448
228i284J4538Q323Q01k806j069M138R314J2068J4802J2039L421l914j1276j7128
$$ plain form
242 33967 13747 -6875 -22950 -34729 -42683 -44122 -41059 -37764 -33993 -31538 -31178 -33794 -37514 -36762
256 -36762 -31306 -21489 -3749 17898 38313 54172 62708 63225 55260 41856 29158 18605 10726
269 10726 7941 8034 7541 4423 -2823 -12648 -26273 -41457 -52482 -59325 -60554 -54398 -42197 -25395
283 -25395 -8782 5909 18230 24476 24869 24024 22849 22958 25979 32156 40460 46023 46810 43102 31942
298 31942 14995 -3650 -21905 -35942 -44621 -47012 -42874 -36545 -29961 -23758 -20735 -20787 -21916 -22413 -19460
313 -19460 -13420 -2625 13013 28550 42294 52308 55811 52544 43145 30344 18238 6406 -1514
326 -1514 -4533 -5807 -6165 -7610 -11827 -18721 -29001 -39204 -46228 -49930 -47956 -38787 -25372 -9408
340 -9408 5907 18691 27218 29771 28989 26826 23346 21853 23416 26700 30936 32691 31381 25942 14280
$$ packed form
242C3967k0220k0622j6075j1779p954j439L063L295L771K455L60k616l720P52
256c6762N456R817J7740K1647K0415J5859Q536N17p965j3404j2698j0553p879
269A0726k785R3m93l118p246r825j3625j5184j1025o843j229O156J2201J6802
283b5395J6613J4691J2321O246L93q45j175J09L021O177Q304N563P87l708j1160
298C1942j6947j8645j8255j4037q679k391M138O329O584O203L023n2j129m97K953
313a9460O040J0795J5638J5537J3744J0014L503l267r399j2801j2106j1832p920
326a514l019j274l58j445m217o894j0280j0203p024l702J974R169J3415J5964
340i408J5315J2784Q527K553p82k163l480j493J563L284M236J755j310n439j1662
$$ plain form
355 14280 -170 -15360 -29868 -40204 -44891 -43888 -37876 -30180 -21417 -14138 -10660 -9258 -8906 -8698
369 -8698 -6029 -541 8925 20602 31570 41117 46977 46093 40002 29825 17548 5108 -5696 -12062
383 -12062 -14506 -15453 -14506 -13895 -15982 -20282 -26383 -32464 -36462 -37295 -32381 -22413 -9751 4917 17754
398 17754 27327 32316 32374 29685 25139 20109 17353 16810 17003 18099 17943 15787 9781 403 -10829 -22436
414 -22436 -33361 -39809 -41671 -38615 -30609 -20677 -10590 -2567 1493 3470 2962 2364 4171 8330 15570
429 15570 24086 31670 37202 38097 33881 25980 15264 3611 -6567 -14626 -19538 -21477 -21610 -19452 -17757
444 -17757 -17317 -17941 -20258 -23049 -24608 -23896 -18655 -9929 1632 14727 26081 33353 35607 32555 26500
459 26500 19086 12691 9577 8401 8685 9434 7906 4081 -2542 -11044 -19402 -27237 -32860 -34614 -33552
$$ packed form
355A4280j4450j5190j4508j0336m687J003O012P696Q763P279L478J402L52K08
369h698K669N488R466J1677J0968R547N860q84o091j0177j2277j2440j0804o366
383a2062k444r47R47O11k087m300o101o081l998q33M914R968J2662J4668J2837
398A7754R573M989N8k689m546n030k756n43J93J096j56k156o006r378j1232j1607
414b2436j0925o448j862L056Q006R932J0087Q023M060J977n08n98J807M159P240
429A5570Q516P584N532Q95m216p901j0716j1653j0178q059m912j939j33K158J695
444a7757M40o24k317k791j559P12N241Q726J1561J3095J1354P272K254l052o055
459B6500p414o395l114j176K84P49j528l825o623q502q358p835n623j754J062
$$ plain form
474 -33552 -28818 -21177 -12412 -2871 4888 10265 13090 12646 10967 10533 11489 15580 21590 27522 31614 30851
490 30851 25088 15427 3048 -8640 -17424 -23022 -23990 -22667 -20077 -17360 -16182 -15919 -15859 -16117 -15504 -13543
506 -13543 -10301 -5247 1255 9769 18720 26562 32113 33746 30608 24002 15128 6349 850 -2237 -1715
521 -1715 251 780 -1116 -6659 -14890 -23079 -29588 -32281 -30256 -25315 -17650 -9228 -1646 4663 9602
536 9602 12928 15439 16143 16095 15832 15039 15627 16965 18917 20810 20193 16374 9015 -1994 -13130 -22478
552 -22478 -28243 -28300 -24853 -18834 -13067 -9597 -8649 -9692 -11630 -11327 -8655 -3585 3530 10934 17784 22921
568 22921 25784 26806 25741 22428 17792 11308 4124 -1979 -6899 -8925 -8437 -7541 -6679 -8537 -13086 -18867
584 -18867 -24799 -28022 -26691 -21101 -11737 -1461 7397 13912 16214 16319 14984 13467 13244 13973 14729 15750
$$ packed form
474c3552M734P641Q765R541P759N377K825m44j679m34R56M091O010N932M092p63
490C0851n763r661j2379j1688q784n598r68J323K590K717J178K63O0k58O13J961
506a3543L242N054O502Q514Q951P842N551J633l138o606q874q779n499l087N22
521a715J966N29j896n543q231q189o509k693K025M941P665Q422P582O309M939
536I602L326K511P04m8k63p93N88J338J952J893o17l819p359j1009j1136r348
552b2478n765n7L447O019N767L470R48j043j938L03K672N070P115P404O850N137
568B2921K863J022j065l313m636o484p184o103m920k026M88Q96Q62j858m549n781
584a8867n932l223J331N590R364J0276Q858O515K302J05j335j517k23P29P56J021
$$ plain form
600 15750 15503 14195 12115 8695 4499 -584 -7543 -14258 -20881 -25239 -26219 -23861 -18209 -11225 -5287
615 -5287 -1378 -364 -1925 -3407 -3396 -551 5492 12653 19826 24818 25849 23747 18815 12577 6953 1585
631 1585 -2241 -5281 -8119 -9965 -10994 -11781 -11593 -12005 -12573 -14055 -16412 -17531 -16772 -13084 -6298 2219
647 2219 10729 17727 20703 20024 16673 12137 8735 7072 7492 9457 10645 10323 7896 2873 -2814 -8721
663 -8721 -14146 -17325 -19497 -20071 -18783 -16230 -12121 -7099 -2593 1809 4230 4989 4767 3774 4276 6660
679 6660 10688 15685 19818 21211 19692 14319 7118 -98 -6702 -10416 -11504 -11339 -9907 -9290 -9212 -9739
695 -9739 -10842 -11890 -11758 -11493 -9694 -6739 -3252 1831 7034 12591 16816 18957 18947 16000 11646 7148
711 7148 3217 1651 1701 2487 3272 2412 -649 -5427 -10847 -15988 -18833 -19627 -17525 -13629 -9049 -4211 -269
$$ packed form
600A5750k47j308k080l420m196n083o959o715o623m358r80K358N652O984N938
615e287L909J014j561j482J1K845O043P161P173M992J031k102m932o238n624n368
631A585l826l040k838j846j029p87J88m12n68j482k357j119P59L688O786Q517
647B219Q510O998K976o79l351m536l402j663M20J965J188l22k427n023n687n907
663h721n425l179k172n74J288K553M109N022M506M402K421P59k22r93N02K384
679F660M028M997M133J393j519n373p201p216o604l714j088J65J432O17P8n27
695i739j103j048J32K65J799K955L487N083N203N557M225K141j0k947m354m498
711G148l931j566N0P86P85q60l061m778n420n141k845p94K102L896M580M838L942
$$ plain form
728 -269 2853 5080 6266 7035 7594 7707 8420 9586 10830 12889 14025 14076 12435 8087 2488 -3798 -9974
745 -9974 -13681 -15327 -14652 -11849 -9536 -7196 -6272 -6758 -7519 -8328 -7730 -5488 -1927 2724 7838 11956 15216
762 15216 17029 16623 14892 11745 7910 4461 985 -1277 -1979 -2805 -2645 -3303 -5027 -7561 -11017 -14346
778 -14346 -16404 -16653 -14513 -10275 -5005 457 4896 7962 9484 9357 8785 7968 7636 8230 9061 9939 10846
795 10846 10493 8894 6195 1676 -2757 -7614 -11878 -14349 -15088 -14073 -11499 -8870 -6155 -4141 -3320 -3086
811 -3086 -3325 -2797 -1006 1530 5364 9755 13172 15684 16081 14436 11681 7914 3685 372 -2424 -3946
827 -3946 -4404 -4729 -4747 -5488 -6940 -8761 -10784 -12271 -12911 -12309 -9577 -5504 -1279 3717 7418 9948 11005
844 11005 10336 9095 7777 6596 6406 6650 7278 7732 6922 5072 2230 -1902 -5932 -9928 -12652 -13772
$$ packed form
728b69L122K227J186P69N59J13P13J166J244K059J136N1j641m348n599o286o176
745i974l707j646O75K803K313K340R24m86p61q09N98K242L561M651N114M118L260
762A5216J813m06j731l147l835l449l476k262p02q26J60o58j724k534l456l329
778a4346k058k49K140M238N270N462M439L066J522j27n72q17l32N94Q31Q78R07
795A0846l53j599k699m519m433m857m264k471p39J015K574K629K715K014Q21K34
811c086k39N28J791K536L834M391L417K512L97j645k755l767m229l313k796j522
827c946m58l25j8p41j452j821k023j487o40O02K732M073M225M996L701K530J057
844A1005o69j241j318j181j90K44O28M54q10j850k842m132m030l996k724j120
$$ plain form
860 -13772 -13514 -11610 -8809 -5988 -3302 -1544 -871 -209 -147 556 2065 4073 6926 9886 12071 13375
876 13375 12964 11005 7978 4092 251 -3026 -5337 -6135 -6086 -6043 -5636 -5855 -6516 -7528 -8877 -9513 -9285 -8012
894 -8012 -5178 -1650 2438 6422 8991 10666 10983 9607 8151 6267 4720 4186 3759 3867 4121 2911
910 2911 1514 -1227 -4510 -7629 -10397 -12158 -12147 -11117 -8624 -5618 -2818 -311 1400 2119 2633 2502
926 2502 3058 3985 5347 7294 9034 10303 10731 9529 7137 4109 211 -3324 -5784 -7515 -7802 -7218
942 -7218 -6457 -5495 -5365 -5387 -5790 -6633 -6566 -5645 -4014 -1097 2064 5470 8440 10019 10968 10195 8462 6517
960 6517 4216 2519 1564 648 695 377 -530 -1737 -3703 -6379 -8564 -10462 -11151 -10404 -8530 -5589 -2421
977 -2421 483 2918 3997 4556 4737 4478 4643 5304 6030 7339 7941 8159 7604 5852 3504 733 -2777
$$ packed form
860a3772K58J904K801K821K686J758O73O62O2P03J509K008K853K960K185J304
876A3375m11j959l027l886l841l277k311p98M9M3M07k19o61j012j349o36K28J273
894h012K834L528M088L984K569J675L17j376j456j884j547n34m27J08K54j210
910B911j397k741l283l119k768j761J1J030K493L006K800K507J711P19N14j31
926B502N56R27J362J947J740J269M28j202k392l028l898l535k460j731k87N84
942g218P61R62J30k2m03q43O7R21J631K917L161L406K970J579R49p73j733j945
960F517k301j697r55r16M7l18r07j207j966k676k185j898o89P47J874K941L168
977b421K904K435J079N59J81k59J65O61P26J309O02K18n55j752k348k771l510
$$ plain form
994 -2777 -5574 -7845 -9095 -8831 -8145 -6754 -5191 -4230 -3684 -3831 -4202 -3662 -2980 -966 2005 4978 7769
1011 7769 9870 10789 10405 8662 6694 4498 2398 887 7 -1122 -1768 -2347 -3300 -3984 -5511 -7033 -8271
1028 -8271 -9581 -9428 -8414 -6514 -3337 -184 2831 5051 6367 6389 5896 5001 4854 5042 5778 6813 7263
1045 7263 6759 5538 3092 429 -2511 -5142 -7130 -8425 -8717 -8406 -7667 -6208 -4679 -3561 -2250 -1555
1061 -1555 -1422 -923 -74 1305 3431 5660 8212 9930 10353 9629 7579 4670 2095 -203 -1451 -2191
1077 -2191 -2557 -2519 -3062 -4168 -5127 -6353 -7271 -7693 -7557 -6642 -5277 -3488 -864 1778 4034 6055 7077
1094 7077 7405 6599 5400 4482 3972 3840 4275 4574 4596 3457 1337 -1391 -4334 -6931 -8440 -8646 -7930 -6777
1112 -6777 -5443 -3877 -2785 -1929 -1064 -409 429 1339 2110 3377 4482 5619 7111 7951 8000 7311 5306
$$ packed form
994b777k797k271j250K64O86J391J563R61N46j47l71N40O82K014K971K973K791
1011G769K101R19l84j743j968k196k100j511q80j129o46n79r53o84j527j522j238
1028h271j310J53J014J900L177L153L015K220J316K2m93q95j47J88P36J035M50
1045G263n04j221k446k663k940k631j988j295k92L11P39J459J529J118J311O95
1061a555J33M99Q49J379K126K229K552J718M23p24k050k909k575k298j248p40
1077b191l66L8n43j106r59j226r18m22J36R15J365J789K624K642K256K021J022
1094G077L28q06j199r18n10j32M35K99K2j139k120k728k943k597j509k06P16J153
1112f777J334J566J092Q56Q65O55Q38R10P71J267J105J137J492Q40M9o89k005
$$ plain form
1129 5306 2975 279 -2359 -3785 -4424 -4351 -3479 -3189 -3375 -4091 -5297 -6098 -6409 -6271 -4579 -2651 -480
1146 -480 2122 3958 5197 5988 6150 6051 5587 4583 3880 2746 2050 1921 1588 1460 760 -720 -2215 -4722
1164 -4722 -6668 -7691 -8165 -6973 -5373 -3214 -1168 172 886 1322 1186 1454 2118 2773 4049 5072 5795
1181 5795 6294 5845 5182 3913 2381 466 -1370 -3390 -4463 -5128 -5067 -4322 -3854 -3115 -2802 -3177 -3670 -4041
1199 -4041 -3758 -2595 -624 1611 3946 5445 6423 6346 5609 4787 3629 2673 1874 1186 778 295 -342 -937
1217 -937 -1964 -2770 -3734 -5008 -5785 -6313 -6353 -5320 -3667 -1789 441 2147 3114 3494 3145 2834 2639 2947
1235 2947 3858 4454 5092 5412 4553 3329 1559 -371 -2150 -3538 -4693 -5018 -5150 -4826 -4198 -3685 -2727 -2408
1253 -2408 -2162 -1747 -1529 -1033 -19 1135 2932 4686 6057 6792 6469 5500 3958 2377 992 26 -801
$$ packed form
1129E306k331k696k638j426o39P3Q72K90j86p16j206q01l11J38J692J928K171
1146d80K602J836J239P91J62r9m64j004p03j134o96j29l33j28p00j480j495k507
1164d722j946j023m74J192J600K159K046J340P14M36j36K68O64O55J276J023P23
1181E795M99m49o63j269j532j915j836k020j073o65O1P45M68P39L13l75m93l71
1199d041K83J163J971K235K335J499R78p7p37q22j158r56p99o88m08m83o37n95
1217i37j027q06r64j274p77n28m0J033J653J878K230J706R67L80l49l11j95L08
1235B947R11N96O38L20q59j224j770j930j779j388j155l25j32L24O28N13R58L19
1253b408K46M15K18M96J014J154J797J754J371P35l23r69j542j581j385r66q27
$$ plain form
1270 -801 -972 -1026 -1487 -1920 -2833 -3958 -4793 -5416 -5503 -5394 -4433 -3160 -1675 180 1959 3094 4084 4274 4120
1289 4120 3881 3326 3202 3354 3482 3908 3829 2980 1816 182 -1881 -3517 -4954 -5654 -5577 -5213 -4337 -3402 -2622
1308 -2622 -1788 -1401 -1070 -699 -187 557 1640 2669 4058 5116 5712 6196 5531 4462 3006 1395 -121
1325 -121 -1257 -2073 -2236 -2399 -2542 -2645 -3215 -3599 -4408 -4916 -4850 -4421 -3197 -1409 152 1618 2916 3785
1343 3785 4249 4279 3731 3584 2904 2689 2628 2438 2320 1968 1349 256 -1320 -2885 -3945 -5084 -5329 -4993 -4497
1362 -4497 -3354 -2252 -1264 -499 -75 118 638 614 1568 2271 3010 4030 4492 5019 4701 4033 2756 1496
1380 1496 -232 -1495 -2149 -2547 -2820 -2664 -2694 -2373 -2784 -3070 -3352 -3476 -3147 -2591 -1485 -208 1326 2659
1398 2659 3800 4115 4293 3789 3353 2616 1856 1454 1511 1050 1022 577 -100 -951 -2045 -3268 -4101 -4613 -4514 -4075
$$ packed form
1270h01j71n4m61m33r13j125q35o23q7J09R61J273J485J855J779J135R90J90j54
1289D120k39n55j24J52J28M26p9q49j164j634k063j636j437p00P7L64Q76R35P80
1308b622Q34L87L31L71N12P44J083J029J389J058N96M84o65j069j456j611j516
1325a21j136q16j63j63j43j03n70l84q09n08O6M29J224J788J561J466J298Q69
1343C785M64L0n48j47o80k15o1j90j18l52o19j093j576j565j060j139k45L36M96
1362d497J143J102R88P65M24J93N20k4R54P03P39J020M62N27l18o68j277j260
1380A496j728j263o54l98k73J56l0L21m11k86k82j24L29N56J106J277J534J333
1398B659J141L15J78n04m36p37p60m02N7m61k8m45o77q51j094j223q33n12R9M39
$$ plain form
1418 -4075 -3226 -2014 -1054 218 873 1117 1574 1565 1621 1915 2484 3009 3530 3760 3773 3196 2251 980 -444 -1575
1438 -1575 -2573 -3139 -3382 -3047 -2719 -2550 -2209 -2235 -2165 -2150 -1993 -1497 -840 135 1413 2525 3524 4032 4081 3894
1458 3894 3235 2425 1676 721 482 -35 -245 -415 -909 -1176 -1961 -2875 -3534 -4024 -4153 -3624 -3060 -2050 -767
1477 -767 490 1326 2212 2312 2286 2328 2094 2168 2519 2687 3041 2929 2626 2126 766 -263 -1640 -2554 -3263 -3614
1497 -3614 -3600 -3130 -2718 -2180 -1957 -1818 -1262 -1086 -781 -265 369 1449 2398 3212 3873 4238 4265 3592 2679 1776
1517 1776 892 -160 -530 -851 -1282 -1049 -1583 -1968 -2495 -3140 -3587 -3806 -3671 -2955 -2020 -871 410 1361 2262
1536 2262 2507 2727 2846 2558 2453 2563 2346 2394 2382 2131 1620 838 -303 -1096 -2362 -3418 -3659 -3749 -3392 -2977
1556 -2977 -2291 -1574 -1197 -884 -724 -300 51 578 1261 2186 2773 3347 3854 3711 3476 2917 1782 1032 197
$$ packed form
1418d075Q49J212R60J272O55K44M57rN6K94N69N25N21K30J3n77r45j271j424j131
1438a575r98n66k43L35L28J69L41k6P0J5J57M96O57R75J278J112R99N08M9j87
1458C894o59q10p49r55k39n17k10j70m94k67p85r14o59m90j29N29N64J010J283
1477g67J257Q36Q86J00k6M2k34P4L51J68L54j12l03n00j360j029j377r14p09l51
1497c614J4M70M12N38K23J39N56J76L05N16O34J080R49Q14O61L65K7o73r13r03
1517A776q84j052l70l21m31K33n34l85n27o45m47k19J35P16R35J149J281R51R01
1536B262K45K20J19k88j05J10k17M8j2k51n11p82j141p93j266j056k41r0L57M15
1556b977O86P17L77L13J60M24L51N27O83R25N87N74N07j43k35n59j135p50q35
$$ plain form
1575 197 -845 -1209 -1604 -1902 -1845 -2081 -2204 -2415 -2886 -2978 -3104 -2982 -2110 -1158 -37 1227 2017 2643 2772 2748
1595 2748 2590 2135 2099 1952 1901 1755 1763 1208 768 -89 -1056 -1786 -2576 -3190 -3400 -3512 -2947 -2451 -1703 -892 -437
1616 -437 29 256 226 469 800 1509 1989 2786 3094 3455 3130 2525 1695 682 -29 -783 -1145 -1537 -1700 -1773
1636 -1773 -1888 -1968 -2104 -2136 -2149 -2090 -1937 -1541 -879 -117 830 1626 2414 2777 2844 2460 2121 1669 1214 1086 893
1657 893 869 733 266 -217 -928 -1455 -2087 -2788 -2867 -2832 -2534 -2111 -1408 -877 -182 340 714 1128 1122 1258 1324 1601
1679 1601 1756 2319 2488 2483 2231 1448 557 -211 -1117 -1712 -2074 -1989 -2049 -1902 -1597 -1567 -1346 -1542 -1335 -1130 -795
1700 -795 -203 332 868 1502 2085 2375 2676 2532 2201 1659 977 558 208 -195 -227 -279 -445 -869 -1556 -1896 -2436
1721 -2436 -2735 -2509 -2474 -1770 -1051 -408 403 787 1161 1401 1651 1688 1688 1729 1791 1738 1653 1596 1606 1096 635 -45 -1101
$$ packed form
1575A97j042l64l95k98N7k36j23k11m71r2j26J22Q72R52J121J264P90O26J29k4
1595B748j58m55l6j47n1j46Qn55m40q57r67p30p90o14k10j12N65M96P48Q11M55
1616d37M66K27l0K43L31P09M80P97L08L61l25o05q30j013p11p54l62l92j63p3
1636a773j15q0j36l2j3N9J53L96O62P62R47P96P88L63O7l84l39m52m55j28j93
1657H93k4j36m67m83p11n27o32p01p9L5K98M23P03N31O95N22L74M14oJ36O6K77
1679A601J55N63J69nk52p83q91p68r06n95l62Q5o0J47L05L0K21j96K07K05L35
1700g95N92N35N36O34N83K90L01j44l31n42o82m19l50m03l2n2j66m24o87l40n40
1721b436k99K26L5P04P19O43Q11L84L74K40K50L7%M1O2n3q5n7J0n10m61o80j056
$$ plain form
1744 -1101 -1670 -2232 -2456 -2424 -2254 -1542 -1240 -1093 -847 -1006 -788 -529 -131 468 1137 1628 2196 2543 2539 2411 2191
1765 2191 1659 1238 561 -144 -294 -671 -981 -964 -1150 -1324 -1878 -2012 -2222 -2357 -2382 -2035 -1400 -493 306 1115
1785 1115 1391 1702 1864 1816 1793 1869 1443 1801 1634 1522 1310 865 428 1 -760 -1516 -2027 -2435 -2559 -2446 -2023
1806 -2023 -1704 -1256 -860 -618 -375 -327 -158 290 802 1421 1813 2299 2575 2429 2391 1728 1250 590 -9 -355
1826 -355 -765 -921 -1072 -1358 -1454 -1600 -1712 -1826 -2012 -1947 -1685 -1367 -792 107 583 1286 1808 1972 1825 1580 1706
1847 1706 1403 1265 1324 1238 953 890 499 -74 -475 -1348 -1648 -2040 -2312 -2079 -1869 -1589 -1308 -910 -500 -11 -156
1868 -156 217 426 683 973 1322 1666 2154 2191 2140 1727 1179 733 -30 -508 -733 -1107 -1110 -1070 -1250 -1211 -1319 -1305
1890 -1305 -1487 -1561 -1260 -1205 -541 -69 487 955 1701 1696 1765 1776 1389 1269 1006 833 733 491 459 175 -30 -496
$$ packed form
1744a101n69n62k24L2J70P12L02J47K46j59K18K59L98N99O69M91N68L47mj28k20
1765B191n32m21o77p05j50l77l10J7j86j74n54j34k10j35k5L47O35R07P99Q09
1785A115K76L11J62m8k3P6m26L58j67j12k12m45m37m27p61p56n11m08j24J13M23
1806b023L19M48L96K42K43M8J69M48N12O19L92M86K76j46l8o63m78o60n99l46
1826c55m10j56j51k86r6j46j12j14j86O5K62L18N75Q99M76P03N22J64j47k45J26
1847A706l03j38N9q6k85o3l91n73m01q73l00l92k72K33K10K80K81L98M10M89j45
1868a56L73K09K57K90L49L44M88L7n1m13n48m46p63m78k25l74lM0j80L9j08J4
1890a305j82p4L01N5O64M72N56M68P46nO9J1l87j20k63j73j00k42l2k84k05m66
$$ plain form
1912 -496 -978 -1503 -1680 -1803 -2024 -1552 -1451 -823 -562 2 242 468 504 804 873 1085 1324 1237 1512 1669 1479
1933 1479 1460 926 325 -51 -723 -926 -1167 -1433 -1614 -1477 -1328 -1109 -1169 -1058 -1034 -841 -509 -245 20 540 1153
1954 1153 1385 1674 1756 1720 1430 1266 821 644 298 148 -106 -425 -374 -641 -1059 -1355 -1463 -1710 -1696 -1656 -1272
1975 -1272 -1040 -303 228 609 801 895 1037 1108 1109 1320 1395 1404 1501 1230 1209 880 250 -214 -817 -1297 -1520 -1721 -1715
1998 -1715 -1559 -1491 -1222 -923 -805 -770 -585 -173 64 348 570 1295 1564 1690 1991 1939 1622 1330 886 466 -16
2019 -16 -180 -433 -827 -719 -988 -1260 -1434 -1531 -1790 -1560 -1546 -1357 -968 -316 228 508 883 1278 1385 1442 1406 1304
2041 1304 1418 1190 1265 1205 928 634 403 -50 -667 -1243 -1582 -1676 -1675 -1812 -1581 -1312 -1016 -938 -694 -328 23 -163
2063 -163 416 596 972 1218 1446 1806 1861 1526 1591 1071 529 103 -252 -612 -667 -737 -910 -1080 -1203 -1307 -1611
$$ packed form
1912d96m82n25j77j23k21M72J01O28K61N64K40K26L6L00O9K12K39q7K75J57j90
1933A479j9n34o01l76o72k03k41k66j81J37J49K19o0J11K4J93L32K64K65N20O13
1954A153K32K89Q2l6k90j64m45j77l46j50k54l19N1k67m18k96j08k47J4M0L84
1975a272K32P37N31L81J92R4J42P1JK11P5RR7k71k1l29o30m64o03m80k23k01O
1998a715J56O8K69K99J18L5J85M12K37K84K22P25K69J26L01n2l17k92m44m20m82
2019a6j64k53l94J08k69k72j74r7k59K30J4J89L89O52N44K80L75L95J07N7l6j02
2041A304J14k28P5o0k77k94k31m53o17n76l39r4Jj37K31K69K96P8K44L66L51j86
2063a63N79J80L76K46K28L60N5l35O5n20n42m26l55l60n5p0j73j70j23j04l04
$$ plain form
2084 -1611 -1282 -1437 -1149 -892 -644 -90 378 744 1215 1298 1368 1458 1243 1201 1029 915 927 837 460 209 -42 -420
2106 -420 -956 -1250 -1331 -1684 -1605 -1426 -1125 -911 -687 -278 -291 -34 207 415 444 854 1057 1290 1397 1563 1385
2127 1385 1242 1017 497 131 -130 -550 -683 -769 -925 -844 -1110 -1103 -973 -1155 -1204 -877 -832 -282 69 260 689 868
2149 868 1169 1385 1087 1210 1073 767 683 327 342 259 -19 -59 -416 -692 -723 -1188 -1419 -1134 -1197 -995 -460 -373
2171 -373 23 110 345 405 450 557 807 797 1021 1180 1095 1088 812 582 372 -131 -320 -604 -916 -1034 -1026 -967 -697
2194 -697 -806 -668 -704 -540 -398 -468 -276 119 573 802 1034 999 1266 1131 831 745 521 459 163 -51 -169 -276
2216 -276 -537 -618 -837 -1086 -1032 -1264 -1021 -951 -817 -676 -189 -46 500 724 848 766 754 866 680 820 912 826
2238 826 804 568 287 221 -167 -583 -714 -859 -1237 -1071 -1251 -848 -815 -710 -622 -589 -193 -85 224 271 748 853
$$ packed form
2084a611L29j55K88K57K48N54M68L66M71Q3P0R0k15m2j72j14J2r0l77k51k51l78
2106d20n36k94q1l53P9J79L01K14K24M09j3K57K41K08K9M10K03K33J07J66j78
2127A385j43k25n20l66k61m20j33q6j56Q1k66PJ30j82m9L27M5N50L51J91M29J79
2149H68L01K16k98J23j37l06q4l56J5q3k78m0l57k76l1m65k31K85o3K02N35Q7
2171c73L96Q7K35O0M5J07K50j0K24J59q5pk76k30k10n03j89k84l12j18QN9K70
2194f97j09J38l6J64J42p0J92L95M54K29K32l5K67j35l00q6k24o2k96k14j18j07
2216b76k61q1k19k49N4k32K43P0J34J41M87J43N46K24J24q2j2J12j86J40R2q6
2238H26k2k36k81o6l88m16j31j45l78J66j80M03L3J05Q8L3L96J08L09M7M77J05
$$ plain form
2260 853 1046 1157 1321 1204 1039 724 525 410 42 -264 -351 -293 -556 -633 -811 -988 -1085 -1091 -973 -1001 -740 -500
2282 -500 -207 107 444 647 779 933 887 1035 1024 866 682 886 632 579 447 -2 -135 -429 -817 -876 -1208
2303 -1208 -1136 -1264 -1099 -814 -671 -712 -378 -307 59 281 377 595 717 949 1044 1134 918 1134 863 606 367 86
2325 86 -201 -283 -628 -720 -919 -747 -711 -1029 -933 -1193 -1022 -660 -366 -388 31 338 629 786 961 973 1000 812 868
2348 868 680 776 638 356 248 101 -336 -263 -593 -854 -786 -1120 -1070 -998 -769 -552 -190 -286 -105 61 228 218
2370 218 397 427 700 811 865 900 756 689 371 188 11 -339 -349 -308 -492 -529 -657 -695 -558 -783 -685 -481 -575
2393 -575 -399 -110 82 345 257 644 670 770 729 560 616 384 266 173 289 -148 -75 -103 -348 -658 -699 -708 -790 -874
2417 -874 -643 -481 -392 -82 -47 40 293 418 475 481 569 736 675 530 651 575 530 474 23 -1 -223 -529 -627 -739
$$ packed form
2260H53J93J11J64j17j65l15j99j15l68l06q7N8k63p7j78j77r7oJ18k8K61K40
2282e00K93L14L37K03J32J54m6J48j1j58j84K04k54n3j32m49j33k94l88n9l32
2303a208P2j28J65K85J43m1L34P1L66K22R6K18J22K32R5R0k16K16k71k57k39k81
2325H6k87q2l45r2j99J72L6l18R6k60J71L62K94k2M19L07K91J57J75J2K7j88N6
2348H68j88R6j38k82j08j47m37P3l30k61O8l34N0P2K29K17L62r6J81J66J67j0
2370B18J79L0K73J11N4L5j44o7l18j83j77l50j0M1j84l7j28l8J37k25R8K04r4
2393e75J76K89J92K63q8L87K6J00m1j69N6k32j18r3J16m37P3k8k45l10m1rq2q4
2417h74K31J62Q9L10L5Q7K53J25N7OQ8J67o1j45J21p6m5n6m51k4k22l06r8j12
$$ plain form
2441 -739 -629 -442 -590 -550 -427 -477 -279 -234 -7 91 323 459 667 570 605 819 552 647 426 326 279 52 -237
2464 -237 -184 -402 -344 -373 -582 -413 -764 -621 -576 -589 -403 -347 -162 168 260 105 680 545 597 728 623 528 711
2487 711 449 491 247 188 211 -276 -268 -698 -647 -881 -899 -586 -692 -623 -363 -281 -210 148 -113 74 422 372 767 831
2511 831 892 834 934 768 545 279 125 -33 -287 -374 -509 -538 -509 -585 -680 -717 -807 -781 -627 -379 -361 -122 252 353
2535 353 475 804 561 609 697 713 602 704 323 452 387 153 2 -206 -452 -654 -982 -914 -727 -891 -603 -575
2557 -575 -491 -356 -232 -68 70 102 421 535 483 482 773 566 694 621 597 536 177 276 -53 -321 -262 -642 -587 -519
2581 -519 -701 -620 -556 -642 -486 -402 -328 -108 66 176 516 451 651 642 508 540 508 447 384 215 228 50 -57 -165
2605 -165 -267 -416 -538 -731 -716 -472 -711 -439 -405 -153 -52 -26 -4 92 120 220 267 216 680 486 517 528 457 167
$$ packed form
2441g39J10J87j48M0J23n0J98M5K27R8K32J36K08r7L5K14k67R5k21j00m7k27k89
2464b37N3k18N8k9k09J69l51J43M5j3J86N6J85L30R2j55N75j35N2J31j05r5J83
2487G11k62M2k44n9K3m87Qm30N1k34j8L13j06O9K60Q2P1L58k61J87L48n0L95O4
2511H31O1n8J00j66k23k66j54j58k54q7j35k9K9p6r5l7r0K6J54K48J8K39L74J01
2535C53J22L29k43M8Q8J6j11J02l81J29o5k34j51k08k46k02l28O8J87j64K88K8
2557e75Q4J35J24J64J38L2L19J14n2jK91k07J28p3k4o1l59R9l29k68N9l80N5O8
2581e19j82Q1O4q6J56Q4P4K20J74J10L40o5K00rj34L2l2o1o3j69J3j78j07j08
2605a65j02j49j22j93J5K44k39K72L4K52J01K6K2R6K8J00M7n1M64j94L1J1p1k90
$$ plain form
2629 167 79 -93 -149 -210 -240 -401 -347 -323 -476 -564 -459 -300 -429 -325 -241 -66 138 110 521 357 551 523 507 589
2653 589 330 200 153 285 88 -29 -68 -171 -203 -273 -409 -396 -563 -485 -326 -281 -147 -69 17 168 286 237 170 249
2677 249 298 255 370 357 338 178 256 100 102 -70 -334 -281 -506 -439 -373 -203 -263 -290 -146 -116 -256 -54 -75 209 263
2702 263 369 438 462 463 421 302 327 195 87 21 113 -204 -328 -247 -348 -141 -288 -435 -457 -329 -484 -361 -207
2725 -207 -107 217 182 229 394 256 324 410 223 391 287 239 302 66 170 -48 -146 -318 -376 -515 -276 -691 -370
2748 -370 -485 -308 -211 -339 -73 37 -7 1 268 230 367 474 412 456 453 507 327 164 150 -49 -92 -140 -347 -329 -395
2773 -395 -509 -446 -326 -399 -412 -262 -199 -217 31 176 92 265 407 469 280 329 564 237 357 247 314 404 222
2796 222 112 -34 -270 -261 -336 -621 -471 -373 -457 -335 -169 -242 -173 15 -69 320 230 64 197 425 397 520 584 348
$$ packed form
2629A67q8j72n6o1l0j61N4K4j53q8J05J59j29J04Q4J75K04k8M11j64J94k8j6Q2
2653E89k59j30m7J32j97j17l9j03l2p0j36J3j67P8J59M5J34P8Q6J51J18m9o7P9
2677B49M9m3J15j3j9j60P8j56Kj72k64N3k25O7O6J70o0k7J44L0j40K02k1K84N4
2702B63J06O9K4Jm2j19K5j32j08o6R2l17j24Q1j01K07j47j47k2J28j55J23J54
2725b07J00L24l5M7J65j38O8Q6j87J68j04m8O3k36J04k18r8j72n8j39K39m15L21
2748c70j15J77R7j28K66J10m4QK67l8J37J07o2M4lN4j80j63j4j99m3m8k07J8o6
2773c95j14O3J20p3j3J50O3j8K48J45q4J73J42O2j89M9K35l27J20j10O7R0j82
2796B22j10j46k36Rp5k85J50R8q4J22J66p3O9J88q4L89r0j66J33K28k8J23O4k36
$$ plain form
2820 348 392 164 125 30 32 -98 -148 -221 -270 -361 -406 -394 -282 -388 -375 -143 -150 -115 -99 29 171 189 374 409 475 453 429
2847 429 346 377 195 38 0 -91 -39 -182 -181 -300 -288 -368 -552 -533 -289 -256 -236 -178 -132 -92 109 198 221 299 187 206
2873 206 108 232 407 310 299 254 37 -68 -67 -108 -36 -131 -217 15 -119 -47 -70 -199 -53 -163 19 24 -140 94 111
2898 111 183 397 364 174 60 222 176 -20 37 -185 -53 -219 -26 -157 -206 -7 -342 -336 -132 -279 -19 -154
2920 -154 -66 287 -8 194 41 165 289 27 109 226 192 195 78 18 26 -25 -198 -66 -224 -205 -318 -165 -126 -216
2944 -216 -103 -54 -59 64 62 2 165 254 262 202 326 243 157 104 134 237 -194 -40 -36 -261 -235 -268 -158 -220 -135 -48 -254
2971 -254 -232 -117 -159 -140 -26 86 96 366 155 371 186 371 229 196 145 120 69 202 70 -66 -92 -136 -238
2994 -238 -152 -255 -384 -143 -448 -140 -138 -91 -108 -104 116 10 181 67 263 132 353 323 224 387 224 141 60 -29
$$ packed form
2820C48M4k28l9r5Kj30n0p3m9r1m5J2J12j06J3K32pL5J6J28J42J8J85L5O6k2k4
2847D29q3L1j82j57l8r1N2j43Jj19J2q0j84J9K44L3K0N8M6M0K01Q9K3P8j12J9
2873B06r8J24J75r7j1m5k17j05Jm1P2r5q6K32j34P2k3j29J46j10J82Nj64K34J7
2898A11P2K14l3j90j14J62m6j96N7k22J32j66J93j31m9J99l35OK04j47K60j35
2920a54Q8L53k95K02j53J24J24k62Q2J17l4Lj17o0Qn1j73J32j58J9j13J53L9r0
2944b16J13M9nJ23ko0J63Q9Qo0J24q3q6n3L0J03m31J54Mk25K6l3J10o2Q5Q7k06
2971b54K2J15m2J9J14J12J0K70k11K16j85J85j42l3n1k5n1J33j32j36k6m4j02
2994b38Q6j03j29K41l05L08KM7j7MK20j06J71j14J96j31K21l0r9J63j63q3q1q9
$$ plain form
3018 -29 -139 -249 -199 -105 -164 -417 -363 -254 -234 -358 -172 -377 -186 -14 -6 197 135 223 274 327 267 265 318 224 208 -38
3044 -38 -20 -26 -2 -80 -283 -295 -222 -333 -424 -309 -358 -167 -253 -92 -37 -32 19 213 154 210 150 244 205 251 247 321 311 80
3072 80 280 93 36 -133 -357 -89 -220 -214 -249 -147 -167 -71 -225 -275 -124 -22 66 16 99 50 156 169 87 138 67
3097 67 387 17 50 183 -46 129 -1 3 -214 -210 -140 -355 -101 -148 -243 -117 -23 -94 26 -52 61 21 -81 71
3121 71 102 226 135 173 77 246 211 -50 15 180 51 4 -259 -150 -96 -48 56 -106 -77 -127 -334 -43 120 -29
3145 -29 -148 -73 121 203 137 -21 164 141 151 68 -47 82 67 109 9 -134 -45 21 -316 -85 -28 -123 -74 -179 10
3170 10 70 93 128 -75 92 217 147 85 152 87 -23 84 59 2 -18 -191 -48 19 -70 -76 -155 -228 -199 -53 10 -76 24
3197 24 117 7 80 155 165 255 42 131 127 218 120 -78 -149 50 -314 11 14 -96 -93 -119 -144 -237 -152 -43 -50 -60 24 116
$$ packed form
3018b9j10j10N0R4n9k53N4J09K0j24J86k05J91J72QK03o2Q8N1N3o0kN3r4j6k46
3044c8J8oK4p8k03j2P3j11r1J15m9J91q6J61N5NN1J94n9N6o0R4l9M6mP4j0k31
3072H0K00j87n7j69k24K68j31Ol5J02k0R6j54n0J51J02Q8n0Q3m9J06J3q2N1p1
3097F7L20l70L3J33k29J75j30Mk17MP0k15K54m7r5J26R4p1J20p8J13m0j02J52
3121G1L1J24r1L8r6J69l5k61O5J65j29m7k63J09N4M8J04j62K9n0k07K91J63j49
3145b9j19P5J94Q2o6j58J85k3J0q3j15J29j5M2j00j43Q9O6l37K31N7r5M9j05J89
3170A0O0K3L5k03J67J25p0o2O7o5j10J07k5n7k0j73J43O7q9op9p3K9J46O3q6J00
3197B4R3j10P3P5J0R0k13Q9mR1r8j98p1J99l64L25Lj10Lk6k5r3Q5J09pj0Q4R2
$$ plain form
3225 116 48 86 214 109 289 271 85 31 133 71 162 -141 -56 -118 -64 59 -253 -226 -59 -285 -171 -203 -50 7
3249 7 -31 -94 53 204 7 199 47 341 97 -66 184 278 -43 148 281 91 -17 -84 -90 -175 -67 -161 -417
3272 -417 -338 -127 -357 -132 -134 -240 -15 -155 -60 8 -35 27 256 139 257 213 221 213 155 3 48 139 -130 -69 -230
3297 -230 -30 -156 -175 -154 -61 -134 -244 -108 -181 -69 -11 -58 1 135 131 90 181 258 102 243 251 35 108 160 126 74
3323 74 -61 -14 9 -127 -161 -251 84 -69 -178 -156 96 -38 13 -22 -64 0 -26 -23 -24 57 185 79 93 68 85 98 51
3350 51 35 -16 -27 -36 -50 -100 -167 -17 -102 -111 -318 -57 54 -79 -41 28 -9 91 -3 -3 143 -46 111 63 20 -18 107
3377 107 -98 -45 -104 -36 40 89 -23 -64 96 -104 23 -49 90 37 -120 57 -229 190 57 -48 -166 37 173
3400 173 105 -71 29 29 6 -66 49 -132 -22 -127 66 22 98 67 -71 -32 -39 -27 -93 62 -11 -7 -55 54 114 -2
$$ packed form
3225A16o8L8J28j05J80j8j86n4J02o2R1l03Q5o2N4J23l12K7J67k26J14l2J53N7
3249Gl8o3J47J51j97J92j52K94k44j63K50R4l21J91J33j90j08o7oq5J08r4k56
3272d17P9K11k30K25kj06K25j40R5O8m3O2K29j17J18m4Qqn8j52M5R1k69O1j61
3297b30K00j26j9K1R3p3j10J36p3J12N8m7N9J34mm1R1P7j56J41Qk16P3N2l4n2
3323G4j35M7K3j36l4r0L35j53j09K2K52j34N1l5m2O4k6LjQ1J28j06J4k5J7J3m7
3350E1j6n1j1rj4n0o7J50q5rk07K61J11j33L8O9l7J00r4%J46j89J57m8m3l8J25
3377A07k05N3n9O8P6M9j12m1J60k00J27p2J39n3j57J77k86M19j33j05j18K03J36
3400A73o8j76J00%k3p2J15j81J10j05J93m4P6l1j38L9pJ2o6J55p3Mm8J09O0j16
$$ plain form
3426 -2 -71 95 -68 -51 -49 -85 -18 13 -102 -150 -46 -89 -68 -69 117 61 -28 26 119 76 77 -122 71 87 106 6 89 282
3454 282 40 138 11 -26 -69 -1 -150 -101 -213 -16 -75 -69 -98 -165 -175 -25 107 -89 -121 -19 26 38 147 195 128
3479 128 209 158 157 66 122 42 64 79 -79 -109 -169 -152 -101 53 -112 -98 -89 -171 -16 60 -126 73 12 -18 28 -11 250
3506 250 -67 14 0 202 183 128 173 97 -65 3 36 -181 -199 -164 -147 -156 -268 -127 -200 -210 -212 -55 -84 68 -35 -76
3532 -76 17 117 188 219 -17 -128 43 20 245 207 34 120 141 71 -11 -140 -117 -3 -138 -109 -104 -98 -105 -15 -159 -211 -42
3559 -42 -63 -14 37 60 135 40 58 154 210 168 53 103 77 33 77 29 -122 69 44 71 -218 -214 -223 -218 -100 -34 -52 -83 161
3588 161 -50 -67 -35 -67 -75 82 52 62 102 73 116 -12 105 67 -18 28 -115 -92 -131 -56 9 -66 -114 -120 -45 -46 -101 -17 -168
3617 -168 -51 -354 -57 -31 -71 100 -46 91 4 89 92 136 87 45 -59 -214 -55 -226 93 86 -179 -42 -130 34
$$ packed form
3426bo9J66j63J7Kl6O7L1j15m8J04m3K1jJ86n6q9N4R3m3Jj99J93J6J9j00Q3J93
3454B82k42R8j27l7m3O8j49M9j12J97n9Ok9o7j0J50J32j96l2J02M5J2J09M8o7
3479A28Q1n1jr1N6q0K2J5j58l0o0J7N1J54j65J4Rq2J55P6j86J99o1l0M6l9K61
3506B50l17Q1j4K02j9n5M5p6j62O8L3k17j8L5J7rj12J41p3j0kJ57k9J52j03m1
3532g6R3J00P1L1k36j11J71k3K25l8j73Q6K1p0q2j29K3J14j35K9NOpR0j44n2J69
3559d2k1M9N1K3P5r5J8R6N6m2j15N0k6m4M4m8j51J91k5K7k89MrNJ18O6j8l1K44
3588A61k11j7L2l2qJ57l0J0M0k9M3j28J17l8q5M6j43K3l9P5O5p5m8oP5jn5Q4j51
3617a68J17l03K97K6m0J71j46J37q7Q5LM4m9m2j04j55J59j71L19pk65J37q8J64
$$ plain form
3641 34 40 -87 86 -12 -144 -40 170 -113 46 -125 -38 -83 56 86 -36 -82 -54 -3 143 -120 50 5 -136 -85
3665 -85 37 21 146 -89 68 -120 -79 -187 72 42 58 23 -72 248 -111 24 -107 -17 -58 -41 -37 -74 -51 47 44 -82
3691 -82 -205 155 -108 32 -16 107 121 -3 -93 -14 7 -55 175 72 56 -72 88 -11 -196 -1 -120 -49 -115 -176
3715 -176 -128 -95 -88 144 143 165 -186 -8 169 54 123 -94 33 15 -59 95 119 75 -93 -172 -35 -11 78 1 -53 -240
3741 -240 -103 -153 -231 -60 -102 106 -41 -27 85 -101 155 -115 -39 15 -5 61 6 182 33 -25 -134 57 28 -11
3765 -11 -122 129 -115 -26 -138 -73 -62 -79 -147 -177 -109 -64 -183 -105 -21 2 53 61 124 157 -44 131 98 47 203 -15
3791 -15 -154 -21 -40 4 -58 -244 0 -58 -43 -44 28 -156 -4 -31 -111 -190 -86 -22 -70 4 45 10 -49 101 34 60 -18
3818 -18 15 114 37 172 34 28 140 -17 -35 61 7 -80 -3 -5 74 -234 122 -74 -71 -151 -2 -93 -30 39 28 146 155 53
$$ packed form
3641C4Oj27J73r8j32J04K10k83J59j71Q7m5J39L0j22m6K8N1J46k63J70m5j41N1
3665h5J22j6J25k35J57j88M1j08K59l0J6l5r5L20l59J35j31R0m1J7Ml7K3R8lj26
3691h2j23L60k63J40m8J23J4j24r0P9K1o2K30j03j6j28J60r9j85J95j19P1o6o1
3715a76M8L3PK32jK2l51J78J77j15O9k17J27j8p4J54K4m4j68p9J37K4Q9p7n4j87
3741b40J37n0p8J71m2K08j47J4J12j86K56k70P6N4k0O6n5J76j49n8j09J91k9l9
3765a1j11K51k44Q9j12O5J1j7o8l0O8M5j19P8Q4K3N1QO3L3k01J75l3n1J56k18
3791a5j39J33j9M4o2j86K44n8J5jP2j84J52k7q0p9J04O4m8P4M1l5n9J50o7K6p8
3818a8L3R9p7J35j38oJ12j57j8R6n4q7P7kP9l08L56j96Lq0J49r1O3O9j1J18Rj02
$$ plain form
3846 53 155 14 102 22 78 80 69 -4 -100 -16 60 47 20 -145 1 54 72 -14 -69 60 -92 -92 -6 7 -138 -38 6
3873 6 81 75 27 -102 15 -49 85 102 -145 -182 -24 -22 81 44 -6 -157 60 113 141 4 -91 90 9 -2 -132 52
3899 52 63 -60 -135 -59 -13 15 -28 10 -152 -31 -22 -68 -10 133 29 137 -73 167 -22 9 69 170 35 7 -79
3924 -79 103 -77 -108 -4 -10 -63 125 -26 -61 -138 -18 107 -10 -66 -77 -51 -85 -35 9 46 77 70 63 160 -146 66 12
3951 12 112 79 -6 59 -9 48 4 -10 15 -39 -22 -12 -57 -107 91 -80 -118 -77 190 -78 -269 0 1 84 -21 37 -46
3978 -46 116 -70 24 89 -19 -43 -68 -92 55 -128 -89 -150 62 -12 -66 -132 -26 -53 -23 81 -36 -53 76 22 -47
4003 -47 9 11 129 69 77 160 243 138 94 83 -12 -142 22 -43 -72 6 -152 -94 -148 -43 -154 19 -71 -29 -68 26 -42
4030 -42 -40 36 -76 -153 7 6 41 3 60 115 182 -28 126 158 26 -56 13 -41 -10 -14 -57 -190 71 -114 -159 -108 -108 -64
$$ packed form
3846E3J02j41Q8q0N6Kj1p3r6Q4P6j3k7j65J46N3J8q6n5J29j52%Q6J3j45J00M4
3873FP5om8j29J17o4J34J7k47l7J58KJ03l7n0j51K17N3K8j37r5J81q1j1j30J84
3899E2J1j23p5P6M6K8m3L8j62J21Rm6N8J43j04J08k10K40j89L1O0J01j35k8q6
3924g9J82j80l1J04on3J88j51l5p7J20J25j17n6j1K6l4N0M4L7L1ppR7l06K12n4
3951A2J00l3q5O5o8N7m4j4K5n4J7J0m5n0J98j71l8M1K67k68j91K69JQ3j05N8q3
3978d6J62j86R4O5j08k4k5k4J47j83L9o1K12p4n4o6J06k7L0J04j17j7J29n4o9
4003d7N6KJ18o0QQ3Q3j05m4j1r5j30J64o5k9P8j58N8n4J05j11J73r0M2l9R4o8
4030d2KP6j12p7J60jL5l8N7N5O7k10J54L2j32q2O9n4L1mm3j33K61j85m5N1%M4
$$ plain form
4058 -64 -135 -69 30 -90 37 -68 30 -169 144 91 191 159 -33 190 16 -44 -26 22 -141 1 70 99 80 42 -35
4083 -35 -53 33 98 -127 -104 -11 43 45 -85 6 16 63 -10 15 -9 262 231 -1 47 190 18 -6 -33 139 -106 -61 -41
4110 -41 -125 -78 95 23 -146 -43 90 -16 70 -134 48 85 -106 -40 -2 -91 -91 8 -143 129 88 30 -139 44 116
4135 116 93 52 -6 83 -167 67 -194 47 -7 22 114 -74 -35 -92 -180 58 -93 34 187 -73 35 -105 10
4158 10 14 -37 88 42 20 182 30 234 60 -10 43 -41 -128 -109 8 -87 -41 -67 48 66 -166 56 98 -101 41
4183 41 -79 -59 -51 -86 15 -78 -3 87 72 140 -147 -69 93 81 46 27 95 -17 76 -8 -81 -75 -31 152 126 30 67 46
4211 46 -51 -38 32 -104 -243 -49 -60 -22 -42 -1 -84 78 -150 125 102 104 74 169 -18 -60 127 24 160 159 -60 -144
4237 -144 -120 -57 28 -88 -80 -51 19 69 77 79 279 -120 -82 -41 77 86 50 145 -33 -6 258 -70 159 179 93 139 15
$$ packed form
4058f4p1O6R9j20J27j05R8j99L13n3J00l2j92K23j74o0J8M8j63J42O9K9j9l8p7
4083c5j8Q6O5k25K3R3N4Kj30R1J0M7p3K5k4K71l1k32M8J43j72k4k7J72k45M5K0
4110d1q4M7J73p2j69J03J33j06Q6k04J82L7j91O6L8q9%R9j51K72m1n8j69J83P2
4135A16k3m1n8Q9k50K34k61K41n4K9R2j88L9n7q8K38j51J27J53k60J08j40J15
4158A0Mn1J25m6k2J62j52K04j74p0N3q4q7J9J17r5M6k6J15J8k32K22M2j99J42
4183D1j20K0Ql5J01r3P5R0j5O8k87P8J62j2l5j9O8j12R3q4p3OM4J83k6r6L7k1
4211D6r7J3P0j36j39J94j1L8k0M1q3J62k28K75k3Kl0R5j87m2J87j03J36jk19q4
4237a44K4O3Q5j16QK9P0N0QKK00l99L8M1J18Rl6R5j78K7K64l28K29K0q6M6j24
$$ plain form
4264 15 123 -99 15 42 -86 -152 -44 -24 6 -19 -42 41 -20 -45 126 60 -210 108 -62 -70 28 156 150 -6 -26 15
4290 15 163 -66 -31 -39 27 69 -232 44 -45 -25 -43 -57 -114 -106 14 -38 17 -120 -32 -85 15 -10 32 53 6 131 94
4317 94 12 -61 -13 -13 101 114 -40 -1 -95 15 -125 -81 5 -55 -1 -25 -144 66 -97 -57 -40 33 -121 91 -18 61
4343 61 -107 14 -48 114 -64 -38 129 -6 -16 -35 96 37 111 -59 -81 -33 -47 34 2 55 -36 -47 85 -99 -96 -256
4369 -256 -8 41 124 18 -75 65 -128 -83 144 77 -32 2 -21 36 6 90 -122 -135 39 -96 -18 -185 -35 -28 -27
4394 -27 87 -109 82 11 137 -2 -54 -17 15 -5 -27 -34 -81 -8 38 -61 16 73 -79 -105 -94 78 11 118 -35 -21
4420 -21 52 4 80 53 38 55 -50 -157 -39 130 -102 -223 -67 -148 110 -84 93 43 151 84 -82 32 85 16
4444 16 -43 43 82 100 115 -45 -43 89 -3 78 165 -39 -85 -59 -22 17 -259 -97 62 53 -135 -46 55 -113 -7 148
$$ packed form
4264A5J08k22J14K7j28o6J08K0L0k5k3Q3o1k5J71o6k70L18j70qR8J28oj56k0M1
4290A5J48k29L5qO6M2l01K76q9K0j8j4n7QJ20n2N5j37Q8n3J00k5M2K1m7J25l7
4317I4q2p3M8%J14J3j54L9r4J10j40M4Q6o0N4k4j19K10j63M0J7P3j54K12j09P9
4343F1j68J21o2J62j78K6J67j35j0j9J31n9P4j70k2M8j4Q1l2N3r1j1J32j84Lj60
4369b56K48M9Q3j06r3J40j93M5K27o7j09L4k3N7l0Q4k12j3J74j35P8j67J50PJ
4394b7J14j96J91p1J26j39n2L7L2k0k2pm7P3M6r9P7N7j52k6J1J72o7J07j53J4
4420b1P3m8P6k7j5J7j05j07J18J69k32j21J56q1K58j94J77n0J08o7j66J14N3o9
4444A6n9Q6L9J8J5j60KJ32r2Q1Q7k04m6K6L7L9k76J62J59rj88Q9J01j68J06J55
$$ plain form
4470 148 -32 39 148 -60 -52 108 -10 87 144 49 -98 -5 -43 -18 -1 35 50 104 -228 -124 105 -76 -135 -101 -104 5
4496 5 -164 -152 -14 -150 -72 -152 7 176 197 -66 110 21 -4 -77 -53 6 88 -43 129 -31 -31 -73 -37 -67 -84 -18
4522 -18 -58 -85 34 -69 54 -118 120 17 18 119 113 58 222 -6 -119 127 111 200 -28 -160 -45 -172 -39
4545 -39 70 -25 21 -219 -95 16 -11 -7 -152 -139 -10 -182 -2 -80 155 143 80 -37 179 6 42 18 -23 -28 195
4570 195 55 145 80 43 -57 -19 -44 126 -138 -87 142 40 96 -56 -107 -213 -1 -50 -114 -112 -35 -18 -1 -45 33 76
4596 76 -41 20 58 -91 10 0 -61 67 -30 -28 -6 25 101 -130 141 -80 88 -36 49 -123 10 24 -31 93 76
4621 76 -107 30 -30 -160 -16 -43 100 -23 124 51 210 -45 -94 158 -69 -24 -2 -86 61 111 14 -109 -8
4644 -8 -86 -116 13 -110 2 -37 79 54 -39 7 -8 61 31 129 56 -85 20 -26 29 -49 24 -43 -149 95 13 96 -36
$$ packed form
4470A48j80P1J09k08QJ60j18R7N7r5j47R3l8K5J7L6J5N4l32J04K29j81n9L4lJ09
4496Ej69J2J38j36P8q0J59J69K1k63J76q9k5p3K4N9Q2j31J72j60%m2L6l0j7O6
4522a8m0k7J19j03J23j72K38j03JJ01on5J64k28j13K46j6Q9k28j32J15j27J33
4545c9J09r5M6k40J24J11k7Mj45J3J29j72J80p8K35j2o3j17K16j73L6k4m1nK23
4570A95j40R0o5l7j00L8k5J70k64N1K29j02N6j52n1j06K12m9o4KP7J7J7m4P8M3
4596G6j17O1L8j49J01j0o1J28r7KK2L1P6k31K71k21J68j24Q5j72J33J4n5J24j7
4621G6j83J37o0j30J44k7J43j23J47p3J59k55m9K52k27M5K2q4J47N0r7j23J01
4644hp8l0J29j23J12l9J16k5r3M6j5O9l0R8p3j41J05m6N5p8P3o7j06K44q2Q3j32
$$ plain form
4671 -36 75 -61 -4 42 -58 -45 -37 88 -90 113 90 -144 -60 -63 -4 135 -5 169 -93 81 -28 31 72 147 143
4696 143 -141 -41 41 50 91 42 45 21 40 -207 -101 -120 -78 108 59 21 31 119 -57 83 78 -84 -40 117 66 17 104
4723 104 29 49 -25 -9 98 -36 -10 92 -201 -43 58 98 -67 95 38 -114 72 47 15 -96 -3 -247 -11
4746 -11 -37 37 15 -167 18 -86 73 157 176 89 34 163 31 186 -43 -49 -117 35 99 -232 131 -126 -170 -92 29
4771 29 -58 69 -169 28 33 -141 44 67 100 -76 -162 -223 47 65 206 198 -140 108 18 -193 -2 32 -63 -125 113
4796 113 49 -153 195 54 -26 -117 8 -7 124 -44 61 41 63 -45 -61 84 47 11 -58 -75 95 112 112 -35 -188
4821 -188 21 27 70 48 -39 59 58 5 -51 -10 36 -71 -17 78 33 -143 -9 187 -13 124 57 -174 38 6 68 -55
4847 -55 40 -27 -29 204 -13 78 254 -87 -26 12 19 137 122 25 73 -135 7 -98 -16 87 44 -69 128 7 -14
$$ packed form
4671c6J11j36N7M6j00J3QJ25j78K03k3k34Q4lN9J39j40J74k62J74j09N9M1P5m
4696A43k84J00Q2RM1m9Lk4J9k47J06j9M2J86m9l8J0Q8j76J40nj62M4J57n1m9Q7
4723A04p5K0p4J6J07j34K6J02k93J58J01M0j65J62n7j52J86k5l2j11R3k44K36
4746a1k6P4k2j82J85j04J59Q4J9q7n5J29j32J55k29oo8J52O4l31L63k57m4P8J21
4771B9q7J27k38J97Nj74J85K3L3j76q6o1K70J8J41ql38K48r0k11J91L4r5o2K38
4796A13o4k02L48j41q0r1J25j5J31j68J05k0K2j08j6J45l7l6o9j7J70J7%j47j53
4821a88K09OM3k2q7R8jn3n6M1M6j07N4R5m5j76J34J96k00J37o7k31K12l2O2j23
4847e5R5o7kK33k17R1J76l41O1L8PJ18j5r7M8k08J42j05Q2J03m3j13J97j21k1
$$ plain form
4872 -14 -82 -87 -47 53 -40 -62 -76 87 -38 -155 -73 -52 -204 -33 -40 -38 44 -144 -22 -32 90 -52 78 -28 67 -16
4898 -16 72 -78 -59 75 -113 -29 -68 -93 -26 -73 -35 -74 39 -110 24 112 207 60 -31 49 105 128 79 -1 22 69 -5
4925 -5 -42 18 -24 6 73 -12 28 -117 -20 -27 -45 82 30 164 85 -117 -50 80 72 57 30 38 11 94 -28 -36 -13 -107 -118 25
4955 25 -243 -46 96 -13 -74 -135 -196 -102 -152 72 -126 30 63 -123 -110 -243 -29 -160 -57 173 242 30 -53
4978 -53 32 21 332 10 -3 -20 -162 68 42 -130 26 -166 7 -133 10 -41 -34 -50 -101 -190 69 -105 71 -45
5002 -45 119 81 6 28 39 5 -69 -47 -61 11 -34 87 76 140 58 -169 -129 -199 -152 -21 -81 113 -5 -64 -98 126 -1
5029 -1 16 61 139 89 289 -55 7 -48 150 79 111 80 -151 106 -9 63 51 -55 -63 32 0 63 -4 -18 111 94 101 34
5057 34 -53 -23 13 117 -101 42 116 -60 75 -67 100 -81 45 -32 42 -146 -32 -190 19 -200 -45 83
$$ packed form
4872a4o8nM0J00r3k2j4J63j25j17Q2K1j52J71pKQ2j88J22j0J22j42J30j06R5q3
4898a6Q8j50J9J34j88Q4l9k5O7m7L8l9J13j49J34Q8R5j47r1Q0N6K3m9q0K3M7p4
4925el7O0m2L0O7q5M0j45R7pj8J27n2J34p9k02O7J30qj5k7Qk7Q3j22qK3r4j1J43
4955B5k68J97J42j09o1o1o1R4n0K24j98J56L3j86J3j33K14j31J03K30O9k12q3
4978e3Q5j1L11l22j3j7j42K30k6j72J56j92J73j40J43n1Pj6n1q9K59j74J76j16
5002d5J64l8p5K2J1l4p4K2j4P2m5J21j1O4q2k27M0p0M7J31o0J94j18n9l4K24j27
5029aJ7M5P8n0K00l44O2n5J98p1L2l1k31K57j15P2j2j06qR5l2O3o7j4J29j7Po7
5057C4q7L0L6J04k18J43P4j76J35j42J67j81J26p7P4j88J14j58K09k19J55J28
$$ plain form
5079 83 -134 -53 -86 -48 63 -92 -47 47 -63 70 -32 56 -7 28 6 152 -65 72 47 81 16 -161 37 197
5103 197 160 9 -102 -19 30 42 -40 -97 19 122 -61 20 -68 -89 -17 -19 -76 -28 10 5 -10 -40 -113 71 1 -135 100
5130 100 122 60 -56 122 66 97 174 63 -50 -92 -100 44 46 113 -4 60 19 22 5 -32 -45 -208 33 -63 43 -8 -98
5157 -98 -42 61 -43 118 -28 2 103 -15 -10 271 64 12 -147 -1 -69 79 -31 -60 -113 -10 116 -140 -117
5180 -117 -122 -147 -27 -115 -11 87 -42 -3 -20 4 140 5 -87 128 87 -7 42 -74 -137 101 58 53 -19 17 52 88 -183
5207 -183 21 75 -98 50 -33 -99 -176 -71 8 2 57 92 -23 -32 24 -84 -48 46 139 90 90 67 -34 107 28 -55 22
5234 22 -9 70 -79 -249 -91 75 164 40 61 30 57 60 39 -21 -32 115 124 42 17 90 1 57 124 67 8 54 -37 -5
5262 -5 -66 133 -9 1 -75 24 50 -177 35 -139 -122 -55 -147 -11 48 -47 23 5 54 -8 73 -35 163 -12 11 17 137
$$ packed form
5079H3k17Q1l3L8J11j55M5R4j10J33j02Q8o3L5k2J46k17J37k5L4o5j77J98J60
5103A97l7j51j11Q3M9J2q2n7J16J03j83Q1q8k1P2kn7M8L8nj5l0p3J84p0j36K35
5130A00K2o2j16J78n6L1P7j11j13m2qJ44KO7j17O4m1Lj7l7j3j63K41r6J06n1r0
5157i8N6J03j04J61j46L0J01j18NK81k07n2j59J46o8J48j10k9n3J03J26k56K3
5180a17nk5J20q8J04R8j29L9j7K4J36j35r2K15m1r4M9j16o3K38m3np2L6L5L6k71
5207a83K04N4j73J48q3o6p7J05P9oN5L5j15rN6j08L6R4R3m9%k3j01J41p9q3P7
5234B2l1P9j49j70J58J66Q9j24K1l1K7Lk1o0j1J47Rq2k5P3q9N6O7n7n9M6r1L2
5262eo1J99j42J0p6R9K6k27K12j74J7O7r2J36N9r5P0j8M9o2Q1j08J98j75K3OJ20
$$ plain form
5289 137 43 188 58 -138 -44 -81 -66 -90 8 11 -111 -125 -91 -9 -98 22 144 17 -53 -66 -100 -97 -51 -105 259 32
5315 32 61 -87 -62 19 -136 33 -98 36 -147 10 -79 4 -78 68 42 28 -191 -31 -29 -167 -127 -131 52 -70 6
5340 6 -69 -13 52 21 95 -58 -84 139 0 84 -96 -122 44 77 3 -56 47 61 -55 -106 197 122 109 -39 -1 40
5366 40 0 -165 20 -48 -88 -59 50 174 -40 31 -61 95 87 -15 74 28 61 53 29 35 -79 19 -35 -7 -34 79 63
5393 63 -65 -76 39 -134 36 -127 38 -151 140 114 137 87 99 140 3 -30 88 64 -129 122 68 -158 56
5416 56 160 64 109 -110 -17 35 -138 -82 -46 -97 -79 132 193 -37 -128 -89 1 -40 69 -122 78 -46 50 -144 146
5441 146 -139 7 36 -20 77 -72 44 -177 106 -67 16 -101 -74 83 -21 -126 -38 86 -28 -57 -48 -125 3
5464 3 -67 -91 -1 7 -52 -37 81 36 88 89 21 -49 -51 80 131 -43 -76 12 -143 146 -181 84 2 -82 -32 26 -49 -7 -33
$$ packed form
5289A37r4J45j30j96R4l7J5k4R8Lj22j4L4Q2q9J20J22j27p0j3l4LM6n4L64k27
5315C2K9j48K5Q1j55J69j31J34j83J57q9Q3q2J46k6j4k19J60Kj38M0mJ83j22P6
5340Fp5N6O5l1P4j53k6K23j39Q4j80k6J66L3p4n9J03J4j16n1L03p5j3j48L8M1
5366D0m0j65J85o8m0K9J09J24k14P1r2J56qj02Q9m6L3qk4Oj14R8n4K8k7J13j6
5393F3j28j1J15j73J70j63J65j89K91k6K3n0J2M1j37l3J18k4j93K51n4k26K14
5416E6J04r6M5k19R3N2j73N6L6n1J8K11O1k30r1L9R0m1J09j91K00j24R6j94K90
5441A46k85J46K9n6R7j49J16k21K83j73Q3j17K7J57j04j05Q8J24j14k9Rp7J28
5464Cp0k4R0Qn9J5J18m5N2Jo8p0kJ31N1j74l3Q8j55K89l27K65q2q4N0N8p5M2k6
$$ plain form
5493 -33 -48 182 52 57 -102 19 -23 88 -12 -110 -12 55 -9 -99 -36 7 10 -3 102 -11 226 -13 -221 -30 -161
5518 -161 106 -122 -198 -52 58 -41 -63 -131 -50 -72 36 -30 96 -137 59 -11 -27 40 -104 -115 147 39 -98 -119
5542 -119 -180 -64 -142 19 27 -7 45 -18 -97 29 68 -81 -107 188 -9 12 -19 -75 2 35 -20 141 74 105 137 55 -18
5569 -18 -1 34 -227 54 -17 -51 49 58 30 59 -69 -98 -11 -62 23 -40 -47 -152 -86 -123 -68 -206 -34 -118 -19 8 -8 -3
5597 -3 32 -41 -86 -88 -57 -21 -123 27 22 126 -51 54 67 25 4 25 105 -191 -100 81 -12 -9 -30 33 -1 -114 -39 -36 13
5626 13 -99 -42 -150 -128 148 -32 164 1 11 -22 88 166 25 17 91 53 -122 -54 -38 -8 5 -28 -163 144 -40
5651 -40 -153 34 102 147 -87 -56 9 -5 -184 99 -26 -78 18 51 -80 73 -38 97 -91 20 119 66 51 -9
5675 -9 -166 -43 -269 -68 -59 -33 73 -96 176 10 51 10 87 66 66 -164 128 163 -19 65 161 17 35 143 101
$$ packed form
5493c3j5K30j30Nj59J21m2J11j00r8R8O7o4r0O3M3Lj3J05j13K37k39k08J91j31
5518a61K67k28p6J46J10r9k2o8Q1k2J08o6J26k33J96p0j6O7j44j1K62j08j37k1
5542a19o1J16p8J61Ql4N2o3p9J26L9j49k6K95j97K1l1n6P7L3n5J61o7L1L2q2p3
5569a8J7L5k61K81p1l4J00Rk8K9j28k9Q7n1Q5o3pj05O6l7N5j38J72q4R9K7j6N
5597cL5p3m5kL1L6j02J50nJ04j77J05J3m2k1K1Q0k96R1J81r3Lk1O3l4j13P5LM9
5626A3j12N7j08K2K76j80J96j63J0l3J10P8j41qP4l8j75O8J6L0J3l3j35L07j84
5651d0j13J87O8M5k34L1O5j4j79K83j25n2R6L3j31J53j11J35j88J11R9n3j5o0
5675ij57J23k26K01RK6J06j69K72j66M1m1P7k1%k30K92L5j82Q4R6j44J8J08m2
$$ plain form
5700 101 -48 -21 -32 111 -251 -12 -20 118 -142 -53 -201 50 -90 -34 -25 -157 87 17 77 28 -40 171 100 -141
5724 -141 101 123 55 34 -144 -34 -89 7 123 10 48 -16 -14 -224 -9 -1 28 12 32 52 29 -54 140 -147 78 -174
5750 -174 -53 -85 74 8 -29 -28 26 -116 62 154 168 -225 54 50 -37 -151 150 34 37 139 113 -13 -109 55 101
5775 101 -3 102 14 59 132 -9 -57 -119 -16 -33 -43 -113 -48 57 133 -83 -22 47 -33 -52 7 -37 -86 -15 57 42 -68
5802 -68 -12 20 -69 103 -82 94 -54 -19 -65 -68 -128 -25 5 -104 134 70 58 52 77 -3 -55 156 -48 7 -72 -144 158
5829 158 5 -30 -130 132 12 109 77 -105 -25 -30 -1 149 -61 21 29 -65 -63 39 30 -19 -130 126 24 20 59 79 27
5856 27 105 -70 -109 -104 -39 70 -15 -29 -61 -6 36 118 -14 106 32 43 -14 126 -20 96 -125 74 -17 50 30 32 158
5883 158 -49 31 19 11 -102 -36 103 136 83 -53 -83 -44 -137 40 -101 -60 -77 -4 -20 -97 -53 -16 -120 -13 -25 86
$$ packed form
5700A01j49K7j1J43l62K39qJ38k60Q9j48K51j40N6Rj32K44p0O0m9o8K11p1k41
5724a41K42K2o8k1j78J10n5R6J16j13L8o4Kk10K15QK9j6K0K0k3q3J94k87K25k52
5750a74J21l2J59o6l7JN4j42J78R2J4l93K79mq7j14L01j16LJ02k6j26r6J64M6
5775A01j04J05q8M5P3j41m8o2J03j7j0p0O5J05P6k16O1O9q0j9N9m4m9P1P2j5j10
5802f8N6L2q9J72j85J76j48L5m6lo0J03L0j09K38o4j2oK5q0n2K11k04N5p9p2L02
5829A58j53l5j00K62j20R7l2j82Q0nK9J50k10Q2Qr4KJ02rm9j11K56j02mL9K0n2
5856B7P8j75l9NO5J09q5j4l2N5M2Q2j32J20p4J1n7J40j46J16k21J99r1O7k0KJ26
5883A58k07Q0j2qj13O6J39L3n3j36l0L9r3J77j41M1j7P3j6p7M4L7j04J07j2J11
$$ plain form
5909 86 87 109 -50 41 29 39 -84 107 -4 15 46 1 -40 115 -21 -53 42 -32 -10 -75 -56 -64 46 -35 -13 -55 -32 -53
5937 -53 48 -187 -87 7 -8 50 -30 -90 150 26 29 -131 43 -31 17 67 25 30 -17 -16 7 -119 -3 205 27 59
5963 59 -66 -92 -6 -88 186 97 -152 125 95 -19 -40 14 -59 25 -2 85 17 26 5 69 72 81 -12 80 -4 -29 37 -3 86
5992 86 -97 -101 27 50 -19 28 1 42 28 24 29 -75 -126 86 -39 -45 -29 28 -35 -20 -59 -40 -77 -52 -71 -13 54 30 -123
6021 -123 -149 44 41 -34 -66 84 78 -171 -81 -61 -18 95 125 -92 140 -35 -34 42 -18 26 55 29 -6 39 18 -140 -6
6048 -6 137 -57 -94 6 -34 78 61 -178 149 -109 131 65 51 -66 -96 36 -84 -4 52 80 -18 -47 -92 125 -41
6073 -41 -46 -80 22 101 -83 -21 14 17 -70 -74 190 132 -76 -32 12 26 -207 -66 -31 -24 -22 -26 -66 -6 140 -82 27 130
6101 130 -49 -118 18 136 42 -42 21 122 26 81 16 100 -34 54 64 1 76 51 -250 -18 -47 46 -4 -131 91
$$ packed form
5909H6JK2j59R1j2J0j23J91j11J9L1m5m1J55j36l2R5p4K2o5J9qJ10q1K2m2K3k1
5937e3J01k35J00R4j5N8q0o0K40j24Lj60J74p4M8N0m2Nm7JK3j26J16K08j78L2
5963E9j25k6Q6q2K74q9k49K77l0j14k1N4p3Q4k7Q7o8Rk1O4LRr3R2q4k5O6m0Q9
5992H6j83mJ28K3o9M7k7M1j4mNj04n1K12j25oJ6N7o3J5l9J9l7K5j9N8O7k4j53
6021a23k6J93lp5l2J50ok49R0K0M3J13L0k17K32j75JP6o0M4K9k6l5M5k1j58J34
6048fJ43j94l7J00m0J12j7k39L27k58K40o6j4j17l0J32j20Q0N6K8r8k9m5K17j66
6073d1nl4J02P9j84O2L5Lq7mK64n8k08M4M4J4k33J41L5PKmm0O0J46k22J09J03
6101A30j79o9J36J18r4q4O3J01r6N5o5Q4j34Q8J0o3P5k5l01K32k9R3n0j27K22
$$ plain form
6126 91 57 135 9 -9 32 2 27 -31 56 -74 -18 -55 70 142 -196 133 173 -28 172 22 41 121 -60 5 -5 102
6152 102 -23 108 -57 150 69 31 66 -117 -117 -53 24 -23 12 -40 -120 -222 30 -68 -150 -6 -80 107 -2 -81 -77 32
6178 32 -7 -82 -32 -79 44 49 -108 101 18 -104 91 112 47 -25 180 -41 76 8 17 91 -96 -15 -108 189 -62 -42
6204 -42 69 32 -73 -32 -83 -46 14 29 67 -20 30 -102 -96 -143 17 -21 78 44 -31 -17 38 25 10 245 -2 -64 -93 -38
6232 -38 -86 92 -83 194 -52 9 -18 54 74 -207 -23 106 29 -104 32 35 -1 -45 1 1 -29 -5 -60 -76 -87 144
6258 144 -77 7 -169 -40 -63 151 -93 111 24 32 -155 -181 31 29 20 30 101 13 46 189 109 -45 143 84 -80
6283 -80 129 88 74 26 -73 43 74 145 -46 -115 19 -9 110 44 -10 119 32 8 69 84 -106 68 -98 -176 -118 -165
6309 -165 13 -55 -59 161 -113 -64 37 39 6 61 -29 -27 74 10 9 106 -43 39 42 52 -78 -109 -11 43 -136 -105 23 -94
$$ packed form
6126I1l4P8j26j8M1l0K5n8Q7j30N6l7J25P2l38L29M0k01K00j50J9Q0j81O5j0J07
6152A02j25J31j65K07q1l8L5j83%O4P7m7L5n2q0j02K52r8q2J44p4J87j09p9MJ09
6178C2l9p5N0m7J23Nj57K09q3j22J95K1o5p2K05k21J17o8RP4j87Q1r3K97k51K0
6204d2J11l7j05M1n1L7O0J5L8q7N0j32Om7J60l8R9l4p5J4N5j3j5K35k47o2k9N5
6232c8m8J78j75K77k46O1k7P2K0k81J84J29p7j33J36Ll6m4M6%l0K4n5j6j1K31
6258A44k21Q4j76J29k3K14k44K04q7Qj87k6K12krJ0P1q8L3J43q0j54J88n9j64
6283h0K09m1j4m8r9J16L1P1j91o9J34k8J19o6n4J29q7k4O1J5j90J74j66p8N8m7
6309a65J78o8mK20k74M9J01Kl3N5r0KJ01o4jR7j49Q2LJ0j30l1R8N4j79L1J28j17
$$ plain form
6337 -94 128 -96 -55 -31 27 -29 26 2 1 -110 24 34 8 103 100 -210 -107 60 81 -43 -63 -84 114 -119 126 -41
6363 -41 -101 -21 31 -68 -119 87 115 3 41 -45 -8 -191 -9 -39 -260 198 -90 -93 25 105 -27 60 -35 114 -164
6388 -164 123 -43 23 -75 77 49 19 -82 94 -12 -83 131 -78 -139 -84 12 -14 154 49 -38 -107 -86 -14 -6 -37
6413 -37 89 -41 -59 -3 149 -37 147 -144 24 -68 -50 -12 73 45 62 -153 18 -64 80 -24 -58 -67 9 -63 7
6438 7 -62 60 54 42 96 -77 -10 71 44 85 -36 -21 -17 -27 28 -9 30 -25 -52 26 7 -52 168 141 -29 25 75 -36 11
6467 11 -74 75 105 92 57 -104 47 62 143 71 88 -41 -40 6 -43 53 -157 10 -135 30 26 17 130 -33 48 42 97
6494 97 -86 -123 113 -40 -106 132 45 30 -56 -19 -31 42 73 -55 -48 -125 51 88 3 -4 64 13 -74 10 -70 -112 129 84
6522 84 37 -109 1 -42 -19 -24 -127 33 -70 149 -2 -57 -67 80 104 136 -48 -132 14 3 81 -98 117 27 -112
$$ packed form
6337i4K22k24M1K4N8n6N5k4jj11J34J0k6R5ll10J03J67K1j24k0k1J98k33K45j67
6363d1o0Q0N2r9n1K06K8j12L8q6L7j83J82l0k21M58k88lJ18Q0j32Q7r5J49k78
6388a64K87j66O6r8J52k8l0j01J76j06p1K14k09o1N5R6k6J68j05q7o9K1P2Ql1
6413c7J26j30j8N6J52j86J84k91J68r2J8L8Q5k8J7k15J71q2J44j04l4rP6p2P0
6438Go9J22oj2N4j73O7Q1k7M1j21J5Mj0N5l7L9n5k7P8j9n9K20k7j70N4N0j11M7
6467A1q5J49L0j3l5j61J51J5Q1p2J7j29JM6m9R6k10J67j45J65mrJ13j63Q1oN5
6494I7j83l7K36j53o6K38q7j5q6L7j2P3L1j28Pp7J76L7q5pO8n1q7Q4q0m2K41m5
6522H4m7j46J10m3K3nj03J60j03K19j51n5j0J47K4L2j84q4J46j1P8j79K15r0j39
$$ plain form
6547 -112 -24 -7 -52 -163 -27 4 -58 80 174 22 101 30 -76 -8 27 7 -29 -109 152 44 -81 28 172 33
6571 33 -62 221 -168 -98 -140 -81 39 -5 -39 -5 28 -159 44 139 -23 -30 -16 39 -40 58 -53 -199 -154 -240 4 71
6597 71 -174 30 74 83 17 -33 -42 -180 -80 -39 -105 95 -84 17 16 57 -1 -32 -33 -55 72 19 -4 -29 114 -59 -57 -246
6625 -246 -63 -125 42 103 15 -174 39 28 -191 30 -31 -34 73 59 130 -113 -15 156 11 -53 159 73 225 172
6649 172 140 -7 -19 -10 -13 -33 -68 139 58 50 17 32 79 63 -13 -41 -6 37 172 -123 -78 -33 -46 5 -37 60 -3 -59 -54 -94
6679 -94 -202 -12 -48 -148 -15 -42 46 -4 5 18 -47 32 -107 -54 114 46 3 -12 218 -33 38 87 -47 73 -133
6704 -133 65 24 49 -35 -132 -158 221 157 49 -27 -44 14 14 -111 26 -70 97 -37 11 168 -13 -14 64 78 12 -14
6730 -14 170 -101 139 56 -36 -60 26 49 -71 -26 -86 39 -16 75 75 188 3 -31 29 23 -27 -15 -4 32 -116 -24 -67
$$ packed form
6547a12Q8J7m5j11J36L1o2J38R4j52P9p1j06O8L5k0l6q0K61j08j25J09J44j39
6571C3r5K83l89P0m2N9J20m4l4L4L3j87K03R5j62pJ4N5p9R8j11j46M5q6K44O7
6597G1k45K04M4Ro6n0rj38J00M1o6K00j79J01jM1n8l1jk2J27n3k3k5J43j73Kj89
6625b46J83o2J67O1q8j89K13j1k19K21o1lJ07j4P1k43R8J71j45o4K12q6J52n3
6649A72l2j47j2Rlk0l5K07q1ql3J5M7j6p6k8L5M3J35k95M5M5j3N1m2R7o3n6Nm0
6679i4j08J90l6j00J33k7Q8n0RJ3o5P9j39N3J68o8m3j5K30k51P1M9j34J20k06
6704a33J98m1K5q4r7k6L79o4j08p6j7N8%j25J37r6J67j34M8J57j81jP8J4o6k6
6730a4J84k71K40q3r2k4Q6K3j20M5o0J25n5R1%J13j85l4O0on0J2J1L6j48R2m3
$$ plain form
6757 -67 59 1 183 -40 97 -117 -49 -142 -121 5 -52 46 -145 -93 -197 47 -69 -119 74 10 32 2 -7 -70 -61 115
6783 115 77 30 116 8 -4 2 -80 62 -35 -13 74 -55 -138 -6 48 63 118 -198 66 -47 -33 -16 -65 -14 172 48
6809 48 91 37 153 -114 28 -39 2 110 -87 2 -10 1 -34 -8 74 -24 36 60 45 16 125 83 -107 -125 170 21
6835 21 -5 170 -6 89 71 114 -56 2 115 -86 -32 31 88 6 -123 -64 -133 -9 -34 -121 -67 -127 12 -21 102 41
6861 41 -62 53 73 25 23 -33 69 -181 56 -57 -7 50 19 -99 62 138 -19 55 41 14 -111 -44 -82 57 -67
6886 -67 101 -170 20 -1 35 6 -55 94 19 -121 145 36 -159 -68 25 0 -7 -36 -2 -15 39 -80 -47 -30 -86 7
6912 7 83 -14 -40 -81 15 42 -105 61 -6 79 29 75 -62 38 -53 61 160 -38 68 78 -2 -114 -113 63 -51 13
6938 13 17 -9 38 48 36 14 139 113 -72 105 -31 16 76 53 90 -86 48 62 59 153 76 0 19 55 -48 112 90
$$ packed form
6757f7J26n8J82k23J37k14O8r3K1J26n7R8j91N2j04K44j16n0J93o4K2l0ro3RJ76
6783A15l8m7Q6j08j2Oq2J42r7K2Q7j29q3J32N4J5N5l16K64j13J4J7m9N1J86j24
6809D8M3n4J16k67J42o7M1J08j97Q9j2J1l5K6Q2r8O0K4j5k9J09m2j90j8K95j49
6835B1k6J75j76R5j8M3j70N8J13k01N4O3N7q2j29N9o9J24k5q7N4o0J39l3J23o1
6861D1j03J15K0m8kn6J02k50K37j13N0N7l1j18J61P6j57P4j4k7j25O7l8J39j24
6886f7J68k71J90k1L6k9o1J49p5j40K66j09j95R1R3k5pk9L4j3N4j19L3J7n6R3
6912GP6r7k6m1R6K7j47J66o7Q5n0M6j37J00r1J14R9j98J06J0q0j12JJ76j14O4
6938A3Mk6M7J0j2k2J25k6j85J77j36M7O0k3L7j76J34J4lR4p7p6J9L6j03J60k2
$$ plain form
6965 90 -146 1 58 -79 23 -135 -98 17 46 71 45 29 9 46 11 -86 -68 -31 60 49 -61 -176 74 77 -14 12
6991 12 -13 -76 -48 -41 55 71 62 20 -25 71 -15 98 -80 -62 4 105 47 118 49 62 -14 40 51 -178 -35 -167 -166 78
7019 78 -61 5 -13 65 -8 -118 21 -35 94 64 20 -49 -41 27 -18 127 21 46 -34 -193 -8 87 10 49 -30 57 -138
7046 -138 -51 -69 -124 -90 -36 7 26 -144 41 14 -39 43 -155 -20 127 -145 -96 -5 26 34 69 121 22 -10 -75 -49 115
7073 115 37 129 -12 -75 -51 -14 -61 -18 89 36 38 -35 48 -152 -9 -172 -10 27 -5 77 40 -27 86 -190 20 -2
7099 -2 64 61 15 99 174 123 51 -54 2 12 -86 42 -179 -71 22 -55 59 -18 -40 -9 104 95 70 68 -62 -48 112 -73
7127 -73 78 -61 -22 -40 -48 -12 104 16 -79 84 32 51 -4 31 74 -90 0 -53 -37 -56 -62 -38 100 117 -33 109 147
7154 147 122 51 121 7 -85 27 19 -113 -68 122 -115 9 -197 74 -39 15 -97 -49 -81 -117 92 66 -36 -170
$$ packed form
6965I0k36J47N7j37J02j58L7J15K9K5k6j6k0L7l5r7J8L7R1j1j10j15K50Lr1K6
6991A2k5o3K8PR6J6rm2m5R6q6J13j78J8O6J01n8P1o9J3p6N4J1k29J43j32JK44
7019G8j39O6j8P8p3j10J39n6J29l0m4o9QO8m5J45j06K5q0j59J85R5p7L9p9Q7j95
7046a38Q7j8n5L4N4M3J9j70J85k7n3Q2j98J35J47k72M9R1L1QL5N2r9l2o5K6J64
7073A15p8R2j41o3K4L7m7M3J07n3Kp3Q3k00J43j63J62L7l2Q2l7o7J13k76K10k2
7099bO6lm6Q4P5n1p2j05N6J0r8J28k21J08R3p7J14p7k2L1J13rk5kj30J4J60j85
7127g3J51j39L9j8qL6J16q8r5J63n2J9n5L5M3j64R0n3J6j9oK4J38J7j50J42L8
7154A47k5p1P0j14r2J12qj32M5J90k37J24k06K71j13N4j12M8l2l6K09k6j02j34
$$ plain form
7178 -170 -73 15 59 101 -54 -56 28 20 98 -56 -12 39 118 -46 203 87 69 -189 -57 36 18 -63 55 8 -146 -61
7204 -61 29 -34 -6 -54 46 132 1 -44 -107 -247 -7 -38 2 30 100 -57 31 75 -161 -33 25 -103 -43 -33 -87 60
7230 60 -28 -13 32 -21 55 81 -161 50 -49 -1 -111 -81 -5 -2 -42 -25 117 -79 44 -98 -200 52 86 -87 92
7255 92 -106 29 -33 39 -88 -71 74 -122 45 12 120 87 32 -2 105 26 -13 -69 -136 2 -84 21 78 -174 7
7280 7 -94 -122 191 -15 99 43 -42 32 57 73 44 102 -57 107 83 -22 -138 55 109 48 -127 71 -63 -46 -18
7305 -18 -148 42 -37 -42 -45 -49 52 -46 -86 122 5 11 57 -72 7 -16 -43 -157 -74 -141 16 -16 -278 68 190 39
7331 39 -180 119 39 34 160 -20 -39 -46 76 -61 -6 -95 31 37 47 -61 -21 -11 -22 -109 20 -114 5 -182 118
7356 118 -26 -110 -69 -66 -170 -115 107 105 -87 97 80 -61 85 -43 55 36 52 -27 88 35 -152 -83 68 -25 -124
$$ packed form
7178a70R7Q8M4M2j55kQ4qP8j54M4N1P9j64K49j16j8k58J32R3j8q1J18m7j54Q5
7204f1R0o3K8m8J00Q6j31m5o3j40K40l1M0K8P0j57Q8M4k36J28N8j28O0J0n4J47
7230F0q8J5M5n3P6K6k42K11r9M8j10L0P6Lm0J7J42j96J23j42j02K52L4j73J79
7255I2j98J35o2P2j27J7J45j96J67l3J08l3n5l4J07p9l9n6o7J38q6J05N7k52J81
7280Gj01k8L13k06J14n6q5P4K5J6k9N8j59J64k4j05j16J93N4o1j75J98j34J7K8
7305a8j30J90p9nlmJ01r8m0K08j17OM6j29P9k3k7j14Q3o7J57l2k62L46J22j51
7331C9k19K99q0nJ26j80j9pJ22j37N5q9J26OJ0j08M0J0j1q7J29j34J19j87L00
7356A18j44q4M1Lj04N5K22kj92J84j7j41J46j28R8j9J6p9J15n3j87O9J51r3r9
$$ plain form
7381 -124 60 -15 85 -166 -4 46 142 76 129 -54 -186 82 48 -84 -23 46 -44 -79 84 109 28 45 -48 13 12 -22
7407 -22 50 59 -97 -23 43 -86 -161 91 10 6 -32 79 16 168 -23 22 70 42 -122 11 50 -10 -98 -13 37 -101 -22
7434 -22 77 126 -254 41 70 -18 -154 -20 38 -82 28 0 -56 -8 -57 -23 -63 8 -42 113 15 75 -2 -18 -71 19 -60
7461 -60 -55 -62 -22 58 -118 68 -65 44 38 38 35 7 -218 -13 95 23 -47 15 -93 200 65 -72 85 124 234 -57
7487 -57 4 -131 -148 78 -102 154 7 -18 -7 -167 145 68 -35 -13 -33 112 136 131 18 -161 0 -62 -21 -22 -28 -173
7513 -173 58 133 -111 -5 -82 -129 -9 32 -25 32 -90 -103 104 81 -138 2 113 -92 59 -9 -156 46 -54
7536 -54 -33 33 -48 75 -30 80 -194 -138 -108 -155 -57 -44 42 28 -28 54 111 70 55 -67 25 137 -73 -28 -9 6 -233
7563 -233 118 -122 96 21 -67 -11 19 -51 -20 -122 -16 12 86 60 80 30 65 -114 -38 118 -92 20 128 6
$$ packed form
7381a24J84p5J00k51J62N0R6o6N3j83j32K68l4j32O1O9r0l5J63K5q1J7r3O1jl4
7407b2P2Rj56P4O6j29p5K52q1ml8J11o3J52j91M5M8k8j64J33L9o0q8Q5N0j38P9
7434b2R9M9l80K95K9q8j36J34N8j20J10k8n6M8m9L4m0P1n0J55r8O0p7j6n3R0p9
7461f0NpM0Q0j76J86j33J09o%lk8k25K05J08p2p0O2j08K93j35j37J57L9J10k91
7487e7O1j35j7K26j80K56j47k5J1j60L12p7j03K2k0J45K4nj13j79J61o2M1joj45
7513a73K31P5k44J06p7m7J20M1n7N7j22j3K07k3k19J40J11k05J51o8j47K02j00
7536e4K1O6q1J23j05J10k74N6L0m7R8J3Q6j4n6Q2N7m1j5j22R2J12k10M5J9J5k39
7563b33L51k40K18p5q8N6L0p0L1j02J06K8P4k6K0n0L5j79P6J56k10J12J08j22
$$ plain form
7587 6 17 -182 -58 48 98 81 -172 -7 -17 -127 -55 -7 -6 64 -179 -35 -159 -101 69 54 -103 -4 -27 -37 80
7612 80 59 -197 93 51 -41 20 -223 -13 -159 -37 -128 36 44 18 -82 -60 -113 62 55 -47 177 -97 84 127 7
7637 7 60 145 -8 -42 -91 94 105 -64 61 -67 92 9 76 -56 -8 -42 -26 -60 -148 -43 -51 -36 -39 105 -98 22
7663 22 40 -4 -36 -113 -25 -92 -123 -4 -11 -32 -30 -165 61 -59 28 72 30 -27 -81 -98 24 14 19 56 -78 -20 -113 -22 -31
7692 -31 -42 -75 -131 -75 57 -8 88 7 76 -83 -30 100 -132 45 -35 145 153 -130 -51 80 25 -70 -143 41 -85 -9
7718 -9 -114 5 -9 -34 164 88 55 -210 -28 -127 16 72 129 -3 35 126 -94 -8 -64 -90 72 -44 44 45 -32 16
7744 16 112 -174 -47 -145 -117 34 36 -43 -136 43 80 64 -50 -3 129 33 -82 176 -94 -3 -118 18 -33 -74 -90
7769 -90 10 -58 -41 -30 162 14 -187 -97 -46 -30 -63 113 -90 95 84 -124 128 -1 -63 -13 -27 28 -59 88 61
$$ packed form
7587FJ1j99J24J06N0j7k53J65j0j10P2M8JP0k43J44j24N8J70j5j57R9k3j0J17
7612H0k1k56K90m2r2O1k43K10j46J22r1J64Qk6j00K2n3J75pj02K24k74J81M3j20
7637GN3Q5j53l4m9J85J1j69J25j28J59q3O7j32M8l4J6l4q8J05qJ5lJ44k03J20
7663B2J8m4l2p7Q8o7l1J19pk1Kj35K26j20Q7M4m2n7n4j7J22j0NL7j34N8r3R1r
7692c1j1l3n6N6J32o5R6q1O9j59N3J30k32J77q0J80Qk83P9J31n5r5p3J84j26P6
7718ij05J19j4k5J98p6l3k65J82r9J43N6N7j32L8R1k20Q6n6k6J62j16Q8Jp7M8
7744A6R6k86J27r8K8J51Kp9r3J79L7j6j14M7J32r6j15K58k70R1j15J36n1m1j6
7769i0J00o8J7J1J92j48k01R0N1J6l3J76k03J85j1k08K52j29o2N0j4N5q7J47k7
$$ plain form
7794 61 36 -157 -29 79 -35 -20 -49 56 -118 -52 -26 -61 -150 -59 -58 -27 -24 -86 -141 74 124 -13 -101 -22 26 57 75
7821 75 113 -55 88 -8 -65 -77 47 135 -52 74 -13 21 66 -62 96 54 -64 224 -127 24 163 87 14 43
7845 43 -32 81 55 88 -11 16 4 -64 104 10 28 50 -25 24 -54 9 -173 98 94 -88 -28 -32 -27 -125 12 -1 -6 11 69
7874 69 26 76 73 -34 61 -54 32 -60 -11 18 76 -105 102 58 -186 37 -49 16 15 -111 -24 166 -107 -81 -95 47
7900 47 15 -21 -7 -105 95 -4 -71 10 -92 -1 32 -78 25 6 -150 -59 -29 -57 16 -12 53 93 110 113 -46 -39 -8 25
7928 25 -26 15 133 149 86 -103 -30 192 112 -17 56 67 -34 122 28 38 95 93 10 18 -72 74 53 34 -21 191 -121
7955 -121 -25 29 93 28 -71 -4 115 -41 47 81 -48 -6 -49 5 29 -6 35 8 -125 -102 -55 -168 140 -73 46 -33
7981 -33 10 106 -99 -4 162 -64 1 37 9 -26 -1 -70 -60 -187 211 -137 -37 65 -110 16 -107 -68 -77 -51 69
$$ packed form
7794F1k5j93J28J08j14J5k9J05j74O6K6l5q9R1JL1Lo2n5K15N0j37q8P9M8L1J8
7821G5L8j68J43r6n7j2J24Q8j87J26q7L4M5j28J58m2j18K88l51J51J39p6p3K9
7845D3p5J13k6L3r9K7j2o8J68r4J8K2p5M9p8O3j82K71mj82O0mNr8J37j3nJ7N8
7874F9m3N0lj07R5j15Q6r2M9K9N8j81K07m4k44K23q6O5jj26Q7J90k73K6j4J42
7900D7l2l6J4r8K00r9o7Q1j02R1L3j10J03j9j56R1L0k8P3k8O5M0J7Lj59PL1L3
7928B5n1M1J18J6o3j89P3K22q0j29P3J1j01J56r4J0N7kq3Qr0J46k1j9n5K12l12
7955a21R6N4O4o5r9O7J19j56Q8L4j29M2m3N4K4l5M1k7j33K3M7j13L08k13J19p9
7981c3M3R6k05R5J66k26O5L6k8l5K5o9J0j27L98l48J00J02j75J26j23L9rK6J20
$$ plain form
8006 69 -80 18 40 -35 -2 -55 27 69 -131 -53 26 -14 120 -46 -36 19 -60 87 -81 132 107 62 13 77 42 -143
8032 -143 38 112 -54 -22 33 8 -47 -73 -128 126 -96 27 65 -14 -4 -205 -40 -58 38 -89 -116 -28 126 135 -43
8057 -43 230 -5 -94 -20 4 -110 -2 -125 15 -86 104 88 18 -37 -149 25 -83 134 1 -141 -84 20 -22
8080 -22 7 58 -14 105 -157 -114 -45 16 -16 -67 -3 -69 86 0 -7 6 13 19 -97 29 8 123 0 -183 -15 -141 47
8107 47 -31 28 11 79 -80 -137 -185 70 93 -19 -37 79 -56 39 -155 -36 -88 64 -33 -12 -81 25 -103 -23 41
8132 41 -188 90 4 92 -17 -101 -70 -3 -40 -73 47 34 77 145 1 -53 18 -10 14 49 -43 -99 102 126 -173 -110 -36
8159 -36 121 10 107 -73 70 -42 40 1 4 49 -94 -69 -3 -24 -7 -106 -54 73 111 -47 -128 -78 -24 29 63 136 68
8186 68 4 138 63 22 -102
$$ packed form
8006F9j49R8K2p5L3n3Q2M2k00P8P9m0J34j66J0N5p9J47j68K13k5m5m9O4l5j85
8032a43J81P4j66L2N5k5n5k6n5K54k22J23L8p9J0k01J65j8R6j27k7Q8J54Rj78
8057d3K73k35q9P4K4j14J08j23J40j01J90j6p0n5j12J74j08K17j33j42N7J04m2
8080b2K9N1p2J19k62M3O9O1l2n1O4o6J55q6pJ3POj16J26k1J15j23j83J68j26J88
8107D7p8N9j7O8j59n7m8K55K3j12j8J16j35R5j94J19n2J52r7K1o9J06j28Q0O4
8132D1k29K78q6Q8j09q4L1O7l7l3J20j3M3O8j44n4P1k8K4L5r2n6K01K4k99O3P4
8159c6J57j11R7j80J43j12Q2l9LM5j43K5O6k1J7r9N2J27L8j58q1N0N4N3L4P3o8
8186F8o4J34p5m1j24
8191a02
$$ Imaginary data points
##PAGE= N=2
##DATA TABLE= (X++(I..I)), XYDATA
$$ plain form
0 0 0 0 0 0 0 0 0 0 0 0 0 0 0 0 0 0 0 0 5 -8 8 -8 8 -8 13 -16 16 -16 24 -24 29 -32 37 -40 48 -53 60 -68 75 -84
40 -84 93 -101 113 -125 138 -153 169 -186 205 -227 249 -275 303 -334 370 -409 454 -507 568 -639
60 -639 726 -833 966 -1145 1391 -1755 2347 -3491 6523 -32437 -89054 -67121 -38694 14899
74 14899 70179 121928 144344 143079 124389 102080 72102 50253 36404 24512 7733 -8976
86 -8976 -23403 -33785 -45725 -51674 -58149 -74457 -98910 -119684 -131784 -127208 -101575 -51751 7100
99 7100 55181 86992 99291 87283 64723 47857 45988 56610 73761 93657 102927 90515 63913
112 63913 30249 -7686 -43204 -71530 -90170 -103552 -113741 -113044 -100825 -82551 -57741 -29630
124 -29630 -7459 2170 910 -823 809 9908 35367 72618 106857 128669 132058 115788 80600
$$ packed form
0@%%%%%%%%%%%%%%%%%%Nj3J6j6J6j6K1k9L2l2M0m8N3o1O9p7Q8j01J13j28J43j59
40h4J77j94K14k38K63k91L22l55L91m32M76n24N78o37P04p79Q63r61J075j207
60f39J365j559J799k111K536l146M102n838J0014l8960n6617K1933K8427N3593
74A4899N5280N1749K2416j265j8690k2309k9978k1849j3849j1892j6779j6709
86h976j4427j0382j1940n949o475j6308k4453k0774j2100M576K5633M9824N8851
99G100M8081L1811J2299j2008k2560j6866j869J0622J7151J9896R270j2412k6602
112F3913l3664l7935l5518k8326j8640j3382j0189O97J2219J8274K4810K8111
124b9630K2171R629j260j733J632R099K5459L7251L4239K1812L389j6270l5188
$$ plain form
137 80600 36962 1735 -22626 -37166 -40329 -38330 -39239 -46417 -56671 -65403 -73572 -79488 -76987 -69756
151 -69756 -60929 -46286 -24655 3584 34105 63419 89087 100976 94858 78601 56812 35281
163 35281 21311 19773 26713 32337 30687 20861 -2022 -33979 -63793 -85458 -94890 -92623 -80158
176 -80158 -59912 -40770 -24221 -7938 5175 14085 21282 26894 31270 32922 36044 44782 54256 63156
190 63156 71148 71701 60440 37658 8448 -20055 -45254 -60166 -60344 -52927 -42976 -33546 -29443 -31727
204 -31727 -38910 -45039 -44901 -39898 -27598 -7894 13367 33168 49609 61519 67910 65995 58268 48049
218 48049 33117 17767 7493 1616 -186 -146 308 -2837 -14662 -31247 -48132 -64012 -72684 -70696
232 -70696 -58090 -38629 -17784 2046 17575 24399 26202 25934 24872 25201 28238 34460 41854 46704
$$ packed form
137H0600m3638l5227k4361j4540l163J999r09p178j0254q732q169n916K501P231
151f9756Q827J4643K1631K8239L0521K9314K5668J1889o118j6257k1789k1531
163C5281j3970j538O940N624j650r826k2883l1957k9814k1665r432K267J2465
176h0158K0246J9142J6549J6283J3113Q910P197N612M376J652L122Q738R474Q900
190F3156P992N53j1261k2782k9210k8503k5199j4912j78P417R951R430M103k284
204c1727p183o129J38N003J2300J9704K1261J9801J6441J1910O391j915p727j0219
218D8049j4932j5350j0274n877j802M0M54l145j1825j6585j6885j5880q672J988
232g0696J2606J9461K0845J9830J5529O824J803k68j062L29L037O222P394M850
$$ plain form
246 46704 49706 49211 41090 27486 10098 -9433 -28893 -45192 -53816 -54257 -50241 -41043 -29758 -22805
260 -22805 -20152 -21007 -23165 -24134 -21636 -11686 4331 22001 40399 55287 62981 62408 54516 43078
274 43078 28677 13850 3093 -3309 -7712 -9357 -10223 -12486 -17966 -27013 -36593 -46251 -54791 -56235
288 -56235 -50530 -39011 -22159 -3239 15105 28544 34996 37340 34952 29837 26376 25804 27877 31770
302 31770 35003 36526 32830 22558 8934 -8090 -26073 -40797 -50254 -52666 -49621 -42118 -31063
315 -31063 -20946 -14357 -9695 -8180 -8110 -7002 -3475 5167 16359 29078 42294 51479 54528 51767
329 51767 42532 29303 13690 -367 -10133 -16611 -19327 -18413 -17258 -18325 -21279 -26913 -33186 -39821
343 -39821 -43200 -40362 -33052 -20921 -4669 11540 25344 34720 38701 38439 33406 27013 22533 19044
$$ packed form
246D6704L002m95q121j3604j7388j9531j9460j6299q624m41M016R198J1285O953
260b2805K653q55k158r69K498R950J6017J7670J8398J4888P694n73p892j1438
274D3078j4401j4827j0757o402m403j645q66k263n480r047r580r658q540j444
288e6235N705J1519J6852J8920J8344J3439O452K344k388n115l461n72K073L893
302C1770L233J523l696j0272j3624j7024j7983j4724r457k412L045P503J1055
315c1063J0117O589M662J515P0J108L527Q642J1192J2719J3216R185L049k761
329E1767r235j3229j5613j4057r766o478k716R14J155j067k954n634o273o635
343c9821l379K838P310J2131J6252J6209J3804R376L981k62n033o393m480l489
$$ plain form
357 19044 18656 20263 21320 20898 16296 7403 -4224 -18640 -32453 -42189 -47549 -46542 -40594 -30807 -19256
372 -19256 -9779 -2583 2216 3588 3537 4675 7307 12958 20799 29661 38221 42580 42553 37825 27150 13797
388 13797 -232 -12513 -20771 -25121 -25436 -22656 -20049 -18491 -18964 -21824 -25458 -28322 -28506 -24042 -16367
403 -16367 -4807 9020 21201 31158 36995 38211 34951 28516 21145 14694 9293 6937 6733 6846 6348
418 6348 3164 -3383 -12559 -23767 -33313 -39719 -41698 -37566 -28707 -17921 -6228 2807 9008 12062
432 12062 11773 11359 11827 13299 17021 21876 26838 30331 30884 28888 22840 12778 1618 -9754 -20109
447 -20109 -26826 -29950 -28410 -23866 -19120 -14538 -12473 -13795 -15709 -17994 -17832 -13213 -5143 6394 18340
462 18340 28059 34436 35971 32972 27267 19713 12943 7431 2799 563 -1113 -2806 -4238 -7192 -11703
$$ packed form
357A9044l88J607J057m22m602q893j1627j4416j3813r736n360J007N948R787J1551
372a9256R477P196M799J372n1J138K632N651P841Q862Q560M359k7m728j0675j3353
388A3797j4029j2281q258m350l15K780K607J558m73k860l634k864j84M464P675
403a6367J1560J3827J2181R957N837J216l260o435p371o451n401k356k04J13m98
418F348l184o547r176j1208r546o406j979M132Q859J0786J1693R035O201L054
432A2062k89m14M68J472L722M855M962L493N53j996o048j0062j1160j1372j0355
447b0109o717l124J540M544M746M582K065j322j914k285J62M619Q070J1537J1946
462A8340R719O377J535k999n705p554o770n512m632k236j676j693j432k954m511
$$ plain form
477 -11703 -17169 -23842 -29551 -33182 -34055 -29294 -20641 -9416 2781 12319 18362 19960 17792 15126 12858
492 12858 12999 16117 20273 24402 26078 23844 18474 9718 -505 -9711 -18181 -24364 -27415 -28355 -26769
507 -26769 -22940 -18310 -12932 -8878 -6546 -5691 -5976 -5670 -3077 2557 11354 21380 29890 35578 35583 30127
523 30127 21606 11161 2626 -3433 -6078 -6407 -6440 -7213 -9284 -13239 -17827 -21582 -24743 -25626 -24684 -22161
539 -22161 -16660 -10056 -1496 7735 16125 22313 24827 23576 19871 14985 11138 10695 12199 15490 17749
554 17749 16564 11825 2574 -8220 -17964 -25717 -28863 -27989 -24652 -19633 -14705 -10861 -7635 -5554 -3139
569 -3139 -325 1735 4382 7201 10174 14875 19647 24107 27882 27746 24224 16837 6603 -2900 -10550
584 -10550 -14354 -14101 -12007 -9348 -8235 -10340 -14202 -18884 -22373 -22609 -19887 -13819 -6023 1419 8509
$$ packed form
477a1703n466o673n709l631q73M761Q653J1225J2197R538O043J598k168k666k268
492A2858J41L118M156M129J676k234n370q756j0223r206q470o183l051r40J586
507b6769L829M630N378M054K332Q55k85L06K593N634Q797J0026Q510N688Nn456
523C0127q521j0445q535o059k645l29l3p73k071l955m588l755l161q83R42K523
539b2161N501O604Q560R231Q390O188K514j251l705m886l847m43J504L291K259
554A7749j185m739r251j0794r744p753l146Q74L337N019M928L844L226K081K415
569c139K814K060K647K819K973M701M772M460L775j36l522p387j0234r503p650
584a0550l804K53K094K659J113k105l862m682l489k36K722O068P796P442P090
$$ plain form
599 8509 13956 17282 19884 20502 19738 17793 14255 10699 7929 6109 6015 6642 6148 4206 -1124 -8921 -17109
616 -17109 -24584 -28107 -26998 -22257 -14746 -7338 -1710 1621 2135 1650 1650 2873 5915 9739 13704 17797
632 17797 19470 20323 19466 16860 13120 7960 1225 -5285 -11456 -15389 -16712 -15849 -12640 -9431 -8223 -8613
648 -8613 -11076 -14211 -15638 -14373 -9386 -1747 6648 14348 19379 20773 19924 16719 13156 10420 7887
663 7887 6531 5205 3663 2241 436 -1877 -4167 -7628 -11500 -15589 -19488 -21408 -20816 -17461 -11032
678 -11032 -3980 2948 7715 9196 8785 7114 5385 5951 8026 11491 15445 17596 17628 14911 9891 4270
694 4270 -1833 -7008 -10877 -13602 -14958 -14759 -13801 -11757 -9508 -7827 -6117 -5841 -6176 -6221 -5211 -2214 2798
711 2798 8608 14911 19373 21029 19670 15139 10111 4828 1024 -1004 -1231 -1236 -1141 -2475 -4990 -7793 -11342
$$ packed form
599H509N447L326K602O18p64j945l538l556k770j820r4O27m94j942n330p797q188
616a7109p475l523J109M741P511P408N628L331N14m85%J223L042L824L965M093
632A7797J673Q53q57k606l740n160o735o510o171l933j323Q63L209L209J208l90
648h613k463l135j427J265M987P639Q395P700N031J394q49l205l563k736k533
663G887j356j326j542j422j805k313k290l461l872m089l899j920N92L355O429
678a1032P052O928M767J481m11j671j729N66K075L465L954K151L2k717n020n621
694D270o103n175l869k725j356J99R58K044K249J681J710K76l35m5J010K997N012
711B798N810O303M462J656j359m531n028n283l804k028k27nR5j334k515k803l549
$$ plain form
728 -11342 -14107 -16091 -16693 -15499 -13010 -9103 -4022 1149 6082 9932 11790 12131 10739 8800 7596
743 7596 7335 8258 10443 11647 11884 9913 5491 -167 -6702 -12040 -15235 -16706 -15476 -13261 -10679 -7733
759 -7733 -5881 -4496 -3403 -3020 -2265 -762 916 4087 7517 11468 14929 17012 17354 15794 11690 6974
775 6974 1794 -2652 -5173 -6536 -6332 -5531 -5463 -6117 -7976 -10711 -12805 -14271 -13998 -11774 -8196 -3329 2072
792 2072 6338 10166 12161 12427 11938 10158 8663 7536 6642 6532 6900 6803 6044 3827 289 -3967 -8780
809 -8780 -12926 -15538 -16326 -14671 -11898 -8279 -4686 -2230 -511 404 356 990 2019 3629 6425 9414
825 9414 12397 14491 14751 13610 11070 6858 2657 -1608 -5152 -7073 -8138 -7916 -7128 -6904 -6631 -7482 -8887
842 -8887 -9968 -10626 -9866 -7642 -4250 426 5045 8672 11605 12542 12041 10636 8526 6429 5055 4096
$$ packed form
728a1342k765j984o02J194K489L907N081N171M933L850J858L41j392j939j204
743G596k61R23K185J204K37j971m422n658o535n338l195j471J230K215K582K946
759g733J852J385J093L83P55J503J678L171L430L951L461K083L42j560m104m716
775F974n180m446k521j363K04Q01O8o54j859k735k094j466K73K224L578M867N401
792B072M266L828J995K66m89j780j495j127q94j10L68r7p59k217l538m256m813
809h780m146k612p88J655K773L619L593K456J719R15m8O34J029J610K796K989
825I414K983K094K60j141k540m212m201m265l544j921j065K22P88K24K73q51j405
842h887j081o58P60K224L392M676M619L627K933R37n01j405k110k097j374r59
$$ plain form
858 4096 4246 4153 3299 2402 169 -2886 -6630 -10379 -12956 -13897 -13787 -11556 -8818 -5142 -1785 863 2586
875 2586 3062 3184 3365 3943 4960 6949 8984 10594 11807 11449 9823 6628 2803 -1182 -5029 -7536
891 -7536 -8745 -8875 -7995 -6769 -6119 -5699 -5894 -6493 -6853 -7068 -5693 -3330 -168 3765 7105 10244 11807
908 11807 11860 10808 8617 5986 3844 2263 1112 936 471 182 -694 -2742 -5096 -7659 -10209 -11546
924 -11546 -11884 -10767 -8088 -5052 -1526 1757 3649 5044 5402 5065 4841 4918 5333 6418 7660 8461 8923
941 8923 7839 5896 2712 -1271 -4525 -7644 -9311 -9449 -8981 -7755 -6055 -5138 -4070 -3874 -3795 -3672 -3273
958 -3273 -1776 439 3006 6046 8719 10495 11552 10645 9011 6423 3407 989 -721 -2010 -2196 -2383
974 -2383 -2386 -3063 -4791 -6374 -8197 -9786 -10058 -9343 -7335 -4421 -1362 1761 4311 5793 7019 6910 6567
$$ packed form
858D096J50r3q54q97k233l055l744l749k577r41J10K231K738L676L357K648J723
875B586M76J22J81N78J017J989K035J610J213l58j626l195l825l985l847k507
891g536j209j30Q80J226O50M20j95n99l60k15J375K363L162L933L340L139J563
908A1807N3j052k191k631k142j581j151j76m65k89q76k048k354k563k550j337
924a1546l38J117K679L036L526L283J892J395L58l37k24P7M15J085J242Q01M62
941H923j084j943l184l983l254l119j667j38M68J226J700R17J068J96P9J23L99
958c273J497K215K567L040K673J776J057r07j634k588l016k418j710j289j86j87
974b383lo77j728j583j823j589k72P15K008K914L059L123K550J482J226j09l43
$$ plain form
991 6567 5929 5343 5457 5587 5810 5880 5702 4577 2643 -455 -3831 -6949 -9436 -10375 -10330 -8881 -6520 -4722
1009 -4722 -3171 -2162 -1737 -1608 -1071 -492 1318 3359 5598 7799 9359 10168 10050 8669 6774 4309
1025 4309 1423 -754 -2967 -4136 -4372 -4448 -4246 -4321 -5114 -6205 -7763 -8908 -8550 -7456 -5071 -1833 1591
1042 1591 4708 6516 7345 7722 6811 6271 5783 5021 5010 4883 4646 4048 2884 1523 -544 -3019 -5396 -7473
1060 -7473 -9437 -9942 -9623 -8089 -5800 -3498 -1377 126 592 637 767 1188 2652 4307 6270 8460 9245
1077 9245 9354 8368 6092 3879 1329 -1072 -2596 -4040 -4715 -5128 -5379 -5340 -5302 -5375 -5474 -5699 -5816 -5626 -4888
1096 -4888 -2685 -170 2727 5760 7920 8561 8109 6759 5255 3879 2974 2722 2998 2848 2371 1244 -671
1113 -671 -2885 -4934 -6427 -7667 -8081 -7713 -6987 -5699 -3608 -1891 -29 1599 2266 2670 2692 2814 3171
$$ packed form
991F567o38n86J14J30K23P0j78j125j934l098l376l118k487r39M5J449K361J798
1009d722J551J009M25J29N37N79J810K041K239K201J560Q09j18j381j895k465
1025D309k886k177k213j169k36p6K02p5p93j091j558j145L58J094K385L238L424
1042A591L117J808Q29L77r11n40m88p62j1j27k37n98j164j361k067k475k377k077
1060g473j964n05L19J534K289K302K121J503M66M5J30M21J464J655J963K190P85
1077I245J09r86k276k213k550k401j524j444o75m13k51L9L8p3r9k25j17J90P38
1096d888K203K515K897L033K160O41m52j350j504j376r05k52K76j50m77j127j915
1113f71k214k049j493j240m14L68P26J288K091J717J862J628O67M04K2J22L57
$$ plain form
1130 3171 3861 4998 6706 7468 7731 6415 4281 1425 -1477 -3499 -4675 -5154 -4914 -4426 -4306 -4130 -4277
1147 -4277 -4662 -4474 -4298 -3738 -2646 -1428 195 2180 3899 5734 6955 7619 7010 5817 4196 2430
1163 2430 894 416 217 329 323 -336 -1284 -3296 -5350 -6693 -7361 -7045 -5979 -4464 -2368 -408 461 1993
1181 1993 2485 3063 3621 3626 3756 3852 4066 4444 4788 4792 4673 3725 1725 -332 -2952 -4798 -6067 -6372 -5633 -4545
1201 -4545 -3607 -2414 -2427 -2277 -2511 -2723 -1874 -695 716 2631 4344 5455 6221 6345 6078 5208 4034 2617
1219 2617 1017 -408 -1367 -2023 -1958 -2012 -2335 -2701 -3636 -4811 -5730 -6302 -5913 -4506 -2867 -560 1745 3135
1237 3135 4069 4312 4046 3828 3324 3514 3710 3653 3700 3582 2870 2176 706 -752 -2269 -4239 -5211 -6182 -6316
1256 -6316 -5542 -4454 -3224 -1744 -1031 -300 -287 -464 93 760 1922 3566 4779 6028 6442 5986 4969
$$ packed form
1130C171O90J137J708P62K63j316k134k856k902k022j176m79K40M88J20J76j47
1147d277l85J88J76N60J092J218J623J985J719J835J221O64o09j193j621j766
1163B430j536m78j99J12oo59r48k012k054j343o68L16J066J515K096J960Q69J532
1181A993M92N78N58NJ30R6K14L78L44Mj19r48k000k057k620j846j269l05P39J088
1201d545R38J193j3J50k34k12Q49J179J411J915J713J111P66J24k67q70j174j417
1219B617j600j425r59o56O5n4l23l66r35j175r19n72L89J407J639K307K305J390
1237C135R34K43k66k18n04J90J96n7M7j18p12o94j470j458j517j970r72r71j34
1256f316P74J088J230J480P13P31J3j77N57O67J162J644J213J249M14m56j017
$$ plain form
1273 4969 3599 1982 341 -813 -1856 -2328 -2822 -2968 -3232 -3331 -3634 -4132 -4339 -4805 -4653 -3913 -2761 -1038
1291 -1038 1032 2834 4133 5240 5225 4857 4162 3218 2918 2595 2675 2703 2417 1651 718 -731 -2384 -3936
1309 -3936 -4962 -5727 -5816 -5386 -4511 -3405 -2137 -930 -64 668 971 1200 1627 2108 2880 3976 4724 5501
1327 5501 5612 5029 4016 2280 671 -919 -2362 -2934 -3248 -3466 -2994 -3014 -3236 -3307 -3609 -3704 -3603 -3306 -2330
1346 -2330 -876 703 2270 3549 4555 5144 4833 4302 3677 2748 2025 1564 1145 1020 669 334 -453 -1788
1364 -1788 -3003 -4152 -5079 -5301 -5144 -4068 -3024 -1961 -554 358 1030 1604 1572 1750 2096 2442 3002 3664
1382 3664 4085 4286 4210 3291 2324 650 -901 -2040 -3336 -3628 -3625 -3461 -2738 -2592 -2411 -2384 -2439 -2370 -2046 -1722
1402 -1722 -613 352 1777 3221 3992 4553 4652 3876 3321 2271 1335 805 194 -78 -207 -632 -1084 -1471 -2560
$$ packed form
1273D969j370j617j641j154j043m72m94j46k64r9l03m98k07m66J52P40J152J723
1291a038K070J802J299J107j5l68o95r44l00l23Q0K8k86p66r33j449j653j552
1309c936j026p65q9M30Q75J106J268J207Q66P32L03K29M27M81P72J096P48P77
1327E501J11n83j013j736j609j590j443n72l14k18M72k0k22p1l02r5J01K97R76
1346b330J454J579J567J279J006N89l11n31o25r29p23m61m19j25l51l35p87j335
1364a788j215j149r27k22J57J076J044J063J407R12O72N74l2J78L46L46N60O62
1382C664M21K01p6r19r67j674j551j139j296k92LJ64P23J46J81K7n5O9L24L24
1402a722J109R65J425J444P71N61R9p76n55j050r36n30o11k72j29m25m52l87j089
$$ plain form
1421 -2560 -3241 -4065 -4391 -4150 -3755 -2886 -1517 -271 992 1865 2491 2556 2289 2251 2251 2291 2690 2883 2948 3250 2484
1442 2484 1587 499 -741 -2015 -3069 -3807 -3846 -3510 -3223 -2426 -1861 -1440 -1321 -1281 -798 -717 -230 761 1498
1461 1498 2727 3550 4100 4332 3934 3095 2264 1083 113 -545 -1086 -1167 -1449 -1816 -1842 -2183 -2671 -3170 -3694 -3766
1481 -3766 -3207 -2552 -1382 -156 1090 2171 2866 3001 3110 2814 2427 2212 2193 2174 2275 2131 2030 1077 288
1500 288 -809 -2035 -3064 -3643 -3912 -3911 -3593 -2806 -1949 -1534 -809 -473 -102 224 542 1005 1823 2356 3342 3849
1520 3849 4020 3925 3351 2353 1319 113 -808 -1453 -1847 -1764 -2137 -2228 -2275 -2692 -2811 -2971 -3217 -3092 -2229 -1445
1540 -1445 -337 840 1814 2906 3217 3610 3372 2853 2488 2003 1762 1643 1474 1310 951 179 -611 -1674
1558 -1674 -2746 -3283 -3873 -3903 -3592 -2901 -2295 -1337 -780 -145 244 476 832 1189 1595 2201 2624 3146 3414 3326
$$ packed form
1421b560o81q24l26K41L95Q69J369J246J263Q73O26O5k67l8%M0L99J93O5L02p66
1442B484q97j088j240j274j054p38l9L36K87P97N65M21J19M0M83Q1M87R91P37
1461A498J229Q23N50K32l98q39q31j181r70o58n41q1k82l67k6l41m88m99n24p2
1481c766N59O55J170J226J246J081O95J35J09k96l87k15j9j9J01j44j01r53p89
1500B88j097j226j029n79k69JL18P87Q57M15P25L36L71L26L18M63Q18N33R86N07
1520C849J71r5n74r98j034j206r21o45l94Q3l73r1m7m17j19j60k46J25Q63P84
1540a445J108J177R74J092L11L93k38n19l65m85k41j19j69j64l59p72p90j063
1558a674j072n37n90l0L11O91O06R58N57O35L89K32L56L57M06O06M23N22K68q8
$$ plain form
1578 3326 3270 2610 1670 588 -655 -1444 -2097 -2272 -2386 -2211 -2134 -2179 -2187 -2434 -2520 -2550 -1973 -1367 -446 557 1498
1599 1498 2477 3025 3095 3192 2833 2387 2277 1418 1104 906 520 262 118 -419 -989 -1789 -2735 -3262 -3597 -3350
1619 -3350 -2930 -2195 -1243 -412 284 553 801 854 1050 1521 1852 2242 2455 2816 2724 2499 2068 1237 597 -351
1639 -351 -1280 -1847 -2347 -2433 -2430 -2335 -1895 -1506 -1536 -1563 -1426 -1519 -1048 -674 407 1329 2110 2777 3060 2871 2539 2224
1661 2224 1376 990 685 291 198 -87 -584 -899 -1354 -1615 -2051 -2346 -2453 -2592 -2277 -1867 -1146 -279 434 1206
1681 1206 1513 1603 1471 1388 1432 1629 1688 1788 2128 2083 1542 873 140 -632 -1291 -2083 -2338 -2314 -2377 -1970 -1804 -1434
1703 -1434 -1031 -901 -521 -338 -337 91 380 962 1867 2180 2792 2888 2652 2286 1434 543 165 -492 -638 -804 -755
1724 -755 -970 -1221 -1727 -2006 -2282 -2317 -2210 -1965 -1442 -752 -294 683 1028 1638 2133 2042 2011 1928 1439 1367 1368 1362 1418
$$ packed form
1578C326n6o60r40j082j243p89o53j75j14J75P7m5qk47q6l0N77O06R21J003R41
1599A498R79N48P0R7l59m46j10q59l14j98l86k58j44n37n70q00r46n27l35K47
1619c350M20P35R52Q31O96K69K48N3J96M71L31L90K13L61r2k25m31q31o40r48
1639c51r29n67n00q6LR5M40L89l0k7J37r3M71L74J081R22P81O67K83j89l32l15
1661B224q48l86l05l94r3k85m97l15m55k61m36k95j07j39L15M10P21Q67P13P72
1681A206L07R0j32q3M4J97N9J00L40m5n41o69p33p72o59p92k55K4o3M07J66L70
1703a434M03J30L80J83JM28K89N82R05L13O12R6k36l66q52q91l78o57j46j66M9
1724g55k15k51n06k79k76l5J07K45N23O90M58R77L45O10M95r1l1q3m89p2JoN6
$$ plain form
1747 1418 913 820 37 -688 -1508 -2186 -2634 -2560 -2574 -2183 -1764 -1388 -1027 -685 -381 40 149 598 915 1175 1748
1768 1748 2171 2389 2600 2400 2063 1630 867 142 -430 -1061 -1369 -1471 -1401 -1485 -1564 -1792 -1736 -2044 -2089 -1900 -1492
1789 -1492 -922 -108 838 1118 1642 1981 2242 2050 2237 1692 1410 1423 1116 969 592 421 175 -404 -1176 -1640
1809 -1640 -2375 -2471 -2468 -2398 -2145 -1544 -851 -413 -68 75 301 550 848 1320 1531 1956 2131 2233 2165 1968 1654
1830 1654 906 220 -152 -575 -1142 -1503 -1553 -1541 -1412 -1624 -1475 -1432 -1670 -1530 -1445 -885 -190 62 1145 1537 1998
1851 1998 2113 2196 1872 1496 1387 967 892 932 463 351 -46 -392 -747 -1367 -1719 -2062 -2200 -2188 -1866 -1437 -956
1872 -956 -553 65 303 564 745 844 1130 1295 1410 1770 1769 1850 1918 1341 975 405 -300 -699 -1105 -1426 -1472 -1629
1894 -1629 -1515 -1496 -1245 -1236 -1151 -1086 -796 -630 -268 469 714 1265 1733 1875 1985 1821 1620 1090 664 505 294
$$ packed form
1747A418n05r3p83p25q20o78m48P4j4L91M19L76L61L42L04M21J09M49L17K60N73
1768A748M23K18K11k00l37m33p63p25n72o31l08j02P0q4p9k28N6l08m5J89M08
1789a492N70Q14R46K80N24L39K61j92J87n45k82J3l07j47l77j71k46n79p72m64
1809a640p35r6LP0K53O01O93M38L45J43K26K49K98M72K11M25J75J02o8j97l14
1830A654p48o86l72m23n67l61n0J2J29k12J49M3k38J40Q5N60O95K52J083L92M61
1851A998J15Q3l24l76j09m20p5M0m69j12l97l46l55o20l52l43j38J2L22M29M81
1872i56M03O18K38K61J81R9K86J65J15L60jQ1O8n77l66n70p05l99m06l21m6j57
1894a629J14J9K51RQ5O5K90J66L62P37K45N51M68J42J10j64k01n30m26j59k11
$$ plain form
1915 294 -54 -89 -334 -484 -807 -1189 -1553 -1555 -1804 -1714 -1579 -1282 -551 -268 387 678 837 1083 1195 1156 1208 1354
1937 1354 1357 1488 1367 1310 1044 432 285 -424 -854 -1288 -1498 -1704 -1529 -1386 -1321 -936 -966 -806 -540 -378 -92
1958 -92 117 487 911 1237 1655 1820 1809 1705 1499 1146 564 180 -203 -285 -647 -717 -1009 -1022 -1225 -1388 -1487 -1455
1980 -1455 -1728 -1221 -1043 -604 -44 379 923 1214 1353 1390 1514 1305 1326 1017 1134 1257 892 835 551 -127 -315
2001 -315 -1023 -1374 -1617 -1844 -1940 -1630 -1397 -1011 -859 -403 -102 18 110 439 698 1017 1380 1438 2044 1968 1637
2022 1637 1526 1155 690 237 -280 -712 -858 -1129 -1175 -1407 -1407 -1321 -1518 -1446 -1393 -1374 -919 -539 -102 388 739 1236
2044 1236 1529 1443 1751 1512 1336 1196 868 834 763 606 289 -37 -306 -635 -1192 -1589 -1756 -1962 -1756 -1470 -1247
2065 -1247 -703 -394 -297 210 421 623 738 883 1309 1350 1585 1861 1599 1633 1291 724 359 -192 -614 -797 -1149
$$ packed form
1915B94l48l5k45j50l23l82l64kk49R0J35K97P31K83O55K91J59K46J12l9N2J46
1937A354LJ31j21n7k66o12j47p09m30m34k10k06J75J43O5L85l0J60K66J62K86
1958i2K09L70M24L26M18J65j1j04k06l53n82l84l83q2l62p0k92j3k03j63r9L2
1980a455k73N07J78M39N60M23N44K91J39L7J24k09K1l09J17J23l65n7k84o78j88
2001c15p08l51k43k27r6L10K33L86J52M56L01J20R2L29K59L19L63N8O06p6l31
2022A637j11l71m65m53n17m32j46k71m6k32%Q6j97P2N3J9M55L80M37M90L51M97
2044A236K93q6L08k39j76j40l28l4p1j57l17l26k69l29n57l97j67k06K06K86K23
2065a247N44L09R7N07K11K02J15J45M26M1K35K76k62L4l42n67l65n51m22j83l52
$$ plain form
2086 -1149 -1252 -1171 -1505 -1200 -1106 -1334 -1107 -1149 -919 -511 -213 350 616 1053 1373 1453 1606 1269 1206 995 770
2107 770 719 579 537 292 -3 -251 -618 -961 -1320 -1436 -1527 -1637 -1175 -1041 -786 -297 -53 90 365 466 708
2128 708 753 934 1129 1128 1355 1327 1246 949 648 230 -60 -453 -803 -986 -1103 -1047 -1095 -1059 -914 -948 -945 -687 -532 -330
2152 -330 98 221 613 783 942 1424 1319 1254 1142 790 646 366 97 19 -214 -58 -307 -575 -718 -948 -1386
2173 -1386 -1362 -1093 -1052 -730 -375 -145 80 243 783 611 605 1005 899 930 853 826 754 780 689 476 147 -349 -589
2196 -589 -917 -1001 -1057 -1263 -1062 -863 -688 -565 -281 -294 -183 -72 182 522 634 853 906 1158 1183 1112 889 634
2218 634 370 141 -20 -522 -389 -733 -722 -781 -838 -746 -846 -1049 -863 -943 -737 -172 -80 411 656 714 915 1077
2240 1077 946 721 723 693 886 684 595 239 2 -131 -433 -633 -912 -1174 -1273 -1270 -1170 -1030 -747 -600 -174 -175 70
$$ packed form
2086a149j03Q1l34L05R4k28K27m2K30M08K98N63K66M37L20Q0J53l37o3k11k25
2107G70n1j40m2k45k95k48l67l43l59j16r1j10M62J34K55M89K44J43K75J01K42
2128G08M5J81J95jK27k8q1k97l01m18k90l93l50j83j17N6m8L6J45l4LK58J55K02
2152c30M28J23L92J70J59M82j05o5j12l52j44k80k69p8k33J56k49k68j43k30m38
2173a386K4K69M1L22L55K30K25J63N40j72oM00j06L1p7k7p2K6r1k13l29m96k40
2196e89l28q4n6k06K01J99J75J23K84j3J11J11K54L40J12K19N3K52K5p1k23k55
2218F34k64k29j61n02J33l44J1n9n7R2j00k03J86q0K06N65R2M91K45N8K01J62
2240A077j31k25Kl0J93k02q9l56k37j33l02k00k79k62r9LJ00J40K83J47M26jK45
$$ plain form
2263 70 166 249 652 738 809 1089 1175 1283 1095 950 680 494 88 -54 -420 -622 -549 -799 -864 -984 -1081 -978 -861
2286 -861 -859 -716 -641 -440 81 188 571 940 959 1237 1021 1155 917 700 598 669 461 210 51 -109 -419 -866
2308 -866 -748 -1106 -1275 -1088 -1118 -991 -871 -554 -278 -47 -48 404 459 538 767 846 992 1183 1027 1043 1047 602 564
2331 564 253 -171 -310 -558 -730 -595 -913 -739 -922 -933 -736 -926 -546 -402 -273 -171 110 409 776 759 930
2352 930 903 761 917 627 453 479 331 143 61 -56 -216 -417 -660 -784 -983 -1054 -938 -619 -709 -329 -189 -28
2374 -28 148 141 546 594 519 619 718 944 743 740 663 606 239 134 16 -355 -450 -877 -758 -602 -824 -685 -606 -487
2398 -487 -373 -529 -336 -95 28 117 463 577 770 781 692 872 652 521 408 186 86 -212 -224 -262 -277 -457
2420 -457 -563 -753 -661 -704 -759 -494 -296 -301 -101 95 344 400 587 692 578 633 600 528 607 376 397 304 72 28
$$ packed form
2263G0R6Q3M03Q6P1K80Q6J08j88j45k70j86m06j42l66k02P3k50o5j20r7J03J17
2286h61KJ43P5K01N21J07L83L69J9K78k16J34k38k17j02P1k08k51j59j60l10m47
2308h66J18l58j69J87l0J27J20L17K76K31jM52N5P9K29P9J46J91j56J6Mm45l8
2331E64l11m24j39k48j72J35l18J74j83j1J97j90L80J44J29J02K81K99L67j7J71
2352I30k7j42J56k90j74K6j48j88q2j17j60k01k43j24j99p1J16L19r0L80J40J61
2374b8J76pM05M8p5J00R9K26k01lp7n7l67j05j18l71r5m27J19J56k22J39P9J19
2398d87J14j56J93K41J23Q9L46J14J93J1q9J80k20j31j13k22j00k98j2l8j5j80
2420d57j06j90R2m3n5K65J98nK00J96K49N6J87J05j14N5l3p2P9k31K1r3k32m4
$$ plain form
2444 28 -250 -630 -687 -658 -704 -639 -710 -577 -388 -436 -275 -37 -147 13 230 298 432 668 693 883 674 827 668
2467 668 322 311 -77 -171 -361 -471 -326 -649 -505 -447 -592 -676 -642 -554 -604 -127 -150 133 394 297 543 721 837
2490 837 742 561 562 592 496 311 261 60 -44 -305 -336 -610 -750 -840 -858 -936 -552 -737 -423 -126 -227 -51 103
2513 103 53 328 546 498 668 705 822 755 739 615 538 273 -42 -228 -480 -497 -740 -697 -577 -623 -555 -691 -739 -661
2537 -661 -526 -430 -64 99 366 552 696 638 769 724 916 545 391 616 268 147 -89 136 -27 -371 -406
2558 -406 -742 -591 -754 -909 -764 -527 -421 -405 -221 -90 133 255 231 391 429 681 578 664 678 710 498 492 267
2581 267 37 50 -395 -457 -421 -641 -611 -508 -516 -523 -566 -421 -430 -256 -165 35 83 389 540 747 688 582 644 631 272
2606 272 386 94 91 199 -71 -58 -106 -428 -434 -664 -549 -550 -618 -482 -237 -251 -167 55 30 157 188 315 340 418 403
$$ packed form
2444B8k78l80n7K9m6O5p1J33J89m8J61K38j10J60K17O8J34K36K5J90k09J53j59
2467F68l46j1l88r4j90j10J45l23J44N8j45q4L4Q8n0M77k3K83K61r7K46J78J16
2490H37r5j81JL0r6j85n0k01j04k61l1k74j40r0j8p8L84j85L14K97j01J76J54
2513A03n0K75K18m8J70L7J17o7j6j24p7k65l15j86k52j7k43M3J20m6O8j36m8P8
2537f61J35R6L66J63K67J86J44n8J31m5J92l71j54K25l48j21k36K25j63l44l5
2558d06l36J51j63j55J45K37J06J6J84J31K23J22k4J60L8K52j03Q6J4L2k12ok25
2581B67k30J3m45o2L6k20L0J03qpm3J45rJ74R1K00M8L06J51K07n9j06O2j3l59
2606B72J14k92lJ08k70J3m8l22ok30J15jo8J36K45j4Q4K22k5J27L1J27K5P8j5
$$ plain form
2631 403 451 342 462 446 293 85 -60 -213 -131 -296 -575 -460 -543 -391 -370 -259 -147 -253 -190 -162 -101 127 248
2654 248 240 551 451 288 546 370 486 323 41 82 40 -43 -166 -160 -298 -259 -322 -354 -458 -337 -216 -343 -296 -1
2678 -1 -77 158 370 207 461 370 463 185 330 418 254 141 76 -62 4 -56 -231 -335 -369 -449 -336 -344 -371 -353 -237
2703 -237 -48 12 82 169 184 113 330 316 256 378 401 468 465 217 302 -74 -18 -194 -230 -290 -302 -530 -445 -260 -424 -325
2729 -325 -442 -484 -148 -40 60 217 96 190 379 365 512 374 365 469 400 334 93 72 73 -38 18 -266 -358 -374
2753 -374 -558 -474 -266 -446 -402 -178 -42 -21 -45 33 203 484 566 529 391 366 467 493 377 277 245 88 39 -136
2777 -136 -288 -441 -366 -536 -402 -443 -451 -360 -150 -264 -140 -151 -10 110 380 364 294 408 439 363 379 427 222 -7
2801 -7 197 73 24 -98 -270 -180 -390 -270 -416 -515 -600 -383 -528 -281 -117 -160 -27 219 29 100 252 353 507
$$ packed form
2631D03M8j09J20j6j53k08j45j53Q2j65k79J15q3J52K1J11J12j06O3K8O1K28J21
2654B48qL11j00j63K58j76J16j63k82M1m2q3j23Oj38L9o3l2j04J21J21j27M7K95
2678ap6K35K12j63K54r1R3k78J45Q8j64j13o5j38O6o0j75j04l4q0J13qk7J8J16
2703b37J89O0P0Q7J5p1K17j4o0J22K3O7lk48Q5l76N6j76l6o0j2k28Q5J85j64R9
2729c25j17m2L36J08J00J57j21R4J89j4J47j38rJ04o9o6k41k1Jj11N6k84r2j6
2753c74j84Q4K08j80M4K24J36K1k4P8J70K81Q2l7j38k5J01K6j16j00l2j57m9j75
2777a36j52j53P5j70J34m1qR1K10j14J24j1J41J20K70j6p0J14L1p6J6M8k05k29
2801gK04j24m9j22j72R0k10J20j46r9q5K17j45K47J64m3J33K46j90P1J52J01J54
$$ plain form
2824 507 611 268 259 320 324 324 -59 127 -134 -91 -271 -385 -241 -394 -477 -257 -125 -368 -116 -294 -255 -14 16 286
2848 286 69 292 393 230 304 334 167 227 159 85 -7 33 -51 -307 -164 -300 -182 -335 -416 -268 -391 -242 -57
2871 -57 -120 116 29 281 252 145 224 125 179 177 170 284 249 294 151 92 63 -120 -287 -153 -179 -392 -335 -294 -176 -244
2897 -244 6 -296 50 -99 -82 -37 10 200 58 371 278 168 2 139 -40 95 -119 -48 -242 -272 -146 -120
2919 -120 -146 -124 -213 -240 -195 -88 -28 -172 -182 70 65 280 203 242 162 247 292 242 135 14 49 -11 -144 -127 -72 -134 -194
2946 -194 -201 -122 -421 -351 -183 -101 -222 -98 14 106 92 171 289 211 315 120 267 309 92 217 101 -10 43 -132
2970 -132 -165 -251 -284 -392 -107 -151 -194 -264 -236 -107 63 -19 -60 55 243 112 191 291 386 233 299 149 272 250
2994 250 -33 22 109 -158 -119 -168 -158 -291 -306 -348 -332 -249 -209 -169 -95 86 2 128 338 94 200 319 338 204 298
$$ packed form
2824E07J04l43rO1M%l83J86k61M3j80j14J44j53q3K20J32k43K52j78L9K41L0K70
2848B86k17K23J01j63P4L0j67O0o8p4r2M0q4k56J43j36J18j53q1J48j23J49J85
2871e7o3K36q7K52k9j07P9r9N4kpJ14l5M5j43n9k9j83j67J34k6k13N7M1J18o8
2897b44K50l02L46j49J7M5M7J90j42L13r3j10j66J37j79J35k14P1j94l0J26K6
2919a20k6K2q9k7M5J07O0j44j0K52nK15p7L9q0Q5M5n0j07j21L5o0j33J7N5o2o0
2946a94pP9k99P0J68Q2j21J24J12R2j4P9J18p8J04j95J47M2k17J25j16j11N3j75
2970a32l3q6l3j08K85m4m3p0K8J29J70q2m1J15J88j31P9J00R5j53O6j50J23k2
2994B50k83N5Q7k67L9m9J0j33j5m2J6Q3M0M0P4J81q4J26K10k44J06J19J9j34R4
$$ plain form
3019 298 198 272 203 129 149 50 -366 -262 -149 -99 -202 -224 -271 -220 -177 -238 -147 -202 -8 -18 13 -71 233 365 303 291
3045 291 400 258 336 119 135 202 195 55 -94 -97 -168 -197 -229 -330 -439 -345 -201 -376 -162 -135 -52 -34 -94 34 215
3070 215 76 96 345 185 248 279 151 253 239 116 -37 -68 -150 -95 -277 -236 -220 -252 -232 -373 -288 -264 -179 -87 -19
3095 -19 -101 121 14 224 168 35 267 98 330 175 98 281 59 -22 -49 73 -64 -223 -74 -344 -232 -109
3117 -109 -224 -97 -270 -120 -125 0 -37 108 78 98 110 68 48 75 148 81 15 85 -2 1 100 -108 -11 -98 -255 -165 -180
3144 -180 -231 -129 -40 -112 -45 -25 136 -89 -100 -83 98 -91 15 5 126 256 -58 68 -71 -56 8 -65 -78 -141
3168 -141 -198 -113 -56 -70 -139 -213 -22 54 -19 141 -3 107 100 -17 201 213 44 85 71 -100 103 -6 -145 58
3192 58 -154 -58 12 -160 -69 -158 -97 -153 -229 -121 57 -3 27 -127 161 80 176 326 43 159 131 83 75 24 -42 15
$$ packed form
3019B98j00P4o9p4K0r9m16J04J13N0j03k2m7N1M3o1R1n5J94j0L1q4L04J32o2j2
3045B91J09j42P8k17J6O7pj40j49lp1k9l2j01j09R4J44j75K14K7Q3J8o0J28J81
3070B15j39K0K49j60O3L1j28J02j4j23j53l1q2N5j82M1J6l2K0j41Q5K4Q5R2O8
3095a9q2K22j07K10n6j33K32j69K32j55p7J83k22q1k7J22j37j59J49k70J12J23
3117a09j15J27j73J50nJ25l7J45l0K0J2m2k0K7P3o7o6P0q7LR9k08R7q7j57R0j5
3144a80n1J02Q9p2O7K0J61k25j1J7J81j89J06j0J21J30l14J26j39J5O4p3j3o3
3168a41n7Q5N7j4o9p4J91P6p3J60j44J10pj17K18J2j69M1j4j71K03j09j39K03
3192E8k12R6P0j72R1q9O1n6p6J08J78o0L0j54K88q1R6J50k83J16k8m8qn1o6N7
$$ plain form
3218 15 -115 -125 -101 -216 -156 -171 -264 -162 -136 -41 -4 -151 -136 143 118 133 215 187 175 40 91 283 216 111 150 157 -75
3245 -75 244 -73 -102 -98 -140 -154 -234 -53 -133 -196 -119 -141 -26 -129 -71 126 87 157 116 267 226 161 37 171 -21 76
3271 76 89 183 -62 -37 -97 -135 -34 -272 -364 -309 -126 -118 -81 -97 -218 -101 -79 118 78 87 14 81 195 241 78 184
3297 184 105 25 264 -26 68 59 -32 65 -65 -128 -125 -275 -143 -146 -203 -109 -80 -114 -92 58 -81 85 240 -38 197 161
3323 161 44 91 129 106 232 84 164 72 -52 37 -196 135 -317 -110 -83 -42 -109 -227 -30 -158 -129 -15 -83 182
3347 182 -65 94 180 220 72 -144 78 -41 219 110 63 51 57 -156 -133 117 16 -166 -65 -132 -54 -242 11
3370 11 63 -56 73 -10 -20 167 149 202 11 24 -81 7 -130 -60 146 36 -15 -19 2 31 -157 -102 78 -160 84
3395 84 9 69 -48 69 -96 67 10 -165 -86 49 -30 180 290 -17 109 74 -315 -153 -253 -69 4 -64 155
$$ packed form
3218A5j30j0K4j15O0j5r3J02K6R5L7j47J5K79k5J5Q2k8j2j35N1J92o7j05L9Pk32
3245g5L19l17k9Mm2j4q0J81q0o3P7k2J15j03N8J97l9P0m1J51m1o5j24J34j92R7
3271G6J3R4k45K5o0l8J01k38r2N5J83QL7j6j21J17K2J97m0Rp3O7J14M6j63J06
3297A84p9q0K39k90R4rr1R7j30o3Lj50J32ln7R4K9l4K2J50j39J66J55k78K35l6
3323A61j17M7L8k3J26j48Q0r2j24Q9k33L31m52K07K7M1o7j18J97j28K9J14o8K65
3347A82k47J59Q6M0j48k16K22j19K60j09m7j2Ok13K3K50j01j82J01o7P8j88K53
3370A1N2j19J29q3j0J87j8N3j91J3j05Q8j37P0K06j10n1mK1K9j88N5J80k38K44
3395H4p5O0j17J17j65J63n7j75P9J35p9K10J10l07J26l5l89J62j00J84P3o8K19
$$ plain form
3418 155 -169 -96 54 46 -70 25 -64 -102 103 47 46 86 128 204 145 122 -1 149 -150 49 25 -119 -81 35 -2 -85
3444 -85 -51 -105 -206 -48 -6 -177 48 45 133 -104 113 80 147 129 17 27 54 -48 195 22 -90 25 -39 -92 -73
$$ packed form
3418A55l24P3J50qj16R5q9l8K05n6jM0M2P6n9k3j23J50k99J99k4j44L8J16l7q3
3444h5L4n4j01J58M2j71K25lQ8k37K17l3O7j8j12J0K7j02K43j73j12J15o4n3J9
$$ [...]
8191a00
##END NTUPLES=NMR FID
##END=
