##TITLE=1H_Bz0402-3-M
 CDCl3
 8 sc, 
 7.02.2022
##JCAMPDX= 6.0         $$ Bruker NMR JCAMP-DX V2.0
##DATA TYPE= NMR FID
##DATA CLASS= NTUPLES
##ORIGIN= UXNMR, Bruker Analytische Messtechnik GmbH
##OWNER= root
$$ XWIN-NMR		Version 3.5
$$ Mon Feb  7 11:29:08 2022 Russian Standard Time (UT+4h)  she@DPX200
##.OBSERVE FREQUENCY= 200.131346
##.OBSERVE NUCLEUS= ^1H
##.DELAY= (6, 6)
##.ACQUISITION MODE= SIMULTANEOUS
##.ACQUISITION SCHEME= undefined
##.AVERAGES= 8
##.DIGITISER RES= 18
##SPECTROMETER/DATA SYSTEM= spect
##.PULSE SEQUENCE= zg30
##.SOLVENT NAME= CDCl3
##.SHIFT REFERENCE= (INTERNAL, CDCl3, 0, 15.7039)
##AUDIT TRAIL= $$ (NUMBER, WHEN, WHO, WHERE, WHAT)
$$ ##TITLE= Audit trail, XWIN-NMR		Version 3.5
$$ ##JCAMPDX= 5.01
$$ ##ORIGIN= Bruker BioSpin GmbH
$$ ##OWNER= she
$$ F:/spectra/data/she/nmr/H-F/1/audita.txt
$$ ##AUDIT TRAIL=  $$ (NUMBER, WHEN, WHO, WHERE, WHAT)
(   1,<2022-02-07 11:26:49.84 +0400>,<she>,<DPX200>,
      <created by zg, POWCHK disabled, PULCHK disabled
       configuration hash MD5:
       00 E9 B6 7A A2 85 ED C7 34 08 36 98 17 FE 4E 26
       data hash MD5: 16K
       03 19 43 13 61 B4 E8 50 F7 48 22 64 41 A5 7D A9>)
$$ ##END=
$$ 
$$ hash MD5
$$ B9 AA 44 A7 42 54 FB B9 6C 33 62 3F 2E 83 2F 3F
##$RELAX= 
##$RELAX= 
##$RELAX= 
##$RELAX= 
##$RELAX= 
##$RELAX= 
$$ Bruker specific parameters
$$ --------------------------
##$DU= <F:/spectra>
##$EXPNO= 1
##$NAME= <H-F>
##$PROCNO= 1
##$TYPE= <nmr>
##$USER= <she>
##$AMP= (0..31)
100 100 100 100 100 100 100 100 100 100 100 100 100 100 100 100 100 100 
100 100 100 100 100 100 100 100 100 100 100 100 100 100 
##$AQSEQ= 0
##$AQ_mod= 1
##$AUNM= <au_zg>
##$AUTOPOS= <>
##$BF1= 200.13
##$BF2= 200.13
##$BF3= 200.13
##$BF4= 200.13
##$BF5= 200.13
##$BF6= 200.13
##$BF7= 200.13
##$BF8= 200.13
##$BYTORDA= 1
##$CFDGTYP= 0
##$CFRGTYP= 5
##$CHEMSTR= <none>
##$CNST= (0..31)
1 1 145 1 1 1 1 1 1 1 1 1 1 1 1 1 1 1 1 1 1 1 1 1 1 1 1 1 1 1 1 1 
##$CPDPRG= <>
##$CPDPRG1= <>
##$CPDPRG2= <>
##$CPDPRG3= <>
##$CPDPRG4= <mlev>
##$CPDPRG5= <mlev>
##$CPDPRG6= <mlev>
##$CPDPRG7= <mlev>
##$CPDPRG8= <mlev>
##$CPDPRGB= <>
##$CPDPRGT= <>
##$D= (0..31)
0 1.2 0 0 0 0 0 0 0 0.06 0 0.03 0 0 0 0 0.0002 0 0 0 0 0 0 0 0 0 0 0 0 
0 0 0 
##$DATE= 1644218809
##$DBL= (0..7)
120 120 120 120 120 120 120 120 
##$DBP= (0..7)
150 150 150 150 150 150 150 150 
##$DBP07= 0
##$DBPNAM0= <>
##$DBPNAM1= <>
##$DBPNAM2= <>
##$DBPNAM3= <>
##$DBPNAM4= <>
##$DBPNAM5= <>
##$DBPNAM6= <>
##$DBPNAM7= <>
##$DBPOAL= (0..7)
0.5 0.5 0.5 0.5 0.5 0.5 0.5 0.5 
##$DBPOFFS= (0..7)
0 0 0 0 0 0 0 0 
##$DE= 6
##$DECBNUC= <off>
##$DECIM= 32
##$DECNUC= <off>
##$DECSTAT= 4
##$DIGMOD= 1
##$DIGTYP= 9
##$DL= (0..7)
0 120 120 120 120 120 120 120 
##$DP= (0..7)
150 150 150 150 150 150 150 150 
##$DP07= 0
##$DPNAME0= <>
##$DPNAME1= <>
##$DPNAME2= <>
##$DPNAME3= <>
##$DPNAME4= <>
##$DPNAME5= <>
##$DPNAME6= <>
##$DPNAME7= <>
##$DPOAL= (0..7)
0.5 0.5 0.5 0.5 0.5 0.5 0.5 0.5 
##$DPOFFS= (0..7)
0 0 0 0 0 0 0 0 
##$DQDMODE= 0
##$DR= 18
##$DS= 0
##$DSLIST= <SSSSSSSSSSSSSSS>
$$ [...]
##$SUBNAM2= <"">
##$SUBNAM3= <"">
##$SUBNAM4= <"">
##$SUBNAM5= <"">
##$SUBNAM6= <"">
##$SUBNAM7= <"">
##$SUBNAM8= <"">
##$SUBNAM9= <"">
##$SW= 18.0517287032376
##$SWIBOX= (0..15)
0 0 2 0 0 0 0 0 0 0 0 0 0 0 0 0 
##$SW_h= 3612.71676300578
##$TD= 16384
##$TD0= 1
##$TE= 0
##$TE2= 300
##$TE3= 300
##$TEG= 300
##$TL= (0..7)
0 120 120 120 120 120 120 120 
##$TP= (0..7)
150 150 150 150 150 150 150 150 
##$TP07= 0
##$TPNAME0= <>
##$TPNAME1= <>
##$TPNAME2= <>
##$TPNAME3= <>
##$TPNAME4= <>
##$TPNAME5= <>
##$TPNAME6= <>
##$TPNAME7= <>
##$TPOAL= (0..7)
0.5 0.5 0.5 0.5 0.5 0.5 0.5 0.5 
##$TPOFFS= (0..7)
0 0 0 0 0 0 0 0 
##$TUNHIN= 0
##$TUNHOUT= 0
##$TUNXOUT= 0
##$USERA1= <user>
##$USERA2= <user>
##$USERA3= <user>
##$USERA4= <user>
##$USERA5= <user>
##$V9= 5
##$VALIST= <valist>
##$VCLIST= <CCCCCCCCCCCCCCC>
##$VD= 0
##$VDLIST= <DDDDDDDDDDDDDDD>
##$VPLIST= <PPPPPPPPPPPPPPP>
##$VTLIST= <TTTTTTTTTTTTTTT>
##$WBST= 1024
##$WBSW= 4
##$XGAIN= (0..3)
0 0 0 0 
##$XL= 0
##$YL= 0
##$YMAX_a= 108360
##$YMIN_a= -84855
##$ZGOPTNS= <>
##$ZL1= 120
##$ZL2= 120
##$ZL3= 120
##$ZL4= 120
##$ABSF1= 10
##$ABSF2= 0
##$ABSG= 5
##$ABSL= 3
##$ALPHA= 0
##$AQORDER= 0
##$ASSFAC= 0
##$ASSFACI= 0
##$ASSFACX= 0
##$ASSWID= 0
##$AUNMP= <proc_1d>
##$AZFE= 0.1
##$AZFW= 0.1
##$BCFW= 1
##$BC_mod= 2
##$BYTORDP= 1
##$COROFFS= 0
##$CY= 11.3945322036743
##$DATMOD= 1
##$DC= 2
##$DFILT= <>
##$DTYPP= 0
##$F1P= 2.36226072786647
##$F2P= -0.459571619588291
##$FCOR= 0.5
##$FTSIZE= 0
##$FT_mod= 4
##$GAMMA= 1
##$GB= 0.15
##$INTBC= 1
##$INTSCL= 1
##$ISEN= 128
##$LB= 0.24
##$LEV0= 0
##$LPBIN= 0
##$MAXI= 10000
##$MC2= 0
##$MEAN= 0
##$ME_mod= 0
##$MI= 1.114404
##$NCOEF= 0
##$NC_proc= 0
##$NLEV= 6
##$NOISF1= 3.799351
##$NOISF2= 2.8
##$NSP= 1
##$NTH_PI= 0
##$NZP= 0
##$OFFSET= 15.70392
##$PC= 1
##$PHC0= -15866.37
##$PHC1= 13.40078
##$PH_mod= 1
##$PKNL= yes
##$PPARMOD= 0
##$PSCAL= 0
##$PSIGN= 0
##$REVERSE= no
##$SF= 200.130013532006
##$SI= 16384
##$SIGF1= 3
##$SIGF2= 2
##$SINO= 400
##$SIOLD= 16384
##$SREGLST= <1H.CDCl3>
##$SSB= 0
##$STSI= 0
##$STSR= 0
##$SW_p= 3612.71676300578
##$SYMM= 0
##$S_DEV= 0
##$TDeff= 0
##$TDoff= 0
##$TI= <>
##$TILT= no
##$TM1= 0
##$TM2= 0
##$TOPLEV= 0
##$USERP1= <user>
##$USERP2= <user>
##$USERP3= <user>
##$USERP4= <user>
##$USERP5= <user>
##$WDW= 1
##$XDIM= 8192
##$YMAX_p= 0
##$YMIN_p= 0
$$ End of Bruker specific parameters
$$ ---------------------------------
##NTUPLES= NMR FID
##VAR_NAME=  TIME,          FID/REAL,        FID/IMAG
##SYMBOL=    X,             R,               I
##VAR_TYPE=  INDEPENDENT,   DEPENDENT,       DEPENDENT
##VAR_FORM=  AFFN,          ASDF,            ASDF
##VAR_DIM=   8192,          8192,            8192
##UNITS=     SECONDS,       ARBITRARY UNITS, ARBITRARY UNITS
##FACTOR=    0.0002768,     1,               1
##FIRST=     0,             0,               0
##LAST=      2.2672688,     0,               0
##MIN=       0,             -84855,          0
##MAX=       2.2672688,     108360,          0
$$ Real data points
##PAGE= N=1
##DATA TABLE= (X++(R..R)), XYDATA
$$ [...]
1717A17J740j456j464K090K382p33j977P20J631r79k997r38J505O8k096q15K306
1734h96J588j440j488J591J601j088k500J076K335K90j520O64K679Q45j927j161
1750F49J207L11k101k074Q61J754j125j566R33J902j18k447l55J640L21j911m50
1767b569K346J999j142n67J680J830j185k260L1J652r96k342L9K023O83j890r25
1784a593J624Q53k153j749J170J380p38j343J131K991L10j512K98J905K09k456
1800C27j098J743P29j401j398J311J923j245k103K90J116o65k489k70K127N86
1816e17j389R7K336J598j295j178J331J274j339j572N85K010jj922K67K005m12
1833A878k183j244J095L03j881j241J446J790m74j421J291K006k80j886R0J564
$$ plain form
1717 117 1857 401 -1063 1027 3409 2676 699 1419 3050 2071 -926 -1864 -359 -291 -2387 -3202 -896
1734 -896 692 -748 -2236 -645 956 -132 -2632 -1556 779 1069 -451 213 2892 3737 1810 649
1750 649 1856 2167 66 -2008 -1147 607 -518 -2084 -1151 751 633 -1814 -2169 -529 -208 -2119 -2569
1767 -2569 -223 1776 634 67 1747 3577 2392 132 163 1815 819 -1523 -1484 539 1222 -668 -1593
1784 -1593 31 884 -1269 -3018 -1848 -468 -1206 -2549 -1418 1573 1883 371 669 2574 2783 327
1800 327 -771 972 1701 300 -1098 213 2136 891 -1212 -922 194 -471 -2960 -3230 -1103 -517
1816 -517 -1906 -1809 527 2125 830 -348 983 2257 918 -654 -69 1941 1940 18 285 2290 1878
1833 1878 -305 -1549 -454 -151 -2032 -3273 -1827 -37 -511 -1932 -641 1365 1085 -801 -711 853
1849H53M35j660l01K287J272j495j146J201J027j628k479L17J461q70j670J55
1865b241K327N66j789l63J585P55j611j359J576J788q93j074J232K148l03j805
1881E39j05J460l29k265j022J363R27j579q53J507J522j171j604N18J433n79j817
1898b055N92K152N50j415j2K160O72j708j389R03R82j522j717J061J499k88j437
1915i72J06J731j05j871j009J507P80j330p67J763J776m36j244R09J412n42k090
1932c82k64J593l58j699j27J736Q92j574j229J337Q47j534j751P73J832k78j331
1949a517J037J991O99j560o51J478N11j922j001J096J141q26j285P82J792j191
1965E74j876k6J331m35j955l13K036J098q44n06J645J472j224j448R59J048p38
$$ plain form
1849 853 1288 -372 -673 1614 2886 1391 245 1446 2473 845 -1634 -1317 144 -726 -2396 -2241
1865 -2241 86 652 -1137 -1500 85 840 -771 -2130 -554 1234 341 -733 499 2647 2344 539
1881 539 434 1894 1565 -700 -1722 -359 568 -1011 -1864 -357 1165 -6 -1610 -1092 341 -238 -2055
1898 -2055 -1463 689 1239 -176 -188 1972 2644 936 -453 450 1432 -90 -1807 -746 753 465 -972
1915 -972 -866 865 760 -1111 -2120 -613 167 -1163 -1930 -167 1609 1173 -71 838 2250 1708 -382
1932 -382 -646 947 589 -1110 -1237 499 1391 -183 -1412 -75 772 -762 -2513 -1740 92 -186 -1517
1949 -1517 -480 1511 2210 650 -1 1477 1988 66 -935 161 1302 476 -809 -27 1765 574
1965 574 -1302 -1328 3 -432 -2387 -2700 -664 434 -410 -916 729 2201 977 -471 488 1536 798
1982G98j485L64K146O8j544l55J279J09j822j468R57P25j407j080J203J943l80
1999E1j155O04J516K4j712l74J676R61j273n51J427J398j055j529O83Q71j137
2016D25k440M51J261J0j514o6J852O38j319p11J144Q59j111j204J315J685j98
2033A077j126O67J694M5j855n83Q13J61j707r89J245J111r06j122P94J237n25
2050C1j745K68J553n5j479K82J913J049j080n79J355P34j395j270L14J096r00
2067I2j416O25J536k13j535m14J498jj736p04J331J138q41n49J535J453m48j150
2085B01M55J209m53j769l37J413L26j276o87J250Q32j216j440M34J002p01j723
2102b480O77J727J92q66L10J913L26j314p10J304M64r94r91O92J437q24j176L84
$$ plain form
1982 798 -687 -323 1823 1891 347 -8 1271 1380 -442 -1910 -953 -228 -1635 -2715 -1512 431 51
1999 51 -1104 -500 1016 1040 -672 -1046 630 1591 318 -233 1194 2592 1537 8 691 1562 425
2016 425 -2015 -1564 -303 -293 -1807 -1873 -21 617 -702 -1413 -269 590 -521 -1725 -410 1275 1077
2033 1077 -49 618 2312 2357 502 -81 732 893 -814 -1803 -558 553 -353 -1475 -681 556 31
2050 31 -1714 -1446 107 52 -1427 -1145 768 1817 737 158 1513 2247 852 -418 -104 992 92
2067 92 -1324 -699 837 624 -911 -1325 173 172 -1564 -2268 -937 201 -640 -1189 346 1799 1351 201
2085 201 656 1865 1412 -357 -694 719 1045 -231 -918 332 1164 -52 -1492 -1058 -56 -757 -2480
2102 -2480 -1803 -76 116 -750 -440 1473 1799 485 -225 1079 1543 549 -442 250 1687 863 -313 71
2120G1J272n87k198l42J170K5j395k25J340J258q49o02J158J461q76j488Q01J291
2138A285j13j247L25J662J50j443n47P35K96j428j549N04J103q69r11N49J696
2155A98r8j373J89J509o9r82m34J511J129q26n89J373J104p73j707K06R71q41
2173D98j715L0R59K21j159m64J417O72j352q44O75J139o01q78J006J624l2p94
2191D02K47J429R6j815m40O53O35j312r55Q60J168j058j005K80Q33m73j240j73
2209a868J316L67r08j35J778J106j045o43R51Q71j016j280M33J237l20j227N0
2226c33J371q7j517n73Q58O3j338o83J046J283n93o75J034J496j82j344J73J229
2244A228o1j265j23J137N50q11q19Q77O20j167j453L48P86m81j294L68J492K15
$$ plain form
2120 71 1343 756 -1442 -1784 -614 -589 -1984 -2209 -869 389 -460 -1062 96 1557 681 -807 -6 1285
2138 1285 1172 -75 250 1912 2062 619 72 807 1103 -325 -1874 -1370 -267 -1136 -2047 -1498 198
2155 198 100 -1273 -1084 425 356 -626 -1060 451 1580 754 165 1538 2642 1869 162 368 1339 498
2173 498 -1217 -1187 -228 -7 -1166 -1630 -213 459 -893 -1737 -1062 77 -524 -1402 -396 1228 1196 402
2191 402 649 2078 2174 359 -81 572 1207 -105 -1060 -200 968 -90 -1095 -815 18 -455 -1695 -1868
2209 -1868 -552 -185 -1093 -1228 550 1656 611 -32 919 1790 774 -506 -73 1164 844 -383 -333
2226 -333 1038 951 -566 -1139 -281 -218 -1556 -2239 -1193 90 -503 -1178 -144 1352 1170 -174 -1 1228
2244 1228 1167 -98 -221 916 1466 655 -164 713 1333 166 -1287 -939 -153 -634 -1928 -1560 -68 147
2262A47o52l59J153R14j085q71J100P96o37p33P51J354l79j442K3R12l37j548
2280h93o82R99L13j110l39J131R14p02p75P09J128n91r45M10J058N40r24J48J146
2299A535N48j318q64O33N93j394j047M58P51j13j087J72J380k6j323j88R25M77
2317A12p74m01J221J118n90n48O26J209m22j610j6J093m27j332l22J461O3j111
2335f50n65J018L52r41r28M18J269l20o88M71J410L15q54j48J072J46j223m33
2353b79P31N61q55q11O31J038p65q79j64Q80l28j108k42J090P42r75j46J324R07
2372A352q11q17P05O08l02j282L97J252k95p02k43R97Q6j299o44P32J02p82o44
2391a590Q27R93j42q81O11J010J0j186j80J105Q9p79j78R91P26p83q04M08P71
$$ plain form
2262 147 -505 -864 289 1203 118 -753 347 1143 506 -227 524 1878 1499 57 80 992 655 -893
2280 -893 -1575 -576 -263 -1373 -1712 -581 333 -369 -1144 -435 693 102 -843 -433 625 1165 241 389 1535
2299 1535 2083 765 -99 534 1127 -267 -1314 -856 -105 -218 -1305 -1133 247 221 -1102 -1290 -365 112
2317 112 -662 -1063 158 1276 686 138 764 1973 1551 -59 -75 1018 591 -741 -1063 398 461 -650
2335 -650 -1215 -197 155 -786 -1714 -1296 -27 -347 -1035 -564 846 1161 307 159 1231 1377 154 -279
2353 -279 452 1013 158 -653 -22 1016 251 -628 -792 88 -240 -1348 -1590 -500 242 -733 -879 445 1352
2372 1352 541 -276 429 1037 735 -547 -150 1102 807 105 -138 859 945 -354 -998 -266 -164 -946 -1590
2391 -1590 -763 230 88 -793 -182 828 838 -348 -528 577 666 -113 -291 700 1426 643 -161 247 1018
2410A018q15j315J07P63N7q89n4J138N61r77l16J015O42q88p10O12J106n68o26
2429a39K89J228j30j266j47Q53l75j006o36J009L61o13n80P69P97m21r02K05J089
2448C85j76q13K9J138O59j062N8R30M76j004q80K69N47o74r36L87J012j60r93
2467h08O7Q16J98j035n06Q00O51n75m36Q57J128l98o72L25Q45j91j070l18P55
2486D33J02r77k45R51L37p02q23M57P32r06q51M36R90k16l83L04J316K43q63l59
2506b4P36L99q55n34N51P10n54p06K72O90k68j085PM48M0j060j0P90P84o00j44
2527d13N85Q60m40q52L00P30r0q71J8J072K27q34o73R04J84j001r63O49M16k69
2547d61n34L00J108j68o15J15Q63j17p36j70P36L24m12l26M82P51n22q30L06M07
$$ plain form
2410 1018 203 -1112 -1005 -242 -185 -1074 -1128 10 571 -406 -722 293 935 47 -663 -51 1055 487 -139
2429 -139 150 1378 1248 -18 -165 688 313 -693 -1329 -320 41 -572 -1152 -383 414 -7 -909 -704 385
2448 385 209 -604 -575 563 1222 160 218 1148 1624 620 -260 9 556 -118 -1054 -667 345 185 -808
2467 -808 -741 75 273 -762 -1268 -468 183 -392 -828 29 1157 759 87 412 1257 1066 -4 -322 433
2486 433 535 -442 -687 264 601 -101 -924 -467 265 -641 -1492 -1056 -66 -282 -665 -361 955 1198 335 -24
2506 -24 712 1111 256 -278 273 983 429 -277 -5 685 417 -668 -661 -213 -173 -1233 -1243 -453 331 -269 -413
2527 -413 172 1032 592 -260 40 770 680 -191 -173 899 1126 292 -381 523 707 -294 -1257 -608 -192 -461
2547 -461 -995 -695 413 245 -370 -255 608 491 -245 -415 321 645 233 -93 389 1140 618 -212 94 501
2567E01n43j000K2P47K35r22K45P87L90p13l75O76N19o01m92K72J005O8o87P7
2587B11R30K7j216l20M34M12j102n09P27O65n76o44M10P28j08p19R3N51K61o06
2607c51J35J090K66o42k95M70N84p24o75k1M92l59o40K8P40J00r47j73O19K11
2627i2m80o69P17P60l41m86P24R11J1r81K73N76j9r05m20P75K98o91l64O42K86
2648E25p21q07K43N51k79r66M67R03J19l15j55J010N63q30m62O00O19o09n85K74
2668A45P19l13p31J02N34r6r76l49N60K16p03k36R07O43m85n36N55P43m64n37
2688c02J78Q14j36n08o4P26L58q51m14M33K46p32p49L20O00j94o29Q5J035J30
2708C46q67J48O81K19q60j55O98L88j88m47M65O86l92r64K35J94j3q23k35P11
$$ plain form
2567 501 -42 -1042 -1020 -273 -38 -960 -715 72 462 -251 -626 50 569 -32 -524 -252 753 821 134 211
2587 211 1141 1168 -48 -368 66 478 -624 -1133 -406 259 -317 -961 -551 177 69 -650 -557 -6 255 -351
2607 -351 -216 874 1140 498 203 673 1257 533 -142 -163 329 -30 -670 -642 98 198 -749 -922 -303 -92
2627 -92 -572 -1241 -524 236 -105 -591 133 1044 1055 74 347 923 904 -1 -421 354 652 -39 -403 239 525
2648 525 -196 -1003 -760 -209 -488 -1454 -987 -84 35 -280 -435 575 1138 308 -154 446 1065 456 -129 145
2668 145 864 551 -180 -78 456 360 -616 -965 -405 -189 -892 -1128 -221 422 -63 -599 -44 699 235 -302
2688 -302 -124 690 554 46 -18 708 1066 215 -199 234 480 -252 -1001 -681 -81 -275 -904 -819 216 346
2708 346 -521 -373 308 527 -333 -488 210 598 410 -37 428 1114 722 -242 -7 187 174 -649 -884 -173
2728a73L01p50j91O85M36n77m72N14N64k33n88L99Q39M9n40o1N68R5p43n42K95
2749a25N30o93m35J24P74k18p34K65P20j45j033L11N34M01n44N3N58O63l69o23
2769A4N03N00m97p11Q4N57k64n30p8N20K88o78n97L29N42o72m20O10O12p4l90
2790c52L06P16R5n78p2O18j77m52k84O02K12l94o63N12M10n39p50J20N46m18n06
2811a048J16Q63K50m21m6M93N32n13m08M70M43k07n70J86P21j47p73n2N17j06
2831C00r22l27O56J33l94k76M86P95n74n68N02N49n1o71J95P69J52o08k10O29
2851E65L19l24n66R1L07o78m30J93O19o9n11J81M68J67p82k00P56P9l62j76N45
2872A92M36j43n71M39L76j79o28j01L31J23n69j38N24J08o18q0L75K80l10n91
$$ plain form
2728 -173 128 -622 -813 -128 308 -269 -741 -227 337 104 -484 -85 754 803 263 202 770 865 122 -420 -125
2749 -125 405 -288 -723 -599 175 -43 -777 -512 208 63 -970 -659 -125 276 -268 -215 343 1006 637 14
2769 14 517 1017 520 -191 -107 450 186 -344 -422 98 386 -292 -889 -560 -18 -690 -1110 -500 112 38 -352
2790 -352 -46 670 765 187 115 733 556 104 -180 422 634 240 -423 89 499 -40 -790 -670 -124 -542 -1048
2811 -1048 -932 -69 181 -240 -286 207 739 226 -182 288 731 524 -46 140 861 714 -59 -111 406 300
2831 300 -622 -949 -293 -160 -554 -830 -344 451 -123 -691 -189 360 309 -362 -167 602 754 146 -64 565
2851 565 884 560 -6 85 392 -286 -716 -523 96 27 -484 -303 165 332 -450 -650 106 185 -177 -353 192
2872 192 628 485 -86 353 729 550 -78 -179 152 275 -294 -432 92 200 -418 -498 -123 157 -153 -744
2892g44M73N56k70k59N1O34L13n82j53N40K16m92o51L31L38k29m70J79L82q9o72
2913e98P1M21O4n55k33P24K80k49j91O97K75l15k25q4P20l80n31r6O19j8o28L4
2935a98K88J86o75l40M10K35l40m33M49P03l9o90K35P70J7n15n2O48m3n45k51
2956a80N12L23m63m76J45K32j16o72O0N75j26m69R3M69K57k18k90M88M02n50k58
2977b62K94N01p0l73j3N71K9o75j69L72K2n73l30N76Kk73l89L88N91l08l34J75
2999b48K80Q2m14P4M89N03n38k84N39J86m02m64Q2J95p8m71P5M42k4l82j61P09
3021A90l1n02j64L06M71l73j55L56N75j94m72K15J90N1p02K6K30J55m29m3L77
3042G7K41l16l73N1M81l14m31K01O01r1l35N7O70L0m79m6K81J58l18n51L93L11
$$ plain form
2892 -744 -271 285 15 -244 -193 441 754 172 19 559 775 283 -368 -37 301 72 -398 -219 163 74 -598
2913 -598 -527 -106 -42 -597 -830 -106 174 -75 -266 431 706 391 166 82 802 422 -109 -205 414 396 -232 -198
2935 -198 90 276 -399 -739 -329 -94 -434 -867 -418 285 246 -444 -209 561 578 63 11 659 616 71 -180
2956 -180 332 655 192 -284 -139 93 -23 -695 -635 -60 -186 -655 -562 -93 164 -54 -344 144 546 -4 -262
2977 -262 32 533 463 90 77 648 677 2 -167 205 227 -346 -676 -100 -98 -371 -760 -372 219 -89 -423 -248
2999 -248 32 114 -300 -226 263 766 228 -56 483 669 267 -197 -115 80 2 -469 -394 48 24 -358 -519 190
3021 190 159 -343 -507 -201 270 -103 -258 98 673 479 7 222 412 463 -239 -213 17 172 -257 -300 77
3042 77 318 2 -371 -320 161 -153 -584 -383 218 127 -208 -151 519 549 70 24 305 463 145 -406 -13 298
3064B98j13m15O5L58j77l66k4J90J56m55l1N01L47l05k52N11J75j95l64J24L35
3085C63m0m54n3M37J08k48m47M37L7m73l56L22L73l43m01L15O82N2m50J9L67K64
3107E11n95j69N77K44k84l44K98K73k70l03q7L11j24n44jM17j72q4j35L74L92
3128B85k60l23K66L77j45l87J69N46j9l62j3K63K33o86k15L40J20l85l51K38M40
3149A31j87k83J17K89j25k22j68L96K58m62Q3M45K87k58l60K85K36k71k89k2L05
3170A85k01m54k8M17O1j78l83N97K1k16m11M63M00m13j15J83N77q4l58j02M27
3191C88j6l21l00L68J32k85l20M24K25l73k80K07K82j48k86l6M44K59m51j0N35
3212D38J9k00m87M31K65m30k08K50K99j61m10r1N22k15l73j24K40K17l00j58M84
$$ plain form
3064 298 185 -230 -165 193 16 -350 -374 -184 -28 -483 -514 -13 334 29 -223 288 463 268 -96 28 363
3085 363 323 -131 -184 253 361 113 -334 103 140 -333 -689 -367 6 -337 -738 -423 259 311 -139 -120 247 511
3107 511 -84 -253 324 568 284 -60 238 511 241 -62 -149 162 38 -506 -507 -90 -262 -346 -481 -107 285
3128 285 25 -298 -32 345 200 -187 -18 528 509 147 134 397 630 -56 -271 69 189 -196 -547 -309 131
3149 131 -56 -339 -222 67 -58 -280 -448 -52 206 -256 -173 272 559 301 -59 226 462 191 -98 -120 185
3170 185 -16 -470 -498 -81 -20 -198 -581 16 37 -179 -590 -127 273 -140 -255 -72 505 421 63 -39 388
3191 388 372 51 -249 119 251 -34 -354 70 295 -78 -358 -151 131 -17 -303 -339 105 364 -87 -97 438
3212 438 457 257 -230 201 466 36 -172 78 377 216 -194 -285 237 22 -351 -475 -235 -18 -318 -476 8
3233HJ33j67k9K5O82l07l91J34K82n1k81o7K83J0k47j95J14O3r8m08M1K11K7l43
3257e71L62L75j40j48m4L59J95k56l04M37jj23j89L06L58l73l94M3J24L6l84j53
3279d85L55N9j99j06M81n9k04j71K00K08J03k43J26L26Q6k79j50L31m2k29k16
3300a08J40J86m33j60J69K94k40k50J53K42qk76j78O04O5l80K3J49J95p4j32L66
3322C47Q5r9k85jL28j68l67n2M30j60k48j59J68L05m94r4L78J84N4l79Q6O42l34
3345A67j64J5J26J65l67j45J85L08m37p0K57K01l41k04N5L99j29k96J16R5L80
3366C16l28l4K65J23k31l28L27J20Q3n38J31M21j01l56k41L23J14j59j75J60J31
3387B3l08N1K25K09j94j76Q5K47M6k42J05J85R1j92k52K37M37l37m94J48J22j91
$$ plain form
3233 8 141 -26 -55 -30 652 345 -46 88 370 319 38 -29 254 264 17 -178 -64 -1 -99 -507 -466 -255 -228 -571
3257 -571 -209 166 26 -122 -166 193 388 132 -172 265 264 141 -48 258 616 243 -151 -108 16 52 -332 -485
3279 -485 -130 -71 -270 -376 105 46 -158 -329 -129 79 182 -61 65 391 477 198 48 379 337 108 -108
3300 -108 32 218 -215 -375 -206 88 -152 -402 -249 -7 -15 -291 -469 135 200 -180 -157 -8 187 113 -19 347
3322 347 432 333 48 47 375 207 -160 -212 218 58 -190 -349 -181 124 -370 -464 -86 98 152 -227 -141 501 167
3345 167 3 18 144 309 -58 -203 -18 290 -147 -217 40 241 -100 -304 -249 150 21 -275 -159 -64 316
3366 316 -12 -46 219 342 111 -217 110 230 313 -225 -94 327 226 -130 -371 -48 66 -93 -268 -108 23
3387 23 -285 -234 -9 200 6 -170 -85 162 208 -34 71 256 347 155 -97 140 577 240 -254 -106 16 -175
3409a75k88Q9L80m5k10j4K83Q5k41j11L39J91l75j0M24K00k54j72m9K88k41l04
3431b10r1L44M7l63oK27J61l15k15K50J03l2k75K45K90j09j40N9L29j44q1L5J49
3454B58j0k28P9q9K48l41j43L8M63l09l55J05L23o7l02O2J83J36q6Q1K86N3m02
3477a7m1J77J90o9l50K9K25M3q5k03L22j75j48l38K36K75k79j40J91K10Q6k38
3499i9J40K50L9k01k29J36J95k31k57N13L3j53j86o7J94j87k53J87n0K31l60J03
3521b52L26Mq8k07L36J44j42k13L4K85m8k05P2K18m3k79j39P7J61l16M7n1K73
3544fm5k37J17L86p3k49J35J4L0j4j77K07K15k45k61L76J19j18m14j04L35n3k71
3567c33K00P4o1j9k61M66K08k65k15K86K20j61J3%Q4j17j09M8J97j9l08m9K14
$$ plain form
3409 -175 -463 -374 6 -39 -249 -263 20 105 -136 -247 92 283 -92 -102 322 522 268 96 47 335 94 -210
3431 -210 -301 43 90 -273 -279 -52 109 -206 -421 -171 -68 -100 -375 -130 160 51 -89 -30 299 155 74 109 258
3454 258 248 20 99 10 258 -83 -226 -188 275 -34 -389 -284 39 -28 -330 -268 -85 51 -35 46 332 385 -17
3477 -17 -58 119 309 240 -110 -81 144 187 102 -101 221 46 -102 -440 -204 71 -208 -348 -157 53 139 -99
3499 -99 41 291 330 129 -100 36 231 0 -257 256 289 136 -50 -117 77 -110 -363 -176 -226 5 -355 -252
3521 -252 74 78 -10 -217 119 263 121 -92 -58 227 179 -26 46 264 221 -58 -197 -120 41 -275 -228 -279 -6
3544 -6 -51 -288 -171 215 142 -107 28 42 72 58 -119 88 303 58 -203 173 292 174 -240 -344 -9 -62 -333
3567 -333 -133 -59 -120 -139 -400 66 274 9 -206 80 300 139 152 152 236 119 10 58 255 236 -72 -121 93
3590I3j21j80R2M0J11p8j09QK11j94q5M5K62K2n9J8K63P3l01j05lL57l69k90N21
3615B22%k16j12l0J61k4k39j53L25Q8j47j39L74N0K0k52J03L6M9l59K75K36o6
3638B02l64J07L99r0k79j38L31r0j09l53J25L36j05k59J59K40L3j82j6J75M2j36
3660B8O3N5P2j53k96K79K11r7k38j33K38Nl05N3J89L9J0k88L10P2j70l9J02J60
3684A67j27l02M15L7o5l38J78O9J71j46j93J64J10l08r2K47K27j26j15Q9p3J23
3706A12j13j32J81Q3q5q2O2K18j80j10J42K00l00k63J58P7M2k73J97J47l1j30
3728h0j62L71Nk29j69L56m0j3j24K88Q9q2k46j1P8M7k10k4J76J9j95N7K96p4k76
3753a53j41J28J50j47j65K04O6O8q2JL19n2l8j00J39j51Q2q2j58L61j61p4k67
$$ plain form
3590 93 -28 -208 -116 -76 35 -43 -152 -144 67 -127 -212 -167 95 117 58 76 339 412 111 6 3 360 -9 -299 222
3615 222 222 6 -106 -136 25 1 -238 -391 -66 22 -125 -264 110 160 180 -72 31 67 116 -243 32 268 202
3638 202 -162 -55 344 254 -25 -163 168 78 -31 -384 -259 77 -28 -287 -128 112 145 -37 -53 122 164 28
3660 28 91 146 218 65 -231 48 259 162 -76 -209 29 34 -271 -218 -29 10 20 -268 42 114 -56 -95 7 167
3684 167 40 -262 153 190 125 -213 -35 34 205 59 -134 30 140 -168 -260 -13 214 88 -27 62 -11 112
3706 112 -1 -133 48 131 46 -36 26 244 64 -46 96 296 -4 -267 -109 -32 10 -263 -66 81 50 -80
3728 -80 -242 129 134 -95 -264 92 52 39 -85 203 292 210 -36 -47 31 78 -132 -156 20 39 -156 -99 197 123 -153
3753 -153 -294 -166 -16 -163 -328 -124 -58 10 -72 -71 248 196 158 58 197 46 128 46 -112 249 88 14 -253
3776b53M26j84k30J51R3r2O2m0M1R7j50p9K50J35k05j08l4K41k9j33n6L62k3l14
3800g2j01J10R1j2o7kJ38m7l58J71P5J52q1j85L44o9o2k88L37P6j44j19P2K52
3824B11j86qj67Q3J52m4r5J01o6j74R2J30J39j11o2np3J42j6l16M64K5k49N1J75
3849A93p0k64n6J55J28k12j14J58K88k5l41J17l0N5k21J65J91o8j44J79m9J09
3871A44N9j70PK07j61l22N6J52o4L2k19K54n4lo9J56J33k25J24O3J34q6r7k7K88
3896C12l28P2lk1K31l29j2K01p3j25j53J73J49j38k2o0N5L1Nj87J17L09j02M2
3920A44Q7j57r4L7jK63l08j4J44J1J9k29M6J18n1j02k04K00J54j74r4K84J18k49
3944e2q7K97r4L6o6m8J52Q2j62qjR3j51rn3M02m66j12J71J02l4j78j15L71p8l
$$ plain form
3776 -253 173 -11 -241 -90 3 -89 -27 -67 -26 71 -79 -158 92 227 22 -86 -120 121 92 -41 -97 265 242 -72
3800 -72 -173 -63 28 16 -51 -53 85 38 -320 -149 -74 78 -3 -188 156 87 25 -263 74 150 6 -113 -41 211
3824 211 25 17 -150 -67 85 41 -54 47 -19 -193 -101 29 168 57 -5 -10 -83 59 43 -273 191 216 -33 18 193
3849 193 123 -141 -197 -42 86 -126 -240 -82 206 181 -160 -43 -73 -18 -239 -74 117 49 -95 84 35 144
3871 144 203 33 40 247 86 -236 -180 -28 -92 -60 -279 -25 -79 -82 -151 5 138 -87 37 100 234 148 51 24 312
3896 312 -16 56 53 32 263 -66 -78 123 50 -75 -228 -55 94 -44 -66 -126 -71 -40 -35 -222 -105 204 102 144
3920 144 231 74 -20 17 16 279 -29 -43 101 112 131 -98 -52 66 15 -87 -291 -91 63 -111 -205 79 197 -52
3944 -52 -139 158 64 100 34 -14 138 220 58 50 49 142 -9 -18 -71 331 -135 -247 -76 26 -8 -186 -301 70 -8 -11
3970a1j15K72j59pk25J64K48R7k40RK43q8l89Q8L08k55n1k4J81j18P6j40p8K56
3994D2n6k60K56K41l89J45J09k1K0j27L7O7j11J5p4j5M0%j64J77L79k17j62O5
4018cJ69J9j92k9K8J61j45o6J37N7K8k7j44R0j78l3J98k9j4j90K2L13j69q3Nl9
4044a14J28j12J8J46L9j06j13J84J33k2k27j55L19k03J5J24j00J38r6k08P1J29
4066a2J9j64J36o1N6k29K21K0J99k98o5M07r0l8k84J56o2K16p4k8Q5m9m7r4J4
4091f6J14k07o1K37Pn5j10R8J23j77L5j0N6o3j9j4K76j00M5J20p8k27M5R6r4J33
4117A04K1k32KJ98j20p8J12M6Jj26j5Q6j0k19Q6J50J60k45qJ73R9j33j55K0J29
4142D6Q4j51k61L07K0l0j12K2J81k30k09L60P6j04OQ4R5p2J9j67M2K1j84N6J32
$$ plain form
3970 -11 -126 146 -13 -20 -245 -81 167 264 24 33 276 188 -201 -113 195 -60 -111 -135 46 -72 4 -136 -214 42
3994 42 -14 -274 -18 223 -166 -21 88 67 87 -40 -3 64 -47 -32 -106 -121 -81 -81 -245 -68 311 94 -68 -3
4018 -3 166 185 -7 -36 -8 153 8 -58 79 136 164 137 -7 83 -95 -128 70 41 27 -163 -141 172 3 -80 -75 -114
4044 -114 14 -98 -80 66 105 -1 -114 70 203 181 -46 -201 118 -85 -70 54 -46 92 -4 -212 -141 -12
4066 -12 7 -157 -21 -82 -26 -255 -34 -14 185 -113 -178 229 139 101 -183 -27 -89 127 53 25 110 61 14 -80 -66
4091 -66 48 -159 -220 17 24 -31 -141 -43 80 -97 -62 -72 -16 -79 -98 -112 164 64 109 229 151 -76 -31 65 -29 104
4117 104 125 -107 -105 93 -27 -105 7 53 54 -72 -87 -1 -11 -230 -144 6 166 -79 -87 86 185 52 -103 -83 46
4142 46 130 -21 -282 25 45 15 -97 -75 106 -124 -333 27 103 -1 5 89 184 112 131 -36 6 27 -157 -101 31
4167C1J55k23j9K4M8j03P2j19K79r0j30n2M6K02n1q0M1P6ql20L81j89j2P4m0O
4193aL3m2j83R5K32j17k52J84J57j18j00Q1J00J21l12L10m9j91o3J36K4O7j23
4216a1q2M5J34pp1q1N7nq8j03K74r0J61l05N8J01J16q9n7J28j17P5j9J37l1l8
4242I2r2J13p6j86p3K98J93l01k6L3%R2j85J29J38j79L9N0N9j66L8n0J8L2J00
4267I0q8R8R6j34k00J69O3N3k13QJ40j21kj45L32k36l0l7J87l6O0j71J57R5j01
4292C4N4O3J02k60M2o7O0l2mL5k9nL5p8m0k4n3N4l1K30K1j10j63K31nk31N4J6
4320a01N7m4j24K22J6Q3q6k05K46Nj82l1J54j2p1n1J76J09k07J7J86Rn6j07J4
4345A7j2K3o4O4K44l02j3j21P5L9J2q5Q8J52n4k52J77J71j05p5O2R5N0j71j8P0
$$ plain form
4167 31 186 -37 -56 -32 16 -87 -15 -134 145 55 -75 -127 -81 121 70 -10 31 107 99 -221 160 -29 -41 33 -7 -1
4193 -1 32 -10 -193 -98 134 17 -235 -51 106 -12 -112 -31 69 190 -122 188 139 -52 -115 21 45 112 -11
4216 -11 -93 -48 86 79 8 -73 -16 -21 -109 -212 62 -28 133 -172 -114 -13 103 14 -43 85 -32 43 24 161 130 92
4242 92 0 113 37 -149 -222 76 269 -32 -58 -25 -25 67 -118 11 149 -30 9 59 118 -48 -10 -60 -42 -10 90
4267 90 2 100 196 62 -138 31 94 147 -66 -58 82 -39 -41 -186 146 -90 -120 -157 30 -6 54 -117 40 135 34
4292 34 88 151 253 -7 35 -32 28 -4 -8 27 -2 -7 28 -50 -90 -114 -167 -113 -144 86 107 -3 -166 65 60 -171 -117 -101
4320 -101 -44 -88 -212 10 26 109 23 -182 64 69 -113 -144 10 -2 -73 -124 52 161 -46 -29 157 166 110 3 17
4345 17 5 28 -36 28 272 -30 -43 -164 -89 -50 -38 -123 -35 117 63 -189 -12 159 54 -21 41 136 186 15 -3 67
4371F7m1K0j81J45OJ78m36K72o0m7r5n0L68k14Q2r0RK44n5k80R1K53p4j16r3K85
4397A88j84j00K28j30r5K29q3j48J74j73J80j46J07r0j72K38K8j14j43nK56J3
4419E8k77K69j9nQ9j41J92j70n7l0q3L16p9j50R9pJ48l27R5N2r7N7j23K49n5O1
4445F5k06P1J83Q0j68j22K46o3k15J24l3K7l3L1O8j26Q0j34J37K38k98J45j53
4468e6J37k3j30Q8J0lrj79N9J66%j25P3L5m1j51J5Q1m0j89L29L3k5j2j91K37j1
4495G8o3J8m8m2J10n4Q0o1q7J65k07L23j12ko7J3r2R1k76K37J19l1j43K67Jo0
4521A57j80l1J98p9j76JJ53J83j57j07R2mj00N8p0Q0j21K1r4J83J65j29k11L7
4545a31J01j09k2J64l6kJ46l5l7N0j70P0J42m1q7j17O9P0k8n0o4J52k26P7J29
$$ plain form
4371 67 26 46 -135 10 16 194 -242 30 -30 -77 -172 -222 146 -68 14 -76 -67 177 122 -158 -67 186 112 -4 -97 188
4397 188 4 -96 132 2 -93 136 53 -95 79 -94 86 -60 47 -43 -215 23 51 -63 -206 -211 45 58
4419 58 -219 50 31 26 115 -26 166 -4 -61 -91 -174 142 63 -87 12 5 153 -174 -79 -27 -124 -67 -190 59 4 65
4445 65 -141 -70 113 193 25 -97 149 86 -129 -5 -38 -11 -44 -13 55 -71 9 -125 12 250 -48 97 -56
4468 -56 81 58 -72 16 26 23 14 -165 -106 60 60 -65 8 43 2 -149 -134 -53 -93 -282 47 80 55 43 -148 89 78
4495 78 15 33 -15 -57 53 -1 79 18 -69 96 -111 212 100 98 31 44 -48 43 -233 4 123 92 -51 216 217 157
4521 157 -23 -54 144 65 -111 -110 43 226 69 -38 54 50 -50 8 -62 18 -103 -82 -176 7 172 43 -168 -131
4545 -131 -30 -139 -161 3 -33 -35 111 76 39 89 -81 -11 131 90 3 -114 -45 25 -3 -53 -117 35 -191 -114 15
4570A5R9m6p9r7J58q7l5K40M1j11o9n5J35oj28j1Q1L8K4R5k39k2J69k36J88L5
4596I7q1j47l7K32k23n9M20j97JP4k20Q4J25Ln2q9J44J01j71M3J3n2o1j57Q4q5
4622b10K10Jj1J0RK6k50J51J46L6j87J14m2J05M1j48J18k14l4J15k5Q8pk27P8
4647a07K17o2l9q8K25p7J4j7J9l8q2J7P0n6J21o0k4J15j82j8P2p5LJ01n9J19j11
4674bJ7L7n7r3r0J88j29Q3Q6j79J35J78j16p2R9J50k17j41R6J8O8o9j00K34j49
4699b5p2o0O8J71k68N6J20K01j43q7J77j20Q4j8k12K77J04k75J18q7R7k7j44Q1
4723A6j7O9j36o0J89j82R2K6K23k82J67j70K26L1k39l9qN4J34p3m4J65o6k9k5
4748B2n8J15k01J06j53P6L7p9K34M9J7k24l5K38j32j21K86j00l5j25J41n3J18
$$ plain form
4570 15 114 68 -11 -108 50 -37 -72 168 209 98 29 -26 109 103 -25 -36 45 83 107 202 -37 -59 110 -126 62 97
4596 97 16 -131 -168 64 -159 -218 202 5 6 80 -140 -56 69 72 20 -69 75 176 5 48 61 9 -52 -209 -125 -210
4622 -210 0 1 -10 0 9 35 -215 -64 82 118 -69 45 3 108 149 1 119 -95 -129 -14 -39 49 42 -185 -107
4647 -107 110 48 9 -79 146 69 83 66 85 47 -35 -18 52 -4 117 57 33 148 -34 -52 20 -55 -52 49 -10 109 -2
4674 -2 15 52 -5 -98 -188 0 -129 -46 40 -139 -4 174 58 -14 85 235 18 -123 -27 -9 59 -10 -110 124 -25
4699 -25 -97 -157 -89 82 -186 -130 -10 191 48 -39 138 18 102 84 -128 149 253 -22 96 9 106 79 -65 16
4723 16 -1 68 -68 -128 61 -121 -29 -3 220 -62 105 -65 161 192 -47 -86 -94 -40 94 21 -23 142 76 47 22
4748 22 -36 79 -122 -16 -169 -93 -56 -135 99 148 165 -59 -94 144 12 -109 177 77 42 -83 58 5 123
4771A23j72j6K52j40q6O5k4O9j2k58K03j75K53q7l0J12j13K6q5J51j68J28m5n5
4795h4J64j52r2J60Nn6j27J26J59K7j15J0p3Q0K9j13J3O7Rj21mNk1n4K7J45j2
4822Bj55K15j03j40K01j23N7J61r7n4j06J75k44K2J91kJ06k24J61o5J63q8m8%
4846Ek5m7k1R9Q4o9j60P6N2J3j8j82J17P9n0k37L65O7j29q6J73pM3j13K4k5oj18
4874i6P0J40j13o1m3O0K1K7k47J56K65j01p6j36P6Q1M8%j04K11k55o0K06P9o4
4899H4J5k55K27p4j11J7J80p0Kj14J41j53J09l1J48J5j68r3l8J58N2m2M5J3k26
4924a69K68j51K68l85J69m4K6J56k27L6Q9L4p9p2j13K36o4j19l7K32J27j79q0
4947g8L6J97k91M4R4r7J03O6q1J03J2j05k3QJ01j82L3J78j39Mj58K01j80J45j
$$ plain form
4771 123 -49 -65 187 47 -39 26 2 71 59 -199 4 -171 82 -5 -35 77 -36 -10 -95 56 -112 16 -29 -84
4795 -84 80 -72 -164 -4 1 -55 -182 -56 103 130 15 25 -48 32 61 -52 -39 28 37 -84 -88 -83 -104 -158 -131 14 2
4822 2 -153 62 -41 -181 20 -103 -46 115 18 -36 -142 33 -211 -189 2 0 106 -118 43 -22 141 53 5 5
4846 5 -20 -67 -88 11 95 26 -134 -58 -6 7 -11 -193 -76 3 -47 -284 81 148 19 -67 106 99 142 29 53 28 22 -96
4874 -96 -26 114 1 -60 -103 -43 -22 5 -242 -86 179 78 2 -134 -58 23 71 71 -33 178 -77 -137 69 148 84
4899 84 99 -156 71 -3 -114 -97 83 13 15 -99 42 -111 -2 -33 115 130 -38 -131 -169 -11 41 -1 44 57 -169
4924 -169 99 -52 216 -169 0 -44 -18 138 -89 -53 36 70 -9 -81 -194 42 -22 -141 -178 54 181 2 -78
4947 -78 -42 155 -136 -92 2 -95 8 74 -7 96 108 3 -20 -12 89 -93 -60 118 -21 -17 -175 26 -154 -9 -10
4972a0NK6k6J9PpR5j42Q5l7O7p3j38o6J79K02l40l3P4N0N2j61J65J80k48J0j1
4999g6L20l50N9j5J57j91lm1L12k45N4o9R3M6j50O1l6J96j22j28J65k5K5q1L9
5024eR0J14j57j18K23n2o2p2O9j08J17j84J77L9k0k00o6J26j03J48P8J91p0m8
5048A07q3mM2r3N2J2P5q4j3r7K56o7J6j59R2K0r1k2J19k04P8M9R4J51k19p0n4
5075i7M5q6J21L5j74K89j8j68Q1M8j32J67j14Mp8J34n3nK9l7j42K60o2j45r0K35
5101D7j08J14q5m8M5k1n0L3N5N7o9nJ04P7j04QJ79q6k72n1K06n3N2kj32J67o2
5128dj4m1J22r8L5m1J97j72J0K6m6K6Rk28J63O2jj73MJ76M5j0o8L5R0j71J24j58
5156a01K35k8j10nL6Pm0r7J99j34j06J57J3J29j34j12R4R7j60J2L3K4K81l73K0
$$ plain form
4972 -10 -5 21 -5 14 21 14 109 -33 52 15 82 9 -129 -195 -16 186 -154 -187 -113 -63 -11 -172 -7 173 -75 -65 -76
4999 -76 244 -106 -47 -62 95 -96 -99 -140 172 -73 -19 -88 5 51 -99 -38 -74 122 0 -128 37 12 37 -44 -5
5024 -5 85 199 42 -76 147 95 33 -39 30 -78 39 -145 32 71 51 -149 -215 -89 -192 -44 34 225 155 107
5048 107 24 20 62 -31 21 33 108 24 11 -86 170 103 119 -40 52 72 -19 -41 78 -126 -48 1 95 246 27 -43 -97
5075 -97 -52 -138 -17 18 -156 133 115 -53 28 76 -56 111 -3 1 -77 57 4 -1 28 -9 -151 109 47 -98 -188 47
5101 47 -61 53 -32 -80 -35 -56 -106 -73 -18 39 -30 -35 69 146 42 50 229 143 -129 -180 26 -27 25 23 -109 58 -4
5128 -4 -18 -59 63 -35 0 -41 156 -16 -6 20 -26 0 9 -219 -56 6 5 -168 -164 12 57 47 -21 14 104 -67 57 -101
5156 -101 134 106 -4 -9 27 34 -6 -103 96 -38 -144 13 26 155 21 -91 3 100 -60 -48 -15 9 290 -83 -63
5181f3J82J3j59J33k01K66k29M2K7O9k17OJ72o4j03Pj39K90L1N0n4rq7j37R9J60
5207H5K7k36J83r7qK06k26lJ77rj64N7l9l8l1M2O6J19p8j00k6J10K2r7J2J2R4
5234F0j7JR9j18j34K16j15M1n1J25nj8joj46J5K33j76j4q4K05j10p8n2J75J9q1
5261a7O2L7p7m6j07J70M1l1j78K09oP4j20k30M12k47J9J19r2L6r4J45J7r2j9O
5287in2J4P7R1j55K3j8K2k3O1N9j09k00K19Q7k38J47J2O6j23R4J2K5j88N3J53
5313A00j32k2m0QJ59K4n2J4l1rk3j51P1N6p9jJ25q5Rj9JJ47O8j34Rn2J14j90M4
5342g1R9j6J6L3n1J33n1j0q7J38r2l3k76L04j52J28O8O4j48j30L8R2J39k65N4
5367g6K6N5m0q8J79M9j12M1j08L5J1J0q0J04o1J96j52j04J45O4q9P6O0j00q1J00
$$ plain form
5181 -63 119 132 -27 106 -95 171 -58 -16 11 80 -137 -131 41 -23 -126 -119 -258 32 63 113 59 50 -37 -174 -75 85
5207 85 112 -124 59 -38 -46 160 -66 -69 108 99 -65 -8 -47 -85 -116 -74 -8 111 33 -67 -93 17 39 -58 -46 -34 60
5234 60 43 44 143 25 -109 107 -8 33 -18 107 102 84 83 77 -69 -54 179 3 -11 -95 110 0 -78 -130 45 64 -17
5261 -17 45 82 5 -41 -148 22 63 32 -146 63 57 131 11 -219 193 -54 -35 84 -8 28 -66 79 96 4 -15 -9
5287 -9 -61 -47 30 121 -34 -11 -29 -7 -30 31 90 -19 -219 0 87 -151 -4 8 74 -49 45 57 82 -106 -53 100
5313 100 -32 -54 -94 -86 73 97 45 59 28 19 -4 -155 -84 -28 -107 -108 17 -68 -59 -78 -77 70 138 4 13 -39 75 -115 -71
5342 -71 28 12 28 61 10 143 92 82 -5 133 41 8 -268 36 -116 12 80 144 -4 -134 -96 -4 135 -130 -76
5367 -76 -50 5 -35 -123 56 105 -7 34 -74 -39 -28 -18 -98 6 -55 141 -11 -115 30 94 5 81 141 41 -40 60
5393F0j14M0%r2L25k04O4j33n5K57j36p4rJ45O4j05j39J37l0j08L2j7J92k19o5
5418a84J41n6J86k49L73j94J05k50J10m5NP6o4rM3j55J22R6p3L8P0j46J38j26
5442d8J0J0qJ18n2L7J3p2L9j4j22J62j43J5K38j32K6j34R5j61K28j03K2l9J50
5467A35q8j56n9R2O1J09j15J29r0n0K26k14P3j15j0J0nO5l0J2r5J88M6r9R0j12
5493bN8lj65L03k73m8OJ96k9p5M5j02l6J07K2l7j5j25O8J36q8j26K03n2Jo0l7
5520a28Q9K1M8K1q5L1j8R9k77J63P4m8r8J41rq2j01L27k72K52r7q4K89j17l14
5545a75R1K13k07J62k53L03j03K9p2n2R9J26m4k19J14p6p0l8K10q2N1r5L8l0J63
5570H3p7j2N2M8j08j0J98k73k9J26j62J43L0L0J5L1r9j16O1K43q9l1j67K84p6
$$ plain form
5393 60 -54 -14 -14 -106 219 15 79 -54 -109 148 12 -62 -71 74 138 33 -106 31 1 -107 -75 -92 100 -119 -184
5418 -184 -43 -99 87 -162 211 17 122 -128 -18 -63 -58 18 -46 -55 -12 -167 -45 51 -22 16 86 -60 78 -48
5442 -48 -38 -28 -36 82 30 67 80 8 47 33 -89 73 -70 -55 183 51 77 -57 38 -123 105 2 24 -15 135
5467 135 47 -109 -168 -76 -15 94 -21 108 18 -32 194 -20 53 -62 -72 -62 -67 -2 -32 -20 -115 73 119 20 110 -2
5493 -2 56 53 -112 191 -82 -130 -124 72 43 -32 13 -89 -125 -18 4 -33 -48 -173 -105 31 -57 -183 20 -32 -31 -91 -128
5520 -128 -39 -18 30 51 -34 -3 -21 78 -199 -36 38 -10 -108 33 24 -58 -159 168 -104 148 51 -33 256 139 -175
5545 -175 -84 129 -78 84 -169 134 31 60 -12 -64 35 161 117 -102 12 -64 -134 -172 38 -44 7 -88 -50 -80 83
5570 83 6 -6 46 94 -14 -24 174 -99 -128 -2 -164 -21 9 39 54 85 -14 -130 -69 174 85 54 -113 171 95
5595I5O2l12Q3K98j64m8P0M2Ol17K25J8k6kj41J11J8J48k35J12j12Lj27K01o9
5620f1l5J12K5J72j54j0J00k22J37k21K10j53Q6K0k05R0J91k2j06J12j17J7o5
5643i9J48r6Q9M6j31J07j8K6k61K73p3KJ64k71M0lJ46k33K82j98n6j7K12j0k01
5668a32M8R7k2lJ25l7p1j02J44j85K99j83J3o2Q8q9p2K04j37M7K0p3K29j70J30
5693A06k00O1O2j27M5J06j00J18j94J15N0R3m5j80J09r9J40j55OL4K8J20J6j74
5717f5J9j64K07N4j19Q0kJ58k44L6P2okJ5j74P1Q2n9K0J27q0m0J42q4k6J05j0
5744A13j57J89o9n5j60J35Nk1j28N4K1K25j26l7O8j14K25j46j0QM9m8q3J25k44
5769a81J84m9N3J56j86j09J87q5n2n0L28j36j47j63K04N2Ol5k7N5q3J7k27K37
$$ plain form
5595 95 157 -155 -72 226 62 14 84 126 132 -185 40 58 32 30 -111 0 18 166 -69 43 -69 -66 -193 8 -61
5620 -61 -96 16 41 213 59 49 149 -73 64 -157 53 -100 -14 6 -199 -109 82 60 -46 66 -51 -34 -99
5643 -99 49 -47 42 88 -43 64 46 72 -189 84 11 13 177 -94 -54 -57 89 -144 138 -60 -116 -133 79 69 -132
5668 -132 -84 13 -9 -12 113 76 5 -97 47 -138 161 -22 -9 -71 17 -72 -144 60 -77 -30 -10 -83 146 -24 106
5693 106 -94 -33 29 -98 -53 53 -47 71 -123 -8 42 135 90 -90 19 -80 60 -95 -89 -55 -27 93 109 -65
5717 -65 -46 -210 -3 51 -68 12 10 168 -76 -40 32 26 24 39 -135 -64 18 -41 -21 106 26 -14 128 44 18 123 113
5744 113 -44 145 76 21 -139 -4 1 -20 -148 -94 -73 152 26 -11 57 -57 168 22 12 20 69 21 -62 63 -181
5769 -181 3 -46 7 163 -23 -132 55 -30 -82 -132 196 60 -87 -250 -46 6 12 -23 -50 5 -78 -61 -288 -51
5793e1K26P9l16J84k69R7J3L2j32J47j27K38q9N1p1P8q6j3K70k07l2rO8q4q7J34
5819D4o3J22r1J71k42L2N5M5l4K6j32J6J27j82N0j21K92q9j45P8Q4j66J66kN8
5844I9j52P2N2J3P0m1l27J25J43q6r6n7K49o2k52K23o9J13R9j62M3No2o5rJ21
5870a3L6P9j47M2P3o7m3n0J3P1Nr8J32j0l0oj2O3M7j34Q5j54kL00j01p7j8n2O1
5899gJ24j32J07k15oJ14k18K32J22j84J16j41J49k4L7j82R3m2J14p3K52j63oj63
5923i6j23J37Q5o6j24J61l2rJ40M3j20P7q1%J02l8k06J47k9L1p4L8J2N8n5m9J06
5950C5qOp7k7Q2j27J42p3k6l2R0N6j93J20P6j12J48O0k34K6N2P3k0K7j78J04J09
5977I9l12J77p2L24l99J62n4O2J62k15n2j5J17k5N6Q4j57l9J64k30J66N3p7P8
$$ plain form
5793 -51 175 254 -62 122 -147 -50 -37 -5 -137 10 -117 121 32 83 12 90 4 -9 261 54 22 13 81 -3 -90 44
5819 44 -19 103 12 183 -59 -27 28 73 39 65 -67 -51 76 -106 -56 -177 115 26 -119 -41 43 -123 43 41 99
5844 99 -53 19 71 84 154 113 -214 -89 54 -32 -128 -185 64 2 -250 -27 -96 17 116 -46 -3 2 -60 -125 -134 -13
5870 -13 23 102 -45 -3 70 3 -40 -90 -77 -6 -1 -99 33 23 -7 -13 -25 38 85 -49 36 -118 -120 180 79 2 -16 -68 -7
5899 -7 117 -15 92 -123 -129 -15 -233 -1 121 -63 53 -88 61 37 74 -108 -15 -57 57 -16 236 73 67 -96
5923 -96 -219 -82 3 -63 -187 -26 -58 -67 73 116 -4 73 -8 -8 94 56 -150 -3 -32 -1 -75 -37 -25 33 -22 -71 35
5950 35 27 33 -44 -71 11 -116 26 -47 -73 -105 -15 41 -152 -32 44 -68 80 140 -94 -68 -16 57 37 64 -114 -10 99
5977 99 -213 -36 -108 216 -183 -21 -75 -13 149 -66 -118 -133 -16 -41 15 99 -58 -97 67 -163 3 56 -21 57
6001E7Q9j32L2k09J32o1Q1J0j01J13n2p4Q1K8O8j88K04m0p0J07j30K09j52Q3j25
6026d0O5p2J93j68J45j92j7L1L9j51K88j60j8L5M2n3J54q5J02p2q2N2P4j45J07
6051G2l0J49k67k6P1j2L7M9J08p3Kj23n5m3J20K8o7j7M4J29P6k77k1P1Q9n9l4
6078e9O5n5k9J27mq0l8Q8m1o0N7J01p4J00j03Pj03K97l38K80r7rP2Kj15J45r3
6105D3qj12l5P7Q3K7k37K01j97K55k4q6k13J85J06j51J2J30k58L81l07J24L1K23
6129B50k38o4M4o1K41k36M4kMl8n6K18k39QJ43n1l8k4K4J10O3n3j18L7J37J8j27
6156dk2R2Qk50K06j34K33j43J52j64k4J64j24J02o2JK3j1n6L1Qm3J1K24n4J6k22
6183d2N2O6L5j22J4J0J23j07R1j81K1O1k6J12j31K0N5mN9r4Q2j37l2PQ3K7N2M9
$$ plain form
6001 57 146 14 46 -163 -31 -92 -11 -1 -102 11 -41 -115 -34 -6 62 -126 78 38 -32 75 -55 154 2 85 -40
6026 -40 25 -47 146 -22 123 -69 -86 -55 -16 -167 121 -39 -57 -22 20 -33 121 36 138 66 -16 36 110 -35 72
6051 72 42 191 -76 -102 -31 -43 -6 43 151 78 80 -43 -98 -141 -21 7 -60 -77 -33 96 172 -105 -126 -55 34 -25 -59
6078 -59 6 -49 -78 49 45 -35 -73 15 -26 -86 -29 72 -2 98 -5 2 -101 196 -142 138 41 32 104 106 -9 136 43
6105 43 35 -77 -112 -35 48 75 -162 39 -158 97 73 -13 -226 -41 65 -86 -74 56 -202 179 -128 -4 27 250
6129 250 12 -52 -8 -69 172 -64 -20 -22 -18 -56 -112 106 -133 -125 18 -33 -71 -95 -71 39 102 49 -69 -32 105 123 -4
6156 -4 -26 66 74 -176 30 -104 129 -14 138 -26 -50 114 -10 92 30 31 54 43 -13 18 26 -17 -6 218 164 180 -42
6183 -42 10 76 111 -11 3 13 136 29 120 -61 -40 21 -5 107 -24 -4 51 47 106 12 94 -43 -75 -68 15 42 94 143
6211A43o7L8k13M2kRJ63k50P1%QN6n6O4q2L19k56J44o6k25O5M7JjRJ44j34m0m9
6240a18K49o0j17J01m4qpl6k8R1P1j15R1K8r8l3P3m6J85j56j43K55k04J6J08J
6266E6o4O5N3j18j44K74k13K12j77M8J11k07O3m7M3M3n7P6k1P1k6m0N1N9p3r7
6292e9n1M2RkmQ3p9j3Q0J8Q1O8k41oJ59k58J95M6j32J78pj30J40j42J19j42K42
6319A94j67j45J11L1j17Q7J23j25l4J22j40J42pp0j07J66m3j72J74O3k59K57m8
6342C6j00J34r3K8J07q3mJ2j1j04m8J54J3j00K18j48o2J48j25N1j13m1K15j33
6366d9JP5r4K4N5J38k15qN0j16R1Q9Q9n6k45K06j74K36r1L6m6P3ml3q1R7o6m1
6394e9O4l9Q8m4mR1p5o6N3NK4l0P8j05j5p4J31j1Q1j1j55J38p5j70K97q0l0j2
$$ plain form
6211 143 76 114 -99 -57 -59 -50 113 -137 -66 -66 -58 -2 -58 6 -76 243 -13 131 65 -160 -95 -48 -47 -48 -39 105 -29 -69 -118
6240 -118 131 71 -46 55 11 3 -4 -40 -68 23 94 -21 70 98 0 -33 40 -6 179 23 -120 135 -69 -53 55 56
6266 56 -8 57 110 -8 -152 122 -91 121 -56 -8 103 -104 -41 -88 -45 -2 -59 17 -4 67 41 1 52 111 38 -59
6292 -59 -110 -68 -59 -61 -65 18 -61 -74 6 24 105 173 -68 -74 85 -173 22 68 -64 114 107 -23 117 -25 94 -48 194
6319 194 27 -118 -7 24 -93 -6 117 -8 -42 80 -60 82 75 5 -102 64 21 -151 23 86 -173 84 36
6342 36 -64 70 -23 5 112 29 25 37 26 -78 -126 28 41 -59 159 11 -51 97 -28 23 -90 -131 84 -49
6366 -49 -48 27 -67 -43 12 150 -65 -73 -23 -139 -48 41 130 74 -171 35 -139 97 6 42 -4 69 65 32 -49 48 -18 -59
6394 -59 5 -34 54 10 6 97 22 -44 9 14 38 8 86 -19 -34 -108 23 12 93 82 -73 65 -10 -180 117 37 7 -5
6422eJ16j72L0K6Q5k04J35j05j5L22k56J03l2M5l7M0j81K18o0ml9o6J46M8j45
6447gj5N7j7Q3j06OOo5K05q9k10K31j97Q0JJ64j55k9J7O2l1J12p9o1K55j48P8
6474A48j80J32p1Oj88J98P3j13JMj71J20JK64k18j4P3m0j66R1O6j29J83o7Q4n
6500H2n2j38J5j4Q3N1J8j40K35k97K13m7l3R7r4Q5m4r1K9J13o6r3J19M8J01m2
6526A38j57J38J65l44j48K30n9R6j22Q1n8QL0o9R7q7J36j49L0o1J79j91J74j07
6550e0M4j11m0K18l8j63J70j3J3j03NQ3L5k7j2O9N5j67J03j63O4p9O1L5J25j31
6576a7MN6j37N0P6N7J3j43K9J9m8Q8l4J07j86O6K9rK07k97o4K75p7p0l3J1jK3
6604fk39K66O3k55R7J00o0r0P6R6j63J11J44j02n8J23K8n1p2M1J2j3l5J8J7p2
$$ plain form
6422 -5 111 -61 -31 -5 80 -124 11 -94 -109 213 -43 60 28 73 36 76 -105 113 53 49 10 -56 90 138 -7
6447 -7 -22 35 18 101 -5 1 7 -58 147 58 -152 79 -118 -38 -37 127 -28 -57 -40 22 -9 103 24 -37 218 70 148
6474 148 -32 100 29 35 -153 45 118 5 6 10 -161 -41 -40 224 6 -8 65 25 -141 -50 16 -113 70 3 87 82
6500 82 30 -108 -93 -107 -24 27 45 -95 140 -157 56 9 -24 73 -21 64 20 -71 -42 71 5 -88 31 79 180 138
6526 138 -19 119 284 -60 -208 22 -37 59 -63 18 -40 -32 -2 -71 26 -61 75 -74 -44 -105 74 -117 57 -50
6550 -50 -6 -117 -157 61 23 -140 30 17 30 -73 -68 15 50 23 11 80 135 -32 71 -92 -28 -107 -46 -11 114 -17
6576 -17 -13 43 -94 -44 32 89 102 -41 -12 7 -41 47 13 120 -66 0 29 20 227 -70 -134 141 64 -6 -39 -28 -29 -6
6604 -6 -245 21 84 -171 -74 26 -34 -124 -48 48 -115 -4 140 38 -20 103 131 80 8 49 61 48 13 31 48 -24
6630b4p4J29p6k1Q6K9j80J17M8o6P0j7O1J9l4M4j07j2M7m2M2m7N3k4P3j35J1n2
6658h2J2J02l2k0O8o1L5p5Q3q3K31k37q4K11L9j58J00l8j1J07j35M3Pk3r3P9Q
6685gr4J85j01j54J22J15j07L2L7M3rj13M5Ol4K4P0j16K04j86L5nk1L3j88J83
6711aL3p0M2l3M0q1p9K28k3n1j24L93k70p5J12J26k14N4j13J69rj81K16k22J05
6736b8J14qj91J0L8J56q7K6O5j79KJ31j44P8L5q4n9L26k08o0J51j87M3L2J5J31
6762A18j07o4JJ70jp2J0j6N1m3j49L1oL6M8J2j15J81j10k3o2L9J93j27j11K28
6788A12m0r6K6j8o5J8K72k85K06k7j55rJ24r7M9j29J12K05j39k6rO0llm0j72N8
6815g1j8OJ4JJ73j58J56j93kjk3J38N4p0L0o0k1J17m3Q8k31J32O3j35R3Q7r1j00
$$ plain form
6630 -24 -98 31 -45 -66 20 49 -131 -14 34 -32 38 21 82 101 67 111 4 -8 39 -3 39 -8 45 21 94 -41 -30 -82
6658 -82 -70 32 0 -20 48 -13 22 -53 30 -53 178 -59 -143 68 107 -51 49 11 0 107 -28 15 22 -1 -94 -15 -7
6685 -7 -101 84 -17 -171 -49 66 -41 -9 28 71 62 -51 -6 0 -34 -10 60 -56 148 -38 -3 -8 -29 4 -184 -1
6711 -1 32 -38 4 -29 11 -70 -149 79 56 5 -119 274 4 -71 41 167 -47 7 -106 63 54 -127 89 -133 -28
6736 -28 86 78 -113 -103 -65 91 4 30 95 -84 -82 49 -95 -17 18 -66 -125 201 -7 -67 84 -103 -60 -28 -13 118
6762 118 11 -53 -52 118 117 45 55 39 90 47 -102 -71 -77 -41 7 19 -96 85 -25 -48 -110 -71 122 -5 -116 112
6788 112 72 -24 2 -16 -81 -63 209 -76 130 103 -52 -61 63 -34 15 -114 -2 203 64 38 29 89 86 83 43 -129 -71
6815 -71 -89 -83 -69 -68 105 -53 103 -90 -92 -93 -116 22 76 6 36 -24 -45 72 29 117 -114 18 81 -54 39 126 35 -65
6843f5m4k4K59lj34p8J41j33J76j24l2J41n8m4Q4p0L2o0M2jl0J5j2J46k60K58
6869A22k20J43q4J0o2N2Q5L3j33R6k2j53K30r0m7J25r5J11m5k11J18n9J31K9q3
6894a9q3J56r3P1l3NpK5J57M2l02L6nJ8m2Q6J04j90PJ28q2lN2k2k6l6RM8R0j24
6924c3j01R4n2q2o2L10J9k1j06j3J3o6J20Jj37J86k45Q8Q7R3j33M9K1j53J83k13
6950a53J28j2J45r3oJ5q5J49j27n7P0KP2l1n8M1jnl7j3K7J88k63N2J20j66J43
6977D5r7l0j1O1L1o7J10o8P5j28J03o1l4L4J25K1jj38O6j06M0K8L4o5jj60K27
7004C3k3k1N8Q6k51J64On3J64k51J55k66K91M4l7n3q9R5j63J88Kj04j50L3K26
7029H4q7K4kl0J38j45J27j94N1r8P8J60k93K10p9J71k24P2m2K97k11j01K05j20
$$ plain form
6843 -65 -109 -133 126 123 -11 -89 52 -81 95 -29 -61 80 22 -22 62 -8 24 -36 6 5 -25 -10 -22 124 -136 122
6869 122 -98 45 -39 -29 -91 -39 46 79 -54 42 20 -133 97 7 -40 85 -10 101 56 -155 -37 -96 35 64 -19
6894 -19 -102 54 -39 32 -1 4 -3 22 179 221 -81 -45 -50 -32 -74 12 116 -74 -67 61 -21 -24 28 6 -20 -56 -47 1 91 -33
6924 -33 -134 -40 -92 -174 -236 74 93 72 -34 -47 -34 -100 20 21 -116 70 -175 -87 0 93 -40 9 30 -123 60 -153
6950 -153 -25 -37 108 15 9 24 -61 88 -39 -96 -26 -24 48 17 -41 0 -1 -6 -43 -56 -29 159 -104 -52 68 -98 45
6977 45 -52 -82 -93 -32 -1 -68 42 -26 49 -79 24 -37 -71 -37 88 109 108 -30 36 -70 -30 -2 32 -33 -34 -194 33
7004 33 10 -11 47 133 -118 46 52 -1 163 -88 67 -199 92 136 99 46 -43 52 -111 77 79 -25 -175 -142 84
7029 84 -3 21 19 -11 127 -18 109 -85 -34 -132 -54 106 -187 23 -56 115 -109 -37 -79 218 7 -94 111 -9
7053ij25J24OK2J1L1Q4k00P5N2q4j27L7K41k19J95r7m9J06j14%J55j58J25K4p0
7079C6J7J3k7m1k8J6P2j91K84k61J10J4n1J83l81K91N2R9j87j07R8K6M2m1p5j25
7105a62J21M7j13R9N9j62nKJ37j2N9qK6j52K23k11Q2k7n7J4j61J23R7j78K04k
7131D3J8m9m4O0j38J18M8p9r9J77j74J90k31K15L4l3n0lm6p1O5P9q1O6p6l9J32
7158C2o2J10r3J01p4q8J92j64J12j75R6q3M8O9k5J11k03K38j15j74O1L3J67j84
7182g0l7N0j08O4M8O6J29k17J0K13o6m5m2O9%j8j22L7q4J2K03j8j31JL8L2r5Q7
7210Fq5J34j86J98O9j56J27j8q6j30L32j79m1R9p4J29q4j41J64o2j8P3m7JK9j87
7236a33J71q7n5n0J34J79k29O3j32K38k8j82P4K26k07n1J0J66k08N9m4K20m30
$$ plain form
7053 -9 -134 -10 -4 18 29 60 144 -56 19 71 -13 -140 -103 138 -81 114 17 -32 74 -40 -40 115 -43 82 106 36
7079 36 53 66 39 -2 -30 -14 58 -133 151 -110 0 14 -37 146 -235 56 108 207 20 -87 11 37 79 38 -37 -162
7105 -162 -41 6 -107 -8 51 -111 -116 -114 23 11 70 62 88 -64 159 -52 30 3 -54 -40 -201 -78 19 -159 45 43
7131 43 61 12 -32 28 -110 8 56 -23 -122 55 -119 71 -160 55 89 56 6 3 -43 -114 -49 30 -51 15 -61 -100 32
7158 32 -30 80 -13 88 14 -74 118 -46 66 -109 -13 -96 -48 21 -4 107 -96 142 27 -147 -86 -53 114 -70
7182 -70 -107 -57 -165 -101 -53 13 142 -75 -65 148 82 37 -5 64 64 46 -76 -39 -123 -111 92 74 -57 -56 -18 14 -81 6
7210 6 -79 55 -131 67 136 -20 107 89 3 -127 205 26 -15 84 10 139 55 -86 78 16 -2 71 24 25 54 -133
7236 -133 38 -49 -104 -154 -20 159 -70 -7 -139 99 71 -111 -37 189 -18 -69 -59 107 -101 -42 -86 134 -296
7259b96L39m4J25o6p7nP4p4P8j45K50p9p7j9r6P1L4Pn1O6k6J13k56J91P4j45J0
7286b4N3p0J09j15k7O3M8l8l4Q1o9r0J24k6q5L0k2J89k06K33j13m6p9o4K05k0
7312Gj0O6N9j54K19j97N5k01K18l3K4j14R1R8k65J55M8j48J4J02j22K6R7J1j9
7337B7K08m42J30K46j41l8k3m2M6K9R4k18J88n5r3k4P9J18j28J09q9p2K4J31j63
7362i9L02k79P1J54j08J41j95Q6p2r2Q3r2K63j87O5m9J1n3J33n7j04J89k09j7
7386a15J04R8j77PJ20J21j48jnj33J30j25P5K9j1L4o6j1K40j37mm3K4MJ83j35
7412E8j33J38p6j73J53M8r6k3J15nL9j45k1J71m3K0k24J70J50k1O0j75L7k2L9
7437D1o8O7jM5q6j4K8j6N9k73L84q9r1j33R6J16M2n4j05J30k21R3J09p0p7N1Q0
$$ plain form
7259 -296 43 -1 124 58 -19 -24 50 -24 54 -91 159 80 3 -16 -112 -41 -7 0 -51 15 -11 102 -154 37 111 -34 -24
7286 -24 29 -41 68 -47 -74 -11 37 -1 -35 46 -23 -113 11 -15 -100 -70 -92 97 -109 124 11 -35 -114 -178 27 7
7312 7 -3 63 122 -32 187 -10 45 -156 62 29 53 -61 30 128 -137 18 66 -82 -68 34 -88 -62 35 46 27
7337 27 235 -207 -77 169 28 -10 -33 -75 -29 0 94 -124 64 9 -84 -108 -29 89 -39 70 -19 -91 -67 64 -99
7362 -99 203 -76 -5 149 41 182 -13 73 1 -91 -8 -100 163 -24 41 -8 3 -50 83 26 -78 111 -98 -115
7386 -115 -11 87 -90 -83 37 158 10 9 4 -129 1 -124 -49 -20 -31 3 -63 -74 166 29 25 -18 6 10 193 58
7412 58 -75 63 -13 -186 -33 15 -81 -104 11 6 45 -100 -121 50 7 27 -197 -27 123 102 162 -13 24 2 41
7437 41 -27 40 39 84 -2 -16 12 -4 55 -218 166 77 -14 -147 -51 65 107 53 -52 78 -143 -50 59 -11 -88 -37 43
7464D3j54O6O6P3j80J9J33n6Rl4J27j17jm3J24O4j41M6j86J65l3m7M1oQ6O8j67
7491c5K7Q3j41m0r0K17p4r9NJ40n3L4jJ55j03p5N9%lK2PK2j24L6lP1r4O4L7j3
7521C1K1k23P4K07j16O0%k71J93J8KQ9j32Q4L4m7J86j90k40J96P1n0L5K6Qn6L1
7548D1j09n0m9J11k3M8J0J43k07J52K5p7L1j99J52p2Q0L5j29R1n3N8m4O3KN8P1
7575A59j56j32J52L6j31j0QP1r5Q4Q3l43L52J11k58K49k71R5KJ0k12J86m0k1k8
7600i9K21j51J22k60K60rj41l9J84o8k9P4l6j08L3j17K35n9m8R9J5r3Kl5L9J5
7626Gk7L5o5K53k96N0J78k00K40m3J51l59R3o6N0N4j0J9n8k7O1o2q4J50j9j21
7652i6N0k7J07k20J41R4p8j2J16m9j21OmJ41o7N4kK4j2m6k4K08k04P4k7J39k63
$$ plain form
7464 43 -111 -45 21 94 -86 -67 66 10 19 -15 112 -5 -6 -49 75 139 -2 44 -142 23 -10 -57 -16 -22 64 132 -35
7491 -35 -8 75 -66 -106 -196 21 -53 -152 -147 -7 -60 -26 -27 128 25 -50 9 9 6 28 35 57 -67 -31 -34 37 -57 7 44 31
7521 31 52 -171 -97 110 -6 54 54 -217 -24 -6 -4 85 -47 37 71 24 210 20 -220 -24 47 -3 32 58 66 10 41
7548 41 -68 -118 -167 -56 -79 -31 -21 122 -85 67 92 15 46 -153 -1 -73 7 42 -87 4 -49 9 -35 28 30 88 159
7575 159 3 -129 23 59 -72 -82 -74 -3 -98 -14 69 -274 78 189 -69 180 -91 4 6 16 -196 -10 -50 -71 -99
7600 -99 122 -29 93 -167 93 84 -57 -96 88 20 -9 65 29 -79 -46 -163 72 13 -35 64 79 -14 -12 -47 -8 7
7626 7 -20 15 -50 203 -93 -43 135 -65 175 132 283 -76 17 -49 1 55 45 64 6 -21 40 -22 -106 44 25 -96
7652 -96 -46 -73 34 -186 -45 49 -29 -41 75 26 -95 -89 -93 48 -19 35 33 57 45 -1 -25 183 -21 53 26 165 -98
7679i8J74j61P2J18l09J74q2J52l2J65k17j13K74j6r8O0m5r5J4J43n2Ok9k9j75
7704a99J68l1j96J81J32J3j32P6O8j0L3j43n8J09r0R3n3J41j35l8J27j77M6J09
7728C4N6r9K5N3q5J1m5K1J99j82R1o6r7K4m4J93J45l02L5mJ44j24J71j50j20J33
7754A7j55L08j69j09P6J26n0mm6m9Q6Q1o0n1O2n4Q5j97K17j4Qj12p0J44j22N3
7780AK8o0l1O6j50K69m4n2pk9p1m6J38j27k6Q2n0K3J05r3K9p2Q3J05p6J1j17L6
7808g5K8pJ37n1J58k16M5j2j6q0J93j02J7j40k0J52l1L1o0J63q5j34J25N5l0K7
7834G2r3O8K5l7j34J67j60N2R2j5j34j82L82m5J45p1j56o9J63J9j84M5R1j83J31
7859a1j11p1K12k4J00l62L05o7J19j31J16Ko5orJ10q1Jk3k8q0J62k16O2Q6J03
$$ plain form
7679 -98 76 -85 -13 105 -204 -30 -112 40 8 173 -44 -157 117 101 3 63 18 -77 -63 80 28 34 5 -24 -199
7704 -199 -31 -62 -258 -77 55 68 -64 12 80 70 103 -40 -98 11 -79 14 -39 102 -33 -71 56 -121 -75 34
7728 34 90 -9 16 69 -16 -5 -50 -29 170 -12 79 13 -84 -60 -104 89 234 -68 -33 -37 107 -17 154 4 -116 17
7754 17 -138 170 1 -108 -32 94 44 40 -6 -55 31 112 52 1 63 9 94 -103 114 100 108 -4 -74 70 -52 1
7780 1 29 -31 -62 4 -146 123 79 27 20 -9 -80 -126 12 -115 -141 -59 -109 -86 19 -74 -45 -117 -34 71 -5 6 -111 -75
7808 -75 -47 -54 83 32 190 -26 19 7 -9 -89 104 2 19 -121 -141 11 -20 11 -49 114 29 -105 20 75 45 72
7834 72 -21 47 72 35 -99 68 -92 -40 52 37 -97 -279 103 58 203 132 -24 -93 70 89 -95 -50 41 -142 -11
7859 -11 -122 -193 19 -5 95 -267 38 -29 90 -41 75 77 12 6 -3 107 26 27 4 -24 -104 58 -158 -96 -10 93
7885I3j33M9o5L1mk8r2J98j85qO4k2j7Q5J60j26J48k76J76l2o8J2J28j84M2L1
7911b3O4p1M1m9Jj46R8n3M4J46j10J06J9k9M8q7J13r3M3j14j33K56JL0n8l9Jj35
7939a29J58r6J38j03Nn9J84Qj14P2q1L4j17M3Nj4P2j4j12O8J34L4j75j6O8R4k70
7966a83J16N9m4M1N5p7l2K7j06J86NO8J1p0p7o3J68j05K0Q6j11nK59k12J10k31
7992a05o3L05r2o5J12L7k62K75j17r3l3K10j03J1j6p7L8J19m9L8j6J5j02K3R3
8017H3j42K5o8J23o4K0LMR4j2n3p0P4j01K2J49P5q9m1ln1M4J3j30O6j15J81K4
8045F1j92J47m4j6n1N6J17K3k86J59j02J09J91r0j27n2J10K0j08J89j20O2p0n9
8069g3J83j71J53j38Q3J0k24J50j37J54m2P0j53J19j02J13j51RL27j54k4P4m2
$$ plain form
7885 93 -40 9 -56 -25 -29 -57 -149 49 -136 -144 -80 -102 -119 -34 126 0 148 -128 48 16 -52 -40 88 -96 -54 -23
7911 -23 41 -30 11 -38 -37 -183 -85 -138 -94 52 -58 48 67 38 86 -1 112 19 62 -52 -185 71 72 102 44 5 6 -129
7939 -129 29 -67 71 -32 -27 -86 98 106 -8 64 -17 17 -100 -57 -52 -66 6 -8 -120 -52 82 116 -59 -75 -7 87 -183
7966 -183 -67 -8 -52 -11 44 -33 -65 -38 -144 42 47 115 126 56 -21 -84 84 -21 -1 85 -26 -31 228 16 126 -105
7992 -105 -168 137 45 -20 92 129 -133 142 25 -68 -101 109 6 17 1 -76 -38 81 32 70 54 69 -33 -10 83
8017 83 -59 -34 -102 21 -43 -23 -20 -16 78 66 13 -57 17 -84 -62 87 162 73 32 29 -22 22 35 -95 -29 -144 37 61
8045 61 -131 16 -28 -44 -95 -39 78 101 -185 -26 -128 -19 172 82 -45 -97 13 33 -75 114 -6 56 -14 -73
8069 -73 110 -61 92 -46 37 47 -177 -27 -164 -10 -52 18 -135 -16 -118 -5 -156 -147 180 26 2 76 34
8092C4q6L1m1R6j32J33J3L8k11J33L9K9j48J16M6K7r8m5M1J13J2k64K95j59l5
8117b3n0O1PP3r5j09K2J57r4R5L0n0J40j33r7l7J93p8J3RO2k78J40j6l8J77rp8
8145fJ8ll8Q5L6k1j1j25n8J91l4j25J22n4j23L02o4j54O6Q8j26l5j02K83n6K8
8171H4j16k0J82j49J7L9m9q6J48p0m4kK24p3j33L9N9Qn2j43
$$ plain form
8092 34 -52 -21 -62 34 -98 35 48 86 -125 8 47 76 -72 44 90 117 19 -26 15 128 140 -124 171 12 -23
8117 -23 -73 -12 -5 68 -27 -136 -114 43 -51 44 74 24 164 31 -66 -103 90 12 25 34 96 -182 -42 -58 -96 81 72 -6
8145 -6 12 9 -29 56 92 71 60 -65 -123 68 34 -91 31 -23 -146 156 92 -62 4 92 -34 -69 -171 112 56 84
8171 84 -32 -52 130 -19 -2 37 -12 -98 50 -20 -64 -66 158 85 -48 -9 50 58 6 -137
8191a37
$$ Imaginary data points
##PAGE= N=2
##DATA TABLE= (X++(I..I)), XYDATA
0@%%%%%%%%%%%%%%%%%%%%Mj2J6j6J6j6J6j9K7l2L2l6M4m8N4o2P0p9Q7r8J10j21
42f3J33j48J65j83K02k22K45k69K96l27L58l96M40m86N39o01O71p53Q54r78J134
63F11j337J609k007K642l805O638k5255m0328M3785L6611M271K031M2320M0574
77A08360q378l7504q763N121k2795m8486j8577J8629L331k7655j0430K0377J4264
90a2506k0868k5525O805J6503r711j6172J5857M2533K4445k924J1784L4023J1772
103G6016k3989k2372Q736R557k1761k3353Q782J8130j1198l1706q702J2825j3156
116b2191l8202j3896J8818J1411j1697K516L7994L4200j44p649J6178K2075j0557
129C8856k5553M406K3543N92k0386n317J7125p4l0525k2049N367L785k0755k1641
$$ plain form
0 0 0 0 0 0 0 0 0 0 0 0 0 0 0 0 0 0 0 0 0 0 4 -8 8 -8 8 -8 8 -11 16 -16 16 -20 24 -24 30 -32 38 -41 46 -52 58 -63
42 -63 70 -78 87 -96 106 -116 129 -140 156 -171 187 -209 231 -255 284 -317 354 -399 455 -523 611
63 611 -726 883 -1124 1518 -2287 4351 -20904 -61232 -17447 19164 23435 25466 67786 108360
77 108360 99982 62478 53715 58836 36041 -12445 -31022 -12393 -9062 -36717 -47147 -26770 -12506
90 -12506 -33374 -58899 -52094 -35591 -45302 -61474 -45617 -3084 21361 18437 30221 64244 76016
103 76016 52027 29655 38391 47948 26187 2834 11616 29746 18548 -13158 -21860 -9035 -22191
116 -22191 -60393 -74289 -55471 -44060 -55757 -53241 -15247 18953 18809 11160 27338 49413 38856
129 38856 13303 17709 41252 41844 21458 16141 33266 33192 2667 -19382 -14015 -10230 -30985 -52626
143e2626R404K0471l803j2942J1608K7775P614j4594O8K2299Q572j4385o404J9560
157B2617J9538q913j5156R402J2488j4840k8136o707J0440q060k5764o647J6852
170b2886P665j4436p375K0757J7658r805j0366J3919K0352k470j3387R842K3703
183C3171K383j5641l204J3891J277k3786j6381P360L752j7342j7043P363J6008
196h192n705j3523O937J8094J311j5408k882J7970Q579j0250j579K0142J7554
209C3048o505j1759P594R888j3345k2143m119J0955l009j8540k761J6767N655
222A726j4614r867J1484Q753j3835j2608J1900J8488P21p192J1561K2886K177
235C1580j5954m922R565p37k0349j1586J2074R492j0253r668Q677J1891r543j9175
$$ plain form
143 -52626 -43222 -22751 -26554 -39496 -27888 -113 7501 -7093 -7025 15274 23846 9461 3057 22617
157 22617 42155 33242 18086 27488 39976 25136 -3000 -9707 733 -7327 -33091 -39738 -22886
170 -22886 -15221 -29657 -37032 -16275 1383 -8422 -18788 -4869 15483 13013 -374 9468 33171
183 33171 35554 19913 16709 30600 31877 8091 -8290 -930 2822 -14520 -31563 -24200 -8192
196 -8192 -13897 -27420 -20483 -2389 -1078 -16486 -19368 -1398 7181 -3069 -4648 15494 33048
209 33048 26543 14784 22378 32266 18921 -3222 -7341 3614 605 -17935 -20696 -3929 1726
222 1726 -12888 -22755 -11271 -2518 -16353 -28961 -17061 1427 2148 -5044 6517 29403 31580
235 31580 15626 10704 20269 19532 -817 -12403 -329 9163 -1090 -10758 -2081 9810 267 -18908
249a8908q58J0577l140j3715J728K1134J2324o625l79J5273Q818j2432j5627M132
263B302R521p584j2243N931J7116J792j4841m213R672k724j9440j1807Q998R860
277g660p320n210J5617J7953j980j1127K988J2182m715j7317j824J3916N830r504
291A829l022J4262P841j3453j4092J910N529j0420j5121M693J6748L107p586L057
305d718J5722M869j3877q376Q767N609r276q811J0280J5250l101j0717L433R867
319A4921n350j8413o713R476J661j1822k688J4477J2009o047q081R119R758p713
333D594j2990K722J3582M06j0582K769J4795L998j2517p898O632K755j4738j2355
347a8827O062R530m239q815O567J4748j89j1291n46J0783K927j0924l869J2904
$$ plain form
249 -18908 -19766 -9189 -12329 -26044 -24316 -3182 9142 2517 2138 17411 26229 13797 -1830 2302
263 2302 11823 4239 -8004 -2073 15043 16835 1994 -2219 7453 4729 -14711 -26518 -17520 -7660
277 -7660 -14980 -20190 -4573 13380 11400 273 3261 15443 10728 -6589 -8413 5503 11333 1829
291 1829 -1193 13069 20910 7457 -6635 -4725 804 -9616 -24737 -20044 -3296 -189 -7775 -4718
305 -4718 11004 15873 1996 -6380 2387 7996 -1280 -10091 189 15439 12338 1621 5054 14921
319 14921 9571 -8842 -15555 -6079 -4418 -16240 -18928 -4451 7558 1511 -6570 2549 12307 4594
333 4594 -8396 -5674 7908 8314 -2268 501 15296 19294 6777 -1121 5511 8266 -6472 -18827
347 -18827 -12765 -3235 -7474 -16289 -9722 5026 4837 -6454 -7000 3783 6710 -4214 -8083 4821
361D821R398n788n755Q521R839p666j4061l14O824n465j4036k702J1434L757j0179
376a1372k753J1036P015q589r023P583J0295m696p663O836J4585K320r244J011
390G341J1770Kj3531q361O055L037j1937r327P343Q868m848r867L264J0386k862
405b667j2265m11J1523M580p169m38J4695J0102n717n664O458P482q363j3792
419a646O76P948l516j1352p08J0710K224j1706n661P166K917j0224q242Q270J1701
434a443j819m200R223J4198Q69r620r24R065j158j2538m961Q305N636p847o908
449d122O585O127q659j2831q92O419m119j0559K389J4173O570m097N82J2125O967
464A6658q875p687N372P081n140q358N188J1382j467j0463k297N846k632j5312
$$ plain form
361 4821 14219 8431 2676 11197 21036 13370 -691 -1005 5819 354 -13682 -16384 -4950 -1193 -11372
376 -11372 -14125 -3089 3926 -4663 -13686 -6103 4192 -504 -8167 -1331 13254 15574 6330 7341
390 7341 19111 19113 5582 -2779 3276 6313 -5624 -14951 -7608 1260 -3588 -13455 -10191 195 -2667
405 -2667 -14932 -15343 -3820 760 -6409 -6847 7848 17950 12233 6569 13027 20509 12146 -1646
419 -1646 -970 6978 3462 -7890 -8598 2112 4336 -7370 -13031 -5865 -2948 -13172 -21414 -13144 -1443
434 -1443 -3262 -7462 1761 15959 16828 7208 6284 15349 14191 1653 -3308 4997 10633 2786 -4122
449 -4122 2463 8590 -69 -12900 -13792 -7373 -11492 -22051 -19662 -5489 1081 -3016 -2434 9691 16658
464 16658 7783 96 5468 12549 7409 -949 4239 15621 14154 3691 1394 7240 4608 -10704
478a0704q411N805L697o952l751J0795J2324j548o642N202Q980k433j0191P58
492c071J1889M238o300J50J0294M789j0035j0546J620J951j0855j1922J859Q764
506g175o62p685K982J1651J839r003l518Q152N381o472k621J1145J1847q78n061
521I922M655Q111n675j3534m022M506j794j1188m178Q709M259p298n959N319N795
536b372o850r226M402J0166O57l902N547J4200N376o996j832P076J491j0293q460
551a016M575N545o359p880K963O558l869j1391k526O456j253r633k102J0011P953
566a968l394j043J0919R496l059o830K947P520l424r332Q80Q519J099q918m170
581g58O162P09j1009q577L106M261o147p148N506J0464N11m666L707J0641K425
$$ plain form
478 -10704 -19115 -13310 -9613 -16565 -20316 -9521 2803 1255 -5387 -185 8795 6362 -3829 -3071
492 -3071 8818 13056 6756 6906 17200 21989 11954 1408 3028 4979 -5876 -17798 -15939 -7175
506 -7175 -7837 -15522 -12540 -889 950 -8053 -11571 -3419 1962 -4510 -7131 4014 15861 14983 9922
521 9922 14577 22688 17013 3479 -543 3963 2169 -9019 -13197 -4488 -229 -7527 -13486 -8167 -2372
536 -2372 -9222 -18448 -14046 -3880 -3223 -7125 -1578 12622 17998 11002 9170 16246 17737 7444 -1016
551 -1016 3559 9104 2745 -5135 -2172 4386 517 -10874 -13400 -6944 -8197 -17830 -19932 -9921 -1968
566 -1968 -5362 -6405 4514 14010 10951 4121 7068 14588 11164 1832 2712 11231 12330 3412 -758
581 -758 5404 6113 -4896 -13473 -10367 -6106 -12253 -19401 -13895 -3431 -2920 -7586 -3879 6762 9187
596I187p732j841P966L705n961l523P126O969n192q196J718L845n868j1702k309
611a1808O117o01q202p74R143N792m778l339P811O733n011o031M634Q718l36n972
627B096L343R642M88q809m422M495l41j0901p231M506M567m637n886N104Q426
642D40j921p302J479P428O00p054k83R872N966l451j539P355N876o199r323N71
658B515L464n541r165L45P601J052p376j074O736K001p506n749N501N806l806
673e196l375P113J0534Q53n341K768P398k205r875m232M710J679p102l805O755
688F79N003n422p253J535M403n003q482J574Q110K199l652K216J0509M939n505
703E850l245M646L190o199p075L782O613k051n874J555O007j510j0036m426M019
$$ plain form
596 9187 1455 -386 7580 11285 5324 1801 8927 15896 10704 2508 4226 8071 2203 -9499 -11808
611 -11808 -5691 -6292 -14494 -15268 -6125 -333 -5111 -8450 -639 6094 1083 -4948 -314 8404 8068 2096
627 2096 5439 15081 15569 6760 2338 6833 6492 -4409 -11640 -7134 -2567 -7204 -13090 -7986 440
642 440 -1481 -8783 -7304 124 724 -6330 -6613 3259 9225 5774 4235 11590 17466 11267 1944 2515
658 2515 5979 438 -8727 -8382 -781 271 -7105 -8179 -1443 558 -6948 -12697 -7196 -1390 -5196
673 -5196 -8571 -1458 9076 9929 4588 7356 14754 12549 2674 -1558 3152 4831 -2271 -6076 679
688 679 5682 260 -6993 -5458 -1055 -6058 -14540 -12966 -4856 -2657 -6309 -4093 6416 11355 5850
703 5850 2605 7251 10441 4242 -2833 949 7562 5511 -363 1192 7199 5689 -4347 -8773 -4754
718d754J09o963l195P249P570k054k963N926O943k082p125N06P010l56o580M54
734c05Q180L609n975m238M088J900q118q199J197N056k909n740L580Q771J084
749A981n533p14O684J736o842l002O320N265k610l314N181O887l112p324m27L842
765E018k562q962k240O137K191m930j850N992M813m548n632L376N286k695n444
780f050K739Q521J274n013P22O649J240p395m825L599K238o309n377L834O092
795A939k107n563K115O213j332o908j273N960K327n047j153P549N235k969l644
810A342L186M790m330p367M0M560j088o197o82O688K140n598l006M309K958n217
826c472n324L935N960j452l373L572P832J004o158q38N114Qp084m011M542L414
$$ plain form
718 -4754 -4645 -11608 -14803 -7554 16 -2038 -5001 925 7868 5786 -1339 -833 6177 5821 -759 -305
734 -305 7875 11484 5509 1271 5359 7259 -859 -9058 -7861 -2805 -5714 -11454 -7874 897 1981
749 1981 -3552 -4266 2418 4154 -2688 -5690 630 5895 3285 -29 5152 12039 8927 1603 1176 5018
765 5018 2456 -6506 -8746 -2609 -418 -5348 -7198 -1206 3607 -941 -6573 -3197 2089 -606 -6050
780 -6050 -3311 5210 6484 1471 2193 8842 10082 2687 -2138 1461 3699 -2610 -7987 -4153 1939
795 1939 -168 -5731 -3616 2597 1265 -5643 -6916 -956 1371 -3676 -4829 2720 7955 4986 1342
810 1342 4528 9318 4988 -2379 -2339 2221 1133 -5064 -5746 942 3082 -2516 -5522 -1213 1745 -3472
826 -3472 -8796 -4861 1099 -353 -3726 -154 7678 8682 2524 1686 6800 6808 -276 -4287 255 3669
842C669m768l709M326M763l378o618L89M785k046o312N29O906L625l246o27P045
858E333L919m431m598K375L619l701n950J923O159j51n389p47N010j65p498l700
874g992L350K295l909l437N551P190r13l630K797N661j195o636j137N606J038
889D639m745j218N908L960m844n074K350K157n174o810P28N538k51m361J997P173
905A973K370m742k316M544K431m989l408M293N769j428m021K879N612k105p057
920a95k007K848n06o598k438N521L829l087k448M188M713l160n616J794M709l90
936A157m224J507P145K457m304j575M200J243o342n699K227K873l492m105K459
951d473O035p81m978J97M800j54n513j887N470M017k893j351N501N198k261m795
$$ plain form
842 3669 -1099 -4808 -482 4281 903 -5715 -5326 -541 -2587 -8899 -8370 -1464 2161 -1085 -1712 5333
858 5333 9252 4821 223 2598 6217 2516 -3434 -1511 4648 4497 -892 -1639 3371 3206 -4292 -7992
874 -7992 -4642 -2347 -6256 -9693 -4142 3048 2135 -1495 1302 6963 5768 -868 -2005 3601 4639
889 4639 -106 -1324 4584 8544 3700 -1374 976 3133 -2041 -8851 -8123 -2585 -2836 -7197 -5200 1973
905 1973 4343 -399 -2715 1829 4260 -729 -4137 156 5925 4497 476 3355 8967 6862 -195
920 -195 -2202 646 140 -6458 -8896 -3375 454 -2633 -5081 -893 3820 660 -4956 -3162 1547 1157
936 1157 -3067 -1560 5585 8042 3738 2163 6363 7606 1264 -4435 -2208 665 -2827 -6932 -4473
951 -4473 1562 781 -4197 -4000 800 646 -4867 -6754 -1284 2733 -160 -1511 3990 9188 6927 2132
967B132Q13L461k991o375r95M604P36m704j510M709K313m746l948K331L547k935
983c558m232L414O294R95k906J451O321Q92n481k546L613J214m832l839L500L852
999D152l048m617J479L605k275o496n63M516ll696j44O394M521k666j697M554
1015D016L717l105m581J405M292j265n011Q19M951K79n175k915L047M07n775m155
1031i049K648L811j914l172L787O239l5l817R00M935M02m871j024N078K536l073
1047C381k215L629L553m192n628L58K220k969n749j11M669J048l532N6N046K872
1063B436l781k787L792L043k254k912L324N648J9l619Q41L962r28o102l303K384
1079b37Q09m843k562L603L684k183l681K162M073j865m559N59M827J303k993Q77
$$ plain form
967 2132 2945 6406 3415 -2960 -3955 649 1385 -3319 -4829 -120 2193 -2553 -6501 -4170 -623 -3558
983 -3558 -7790 -4376 1918 2913 7 1458 7779 8671 3190 644 4257 5471 639 -3200 300 4152
999 4152 1104 -3513 -2034 1571 -704 -7200 -7763 -3247 -3250 -6946 -7090 -696 3825 1159 -538 4016
1015 4016 7733 4628 47 1452 5744 4479 -532 287 5238 5517 342 -2573 474 881 -4894 -9049
1031 -9049 -6401 -2590 -4504 -7676 -3889 2350 2315 -1502 -602 4333 4735 -136 -1160 3918 6454 3381
1047 3381 1166 4795 8348 4156 -1472 -1114 1106 -1863 -7612 -7723 -3054 -2006 -5538 -5482 -436 2436
1063 2436 -1345 -4132 -340 2703 449 -2463 861 6509 6528 2909 3750 7712 6784 682 -2621 -237
1079 -237 572 -4271 -6833 -3230 454 -1729 -5410 -3248 825 -1040 -5599 -5040 -213 1090 -1903 -1026
1095a026O147L012l285k326K658J953m633n339J351K922j548l933P82M773k97
1110A211m950j533L177O84l842k053M528M510j414j244L640M777r13m810nL259
1126E022j215m777j368M194J911l797k453L120J765m327m833J055L188j452l352
1141g319K363N767J937k800J78M830J115m000k659K826K617k707l045K809L624
1156E536j716m332l38K441j917n806j381L476J357k284q84M671L986k094k578
1171a863K377L562j703l712J210M521N50l190J52L785R68m779l642J724Q14m028
1187c254m030J941M002q10l229J990M283o4l688o62M209J437l018r40M780L388
1203F335j960k445K364K985l202m858m89K465j241m435n55L827J504l225j449
$$ plain form
1095 -1026 5121 8133 4848 2522 5180 7133 2500 -2839 -1488 1434 -114 -4047 -3265 1508 1211
1110 1211 -3739 -5272 -2095 -1411 -5253 -7306 -2778 1732 318 -926 2714 7491 6578 1768 1763 5022
1126 5022 3807 -970 -2338 1856 3767 -30 -2483 637 2402 -1925 -6758 -5703 -2515 -3967 -7319
1141 -7319 -4956 811 2748 -52 126 4956 6071 2071 -588 2238 4855 2148 -897 1912 5536
1156 5536 3820 -512 -850 1591 -326 -6132 -7513 -4037 -2680 -4964 -5848 -1177 2809 715 -1863
1171 -1863 514 4076 2373 -1339 -129 4392 4942 1752 1904 5689 6657 1878 -1764 -40 774 -3254
1187 -3254 -7284 -5343 -1341 -2151 -5380 -3390 893 829 -2859 -3521 688 2125 -893 -1833 2947 6335
1203 6335 4375 1930 4294 7279 4077 -781 -1270 1195 -46 -4481 -5036 -1209 295 -2930 -4379
1218d379K940K148l273k856K675L467p46k023K197N077O18l540r1K817M28m627
1234H32k924K546J816l350k617K288L244j629m091M10K984j044l822r5M141K506
1250A195k279k12M373K820k529k772J549K566k743l788J063L285j69l607j19L304
1266A937m6m324k173K069J498k790k223L289M371o84j943J816L922n76m138m43
1282d38L089K78l246j212L499K378k795k724J650J915l085m471M89L214p20k575
1298d754J121M573J895k748r50L136J346l059k638K271L300j393k577J842L419
1313D784j019l811j346K083n51m500j407K875K225j881j079L141L210j714k791
1328a781O93K818n42k945P95M167J017k215o73K727J062l764l502Q54J683k409
$$ plain form
1218 -4379 -1439 709 -2564 -5420 -2745 722 -24 -2047 150 5227 5845 2305 2214 5031 5459 832
1234 832 -2092 454 2270 -1080 -3697 -1409 1835 206 -3885 -3475 -491 -1535 -5357 -5452 -1311 1195
1250 1195 -1084 -1296 3077 5897 3368 596 2145 4711 1968 -1820 -757 2528 2359 -1248 -1367 1937
1266 1937 1891 -2433 -4606 -2537 -1039 -3829 -6052 -2763 1608 924 -1019 797 4719 4143 5 -438
1282 -438 2651 2929 -317 -1529 1970 4348 1553 -1171 479 2394 -691 -5162 -4673 -1459 -2179 -4754
1298 -4754 -3633 940 2835 87 -863 2273 3619 560 -2078 193 3493 2100 -477 1365 4784
1313 4784 3765 -46 -1392 691 140 -4360 -5767 -2892 -667 -2548 -3627 -486 2724 1010 -1781
1328 -1781 -1088 1730 1188 -1757 -962 3205 4222 2007 1334 4061 5123 1359 -2143 -1289 394 -2015
1344b015l177J641L998k55k925L72L347J63l587j495L297K047k152r08L417L665
1360E433j464k780J130K371k161m024q43K647J88l223l57L366J352k740k240J657
1376a688K191k596k611J767L605M33j798J135L852M78k978j556K026J014l497
1391b23k503K440K465j642k475J268K744j385l878k59K528p7k680l34L930K530
1407B449j952r46K608K346k233l202J048K441j310k993O67L132O26l125r59K279
1423H76L64l272k445J899K117j303k071K636L590m6k558K37L199l35l438r45K701
1440A206J463k352j606K582K102k115l087O48K108j755l729L07L578N55k275P9
1456b291L691K004k712j582K079J686k119k564J759L203m91k503O64K331l95l658
$$ plain form
1344 -2015 -5192 -3551 447 192 -2733 -2361 986 1149 -2438 -3933 -636 1411 -741 -1649 1768 5433
1360 5433 3969 1189 2319 4690 2529 -1495 -2338 309 497 -2726 -3083 283 1635 -1105 -3345 -1688
1376 -1688 503 -2093 -4704 -2937 668 1101 -697 438 4290 4768 1790 234 2260 3274 -223
1391 -223 -2726 -286 2179 537 -1938 -670 2074 689 -3189 -3448 -920 -997 -3677 -4011 -81 2449
1407 2449 497 -449 2159 4505 2272 -930 118 2559 1249 -1744 -1077 2055 2681 -444 -1403 876
1423 876 1240 -2032 -4477 -2578 -461 -1764 -3835 -1199 2391 2345 -213 24 3223 2888 -550 -1495 1206
1440 1206 2669 317 -1289 1293 3395 1280 -1807 -1159 949 -806 -4535 -4228 -650 -95 -2370 -2291
1456 -2291 1400 3404 692 -890 1189 2875 756 -1808 -49 3154 2663 160 824 3155 2760 -898
1472h98j910J968L65k852j375K352K745j216j731K189K481q90k697R1K915L34
1488A871k368J05L380J467k102j604J568J098k940l300N53J900j058k655J091
1503b994L151M32k492l83K288J079k669j396K450K564j152j114K297L121r76l056
1519A150J6J622j122l501j109K648R06k373r04K042J973k027k823J087J909q90
1535a396k147J180L524J421j915J93L010P59k637k125J200J296k304k339J709
1550e71K510q10k590Q4K210p00l520q09K279R53j831m12L375K535j236j311J642
1567A798K162j738k948M69K516m84k307o3K827N45l046j522J328O14k510k387
1583d746J404K504k20j557J653L076L65k241n27K266M43k411j085K385J909j422
$$ plain form
1472 -898 -2808 -840 -475 -3327 -4702 -2350 395 -821 -2552 -363 2118 1228 -1469 -1378 1537 1871
1488 1871 -497 -392 2988 4455 2353 749 2317 3415 475 -2825 -2272 -372 -1430 -4085 -2994
1503 -2994 157 589 -1903 -2286 2 1081 -1588 -2984 -534 2030 878 -236 2061 5182 4206 1150
1519 1150 1166 2788 1666 -1835 -2944 -296 610 -1763 -2667 -625 1348 -679 -3502 -2415 -506 -1396
1535 -1396 -3543 -2363 1161 2582 667 860 3870 4629 1992 -133 1067 2363 59 -2280 -571
1550 -571 1939 1129 -1461 -1377 833 133 -3387 -4196 -1917 -964 -2795 -3207 168 2703 1467 156 1798
1567 1798 3960 2222 -726 -257 2259 1775 -532 -595 2232 2777 -269 -1791 -463 151 -2359 -4746
1583 -4746 -3342 -838 -1058 -2615 -962 2114 2479 238 -289 1977 2420 9 -1076 1309 3218 1796
1599A796j874J561J785j854l146o36J954p35k825l9K860J292j579o68K615J783
1615B290k007j931J725K003p80k036J470L076p9k365n49J731o9l452k045J715
1631a303Q27j956j627K035K561r94k080J089K277m62k361J07K712J164j575q3
1647C31K637J693j856k215J117J081k007k851J07K136l41k426K09K179P14k509
1663b001j233K078R63j747j093K201K801j57j528J492K300l93k735n96J806k11
1679A947k638j213K245J309k138j566J235J467j809k550N31J925rj679N57L064
1695F78J639j745l00K081R93j890j747J168J789j405j911R79K013l56k780o77
1711a471J794n65k553j330J898J383j099q70K476K314p13j828P39K194o72k457
$$ plain form
1599 1796 -78 1483 3268 1414 -1732 -2368 -414 -1149 -3974 -4013 -1153 139 -1440 -2108 507 2290
1615 2290 283 -1648 77 2080 1300 -736 734 3810 3731 1366 817 2548 2479 -973 -3018 -1303
1631 -1303 -476 -2432 -4059 -2024 537 -457 -2537 -1448 829 367 -1994 -1887 825 1989 414 331
1647 331 2968 4661 2805 590 1707 2788 781 -2070 -1963 173 -168 -2594 -2385 -206 508 -2001
1663 -2001 -3234 -1156 -193 -1940 -3033 -832 1969 1812 284 1776 4076 3683 948 352 2158 1947
1679 1947 -691 -1904 341 1650 -488 -2054 -819 648 -1161 -3711 -3180 -1255 -1264 -2943 -2386 678
1695 678 2317 572 272 2353 3346 1456 -291 877 2666 1261 -650 329 2342 1986 -794 -1471
1711 -1471 323 -242 -2795 -4125 -2227 -844 -1943 -2813 -337 1977 1264 -564 175 2369 1697 -760
1727g60L81K527L68j801o44K199O37k297k118O23J027j700k248J162K159N8j448
1744a875N85K437L85k114r06J939R15j379q99J828K237q48j591N75J509j190k868
1761a260o67J539j42j946k39K069J539j603j096J420J454j246k147J085K178J02
1777A040j491Q70K543K76j724j148J261M12k495j926J309J513j145j530J011K289
1793A065q03k158N9J660J58k046k32K494J461q33p50J965J467j368k097M71J136
1810A649q88k140j4K012K25j790n96J606M56j879j732J420J298j006j035J467
1826i47K410K16j455O21J802j55k136q02J504P01j746j043J762J207j289j967
1842a317N35J187r45k514K18J747O51j456O5K633J237j618q85J275J212j067j886
$$ plain form
1727 -760 -379 2148 2516 715 71 2270 2907 610 -1508 -885 142 -1558 -3806 -2644 -485 -427 -1875
1744 -1875 -1290 1147 1532 -582 -1488 451 1366 -13 -912 916 3153 2305 714 1289 2798 1608 -1260
1761 -1260 -1927 -388 -530 -2476 -2715 -646 893 -710 -1806 -386 1068 -178 -2325 -1240 938 1040
1777 1040 -451 419 2962 3238 1514 366 1627 2039 -456 -2382 -1073 440 -705 -2235 -1224 1065
1793 1065 262 -1896 -1837 -177 -19 -2065 -2297 197 1658 825 75 2040 3507 2139 42 513 1649
1810 1649 761 -1379 -1393 619 844 -946 -1542 64 520 -1359 -3091 -1671 -373 -1379 -2414 -947
1826 -947 1463 1679 224 845 2647 2492 356 -446 1058 1759 13 -1030 732 1939 650 -1317
1842 -1317 -782 405 -540 -3054 -2836 -1089 -438 -1894 -1829 804 2041 423 -462 813 2025 958 -928
1859i28Q86K017n09j442K79J871j64k457q76J234L2j953j115J758J630q54j091
1876a682J270J754l93j861J47J714J85j793r4K103J182j468j166J553Q56j873
1892D34k013L89J400p24j903P29K044K77j499l88J925N33j985q94J414J434r41
1909B32j141J452J922n01j684l5J435m22k423p48J746M25j566m83J621J369j197
1926Bj504J007J140p52j492M54K040L90j455K60K055M43j747j288R82P29j670
1943d06j553R96J649o17j465L93J911m35j898l38J347P24j382n17J849J777q04
1960A231j035R99J458j121k110Q9J453l41j937R1J787N63j623j157J457P77j684
1977a103j490J021J481k16j140R66K253J70j450L3J295Jj736r83J350J220j245
$$ plain form
1859 -928 -42 1975 1466 24 303 2174 2010 -447 -1323 -89 -57 -2010 -3125 -1367 263 -591 -1682
1876 -1682 -412 1342 949 -912 -765 949 1134 -659 -753 1350 2532 1064 -102 1451 2307 434
1892 434 -1579 -1190 210 -514 -2417 -1688 356 633 -866 -1254 671 1204 -781 -1675 -261 1173 232
1909 232 -909 543 2465 1964 280 245 1680 1258 -1165 -1913 -167 258 -1308 -1791 -170 1199 2
1926 2 -1502 -495 645 -107 -1599 -1145 895 1285 -170 90 2145 2588 841 -447 535 1264 -406
1943 -406 -1959 -963 686 69 -1396 -1003 908 473 -1425 -1763 -416 308 -1074 -1591 258 2035 1231
1960 1231 196 1195 2653 1532 -578 -489 964 623 -1314 -1223 564 1127 -496 -1653 -196 581 -1103
1977 -1103 -2593 -1572 -91 -307 -1447 -481 1772 1942 492 525 1820 1821 85 -898 452 1672 427
1994D27j207J197J047r32j776j64J368o25j819Q2J725R24j088l50J869J255j259
2011F74j092P09J277q31j456Q17J502J50j420m85J751k38k029j208J002N88j259
2028a548j027J269J726m29r19M66J618j54j788J3J550M46j241k49J523J251j259
2045A248j338O61P65j146j999L03J352m17j170L09J468O69j366p25J211J105j458
2062e28r14J282J658o68r15Q25J601m75j716m40J231j80k056m03J140J072j274
2079g60r17J181J358r82j612N63J376o3j429M35K008N68j087j51J145O72j703
2096F02j288P59P43q53j407M97J599k15j512j87J370j1j576p25J420J097j132
2113h19k10J511J442k03j470P52J020n46j800j25J458%j415n85J622K92j385j080
$$ plain form
1994 427 -780 417 1464 532 -1244 -1408 -40 -665 -2484 -2402 -677 247 -841 -1191 678 1933 674
2011 674 -418 291 1568 737 -719 98 1600 1750 330 -155 1596 1358 -671 -1879 -877 -289 -1548
2028 -1548 -2575 -1306 420 -9 -928 -462 1156 1002 -786 -773 777 1223 -18 -267 1256 2507 1248
2045 1248 -90 571 1336 190 -1809 -1506 -154 -571 -1741 -1432 36 705 -661 -1386 -175 930 -528
2062 -528 -1442 -160 1498 830 -85 740 2341 1866 150 -290 941 761 -1295 -1698 -558 514 -760
2079 -760 -1677 -496 862 -120 -1732 -1169 207 144 -1285 -850 1158 1726 639 488 1633 2305 602
2096 602 -686 73 816 -37 -1444 -947 652 437 -1075 -1262 108 97 -1479 -2204 -784 313 -819
2113 -819 -1029 482 1924 1721 251 1003 2023 1477 -323 -448 1010 1010 -405 -990 632 924 -461 -1541
2131a541N22Q66r53j476Q18J594P4r43P35J606M02j250l35J047M94j208q70J054
2149F36J075p21j145M59J027p72j882m20J297j64j411l58J634J160r48o23J396
2166B40R49p42j174N36J623m45j007M23J557J74j414o81J063Pj759q94M03Q27
2184c14o55j092R64J426m38j277L46J258K83j567J95J331Q21n64p00J491R08j060
2202A356j247K67O19n36j638m9J385p9j137p8J098K93j162q96J066P99p43n91
2220a273P99J617J7j028O71J222j49j489p25J156R0j542l47J021P44r06q19L78
2238e63J006q69j209n6J328N2p57R9J650O04o09n34Q40Q20j056j200N20J056n94
2257E28r25J2J325l46j102n92O86M69j405p81J181R35l54n80J009J369m61j024
$$ plain form
2131 -1541 -1019 -153 -1106 -2582 -1764 -170 -96 -1039 -304 1302 1704 454 119 1166 1660 452 -418 636
2149 636 1711 990 -155 304 1331 559 -1323 -1743 -446 -610 -2021 -2379 -745 415 -533 -1156 240
2166 240 1189 447 -727 -191 1432 987 -20 403 1960 2134 720 39 1102 1109 -650 -1544 -1141 -314
2184 -314 -969 -2061 -1097 329 -109 -1386 -1040 218 501 -1066 -871 460 1281 717 17 1508 2416 1356
2202 1356 109 376 995 459 -1179 -1228 157 78 -1059 -1137 -39 254 -908 -1804 -738 61 -682 -1273
2220 -1273 -474 1143 1160 132 803 2025 1876 387 -338 818 908 -634 -981 40 784 -122 -941 -563
2238 -563 443 -426 -1635 -1691 -363 -311 -1068 -969 681 1285 676 142 982 1802 746 -454 66 1122 528
2257 528 -397 -385 940 594 -508 -1100 -414 55 -1350 -2131 -950 -15 -369 -949 60 1429 968 -56
2275e6K42J151k75j185j42J239L78j052n73Q11N97j180j121J58P34p82r30L71
2293a615J484K26q45j25J663J75j028l15Q16P29n79r19J192P99k33j192J45O46
2311A024m86j515m75R64K87j061l41R55J102p68r07Q37R03m47j036N72J283P5
2329I66q91J73J273L75j130p01O18L03j228j107O58R01o14q54M54R06j02r69l27
2348a296J039L52q27k89J101R54l59o13R00R17p10j041OP34l57j245j83J210K34
2367E27q59n69O79N12r86j008Q58P27j73p24O87J306L7r85oJ154M3j158o54J003
2387D11O27r57o86P13P28n40j208L09P39n48r01j53J171M37p28j21J193O95p49
2406D32p39P85O16o90r00L27R90Kj149J87Q49j30j099p17Q53L69r23o66R84R50
$$ plain form
2275 -56 186 1337 1062 -123 -265 974 1352 300 -273 538 1135 -45 -1166 -1008 -274 -1056 -1986 -1615
2293 -1615 -131 95 -750 -875 788 963 -65 -380 436 1165 586 -333 859 1658 1425 233 378 1024
2311 1024 538 -977 -1452 -488 -201 -1262 -1603 -648 454 -314 -1221 -384 519 72 -964 -392 891 966
2329 966 75 248 1521 1896 766 65 683 986 -242 -1349 -691 210 -404 -1258 -804 102 0 -969 -1296
2348 -1296 -257 95 -732 -1021 80 1034 675 62 962 1879 1169 128 134 868 511 -734 -917 293 527
2367 527 -332 -901 -222 290 -696 -1704 -846 -119 -292 -1016 -329 977 1014 29 23 1177 1220 62 -592 411
2387 411 1038 81 -605 108 836 296 -912 -603 136 -412 -1313 -1466 -295 142 -586 -707 486 1181 432
2406 432 -307 478 1094 404 -496 -169 821 823 -326 -139 710 580 -519 -1236 -383 -14 -937 -1603 -619 331
2426C31k18o67M72J121k66j221K04Q78K53r21l33R61Q67r32p33N40M09q49r65
2445a069M5R54l45q80J99J106M69q83j60R06L81q96m77Q33Q10m59o32O73Q34l48
2465A061j008r5O46j52j260m18Q62O05j022l89P06P64n27p93K88R68q8j011L62
2484e01J305K18p43q1R84M46j086q32N63M50p30r99L54R25k39q59J17Q41J25j239
2504i81k51R59M33n55l52O86J182n36n16M54P91m06j188kJ056l65r95O4Q12L23
2524F13q95m69K82N65p17o56M58R45j32n73K08J083L74r03j98O20L85r60o01P10
2544A39O43n43q16M31Q85l82j289J60O16l3p92k53J067O59p67j99Q26P15n51p52
2564b36K12Q53l19p20L4R26J40j040j27P40P8j120n88O05M26n84m39M79J025r0
$$ plain form
2426 331 113 -554 -82 1039 773 -448 -244 634 887 -34 -367 594 1461 529 -204 336 745 -104 -1069
2445 -1069 -1024 -70 -415 -1295 -1096 10 479 -404 -564 342 723 -173 -650 183 993 534 -98 575 1409 1061
2465 1061 53 -42 604 452 -808 -1226 -364 241 -781 -1170 -464 300 -227 -1020 -732 236 148 -863 -501
2484 -501 804 1022 279 198 1182 1628 542 -290 273 723 -7 -1006 -652 273 34 -825 -708 133 258 -981
2504 -981 -1232 -273 160 -395 -747 -61 1121 585 69 523 1314 908 -280 -282 774 409 -586 -522 290 613
2524 613 -282 -751 -469 96 -621 -1277 -819 126 -6 -579 -371 712 1086 183 -15 605 990 30 -571 139
2544 139 782 239 -577 -146 739 357 -932 -772 -156 -189 -981 -1234 -167 492 -275 -474 352 1067 516 -236
2564 -236 -24 829 510 -210 -176 750 890 -150 -277 463 541 -579 -1167 -562 -136 -720 -1159 -680 345 255
2584B55r50N14J031l56n95l59R44L41n71m46Q92M17p49m42J40M22m35j251J39
2603a059Q32j37p47J27R75N07q22l24N96N76n27l46N06O32l2n57L18P03L3j180
2623G4k68M64J4p13n46N11O14o44n76P60O80m94p32m3J095j3p57K80Q76M53m90
2644E45m64Q57L28r47n70K56N55n26q59K54P63j9r05JM76K76o10o88R74L48k23
2665a78l16P23P35j64o49L69M79k02q23k52P71L3n93l67O22L00o58o73K52N52
2685c9m47q01L09J046J16o34K84O82L00p30j56M97N25p54m47L93O96m29n89J56
2705b2N07j95q42k15M55J57n53k33O55O26m42k45M81O55m21o55K62O61Rp95O6
2726h4P31K87q69m20N43K69p18o39L48N27m10m29K98O18R9o27J15P29P4q23j64
$$ plain form
2584 255 -695 -181 850 494 -101 -460 484 825 254 -192 700 1117 368 -74 66 488 53 -1198 -1059
2603 -1059 -227 -364 -1111 -984 -9 498 -324 -648 -52 524 -3 -349 157 789 757 200 518 1221 1254 74
2623 74 -194 270 284 -429 -975 -464 150 -494 -1070 -310 370 -124 -856 -899 196 183 -574 -294 582 1035 545
2644 545 81 938 1266 319 -251 5 560 34 -825 -571 192 173 -732 -731 -255 21 -589 -1277 -303 45 -178
2665 -178 -494 229 964 800 151 520 999 797 -26 -278 493 526 -67 -434 188 488 -170 -843 -591 -39
2685 -39 -486 -1287 -978 68 184 -450 -166 516 816 86 -70 427 952 198 -249 144 840 411 -178 -22
2705 -22 485 290 -552 -767 -312 -155 -708 -941 -286 340 -102 -347 134 789 368 -287 -25 636 645 -150 -84
2726 -84 647 934 65 -355 188 457 -261 -900 -552 -25 -435 -864 -566 52 151 -476 -361 368 442 -381 -545
2747e45J020M09n92l01O68L63m66p63j8N12j85q63j12O36K55n93j76O27K38m22
2767c08l44N03L57j22n52M75Q14j6m03o7O00j04q30m07M14K47m80m63L99N22m37
2788b02n66K10N12n4p71J25N80L87m71j19R13N25o28l55M57M66m23p54P7O60j60
2809D09p61OM99J92r17k30M26L33p17k65O49N00k35l83N63Q71m66n38J80M33J25
2830F74p80r9N86M30o90l44K70M94p11n33J75M81j40q35L83P77J02m30k03O99
2850C06L64o14k96N19M99n05m68L68O54k41n34J7K83j78o11l29M83K47l05m03
2870g44N55N10k66n15L69N30l16m60P2O36K12o98P1P22m9n03l61L30K81n16q57
2891i97P19K76j41n18L10N95L5n51k79P15M5m04k10N06P05l21n22N50K49k60q22
$$ plain form
2747 -545 475 884 292 -9 659 1022 556 -207 -225 287 102 -761 -873 -237 18 -575 -751 -124 114 -308
2767 -308 -652 -149 208 86 -466 9 823 807 404 337 937 833 3 -404 10 257 -223 -686 -287 235 -202
2788 -202 -768 -558 -46 -100 -871 -746 -166 221 -250 -369 544 1069 441 86 543 1009 586 -168 -91 569 409
2809 409 -352 -346 153 345 -572 -802 -376 -43 -760 -1025 -376 124 -111 -494 69 940 474 -64 116 549 674
2830 674 -106 -205 381 811 121 -223 47 541 -170 -703 -528 -47 -187 -1022 -639 138 240 -190 -393 306
2850 306 670 56 -240 279 778 273 -195 173 827 586 52 69 352 174 -437 -766 -283 -36 -341 -744
2870 -744 -189 321 55 -460 -91 439 123 -337 -265 371 583 -115 -44 678 629 126 -235 95 376 -140 -997
2891 -997 -278 -2 -143 -661 -351 244 279 -272 -551 164 209 -195 -405 101 806 485 -37 513 762 502 -320
2912c20O3L61j20n81L6M73L39n08n12O61K76l17m21J62Q04k34l47K06N06J35l92
2933B70n2M22M4o25m33M68K11l85m64J28Q55o46m03J22J99J11m94k33Q12J87j64
2954g0o8N68M24m44l84L09M78m99k82m0N35l01m80L05J69J34o12m96L78L22m49
2975e03l64L86N96P0m57J88N90k52j59n6L78J55m34j90M89K77n61k87J61K99m13
2996h7n27R0M78r7n23j8P47nj45j71L10N30n94m01N32L66k13k83K24M61k7o90
3018d3l5K92k9o31j89N14K17m49M1Q4N29k46m19J82M56Mm62M8M73Q6j92k17L77
3041C91K47m03m62J61M10l92m35M8M94M8m49Q4L56P0n03j27N43K56l00l53O09
3062B93L50j96l99K05L78l87n14n9M89n9n11o9L50K62l96l82L72M72l63k13jO80
$$ plain form
2912 -320 -257 104 -16 -597 -561 -88 251 -257 -769 -108 168 -149 -570 -408 396 162 -185 21 527 662 270
2933 270 218 640 684 59 -374 94 305 -80 -544 -416 439 -207 -610 -488 -289 -178 -672 -905 -93 94 -70
2954 -70 -138 430 854 410 26 335 813 314 32 -8 527 226 -254 51 220 354 -258 -754 -376 -54 -503
2975 -503 -867 -481 115 185 -272 -84 506 254 95 39 417 572 138 -52 437 714 153 -134 27 326 -87
2996 -87 -614 -524 -46 -143 -666 -684 63 58 -87 -258 52 582 -12 -413 119 485 272 -11 213 674 647 -43
3018 -43 -78 214 185 -446 -635 -121 96 -353 -312 -228 301 55 -364 -182 274 278 -184 -136 337 423 231 14 391
3041 391 638 235 -227 -66 344 -48 -483 -435 59 107 -342 -258 98 168 -335 -462 81 337 37 -316 293
3062 293 643 447 48 253 631 244 -270 -329 160 101 -410 -479 -129 133 -263 -645 -273 199 -164 -377 -378 302
3084C02nm67J56O42K9m93j04M37K3l67m93L43L62m50j75J0N13k61l98k17N78p6
3106a11m28r8N02L49k77M4J29M67m31n9K6L20j54k62M5M32j38l29k20K44J01m01
3128b49l36L19K10l03l14L09M61J10m20O4M81J02n12m3L78K92l43j24K42L38l71
3149B91m79K30K8j03l71m5M80L4m45j01M67J09k23k91L96M49l14k34L04K00l3
3170C49l97J98M83q8m68l93L86J23m43k97L41L99m28k34K94K84j29l47P7N47M5
3191C02l96m5M63J27k91o7J4L12l91k18J49M07l80m44J97M43j06k48k09M58J50
3212B27n46k8K46L34r8k46J64M83j50k81j13L76o0m54J4J48K25l95k45L01J48
3233E0j76l31L03K87k18l73J78M31J76k91j45N73O4l66k33K25K13k79k75K47J58
$$ plain form
3084 302 297 -170 -14 628 657 164 60 497 520 153 -340 3 365 -85 -260 -250 263 2 -396 -613 -35 -111
3106 -111 -539 -637 -135 214 -63 -19 110 577 146 87 113 433 279 17 62 494 356 27 -193 51 152 -249
3128 -249 -585 -266 -56 -359 -673 -364 97 207 -213 -149 332 434 -78 -121 257 549 206 82 324 662 291
3149 291 -188 42 70 -33 -404 -449 31 65 -380 -481 -14 95 -128 -419 -23 426 112 -122 182 382 349
3170 349 -48 150 633 545 77 -316 70 193 -250 -547 -206 193 -235 -469 -175 109 -20 -367 -290 257 302
3191 302 -94 -139 324 451 160 93 107 419 28 -190 -41 366 -14 -458 -261 182 76 -172 -381 77 227
3212 227 -319 -347 -101 233 135 -111 53 536 386 105 -8 368 308 -146 -132 16 241 -154 -399 -98 50
3233 50 -126 -457 -154 133 -85 -458 -280 151 327 36 -109 464 528 162 -71 154 367 88 -187 60 218
3254B18j52k34N3K81j00l32l27N27O9m99N1M36K51j73l35L85L06l42j45K28K90
3275D56j06k90j24K75K09k67l81K00J84m34k92K17K91j42j54K31J28M3j79Q5K83
3296B33p8l60N4L98J72k06j08J58J11k17k93R6K49k60l29J19K51N3l09k37M39
3317f4J41k31j57J94K12k9j30O3L17J1l20L4K98n6n8k83J62J89l73l89M42K22
3339A95k62l8j14L11j01l44J49L32m4m2k14M27K14l18k30J38R7L7l18O4J84Rl43
3362b11J08J85M9l53j01K65R7j97l35L49K54P2l95K87K90j56k65l1K11J00m81
3383b58R5K09K13l94m4J77J40k99p2k01K98P1k23K19K44oj36r6K89J30j20m96
3405b60L50K67j60m25J73M95k45l04q5K77k24m2l14L84l2j3j63J43M00k71N1j19
$$ plain form
3254 218 66 -168 -115 166 66 -266 -593 -66 3 -496 -445 -9 242 69 -266 119 425 83 -62 166 456
3275 456 350 60 -64 211 420 153 -228 -28 156 -278 -570 -353 -62 -204 -358 -127 1 44 -135 -50 233
3296 233 155 -205 -151 247 419 213 105 263 374 157 -136 -40 209 -51 -380 -261 -10 43 -266 -503 -64
3317 -64 77 -154 -311 -117 95 66 -64 -1 316 327 7 41 339 283 225 -58 104 293 -80 -469 -27 195
3339 195 -67 -105 -219 92 -9 -353 -204 128 84 42 -172 255 469 151 -79 59 156 193 -125 -61 123 132 -211
3362 -211 -103 82 131 -222 -323 -58 39 -158 -493 -144 110 182 -213 74 364 208 -57 -88 123 223 -258
3383 -258 -163 46 259 -135 -179 -2 138 -161 -233 -434 -136 -65 -288 -69 175 169 33 -63 226 356 236 -260
3405 -260 90 357 197 -228 -55 440 195 -109 -194 83 -141 -183 -497 -113 -145 -158 -321 -178 222 -49 2 -117
3427a17L48L6k54q2L90l9l28q4L99J30l07k82K5L77l25l01L05J90j23k95Q6K91
3449D0J01l24j06K90J27m0j28K52J45j1l29M7K86p2n04K05Q3o7j20k02K77J14
3471F4j47k00J68K58k53k83J78L09J4j48q6N71j30k91Q4J21l7j69k42J40K73k36
3493d2j42J18J73j25j53j26L57r8k81Q8L54j5j36j17K39J36j7k58Q9Q2o4l22O0
3516b00K83n9k73J06K15Kk65k0J26l0Q4l05J55L62r8k6j59M04o7j44j91K39K09
3539C48n87K64pL30j19k35m8K7j29k18K87LJ0Nk39L41J93l24j03L49R4o4l29J17
3563c4K90P4n89K51J52l5k34j07K14n8j10j95K17J46k08k23L97J81L0j56QJ20
3585A31Q8k79Q3J74R6r1m0J8m4j8m28K61J63j84k51j06M07%j92n8M04j16j28k35
$$ plain form
3427 -117 231 267 13 -69 321 282 -46 -130 269 399 92 -190 -165 212 -113 -414 -109 81 -42 -337 -251 40
3449 40 141 -183 -289 1 128 88 -40 212 357 346 17 64 350 278 -226 -21 62 -5 -125 -327 -50 64
3471 64 -83 -283 -115 143 -110 -393 -215 94 108 -40 -126 445 315 24 108 229 192 23 -219 -79 194 -42
3493 -42 -184 -66 107 -18 -171 -297 60 -38 -319 -231 123 108 -28 -145 94 230 213 -45 44 126 62 -260 -200
3516 -200 83 24 -249 -143 72 74 -191 -211 -85 -115 -31 -336 -181 181 83 57 -102 302 235 91 -100 139 348
3539 348 -239 25 18 348 229 -6 -54 -27 -156 -374 -87 -84 -74 -69 -308 33 226 -98 -201 148 242 178 -151 -34
3563 -34 256 330 -259 -8 144 109 -125 -232 -18 -76 -186 -381 -164 -18 -226 -449 -52 129 159 3 11 131
3585 131 219 -60 23 197 293 202 162 180 136 118 -310 -49 114 -70 -321 -427 -20 -20 -212 -270 134 18 -110 -345
3609c45J43L65j36p3K31K09j44j71J2J92n2m60J31J18N3j89j46K28J31k77p0J31
3631a19K24k51j50Q9K52l7kM3J83J01k28O4m7L4l42K13K1J14j20k28J32Q4R7l77
3655b50J49J34L0l07M1K90P7j66j31L15q8j7k9l1K51k74J7j70K94L6k07O6k9J03
3679A04j85q3J92J57k71k16K43J48J26k92L9L86k01k21l8K64o3l9k37J67J67j29
3701A8j21o8J97j05j20j62N38j45j91P0P5K87k70n8K16O0j24k66J16L77k49j34
3723e9J02K14k81l2k89K88k2k41J23O7K57j85K1j00L66k82J09N3Lj12N5j03K57
3746B09J42l48J8R5K48k26l72K7K07l4j71r9L50K9k09J9O3J06j17j26K08J44l13
3769a50K00p7J80j71J64j66K67M6k67j49K14M2j58k5p6L03j28k75jK93j53j3J55
$$ plain form
3609 -345 -202 163 27 -46 185 394 250 79 91 283 231 -229 -98 20 73 -116 -262 -34 97 -180 -250 -119
3631 -119 105 -146 -296 -207 45 8 6 49 232 333 105 169 122 156 -186 27 48 162 42 -186 -54 30 127 -250
3655 -250 -101 33 63 -244 -203 87 164 -2 -133 182 94 77 48 17 268 -6 11 -159 135 171 -36 30 1 104
3679 104 -81 -164 28 185 -86 -302 -59 89 215 -77 -38 348 147 -74 -112 152 89 50 -187 -20 147 18
3701 18 -103 -171 26 -79 -199 -361 177 32 -159 -89 -14 273 3 -55 161 221 97 -169 -53 324 75 -59
3723 -59 43 257 -24 -56 -345 -57 -79 -320 -197 -130 127 -58 -37 -137 229 -53 56 109 112 0 55 -48 209
3746 209 351 3 21 116 364 138 -234 -207 0 -34 -205 -304 46 75 -134 -115 -52 54 -63 -189 19 163 -150
3769 -150 50 -27 153 -18 146 -20 247 293 26 -123 91 133 -25 -50 -126 177 49 -226 -227 66 -87 -100 55
3792E5M3Kn2j63L03L5k24n5J84q9n4j16J34Q6p4j87J13J83nk36j82K56M0j78K28
3817D7n6J2O9j72K05Qq4j45j0K21Q5l97J73J22J51j71j50J09n0o4j0R0l3J52k05
3842a03J53J61j16j10O5J22Jr7j14J61j07J4l2R3j8j72j05J43o0J98l91Q2L03
3865G1O1k26j49L22n9k16J09J91k9j45n1kJ97J45m05J24J94n4j03j86J81J28l08
3888b10M9J31n4J49k20O5K43j54j02j73L33K7j26O3oK34j56j51J90O3k19l0K04
3911A50J10l7l55j80L91j91k6k3P0J79k24j45K06J94j69j24L16J07k70q3J54J21
3933A71k5j78j32K67p3k71N9K31K7j82l6LL3j41J23lJ94j27j06J39K86j35l1k63
3957a70K35Qoj10J00J12j70j26R4J46n7k81j3K78l2k72J91K9P5N2r8Q4j4M6l56
$$ plain form
3792 55 98 100 48 -115 188 223 -1 -56 128 39 -15 -131 3 89 15 -172 -59 124 119 -117 -299 -43 -3 -181 47
3817 47 -9 3 72 -100 105 113 29 -116 -126 95 180 -217 -44 78 229 58 -92 17 -33 -97 -107 -17 -50 102 -103
3842 -103 50 211 95 -15 50 172 173 76 -38 123 16 30 -2 91 73 -99 -204 -61 -121 77 -314 -232 71
3865 71 132 -94 -243 79 20 -196 -87 104 75 -70 -121 -123 74 219 -186 -62 132 78 -25 -211 -30 98 -210
3888 -210 -161 -30 -84 65 -155 -90 153 -1 -103 -276 57 84 -42 21 15 249 93 -58 132 195 -24 -54 150
3911 150 260 223 -132 -312 79 -112 -138 -161 -91 88 -136 -281 -75 119 -50 -174 142 249 -21 -104 50 171
3933 171 146 -32 -164 103 30 -241 -182 49 76 -106 -142 -139 -106 -247 -124 -127 67 -60 -166 -27 259 124 93 -170
3957 -170 65 73 67 -43 57 169 -1 -127 -33 113 56 -225 -238 40 8 -264 -73 -44 31 83 -15 69 55 101 -255
3982b55L18O7J85k51j69K09k5j25m6N2K08j58n4l3K2J46j68K21p8K0j53RK08L9
4006A89l50J85N0j10L4j28J29J08m4j03l9J09N0k14k7J84j0Jj99J57J54j77j47
4029a98J56P8K92l57Q1Q4m4j70J69J75j18k31n1L08j99j04P8l8J53j52j1n9J20
4052c8Kkl8J00q2O9NJ92j21j07J03R7k5j74j12R2L19l10P0j65J40J01j92QK1k3
4078g0K9j84K36o1J15o4Q9K22k10j97J9M8J56p0k86L57j06l9p3j18K05J90k41
4101e3n8J64o4j44k7L15j44Q2j99J87M8p8r0K13P6l14Q7OM5J0j73N6J49j33k0
4126e9J9r1J95j7k0K3P7k9k61M2K41o2j14k1J43J00k29J01P1lk35p6J24J93q4
4151B8o3K2J18nk60NK12J71j89l7p8J72j33Q6mj3Nj33J17j6J15k67r8K13O4n8
$$ plain form
3982 -255 63 130 315 64 -105 104 79 -46 -92 -40 168 10 -44 -77 -55 91 -77 144 66 86 -67 -58 150 189
4006 189 -161 24 74 -36 -2 -130 -1 107 63 -40 -79 30 80 -134 -161 23 13 14 -185 -28 126 -51 -198
4029 -198 -42 36 328 -29 52 136 92 -78 91 266 148 -83 -134 174 -25 -129 -51 -89 64 -88 -99 -158 -38
4052 -38 -36 -38 -76 24 -58 11 16 208 87 -20 83 180 155 -19 -131 -39 280 -30 40 -125 15 116 -76 -68 -47 -70
4078 -70 -41 -225 11 -50 65 1 90 312 102 -95 -76 -28 128 58 -228 129 23 -16 -89 -207 -2 188 -53
4101 -53 -111 53 -11 -155 -182 133 -11 71 -128 59 107 29 -61 152 228 -86 1 7 52 62 -111 -55 94 -39 -59
4126 -59 -40 -131 64 47 27 50 127 98 -163 -121 120 58 -56 -77 66 166 -63 38 109 106 -129 -205 -81 112 28
4151 28 -35 -13 105 100 -160 -155 57 228 39 2 -76 96 -37 49 45 32 37 -96 21 5 120 -147 -245 -32 32 -26
4177b6M1R6J29k71M5J7N0k62J47O2L13l06j26M8K02Kj72l6Q5J10l01n9J77R7k03
4202a41N6N0J67j8j03j47L17j66j66J10J26J4j31Q1L4n0k9l7J08j27l9J43p1J07
4226H8k71J9O7J17Q1k58k6N7J81n9j57L2J95j93O5K7JJ94j89J50j01K14k82J34
4250H6Kj02j17KJ31J6m6j76J52P8j47j34M2K75N5j76K32k33O5j69p9K62m8PJ2
4275a0J20j28P0m9J2j32J12r3P3n7J50o2p3k5J51l0j49J17L9l9O1j09O2R4K3k05
4301g7J36M8L3j21m7N5j18J16r8K02j6Qj66J51P6l28r0L27l7m5r2L3K6N9k50K44
4327B9K8j17L5j68J86k3k9l0J04R3j45J16j47J71n4j68nO7J88k36J37N6J4j30
4351b8M5l9N5p6o5O0J01j64OJ79kq6m2k0J70j08j62K35J06j95q4N2k2L19q9j08
$$ plain form
4177 -26 15 111 240 -31 14 31 81 -181 -34 28 341 35 -91 -43 159 161 -11 -47 38 148 -153 -212 -35 62 -141
4202 -141 -85 -35 132 114 11 -136 181 15 -151 -41 85 99 -32 49 83 33 4 -33 75 -52 -91 52 -19 88
4226 88 -183 -164 -97 20 101 -157 -183 -126 55 -4 -161 -129 66 -127 -62 -35 -34 160 -29 121 20 234 -48 86
4250 86 88 -14 -131 -129 2 18 -28 -204 -52 26 -121 -255 -213 62 117 -59 173 -60 5 -164 -243 19 -29 -22 -10
4275 -10 110 -18 52 3 15 -117 -5 -98 -25 -82 68 6 -67 -92 59 29 -120 -3 36 -3 58 -51 11 105 128 -77
4301 -77 59 107 140 19 -28 27 -91 25 -73 129 113 121 -45 106 182 -146 -236 91 54 9 -83 -50 -24 35 -215 29
4327 29 57 -60 -25 -193 -7 -30 -59 -89 15 108 -37 79 -68 103 49 -119 -124 -57 131 -105 32 88 102 -28
4351 -28 17 -22 33 -43 -108 -48 53 -111 -105 74 72 -14 -56 -76 94 -14 -176 59 165 -30 -114 -62 -84 235 146 38
4377C8J32j60Om9k45L84k7o2q4K05r0p1p6q0K65j51j42L55j07j25m8K42O7j94
4401a7J62j85R6J76l04J98p4J20j24j77L5J01K8m2j42J49L2k27J28Q5Mj20K8J21
4425E1o7j57J15R3O6n4o6p8K24l1q6RK5j0j06oJ33J15p8j19K17j09n5l23K42J32
4451G7Mj04J64l8L1j1j84J11J05k14M1j8L7p9p0J11J00q3j6j00K12o1o6R8J1m
4477E4j7m5N6R2k09N4j8Q4j12O3n2Q7o2NLo5O8n5j06k0L56k19nK03j80l5r0J34
4505c1Q5j33J76k87K57J0j19j87K50L3j36o7O9J78j4k83J67K01r4j37M1k8k5M
4529g0J0J96k01N1l4l5O3J24n6k0j9p1n5j0K24j01J0k8q2R3j3n2K00J3j36j72
4555a71J65M1p0J06k3mP0J7j65M8P5j75J29j97K70k43J77j97K62r5j43J02P6o2
$$ plain form
4377 38 170 10 16 -33 -278 106 79 17 -67 138 48 -23 -99 -179 86 -65 -207 148 41 -84 -132 110 177 -17
4401 -17 145 -40 56 232 -72 126 52 172 48 -129 -94 7 35 -7 -149 0 32 -195 -67 18 22 -98 -70 51
4425 51 -16 -173 -58 35 101 47 -19 -97 127 96 10 19 44 34 -72 -78 55 170 92 -27 190 81 26 -297 -55 77
4451 77 81 -23 141 103 134 123 -61 50 155 -59 -18 -36 1 -78 -148 -37 63 -20 -36 -136 76 15 -51 47 58 54
4477 54 37 -8 48 140 -69 -15 -33 51 -61 2 -50 37 -25 -20 -17 -82 -14 -69 -175 -195 161 -58 -63 140 -40 -75 -165 -31
4505 -31 54 -79 97 -190 67 77 -42 -229 21 54 -82 -149 -80 98 84 -199 -32 169 75 -62 -21 -49 -74 -70
4529 -70 -60 136 -65 -14 -48 -83 -20 104 48 28 9 -62 -117 -127 97 -4 6 -22 -104 -11 -24 -76 124 137 1 -171
4555 -171 -6 35 -35 71 48 44 114 131 -34 14 89 -86 43 -154 116 -127 50 -147 115 20 -123 -21 55 -7
4579gj27Q4j06Q0P9rL6M3q3q0O3P9l3k2k17K26J26j55j49K79k7m01K45l8J33J58
4605A77m08K52j1Nl3P4m5K33j21l04J56K25l16k3K19o4L4j66J40j58Q1O6q6J79
4629A06k2k20J25n9K9j32Q4J10j05J94L6k85J92j3L3n1oL19m39J94m5J3j07p9
4653a28R0J79j05j11J49p3r4mJ41k0j04J28m3O2P5j46j64K78l8j5k33R7j14K10
4677A7j62J40Q8kj38P0Q8M6j82k4J18j72J30j99K26NP7k13J23L6j05J16k52K49
4701H0j33L8l1M0pno8P0J23m7j10j86J97L7o6k4K75L7j13j26LK90j51j44M3J23
4727A45l7q3r5k6J44j04P2j14J86j1j55j03L19j28j0j6P3J05k91J09J8m8J20j77
4751a07K06Nq3j12K08p8Q8j83mM9j16j22J57K04k50J81j52J3J80j71nJ27j20J92
$$ plain form
4579 -7 -134 -50 -156 -76 3 -6 30 73 -10 -90 -27 52 19 -3 -220 6 132 -23 -172 107 80 -321 -76 -114 19 177
4605 177 -231 21 10 15 -18 56 11 244 123 -181 -25 200 -116 -139 80 16 50 -116 24 -134 -53 13 -73 106
4629 106 84 -136 -11 -70 -41 -173 -89 21 -84 110 146 -139 53 40 73 22 16 335 -104 90 45 58 -49 -128
4653 -128 -38 141 36 -75 74 1 -93 -97 44 24 -80 48 5 67 142 -4 -168 110 72 57 -176 -79 -193 17
4677 17 -145 -5 83 81 -57 13 101 147 -35 -59 59 -113 17 -182 44 49 126 -87 36 72 -33 83 -169 80
4701 80 -53 -15 -46 -6 -13 -18 -86 -16 107 60 -50 -236 -39 -2 -68 -92 183 220 107 -19 -16 274 123 -21 22 145
4727 145 108 25 -70 -96 48 -56 16 -98 88 77 -78 -181 138 10 0 -16 57 162 -129 -20 -2 -50 70 -107
4751 -107 99 104 21 -91 117 39 127 -56 -60 -11 -127 -249 -92 112 -138 43 -109 -96 84 -87 -92 35 -85 107
4775A07n3j42K60k71l7K52j55J18j39j14K08q7j05K07p4J94k69m6P9n9K83k8r9
4798C0k00K09j51M9o4R2J30n4n6mj0j31N2J34k6kk7k1QJ05j93J45q8L1j03M2K18
4825A15p7j80J41LJ61j85J77j50m0q5K4J04N5j60J54n2j7N4k18Q1P7O0kj44J94
4850I0j9j5n6o7J00o4J2o3J23k10K04J49j26l3j07j28K77k0j39O9o7K50r5q4m9
4875f8J71r6mLL6j8MK4n0m0j5o4J36J46k78o7J96M8k10RK7M5P1M1j07L8J75j86
4903c3l6L00l43J13n0l1P7O9j58k3K53k56J1N4K91p3l78K34Q3j07M1o8P1o7r7
4928a23K32k33J44P2p5j04L40k00j30N4r5J79Pk2r0J8n1J16q1q4Q1k5j3J30l7
4953A0p9J28j4M3q9l9j7R2m9k20Q8L49q8j94pM9M4J6J42j08N1q4%R8m9L7j79L6
$$ plain form
4775 107 54 -88 172 -99 -136 116 -39 79 -60 -174 34 -53 -158 49 -25 169 -100 -146 -67 -126 157 129 30
4798 30 -170 39 -112 -63 -127 -35 95 41 -15 -19 -29 -160 -108 26 0 -2 -29 -50 -42 63 -130 15 -73 -42 -145 -103 115
4825 115 38 -142 -1 2 163 -22 155 5 -35 -120 -96 8 63 -97 57 5 -12 42 -176 -95 -18 42 40 -104 90
4850 90 71 56 0 -67 33 -31 -19 -82 41 -169 35 184 58 25 -82 -210 67 47 -92 -23 -90 160 65 -19 -68
4875 -68 103 7 3 6 42 24 28 52 2 -38 -53 -117 19 165 -113 -180 16 64 -146 -137 -110 -65 6 47 -60 -22 153 -33
4903 -33 -69 231 -112 1 -49 -80 -3 66 -92 -115 138 -118 -107 -53 238 165 -213 21 104 -3 38 -30 41 -26 -123
4928 -123 109 -124 20 92 17 -87 253 53 -77 -23 -118 61 68 46 -44 -26 -77 39 -42 -126 -45 -70 -83 47 10
4953 10 -69 59 45 88 -1 -40 -57 35 -14 -234 -146 203 115 -79 -86 -37 7 23 165 57 108 24 24 122 73 110 -69 -33
4981c3J04m6n0j8J29l23J76J59j26q6J12o0J56l6j97P5P6l4m1j09J78P8j74R0
5005@K15k09oJ02ol9J20j34j78J54o3R8n5k65M03j46j66J4K95r3q3R1M0qr5m0
5031e4J03n8J78k7o8J07j49n6L5QJ48o7j30L0L0j50P1J37Q3k25j58K11M6J43l25
5056a37K13jK4p4j50P2J86j36J09r3K2j21K25q9q1l6l9Q4Mo3J56j14k8K65r8j83
5082h3R2nl4o3J28Lj2j25K10K6M7j67q1J91l19K12K6q6P4j58Q4L9P8j42J10j4
5108C1M6J7k34J98JN1k1q8j01P4p3q2K85j28n0J29n2J66j2k32L8o0k2K41l04K44
5134F2n1r5J27j52K42M4k79J11N6n8n5k3J28rJ42j80J19j09p3j67J90Q0j63N5
5158e8K7M7pp4J49l0j43J61r9O1L5k8l21Q9K78ol02K51j54Q7Q0j56P3m9om3R3
$$ plain form
4981 -33 71 25 -25 -43 86 -237 -61 98 -28 -114 -2 -62 94 58 -139 -64 12 -22 -63 -172 6 84 -90 0
5005 0 215 6 0 102 96 57 177 43 -135 19 -44 54 -1 -266 137 -9 -175 -161 134 41 -42 49 89 81 -14 -54
5031 -54 49 -9 169 142 74 181 32 -24 11 19 167 100 -30 0 30 -120 -49 88 171 -54 -212 -1 45 188 -137
5056 -137 76 75 99 25 -125 -53 133 -3 106 13 35 -86 139 50 -31 -67 -106 -22 -18 -81 75 -39 -67 198 100 -83
5082 -83 9 4 -30 -93 35 38 26 -99 111 137 184 17 -64 127 -192 20 46 -40 34 -124 -40 -1 77 -65 45 31
5108 31 77 94 -140 58 59 110 89 1 -100 -26 -99 -181 104 -24 -74 55 3 169 157 -75 -37 -97 -119 122 -182 62
5134 62 11 -84 43 -109 133 177 -102 9 65 7 -48 -71 57 48 190 10 129 20 -53 -220 -30 50 -113 -58
5158 -58 -31 16 9 -65 84 54 -89 72 -27 34 69 41 -280 -191 87 81 -221 30 -124 -37 43 -113 -40 -89 -95 -138 -45
5185d5K89k11jJ67k21J7p2N0J04j43J9L1o5K2Q2J06j54Rl2JN1m9K17m08K58n8
5211c6L6o4N3K05k40k3o8J13n6J03mK0O1j10k7M7O0j08j68m0L12r5j18O9Q0%N0
5238E2j40k7J22qq1L38k43m6j33J11J18j27J14j21J89m8j88RM9J17L6k26K7O7
5262c9K11k52J5N6Q0j09p8K0N1P3j33J65J12j87R5p1j0K3p1Q2L6j10p1R1M0L3
5288E2qk95K24Q7j56N1J98q2j37j11K03K9r5j11J41J55j16O5j68K5q3J43n3Mm3
5313h1L7j35J46J85m0j97oO7O6M7j54J92j30j13J23n5R0J52k19l7J49j65J64j75
5337h9jK0p9K8J68Kj32K33p5j15m3O8J04ln4pJ75j88J83k56J23L7o5N6l42J75
5363g7J3K7K4r4J14J25k53n9J94k11M7n6J93j32J46J24j08NL9j25L5rqm3K7k6
$$ plain form
5185 -45 244 33 32 199 -22 -5 -77 -27 77 -66 -47 -16 -81 -59 23 129 -25 -16 -48 -47 4 -45 172 -236 22 -36
5211 -36 0 -64 -11 194 -46 -69 -137 -24 -80 23 19 39 100 -10 -37 10 70 -38 -206 -246 66 -29 -147 -78 2 2 52
5238 52 -88 -115 7 -1 -82 256 13 -33 -166 -55 63 -64 50 -71 118 70 -118 -109 -60 57 93 -133 -106 -39
5262 -39 172 -80 -65 -9 71 -38 -116 -96 -45 28 -105 60 172 -15 80 9 -1 22 -49 33 69 -41 -112 -21 19 52
5288 52 44 -251 -27 60 -96 -45 153 71 -66 -177 26 55 -40 -151 -10 145 29 94 -74 -49 -132 11 -42 -38 -81
5313 -81 -44 -179 -33 152 112 -85 -91 -24 42 89 -65 127 -3 -116 7 -48 42 194 -25 -62 87 -78 86 -89
5337 -89 -90 -70 -149 -121 47 49 -83 150 75 -40 -83 -15 89 86 32 25 200 12 195 -61 62 99 34 90 -252 -77
5363 -77 -64 -37 -13 -107 7 132 -121 -180 14 -197 -150 -206 -13 -145 1 125 17 22 61 -64 -29 -38 -46 -89 -62 -88
5389h8J67O3j85K8J47j93j12K32j72J66n0J17P0j13k59J30J86j31o5l5P0R6l1
5412C8j00j1j1O7O7j04J17o7q5O6M6R7r7o3M1K62j51k22J16p9K41k08p5K06j19
5437b8mk6O7MK5j3J02o6j18r4J29J26r9r4J1L0jo3J04m5J85r8j72J79K4j22q3
5464a40J98L2q4q8J5R1pj87j9L38n8n4K1Q3K6j30j06L9K15j24j37K26j34Q1j91
5489i4pJ40j6p5j9Q5L8N7p1P3k7J9n4j19J95k6q3O2K5Qj69J64J2k39K28j40L6
5516Cj17O3M7K8J64o0n3m1jJ09j15j4Q4j0k83J94K2J06k35K33k4K8q7k28K15j48
5542a20J94j25j10L12N7j93J5j51J12lN2m0J10q4N5j87R0J66p2k58L2J65L8m8
$$ plain form
5389 -88 79 142 -43 -15 132 -61 -173 59 -113 53 3 120 190 77 -182 -52 134 3 -62 -97 -27 69 38
5412 38 -62 -73 -84 -17 50 -54 63 -4 -89 -23 23 120 23 -40 1 263 112 -110 6 -73 168 -40 -115 91 -28
5437 -28 -32 -58 9 13 38 25 127 61 -57 -151 -22 104 5 -89 -78 -48 -49 -112 -8 -53 132 34 -138 41 65 -57 -140
5464 -140 58 90 6 -82 -67 24 17 -170 -189 149 91 37 58 141 167 37 -69 -30 185 61 -76 150 16 97 -94
5489 -94 -101 39 23 -52 -71 14 52 109 38 111 84 103 49 -70 125 99 16 78 103 111 -58 106 118 -121 107 -33 3
5516 3 -114 -51 -4 24 188 128 75 34 33 142 27 13 97 87 -196 -2 20 126 -109 124 100 128 41 -187 28 -120
5542 -120 74 -51 -161 151 208 15 30 -121 -9 -12 40 0 110 26 81 -106 -16 150 78 -180 -148 17 55 7
$$ [...]
8191i
##END NTUPLES=NMR FID
##END=
