##TITLE=1H_Bz0402-1-1
 CDCl3
 8 sc, 
 7.02.2022
##JCAMPDX= 6.0         $$ Bruker NMR JCAMP-DX V2.0
##DATA TYPE= NMR FID
##DATA CLASS= NTUPLES
##ORIGIN= UXNMR, Bruker Analytische Messtechnik GmbH
##OWNER= root
$$ XWIN-NMR		Version 3.5
$$ Mon Feb  7 11:36:13 2022 Russian Standard Time (UT+4h)  she@DPX200
##.OBSERVE FREQUENCY= 200.131346
##.OBSERVE NUCLEUS= ^1H
##.DELAY= (6, 6)
##.ACQUISITION MODE= SIMULTANEOUS
##.ACQUISITION SCHEME= undefined
##.AVERAGES= 8
##.DIGITISER RES= 18
##SPECTROMETER/DATA SYSTEM= spect
##.PULSE SEQUENCE= zg30
##.SOLVENT NAME= CDCl3
##.SHIFT REFERENCE= (INTERNAL, CDCl3, 0, 15.7039)
##AUDIT TRAIL= $$ (NUMBER, WHEN, WHO, WHERE, WHAT)
$$ ##TITLE= Audit trail, XWIN-NMR		Version 3.5
$$ ##JCAMPDX= 5.01
$$ ##ORIGIN= Bruker BioSpin GmbH
$$ ##OWNER= she
$$ F:/spectra/data/she/nmr/H-F/1/audita.txt
$$ ##AUDIT TRAIL=  $$ (NUMBER, WHEN, WHO, WHERE, WHAT)
(   1,<2022-02-07 11:34:29.87 +0400>,<she>,<DPX200>,
      <created by zg, POWCHK disabled, PULCHK disabled
       configuration hash MD5:
       00 E9 B6 7A A2 85 ED C7 34 08 36 98 17 FE 4E 26
       data hash MD5: 16K
       4F 4A 36 42 7B 12 06 9C B3 1C 82 39 22 F7 30 F7>)
$$ ##END=
$$ 
$$ hash MD5
$$ C4 D2 84 DF EA C2 86 CE 16 07 5A 01 95 C0 85 7B
##$RELAX= 
##$RELAX= 
##$RELAX= 
##$RELAX= 
##$RELAX= 
##$RELAX= 
$$ Bruker specific parameters
$$ --------------------------
##$DU= <F:/spectra>
##$EXPNO= 1
##$NAME= <H-F>
##$PROCNO= 1
##$TYPE= <nmr>
##$USER= <she>
##$AMP= (0..31)
100 100 100 100 100 100 100 100 100 100 100 100 100 100 100 100 100 100 
100 100 100 100 100 100 100 100 100 100 100 100 100 100 
##$AQSEQ= 0
##$AQ_mod= 1
##$AUNM= <au_zg>
##$AUTOPOS= <>
##$BF1= 200.13
##$BF2= 200.13
##$BF3= 200.13
##$BF4= 200.13
##$BF5= 200.13
##$BF6= 200.13
##$BF7= 200.13
##$BF8= 200.13
##$BYTORDA= 1
##$CFDGTYP= 0
##$CFRGTYP= 5
##$CHEMSTR= <none>
##$CNST= (0..31)
1 1 145 1 1 1 1 1 1 1 1 1 1 1 1 1 1 1 1 1 1 1 1 1 1 1 1 1 1 1 1 1 
##$CPDPRG= <>
##$CPDPRG1= <>
##$CPDPRG2= <>
##$CPDPRG3= <>
##$CPDPRG4= <mlev>
##$CPDPRG5= <mlev>
##$CPDPRG6= <mlev>
##$CPDPRG7= <mlev>
##$CPDPRG8= <mlev>
##$CPDPRGB= <>
##$CPDPRGT= <>
##$D= (0..31)
0 1.2 0 0 0 0 0 0 0 0.06 0 0.03 0 0 0 0 0.0002 0 0 0 0 0 0 0 0 0 0 0 0 
0 0 0 
##$DATE= 1644219269
##$DBL= (0..7)
120 120 120 120 120 120 120 120 
##$DBP= (0..7)
150 150 150 150 150 150 150 150 
##$DBP07= 0
##$DBPNAM0= <>
##$DBPNAM1= <>
##$DBPNAM2= <>
##$DBPNAM3= <>
##$DBPNAM4= <>
##$DBPNAM5= <>
##$DBPNAM6= <>
##$DBPNAM7= <>
##$DBPOAL= (0..7)
0.5 0.5 0.5 0.5 0.5 0.5 0.5 0.5 
##$DBPOFFS= (0..7)
0 0 0 0 0 0 0 0 
##$DE= 6
##$DECBNUC= <off>
##$DECIM= 32
##$DECNUC= <off>
##$DECSTAT= 4
##$DIGMOD= 1
##$DIGTYP= 9
##$DL= (0..7)
0 120 120 120 120 120 120 120 
##$DP= (0..7)
150 150 150 150 150 150 150 150 
##$DP07= 0
##$DPNAME0= <>
##$DPNAME1= <>
##$DPNAME2= <>
##$DPNAME3= <>
##$DPNAME4= <>
##$DPNAME5= <>
##$DPNAME6= <>
##$DPNAME7= <>
##$DPOAL= (0..7)
0.5 0.5 0.5 0.5 0.5 0.5 0.5 0.5 
##$DPOFFS= (0..7)
0 0 0 0 0 0 0 0 
##$DQDMODE= 0
##$DR= 18
##$DS= 0
##$DSLIST= <SSSSSSSSSSSSSSS>
$$ [...]
##$SUBNAM2= <"">
##$SUBNAM3= <"">
##$SUBNAM4= <"">
##$SUBNAM5= <"">
##$SUBNAM6= <"">
##$SUBNAM7= <"">
##$SUBNAM8= <"">
##$SUBNAM9= <"">
##$SW= 18.0517287032376
##$SWIBOX= (0..15)
0 0 2 0 0 0 0 0 0 0 0 0 0 0 0 0 
##$SW_h= 3612.71676300578
##$TD= 16384
##$TD0= 1
##$TE= 0
##$TE2= 300
##$TE3= 300
##$TEG= 300
##$TL= (0..7)
0 120 120 120 120 120 120 120 
##$TP= (0..7)
150 150 150 150 150 150 150 150 
##$TP07= 0
##$TPNAME0= <>
##$TPNAME1= <>
##$TPNAME2= <>
##$TPNAME3= <>
##$TPNAME4= <>
##$TPNAME5= <>
##$TPNAME6= <>
##$TPNAME7= <>
##$TPOAL= (0..7)
0.5 0.5 0.5 0.5 0.5 0.5 0.5 0.5 
##$TPOFFS= (0..7)
0 0 0 0 0 0 0 0 
##$TUNHIN= 0
##$TUNHOUT= 0
##$TUNXOUT= 0
##$USERA1= <user>
##$USERA2= <user>
##$USERA3= <user>
##$USERA4= <user>
##$USERA5= <user>
##$V9= 5
##$VALIST= <valist>
##$VCLIST= <CCCCCCCCCCCCCCC>
##$VD= 0
##$VDLIST= <DDDDDDDDDDDDDDD>
##$VPLIST= <PPPPPPPPPPPPPPP>
##$VTLIST= <TTTTTTTTTTTTTTT>
##$WBST= 1024
##$WBSW= 4
##$XGAIN= (0..3)
0 0 0 0 
##$XL= 0
##$YL= 0
##$YMAX_a= 79567
##$YMIN_a= -53482
##$ZGOPTNS= <>
##$ZL1= 120
##$ZL2= 120
##$ZL3= 120
##$ZL4= 120
##$ABSF1= 10
##$ABSF2= 0
##$ABSG= 5
##$ABSL= 3
##$ALPHA= 0
##$AQORDER= 0
##$ASSFAC= 0
##$ASSFACI= 0
##$ASSFACX= 0
##$ASSWID= 0
##$AUNMP= <proc_1d>
##$AZFE= 0.1
##$AZFW= 0.1
##$BCFW= 1
##$BC_mod= 2
##$BYTORDP= 1
##$COROFFS= 0
##$CY= 11.3945322036743
##$DATMOD= 1
##$DC= 2
##$DFILT= <>
##$DTYPP= 0
##$F1P= 2.36226072786647
##$F2P= -0.459571619588291
##$FCOR= 0.5
##$FTSIZE= 0
##$FT_mod= 4
##$GAMMA= 1
##$GB= 0.15
##$INTBC= 1
##$INTSCL= 1
##$ISEN= 128
##$LB= 0.24
##$LEV0= 0
##$LPBIN= 0
##$MAXI= 10000
##$MC2= 0
##$MEAN= 0
##$ME_mod= 0
##$MI= 1.114404
##$NCOEF= 0
##$NC_proc= 0
##$NLEV= 6
##$NOISF1= 3.799351
##$NOISF2= 2.8
##$NSP= 1
##$NTH_PI= 0
##$NZP= 0
##$OFFSET= 15.70392
##$PC= 1
##$PHC0= -15868.38
##$PHC1= 15.80078
##$PH_mod= 1
##$PKNL= yes
##$PPARMOD= 0
##$PSCAL= 0
##$PSIGN= 0
##$REVERSE= no
##$SF= 200.130013532006
##$SI= 16384
##$SIGF1= 3
##$SIGF2= 2
##$SINO= 400
##$SIOLD= 16384
##$SREGLST= <1H.CDCl3>
##$SSB= 0
##$STSI= 0
##$STSR= 0
##$SW_p= 3612.71676300578
##$SYMM= 0
##$S_DEV= 0
##$TDeff= 0
##$TDoff= 0
##$TI= <>
##$TILT= no
##$TM1= 0
##$TM2= 0
##$TOPLEV= 0
##$USERP1= <user>
##$USERP2= <user>
##$USERP3= <user>
##$USERP4= <user>
##$USERP5= <user>
##$WDW= 1
##$XDIM= 8192
##$YMAX_p= 0
##$YMIN_p= 0
$$ End of Bruker specific parameters
$$ ---------------------------------
##NTUPLES= NMR FID
##VAR_NAME=  TIME,          FID/REAL,        FID/IMAG
##SYMBOL=    X,             R,               I
##VAR_TYPE=  INDEPENDENT,   DEPENDENT,       DEPENDENT
##VAR_FORM=  AFFN,          ASDF,            ASDF
##VAR_DIM=   8192,          8192,            8192
##UNITS=     SECONDS,       ARBITRARY UNITS, ARBITRARY UNITS
##FACTOR=    0.0002768,     1,               1
##FIRST=     0,             0,               0
##LAST=      2.2672688,     0,               0
##MIN=       0,             -53482,          0
##MAX=       2.2672688,     79567,           0
$$ Real data points
##PAGE= N=1
##DATA TABLE= (X++(R..R)), XYDATA
$$ [...]
1466AM61K69L40M45M3J44k37j2m19l92m72j73l38J31k08k89N6n16r9k0l05R3M42
$$ 1 462 731 1071 1516 1559 1703 1466 1454 1035 643 171 -2 -340 -209 -417 -706 -650 -1166 -1265 -1285 -1590 -1497 -1055
1489a055Q6O46L07L84M14oL09J38k64J00r6k61K20q8j26l40j52j55l21n73l57
$$ -1055 -969 -323 -16 368 782 776 1085 1223 959 1059 963 702 922 834 708 368 216 61 -260 -833 -1190
1510a190j46j1j9O7L22L61L04K58J33J80nJ87O2L07J05M90j57O7p7j71n04k82
$$ -1190 -1336 -1347 -1366 -1299 -977 -616 -312 -54 79 259 254 441 503 810 915 1405 1248 1315 1238 1067 563 281
1532B81o06j46l84j02J18k78K05J09Rj23J04N3L6K16M17L91N13K13M23q1J4j78
$$ 281 -325 -471 -855 -957 -839 -1117 -912 -803 -794 -917 -813 -760 -724 -508 -91 300 813 1026 1449 1368 1382 1204
1554A204k34k40k70k95P0l47J14k88j86j75l79j51k53J40l7K36K70M62L52L75
$$ 1204 970 730 460 165 235 -112 2 -286 -472 -647 -1026 -1177 -1430 -1290 -1327 -1091 -821 -359 -7 368
1574C68K35L1j1L67k01K74l0J8L7J7j50j58n79m00k72n05j29j30j81k5K40K21
$$ 368 603 634 623 990 789 1063 1033 1051 1088 1105 955 797 218 -182 -454 -959 -1088 -1218 -1399 -1424 -1184 -963
1596i63K06NK16J54k5L95J89K57P00r2M63j2J09j50k41m94j82k56k50j90m57o4
$$ -963 -757 -752 -536 -382 -407 -12 177 434 1134 1042 1505 1493 1602 1452 1211 717 535 279 29 -161 -618 -682
1618f82K5l33j28j50j62J11J08K03J60M48L97L21L82L26O7J98j62o8J48j32r8
$$ -682 -657 -990 -1118 -1268 -1430 -1319 -1211 -1008 -848 -400 -3 318 700 1026 1093 1291 1129 1061 1209 1077 979
1639I79M2j89k94r0n75k16m33l34o4j61M6J3K29L28P1K26J91J88J98J38N1M71
$$ 979 1021 832 538 448 -127 -343 -776 -1110 -1174 -1335 -1289 -1276 -1047 -719 -648 -422 -231 -43 155 293 344 815
1661H15L36N1RJ69k2l05k01m77j15n30o9k06k24J28k09J7m3r6N8Q7j48L35L64
$$ 815 1151 1202 1211 1380 1358 1053 852 375 260 -270 -339 -545 -769 -641 -850 -833 -876 -972 -914 -827 -975 -640 -276
1684b76O1N80K33K65J57R3r1k54L3j71J9k18j6k69%j91k33k82m20J9k28n9L58
$$ -276 -215 365 598 863 1020 1113 1022 768 801 630 649 431 415 146 146 -45 -278 -560 -980 -961 -1189 -1248 -890
1707h90Q9J47L12K42J02J98j0K48M1l2L94j29K90j31p2n9k25l58l76l1l74J27
$$ -890 -801 -654 -342 -100 2 200 190 438 479 447 841 712 1002 871 799 740 515 157 -219 -250 -624 -497
1729d97l08J71K4j78K43l8J07J31k0J66K34j18N08J49J92L10j97j2j73l09M5j93
$$ -497 -805 -634 -610 -788 -545 -583 -476 -345 -365 -199 35 -83 425 574 766 1076 879 867 694 385 430 237
1751B37k22j17j26jk01j47o8j04j53J26jM6K72K43K27J41K63J37K02j13J99m3
$$ 237 15 -102 -228 -229 -430 -577 -645 -749 -902 -776 -777 -731 -459 -216 11 152 415 552 754 641 840 797
1773G97j29J20l59K54k4m25O9l66m27j86j98L5j19J03K00oN8M40l5q2L55j06M11
$$ 797 668 788 429 683 659 234 303 -63 -490 -676 -874 -839 -958 -855 -655 -661 -603 -163 -198 -280 75 -31 380
1796C80L18k9l3K43J86k2j93j48j61l91l28j20j44p7o7j71K00k29J04j80N2JK32
$$ 380 698 669 636 879 1065 1043 850 702 541 150 -178 -298 -442 -519 -586 -757 -557 -786 -682 -862 -810 -809 -577
1819e77R3K49L37L07K17K49M2J87k96K31k32j90J0l31Qj02l03j13k02k27r6k85
$$ -577 -484 -235 102 409 626 875 917 1104 808 1039 807 617 627 296 304 202 -101 -214 -416 -643 -739 -1024
1841a024J71k42J67K91k0L48K33q5M53J51M7J25J25R9P6P3M0j77j52j04l67l00
$$ -1024 -853 -1095 -928 -637 -657 -309 -76 -161 292 443 490 615 740 839 915 988 1028 851 699 595 228 -72
1863g2r9k53k47nk96K43r1M4R1j43J14K42J8K35L52J09M37K35J29p3K5j15k61
$$ -72 -171 -424 -671 -676 -972 -729 -820 -776 -685 -828 -714 -472 -454 -219 133 242 679 914 1043 970 995 880 619
1886F19mp5k79k33L4k60L7k49k54L7l34J19NJ8K23P5J78K62J95J43P9K88k25J70
$$ 619 615 540 261 28 62 -198 -161 -410 -664 -627 -961 -842 -837 -819 -596 -521 -343 -81 114 257 336 624 399 569
1910E69j48L99k04O3n1k46K0k26l58mk08o6j60p4L0J44p9O4K97r5K74J6k9L71
$$ 569 421 820 616 679 628 382 402 176 -182 -186 -394 -460 -620 -694 -664 -520 -599 -535 -238 -333 -59 -43 -72 299
1934B99RR7L61j99K66k16k6l1k31k23n8k30mr5J0j08o0j9l7j99J19P1o5L05K35
$$ 299 308 405 766 567 833 617 591 560 329 106 48 -182 -186 -281 -271 -379 -439 -458 -495 -694 -575 -504 -569 -264 -29
1959b9J10K58RJ25K73l47J38J7j99m6N5j15O3m04M2l04o0j79N4k13J08J06J58
$$ -29 81 339 348 473 746 399 537 554 355 309 364 249 312 -92 -50 -354 -414 -593 -539 -752 -644 -538 -380
1982c80N5K74J52J08j13K50o1L8K45m9j3J37j56ml24Q6K0l62j17q4j03j80R5q4
$$ -380 -325 -51 101 209 96 346 285 323 568 519 506 643 487 483 159 245 265 -97 -214 -298 -401 -581 -486 -570
2006e70K08j44J4J97l8K08L9J37K13J14M9K50P7Q1l45Q9j30n0j65j72j07j77M8
$$ -570 -362 -506 -492 -295 -333 -125 -86 51 264 378 427 677 754 835 490 579 449 399 234 62 -45 -222 -174
2029a74j46n1k8l20N3K0j69L53j18K90J94J41J75O6J25k5J81oJ6k21K34r5o5j02
$$ -174 -320 -371 -399 -719 -666 -646 -815 -462 -580 -290 -96 45 220 286 411 386 567 561 577 356 590 495 430 328
2053C28j62k30r2j93r5j30l8l1m7K47j7L3R8J63j6J23J00M47NJ38P0j15J26j2
$$ 328 166 -64 -156 -349 -444 -574 -612 -643 -690 -443 -460 -427 -329 -166 -182 -59 41 488 493 631 701 586 712 700
2077G00k46l9q3k33j06J10n10J82p7m87L54j19k05J28N9J17o5R8L38J23J37K70
$$ 700 454 415 332 99 -7 103 -407 -225 -302 -789 -435 -554 -759 -631 -572 -455 -520 -422 -84 39 176 446
2099D46m1n7K52r8J53p8j34j1j14j87Q1k08j40j07k15P9k22n2K9J69K0K7J82J65
$$ 446 405 348 600 502 655 577 443 432 318 131 212 4 -136 -243 -458 -379 -601 -653 -624 -455 -435 -408 -226 -61
2123f1N2M8KJ99l5J40N8J43M5j31k6r1k1j38k30j91P4k30J27l9k14L15j74j4m9
$$ -61 -9 39 41 240 205 345 403 546 591 460 434 343 322 184 -46 -237 -163 -393 -266 -305 -519 -204 -378 -392 -441
2148d41P4L37r5O7J54K0K28K92l26R9P4l04L30k75k78L2J52k06o4k12O4K19m09
$$ -441 -367 -30 -125 -58 96 116 344 636 310 409 483 179 509 234 -44 -12 140 -66 -130 -342 -278 -59 -468
2171d68K1L7J04J61o5P9J10n0J96M5p2R9j05J54Q5Rml7k26K66j68j12k45o5N9
$$ -468 -447 -410 -306 -145 -210 -131 -21 -71 125 170 98 197 92 246 331 340 336 299 73 339 171 59 -186 -251 -192
2196a92j41q3N6M7M8k4K08q1o2K31K11N1p5N9j4J60j25m4K40k93j12p1k02Q7n8
$$ -192 -333 -416 -360 -313 -265 -289 -81 -162 -224 7 218 269 194 253 239 399 274 230 470 177 65 -6 -208 -121 -179
2221a79oj21O5k06K30k94o7L34L5J40O1oJ86K1J29q5M1K56q4j46K9k37rJ05k2
$$ -179 -185 -306 -241 -447 -217 -511 -578 -244 -209 -69 -8 -14 172 193 322 237 278 534 450 304 333 96 87 192 170
2246A70k12P5k74j45j84J23J7j34K28qJ2K29M1j01L50j86J02J43J82N7l5j35O5
$$ 170 -42 33 -241 -386 -570 -447 -430 -564 -336 -344 -332 -103 -62 -163 187 1 103 246 428 485 450 315 380
2269C80n1j1m9j51n8r9j94q9j06N0J27o5k38J76j5n6K71j5N7K09m2L13mR6K3l3
$$ 380 329 318 269 118 60 -39 -233 -322 -428 -378 -251 -316 -554 -378 -393 -449 -178 -193 -136 73 31 344 340 436 459 426
2295D26K5j81J1J8j61n4J4k3j46k86L2M8o2j87M7K3K03mQ4J64L5mJ30m3J31J43
$$ 426 451 270 281 299 138 84 98 75 -71 -357 -325 -277 -339 -526 -479 -456 -253 -257 -173 -9 26 22 152 109 240 383
2321C83o8m8J58L6j45j2l1r3j76m9j33k35M6l0K24j42O1Mo6O2J69j65J03K49r
$$ 383 315 267 425 461 316 304 273 180 4 -45 -178 -413 -367 -397 -173 -315 -254 -250 -316 -254 -85 -250 -147 102 93
2346I3K28j01J07j01K8Q7p2j09m8nk49K50l13K38k9k60O5n4q8K41j33n1J61N2
$$ 93 321 220 327 226 254 341 269 160 112 107 -142 108 -205 33 4 -256 -191 -245 -333 -92 -225 -276 -115 -63
2370f3O7J65j47J25oM6J24l07K34o9R3j37J41j93q7p9j1k3j43J06P7j85J81J2
$$ -63 4 169 22 147 141 187 311 4 238 169 262 125 266 73 -14 -93 -104 -127 -270 -164 -87 -272 -91 -79
2394g9n0J25r9k6J29o9K06O4j51K24l1r0O3j53M6l5j6j65Q1k57J80K6r7J4m4%
$$ -79 -129 -4 -103 -129 0 -69 137 201 50 274 243 153 216 63 109 74 58 -107 -26 -283 -103 -77 -174 -160 -204 -204
2420b04N3J3N2l5R4P3J0JJ90j36K31m3J0j30j11p8MP9n5l0j20l8J47j00j20L9
$$ -204 -151 -138 -86 -121 -27 46 56 57 247 111 342 299 309 179 68 -10 -6 73 18 -12 -132 -170 -23 -123 -243 -204
2446b04j44K36Rk9J24K05l5n1m1n9Q5J57lj35P0n1M5lj54j37K3k67K05j03Q8r2
$$ -204 -348 -112 -103 -132 -8 197 162 111 70 11 96 253 250 115 185 134 179 176 22 -115 -92 -359 -154 -257 -169 -261
2472b61O3o9O5J09j03J03KJ20j21J88n4J17K24j32J60q4n9j09o8K2k34K23j94
$$ -261 -198 -267 -202 -93 -196 -93 -91 29 -92 96 42 159 383 251 411 327 268 159 91 113 -121 102 -92
2495i2M8k04q8Q3P6j31j03P1K14J7j01J68N7J42Nn7J10o2M1J01k0q1J34j67nJ8
$$ -92 -44 -248 -336 -253 -177 -308 -411 -340 -126 -109 -210 -42 15 157 162 105 215 153 194 295 275 194 328 161 156 174
2521A74j62k8k5kn4k83N4J41p3J75Nq2J38J20j33L1J25j6J0Q9K29l53K52j75l7
$$ 174 12 -16 -41 -43 -97 -380 -326 -185 -258 -83 -78 -160 -22 98 -35 -4 121 105 115 204 433 80 332 157 120
2546A20L6k10J09n3k4k86J89o4Q1m0k59J74Mr6J35J38J7p3N2J53p5P5o2J73J8
$$ 120 156 -54 55 2 -22 -308 -119 -183 -102 -142 -401 -227 -223 -319 -184 -46 -29 -102 -50 103 28 103 41 214 232
2571B32N6l1k68m4K20j82jnq5j40K52j45r6mM1J66q1j31J10K36jO5k07J52L8K8
$$ 232 288 257 -11 -55 165 -17 -18 -23 -108 -248 4 -141 -237 -241 -200 -34 -115 -246 -136 100 99 164 -43 109 147 175
2597A75m2q0j0J11j4j88J10j7r4Nkj6l0l1Q3j36N0O9K05j72l8Q3m9J85j49J68
$$ 175 133 53 43 154 140 -48 62 45 -49 -44 -46 -62 -92 -123 -40 -176 -126 -57 148 -24 -62 21 -28 157 8 176
2623A76k5k6p3P2m5m5j71Q7J30k1q7k0j38J50j30J12qj71L38%j44n8R1R5j5nP6
$$ 176 151 125 52 124 79 34 -137 -50 80 59 -28 -48 -186 -36 -166 -54 -62 -233 105 105 -39 -97 -6 89 74 69 145
2650A45R8j66Q8k32N9J05j61M8J8k1j00Q3j83K84j36J18q8j9J06k68K60K30k09
$$ 145 243 77 165 -67 -8 97 -64 -16 2 -19 -119 -36 -219 65 -71 47 -41 -60 46 -222 38 268 59
2673E9M0j97K05J40j0M3j37k9j64Q6Pj59K6J14kj85R8j7q4P1MM2m1J33MO9j83
$$ 59 99 -98 107 247 237 280 143 114 -50 36 43 -116 -90 24 22 -163 -65 -82 -166 -95 -91 -49 -90 43 47 116 -67
2700f7M2K10J7Kj4k7O2j71J46j18p1P3j09P1oq0q3k5l5l4P9J7j72J71o2K06n9
$$ -67 -25 185 202 204 190 163 225 54 200 82 11 84 -25 46 40 -40 -123 -148 -183 -217 -138 -121 -293 -122 -184 22 -37
2727c7K22oj12nK1J17r7j04R9J81k07l9L1n6o2n2K7M3p6n0J48o1R2j29k29Q9R9
$$ -37 185 179 67 62 83 200 103 -1 98 279 72 33 64 8 -54 -106 -79 -36 -112 -162 -14 -75 17 -112 -341 -252 -153
2754a53K52m7j03J84p0j10K86Lk87K25r5M2r6J06L1j12j29j8m1P8q9k97J29M7
$$ -153 99 52 -51 133 63 -47 239 242 -45 180 85 127 31 137 168 56 -73 -91 -132 -54 -143 -440 -311 -264
2778b64J78Q8j13M0j0J37J12j15MQ1j60J98p5J63j08j46J09l7j34O5l1j2M2j85
$$ -264 -86 2 -111 -71 -81 56 168 53 57 138 -22 176 101 264 156 10 119 82 -52 13 -18 -30 12 -173
2802a73kL32j13l0j48J77k07K01j46J37j4L6p3P4nN8K7j74K08n7k30J0J16n8n
$$ -173 -175 157 44 14 -134 43 -164 37 -109 28 14 50 -23 51 46 104 131 -43 165 108 -122 -112 4 -54 -59
2827e9N0j8J03p8lM6j62R5j31J08j02K27L8j45J32j04N7m8j63J02J14j41N8O1
$$ -59 -9 -27 76 -2 -5 41 -121 -26 -157 -49 -151 76 114 -31 101 -3 54 6 -157 -55 59 -82 -24 37
2851C7k53L14n5r5M1M3r5Q6j2N8r3P7k5r7K4M2J63j6o8j73K17j21kLj5R6j54o0
$$ 37 -216 98 43 -52 -11 32 -63 23 11 69 -24 53 28 -69 -45 -3 160 144 76 -97 120 -1 -3 0 -15 81 -73 -133
2879a33J00k30J14m6K27q7O0j0Q2j20n8J81J1m0J9j00K14j05r9J09l4j7P3j93
$$ -133 -33 -263 -149 -195 32 -55 5 -5 77 -43 -101 80 91 51 70 -30 184 79 -20 89 55 38 111 -82
2903h2J28j13o9J30j41J30j59J7j75J00J04N5j29J73O0Q0N5o9P3m7J39k08J36
$$ -82 46 -67 -136 -6 -147 -17 -176 -159 -334 -234 -130 -75 -204 -31 29 109 164 95 168 121 260 52 188
2926A88j9j82J31j43K71k46j95J99j45K5j05J60k11n7L24o7j47K31j35J48l1K22
$$ 188 169 -13 118 -25 246 0 -195 4 -141 -116 -221 -61 -272 -329 -5 -72 -219 12 -123 25 -6 216
2948B16j96M5J10k8L4n8j15o9OM2O0Q6j67l1M4k20K5L3N7p4J78j26J09Q2l9j22
$$ 216 20 65 175 147 181 123 8 -61 -55 -13 47 133 -34 -65 -21 -241 -216 -183 -126 -200 -22 -148 -39 43 4 -118
2974a18N3M7J48j6j47O0J36m4o2rk8P8j57K05j27p1J02n9o0n4P1J5J0j68N0j3
$$ -118 -65 -18 130 114 -33 27 163 119 57 48 20 98 -59 146 19 -52 50 -9 -69 -123 -52 -37 -27 -195 -145 -158
3000a58K31k14J28j0r6K69j26J78k17P9k7J23k6l7P7j59L5k7J8j2K2r4J15j17
$$ -158 73 -141 -13 -23 -119 150 24 202 -15 64 37 160 134 97 174 15 50 23 41 29 51 -43 72 -45
3024d5%P3o6J16j03m7p6J65N5j00q8N3N1J35P1j89P3j32n7J35k6j1N7qm4k8k2
$$ -45 -45 28 -38 78 -25 -72 -148 17 72 -28 -116 -63 -12 123 194 5 78 -54 -111 24 -2 -13 44 36 -8 -36 -58
3051e8Mj3j13J02m4J73j10k3J75L2k37M2N6J4M6q0J96j08j01l5J92j55RP2j15
$$ -58 -54 -67 -180 -78 -122 51 -59 -82 93 125 -112 -70 -14 0 46 -34 162 54 -47 -82 110 -45 -36 36 -79
3076g9pR8p0O7On1n7R6pP4k8J67l48L3J33J7rk8K3p9MM9p7m9J72k5n7o2J02N0
$$ -79 -86 12 -58 9 15 -36 -93 3 -4 70 42 209 -139 -106 27 44 35 7 30 -49 -45 4 -73 -122 50 25 -32 -94 8 58
3106E8J2p7o9J58l5m2J40ll7j32L0j0P0p7M1lJ02K3j23P7j38r7J28n2j14K45j47
$$ 58 70 -7 -76 82 47 5 145 142 105 -27 3 -7 63 -14 27 24 126 149 26 103 -35 -132 -4 -56 -170 75 -72
3133g2J89k34P0K51o7j19L8Q2j21L7J40k4n7j56J36j3m8q3j01J88j25R6p2l4O6
$$ -72 117 -117 -47 204 137 18 56 138 17 54 194 170 113 -43 93 80 32 -51 -152 36 -89 7 -65 -99 -33
3158c3J1QJ55j31M2j64K09j3J04k49M9N4rM6o8K9J75mj38j26P8l2K5k17J34J05
$$ -33 -22 -14 141 10 52 -112 97 84 188 -61 -12 42 33 79 11 40 215 211 73 -53 25 -7 18 -199 -65 40
3184D0j00pj10N3k5J77J2o7QnJ0j9P3J0J6l4l6J09n0Q3M1o3k52P6K02k99N1J27
$$ 40 -60 -67 -177 -124 -149 28 40 -27 -19 -24 -14 -33 40 50 66 32 -4 105 55 138 179 116 -136 -60 142 -157 -106 21
3212B1J7L7r5O2m5j63mJ43j10J84O9j08q6k6J75k56J40J9Q6J38j45l5j5M0M0n4
$$ 21 38 75 -20 42 -3 -166 -170 -27 -137 47 116 8 -78 -104 71 -185 -45 -26 60 198 53 18 3 43 83 29
3238B9O5j96J04P4j71L6j02L3K8J13N5q5K2j6J47k44N7Q4N6o6K9J03q0J1j51K3
$$ 29 94 -102 2 76 -95 -59 -161 -128 -100 13 68 -17 5 -11 136 -108 -51 33 89 23 52 155 75 86 -65 -42
3264d2L9L0R2k55J10j9N9n2j7o2M7K9J45j21J25pj90L08k12q0R1L5j12p7J13l8
$$ -42 -3 27 119 -136 -26 -45 14 -38 -55 -117 -70 -41 104 -17 108 101 -89 219 7 -73 18 53 -59 -136 -23 -61
3290f1O0QO5l2R3l6j05L7M1O1j03J4j28J18j02Q2N9K7Mj35Q7j32J00p6Nl5N9o0
$$ -61 -1 7 72 40 133 97 -8 29 70 131 28 42 -86 32 -70 12 71 98 102 -33 54 -78 22 -54 -49 -84 -25 -85
3318h5o2J74qp1l0P8p9R0j29J48j8N7JrJ63j40r4n8J10k0L2j21P9m2j44Q0K4L4
$$ -85 -147 27 19 -52 -82 -4 -83 7 -122 26 8 65 66 57 220 80 -14 -72 38 18 50 -71 8 -34 -178 -98 -74 -40
3346d0j06R0l7J78l1k7M0j66J59Q0j36k7M8k3Q7j67N4J2P2m5L3NN0j55M6j17l2
$$ -40 -146 -56 -93 85 54 27 67 -99 60 140 4 -23 25 2 89 -78 -24 -12 60 15 48 53 103 -52 -6 -123 -155
3373a55J65j3j15J87k36J05Q2Mj0N1J2j04j36K62J0j6pM2n6loKk5K5p8n0p2J29
$$ -155 10 -3 -118 69 -167 -62 20 24 14 65 77 -27 -163 99 109 93 86 128 72 69 63 65 40 65 -13 -63 -135 -6
3401fN8jj59n1K86k88O4m6M1K4J15r2Q4r9J44j15J50J22j40N5l1l5N5qj07J0N4
$$ -6 52 51 -108 -159 127 -161 -97 -143 -102 -78 37 -55 29 -70 74 -41 109 231 91 146 115 80 135 127 20 30 84
3428H4M2j35K1j18J58o2j97L65k97J09j22J18m4Q4j81J95n8J6M2N8M8k1p6J61
$$ 84 126 -9 12 -106 52 -10 -207 158 -139 -30 -152 -34 -78 6 -175 20 -38 -22 20 78 126 105 29 190
3452A90p5M7j38n6J21L7l36K04J61l17J35o9K3o9L6m8K42k22J8LK91j62J80o4
$$ 190 115 162 24 -32 89 126 -210 -6 155 -162 -27 -96 -73 -142 -106 -154 88 -134 -116 -113 178 16 196 132
3476A32j25p8J75j1j24j5J27K4p3nP5rl2O6p9p9j05K02j57J20o4J30M4j21l5m7
$$ 132 7 -71 104 93 -31 -46 81 105 32 27 102 93 61 127 48 -31 -136 66 -91 29 -35 95 139 18 -17 -64
3502f4nJ07k1J77j55k47K60k3Q6k04K5j0l0M1J39j94J97J2L9j31j41K69l1j64
$$ -64 -69 38 17 194 39 -208 52 29 115 -89 -64 -74 -104 -63 76 -118 79 91 130 -1 -142 127 96 -68
3526f8N9O2k5k4Q7k09J40o4o7J15p4L5rN8J21l8j92J48j5j20J88L0j03l5j5p5
$$ -68 -9 53 28 4 91 -118 22 -42 -109 6 -68 -33 -42 16 137 99 -93 55 40 -80 108 138 35 0 -15 -90
3552i0J24j53P1J60k41P1L6poJ73j99J33p2K7j18M3Q1q5P9k0m7n2R7j63K83j06
$$ -90 34 -119 -48 112 -129 -58 -22 -29 -35 138 -61 72 0 27 -91 -48 33 -52 27 7 -40 -92 5 -158 125 19
3578A9o4K26Lj54l7M8mJ50q7J7j03%JN4j44q7J6M4M1j5q4k5J51j4J8J17j80j4
$$ 19 -45 181 184 30 -7 41 37 187 100 117 14 14 15 69 -75 -162 -146 -102 -61 -76 -160 -185 -34 -48 -30 87 -93 -107
3606a07J23R5j81R7Q6p9J9L5J24j58NO4p3j36J91Qj41N6j3J00J5k7j27j47K23
$$ -107 16 111 -70 27 113 34 53 88 212 54 59 123 50 -86 105 113 -28 28 15 115 130 103 -24 -171 52
3631E2M6r8P4j03J45j57J18l4j53J61P0o3MNm0K6j21J92j44L7j65J11K9O3j50
$$ 52 98 0 74 -29 116 -41 77 43 -110 51 121 58 62 67 27 53 -68 124 -20 17 -148 -37 -8 55 -95
3656i5M6K4j90K09L9k36J55J53o5J42L1k28J21j39R5j19%J27P2k33J59j04j69
$$ -95 -49 -25 -215 -6 33 -203 -48 105 40 182 213 -15 106 -33 62 -57 -57 70 142 -91 68 -36 -205
3679b05K64L0k12Q0Pk2Rq9j36L94j32m7J29j3k29J10P2o0o1Q1P5k7N9j04J36j04
$$ -205 59 89 -123 -43 -36 -58 -49 -138 -274 120 -12 -59 70 57 -172 -62 10 -50 -111 -30 45 18 77 -27 109 5
3705Ej31L09j14n1M9q0p1j20K99j17j67O4J75j43j46K62kJ02q1n6K22j59J19k61
$$ 5 -126 183 69 18 67 -13 -84 -204 95 -22 -189 -125 50 -93 -239 23 21 123 42 -14 208 49 168 -93
3729i3O7o0p2J71o2ok9o4Q2J24p2Q6p7J2j9M9n5M1NM9m2j45J10J81k86j8n3K07
$$ -93 -26 -86 -158 13 -49 -55 -84 -148 -66 58 -14 72 -5 7 -12 37 -18 23 28 77 35 -110 0 181 -105 -123 -176 31
3757C1J7o6J0L4n7k0J35j67K04j14p5K11j12J10j29j1J5mJ15q7k4k21K23m4j19
$$ 31 48 -18 -8 26 -31 -51 84 -83 121 7 -68 143 31 141 12 1 16 12 127 40 16 -205 18 -26 -145
3782a45J49Q4jj68MJ20J16j33Jo7j2K7K9J24j39N5K5p4k3J74k6J7j90J04J8j55
$$ -145 4 88 87 -81 -77 43 159 26 27 -40 -52 -25 4 128 -11 44 69 -5 -28 146 120 137 -53 51 69 -86
3808h6k1J26K4M6k82R2J58l4j48J75L0k53L16j42J3L7Rm7R7o2mP9j1p3m1k9j00
$$ -86 -107 19 43 89 -193 -101 57 23 -125 50 80 -173 143 1 14 51 60 13 110 48 44 123 112 39 -2 -31 -131
3835a31J66N6j49J86o2k68L15M8j12j60J22m5J55j41l6j29J77M3p9o2K04J9n7
$$ -131 35 91 -58 128 66 -202 113 161 49 -111 11 -34 121 -20 -56 -185 -8 35 -44 -106 98 117 60
3858F0N2j52P4m5J27l0K3o3O3k91K18k4k9j2j29m4J39n4K73j84R2j55R8j91J91
$$ 60 112 -40 34 -11 116 86 109 46 109 -182 36 12 -17 -29 -158 -202 -63 -117 156 -28 64 -91 7 -184 7
3883Gk25J46K29j36P0p9MJ9J55p2k74K95k85J24R8j9O9k90J67N8m2nL2q3L5o6
$$ 7 -218 -72 157 21 91 12 16 35 190 118 -156 139 -146 -22 76 57 126 -164 3 61 19 14 46 -37 -2 -68
3909f8l0J59j37J03r9rR9n3j68K18P7N9j47M0O2K3j20M5p8j7J19j39K29j54k40
$$ -68 -98 61 -76 27 -72 -81 18 -35 -203 15 92 151 4 44 106 129 9 54 -24 -41 78 -61 168 14 -226
3934b26K24q4J1k4K05q8O2j44R3J08k9n1kr8LN3JJ2m9M1j8q5o0N8J24o5M6o1J00
$$ -226 -2 -86 -75 -99 106 18 80 -64 29 137 108 57 55 -43 -40 13 14 26 -23 18 0 -85 -145 -87 37 -28 18 -43 57
3963E7j88Q3n5K4P0j45K36r4J5kL0l4M5N4j61k2Q6Q4k27R4J19j27k1N7j06J42
$$ 57 -131 -48 -103 -79 -9 -154 82 -12 3 1 31 -3 42 96 -65 -87 -1 83 -144 -50 69 -58 -79 -22 -128 14
3989A4M9r0LO4j64J08J9o9J84j09N4m0o6LJ6j20N9l8J24j74J69O6j69J53m6O9
$$ 14 63 -27 -24 40 -124 -16 3 -66 118 9 63 23 -43 -40 -24 -144 -85 -123 1 -173 -4 62 -107 46 0 69
4015F9k9r1O7l0o3O2J64j49R3k1j11J12j39Rk5o3K26j40J06K08k80O3o0n6Q7j3
$$ 69 40 -51 16 -14 -77 -15 149 0 93 72 -39 73 -66 -57 -82 -145 81 -59 47 255 -25 38 -22 -78 9 -4
4041dJ32j97J92j54lL5J04R6j67J30l4r6j0oK2q4l2L9OR1r3N4N4r1MK9m2J5L3
$$ -4 128 -69 123 -31 -34 1 105 201 34 164 130 34 24 18 40 -44 -76 -37 -31 60 -33 21 75 -16 -12 17 -25 -10 23
4070B3pK1j13J31l0n0l2K27k45Q5L1P0q1Q3j77P3q0J53j03J44q0j07J95k37J00
$$ 23 16 37 -76 55 25 -25 -57 170 -75 10 41 111 30 113 -64 9 -71 82 -21 123 43 -64 131 -106 -6
4095fN2Nj85J77j78K50M3k43K0J7N8J9O9k45K64j0r3Q4M2k17N3M2R8j91N1o9J24
$$ -6 46 51 -134 43 -135 115 158 -85 -65 -48 10 29 98 -147 117 107 14 98 140 -77 -24 18 116 -75 -24 -93 31
4122C1l4j4Q4j82O1R5j01q3Q7l4N3n2j33L34j04J4J51m9j22RL7m8j48J59O9m6
$$ 31 -3 -17 67 -115 -54 41 -60 -143 -56 -90 -37 -89 -222 112 8 22 173 124 2 11 48 0 -148 11 80 34
4148C4j19J21j3M2j48j0P0r1O0N9k3K6M8r2K20j05j95J75J62j38O0m3k11O1l8
$$ 34 -85 36 23 65 -83 -93 -23 -114 -54 5 -18 8 56 -36 184 79 -116 59 221 83 143 100 -111 -50 -88
4173h8o0J74q3J8O2J30j46nJ99k08qJ41k14lJ79M1k03N0N9J1m2q6R9k2m5l5L7
$$ -88 -148 26 -57 -39 23 153 7 2 201 -7 -15 126 -88 -91 88 129 -74 -24 35 46 4 -82 17 -5 -50 -85 -48
4200d8K9j20J76n6j25Q7N7k6k5Q8QR4Mj2n6j25J3J1J02k7o0O1r5kr9J87O8k32
$$ -48 -19 -139 37 -19 -144 -57 0 -26 -51 37 45 139 143 131 75 -50 -37 -26 76 49 -11 50 -45 -47 -146 41 109 -123
4228a23J75l1p9J16p8J6n9J14K3O8r6k06K17J84m2j32k2J76l08J13n3NP6J5j13
$$ -123 52 21 -58 58 -20 -4 -63 51 74 142 46 -160 57 241 199 67 45 221 -87 26 -27 -22 54 69 -44
4253d4j88K81L7k16l8K7K6J03o5J29j16M8J08n2p5j62L24k03L3J69j26L8m5r4
$$ -44 -232 49 86 -130 -168 -141 -115 -12 -77 52 -64 -16 92 40 -35 -197 127 -76 -43 126 0 38 -7 -101
4277a01M6L6M2Qj90J81l2R9p3l0r4L7M1L9j51K31j48K81o2r8p0J11j35p3K01m1
$$ -101 -55 -19 23 31 -159 22 -10 89 16 -14 -108 -71 -30 9 -142 89 -59 222 160 62 -8 103 -32 -105 96 55
4303E5j7J53o4j88O1o2qn8J90k57K44p0JM4j20P8M0O7q0j2L7k0o5R0K1P6r2Q2
$$ 55 38 191 127 -61 0 -62 -70 -128 62 -195 49 -21 -20 24 -96 -18 22 89 9 -3 34 14 -51 39 60 136 44 126
4331A26j44J6P1j38J23m5QJ8l3r3L0p3K41j17j06M4J79k12J5J13P2j22J44j34
$$ 126 -18 -2 69 -69 54 9 17 35 2 -91 -61 -134 107 -10 -116 -72 107 -105 -90 23 95 -27 117 -17
4355a7k3J36q8o0K46j56mm5PJ63J1j28J2l0m5L5o5N7m7O5J08k46N4j4J06j41K44
$$ -17 -40 96 8 -52 194 38 34 -11 -4 159 170 42 54 24 -21 14 -51 6 -41 24 132 -114 -60 -74 32 -109 135
4382A35j58j8J25p7m6k8Q2l3OR5r2J56j50o6J69j20nn7J40Q3j26M4j03J17j1j04
$$ 135 -23 -41 84 7 -39 -67 15 -18 -12 83 -9 147 -3 -69 100 -20 -25 -82 58 141 15 59 -44 73 62 -42
4408d2Q6m4n4qmP7j9l0P0n3J00n9p1n4k4n3K04J0j58J45J28j50J36j13O7o6J14
$$ -42 44 0 -54 -62 -66 11 -8 -38 32 -21 79 20 -51 -105 -129 -182 22 32 -126 19 147 -3 133 20 87 21 135
4435A35j16J22k23o7J33j31J77m2R7N4j75J32k27KJ40q0R2l8j8JJ83j39o8R3O3
$$ 135 19 141 -82 -149 -16 -147 30 -12 85 139 -36 96 -131 -129 11 -69 23 -15 -33 -32 151 12 -56 37 100
4460A00o9k63R2M2P2J0l9J15j81J4J52j30L9J43o4j22k4P5J7M9Q2j25O4q4o6J89
$$ 100 31 -232 -140 -98 -26 -16 -55 60 -121 -107 45 -85 -46 97 33 -89 -113 -38 -21 28 110 -15 49 -35 -101 88
4486H8j29o3K23L8j98P3N9L5j02K3K4n4J54r1q0Kl7M3N6j3J6j1r7J7qq8L3N3R5
$$ 88 -41 -104 119 157 -41 32 91 126 24 47 71 17 171 80 0 2 -35 8 64 51 67 56 -41 -24 -32 -120 -87 -34 61
4515F1q4L8mm0PJ4L7P5l6p4j18M3N3J17o0l2LR2M2k35K97j18r3j58J98o9p1K74
$$ 61 -23 15 11 -29 -22 -8 29 104 68 -6 -124 -81 -28 89 29 -3 0 92 134 -101 196 78 -15 -173 25 -44 -115 159
4543A59m8j80J51j80l5L0J35J08j57r2J56o4J26J9l15K45k27J49j05mN6k0K6J50
$$ 159 111 -69 82 -98 -133 -103 32 140 -17 -109 47 -17 109 128 -187 58 -169 -20 -125 -129 -73 -93 -67 83
4567H3r6k12K21P1l3q2oK91o0j67Q1o1K7m8M0q6J6rM8L2j23J56j61o0K55j75K22
$$ 83 -13 -225 -4 67 34 -48 -54 237 177 10 91 30 57 9 49 -37 -21 -30 18 50 -73 83 -78 -138 117 -58 164
4594A64j89L4Q8p3K9k2j63K02K40l51jo6o2L16q9l4K0p0l2m0J56j46P8J35j33
$$ 164 -25 9 97 24 53 31 -132 70 310 -41 -42 -108 -170 146 57 23 43 -27 -59 -99 57 -89 -11 124 -9
4619ip7K3J07r8L3RL6K6j83K55k83O9J5J00M2j17k5L7Rj31K8Q3K4K05l19J88m
$$ -9 -86 -63 44 -54 -21 -12 24 50 -133 122 -161 -92 -77 23 65 -52 -77 -40 -31 -162 -134 -51 -27 178 -141 47 43
4646D3kpj0p5J53j28K06k31O9n8J8%R7j67J5o0qJ67j9jj38J61mJ85k39K0M3l7
$$ 43 41 34 24 -51 102 -26 180 -51 18 -40 -22 -22 75 -92 -77 -137 -145 22 3 2 -136 25 21 206 -33 -13 30 -7
4674gN1j10mJ19n8N8p8P6k48O4K62j91J07o1J28K8j96k5J85j96Q7N6j49R0rq2
$$ -7 44 -66 -70 49 -9 49 -29 47 -201 -137 125 -66 41 -20 108 136 -60 -85 100 -96 -9 47 -102 -12 -21 -103
4700a03L55k02lq7K0K25k16Jq2O5K93j75L2j81kJ0K20k16J1J26k03J59j39J13
$$ -103 252 50 47 -40 -20 205 -11 -10 -92 -27 266 91 123 -58 -60 -50 170 -46 -35 91 -112 47 -92 21
4724B1m5J29j60K53k83o5L7R5m0J3M1O2j09MMJ33o9k9k4J47o3m5L4j05J24K3p5
$$ 21 -24 105 -55 198 -85 -150 -113 -18 -58 -45 -4 58 -51 -47 -43 90 21 -8 -32 115 52 7 41 -64 60 83 8
4751Hj96J41J4J39j12J0k3j60K49k74J93r3J48j09N6k5j8J48j29J0%Q1On3L0r3
$$ 8 -188 -47 -33 106 -6 4 -19 -179 70 -204 -11 -104 44 -65 -9 -34 -52 96 -33 -23 -23 58 64 11 41 -52
4777e2j59J84Q4o9l1R6j5j84p4J85K02j45j60J02l3J56j76k2J42o1m4L6O3pj28
$$ -52 -211 -27 57 -12 -43 53 38 -146 -220 -35 167 22 -138 -36 -69 87 -89 -111 31 -30 -74 -38 25 18 -110
4802a10R7L2j08J03j32%P4q5L5qJ7J17J3j1Q0k01L5p8K56mj7Q3k03L6K26j58l12
$$ -110 -13 19 -89 14 -118 -118 -44 -129 -94 -102 -85 32 45 34 114 -87 -52 -130 126 122 105 188 -15 21 247 89 -223
4829b23J51J13j58J85l2L8j23K29j72j26J61O0l8J6j51M0o0P7J37n1j78J60k73
$$ -223 -72 41 -117 68 36 74 -49 180 8 -118 43 103 65 81 -70 -30 -90 -13 124 73 -105 55 -218
4852b18K05j42J53r9J48j4j8J2J9j13R1l8p9L3O7J20j78J48N0lj61N4O2k9n6P1
$$ -218 -13 -155 -2 -101 47 33 15 27 46 -67 24 -14 -93 -60 7 127 -51 97 147 144 -17 37 99 70 14 85
4878H5%J56k07j1j09q7J18J94j07J5q0m6M4k5m9K08j37l6J05M0P1j80J8N7J9p4
$$ 85 85 241 34 23 -86 -173 -55 139 32 47 -33 -79 -35 -60 -109 99 -38 -74 31 71 142 -38 -20 37 56 -18
4904a8L2P3m7k04J37J05R7k03l6N7J05j52J01K7Qj18j06J57o7R1N7N2r1q5J1K1
$$ -18 14 87 40 -164 -27 78 175 -28 -64 -7 98 -54 47 74 82 -36 -142 15 -52 39 96 148 57 -28 -17 4
4930Dn4O1p1K4M8q7K18K4k84K35k26K2J26k0N1j53r8K37r5K01j18m4J4P4p1m4
$$ 4 -50 11 -60 -36 12 -75 143 167 -117 118 -108 -86 40 20 71 -82 -180 57 -38 163 45 1 15 89 18 -26
4956b6J16q0QL8M4j80M3K51j96J99j18j97N1J25m7q4n2P0N7J6p5J32j12n1k9P3
$$ -26 90 10 18 56 100 -80 -37 214 18 217 99 -98 -47 78 31 -53 -105 -35 22 38 -37 95 -17 -68 -97 -24
4982b4j6J28o7n5p7J0J79K3O3k02J24j9o8l2L5R0j22Q7L9p8n6M1k2l1%nJ12o0
$$ -24 -40 88 21 -34 -111 -101 78 101 164 -38 86 67 -1 -33 2 92 -30 57 96 18 -38 3 -19 -50 -50 -55 57 -3
5010cJ09o8j47J59j34J99j25K61k93M8k0K7j26K21j65m8J16n8o2J34j34O6L8j4
$$ -3 106 38 -109 50 -84 115 -10 251 -42 6 -14 13 -113 108 -57 -105 11 -47 -109 25 -109 -43 -5 -19
5034a9J35k57l9P5mN0J82j90K13k1j51M9j06J38j02N5P7j61K31k22J76m9j44M8
$$ -19 116 -141 -180 -105 -109 -59 123 -67 146 125 -26 23 -83 55 -47 8 85 -76 155 -67 109 60 -84 -36
5058c6JL5q6J22j33J77j39J40j72J90j45K8k44K50P1M7k02O0P1Q7r0J4r3r1P9
$$ -36 -35 0 -86 36 -97 80 -59 81 -91 99 -46 -18 -262 -12 59 106 -96 -36 35 122 32 46 -47 -138 -59
5083e9K38k00l8K4J60J9o6n7n2n3J31O5j79J66j93J75Oj22kJ11K7Jj78Mn5J35
$$ -59 179 -21 -59 -35 125 144 78 21 -31 -84 47 112 -67 99 -94 81 87 -35 -37 74 101 102 -76 -72 -127 8
5109Ho8R8p2J05n5K1q4j36J89m3K1J22l6m7l6O1J6J8R8k52J32o5K7jP6m8r7J25
$$ 8 -60 38 -34 71 16 37 -47 -183 6 -37 -16 106 70 23 -13 48 64 82 180 -72 60 -5 22 21 97 49 -48 77
5137G7k07L7K8qJ8J0P5j0j53J55j53O9K72k54o9J93l4j03J65n3M6q5o1j2J46j68
$$ 77 -130 -93 -65 -73 -55 -45 30 20 -133 22 -131 -62 210 -44 -113 80 46 -57 108 55 101 16 -45 -57 89 -79
5163g9J19j25J08M1mK2pm2j22J07j71N2l3Q6L7n9J57m7j1Q2q1o7K1L7q4J24O4
$$ -79 40 -85 23 64 60 82 75 33 -89 18 -153 -101 -134 -48 -11 -70 87 40 29 111 30 -37 -16 21 -63 61 125
5190A25j88J14j00J29p5k9j38J01M0O5j00o6j4J38L1j75K14n7j19L68l24J77j00
$$ 125 -63 51 -49 80 5 -24 -162 -61 -21 44 -56 -122 -136 2 33 -142 72 15 -104 264 -60 117 17
5213A7J2K4n0J58k20j37J68k9j8P7N0j88J23p2Q1J2N1o7q4O7O5P6k15P4L5M3N1
$$ 17 29 53 3 161 -59 -196 -28 -57 -75 2 52 -136 -13 -85 -4 8 59 -8 -92 -25 40 116 -99 -25 10 53 104
5240A04k4k65K27jj9J1o1R6r9J33o2j55J99N0j47L6j5m7k8m4K12p0j14n7Q7Q7
$$ 104 80 -185 42 41 22 33 -28 68 -31 102 40 -115 84 134 -13 23 8 -39 -67 -111 101 31 -83 -140 -53 34
5266C4q1j21J88K7j54m9J90N5qk12J02nKO5J18j58n9M9l1K5J7J41k03J16j35P1
$$ 34 -47 -168 20 47 -107 -156 34 89 81 -131 -29 -34 -32 33 151 -7 -66 -17 -48 -23 -6 135 -68 48 -87 -16
5292a6J92q5l02L54l28K3K91j10k1K3MO3j42Mo4J60m4K9l5j0n3k1K23l3r3Q8j5
$$ -16 176 91 -211 143 -185 -162 129 19 -2 21 25 88 -54 -50 -114 46 2 31 -4 -14 -67 -88 135 102 9 97 82
5319H2n3KJ49n8Qj07j33J11N5o4m7Q6K0n4J04j11J6j16J11L5O5q9j9l5m9K06p5
$$ 82 29 31 180 122 130 23 -110 1 56 -8 -55 31 51 -3 101 -10 6 -110 1 36 101 12 -7 -42 -91 115 40
5346D0k00J87j73K02j63pJ22L0j06L7J12j46N4qn9j37K52o9J3%n4J10J58j98M0
$$ 40 -160 27 -146 56 -107 -114 8 38 -68 -31 81 -65 -11 -19 -78 -215 37 -32 -19 -19 -73 37 195 -3 37
5371C7K2k07K95p3Mj0J2Jn5j02o8K63k60L04n8N5k73R3Q3j20PJ53M8j89qq4J18
$$ 37 59 -148 147 74 78 68 80 81 26 -76 -144 119 -141 163 105 160 -113 -20 63 -57 -50 103 151 -38 -46 -130 -12
5398a2L9j11M9QN%r0K19j57n6K6J37Kr5P6j18L1L4O2j06J91k51K17J40k46r2j1
$$ -12 27 -84 -35 -27 -22 -22 -112 107 -50 -106 -80 57 59 -36 40 -78 -47 -13 49 -57 134 -117 100 240 -6 -98 -109
5425a09K24o4O4j60K1LN0K0k15P8J01q3J70r6M9j5l0p0q2nJ14J7J15q1j43J25
$$ -109 115 51 115 -45 -24 -21 29 49 -166 -88 13 -70 100 4 53 38 8 -62 -144 -149 -35 -18 97 16 -127 -2
5451bL1j27J12n7J05j06N0R6k26K03j5j27n3Q6J2Q0J37q3k12O3Jj4l5J76j19n0
$$ -2 29 -98 14 -43 62 -44 6 102 -124 79 64 -63 -116 -30 -18 62 199 116 -96 -33 -32 -46 -81 95 -24 -74
5477g4P4Q3j12k6O8j80J71R2j67J35k31K18p5Q6L1RN0k12O7K1J9N0j90J55m5o3
$$ -74 0 83 -29 -55 13 -167 4 96 -71 64 -167 51 -24 62 93 102 152 -60 7 28 47 97 -93 62 17 -46
5503d6k3R9M6j46P6p1J10j5j31N8K19j77J41j33j15J65om1M9p2Q4O0p4J57k30
$$ -46 -69 30 76 -70 6 -65 45 30 -101 -43 176 -1 140 7 -108 57 51 10 59 -13 71 131 57 214 -16
5528a6j9k1k6P2N7J6j02lL5m3J51j38J57j70M6j7n6l4J3o4K27n3k6j04L1j44J19
$$ -16 -35 -56 -82 -10 47 63 -39 -42 -7 -50 101 -37 120 -50 -4 -21 -77 -111 -98 -162 65 12 -14 -118 -87 -231 -112
5555a12K26j28L2P9k5Kpk81J65J16j11K7N2J7kn0K5N5k67J41j03J32ONJ18j40
$$ -112 114 -14 18 97 72 74 67 -214 -49 67 -44 -17 35 52 50 0 25 80 -187 -46 -149 -17 -11 -6 112 -28
5581b8J04p9j50J72l3J6K8l7K1m7P2l2q0L23l06o6K17j24O2J03j24Mj14J12m8
$$ -28 76 -3 -153 19 -14 2 30 -7 14 -33 39 7 -73 250 -56 -122 95 -29 33 136 12 16 -98 14 -34
5606c4N7Q0j34J2q0Q5J25K8j76l0J42j09j12P6l0J15K1p5J13m7N2J2j47K11q1
$$ -34 23 103 -31 -19 -99 -14 111 139 -37 -67 75 -34 -146 -70 -100 15 36 -39 74 27 79 91 -56 155 74
5631G4k1r5n5J00oj37Q2J28j44J11J06j1m6j54J48m1r9mJ97j82o0J01J52j24m9
$$ 74 53 -42 -97 3 -3 -140 -58 70 -74 37 143 132 86 -68 80 39 -60 -64 133 -49 -109 -8 144 20 -29
5656b9OL9J20k37J82n1m3o3j1n4J53m0j6J52l40J41K29l4j82J13m2M2j06L3J02
$$ -29 -23 16 136 -101 81 30 -13 -76 -87 -141 12 -28 -44 108 -232 -91 138 104 -78 35 -7 35 -71 -38 64
5681F4k3N0k5R5k21K09l96J61P6Pj7O6L5j19K58k55O6j31J43J6JO7j13n6K9p8
$$ 64 41 91 66 161 -60 149 -247 -86 -10 -3 -20 46 81 -38 220 -35 31 -100 43 59 60 127 14 -42 -13 -91
5707i1J02P7j30J17j51O9j31J30O3k04K8J78K2j15K16j81Q4K2k04L9J6J12n7L1
$$ -91 11 88 -42 75 -76 -7 -138 -8 55 -149 -121 57 79 -36 180 -1 83 105 -99 -60 -44 68 11 42
5731D2j44O2j0l9J14j59J9J70k33K70L5j97q1J97p0M4o1l2K15j01O6k08K9J8j25
$$ 42 -102 -40 -50 -89 25 -134 -115 55 -178 92 127 -70 -151 46 -24 20 -41 -73 142 41 107 -101 -72 -54 -179
5756a79K35K12k66R1j99Q4lO5n9N0RL6k08J10m2Q7no9K09j02K1q1J66q3j46J70
$$ -179 56 268 2 93 -106 -22 -25 40 -19 31 40 76 -132 -22 -64 23 18 -51 158 56 77 -4 162 79 -67 103
5782A03k45J11rN2m9P0J53j48m3J2r5Q4K4J46l24L4N2Nl2R6n5k7k3N0J18o2j33
$$ 103 -142 -31 -40 12 -37 33 186 38 -5 7 -88 -4 20 166 -158 -124 -72 -67 -99 -3 -58 -85 -108 -58 60 -2 -135
5809a35J08p4J03rJ11ko6N7j51J86j14m0J07k07J64N1o4kj4J0j46R1j24R7L2m
$$ -135 -27 -101 2 -7 104 102 36 93 -58 128 14 -26 81 -126 38 89 25 23 9 19 -127 -36 -160 -63 -31 -35
5835c5mJ62j36L9n5l2N5Q5j05R0o9jO1r3jJ02j4q5o9M7lq8J87k04J11j01J05j60
$$ -35 -39 123 -13 26 -29 -61 -6 79 -26 64 -5 -6 55 -38 -39 63 49 -36 -105 -58 -61 -149 38 -166 -55 -156 -51 -211
5863b11K07m8R3j1k8K5Jl4J08j67J70l5p2lq1J57J1j77K45j55j29K04j84J84j34
$$ -211 -4 -52 41 30 2 27 28 -6 102 -65 105 70 -2 -5 -86 71 82 -95 150 -5 -134 70 -114 70 -64
5888f4L3P0k18J93o6O5L0l2k6j10J25J26k22l1N1K4o5J53o6N4O8j27J00j29k1
$$ -64 -31 39 -179 14 -52 13 43 11 -15 -125 0 126 -96 -127 -76 -52 -117 36 -30 24 92 -35 65 -64 -85
5913h5P2l8k2J88o3M1j03j42J53O8j89J58J6j97M4R6Mr5R8J37j39j16R0P1j86
$$ -85 -13 -51 -73 115 52 93 -10 -152 1 69 -120 38 54 -143 -99 -3 1 -94 4 141 2 -114 -24 47 -139
5938a39L03j16k7k0o5Q1K8k01J74o9J11j97J90j89K20l57K83p4l5J60J6j3j2j51
$$ -139 164 48 21 1 -64 17 45 -156 18 -51 60 -137 53 -136 84 -273 10 -64 -99 61 77 64 52 -99
5962i9J33M4k0j11L4J08j36J12p7l9J7L6J6k31K17j66J93M7p8j09J0K02j45R8
$$ -99 34 78 58 -53 -19 89 -47 65 -12 -51 -34 2 18 -213 4 -162 31 78 0 -109 -99 103 -42 56
5986E6mnk89K20j3j7L0Q4r7J11k70J64J01q6J24j67Jr3K48l3p1Q0Mj32Pm1J51
$$ 56 52 47 -242 -22 -35 -52 -22 62 -35 76 -194 -30 71 -15 109 -58 -57 -150 98 65 -6 74 78 -54 -47 -88 63
6013F3j29N4Nj3Q7o6k9N2p0N6R8q4m5j3k2J22j29l2P7N2p2K38j66l9J11k55J80
$$ 63 -66 -12 -7 -20 67 1 -28 24 -46 10 108 24 -21 -34 -56 66 -63 -95 -18 34 -38 200 34 -5 106 -149 31
6040C1p7Q8k5o3N2L9r2K23k74j09K33j17%NJ07j20J01k9L7J01j42kJ06k08K24
$$ 31 -46 42 17 -46 6 45 -47 176 -98 -207 26 -91 -91 -86 21 -99 2 -27 10 111 -31 -33 73 -135 89
6065H9O0k25R8r1J35o0r8Q3j09Q8N6J50j81mj2p2j29O8J02J00J4j54Q2O3L6p9
$$ 89 149 -76 22 -69 66 6 -92 -9 -118 -30 26 176 -5 -9 -21 -93 -222 -154 -52 48 62 -92 -10 53 89 10
6091A0J02k01J15P4j48J68j77l9J41m9q2K37j01l6L0k71J82N2Q4J94j81q5L7M9
$$ 10 112 -89 26 100 -48 120 -57 -96 45 -4 -86 151 50 14 44 -227 -45 7 91 285 104 19 56 105
6115A05m0j78J14m2M5M5p4m7J85j8Qj7q6p5o9K15j50J47M1n7L0o7m0r2N8O5j07
$$ 105 65 -113 1 -41 4 49 -25 -72 113 95 103 86 0 -75 -144 71 -79 68 109 52 82 15 -25 -117 -59 6 -101
6142a01R7m0J5j26K17p0l0J02j00J31o8L5K3N8p8r3j01J98j70KO9J02j18qK9n
$$ -101 -4 -44 -29 -155 62 -8 -38 64 -36 95 27 62 85 143 65 -28 -129 69 -101 -99 -30 72 -46 -54 -25 -30
6168c0l9P4J23j66M8N8k0j51J44J68j42m9J00k74N6Q6j04J13j43J92N1j25L2K9
$$ -30 -69 5 128 -38 10 68 48 -103 41 209 67 18 118 -156 -100 -14 -118 -5 -148 44 95 -30 2 31
6192C1nn9J4R0n1k1L6Moj19J02m5pJ41j75O6k8l3J81k36K07r2q8R9P9j17P5l0
$$ 31 26 -33 -19 71 20 -1 35 39 33 -86 16 -29 -36 105 -70 -4 -32 -65 116 -120 87 -5 -93 6 85 -32 43 13
6220A3P5j22m4J09L3p4K5K3q7K93k93P2q8m1O9R5j67M19k77olJ20j56P4k30K28
$$ 13 88 -34 -78 31 64 -10 15 38 -49 244 -49 23 -65 -106 -37 58 -109 310 33 27 24 144 -12 62 -168 60
6246F0j02Q8J5J5q2J03j16O2j2qQ1j91Q8j75J68J08m9j34K01j42O2l6K2rmK8j22
$$ 60 -42 46 61 76 -6 97 -19 43 31 23 104 -87 1 -174 -6 102 53 -81 120 -22 40 4 26 17 13 41 -81
6273h1J47j0p7n9P2j66K11j3O8j38O0J13k34k8pK8O3r3L17m90K63J00o2j14K76
$$ -81 66 56 -21 -80 -8 -174 37 24 92 -46 14 127 -107 -135 -142 -114 -51 -144 173 -317 -54 46 -16 -130 146
6298A46j33O2r0o9K30r3r5j33J79O3R4J8r1o7l7K2J13j24J07j28j43J57q3q4J46
$$ 146 13 75 -15 -84 146 53 -42 -175 4 67 161 179 88 21 -16 6 119 -5 102 -26 -169 -12 -95 -179 -33
6323c3Q5j55J55j62J92n4j11K00p4j5K1Q3j68j9N0Jn9K2J36k68K08qK6J3j15J90
$$ -33 52 -103 52 -110 82 28 -83 117 43 28 49 132 -36 -55 -5 -4 -63 -41 95 -173 35 27 53 66 -49 141
6349A41j03o3J36j76N0j5n2L4K3p9J10P1k68J70q4P0J09n0J7M4q9m4J09k29J55
$$ 141 38 -25 111 -65 -15 -30 -82 -48 -25 -104 6 77 -191 -21 -105 -35 74 24 41 85 -4 -48 61 -168 -13
6374a3J93j62j23J4P6j17J40K7k6p7J71j26n9R8k02J33p1O0J06j90L14k63J01
$$ -13 180 18 -105 -91 -15 -132 8 35 9 -68 103 -23 -82 16 -186 -53 -124 -64 42 -148 166 -97 4
6397DQ1q0P1o5NP7rp2j42K38p6N6nn8k26L5J24n0J47k33N7J67j40M2m6R8NL2n2
$$ 4 85 5 76 11 16 93 84 12 -130 108 32 88 83 25 -201 -166 -42 -92 55 -178 -121 46 -94 -52 -98 0 5 37 -15
6426a5l5O9OP8Oj37J94j65l7o1J54j02K06k78J26l6K5Q3l6o4j35J07J05j4J50
$$ -15 -50 19 25 103 109 -28 166 1 -36 -97 57 -45 161 -117 9 -27 -2 81 45 -19 -154 -47 58 44 194
6451A94k05m6J07j57J31Pr9p3J99M9j35j01J86r3J5m7j5J99j75P1l1K0J73j58
$$ 194 -11 -57 50 -107 24 31 -68 -141 58 107 -28 -129 57 -36 -21 -68 -83 116 -59 12 -19 1 174 16
6475A6j42K11Qp6jJ55q6j03J9M7r6l4K00L7j44j69K17j6n2J11k13J32j88K52j68
$$ 16 -126 85 93 17 16 171 85 -18 1 48 -48 -82 118 155 11 -158 59 43 -9 102 -111 21 -167 85 -83
6500h3K3j7K16j24j26J52J2J71j38nR3k40R2J0m1K%j72P1J50j79K8J43k11J64
$$ -83 -60 -77 139 15 -111 41 53 224 86 81 174 -66 26 36 -5 -3 -3 -175 -104 46 -133 -105 38 -173 -9
6525iJ9m8J6q7J38o5m2P9r0R9Ll2K38l82J43k60L64j31J26K8qj60P6kq4P8J1n0
$$ -9 10 -38 -22 -109 29 -36 -78 1 -89 10 13 -19 219 -163 -20 -280 84 -47 79 107 99 -61 15 13 -71 7 18 -32
6553c2J35p9j11K6K07j21j0Q5j10k8J04r4K4j5qO6n4q5L0P1Nj00r8J94k8j4r1
$$ -32 103 24 -87 -61 146 25 15 100 -10 -38 66 -28 -4 -19 -27 39 -15 -100 -70 1 6 -94 -192 2 -26 -40 -131
6580a31RK16j20O3Ml3Oo5J17O3j85J11k16J34k7k7K45k5r8j19J1Q2N2pJ27k27
$$ -131 -122 94 -26 37 41 8 14 -51 66 129 -56 55 -161 -27 -54 -81 164 139 41 -78 -67 15 67 60 187 -40
6606d0j8m3O8r3J31jj89J13K6K46k23J3K08m9j22r9RJ29J0j04J21j98J37L4k21
$$ -40 -58 -101 -33 -126 5 4 -185 -72 -46 200 -23 -10 198 149 27 -72 -63 66 76 -28 93 -105 32 66 -155
6631a55J01j1J74j74R0j10o7l1J25M4J64J56m86J68N5l4j06o5K95l18J90N0J11
$$ -155 -54 -65 109 -65 25 -85 -152 -183 -58 -14 150 306 -180 -12 43 9 -97 -162 133 -185 5 55 166
6654A66o0j82J98k09J16m5Jl6J37p8k40J54J01j91J88R0j61p8J7J21P6j07J70
$$ 166 106 -76 122 -87 29 -16 -15 -51 86 8 -232 -78 23 -168 20 110 -51 -129 -112 9 85 -22 148
6677A48k99J35RJ02k90J03J5K4n9J75j91M4J42k28N1K2J92k19J34j17K58j37l4
$$ 148 -151 -16 -7 95 -195 -92 -77 -53 -112 63 -128 -84 58 -170 -119 -97 95 -124 10 -107 151 14 -20
6700b0j47P3m2K74j01kJ4q1Q8j28n2K92K4r6m2p0K26k27m5Q0L3q2K9J06l8k1o3
$$ -20 -167 -94 -136 138 37 35 49 -32 56 -72 -124 168 192 96 54 -16 210 -17 -62 18 51 -31 -2 104 66 45 -18
6727a8M1J8j54J95J75l02L7R9j77K08j09P5j91N1J02p5l3K2P7j1j29M4R9q3J52
$$ -18 23 41 -113 82 257 -45 -8 91 -86 122 13 88 -103 -52 50 -25 -58 -36 41 30 -99 -55 44 -39 113
6752A13q8J1p6M5j23K10k6n3j2P1j37L8J02j11J24n2J9O0l5N3j61q0J52M3j55
$$ 113 25 36 -40 5 -118 92 66 13 1 72 -65 -27 75 -36 88 36 55 115 80 133 -28 -108 44 87 -68
6777f8J70k06O5R2l0J05k18M1nJ66k96R7K3J06j0n5R4j3k2P3jj61k2L2LJ77j74
$$ -68 102 -104 -39 53 23 128 -90 -49 -54 112 -184 -87 -64 42 32 -23 71 58 36 109 108 -53 -75 -43 -40 137 -37
6804c7O6q6J44m0n9n2J12M4j25j13Q9RJ14L4l0p5J3K8j2j55J66J25k31J02kj09
$$ -37 29 -57 87 47 -12 -64 48 92 -33 -146 -57 -48 66 100 70 -5 8 36 24 -131 35 160 -71 31 29 -80
6830h0J09oK1L2nj7j84mj5K85j09q9J15k4l4j33M1J17k37J87p2kJ30n7J3k9M0
$$ -80 29 23 44 76 71 54 -130 -134 -149 136 27 -62 53 29 -5 -138 -97 20 -217 -30 -102 -104 26 -31 -18 -47 -7
6857gJ49m48L86J00k73o4J93J5j11R1j28O3j28K81q0pj74N3O0l8j0N0p4n1J74
$$ -7 142 -306 80 180 -93 -157 36 51 -60 31 -97 -34 -162 119 39 32 -142 -89 -29 -67 -77 -27 -101 -152 22
6882B2j39M7J00k04L44j63k13K03p2R1O1j60J59r4o1QJ61j28j08J15K27l56J91
$$ 22 -117 -70 30 -174 170 7 -206 -3 -75 16 77 -83 76 -18 -79 -71 90 -38 -146 -31 196 -160 31
6905C1j03J27Q2j49k3P4r9m0M2Nl2N4nM4n0J30m9k53L03j88R3J05l5k6q8J21k9
$$ 31 -72 55 137 -12 -35 39 -60 -100 -58 -53 -85 -31 -36 8 -42 88 39 -214 89 -99 -6 99 64 38 -50 71 42
6932D2q1O3l2O9l0n5k4N7q5j10J92M3r5nK7j2o8K8N4J57j04O2j45j5J12k00Q9
$$ 42 -39 24 -8 61 31 -24 -48 9 -76 -186 6 49 -46 -51 -24 -36 -104 -76 -22 135 31 93 -52 -67 45 -155 -66
6959f6R5jJ7r1m3L6N8q7O2R4j34j6j8N4J33j20K9J82n8j16j45R5J57j47l4l6M8
$$ -66 29 28 45 -46 -89 -53 5 -82 -20 74 -60 -76 -94 -40 93 -27 2 184 126 10 -135 -40 117 -30 -64 -100 -52
6986e2P5k33J02J93r2l2n4J79j57j49L17Mj36J42j23J05o5J6p0lj38K94o6j12
$$ -52 23 -210 -108 85 -7 -39 -93 86 -71 -220 97 101 -35 107 -16 89 24 40 -30 -33 -171 123 57 -55
7010e5K1J48N3k37K27j17p0J07q5N7o0p2O1Q9o4J25j92J73r3%r8K2J88r8n1P7
$$ -55 -34 114 167 -70 157 40 -30 77 -8 49 -11 -83 -22 67 3 128 -64 109 16 16 -82 -60 128 30 -21 56
7036E6O0j26J74j81M4j4j40J18P0n8j79Q5N2j21M2K61j4j01Q5k12k9K30m2j05
$$ 56 116 -10 164 -17 27 13 -127 -9 61 3 -176 -91 -39 -160 -118 143 129 28 113 -99 -128 102 60 -45
7060d5M6P8k6L6j02J6J20m3k32J19M4r8J55j00J18j98P3P1N8j64P4K0Nj2N9p1
$$ -45 1 79 53 89 -13 3 123 80 -152 -33 11 -87 68 -32 86 -112 -39 32 90 -74 0 20 25 13 72 1
7086AN8j18J97M2j79P1K1j78O9j43K79Mj07N0l4N9J20j01j16j4P9N0l2j37J10
$$ 1 59 -59 138 180 1 72 93 -85 -16 -159 120 124 17 67 33 92 212 111 -5 -19 60 110 78 -59 51
7111E1J7lL6j51J91p5j33J76m2k08J71n2J3qP8J1m3j51J38jl4o0O8o2J03q8J70
$$ 51 68 65 101 -50 141 66 -67 109 67 -141 30 -22 -9 -17 61 72 29 -122 16 15 -19 -79 -11 -73 30 -58 112
7138A12j78j2N8J38k06J51j16J32k2k4k0P3j50r7J37J47j86MJ63k40k6R8R5m4
$$ 112 -66 -78 -20 118 -88 63 -53 79 57 33 13 86 -64 -161 -24 123 -63 -59 104 -136 -162 -64 31 -13
7162a3N3l8N6m6O7j13J2J54k01KK16q1j68J63j61L2MJ77l4j46J34j76J37j23J70
$$ -13 40 2 58 12 79 -34 -22 132 -69 -67 149 68 -100 63 -98 -66 -62 115 81 -65 69 -107 30 -93 77
7187G7j21J19j15R2q5o2M9n9K06k34J45j16j4L3J51j59K69j79L1l3R7o1l4L1p4
$$ 77 -44 75 -40 52 -33 -95 -46 -105 101 -133 12 -104 -118 -85 66 -93 176 -3 28 -5 92 31 -3 28 -46
7212d6J05j2j24J76r3K0j2k9K4j38J80m9m5M0o1nQ8n8J39Q9p5j16Km5o3R9N6m7
$$ -46 59 47 -77 99 6 26 14 -15 9 -129 51 2 -43 -3 -64 -69 19 -39 100 189 114 -2 0 -45 -108 -9 47 0
7240@J01rj95K18j31p2K37j14m0p0R7j1L7l4J83k07J51k28N8J63j65N1n4p4M4
$$ 0 101 92 -103 115 -16 -88 149 35 -5 -75 22 11 48 14 197 -10 141 -87 -29 134 -31 20 -34 -108 -64
7265f4P7P9M1j69J42k34j8J08L9M3p0P3q2J8lJ6r7K0R3N1j3p5Q4j0J56j57j05
$$ -64 13 92 133 -36 106 -128 -146 -38 1 44 -26 47 -35 -17 -20 -4 -101 -81 12 63 50 -25 59 49 205 48 -57
7292e7K02r5M2m2k5j42J91l8l9j9n5O8J14j33j44K05Oj10OJ21j37m5M1K10q3N4
$$ -57 145 50 92 50 25 -117 74 36 -3 -22 -77 -9 105 -28 -172 33 39 -71 -65 56 -81 -126 -85 125 42 96
7318I6j50J70p5j0m3j24J79P3j14o3J20j17n3J33p0Q2k1J67l31P5qQ4n7N0Q1n7
$$ 96 -54 116 41 31 -12 -136 43 116 2 -61 59 -58 -111 22 -48 34 13 180 -151 -76 -84 0 -57 -7 74 17
7344A7k2k79J81J78j78K43k4j4j18K3O4m3O6q8j44J66O9r5kJ22j42p6J78M5j22
$$ 17 -5 -284 -103 75 -103 140 116 102 -16 7 71 28 94 6 -138 28 97 2 0 122 -20 -96 82 127 5
7369EpQ9j80M2J29q5J54q4j70K20r8q3O1j55K41q3%O7j28j12J86K9J30j7j8j87
$$ 5 -2 87 -93 -51 78 -7 147 63 -107 113 15 -68 -7 -162 79 -4 -4 63 -65 -177 9 38 168 151 133 -54
7395e4O5q5K21k43M9L7N6r9Q0J52k19j01M6O4J39j53R7m5nq2K18o7R3l29J95L3
$$ -54 11 -74 147 -96 -47 -10 46 -53 27 179 -40 -141 -95 -31 108 -45 52 7 2 -80 138 71 164 -165 30 63
7421F3k3J9j25nJ92p4j28mL6M1K4P3q9l0l8P5L5J99k58p3K0L2Nk33K12k7J73R9
$$ 63 40 59 -66 -71 121 47 -81 -85 -49 -8 16 89 0 -30 -68 7 42 241 -17 -90 -70 -38 -33 -266 -54 -81 92 191
7449A91n8j93o8m2J06R7j97J0J12k7J42P3j23j00Q6K2q8K5R5O9p9P5n0L8j59Q
$$ 191 133 -60 -128 -170 -64 33 -164 -154 -42 -69 73 146 23 -77 9 31 -57 -32 63 132 53 128 78 116 -43 -35
7475c5O8O1o7k8lQ9K5j78J6J70m9k39K75l6o1j14k6J45j4Jm9J0R3mj26J44k7n
$$ -35 33 94 27 -1 -4 85 110 -68 -52 118 69 -170 105 69 8 -106 -132 13 -1 0 -49 -39 54 50 -76 68 41 36
7503C6J44j68n4n9P8r4R8o3O4r3j8K15k23K16j86K14j27j7j03J98K3j11r7J90
$$ 36 180 12 -42 -101 -23 -117 -19 -82 -18 -111 -129 86 -137 79 -107 107 -20 -37 -140 58 81 -30 -127 63
7527F3K0j11M9o5Q9Jj12J06O9k62J5J25K7m3P9k03K29Lj14J0J28k72J65j28J83
$$ 63 83 -28 21 -44 45 46 -66 40 109 -153 -138 -13 14 -29 50 -153 76 79 -35 -25 103 -169 -4 -132 51
7552E1J47j33n0j25N9n6J87j04P3r9J49K3l64K44M1J00j30l3qO0q5j33K61n3M1
$$ 51 198 65 15 -110 -51 -107 80 -24 49 -50 99 122 -242 2 43 143 13 -20 -28 32 -53 -186 75 22 63
7577F3m3l05K75M6L7l8N7j45j73K43PL9j44O6m1J18j28R0j22N5Q3J7q8P1L1N2
$$ 63 20 -285 -10 36 73 35 92 -53 -226 17 24 63 -81 -15 -56 62 -66 24 -98 -43 40 57 -31 40 71 123
7603A23j76j16K12m8QO4q9m1J06q5LL5J95j46l06K83j33P9M2N6p0M5J00p5L5o0
$$ 123 -53 -169 43 -5 3 67 -22 -63 43 -42 -39 -4 191 45 -261 22 -111 -32 10 66 -4 41 141 66 101 41
7629D1o8j08Q2M4r9J25q8K83k17j7N4K6J7p0l6N5p9P1OK5o2Rl6M8L2r4J63Nj32
$$ 41 -27 -135 -53 -9 -108 17 -71 212 -5 -22 32 58 75 5 -31 24 -55 16 22 47 -15 -6 -42 6 38 -56 107 112 -20
7658b0k8K31k19J05k28J37J93l29K28j13O9j63J21O8q4n7K06k75J71L3l8O5j04
$$ -20 -48 183 -36 69 -159 -22 171 -158 70 -43 26 -137 -16 52 -32 -89 117 -158 13 46 8 73 -31
7681c1J05K1k25K22j5Lj49k3N1m4K29j16R4j36n5J27r8L5P6j14m7Q0rkj44J36
$$ -31 74 95 -130 92 77 80 -69 -92 -41 -85 144 28 122 -14 -69 58 -40 -5 71 -43 -90 -10 -19 -21 -165 -29
7707b9pr4K21j62J57k13K38j23J7N9o4j52J88K9j75J68%J1j52LJ09O9j22l7J27
$$ -29 -36 -130 91 -71 86 -127 111 -12 5 64 0 -152 36 65 -110 58 58 69 -83 -80 29 98 -24 -61 66
7732F6o3P0K3Jm2j03l7QJ20pk72K67r3J72j65J07k6o6J26j04J8K9K0o5o5j9O1
$$ 66 3 73 96 97 55 -48 -85 -77 43 36 -236 31 -62 110 -55 52 26 -40 86 -18 0 29 49 -16 -81 -100 -39
7759c9j3J85q4n7k9m0Qj16J46M7J14j69J64r1K4o0K3r7J11N5p5r8P5n8J31J40
$$ -39 -52 133 49 -8 -37 -77 -69 -185 -39 8 122 -47 117 26 50 -10 13 -84 27 82 7 -91 -16 -74 57 197
7785A97k07m8J20J1j77J65o9Q3j45Q4j61J56m8J71n0o0k16K43N9k34J60M9j59
$$ 197 -10 -58 62 73 -104 61 -8 75 -70 14 -147 9 -39 132 82 22 -194 49 108 -126 34 83 -76
7808g6R6K3pRNL5q5j08J04p6K8N7l7q6J27R1k05J50j36J63n8J81o4o1j25M5N8
$$ -76 20 43 36 45 50 85 0 -108 -4 -80 -52 5 -32 -118 9 100 -105 45 -91 72 14 195 131 70 -55 -10 48
7835D8O0j62j49J66nQ1n9N7K4K3j77k9K41k12j2J94k45J30J3j30J16P3M9j49J4
$$ 48 108 -54 -203 -37 -42 39 -20 37 61 84 -93 -122 119 -93 -105 89 -156 -26 -13 -143 -27 46 95 -54 -40
7860d0O2l6L2r5M7L7j7P8j93J83o9pO3j14K71j25j69K00j32Q2j47J34m3kJ3K9
$$ -40 22 -14 18 -77 -30 7 -10 68 -125 58 -11 -18 45 -69 202 77 -92 108 -24 58 -89 45 2 0 13 42
7886D2j2OJ20l15O3J52j48J13n5J55L1k67K08qk79R7J69l0N0J9r8Q8m4m1n8R9
$$ 42 30 36 156 -159 -96 56 -92 21 -34 121 152 -115 93 85 -194 -97 72 42 92 111 13 101 57 16 -42 57
7912E7l6j13J47j20N8lN4Qnj63rL3J35k16K06R6j68k2l6J01O0j15L5J20l49K97
$$ 57 21 -92 55 -65 -7 -10 44 52 47 -116 -125 -92 43 -173 33 129 -39 -61 -97 4 64 -51 -16 104 -245 52
7938E2NL7j35L7k44K75j08M7J20q5k7J24k85J12k1m2J05J6j20J11L7n4M0pO1o9
$$ 52 57 94 -41 -4 -248 27 -81 -34 86 1 -26 98 -187 -75 -96 -138 -33 -17 -137 -26 11 -43 -3 -10 51 -18
7964a8r9P8J52j48m0J36q0m1m9R7Q6m7j73J85jQQ1l2j44L6L0O0m5j83P1J58k75
$$ -18 -117 -39 113 -35 -75 61 -19 -60 -109 -12 74 27 -146 39 38 46 127 95 -49 -13 17 77 32 -151 -80 78 -197
7991a97J96j44O6K3K17j67J9m7N2q5o9K38k83L02k53L8O8J80k43K40k23Q1o5m4
$$ -197 -1 -145 -79 -56 161 -6 13 -34 18 -67 -136 102 -181 121 -132 -94 -26 154 -89 151 -72 9 -56 -100
8015a00J61m4J81j99M6J16j42J06r5j06J07O4j69M7N1o0J9OK1k9k11J36K15R9
$$ -100 61 17 198 -1 45 161 19 125 30 -76 31 95 -74 -27 24 -36 -17 -11 10 -19 -230 -94 121 220
8039B20k69R1q3J03M8j47l7J71j20Ro3J14Qk0o3J53j09o1L03k84PN9p3P4p6Q1
$$ 220 -49 42 -41 62 110 -37 -74 97 -23 -14 -77 37 45 25 -38 115 6 -55 248 -36 -29 30 -43 31 -45 36
8065C6J3O5k8j19K43k66p7K05L7L8qk23J0M2o5J90j2P1j48Q7p7k06K16j04MJ74
$$ 36 49 114 86 -33 210 -56 -133 72 109 147 139 -84 -74 -32 -97 93 81 152 4 91 14 -192 24 -80 -76 98
8091I8k60J93Q0p9N1l9o9L7p9p3J42r1m8J27m1J47j65P1J1M2j01J15m4J00j15
$$ 98 -162 31 111 32 83 44 -25 12 -67 -140 2 -89 -137 -10 -51 96 -69 2 13 55 -46 69 25 125 10
8116A0k3L5q6L5mo2J98j7P9r7p2L2j01O6m1N5Q2j6o6K08k60J52m9N9l7j18R0m3
$$ 10 -13 22 -64 -29 -33 -95 103 86 165 68 -4 28 -73 -7 -48 7 89 73 7 215 -45 107 58 117 80 -38 52 9
8144IML1n4K02k12o3K09q9j49Q9l2N3o4n8KJ48J3r0K1j79L27r1o0m1J70j1j52
$$ 9 13 44 -10 192 -20 -83 126 37 -112 -23 -55 -2 -66 -124 -122 26 39 -51 -30 -209 118 27 -33 -74 96 85 -67
8171f7J72j4j53J18k42J04J55qL8j48J09r9K7m8J33o5P2j78P3n4
$$ -67 105 91 -62 56 -186 -82 73 65 103 -45 64 -35 -8 -56 77 12 84 -94 -21 -75
8191g5
$$ Imaginary data points
##PAGE= N=2
##DATA TABLE= (X++(I..I)), XYDATA
0@%%%%%%%%%%%%%%%%%%%%%%Kj0J6j6J6j6J6j7K4l1L2l3M0m7M9n6O4p0P8q7R6j06
$$ 0 0 0 0 0 0 0 0 0 0 0 0 0 0 0 0 0 0 0 0 0 0 0 2 -8 8 -8 8 -8 8 -9 15 -16 16 -17 23 -24 25 -31 33 -37 41 -46 50 -56
44e6J18j29J41j56J72j88K09k33K56k82L11l44L83m27M76n35O05o92Q01r38J129
$$ -56 62 -67 74 -82 90 -98 111 -122 134 -148 163 -181 202 -225 251 -284 321 -371 430 -508 621
65F21j404J832k609M480j7217k4035J3606J1378J9439K3136K3203R277j614n575
$$ 621 -783 1049 -1560 2920 -14297 -38332 -24726 -13348 6091 29227 52430 61707 60093 54518
79E4518o347j5258j0588m286p127r981q318n970n630q408j638j23q151r066m058
$$ 54518 48171 32913 22325 18039 10912 931 -7387 -13357 -18987 -27395 -29033 -29156 -37307 -46373 -50431
94e0431l051K530J1774K3569K5331J8085J5649Q107o767j0792o841l282p94K734
$$ -50431 -53482 -50952 -39178 -15609 9722 27807 43456 51563 44796 34004 27163 23881 23087 25821
108B5821P422J499r305r569j1892j7188j4186q629n087m776k065N288P451P123
$$ 25821 33243 34742 25437 15868 3976 -13212 -27398 -36027 -41114 -45890 -47955 -42667 -35216 -28093
122b8093J3255J3946Q285L439j23p66l612r42R334J1453Q622Q346K961p172j4954
$$ -28093 -14838 -892 7393 10832 10709 9943 6331 5389 14723 26176 34798 43144 46105 38933 23979
137B3979j5574j2023j1300o392K484K335m51L40p25k475m227j490K628J62J366
$$ 23979 8405 -3618 -14918 -21310 -18826 -16491 -16942 -16602 -17327 -19802 -24029 -25519 -22891 -22729 -21363
152b1363O914P243Q173J1084J2595J0302K989j388l871j0678j0577m808j527N05
$$ -21363 -14449 -7206 967 12051 24646 34948 37937 36549 32678 22000 11423 6615 5088 5593
166E593J651J683k266j0057j1055r107j0439n549J820O000P242P886R809Q712
$$ 5593 7244 8927 6661 -3396 -14451 -23558 -33997 -39546 -37726 -31726 -24484 -16598 -6789 1923
180A923L995M895N274Q23k69N55R01K24M64L882K871k426m337p192j1937j2923
$$ 1923 5918 10813 16087 16910 16641 17196 18097 18321 18785 22667 25538 23112 18775 11583 -354 -13277
196a3277j0329n068j243J622P034P020K569J666R65j395o48J806N921O146O008
$$ -13277 -23606 -28674 -29917 -28295 -21261 -14241 -11672 -10006 -9041 -10436 -11084 -9278 -3357 2789 8797
211H797Q640O768K539J603n44l584o757p944n754o529n532l24P96p8j81j718l268
$$ 8797 17437 24205 26744 28347 27803 24219 17462 9518 3764 -2765 -8297 -8621 -7825 -7903 -8084 -9802 -13070
228a3070o325n507j084O73L527R168J0180Q679O844M800K257j690k289j86j750
$$ -13070 -19395 -24902 -25986 -25313 -21786 -12618 -2438 6241 13085 17885 20142 18452 16163 15977 14227
243A4227j218J045P84p99j919k992m046p739q084o264o758m001J30L489N774N591
$$ 14227 13009 14054 14838 14039 12120 9128 5082 -2657 -10741 -17005 -23763 -27764 -27634 -24145 -18371 -12780
259a2780O068N696J021K68J263L12J988L974O131N957L356K589L58n158o404o757
$$ -12780 -6712 -1016 5 273 1536 1848 3836 7810 13941 19898 23254 25843 26201 21043 14639 7882
275G882p908o567m960j856m76o80J452J399j366j155j032j226K9J945N505P064
$$ 7882 -26 -6593 -11553 -13409 -13885 -14565 -13113 -11714 -13080 -14235 -15267 -16493 -16464 -14519 -9014 -1950
291a950O326Q272O671K641N41j898l375m381m408j322j141j611M29r90l238m392
$$ -1950 4376 12648 19319 21960 22501 20603 17228 12847 8439 7117 5976 4365 4794 3804 566 -3826
307c826n548n001n577l785M03K132L451O721O559N564L869K032J497k43p80J802
$$ -3826 -9374 -14375 -19952 -23737 -23334 -21202 -17751 -11030 -4471 1093 4962 6994 8491 8248 7468 9270
323I270J274K006L287K048O48k055m310m959p523p274m500l499j735R31K211K977
$$ 9270 10544 12550 15837 17885 18533 16478 12168 7209 -314 -7588 -12088 -15587 -17322 -16391 -14180 -11203
339a1203J413R84J311j045k37J714K193L883N290N853N666K735J506k63l915m687
$$ -11203 -9790 -8806 -7495 -8540 -8777 -7063 -4870 -987 4303 10156 15822 18557 20063 19800 15885 11198
355A1198m244m519k879k145n18K10j026j232j573l741l307k503j100J007K433
$$ 11198 6954 2435 -444 -2589 -3107 -2897 -3923 -5155 -6728 -10469 -13776 -16279 -17379 -16372 -13939
370a3939N171O366M925M832L841R16l52j264j072j026r41R61J344m38L8j819l923
$$ -13939 -8768 -2402 2523 7355 11196 12112 11760 10496 9424 8398 7457 8418 9762 9324 9362 7543 3620
387C620m796n554m685l393k475J078K365K694M084L187K226J070j1P66N89Q68
$$ 3620 -1176 -6730 -11415 -14808 -17283 -16205 -13840 -11146 -7062 -3875 -1649 -579 -590 176 765 1633
403A633L116L604L093L103J350n6k554m142m128m969m955k177j499l09R74N67
$$ 1633 4749 8353 11446 14549 15899 15843 13289 9147 5019 50 -4905 -7082 -8581 -8890 -7916 -7349
419g349O78o13j501p10j401j65K232L445M443M975M651M089J160l59p46k860k748
$$ -7349 -6671 -7284 -8785 -9495 -10896 -11061 -8829 -5384 -941 4034 8685 12774 13934 13575 12829 9969 7221
436G221j673j477p60p00m10k98k414k698k595m048l236j831m77J767K795M339
$$ 7221 5548 4071 3311 2611 2201 1903 -511 -3209 -5804 -9852 -13088 -14919 -15396 -13629 -10834 -6495
452f495N033L001K713J384j55k54k76P07J610J225K536J419m55j455l108m268
$$ -6495 -1462 1539 4252 5636 5481 5227 4951 5658 7268 8493 11029 12448 11993 10538 7430 3162
468C162m322m647l018j888j126R65J204J258J761Q82N56o9j94R40J791K380M082
$$ 3162 -1160 -5807 -8825 -10713 -11839 -10874 -9670 -8412 -6651 -5769 -5213 -5282 -5476 -4536 -2745 -365 3717
485C717M264L634K769O24j025k640l830k963k940k251l48n27p04o56j825j868
$$ 3717 7981 11615 14384 15008 13983 11343 7513 4550 1610 -641 -989 -1516 -2220 -2876 -4701 -6569
501f569k409k372q40n17O04K555L197M085M165L274L053R94l01p3j609j006K02
$$ -6569 -8978 -11350 -12190 -12707 -12103 -9548 -6351 -2266 1899 5173 8226 9220 8919 8846 7237 6231 6433
518F433L58J146M07p10j390l249m477l996l756k520p54N42J926J575K161K190
$$ 6433 6791 7937 8344 7634 6244 2995 -1482 -5478 -9234 -11754 -12508 -11966 -10040 -8465 -6304 -4114
534d114Q42Q09J138O12J258J486J662K856J990K283J796m19j222k433l635l828
$$ -4114 -3272 -2463 -1325 -713 545 2031 3693 6549 8539 10822 12618 12199 10977 8544 4909 1081
550A081l470k087n82l31O70M98p70j032j880j375n57K28K090L079K877L602K953
$$ 1081 -2389 -4476 -5058 -5389 -4719 -4221 -4991 -6023 -7903 -9278 -9835 -9607 -7517 -4438 -1561 2041 4994
567D994K198J832K14k36p10j848j052q85j042P4k25n38r97k500k581l159l184
$$ 4994 7192 9024 9238 9002 8292 6444 5392 4507 3465 3539 3314 2776 1779 -721 -3302 -6461 -9645
584i645j703j35Q73K763K840K851K127R71O99J14M1R92J084J423J671R89Q58k6
$$ -9645 -11348 -11483 -10610 -7847 -5007 -2156 -29 942 1641 1755 1796 2788 3872 5295 6966 7955 8813 8787
602H787j441j123k715l066k696k557j909n94J55J202R19O95P66o48o05r5p3J696
$$ 8787 7346 6223 3508 442 -2254 -4811 -6720 -7314 -7159 -5957 -5038 -4343 -3577 -4225 -4830 -4925 -4998 -3302
620c302K424K896L527K083J333O49j446j567j585j765r40j272q06j46j176n35
$$ -3302 -878 2018 5545 7628 8961 9610 8164 6597 5012 3247 2307 1035 229 83 -1093 -1628
636a628o94j501j321j476j565j54r8J364K830K346L190K599J200M44p15m87l95
$$ -1628 -2322 -3823 -5144 -6620 -8185 -8339 -8437 -7073 -4243 -1897 1293 3892 5092 5536 4821 4334 3939
653C939k69P63J043M36N02r54j768k155k966k440j936j551n37M52M33J424J387
$$ 3939 3670 4433 5476 5912 6414 5460 3692 1537 -1429 -3869 -5805 -7356 -7893 -7441 -7008 -5584 -4197
670d197J159J312K61Q13L86M8J021J687J757K294J545R83l87j570j823l017k562
$$ -4197 -3038 -1726 -1465 -652 -266 -218 803 2490 4247 6541 8086 9069 8682 7112 5289 2272 -290
687b90j437j005o31K91l84j95n58r16n49p36k76P66R22K023K092K552K622J410
$$ -290 -1727 -2732 -3363 -3072 -3456 -3651 -4209 -5125 -5674 -6410 -6686 -5920 -4998 -2975 -883 1669 4291 5701
705E701R72N49p18r24r93j116l66k57j07K44j080j164j840k531k191j594q84K16
$$ 5701 6673 7222 6504 5580 4587 3471 3105 2848 2741 2985 1905 741 -1099 -3630 -5821 -7415 -8299 -8083
723h083Q74J538K015J451J639J033N57P81J19N96J090N83J127J185M89O9o60j659
$$ -8083 -7209 -5671 -3656 -2205 -566 467 1024 1805 1924 2520 3610 4193 5320 6505 6994 7063 6403 4744
741D744j903k576k446j621j337j7R3N99O18j54r9k71m37M99N03J305K288K015
$$ 4744 2841 265 -2181 -3802 -5139 -5156 -5063 -4464 -3846 -4000 -4099 -4370 -4807 -4308 -3805 -2500 -212 1803
759A803K074J662J047N59l85j311o79j265j401o41q06j37k27j015o65j365j488
$$ 1803 3877 5539 6586 7145 6760 5449 4770 3505 2104 1463 657 520 293 -722 -1387 -2752 -4240
776d240j383j047m68N02J004K218J884J634J761P83K04M41m43K01L36M10Q06L85
$$ -4240 -5623 -6670 -7138 -6636 -5632 -3414 -1530 104 1865 2648 2852 3293 2850 3051 3387 3797 4603 4988
794D988j21l01j146j539j713k199j608j156q09L81K63Q62J224J74O61K32j88L94
$$ 4988 4867 4566 3420 1881 168 -2031 -3639 -4795 -5604 -5223 -4960 -4098 -2874 -2700 -2039 -1807 -1995 -1601
812a601O07R74J566J371J624R99L27M3j026j153j453j496j148n18q50j5j38k82
$$ -1601 -994 -20 1546 2917 4541 5540 5867 5910 4884 3731 2278 782 -366 -884 -1734 -1749 -1887 -2169
830b169l50p76o03n66n24L56Q33J026K191J522J447J356J95L50m53o42j56l77
$$ -2169 -2519 -3295 -3898 -4464 -4988 -4632 -3799 -2773 -582 940 2387 3743 3938 4288 3835 3193 3037 2660
848B660m52L68j78k30l56j184j299j429j767p10o86j07P92Q08J303J304N74R63
$$ 2660 2208 2576 2398 2168 1812 628 -671 -2100 -3867 -4577 -5263 -5370 -4578 -3770 -2467 -1163 -589 374
866C74J73L84K05J74P41Q67O28R52M11l09l46j386j528j453j651r60m53m37O25
$$ 374 547 931 1136 1310 2051 2918 3546 4498 4909 4600 4254 2868 1340 -113 -1764 -2724 -3177 -3614 -2989
885b989k0J66K41k59P1p8n9Q06N76J561J685J244J237Q51j52j96p07j267o32q87
$$ -2989 -3009 -2843 -2602 -2861 -2790 -2868 -2927 -2121 -1545 16 1701 2945 4182 5033 4881 4685 3978 2711 2079 1192
905A192m40l14l41k94n37r21q26j229q12n03o8M58J135J122J582J181J156P13
$$ 1192 752 438 97 -197 -734 -1655 -2481 -3710 -4522 -5025 -5093 -4635 -3500 -2378 -796 385 1541 2254
923B254J87K53K04k83M08K60J82O12l25l86r17j594j371j354j629n34l99L0L99
$$ 2254 2441 2694 2898 2615 3023 3283 3465 4077 3752 3366 2449 855 -516 -1870 -3499 -4033 -4432 -4402 -4003
942d003P32N76M61J15M15J83L33Q85P05J284J333Q68R44L94m49n13j122j306p65
$$ -4003 -3271 -2695 -2234 -2119 -1704 -1521 -1188 -303 402 1686 3019 3887 4831 5225 4776 4263 3141 1835 1070
961A070j088p47k10n28L7n08p61k45p60m49n9K1Q79J137J195J672J061R22O08
$$ 1070 -18 -765 -975 -1503 -1466 -1974 -2735 -2980 -3740 -4189 -4248 -4227 -3348 -2211 -1016 656 1717 2639 3247
980C247o2K21k93l75J39p7k51K49n11n99q48j252j361j118q55l85m03M23Q92M95
$$ 3247 3185 3406 3113 2738 2877 2800 2549 2798 2287 1688 840 -412 -1773 -2891 -3746 -4131 -4534 -4111 -3219 -2724
1000b724R77P00L39M78J74M17M56M92J026R69L82O08j35o38n97j188j209j009
$$ -2724 -1747 -1047 -708 -230 -56 361 817 1309 2335 3304 3686 4294 4159 3521 2924 1736 527 -482
1018d82r57l78l14q8L4j49j56q7l77J58K5J49R13R14J354J324P97Q14N3l53k4
$$ -482 -1439 -1817 -2131 -2219 -2185 -2334 -2490 -2577 -2954 -2796 -2771 -2622 -1709 -795 559 1883 2680 3494 3547 3194 3170
1039C170q99m27l86l38q1j14l98m38p02j197o10p52m09k3r3R50P40J101P92O62
$$ 3170 2271 1844 1458 1120 1039 925 527 89 -613 -1810 -2420 -3172 -3581 -3604 -3697 -2747 -2007 -906 -114 548
1059E48K36P34j61J93%K19O31J19L11J76m28p26o83j281r76j058n24L8n5K38N25
$$ 548 784 1518 1357 1550 1550 1769 2400 2519 2830 3006 2578 1852 1169 -112 -1088 -2146 -2670 -2632 -2687 -2449 -1924
1080a924r2L10O5Q1N24J71K02R74N56J004Q16M62L51l06n23m21r97p22o58m66
$$ -1924 -2016 -1706 -1641 -1560 -1036 -865 -663 311 867 1871 2687 3149 3500 3194 2671 2250 1253 531 -127 -593
1100e93j06n8m19m8o45k65n02m55oK94N23J189Q56O92J191Q9O98kl91K42k94k54
$$ -593 -699 -757 -1176 -1224 -1869 -2134 -2636 -3091 -3097 -2803 -2280 -1091 -235 457 1648 1737 2435 2433 2042 2284 1990 1736
1122A736K75k60j04j81n00o05q21j116n93q63l22K72J69N99P83K73Q25n1M00L59
$$ 1736 2011 1751 1647 1466 966 361 -460 -1576 -2169 -3032 -3354 -3082 -2913 -2314 -1531 -1258 -433 -484 -84 275
1142B75J57N98M17N73N86N22L2j31m21o24q53j055o05o90n59P4m01J27Oo5j38
$$ 275 432 1030 1447 2020 2606 3128 3160 3029 2608 1984 1131 76 -529 -1219 -1778 -1704 -2105 -1978 -1972 -2037 -2175
1163b175j26k37K39N83N37J030R44R97N59K64K69j89j83j79n56l25R1m95k42k83
$$ -2175 -2301 -2538 -2299 -1716 -1179 -149 795 1792 2351 2615 2884 2695 2512 2333 1777 1452 1543 1048 806 523
1183E23o18o96p15n95m87n88j06L03L65P32R70N68N56K37K57K69J26K57M66L73
$$ 523 -95 -791 -1506 -2101 -2588 -3176 -3282 -2979 -2614 -1882 -912 -344 212 449 706 975 1101 1358 1824 2197
1203B197M60J03Mk49o72o04q34j022m51p62o8p1k80K60K58k7J18M5l2N63K41O86
$$ 2197 2657 2760 2764 2515 1843 1239 405 -617 -1068 -1830 -1898 -1969 -2249 -1989 -1731 -1758 -1640 -1595 -1627 -1064 -823 -137
1225a37O71P22Q01N26J34q2k12n51m41n45l58K1l91k06l21k93n36m61l82l35q7
$$ -137 534 1256 2057 2583 2717 2635 2423 1872 1431 886 528 549 158 -48 -369 -662 -1198 -1659 -2041 -2376 -2463
1246b463R6K64N10P78P38L99N07L94Q2L4j22K33K2N4J35L0j26l56n29m44r15q12
$$ -2463 -2367 -2103 -1593 -815 -77 322 829 1223 1305 1339 1217 1450 1472 1526 1661 1691 1565 1209 680 236 -679 -1491
1268a491r3m78K7K06J55L98K18K50J85P2J19L66J10O50N05K83O58l5j7j70n52
$$ -1491 -1584 -2062 -2035 -1829 -1674 -1276 -1058 -808 -623 -551 -432 -66 44 694 1199 1482 2140 2105 2088 1918 1366
1289A366n10n57l56l62k64j62J17j71j01j51m13n5j22Q4K93O33L40P73N71K91
$$ 1366 856 299 -57 -419 -683 -845 -728 -899 -1000 -1151 -1564 -1619 -1741 -1657 -1364 -731 -391 382 953 1244
1309A244M39n5M2k73j03j34n15L33j32n29Q9m87n36l83o29l47j4k08M83J83N83
$$ 1244 1683 1628 1670 1397 1294 1160 645 978 846 317 406 -81 -617 -1000 -1629 -1976 -1990 -2198 -1715 -1532 -949
1330i49M38M10K84L13M6J77L11j2N17O8K41J45j14k60m86p45n37m67n62j77j55
$$ -949 -511 -101 183 496 542 719 1030 1018 1535 1603 1844 1989 1875 1615 1129 384 -153 -620 -1182 -1359 -1514
1351a514o0J7P8K56l1m1J71J48K53N50L45P44L76M23L55J4o1j30m47l90k84n13
$$ -1514 -1574 -1557 -1479 -1223 -1254 -1295 -1124 -976 -723 -173 172 916 1292 1715 2070 2084 2023 1893 1446 1056 772 259
1373B59K8m14l80L6l49k21n11n80k2r2J59O18L54N44O26L50M21J46K17J49J93
$$ 259 287 -127 -507 -471 -820 -1041 -1552 -2132 -2154 -2246 -2087 -1469 -1115 -571 55 405 826 972 1189 1338 1531
1394A531j62L60l52L32j35k57l00n60p36m74m67m38Ml81K66J60K6N30j3R9K30
$$ 1531 1369 1729 1377 1709 1574 1317 1017 457 -279 -753 -1220 -1658 -1654 -2035 -1769 -1609 -1583 -1053 -1066 -967 -737
1415g37L14L62K41M31O42L48K26L69l15k1l82m65l39l89n31J3k94j71j21l00k29
$$ -737 -423 -61 180 611 1253 1601 1827 2196 1881 1860 1478 1013 674 285 -246 -233 -527 -698 -819 -1119 -1348
1436a348k97k12K76k34K61O35L35O80K91M58N31j66J36J1k70J69J4j71J40k49
$$ -1348 -1645 -1857 -1581 -1815 -1554 -919 -584 96 387 845 1376 1210 1346 1357 1087 1256 1270 1099 1239 990
1456I90k54j4r06m09j37q18j11l0J01K65M4K94L14J25M50J63jK79K06K51M33P2
$$ 990 736 722 -184 -593 -730 -1548 -1659 -1689 -1588 -1323 -1279 -985 -671 -546 -96 67 66 345 551 802 1235 1307
1478A307L01K04m69Qp97k69l91k10m44J06k34K10j05k80j13J90j30J14LM51L37
$$ 1307 1608 1812 1343 1351 554 285 -106 -316 -760 -654 -888 -678 -783 -1063 -1176 -986 -1116 -1002 -999 -548 -211
1499b11J74M64N92K04J76j36j6j82k42j91j15j59j32J03n40J44n55j40m42l26
$$ -211 -37 427 1019 1223 1399 1263 1247 1065 823 632 517 358 226 329 -211 -67 -622 -762 -1204 -1530
1519a530J27j20L57L90K84L70M70K4J25J06j00M41k35K60J51n6rj31k61k46m44
$$ -1530 -1403 -1523 -1166 -776 -492 -122 348 372 497 603 503 944 709 969 1120 1064 1055 924 663 417 -27
1540b7l22l65k39k03m6n5M01n9R2J88j19M06K41L7L44M34J59L50J42J97k06j79
$$ -27 -349 -714 -953 -1156 -1202 -1257 -856 -915 -823 -635 -754 -348 -107 -70 274 708 867 1217 1359 1556 1350 1171
1562A171j44l86k83l95l34J46j55k03j36k40j91m9q2l9R1K89J25O74K17N40K91
$$ 1171 1027 641 358 -37 -371 -225 -380 -583 -719 -959 -1150 -1199 -1281 -1320 -1229 -940 -815 -141 76 616 907
1583I07J72J09o3n3J06j33rj13k30J12n30p5m95n03j46m65j87J89r8J76M84P1
$$ 907 1079 1188 1125 1072 1178 1045 1036 923 693 805 275 200 -295 -798 -944 -1409 -1596 -1407 -1505 -1329 -845 -774
1605g74M26R1J44K30K20K38M87j34K43K51P1J01k92l25j64o30k63k15l93j15l3
$$ -774 -348 -257 -113 117 337 575 1062 928 1171 1422 1493 1594 1302 977 813 183 -80 -295 -688 -803 -836
1626h36k47M4Qk68O2n4O0N52o1L88N20O12K21J98J61L6l40N2j36k91Q3k01j73
$$ -836 -1083 -1039 -1031 -1299 -1237 -1291 -1231 -679 -740 -352 168 780 1001 1199 1360 1396 1056 1108 972 681 764 563 390
1649C90o0l36l49j67n80r7l11J56O1K7K74L67J90L33J88k5L67P7K67J37P3J79
$$ 390 330 -6 -355 -522 -1102 -1199 -1510 -1354 -1293 -1266 -992 -625 -435 -102 86 61 428 505 772 909 982 1161
1671A161K7r3O2j72l01m88k71k65l49k83J35rj37P2J6K7O7O1P9K63J98M68J74
$$ 1161 1188 1095 1157 985 684 196 -75 -340 -689 -972 -837 -846 -983 -911 -895 -868 -801 -740 -661 -398 -200 268 442
1694D42K69L30q6K05P6l98j59k03j24M4l58m2j53k94P2l59j13j71j04J20N3O4
$$ 442 711 1041 955 1160 1236 838 679 476 352 396 38 -4 -157 -451 -379 -738 -851 -1022 -1126 -1006 -953 -889
1716h89N12J70J21N59j33K25Rl8J36J39j14J21j24j67j08j80k58j55l58j36j63
$$ -889 -377 -207 -86 473 340 565 574 536 672 811 697 818 694 527 419 239 -19 -174 -532 -668 -831
1737h31j8J24q3J60K30l1L51Jm7K08j04M09K80j47L53J05q6R1m07j53j77l05j91
$$ -831 -849 -725 -808 -648 -418 -449 -98 -97 -144 64 -40 369 649 502 855 960 874 965 558 405 228 -77 -268
1760b68m6p6j40M8k06K07k05p8O7j43L27K93J2M36J68L12K2J02N5k8l75o5J2j40
$$ -268 -314 -390 -530 -482 -688 -481 -686 -764 -697 -840 -513 -220 -208 228 396 708 730 832 887 859 484 419 431 291
1784B91R7j38j4l17n07R2m55kJ38j46r3J75M57J9K52O2M26j12K33J65r3J89K30
$$ 291 388 250 236 -81 -588 -496 -951 -953 -815 -961 -1054 -879 -422 -403 -151 -89 337 225 458 623 530 719 949
1807I49P8J7j22o3k36l78l08k45k86r9j17j35K06r3J72J11O0j59l0J87M00J93
$$ 949 1027 1044 922 859 623 245 -63 -308 -594 -693 -810 -945 -739 -832 -660 -549 -489 -648 -678 -491 -91 102
1829A02K20L38k2L79R4j49J65k62k77N9l42j08j01l72J92m59J9k34k38m4P0j30
$$ 102 322 660 638 1017 1111 962 1127 865 588 647 305 197 96 -276 -84 -543 -524 -758 -996 -1040 -970 -1100
1851a100J56L55J94L32K00O4L75nO7J14P8p0j14J42rm8j22j69l92k28l28k42j18
$$ -1100 -944 -589 -395 -63 137 201 576 571 638 752 830 760 646 788 779 731 609 440 48 -180 -508 -750 -868
1874h68J98k76L8J58K2J80j58L10j5L02J28J05K54L96M1J92k39M6p0j30o2l86
$$ -868 -670 -946 -908 -750 -728 -548 -706 -396 -411 -109 19 124 378 774 815 1007 768 814 744 614 552 166
1896A66k4j92m6j79O7k34m14K18j7q8O2q0K67P9K24L73j0L90L8j13Q6J01k37L33
$$ 166 142 -50 -96 -275 -208 -442 -856 -638 -655 -743 -681 -761 -494 -415 -191 182 172 562 600 487 573 674 437 770
1920G70l08L1L0j78j20k02k44m5j40k92K4n5O7kK32M4K7J82K61n7J64K90k0K0
$$ 770 462 493 523 345 225 23 -221 -266 -406 -698 -674 -729 -662 -664 -432 -388 -361 -179 82 25 189 479 459 479
1944D79J93o8K99k44j32j1k59j66l18j13K5j25J8j63n0K16q4n9K41n1M00n1J91
$$ 479 672 604 903 659 527 516 257 91 -227 -340 -315 -440 -422 -585 -635 -419 -503 -562 -321 -372 28 -23 168
1967A68J87J65J29m6J25j15J8k99l6k7j77l05M2k6L1k44k20K19l02J53J64j64
$$ 168 355 520 649 603 728 613 631 332 296 269 92 -213 -171 -197 -166 -410 -630 -411 -713 -560 -396 -560
1989e60L22M9O0L92R1m8N9K5K34j31J48o9K7j56J3l42M3j46k69J7l04j94J53j53
$$ -560 -238 -189 -129 263 354 306 365 390 624 493 641 572 599 443 456 114 157 11 -258 -241 -545 -739 -586 -739
2013g39K27Kj41L06Q6K29n5J40J09J30J45K51J26j7L1m57K01j83k33j64j59j22
$$ -739 -512 -510 -651 -345 -259 -30 -85 55 164 294 439 690 816 799 830 373 574 391 158 -6 -165 -287
2035b87J55k35m5j04k02N6q2j7J37J44L80J06j12K87L39J02J4J30j19J37j64k38
$$ -287 -132 -367 -412 -516 -718 -662 -744 -761 -624 -480 -100 6 -106 181 520 622 636 766 647 784 620 382
2057C82K06k26j45J16m87q0q6k92l9j3q5J34j51J88M2L85M1J84J9J49q0K89J31
$$ 382 588 362 217 333 -154 -234 -320 -612 -651 -664 -749 -615 -766 -578 -536 -151 -110 74 93 242 162 451 582
2080E82q8K45J04k21J30j96k61j2l03j20k1k34m1j50Q8j84M9J8K31j17O1M6J22
$$ 582 494 739 843 622 752 556 295 283 -20 -140 -161 -395 -436 -586 -498 -682 -633 -615 -384 -501 -440 -394 -272
2103b72K22K58J49J56rJ49j02p5J47k3j92J0j88j95r3k02N6k29Q0n4l14JK98n2
$$ -272 -50 208 357 513 504 653 551 476 623 600 408 418 230 35 -58 -260 -204 -433 -353 -407 -721 -720 -422 -474
2127d74J46O2N8L38l4L8L18j95jK48r3N6R3j02j01L4k29k24j0j26k50O1QN6p9
$$ -474 -328 -266 -208 130 96 134 452 257 256 504 411 467 560 458 357 391 162 -62 -72 -198 -448 -387 -379 -323 -402
2152d02K4OR5L6m5J51J29M7K07J01j0j7j15K40k61J01j62K5j07J30l19J21j55
$$ -402 -378 -372 -277 -241 -286 -135 -6 41 248 349 339 322 207 447 186 287 125 150 43 173 -146 -25 -180
2175a80J62k14k37N8J73q6r5K23K08p1N6K29P8j04L11k26k5P4k46J71P1k33pP5
$$ -180 -18 -232 -469 -411 -238 -324 -419 -196 12 -59 -3 226 304 200 511 285 260 334 88 259 330 97 90 165
2199A65j93j19m6j18J3Q7%k2M7k0O0rJ95j1k2J70J37N2N0o4o5l7P0j74j65N6m
$$ 165 -28 -147 -193 -311 -298 -211 -211 -233 -186 -206 -146 -155 40 29 7 177 314 366 416 352 287 250 320 146 -19 37 33
2226C3j92q5l9L2l2j49j27L19N6k51J86P5J69R9J16No7K54j08J45L5j66j75J58
$$ 33 -159 -244 -283 -251 -283 -432 -559 -240 -184 -435 -249 -174 -5 94 210 215 148 402 294 439 474 308 133 291
2250B91k12R0K7l15l0j01p7O9k57J13j08P6J08q3K10M9M8J91J96n6J14j3K08j96
$$ 291 79 169 196 -119 -149 -250 -327 -258 -515 -402 -510 -434 -326 -409 -199 -150 -102 89 285 229 343 330 538 342
2274C42nK01j15k27p0R2j87j26m8k29j07O3Qnk1J00n7l1K98k7M3K15j22K64J21
$$ 342 337 538 423 196 126 218 31 -95 -143 -372 -479 -416 -408 -413 -434 -334 -391 -422 -124 -151 -108 107 -15 249 370
2299C70L8P1p2J3n4q7n3j0j90q2p4r3N3p2j11k3N7P3j32J4J61r3Q0J97K01M3p5
$$ 370 408 479 407 420 366 279 226 216 26 -56 -130 -223 -170 -242 -353 -376 -319 -246 -378 -364 -203 -296 -216 -19 182 225 150
2326A50n2K24j26J40P3j86M2P2j49j1j04j70K4j11k51Q7j11Q6L1J44L0k03K68
$$ 150 98 322 196 336 409 223 265 337 188 177 73 -97 -73 -184 -435 -348 -459 -373 -342 -198 -168 -371 -103
2349a03J9j50P8J59J96J02j72J28o2J27p4N2j68O1j65n2jj71j15J28j6o6m4O1
$$ -103 -84 -234 -156 3 199 301 129 257 195 322 248 300 132 193 28 -24 -25 -196 -311 -183 -199 -265 -309 -248
2373b48n4P3pK32o8o9K41K6k6l9J66JoJ0m2k13J4QQ4j51Q0k27M7p1K26j90J4O9
$$ -248 -302 -229 -236 -4 -72 -141 100 126 100 61 227 228 222 232 190 -23 -9 -1 83 -68 12 -215 -168 -239 -13 -203 -189 -120
2401a20j25L39k98K38P7N6Q5j3r8n7J36J2J28k71N9q0k44R1J10j69o8O9j33R7
$$ -120 -245 94 -204 34 111 167 252 239 141 84 220 232 360 89 148 68 -176 -85 25 -144 -212 -143 -276 -179
2425a79J56j51J22l9n0J31K7O6J64j83J97j03l1R8k0o6k2j60J06k85nK37j10j47
$$ -179 -23 -174 -52 -91 -141 -10 17 83 247 64 261 158 127 225 205 139 117 -43 63 -222 -227 10 -100 -247
2449b47P6n5o7O0J4J12j12K42k7J78p3R0m0l3K9l1J08j53J94j1j78n8L1o5j22
$$ -247 -171 -226 -293 -233 -219 -107 -219 23 -4 174 101 191 151 118 147 116 224 71 265 254 76 18 49 -16 -138
2474a38O0k72K25r4j00j15L27j6j25qJ93k7K66r8k7O2rO9J14J03j26k20M6Q8q2
$$ -138 -78 -350 -125 -219 -319 -434 -107 -123 -248 -256 -63 -90 176 78 51 113 104 173 287 390 264 44 90 178 96
2499I6j45M1k70J41R9k32n2q9J63N9p3k4o7K02J72q0J80J04k8L2PK8M1K1j23K9
$$ 96 -49 -8 -278 -137 -38 -270 -322 -411 -248 -189 -262 -286 -353 -151 21 -59 121 225 197 229 236 264 305 326 203 232
2525B32k38K17r3j07m7j59o5n8N0o2P0n0PK54j48J83Kj08K05m8m6J81O2p0J01
$$ 232 -6 211 118 11 -36 -195 -260 -318 -268 -330 -260 -310 -303 -49 -197 -14 -12 -120 85 37 -9 172 234 164 265
2550B65r2O3l4j20n0J91k39j00n7R4j27q6J15m9O7l6j50J20O1P3J35O0K6K7k21
$$ 265 173 236 202 82 32 223 -16 -116 -173 -79 -206 -292 -177 -226 -159 -195 -345 -225 -164 -91 44 104 130 157 -64
2575f4J63L4j30J78nJ1P0k63M1k1k24K79j40j95J50j46J71n4K2J23J2j74K21j51
$$ -64 99 133 3 181 176 187 257 -6 35 14 -210 69 -71 -266 -116 -262 -91 -145 -123 0 12 -162 59 -92
2599i2n1J48J02j32K69k88L44j11j54J25j75K04j94J9j28J62q2n1p0J13r9k6N9
$$ -92 -143 5 107 -25 244 -44 300 189 35 160 -15 189 -5 14 -114 48 -34 -85 -155 -42 -141 -167 -108
2622a08m4j6L2L98j36j21J04j05K01p4K2j74L9o9O9J69k98J03q1m8J3O1K2M1j30
$$ -108 -152 -168 -136 262 126 5 109 4 205 131 153 -21 18 -51 18 187 -111 -8 -89 -137 -124 -63 -41 0 -130
2647a30Q1O8NP4Q4j02N3n4Po1J65j08m7o4o6J88k36J06n2k1N2q9q3k4mL1L46n3
$$ -130 -49 19 24 98 182 80 133 79 86 25 190 82 35 -29 -95 93 -143 -37 -89 -110 -58 -147 -230 -254 -258 -227 119 66
2675F6j01J24M7M3K6j7m2k0p3R6p4J25j25L4k7k5l30L48k42q0J74j00r0P7J57
$$ 66 -35 89 136 179 205 188 146 126 53 149 75 200 75 109 82 57 -273 75 -167 -247 -73 -173 -263 -186 -29
2700b9k26M7K74k28J71l2m9P8K82k07RJ47j29L0J6q1k6j86L29k37j5j9O5j53O1
$$ -29 -255 -208 66 -162 9 -23 -72 6 288 81 90 237 108 138 154 73 47 -139 190 -47 -62 -81 -16 -169 -108
2725a08j87MJ00KR9j5j14K45m1L2J83r9K37r2j20J1L4m0j28J21O4m0p2q4o7j17
$$ -108 -295 -291 -191 -189 -90 -105 -219 26 -15 17 200 101 338 246 126 137 171 131 3 124 188 148 76 -8 -75 -192
2751a92K13j92O9N9j40K28k60K8K20j32Q4J2J20Lm6J2JO1R3j5N1j95J91k64K8
$$ -192 21 -171 -102 -43 -183 45 -215 -187 33 -99 -15 -3 117 120 74 86 87 148 241 226 277 82 273 9 37
2776C7J5j64J84j59R0M2j87k08J50K5J39r3R9N1n7K4L3j93L30k55L4J03oN6m6
$$ 37 52 -112 72 -87 3 45 -142 -350 -200 -175 -36 -129 -30 21 -36 -12 21 -172 158 -97 -63 40 34 90 44
2801D4J4J3J62l00J27K6j66J55k90J27M2o6P3M5N1L8J2k87K85j29m7K17p1K12
$$ 44 58 71 233 -67 60 86 -80 75 -215 -88 -46 -112 -39 6 57 95 107 -180 105 -24 -71 146 75 287
2825B87k21l0Q0L1r2Nj83Q1L9O9o1k53O2K02j1KLj30R9k7L5K76j86R2p4j17J13
$$ 287 66 36 116 147 55 60 -123 -42 -3 66 5 -248 -186 16 5 7 10 -120 -21 -48 -13 263 77 169 95 -22 91
2852I1k41L00j47j9j41J18k25K19j15J27M0j20Ol8r7K97O8q4J11o4k1l3j02K07
$$ 91 -150 150 3 -16 -157 -39 -264 -45 -160 -33 7 -113 -107 -145 -242 55 123 39 150 86 65 32 -70 137
2876A37Lk15K04o4j92R7rj27K9KK39k64P5p4J45j50K04j75K72j88R0m0OJR5K8
$$ 137 140 -75 129 65 -127 -30 -39 -166 -137 -135 104 -160 -85 -159 -14 -164 40 -135 137 -51 39 -1 5 6 101 129
2902A29J9L9m8J35k05l8j04Q3k8j9j35J84n7j41J66j53K3J62k42K85l6l0j27J89
$$ 129 148 187 139 274 69 31 -73 10 -18 -37 -172 12 -45 -186 -20 -173 -150 12 -230 55 19 -11 -138 51
2926E1P8j42M2l4l6Q3N1j2n4K5KMoj68JN3j46J42Mj26J5l8K30j46J0J55n6j72
$$ 51 129 -13 29 -5 -41 42 93 81 27 52 54 58 52 -116 -115 -62 -208 -66 -62 -188 -173 -211 19 -127 -117 38 -18 -190
2954a90K86n8J43k14M0J47o3N6j22J08N9j50p5l8J37j88J74o7n1j21J88j53J76
$$ -190 96 38 181 -33 7 154 91 147 25 133 192 42 -33 -71 66 -122 52 -15 -66 -187 1 -152 24
2977B4o1Jj22R8Q3j28K42n4J1M9J28k30K6Q5l0R2l08J50k54J94P2k00R4j16q7
$$ 24 -37 -36 -158 -60 23 -105 137 83 94 143 271 41 67 152 122 214 -94 56 -198 -4 68 -132 -38 -154 -241
3002b41K69j12q6J47n0L2j40J95j9r8j3Q8J28j88J99P0r5Q7j83O1l1M2l0l7k1
$$ -241 28 -84 -170 -23 -73 -41 -181 14 -5 -103 -116 -28 100 -88 111 181 86 173 -10 51 20 62 32 -5 -26
3027b6r8l4J03N7on5K4J68j78r5L4M8J06J05j98Q5l4p3O7N2j51K1J31q4p7J31
$$ -26 -124 -158 -55 2 -4 -59 -35 133 -45 -140 -106 -58 48 153 -45 40 6 -67 0 52 -99 -78 53 -31 -108 23
3053B3K0Kj5k1k9q3O0r0R6J03j37n9L38j47Pq0k47J55J80k7r0J2j60J33J11k4
$$ 23 43 45 30 9 -20 -103 -43 -133 -37 66 -71 -130 208 61 68 -12 -259 -104 76 49 -41 -29 -189 -56 55 31
3079C1o9J05j11jK07k35P3j30J01O3k47J68R1j54J30Q4j68Q4J06r6l6L4j6P7j02
$$ 31 -38 67 -44 -45 162 -73 0 -130 -29 34 -213 -45 46 -108 22 106 -62 22 128 32 -4 30 14 91 -11
3104a1o6J89k83K00j22mJ13K29l84J38L3j6k3P3J97k90K33k52K17k46J45k41J06
$$ -11 -77 112 -171 29 -93 -97 16 245 -139 -1 32 16 -7 66 263 -27 206 -46 171 -75 70 -171 -65
3127f5J59j26j47R6j06K50j81M0j0j46J89J0q2K9J48n3L6q4pN8P2J09j54j19J77
$$ -65 94 -32 -179 -83 -189 61 -120 -80 -90 -236 -47 -37 -119 -90 58 5 41 -43 -50 8 80 189 35 -84 93
3152I3j4L0j02K42j49ml2Pj33n4J99j46p5J48j80J66j60J85j14oL3NK54j36k4
$$ 93 79 109 7 249 100 96 64 71 -62 -116 83 -63 -138 10 -170 -4 -164 21 -93 -99 -66 -61 193 57 33
3177C3L8o7L1P7j84K67k42J14o5k1m8R0q9k1j04P4pM7Q2j99J27J8k1J62n9r3J84
$$ 33 71 4 35 112 -72 195 -47 67 2 -19 -67 23 -66 -87 -191 -117 -124 -77 5 -194 -67 -49 -70 92 33 -60 124
3204A24j03J9J37J18j12j62J62j75qj1j8q6j2J83Qj1q3r2K49j10p8O4j45Q7N8
$$ 124 21 40 177 295 183 21 183 8 0 -11 -29 -115 -127 56 64 53 -30 -122 127 17 -61 3 -142 -55 3
3229CJ09j73P5J5M7j0k0N2l9J08lj47J51j21K4j5l3j62J54N8k70K0j0K36q8J7
$$ 3 112 -61 14 29 76 66 46 98 59 167 164 17 168 47 71 56 23 -139 15 73 -197 -177 -187 49 -39 -22
3255b2J00j25m0m8K54j72ML5L4Q3m2J7L7k05L7K95k73Q2K2k44J45M5m7L0O8j05
$$ -22 78 -47 -87 -135 119 -53 -49 -14 20 103 61 78 115 -90 -53 242 -31 51 73 -171 -26 19 -28 2 70 -35
3281c5j13J72J09n1p6R0k33J73J6Rp0j25M7NP1N5J57k54km1jK27m23L23Q4j76
$$ -35 -148 24 133 82 6 96 -137 36 52 61 -9 -134 -87 -82 -11 44 201 -53 -55 -96 -97 130 -293 30 114 -62
3307f2N5m1OJ48q0j37J1J81j88N8j0J22N6m5j3k08PK43j34r7J84k80J76j2rJ6
$$ -62 -7 -48 -42 106 26 -111 -100 81 -107 -49 -59 63 119 74 61 -147 -140 103 -31 -128 56 -224 -48 -60 -69 -53
3333e3N0N0k9J2n3J83mj73nK2J17j93l1N1R6o7N1r7KO0M3K0q6m7R0l4jn0O6O0
$$ -53 -3 47 18 30 -23 160 156 -17 -22 0 117 -76 -107 -56 40 -27 24 -73 -71 -11 32 52 -34 -81 9 -25 -26 -76 -10 50
3363E0k03J36j8n0R2LN3K03j26r6o1pk7J90j99kM4k8Kr2M6P5j67J12l9N9O3k02
$$ 50 -153 -17 -35 -85 7 10 63 266 140 44 -17 -24 -51 139 -60 -62 -18 -46 -44 -136 -90 -15 -182 -70 -109 -50 13 -189
3391a89K42j30J77N3j38M6o0J53p8Q6r8p1oN3J58l8j33M9j08J5J42l54J52J17
$$ -189 53 -77 100 153 15 61 1 154 76 162 64 -7 -13 40 198 160 27 76 -32 -17 125 -229 -77 40
3415D0r9j22J32kN8k38J27J08J53j90P3J06p6J1o0K02k00Q5n3n8J1j44J44q9p7
$$ 40 -59 -181 -49 -51 7 -231 -104 4 157 -33 40 146 70 81 21 223 23 108 55 -3 8 -136 8 -81 -158
3440a58J74k12J79J5o6J32pq6L5M1j23J08j03K27j33J02m3j94P2K0N8O6m5n4K8
$$ -158 16 -196 -17 -2 -68 64 57 -29 6 47 -76 32 -71 156 23 125 82 -112 -40 -20 38 104 59 5 33
3465C3j10M7j5p3Q2p4l0O4J7N0L4j18K8N2p5R8o2K6j1R8K5r3L7o6Ok0P3j32O7
$$ 33 -77 -30 -45 -118 -36 -110 -140 -76 -59 -9 25 -93 -65 -13 -88 10 -52 -26 -37 61 86 -7 30 -36 -30 -50 23 -109 -42
3494d2l7J14j27J38j23J76j88J88j2k25Q5l5J54p4r4kJ54K6j85L3o1L9J22j45
$$ -42 -79 35 -92 46 -77 99 -89 99 87 -138 -53 -88 66 -8 -102 -104 50 76 -109 -76 -137 -98 24 -121
3518a21K33j13Kk8J26j43O9j38J19pQJ4l5J9M0l2o4L3N4P2k02J72j53L2J65r4
$$ -121 112 -1 1 -27 99 -44 25 -113 6 -1 7 21 -14 5 45 13 -51 -18 36 108 -94 78 -75 -43 122 28
3544B8k14J63R3k18L17k02O0o7M9L9O0k39J80j78J88l5J36m4r9j2m4N9K6m8k8
$$ 28 -186 -23 70 -148 169 -33 27 -40 9 48 108 -131 49 -129 59 24 160 116 17 5 -39 20 46 -2 -30
3569c0Ll3K07o6p1m3K42j64j32J92j44J83j80p2J22n9K58k30L2J23J6k31M2Q9
$$ -30 -27 -60 147 81 10 -33 209 45 -87 105 -39 144 -36 -108 14 -45 213 -17 15 138 154 -77 -35 54
3593E4l3O3J5J17j85o8L6j02m1J06o3P9j12KQ0j32L03j55J16J28j56oj04J39R4
$$ 54 21 84 99 216 31 -37 -1 -103 -144 -38 -101 -22 -134 -132 -52 -184 119 -36 80 208 52 46 -58 81 175
3618A75j77n0L13k21j26K30k67P4N9n2j4k3j43J52mP3j55J3Q0J62j34q1J24J18
$$ 175 -2 -52 261 40 -86 144 -123 -49 10 -42 -56 -79 -222 -70 -74 -1 -156 -143 -63 99 -35 -116 8 126
3642A26j2l0p9L5J53k05K68k41m9J92k54R5n9R8K2m3pJ55k08J07r7p2KK9J0R9
$$ 126 114 84 5 40 193 -12 256 15 -34 158 -96 -1 -60 38 60 17 10 165 -43 64 -33 -105 -103 -74 -64 35
3668C5q7n0J02K4NP8J0m7k8J40J2k13N9J7m1n5p4P7J32j07q0j41K16k77L33q8
$$ 35 -52 -102 0 24 29 107 117 70 42 182 194 -19 40 57 16 -39 -113 -36 96 -11 -91 -232 -16 -293 40 -48
3694d8P3j01P1L0O0P5k22N0L6q4m5R4K9o5R5j15J23O6k71J55l4J08r1j6r0J61
$$ -48 25 -76 -5 25 85 160 -62 -12 24 -60 -105 -11 18 -47 48 -67 56 122 -149 6 -28 80 -11 -27 -117 44
3720D4k22M1K84j08J09k84J50j04J21j06Q2l4J5M6j06K9O4j21M1J22m2J04q3k3
$$ 44 -178 -137 147 39 148 -136 14 -90 31 -75 7 -27 -12 34 -72 -43 21 -100 -59 63 21 125 42 19
3744A9j03J47j27j59J32P0R7j77N8J28N4k16J32p3Q0L9j25P9j43J25k9o8K3J42
$$ 19 -84 63 -64 -223 -91 -21 76 -101 -43 85 139 -77 55 -18 62 101 -24 55 -88 37 8 -60 -37 105
3768A05k3p9O4m4Q0K0l6j04P0j1l6Q3j92K62k32P9j22R6J64l1m0Km1M9j30P7R6
$$ 105 82 3 67 23 103 123 87 -17 53 42 6 89 -103 159 -73 6 -116 -20 144 113 73 75 34 83 -47 30 126
3795A26k02M8m2Q2l9N6M9j94k8M0M8P2J06J60m13K69j9j37J44j14P1j07O2o6n0
$$ 126 -76 -28 -70 12 -27 29 78 -116 -144 -104 -56 16 122 282 -131 138 119 -18 126 12 83 -24 38 -28 -78
3820g8J25q1m7J52p2J52k30mK00n8k29J46p9R5k9J23j07L0j38J52R2j7L1j73L1
$$ -78 47 -34 -81 71 -1 151 -79 -83 117 59 -170 -24 -103 -8 -37 86 -21 9 -129 23 115 98 129 -44 -13
3845a3K6K0P6k0J7j09k46J4K01%j8j5m0k7P7K39J5k55M1Q7j65M0J46q8J20o9J37
$$ -13 13 33 109 89 106 -3 -249 -235 -34 -34 -52 -67 -107 -134 -57 182 197 -58 -17 70 -95 -55 91 3 123 54 191
3872A91k80J06j6o5m2j30L33p0l3o6O3j5q0K70r6l5j8j47K03J08j75q8J79M3m1
$$ 191 -89 17 1 -64 -106 -236 97 27 -6 -72 -9 -24 -104 166 70 35 17 -130 73 181 6 -82 97 140 99
3897I9r0m9NJ13j16O0ro2r6k6J28K5j74K03n6p6M3m1J99p0q8m6p3K99k3n5l5j35
$$ 99 9 -40 -35 78 -38 22 13 -49 -145 -171 -43 -18 -192 11 -45 -121 -78 -119 80 10 -78 -124 -197 102 79 24 -11 -146
3925a46K55j24q7J31j11K06q9p9J08n3j74M0J17n3J50r9K00k54P3jp8J07m1o9
$$ -146 109 -15 -102 29 -82 124 35 -44 64 11 -163 -123 -6 -59 91 -8 192 -62 11 10 -68 39 -2 -71
3949g1R3K9j01P7j56J50j93J03J78k1j29J64j72p4l1K20J8r5j02Q2n5J07k1k5
$$ -71 22 51 -50 27 -129 21 -172 -69 109 88 -41 123 -49 -123 -154 66 84 -11 -113 -31 -86 21 0 -25
3973b5p8P9N7R1j05O3k64J66M8l0p6OJ47r3k0k2J42j70R5n2R8j32N4L8l9J82n4
$$ -25 -103 -24 33 124 19 82 -182 -16 32 2 -74 -68 79 -14 -34 -56 86 -84 11 -41 57 -75 -21 17 -22 160 106
4000A06k23R2J15M2j47J46r6m8q4j27K37j67N2J41k40K68n3j5l8j60J96jJ78k84
$$ 106 -117 -25 90 132 -15 131 35 -13 -97 -224 13 -154 -102 39 -201 67 14 -1 -39 -199 -3 -4 174 -110
4024a10J61j13k7P3N8l1j08K01l5Qr6K56r6m9j23Q4r6OR3j68M3m8K85k80K79l91
$$ -110 51 -62 -89 -16 42 11 -97 104 69 77 -19 237 141 92 -31 53 -43 -37 56 -112 -69 -117 168 -112 167 -224
4050b24J53l7J9m8K85n2n7j12ML47j87j00K39k88J95Q2k45N1q7P6l6j60J97P3
$$ -224 -71 -108 -89 -137 148 96 39 -73 -69 278 91 -9 230 -58 137 219 -26 25 -62 14 -22 -182 15 88
4074H8k44K27j24J29j4j73K34L6j52kj05J16J97k78J13l7J35j28Q0L2j6p1o3K4
$$ 88 -156 71 -53 76 62 -111 123 159 7 5 -100 16 213 -65 48 11 146 18 98 130 114 43 -20 4
4098DM0O3j92K6J9M4j05J57q5P9p2j88J22K06o9k02J25R6k3J34k28J16R1k10o5
$$ 4 44 107 -85 -59 -40 4 -101 56 -29 50 -22 -210 -88 118 49 -153 -28 68 45 179 -49 67 158 -52 -117
4123a17M6J61q3j6j28J03L9j1r2N2j12P4J95l4j67K15j78QJ17j32M0N0nQ6l1j41
$$ -117 -71 90 7 -9 -137 -34 5 -6 -98 -46 -158 -84 111 77 -90 125 -53 -45 72 -60 -20 30 25 111 80 -61
4149f1R4P4j17J36j22M0j19P7P3j95J58L7j52J70K9j21j45O4J47m5n8K19l09J85
$$ -61 33 107 -10 126 4 44 -75 2 75 -120 38 75 -77 93 122 1 -144 -80 67 22 -36 183 -126 59
4173E9m7p9j0K44j08j0p4KP3q7k6k27M19j52J09l9O1j43nl0R1O2j45m4J29L9%
$$ 59 12 -67 -77 167 59 49 -25 -23 50 -37 -63 -290 129 -23 86 47 108 -35 -40 -70 21 83 -62 -106 23 62 62
4200F2pj9Pk8p3m8R5l6M9K5J02j51Q9n6L3j51J76r6j1J70j25j9j08K60k7j68R2
$$ 62 55 36 43 15 -58 -106 -11 -47 2 27 129 -22 67 11 44 -107 69 -27 -38 132 7 -12 -120 140 113 -55 37
4227C7P6j04M8q9J45l6m5j87K04j79J63p2Q8m8j98J11J62j37J5J35j43J53j30
$$ 37 113 9 57 -32 113 77 32 -155 49 -130 33 -39 49 1 -197 -86 76 -61 -46 89 -54 99 -31
4250c1j18O8J50j56P0n8N6Kk1L0M0M5lj2j7o1l6M4j0o5J49j02R2n4r2J37r6O6
$$ -31 -149 -81 69 -87 -17 -75 -19 -17 -38 -8 32 77 74 62 45 -16 -52 -8 -18 -83 66 -36 56 2 -90 47 -49 17
4278A7o8J5qQ7QJ27j72o7j05K11%j97J12O8p5k71L94q0j28J62l5K3m8N1j07K7
$$ 17 -51 -36 -44 43 51 178 6 -61 -166 45 45 -152 -40 28 -47 -318 76 -4 -132 30 -5 18 -30 21 -86 -59
4304e9J07J25j10o0Q4J1K7jj91m5K12k51J00P4j45L7P7N6j28Q0j09J54jj76O1
$$ -59 48 173 63 3 87 98 125 124 -67 -112 100 -151 -51 23 -122 -85 -8 48 -80 0 -109 45 44 -132 -71
4329g1o8O5J86j07L4M0j27KJ92k49J91n1K0RmK6j48J18k5J1M6q2p4J09O8q1j8
$$ -71 -139 -74 112 5 39 79 -48 -46 146 -103 88 37 57 66 62 88 -60 58 33 44 90 8 -66 43 111 30 12
4356A2j59PJ57J8P3j34k8L6k9K4q8M4J76j63K50j02j5l8kp7J7J17l0l0P5o4j65
$$ 12 -147 -140 17 35 108 -26 -54 -18 -47 -23 -111 -67 109 -54 196 94 79 41 39 -38 -21 96 66 36 111 47 -118
4383a18RL11l52J56k3k5K2J2N3j34J74m5r1j95L55j29j32J54K7M2PP3k94J39N0
$$ -118 -109 202 -150 6 -17 -42 -20 -8 45 -89 85 40 -51 -246 109 -20 -152 2 29 71 78 151 -143 -4 46
4408D6m4n7R8J06k55J24j9p0K1P9R9k8j29L0J7n1R8j35M3q0m3R0P1q7P7p0J84
$$ 46 2 -55 43 149 -106 18 -1 -71 -50 29 128 100 -29 1 18 -33 65 -70 -27 -107 -150 -60 11 -76 1 -69 115
4435A15j46j71R5J48r0J10L9l9j04J78j03l5J06j18J7k8P9q7L3k7L7j33K08j24
$$ 115 -31 -202 -107 41 -49 61 100 61 -43 135 32 -3 103 -15 2 -26 53 -34 -1 -28 9 -124 84 -40
4459d0j1J7J02j61J01j90O5J78n6n2%k8K22k65P1k8j1J90J6k15R1l7o5L1k3o8
$$ -40 -51 -34 68 -93 8 -182 -117 61 5 -47 -47 -75 147 -118 -47 -75 -86 104 120 -95 -4 -41 -106 -75 -98 -166
4485a66L64l09K12l4j22k5J39k08J01M7pj09O0J01qj27M9J46N3j76N9Nk29K47
$$ -166 198 -111 101 67 -55 -80 59 -149 -48 -1 -8 -117 -57 44 36 -91 -42 104 157 -19 40 45 -184 63
4509F3k3r6J0q1J20l9N5q8l4N1J8Q8j79L4o5J10K57l5k36J20J20j73l4J19j56
$$ 63 40 -56 -46 -127 -7 -46 9 -79 -113 -62 -44 44 -135 -101 -166 -56 201 166 -70 50 170 -3 -37 82 -74
4534g4J57k1r4K6J37j47J07j90N9J11j09K9L8K3j54K44q0p4O1j29O3J02k3N3q5
$$ -74 83 62 -32 -6 131 -16 91 -99 -40 71 -38 -9 29 52 -102 142 62 -12 49 -80 -17 85 62 115 30
4559C0j23J36k2j36NM5Q0j3p0J05r8J21j55n2K54j42P7q8K59k10q8J16j12J80
$$ 30 -93 43 21 -115 -110 -65 15 2 -68 37 -61 60 -95 -147 107 -35 42 -46 213 3 -85 31 -81 99
4583I9k1k7J78k59J00o4k7O0J10j47L9o0J1r4K25p3q7j0k40L36L4l12K73r9Q7
$$ 99 78 51 229 -30 70 6 -21 39 149 2 41 -19 -8 -102 123 50 -37 -47 -287 49 83 -229 44 -55 32
4608C2j9j4J5m6J6N3j15M0L8nJ91j91L3m0j03M6J33k72K75j37J43o2j08J4J11
$$ 32 13 -1 14 -32 -16 37 -78 -38 0 -5 186 -5 28 -12 -115 -69 64 -208 67 -70 73 11 -97 -83 28
4633B8j41J43k3k7J41m3j49M2o7K3J54k61K17l1j99L86j07j37J31J5J7k3J18j49
$$ 28 -113 30 7 -20 121 78 -71 -29 -96 -73 81 -180 37 6 -193 193 86 -51 80 95 112 89 207 58
4657E8j47K31o5o5O7o0r3K9J30j64N4K8qR1k0l5o7R9j28P9N1j79k2K55o5j70K13
$$ 58 -89 142 77 12 79 19 -74 -45 85 -79 -25 3 -5 86 66 31 -36 63 -65 14 65 -114 -136 119 54 -116 97
4684I7p5j52J80n1M2K2P4Jj1j9j97J65k51J68N5K9j21jno1m8J93j06KK22j34J8
$$ 97 22 -130 50 -1 41 63 137 138 127 108 -89 76 -175 -7 48 77 -44 -45 -50 -111 -159 34 -72 -70 152 18 36
4711C6j28M6J07r3l7J40q1n2R4Kj88J65L1Oj32J23m1j71P1K01j48m9J33o1K6R8
$$ 36 -92 -46 61 -32 -69 71 -10 -62 32 34 -154 11 42 48 -84 39 -2 -173 -102 99 -49 -98 35 -26 0 98
4737I8j34j09J37N9j42N2R6j50K01j39K21k73R4J71j86j3n2R5m2j41O1J62j52
$$ 98 -36 -145 -8 51 -91 -39 57 -93 108 -31 190 -83 11 182 -4 -17 -69 26 -16 -157 -96 66 -86
4760h6J90j32m5J18R9k42J1QP1J58M3j35j35K08j64rR7K3p3K0k6L0o0Q3k21n9
$$ -86 104 -28 -73 45 144 -98 -87 -79 -8 150 193 58 -77 131 -33 -42 55 78 5 25 -1 29 -31 52 -169 -228
4786b28M35k26J61n5n8M7j29K3pP5k48K40m6O9j4p7P8M2r0J31l12L10p3j45J96
$$ -228 207 -19 142 87 29 76 -53 -30 -37 38 -210 30 -16 53 39 -38 40 82 -8 123 -189 121 48 -97 99
4811I9Nqk1j96j3K03j39J07M7j95M3J2M2o8R2k20K16m3m3P6r8K08j27O0o7Q7k4
$$ 99 104 96 75 -121 -134 69 -70 37 84 -111 -68 -56 -14 -82 10 -210 6 -37 -80 -4 -102 106 -21 39 -28 59 35
4838C5M8q3L3j05J35j35kj6K7J11K4J05j04K14k37j84Q7l1J40Q1k57J22L4j06
$$ 35 83 0 33 -72 63 -72 -74 -90 -63 48 72 177 73 287 50 -134 -47 -78 62 143 -114 8 42 -64
4862f4j17J77K9l7j00rJ20m1m2J14n3qJ8n8L16j08o0%K1k2o1R0p0r8K03r2j15
$$ -64 -181 -4 25 -12 -112 -121 -1 -42 -84 30 -23 -31 -13 -71 245 137 77 77 98 76 15 105 35 -63 140 48 -67
4889f7Np3K0O1nQ6m4P3m6kp1L0J0n5K26j68KJ26q6j89K94m6j18J06R4k61N8p3
$$ -67 -62 -135 -115 -54 -59 27 -17 56 10 8 -63 -33 -23 -78 148 -20 -18 108 22 -167 127 81 -37 69 163 -98 -40 -113
4917a13J64J29j74j80J11J72o8r7J06R9j56m0O4Ln3M5q6J5p8J1R6j16K39j5j50
$$ -113 51 180 6 -174 -63 109 41 -56 50 149 -7 -47 17 20 -33 12 -74 -59 -137 -126 -30 -146 93 78 -72
4942g2J03r0J74r7K1j81J53o3N1j9Jo9L6J04l8P4J0j49J07j6j5k0L8j36J20L5
$$ -72 31 -59 115 18 39 -142 11 -52 -1 -20 -19 -88 -52 52 14 88 98 -51 56 40 25 5 43 -93 27 62
4968F2k54J24j3J37M5L4q2m3R3k39K4J26m6K29k40lJ33j27j7l6J16k3r2K11p9
$$ 62 -192 -68 -81 56 101 135 53 10 103 -136 -112 14 -32 197 -43 -46 87 -40 -57 -93 23 0 -92 119 40
4993D0J3o4P9J9j60J79j02m9R3k38J63q3J8j2J87j0j71M3N7N3m5j6o1Q5Ko8K4
$$ 40 53 -11 68 87 -73 106 4 -45 48 -190 -27 -110 -92 -104 83 73 -98 -55 2 55 10 -6 -67 18 20 -48 -24
5020b4m9l4K43k11O5M6n6K5k6M9o5J11j27O0J32j30o8J31j57J14N9q6J07j8j11
$$ -24 -73 -107 136 -75 -10 36 -20 5 -21 28 -37 74 -53 7 139 9 -59 72 -85 29 88 2 109 91 -20
5045b0O1Rom0O7M3j82l3J36j58J70j2o8J2%m3J60p0r4J74r9J72j02m1J36j30j27
$$ -20 41 50 44 4 71 114 -68 -101 35 -123 47 35 -33 -21 -21 -64 96 26 -68 106 7 179 77 36 172 42 -85
5072h5J12r0j0J14K9L6k10R4N5j89R3%O0o5L9K7Q3k01J16l1Q7j54J14Jj62J15
$$ -85 27 -63 -73 41 70 106 -104 -10 45 -144 -51 -51 9 -56 -17 10 93 -108 8 -23 64 -90 24 25 -137 -22
5098b2m2J6nJ01jq8O1N6j19J37j52q3J51P2p1K8j01Q5m8P0Mj6J27j74K1k4N1k9
$$ -22 -64 -48 -53 48 47 -41 20 76 -43 94 -58 -141 10 82 11 39 -62 23 -25 45 49 33 160 -14 7 -17 34 5
5126EJR8k03L12k70J43l22L29p3P6r9r1J42q3J39k28J99j01L7m9J02O9k57K62
$$ 5 6 104 -99 213 -57 86 -236 93 20 96 -3 -94 48 -35 104 -124 75 -26 11 -38 64 133 -124 138
5150A38j51k4Q4r2K15k52K06j05J33m00K22N2j07N6O6j4o2j47J48J4q4nJ33m1
$$ 138 -13 -37 47 -45 170 -82 124 19 152 -248 -26 26 -81 -25 41 27 -35 -182 -34 -20 -104 -109 24 -17
5174a7L0j20L6P9o9J75o4k2J63j81j78K77k40J31J75k95K2K5J33Pr9N4j5r9l1
$$ -17 13 -107 -71 8 -61 114 50 28 191 10 -168 109 -131 0 175 -120 -98 -73 60 67 -32 22 7 -92 -123
5199a23J86j06K6O3n2k04J71j08K6K71j93N8j3N3m3k9K11k58J14m1J4%n5J23J8
$$ -123 63 -43 -17 46 -6 -210 -39 -147 -121 150 -43 15 2 55 12 -17 194 -64 50 9 23 23 -32 91 109
5224A09j07Ro0j03J84KL2j47K36j46p1R5jR9j20n8k3NJ95j65J09o1r9Q5r3L18
$$ 109 2 11 -49 -152 32 34 66 -81 155 9 -62 33 32 131 11 -47 -70 -65 130 -35 74 13 -86 -1 -94 224
5250B24j15o8or1J0J62n5j86N9J12p8p2J09J02j24J46j13m6j7j7j3L4J10q4n6
$$ 224 109 41 35 -56 -46 116 61 -125 -66 46 -32 -104 5 107 -17 129 16 -30 -47 -64 -77 -43 67 -17 -73
5275g3K42k19M3j71K47mj00R9r4R2p7Jl0l3K19j52J49l41J48r2J83j37K59j23
$$ -73 169 -50 -7 -178 69 65 -35 64 -30 62 -15 -14 -44 -77 142 -10 139 -202 -54 -146 37 -100 159 36
5299C6j72J40k47K96j61M6J24r9N4j54K01Q2k81P8N5M6K4n6j31K93Oj45j87L28
$$ 36 -136 4 -243 53 -108 -62 62 -37 17 -137 64 146 -135 -57 -2 44 68 12 -119 174 180 35 -152 176
5323A76j98l8l7Q2N2j33J31q9J7J16k89K28r1L9L7o1J03L6p8p6M3j25J87r7J19
$$ 176 -22 -60 -97 -15 37 -96 35 -54 -37 79 -210 18 -73 -34 3 -58 45 81 3 -73 -30 -155 32 -65 54
5348E4L0j77J01m6M8R2j41rj7P4J33j13J62j01j30J13l0k4Or5M8j2n6%J68K2j37
$$ 54 84 -93 8 -38 10 102 -39 -48 -65 9 142 29 191 90 -40 73 43 19 25 -70 -22 -34 -90 -90 78 100 -37
5375c7J09j11l3J4R5k9m1jK34j53j47K05q9o5P5Lp6l0N6J10l2k3j80K01oL6q9
$$ -37 72 -39 -72 -58 37 8 -33 -34 200 47 -100 105 16 -49 26 29 -47 -77 -21 89 57 34 -146 55 49 85 -4
5402dN2p0KRL5L1j13Q7n9r2J11m9N7On3J20r9Jk3j57R2O2O6J9j02L3m0NK8j17
$$ -4 48 -22 -20 -11 24 55 -58 29 -30 -122 -11 -60 -3 3 -50 70 -29 -28 -51 -208 -116 -54 12 31 -71 -38 -78 -73 -45 -162
5432a62K18J2J2j67kJ55Rr3r8N5J08j13Q2P7p5M5M3l7j24J04j09J2p3J31q0J66
$$ -162 56 68 80 -87 -89 66 75 -18 -116 -61 47 -66 16 93 18 63 106 69 -55 49 -60 -48 -121 10 -70 96
5458I6n7q1K07k78J17p2N2k08K32p3O8J36j55m1l3J68q4J7RO9r1ooJ04j09O6K0
$$ 96 39 -42 165 -113 4 -68 -16 -224 8 -65 3 139 -16 -57 -90 78 -6 11 20 89 -2 -8 -14 90 -19 47 67
5485F7r8K9k2m0J53o5L5K3n6o6J37r9n8R6L1L6q7J55l0p1K8j40J20k33J49j23
$$ 67 -31 -2 -24 -64 89 24 59 82 26 -40 97 -2 -60 36 67 103 16 171 141 70 98 -42 78 -155 -6 -129
5511a29K27j93m9K88k63R9P3n0k10L42j26M9Qr2q0R9l1Q6r1Q1j33J11l9Lj11O9
$$ -129 98 -95 -144 144 -119 -20 53 3 -207 135 9 58 66 -26 -106 -7 -38 48 -43 38 -95 16 -23 -20 -131 -62
5537f2K90j54L0j79k9J21j45M5J55j67J1J0L9m7n4J40ln3O6n6J12j73JJ41Rj28
$$ -62 228 74 104 -75 -104 17 -128 -83 72 -95 -84 -74 -35 -82 -136 4 1 -52 14 -42 70 -103 -102 39 48 -80
5563h0N4p4m1K06j03L3q0K46o1k10kJ58P9k1k02K31k4j80P6Q4n6L4j79P2PJN2
$$ -80 -26 -100 -141 65 -38 -5 -85 161 100 -110 -112 46 125 104 -98 133 109 -71 5 89 33 67 -112 -40 -33 -32 20
5590B0k8o9M8N3j9j07J6Pp0J59n0O1M1J1j06k4J29p1j54O6p8J65P2Q3r8j59J00
$$ 20 -8 -77 -29 24 5 -102 -86 -79 -149 10 -40 21 62 73 -33 -57 72 1 -153 -87 -165 0 72 155 57 -102 -2
5617bJ03j31N4Pj74J68j7O7L2R3l21M5K25p1o8j64J53mM2oj14P5n9J97j95M6N9
$$ -2 101 -30 24 31 -143 25 8 75 107 200 -121 -76 149 78 10 -154 -1 -5 37 31 -83 -8 -67 130 -65 -19 40
5644D0k63K37k03J71k3J47j2j12LJ5n4k9K47j95N6N6j49m4J62PN5j35P8Q4j60
$$ 40 -223 14 -189 -18 -41 106 94 -18 -15 0 -54 -83 164 -31 25 81 -68 -112 50 57 112 -23 55 139 -21
5669b1K06k62J38o4l7o1M3P1p1n1J45N5j01j7j3K7rj1O9j07K9k3O3J25r3q3P7
$$ -21 185 -77 61 -3 -40 -101 -58 13 -58 -109 36 91 -10 -27 -40 -13 -22 -33 36 -71 -42 -65 -2 123 30 -53 24
5696B4m4J7L8q0m5N0J31L7k21J57M7k02O3P3k5j74J70l6M1J6j6J51n9j84Q4P1
$$ 24 -20 -3 35 -45 -90 -40 91 128 -93 64 111 -91 -28 45 20 -154 16 -20 21 37 21 172 113 -71 13 84
5722H4j19O3Pj2k57K41j03K03j22mNK3J25k82P4J26o4k0kQl8J73l3L6j55J23n7
$$ 84 -35 28 35 23 -234 7 -96 107 -15 -19 -14 9 134 -148 -74 52 -12 -32 -34 -26 -64 109 76 112 -43 80 23
5749B3PN1r8M2M3j60Q1J68j24q8P7J26k76J08L1RM4k5p4PN3j17N4J10J9j60J79
$$ 23 30 81 -17 25 68 -92 -11 157 33 -55 22 148 -128 -20 11 20 64 39 -35 -28 25 -92 -38 72 91 -69 110
5776A10j46j44J95m8j0L6Lk8K5j07P9j0J46j17J01k7j0r6LPJ2j3n5j31K27m3Q
$$ 110 -36 -180 15 -33 -43 -7 -4 -32 -7 -114 -35 -45 101 -16 85 58 48 -48 -45 -38 -26 -39 -94 -225 2 -41 -33
5803c3J56j56j01J24n6M3L5p5j5Q5K8P6j43N9J13m4lj30J7O2k7m0M8O6K9l4o2
$$ -33 123 -33 -134 -10 -66 -23 12 -63 -78 7 35 111 -32 27 140 96 93 -37 -20 42 15 -25 23 89 118 84 22
5830B2j33P6j29K29l7o2M1J37j32J5n2l0Q1m8Q3r6m5KJ11MO0k5l9l1K7J6n5q8
$$ 22 -111 -35 -164 65 28 -34 7 144 12 27 -25 -55 26 -22 61 -35 -80 -78 33 37 97 72 33 2 29 45 -10 -98
5858i8J17j94R3R9j6j9j28J36p4J21j08K7Q7K3k19L03j77q9J41j15J83j3L1j59
$$ -98 19 -175 -82 17 1 -18 -146 -10 -84 37 -71 -44 43 66 -153 150 -27 -116 25 -90 93 80 111 -48
5882d8LpQ9P1k15j14J82J1p9qJ91l5r7L8N0q2J9N8R7j8m1o8J60j95n1k4k6R9j33
$$ -48 -45 -52 37 108 -107 -221 -39 -28 -107 -115 76 41 -56 -18 32 -50 -31 27 124 106 65 -3 157 -38 -89 -113 -139 -40 -173
5911a73J35J34j38K2J38j13l4K5J6M3j69K72j53lR8l12J52J25j57K01j73L8J7
$$ -173 -38 96 -42 -20 118 5 -29 -4 12 55 -114 158 5 2 100 -212 -60 65 -92 109 -64 -26 -9
5934ij0k1Q3M7M1j40J54k79K41r5j06K11J14k13j4L0n7j3j33J47J19k47K06N7
$$ -9 -19 -40 43 90 131 -9 145 -134 107 12 -94 117 231 18 4 34 -23 -36 -169 -22 97 -150 56 113
5958A13j68J46j25j9P7n7r8K27j19j1J8j21J14L8l2j0L5j24J82R0k73K35r7k65
$$ 113 -55 91 -34 -53 24 -33 -131 96 -23 -34 -16 -137 -23 15 -17 -27 8 -116 66 156 -117 118 21 -244
5982b44K55o8J48Or6k4j66J14J42j77J30K9r3J28j9j18J15j28O9L8q7k24J41K14
$$ -244 11 -57 91 97 1 -23 -189 -75 67 -110 20 49 -44 84 65 -53 62 -66 3 41 -46 -270 -129 85
6006H5j61J40jj30O4M3o6M5L1j14k3K29N0j81q9l0J22N5m2Jj62K23O8M3j29o2
$$ 85 -76 64 63 -67 -3 40 -26 19 50 -64 -87 142 192 11 -78 -108 14 69 27 28 -134 89 157 200 71 9
6032Im4OJ81j99L6Q8o5M8l3J8J13j62L5J5r4j6n4m1J49p0J81r9r2J30j55N9J51
$$ 9 -35 -29 152 -47 -11 77 12 60 27 45 158 -4 31 46 -48 -64 -118 -159 -10 -80 101 2 -90 40 -115 -56 95
6059I5l9pj63J08M8m4N7K5M6j88O8J04K8j74J40j84RJ50k50J64q3J91k2l3j09
$$ 95 56 49 -114 -6 42 -2 55 80 126 -62 6 110 138 -36 104 -80 -71 79 -171 -7 -90 101 79 46 -63
6084f3Q1j18K3q6J33N1P2j37M3J62j52qJ18j81J5n2J4J32p7j37J6j8M05j32k06
$$ -63 18 -100 -77 -163 -30 21 93 -44 -1 161 9 1 119 -62 -47 -99 -85 47 -30 -167 -151 -169 236 104 -102
6109a02L5m5J93n6l3J3l2j64K38j15K8J12O4l03J31l0k8J77M2j30r0J25n6L6J23
$$ -102 -67 -112 81 25 -8 5 -27 -191 47 -68 -40 72 136 -167 -36 -66 -94 83 125 -5 -95 30 -26 10 133
6134A33j06p2P5o2N7j13J47l7lJ80j72lP2j59Q8n0Q9k11l5J82j05R0n5n7J61k2
$$ 133 27 -45 30 -32 25 -88 59 22 19 199 27 24 96 -63 25 -25 64 -147 -182 0 -105 -15 -70 -127 34 12
6160A2P6l6J2q1Q4N2k02J57j03Q3P4j20Q8q5j53R7j6Q8l2o6K0K4r1L8L4J58k53
$$ 12 88 52 64 -17 67 119 -83 74 -29 54 128 8 96 11 -142 -45 -61 27 -5 -71 -51 -27 -118 -80 -46 112 -141
6187a41K50j03M5j40N2J46Jj11j77J92R6l2j79R3P5p1J24l0j3m4j57P8J07Mj62
$$ -141 109 6 51 -89 -37 109 110 -1 -178 14 110 78 -101 -8 67 -4 120 90 77 33 -124 -46 61 65 -97
6212i7J49j73K47j43L8j05M0N0j01K56j01P1m6o2L1N2k11P2J51R2k09n4J31p7
$$ -97 52 -121 126 -17 21 -84 -44 6 -95 161 60 131 85 23 54 106 -105 -33 118 210 1 -53 78 1
6236AJJ89k23J46m7j13K5O1j39J17J51r9j06j29L05m1o3j80J07q7Q5nj2p5KP1
$$ 1 2 191 -32 114 67 -46 -21 40 -99 18 169 70 -36 -165 140 99 36 -144 -37 -124 -39 -44 -56 -131 -129 -58
6262e8oj0O1j16NJ0J34N6o8j7j29K19j22j4M9O0k06J02J04k4p0M8L1O0r1k2J22
$$ -58 -64 -74 -13 -129 -124 -114 20 76 8 -9 -138 81 -41 -55 -6 54 -152 -50 54 30 -40 8 39 99 8 -14 108
6289A08j76L3m9J67o3o2J20k5kj15Q1j3q7Q3J49l29J87j0Pl9M0J06o2l6%j48K61
$$ 108 -68 -35 -84 83 20 -42 78 53 51 -64 17 4 -83 0 149 -180 7 -3 4 -35 5 111 49 13 13 -135 126
6316A26k03J42L4p1O3n5J35j70O2j12J03j71p6K75k4q9n6J31r1Q7j34K2J64j92
$$ 126 -77 65 99 28 91 36 171 1 63 -49 54 -117 -193 82 58 -31 -87 44 -47 40 -94 -72 92 -100
6340a00R5k1R4j83J44M8r9J3O7M8j71l6K32j11m9M4k04J76q2M9o5q1K11K7l1J41
$$ -100 -5 -26 68 -115 29 77 -22 -9 58 106 -65 -101 131 20 -29 15 -189 -13 -95 -46 -111 -192 19 46 15 156
6366A56n3j26l2P8j99K55k15J07J1QM3j6pN8j95J54l3k9P3p7Q8l8P2q4J34j9k04
$$ 156 103 -23 -55 23 -176 79 -136 -29 -18 -10 33 17 10 68 -127 27 -6 -35 38 -39 49 11 83 -1 133 114 -90
$$ [...]
8191a41
##END NTUPLES=NMR FID
##END=
