##TITLE=1H_Bz 1702-1
 CDCl3
 8 sc, 
 18.02.2022
##JCAMPDX= 6.0         $$ Bruker NMR JCAMP-DX V2.0
##DATA TYPE= NMR FID
##DATA CLASS= NTUPLES
##ORIGIN= UXNMR, Bruker Analytische Messtechnik GmbH
##OWNER= root
$$ XWIN-NMR		Version 3.5
$$ Fri Feb 18 10:50:45 2022 Russian Standard Time (UT+4h)  she@DPX200
##.OBSERVE FREQUENCY= 200.131346
##.OBSERVE NUCLEUS= ^1H
##.DELAY= (6, 6)
##.ACQUISITION MODE= SIMULTANEOUS
##.ACQUISITION SCHEME= undefined
##.AVERAGES= 8
##.DIGITISER RES= 18
##SPECTROMETER/DATA SYSTEM= spect
##.PULSE SEQUENCE= zg30
##.SOLVENT NAME= CDCl3
##.SHIFT REFERENCE= (INTERNAL, CDCl3, 0, 15.7039)
##AUDIT TRAIL= $$ (NUMBER, WHEN, WHO, WHERE, WHAT)
$$ ##TITLE= Audit trail, XWIN-NMR		Version 3.5
$$ ##JCAMPDX= 5.01
$$ ##ORIGIN= Bruker BioSpin GmbH
$$ ##OWNER= she
$$ F:/spectra/data/she/nmr/H-F/1/audita.txt
$$ ##AUDIT TRAIL=  $$ (NUMBER, WHEN, WHO, WHERE, WHAT)
(   1,<2022-02-18 10:49:31.98 +0400>,<she>,<DPX200>,
      <created by zg, POWCHK disabled, PULCHK disabled
       configuration hash MD5:
       00 E9 B6 7A A2 85 ED C7 34 08 36 98 17 FE 4E 26
       data hash MD5: 16K
       27 BD E5 CD 42 3A 3F FE EA BA 2F 72 DD 19 6A 99>)
$$ ##END=
$$ 
$$ hash MD5
$$ C2 EF 9E BF A3 FB 6F C5 F6 59 87 F1 8D 06 24 9F
##$RELAX= 
##$RELAX= 
##$RELAX= 
##$RELAX= 
##$RELAX= 
##$RELAX= 
$$ Bruker specific parameters
$$ --------------------------
##$DU= <F:/spectra>
##$EXPNO= 1
##$NAME= <H-F>
##$PROCNO= 1
##$TYPE= <nmr>
##$USER= <she>
##$AMP= (0..31)
100 100 100 100 100 100 100 100 100 100 100 100 100 100 100 100 100 100 
100 100 100 100 100 100 100 100 100 100 100 100 100 100 
##$AQSEQ= 0
##$AQ_mod= 1
##$AUNM= <au_zg>
##$AUTOPOS= <>
##$BF1= 200.13
##$BF2= 200.13
##$BF3= 200.13
##$BF4= 200.13
##$BF5= 200.13
##$BF6= 200.13
##$BF7= 200.13
##$BF8= 200.13
##$BYTORDA= 1
##$CFDGTYP= 0
##$CFRGTYP= 5
##$CHEMSTR= <none>
##$CNST= (0..31)
1 1 145 1 1 1 1 1 1 1 1 1 1 1 1 1 1 1 1 1 1 1 1 1 1 1 1 1 1 1 1 1 
##$CPDPRG= <>
##$CPDPRG1= <>
##$CPDPRG2= <>
##$CPDPRG3= <>
##$CPDPRG4= <mlev>
##$CPDPRG5= <mlev>
##$CPDPRG6= <mlev>
##$CPDPRG7= <mlev>
##$CPDPRG8= <mlev>
##$CPDPRGB= <>
##$CPDPRGT= <>
##$D= (0..31)
0 1.2 0 0 0 0 0 0 0 0.06 0 0.03 0 0 0 0 0.0002 0 0 0 0 0 0 0 0 0 0 0 0 
0 0 0 
##$DATE= 1645166971
##$DBL= (0..7)
120 120 120 120 120 120 120 120 
##$DBP= (0..7)
150 150 150 150 150 150 150 150 
##$DBP07= 0
##$DBPNAM0= <>
##$DBPNAM1= <>
##$DBPNAM2= <>
##$DBPNAM3= <>
##$DBPNAM4= <>
##$DBPNAM5= <>
##$DBPNAM6= <>
##$DBPNAM7= <>
##$DBPOAL= (0..7)
0.5 0.5 0.5 0.5 0.5 0.5 0.5 0.5 
##$DBPOFFS= (0..7)
0 0 0 0 0 0 0 0 
##$DE= 6
##$DECBNUC= <off>
##$DECIM= 32
##$DECNUC= <off>
##$DECSTAT= 4
##$DIGMOD= 1
##$DIGTYP= 9
##$DL= (0..7)
0 120 120 120 120 120 120 120 
##$DP= (0..7)
150 150 150 150 150 150 150 150 
##$DP07= 0
##$DPNAME0= <>
##$DPNAME1= <>
##$DPNAME2= <>
##$DPNAME3= <>
##$DPNAME4= <>
##$DPNAME5= <>
##$DPNAME6= <>
##$DPNAME7= <>
##$DPOAL= (0..7)
0.5 0.5 0.5 0.5 0.5 0.5 0.5 0.5 
##$DPOFFS= (0..7)
0 0 0 0 0 0 0 0 
##$DQDMODE= 0
##$DR= 18
##$DS= 0
##$DSLIST= <SSSSSSSSSSSSSSS>
$$ [...]
##$SUBNAM2= <"">
##$SUBNAM3= <"">
##$SUBNAM4= <"">
##$SUBNAM5= <"">
##$SUBNAM6= <"">
##$SUBNAM7= <"">
##$SUBNAM8= <"">
##$SUBNAM9= <"">
##$SW= 18.0517287032376
##$SWIBOX= (0..15)
0 0 2 0 0 0 0 0 0 0 0 0 0 0 0 0 
##$SW_h= 3612.71676300578
##$TD= 16384
##$TD0= 1
##$TE= 0
##$TE2= 300
##$TE3= 300
##$TEG= 300
##$TL= (0..7)
0 120 120 120 120 120 120 120 
##$TP= (0..7)
150 150 150 150 150 150 150 150 
##$TP07= 0
##$TPNAME0= <>
##$TPNAME1= <>
##$TPNAME2= <>
##$TPNAME3= <>
##$TPNAME4= <>
##$TPNAME5= <>
##$TPNAME6= <>
##$TPNAME7= <>
##$TPOAL= (0..7)
0.5 0.5 0.5 0.5 0.5 0.5 0.5 0.5 
##$TPOFFS= (0..7)
0 0 0 0 0 0 0 0 
##$TUNHIN= 0
##$TUNHOUT= 0
##$TUNXOUT= 0
##$USERA1= <user>
##$USERA2= <user>
##$USERA3= <user>
##$USERA4= <user>
##$USERA5= <user>
##$V9= 5
##$VALIST= <valist>
##$VCLIST= <CCCCCCCCCCCCCCC>
##$VD= 0
##$VDLIST= <DDDDDDDDDDDDDDD>
##$VPLIST= <PPPPPPPPPPPPPPP>
##$VTLIST= <TTTTTTTTTTTTTTT>
##$WBST= 1024
##$WBSW= 4
##$XGAIN= (0..3)
0 0 0 0 
##$XL= 0
##$YL= 0
##$YMAX_a= 200043
##$YMIN_a= -136464
##$ZGOPTNS= <>
##$ZL1= 120
##$ZL2= 120
##$ZL3= 120
##$ZL4= 120
##$ABSF1= 10
##$ABSF2= 0
##$ABSG= 5
##$ABSL= 3
##$ALPHA= 0
##$AQORDER= 0
##$ASSFAC= 0
##$ASSFACI= 0
##$ASSFACX= 0
##$ASSWID= 0
##$AUNMP= <proc_1d>
##$AZFE= 0.1
##$AZFW= 0.1
##$BCFW= 1
##$BC_mod= 2
##$BYTORDP= 1
##$COROFFS= 0
##$CY= 11.3945322036743
##$DATMOD= 1
##$DC= 2
##$DFILT= <>
##$DTYPP= 0
##$F1P= 2.36226072786647
##$F2P= -0.459571619588291
##$FCOR= 0.5
##$FTSIZE= 0
##$FT_mod= 4
##$GAMMA= 1
##$GB= 0.15
##$INTBC= 1
##$INTSCL= 1
##$ISEN= 128
##$LB= 0.24
##$LEV0= 0
##$LPBIN= 0
##$MAXI= 10000
##$MC2= 0
##$MEAN= 0
##$ME_mod= 0
##$MI= 1.114404
##$NCOEF= 0
##$NC_proc= 0
##$NLEV= 6
##$NOISF1= 3.799351
##$NOISF2= 2.8
##$NSP= 1
##$NTH_PI= 0
##$NZP= 0
##$OFFSET= 15.70392
##$PC= 1
##$PHC0= -16584.99
##$PHC1= 2.600779
##$PH_mod= 1
##$PKNL= yes
##$PPARMOD= 0
##$PSCAL= 0
##$PSIGN= 0
##$REVERSE= no
##$SF= 200.130013532006
##$SI= 16384
##$SIGF1= 3
##$SIGF2= 2
##$SINO= 400
##$SIOLD= 16384
##$SREGLST= <1H.CDCl3>
##$SSB= 0
##$STSI= 0
##$STSR= 0
##$SW_p= 3612.71676300578
##$SYMM= 0
##$S_DEV= 0
##$TDeff= 0
##$TDoff= 0
##$TI= <>
##$TILT= no
##$TM1= 0
##$TM2= 0
##$TOPLEV= 0
##$USERP1= <user>
##$USERP2= <user>
##$USERP3= <user>
##$USERP4= <user>
##$USERP5= <user>
##$WDW= 1
##$XDIM= 8192
##$YMAX_p= 0
##$YMIN_p= 0
$$ End of Bruker specific parameters
$$ ---------------------------------
##NTUPLES= NMR FID
##VAR_NAME=  TIME,          FID/REAL,        FID/IMAG
##SYMBOL=    X,             R,               I
##VAR_TYPE=  INDEPENDENT,   DEPENDENT,       DEPENDENT
##VAR_FORM=  AFFN,          ASDF,            ASDF
##VAR_DIM=   8192,          8192,            8192
##UNITS=     SECONDS,       ARBITRARY UNITS, ARBITRARY UNITS
##FACTOR=    0.0002768,     1,               1
##FIRST=     0,             0,               0
##LAST=      2.2672688,     0,               0
##MIN=       0,             -136464,         0
##MAX=       2.2672688,     200043,          0
$$ Real data points
##PAGE= N=1
##DATA TABLE= (X++(R..R)), XYDATA
0 0 0 0 0 0 0 0 0 0 0 0 0 0 0 8 -8 8 -8 8 -16 16 -17 24 -25 32 -40 48 -51 60 -72 80 -89 105 -119 133 -153
35 -153 169 -192 213 -239 266 -297 329 -366 406 -446 495 -546 603 -662 731 -804 887 -978
53 -978 1081 -1192 1321 -1466 1634 -1828 2059 -2334 2674 -3104 3667 -4439 5571 -7404 10876
68 10876 -19868 99636 200043 116728 94592 42989 22569 6295 23637 22221 10871 -19824
80 -19824 -45440 -81712 -107812 -130849 -135574 -133271 -122599 -109464 -83600 -50783 -2903 39823 69953
93 69953 86513 92816 79642 55744 40359 52990 73733 89563 106406 116041 95069 45110 -10952
106 -10952 -53720 -87336 -109440 -109126 -92961 -77021 -67084 -62153 -54893 -45703 -38785 -30407 -20195 -9525
120 -9525 2976 15322 31245 56881 87927 110334 114527 105548 87504 51666 7511 -18940 -24485
133 -24485 -22149 -18722 -12079 -6586 -19370 -47852 -72438 -86259 -91364 -87315 -71270 -44474 -18404
146 -18404 1089 18572 33883 46839 55841 57584 54344 49886 44312 38835 35243 40273 51573 52014
160 52014 38778 20979 -2995 -36283 -69246 -84731 -80041 -69841 -56979 -38306 -22559 -17922
172 -17922 -22714 -26064 -21261 -13500 -3424 13133 32266 49431 61266 66735 69690 68238 60068 44569
186 44569 23546 5395 -8699 -23349 -31659 -28683 -21574 -21447 -29614 -37465 -46015 -60570 -70290 -64126
200 -64126 -45937 -23389 -1650 21016 40807 48230 45945 42814 40279 38043 34988 33311 35060 35601
214 35601 32780 26719 16870 6588 -6983 -27598 -46804 -58363 -63292 -64353 -58466 -40966 -20774
227 -20774 -10033 -4472 749 2364 -546 -2342 6105 21986 35787 47634 58276 63533 58972 45105
241 45105 28596 13707 -1878 -15375 -24527 -28940 -27857 -26705 -27345 -27805 -27682 -30842 -38327 -44488 -41135
256 -41135 -32970 -23665 -7617 14709 34932 45442 48153 48341 43449 31706 20673 16197 16659 17371
270 17371 16485 16952 15417 6418 -6981 -22018 -35436 -45295 -52054 -53800 -47183 -34677 -21081 -10228
284 -10228 -582 9198 12489 9205 7507 10691 15622 19802 26981 38929 47085 46073 39884 30677 17868
299 17868 493 -16349 -25433 -28860 -30149 -28664 -24526 -19742 -17720 -20772 -24600 -26970 -27254 -25247 -20421
314 -20421 -9282 7236 21078 30802 38830 43587 41121 31715 22224 16784 11410 5959 4579 6699
328 6699 7952 3600 -4115 -10906 -20036 -31510 -40260 -42903 -39275 -32649 -24045 -12313 -616 7955
342 7955 11769 11832 12410 13407 12693 13594 18932 26629 31533 31894 31009 28378 18726 4599 -7782 -16380 -22521
359 -22521 -27993 -28526 -23111 -18657 -16886 -16690 -16050 -16396 -18481 -19484 -15201 -7476 1684 11569 20851 30008
375 30008 34986 33086 28390 23088 17341 10283 3839 2687 4155 2467 -268 -2891 -6421 -13462 -23600
390 -23600 -30119 -31888 -32008 -29644 -22572 -11956 -1632 4430 8525 12362 13341 12248 11044 12012 16271
405 16271 19986 22271 24436 25638 23177 15688 5566 -2546 -10897 -19554 -24957 -25189 -21364 -18263 -16312
420 -16312 -12831 -9993 -11329 -14150 -14768 -11552 -6522 -1401 7656 18266 25874 29056 28730 26331 22162
435 22162 15056 7974 3570 1572 542 -2023 -3388 -3182 -5659 -11761 -17812 -22334 -25561 -28515 -28484 -21768
451 -21768 -11983 -3393 4263 11279 16437 16422 12599 11121 11459 12137 13863 16940 21042 22662 19102 13237
467 13237 6391 -1587 -10152 -18460 -22916 -23045 -22730 -21348 -17389 -12072 -7779 -7029 -7694 -6233 -5463 -5636
483 -5636 -2936 4300 13791 20866 25638 29264 29153 23306 14750 6816 1771 -2063 -5211 -5478 -4548 -4607
499 -4607 -7364 -11980 -15021 -17755 -21405 -23613 -22839 -18430 -12997 -7308 539 9935 16305 18573 18472 17656
515 17656 15393 10904 8419 10697 13698 15311 14817 13266 8872 469 -9384 -16930 -21329 -23067 -23187
530 -23187 -21063 -16217 -11401 -9688 -7489 -4962 -1896 -661 -325 2277 6526 9940 13526 18095 23522
545 23522 25984 23189 18369 12722 5042 -3232 -8886 -10018 -8479 -8357 -8412 -8552 -10792 -14736 -19272 -21206
561 -21206 -19027 -15637 -11611 -5396 1626 7736 11674 13594 16992 18340 17060 14218 12039 10982 9568
576 9568 7399 7645 8635 6865 1883 -4566 -10517 -16588 -22454 -24320 -21351 -16238 -11469 -7866 -4388 -1688
592 -1688 -1563 -1838 -299 3391 7460 10314 13416 17419 19317 18718 16654 14943 12151 6491 -416 -5157
608 -5157 -8403 -11236 -12861 -11826 -9080 -8244 -10682 -12624 -14205 -15257 -15410 -12705 -5825 2187 8021 12162
624 12162 15300 16540 15067 12222 10459 10678 9882 8187 6901 6100 5012 1504 -1964 -4444 -7559 -12230
640 -12230 -16751 -18928 -18060 -16448 -13707 -7755 -1542 2270 3357 2930 3217 3235 3342 5394 9711 14665
656 14665 16835 16501 15478 13026 7788 1812 -2657 -5417 -7437 -10104 -11412 -9972 -9118 -9144 -8895 -7889
672 -7889 -7173 -8543 -9904 -8350 -4998 -913 3783 9416 15024 17186 15648 13011 10013 6815 3404
687 3404 1551 2579 3540 2895 1158 -959 -3299 -6947 -11257 -13779 -13844 -14049 -13273 -10931 -6340 -1419 1200
704 1200 3982 6751 7502 6365 4609 4557 6146 7411 8796 11442 12966 11968 7951 2677 -1283 -5979
720 -5979 -9868 -11817 -10907 -9073 -7994 -7628 -6172 -4843 -5066 -5819 -5648 -3700 -2126 -835 2153 6715
736 6715 10323 12375 13072 13277 11777 7781 3405 533 -538 -1426 -2138 -1646 -441 -1826 -4753 -7537
752 -7537 -9580 -11379 -12618 -12023 -8908 -5045 -1938 979 3774 6576 7137 6157 6295 6647 6235 5593 5697
769 5697 7624 8433 7474 5876 3982 1126 -3359 -7745 -9826 -10284 -10502 -9631 -7587 -4891 -3486 -3733 -3868
786 -3868 -2851 -2419 -2000 -485 2460 6023 7944 9242 10926 11341 10023 7059 4547 2933 394 -1957
802 -1957 -2786 -2462 -2286 -3192 -4749 -5262 -6593 -8993 -10366 -10014 -7933 -5638 -3387 110 3821 5541 5883
819 5883 5891 6201 6188 5095 4916 5764 6856 6701 5732 5096 4122 928 -2784 -5406 -7263 -8281 -9532 -9086
837 -9086 -6649 -4725 -4333 -3417 -2323 -1750 -2219 -2448 -555 1925 3784 5762 7942 10156 10325 8490 6773
854 6773 4795 2835 -193 -1891 -1996 -1581 -2410 -3126 -3165 -3730 -5302 -7728 -8600 -8131 -7665 -6528 -4039 -463
872 -463 2712 4235 5281 6359 6365 5112 3974 3882 4757 4878 4691 5352 5615 4337 1760 -1268 -3110 -5589
890 -5589 -8328 -8924 -8050 -6551 -5227 -4174 -2335 -911 -1111 -1797 -1648 -449 680 1332 3568 6496 8416
907 8416 8763 8188 7526 5975 2693 45 -1515 -2220 -2856 -3485 -3095 -2065 -2736 -4368 -5373 -6035 -6406 -7123
925 -7123 -6783 -4081 -1293 621 3028 5339 6945 6706 5411 4672 4434 3469 2890 2935 3718 4117 2922 1707
943 1707 334 -1824 -4530 -7045 -7867 -7443 -7349 -6474 -4464 -2261 -803 -399 5 918 1118 806 1501 3284
961 3284 5097 6182 6722 7618 7664 5801 3385 949 -684 -2613 -4309 -4483 -3916 -3848 -3801 -4340 -4072 -4474
979 -4474 -5495 -5897 -4796 -3337 -1627 97 2416 5164 6104 6380 6281 6134 5650 3806 2691 2876 2564
996 2564 1904 1055 733 62 -2117 -4388 -5906 -6920 -7674 -7777 -6744 -4213 -2578 -1636 -281 963 1899
1013 1899 1792 1871 2946 4529 4904 5631 6376 6906 6534 4617 3265 1846 -132 -2671 -4401 -4804 -4694
1030 -4694 -5034 -5127 -4185 -4059 -4345 -4989 -5080 -3978 -3192 -1858 426 3206 5220 6005 6234 6962 6406 4860
1048 4860 3747 3386 3196 2386 981 803 458 -1018 -2854 -4309 -5143 -6147 -7657 -7793 -6484 -4714 -3251
1065 -3251 -1671 255 2137 2169 1931 2443 3076 3713 4080 5247 6757 6871 5997 4932 3174 1551 -1025
1082 -1025 -3014 -3635 -4093 -4874 -5240 -4969 -3984 -3843 -4220 -3783 -3210 -3030 -2979 -2175 197 2495 3815 5557
1100 5557 6902 7375 6434 4704 3301 2683 1495 637 580 910 421 -995 -2438 -3177 -4491 -5747 -6546
1117 -6546 -6290 -5476 -4551 -3823 -1487 495 1958 2523 2958 3652 3448 2784 2664 3584 4428 4771 4637 4738 3987
1136 3987 1669 -546 -2543 -3627 -4718 -5451 -4945 -3939 -3618 -3364 -3193 -2559 -1867 -2081 -2003 -656 391
1153 391 1457 2514 3901 5538 6005 5580 5099 4268 2792 747 -672 -811 -843 -1349 -1489 -1292 -1753 -3134
1171 -3134 -4604 -4871 -4764 -4619 -3976 -2760 -955 597 1263 2252 3435 3817 3551 2893 3135 3144 2492 2396 2672
1190 2672 2798 2221 1207 -209 -1356 -2756 -4403 -5102 -4651 -3991 -3429 -2897 -1521 -931 -918 -934 -657 423
1208 423 1074 1346 2456 3668 4016 4194 4007 4021 3484 2005 716 -48 -895 -1738 -2569 -2498 -1900 -2177 -2992
1227 -2992 -2859 -3189 -3340 -3747 -3281 -1780 -377 528 1795 2808 3521 3325 2479 2821 2860 2544 2025 1982 2266
1246 2266 1861 731 213 -457 -1298 -2731 -3717 -3925 -3839 -3896 -3465 -2443 -1345 -686 -618 -74 578 449 647
1265 647 1461 2378 3302 3748 3703 4074 3602 2467 1183 289 -155 -1288 -1953 -2246 -1816 -2140 -2428 -2650 -2465
1284 -2465 -2594 -3289 -3139 -2565 -1630 -752 175 1799 3059 3465 3289 3270 3003 2572 1504 1149 1761 1773 1232
1303 1232 774 591 14 -1480 -2564 -3395 -3602 -3988 -3927 -3304 -2004 -1383 -900 -248 562 899 526 491 1181
1322 1181 1861 2135 2702 3432 4094 3548 2578 1878 1051 -294 -1394 -2332 -2057 -1953 -2293 -2141 -1860 -1715 -2147
1341 -2147 -2605 -2595 -2187 -1996 -1502 -361 1175 2106 2487 3089 3440 3419 2505 1595 1387 977 613 396 707 939
1361 939 353 -518 -1448 -1893 -2593 -3823 -3545 -3129 -2464 -1729 -1383 -133 793 803 666 1033 1238 1325 1129 1695
1381 1695 2517 2841 2615 2378 2341 1585 314 -643 -1199 -1751 -2414 -2392 -2219 -1633 -1510 -1947 -1614 -1465 -1367 -1588
1401 -1588 -1287 -314 502 1082 1798 2567 2851 2827 2305 2075 1903 1114 513 175 413 103 -440 -588 -660 -1204
1421 -1204 -2129 -2775 -2707 -2450 -2403 -2134 -1075 -269 291 412 953 1430 1357 1246 1162 1836 2008 1925 2035 2096 1978
1442 1978 971 209 -504 -780 -1583 -2066 -2114 -1756 -1744 -1740 -1542 -1235 -1007 -1427 -1025 -691 18 578 891 1662 2688
1463 2688 2473 2207 2068 2067 1526 657 295 517 146 -253 -594 -711 -950 -1583 -2285 -2280 -2324 -2331 -2510 -1547 -688 -45
1485 -45 299 734 1329 1484 1403 1205 1673 1930 1524 1921 2076 1985 1522 706 181 -457 -1138 -2040 -2295 -2160 -1881
1506 -1881 -2106 -1853 -1119 -930 -1114 -1073 -736 -253 28 236 1036 1831 2517 2684 2572 2829 2204 1293 656 287
1526 287 30 -519 -865 -673 -557 -1184 -1792 -2044 -2022 -2508 -2708 -2550 -1572 -817 -296 298 1298 1723 1895 1723
1546 1723 1771 1912 1557 1443 1380 1983 1826 1441 1005 498 -170 -1242 -2050 -2296 -2602 -2702 -2515 -1966 -1300 -1132
1566 -1132 -1112 -653 -249 -53 -121 393 1046 1687 1881 2367 2954 2978 2434 1659 1138 836 -73 -829 -980 -994 -1203
1587 -1203 -1401 -1410 -1609 -1576 -2196 -2178 -2017 -1456 -1127 -594 267 987 1343 1649 1934 2164 2071 1582 1544 1564 1329 998
1609 998 814 846 566 -287 -933 -1297 -1728 -2135 -2563 -2375 -1929 -1601 -1309 -754 -165 184 38 247 795 1274
1629 1274 1215 1586 1917 2275 2117 1673 1721 1389 619 -2 -518 -692 -1124 -1461 -1502 -1189 -1321 -1577 -1909 -1673 -1404
1650 -1404 -1258 -1036 -334 210 851 1046 1394 1758 1807 1448 1327 1516 1293 1059 776 681 402 72 -549 -907
1670 -907 -932 -1440 -2036 -1864 -1666 -1419 -1337 -889 -256 25 -24 290 484 827 794 936 1367 1806 1710 1509 1400 1134
1692 1134 817 52 -371 -459 -831 -1112 -1304 -1182 -1094 -1046 -1318 -1095 -974 -1057 -1051 -911 -1 296 686 1131 1662 1808
1714 1808 1758 1242 1090 977 635 345 446 386 250 -136 -466 -677 -1087 -1585 -1933 -1642 -1415 -1541 -1297 -595
1734 -595 9 262 352 553 899 628 649 900 1126 1272 1330 1362 1647 1155 610 -38 -531 -634 -1213 -1449 -1444 -1015
1756 -1015 -977 -930 -896 -670 -658 -848 -700 -220 111 270 442 1117 1439 1531 1737 1496 1287 907 373 69 171
1777 171 -123 -171 -133 -230 -234 -878 -1427 -1148 -1381 -1618 -1467 -1072 -427 -152 -43 509 810 928 874 724 1053 966
1799 966 990 909 1148 1166 797 596 339 -29 -586 -1062 -1321 -1451 -1205 -1594 -1068 -635 -790 -736 -637 -408 -195 -179
1821 -179 -24 546 775 1315 1228 1343 1626 1370 1057 669 536 495 10 -260 -285 -381 -458 -696 -971 -895 -1242 -1452
1843 -1452 -1323 -1034 -737 -640 -244 236 586 631 636 1050 1015 840 839 1032 1117 953 682 324 344 382 -255 -705 -726
1866 -726 -855 -1178 -1178 -1079 -751 -766 -874 -534 -352 -286 -154 95 521 690 629 1068 1100 1235 1030 875 728 673 229
1889 229 -128 -73 -43 -296 -622 -616 -647 -735 -1077 -1193 -1099 -1011 -864 -489 -18 239 332 483 569 721 750 533 767 967
1913 967 903 870 650 871 579 66 -246 -671 -707 -1006 -1165 -1030 -628 -593 -743 -586 -416 -299 -314 -230 -8 266
1935 266 454 553 1067 1072 948 1007 840 686 475 -143 -31 24 -324 -354 -274 -512 -495 -774 -1018 -933 -971 -1035 -632 -324
1959 -324 24 205 365 740 922 942 788 568 865 786 517 495 592 497 434 -16 -264 -317 -712 -965 -1247 -984
1981 -984 -944 -1028 -690 -448 -96 -92 -163 158 280 236 307 706 993 1044 910 1083 1050 764 352 142 84 -142 -534
2004 -534 -764 -824 -514 -785 -870 -686 -746 -827 -887 -597 -389 -324 1 329 706 1097 795 1005 1075 1013 689 517 406
2027 406 550 322 37 -74 -61 -516 -828 -991 -1068 -1119 -1202 -1141 -804 -512 -353 -150 164 402 266 492 696 955
2049 955 1192 881 919 967 1005 734 425 123 167 -374 -725 -670 -759 -888 -1199 -1057 -821 -886 -988 -859 -509 -215
2071 -215 -71 -49 588 860 862 941 1103 1152 1078 714 771 849 559 321 -87 45 -202 -707 -816 -680 -1057 -898 -1222
2094 -1222 -1066 -804 -767 -490 -147 121 234 185 388 863 803 937 1035 1109 1101 802 533 482 374 -37 -415 -315
2116 -315 -601 -777 -837 -779 -735 -939 -895 -842 -513 -428 -464 -255 132 562 554 756 844 1021 837 632 534 706 617 324
2140 324 170 213 -60 -446 -519 -667 -636 -992 -1144 -838 -748 -768 -532 -381 90 205 209 276 441 685 597 649 864
2163 864 672 628 639 647 594 225 -139 -489 -255 -639 -825 -801 -506 -441 -585 -558 -489 -226 -247 -355 -78 323 347 476
2187 476 712 844 889 881 565 581 389 184 -44 -68 -57 -280 -408 -182 -406 -513 -696 -670 -611 -525 -682 -341 -71
2210 -71 44 289 256 638 637 642 429 581 515 506 400 293 491 134 12 -144 -300 -384 -634 -752 -764 -572 -665 -538
2234 -538 -320 -36 -51 -200 120 254 201 291 431 666 571 568 748 558 548 267 22 -47 13 -411 -416 -546 -539 -474 -489
2259 -489 -721 -453 -544 -404 -369 -94 173 147 213 403 687 646 568 707 668 442 336 415 437 218 0 -299 -291 -150
2283 -150 -468 -684 -610 -537 -601 -673 -609 -322 -210 -121 72 145 262 348 246 656 903 542 571 502 788 432 225
2306 225 21 -109 63 -215 -509 -448 -543 -649 -559 -567 -559 -560 -518 -527 -16 -67 -143 77 385 428 557 558 748 502 293 213
2332 213 516 270 150 137 17 -110 -276 -502 -534 -541 -575 -620 -452 -317 -233 -373 -169 -47 -180 -26 137 278
2354 278 446 379 396 683 649 668 381 279 209 37 -277 -91 -157 -150 -435 -494 -246 -238 -559 -543 -427 -368 -149 -179 -34
2379 -34 241 258 345 469 421 485 336 224 352 280 269 227 50 -9 -2 -105 -184 -235 -346 -357 -616 -293 -411 -382 -353
2404 -353 -156 -85 86 -49 85 194 141 22 352 409 487 480 314 292 140 283 -224 -117 -170 -405 -342 -326 -205
2427 -205 -34 -303 -455 -240 -239 -164 -210 -111 158 267 45 427 551 325 495 386 223 294 39 40 107 47 -62
2450 -62 -187 -180 -113 -212 -449 -375 -381 -446 -276 -264 -85 130 -31 217 79 194 122 45 278 325 275 125 212 283 11
2475 11 -8 -13 -55 -129 -227 -373 -271 -420 -446 -446 -216 -116 -162 -189 -60 119 104 158 295 485 399 212 340 389 325 196
2501 196 158 16 -12 -116 -41 -121 -353 -451 -497 -452 -380 -425 -542 -391 -113 -138 -86 71 222 439 311 226 395 536
2525 536 245 415 357 315 320 46 -61 -173 -152 -318 -421 -353 -150 -364 -518 -275 -346 -283 -409 69 -4 174 128
2548 128 136 506 401 445 438 407 461 363 121 219 73 69 -155 -129 -283 -261 -430 -479 -366 -465 -321 -356 -369 -76 -274 -58
2574 -58 249 280 236 223 323 260 230 444 345 376 281 289 -47 157 -128 -183 -279 -315 -360 -347 -380 -372 -238 -309 -321 -220 -79
2601 -79 -62 -282 108 303 204 292 528 445 500 509 162 281 177 63 -49 10 -126 -182 -276 -355 -172 -239 -400 -542
2625 -542 -406 -154 -193 3 -125 157 224 188 201 368 278 257 141 331 385 93 157 56 57 -57 -121 -205 -155 -322
2649 -322 -361 -507 -355 -295 -336 -184 -127 -47 81 -71 47 231 117 57 239 492 381 298 320 252 209 102 -107
2672 -107 -176 -125 -288 -214 -163 -67 -237 -219 -113 -244 -158 -18 77 -40 31 122 139 342 263 312 175 315 216 317 81
2697 81 1 -87 -29 -121 20 -139 -344 -299 -311 1 -288 -146 -212 -93 17 48 39 209 233 194 169 254 239 123 155 124
2723 124 20 108 -7 -122 -131 -126 -91 -277 -331 -187 -229 -120 -258 -38 -10 -100 -24 70 246 83 234 462 348 327
2747 327 190 69 168 77 -62 90 -19 -103 -134 -184 -256 -24 -270 -264 -347 -154 -159 -66 -78 189 138 129 86 190 159 106
2773 106 195 223 390 183 84 38 161 6 22 -146 -76 -161 -295 -392 -155 -332 -167 -264 -95 -56 -133 -152 54 106
2797 106 129 203 319 340 306 100 195 369 65 34 88 82 94 -123 -105 5 -277 -113 -401 -320 -97 -308 -127 -110
2821 -110 42 -53 38 -3 374 142 118 266 365 220 167 196 150 263 196 90 -8 32 -30 -268 -264 -192 -227 -173 -133 -255
2847 -255 -64 -255 -142 106 -116 -15 240 82 180 121 238 154 45 368 -24 -17 161 116 -9 -47 -108 6 38
2870 38 -193 -331 112 -226 -192 53 -88 -50 -182 -213 95 136 266 99 250 332 56 193 107 11 178 37 -80
2893 -80 -46 69 -30 -179 -93 -125 -214 -359 -102 -195 -71 -154 -56 -63 -160 -136 -96 -12 127 200 35 100 228 83 110 -17
2919 -17 110 29 -142 14 31 -95 -86 -59 -45 101 -196 -1 -50 -113 32 -141 -92 -32 46 32 -16 163 69 135 21
2944 21 160 176 28 125 37 -31 172 -179 -25 29 -112 -174 -66 -209 -112 29 -87 -43 -139 43 1 35 12 -121
2968 -121 64 158 7 -70 68 -68 119 -62 -208 52 98 98 35 -125 -58 -143 -58 -89 -233 24 -23 -222 -54 29
2992 29 195 94 24 154 263 49 143 188 92 212 31 96 179 -48 -110 -96 -5 -224 -113 -186 -73 -69 -127 -254 -27
3017 -27 -127 -94 35 -12 35 189 -68 233 180 54 145 215 37 69 18 -175 -113 86 -279 -140 -83 -30 -95 -102 -203
3042 -203 12 -234 -212 -36 -109 11 -177 156 136 200 10 90 236 139 44 -63 33 183 -55 -31 -170 -73 -144 -176
3066 -176 -169 -90 -42 -111 -287 -73 -85 -110 -57 -176 -48 45 47 100 297 119 186 123 26 107 234 -25 10 -187 -58 -117
3092 -117 -129 -32 -79 -102 -337 -176 -66 -109 -227 29 -76 -87 128 248 120 133 101 153 259 146 314 -17 55
3115 55 127 -8 119 41 42 -182 -193 -144 -154 -78 -75 -155 -237 -296 -168 -168 -106 2 83 -14 100 -38 170 234 113 20 214
3142 214 92 123 -42 18 -221 17 61 58 -80 -97 -94 2 -162 -203 -185 70 23 23 -48 330 131 138 95 1 167 63
3168 63 -25 74 -59 -4 -192 -124 105 -56 -171 -94 20 -87 43 -8 -192 -31 123 -123 102 18 65 -25 -108 79
3192 79 48 4 -47 0 34 -36 114 109 22 60 -212 -163 -147 -94 -91 -27 -76 -42 -48 70 88 77 39 8 -11 128 -3 48 180
3221 180 138 -67 120 -80 7 -201 -163 -31 -89 -44 -229 -286 53 -35 -62 -3 63 77 95 93 41 76 95 15 171 211
3247 211 66 30 -30 -40 91 -169 167 -60 -65 -153 -144 -95 -158 -198 -286 15 133 -4 -108 -174 79 183 118 16 147
3272 147 59 -105 103 305 149 64 91 135 130 37 73 -92 -5 -206 -114 -170 -103 84 -43 -114 -189 -82 -73 84 145 111
3298 111 -32 170 223 234 24 -33 207 59 161 -91 -3 91 -15 -200 -109 -229 -116 -192 -210 -101 -13 -23 -27 -148
3322 -148 -248 -84 42 12 83 89 21 192 -4 85 29 65 103 32 85 -101 -185 203 -85 -194 -99 -72 -81 -209 -62
3347 -62 -9 -127 -210 -129 102 43 -38 -141 -12 184 -4 20 9 48 112 67 -14 231 -43 42 -61 3 -18 103 -74
3372 -74 -18 -176 -13 -66 -74 -188 6 -168 0 -60 -137 -26 -40 148 69 36 80 79 19 73 -68 10 -67 -42 -41 -163 37
3399 37 -131 80 70 19 11 -3 3 -124 106 -17 13 -3 96 26 -97 -51 13 47 -12 -18 31 8 -209 22 -2 88 -44
3426 -44 -28 96 66 -51 -213 -122 246 55 199 56 -79 121 -41 131 2 0 -106 -34 -64 137 112 -45 10
3449 10 -89 123 -62 -41 -79 26 -13 145 -38 -38 187 15 29 -24 -35 107 34 90 52 -98 -37 -72 131 68 -60
3474 -60 44 48 -24 -277 -85 -70 69 -4 -29 60 -55 15 47 -187 124 210 78 -24 78 155 -9 -17 126 152 20
3499 20 64 128 13 121 -8 -38 3 20 -81 -162 9 -41 -55 -31 -83 -49 -23 -27 -54 -28 -42 16 -30 71 -27 -16 103
3526 103 1 51 18 28 -155 -9 148 -174 -138 -3 -159 65 -117 49 -53 -167 73 -106 -7 48 -43 -42 135
3549 135 -194 104 71 80 168 85 62 160 261 -5 41 1 -62 -22 71 46 -162 -225 4 -33 -90 -63 -48 76 25 -57 3
3576 3 -59 112 -119 -81 16 49 32 61 83 -130 -31 113 -10 -5 -96 -123 -68 96 -17 -134 90 -25 -29 13 -95 -44
3602 -44 28 -188 20 110 23 -26 47 -306 89 24 92 -11 207 -40 23 59 -34 40 201 69 81 -69 22 -32 -31 -136
3628 -136 -101 -46 -112 -127 -221 -12 -42 21 -6 95 64 128 -59 -122 -43 147 85 20 88 -148 -47 3 197 -78 -120 8
3654 8 -18 -50 -146 -15 -125 -24 13 68 -38 -62 45 29 -75 35 -40 60 26 204 97 -42 -67 86 138 105 76
3679 76 -15 23 -123 30 -184 -83 -60 -53 -18 -58 -88 4 -33 20 71 -80 145 96 162 -118 106 -90 5 -55 -140 -54
3705 -54 87 -262 -36 126 124 58 93 0 -47 13 -256 76 -71 -8 92 40 17 170 28 -11 48 -2 -88 37 64
3730 64 35 -135 86 -61 142 63 120 114 -11 15 98 -19 107 133 -58 -86 97 170 136 10 -43 48 -17 39 -119
3755 -119 -90 -94 -127 -92 -39 51 -92 -123 -131 -82 -66 -14 132 14 -66 64 53 -75 61 28 91 78 28 -18 15 65 3 48
3783 48 64 -118 -11 44 24 -153 106 -27 6 -73 -38 83 -75 -94 102 -68 75 27 64 -116 133 44 -15 10
3807 10 2 26 -108 -57 130 -98 63 4 -117 -31 -16 -79 -14 45 56 -173 142 158 -56 -36 100 81 -37 104 -33
3832 -33 -165 -102 6 4 87 50 110 -1 185 -63 76 -159 -214 67 -216 -6 -95 -94 -70 114 -22 -33 52 -40 105
3857 105 142 45 32 90 54 147 61 11 83 116 202 59 -176 -20 34 -118 -36 -30 111 -53 30 -162 67 223 -38
3882 -38 244 -53 -86 84 -76 20 27 -52 -55 -179 95 23 66 -32 -37 -34 -119 12 58 -58 -188 56 -28 99 23 -226
3908 -226 -76 -84 53 -153 -61 32 -11 -51 -58 -48 -6 -89 17 46 1 30 -2 135 44 33 -10 10 87 -20 -47 87 -109
3935 -109 59 87 39 -79 -56 63 167 48 19 100 43 22 104 12 -39 -48 -26 -75 -228 -78 182 54 21 -118 45
3960 45 -15 -1 191 76 40 -79 1 43 -18 32 -74 87 -40 -145 61 29 -123 -20 69 -67 -24 -56 39 -4 -192
3985 -192 122 134 134 57 7 105 35 -33 168 -56 48 60 -44 -57 -26 14 -21 -72 -99 -95 -99 -74 -10 -187 -108 30 -7 106
4013 106 -41 95 63 -64 -23 -7 -110 -50 48 -27 -22 107 112 -159 4 93 168 51 -58 -31 -120 41 44 152 70 -76
4039 -76 -101 -18 -223 -86 -72 -120 10 -70 -31 203 -76 -45 -121 111 126 -120 -26 61 24 11 9 -11 0 14 24 -191 -110
4066 -110 51 11 4 72 13 -62 -46 77 -90 83 -59 62 -5 -77 184 -70 40 7 28 32 61 -40 -46 -16 24 -59
4092 -59 1 -27 -53 2 19 3 -72 -95 -72 -24 37 9 70 -10 -145 33 34 -194 79 82 -50 -33 17 -95 30 69 141 79
4120 79 -15 99 -27 -18 31 -24 -50 -66 -24 -57 2 -59 -23 -62 -123 15 18 -37 20 94 -183 79 24 178 64 -59 -34
4147 -34 37 -245 103 40 94 161 -88 -50 -4 41 -119 101 35 90 -7 15 -56 -46 -51 -56 117 -51 -68 1 -3 90 -146 -22
4175 -22 15 -74 39 -134 -84 -113 -30 -28 19 -74 61 -100 29 16 -21 27 -11 119 108 13 -93 -64 -12 -39 -75 -92 -53
4202 -53 -13 34 -23 -21 -29 66 32 5 162 -84 -24 -57 -38 215 99 36 29 -42 -30 -52 62 -83 41 9 -30 -83 12 -57
4230 -57 -88 -19 100 22 196 113 -57 47 45 68 -32 92 2 179 -20 36 46 -51 68 15 2 8 -119 -96 -66 19
4256 19 72 18 -9 18 -78 127 -64 61 -61 -72 -37 74 -62 -126 35 121 -131 -47 57 1 84 -27 -87 37 -69
4281 -69 212 27 41 -12 -44 -248 -49 107 -105 -134 32 -47 -204 -127 -20 -29 159 47 -33 -69 -92 -118 -8 67 2
4306 2 79 -43 53 44 26 -40 -131 2 160 38 90 1 -136 11 -36 -23 -1 -85 37 32 -71 -19 -140 -2 -3 127 65
4333 65 276 -94 1 28 6 -31 -26 14 60 -3 -106 -101 -51 53 10 145 -163 -85 -36 84 -239 -59 18 -136 105 108
4359 108 -8 -29 50 90 45 17 -4 -115 -111 62 44 64 14 20 18 -15 -64 211 -47 -21 -51 -55 57 0 43 214 105 129
4387 129 -4 -10 14 -166 58 91 14 -62 -157 -29 73 176 38 -44 -136 91 -66 -37 -50 -88 96 63 -34 63 41
4412 41 13 -84 29 -102 0 18 57 -41 -57 -44 89 136 -27 -33 -17 -74 -31 15 -35 -106 -51 1 30 151 -274 34 5
4439 5 -68 63 63 -84 -8 65 -84 -82 5 -134 22 72 -18 -10 50 86 -27 48 170 88 -84 29 -117 37 -120 -78
4465 -78 147 3 161 -72 -193 136 60 -38 -149 54 -135 -97 96 56 -58 23 -11 -30 9 -125 155 -5 -101
4488 -101 -35 37 -27 7 -4 83 -69 167 16 120 12 75 30 -118 14 24 -73 65 -82 -36 -100 49 2 8 -96
4513 -96 -149 -39 -133 -130 -93 29 11 46 -51 -66 -36 -54 -167 9 9 -23 -21 106 144 19 -43 65 9 -154 39 -13 2
4540 2 -76 66 -84 16 102 -4 27 103 26 -115 -161 18 -48 -40 46 43 -4 -91 -12 -98 87 114 -19 72 8 27 -51 -142
4568 -142 90 22 15 -1 315 55 -43 234 37 43 -7 -50 -66 -13 23 113 -76 -57 -52 3 -30 40 -6 64 36 -85 1 -41
4596 -41 -110 -21 -106 -41 -86 -26 -155 -158 15 -29 -17 -187 -32 -51 39 129 64 45 92 68 -64 77 100 -3 32 21 77
4623 77 12 189 44 -169 -161 -29 -5 -37 -26 -57 66 -72 -122 -82 -47 54 -160 91 -94 121 77 -11 -211 -24
4647 -24 -66 171 -19 -144 186 38 -60 64 -36 39 -138 57 99 -33 71 90 32 74 13 -119 50 -159 105
4670 105 -106 -26 -6 58 -189 56 43 -47 111 32 49 77 -37 -6 -1 -5 15 -61 -156 -101 -159 47 -22 54 -46 5 112
4697 112 90 -56 -16 5 -35 122 -57 271 -54 -36 20 -39 -13 -42 -12 -81 -94 -17 -45 -115 -80 -114 9 35 106 -82
4723 -82 103 -30 -136 178 -96 -75 -14 111 4 46 224 -4 25 -6 78 -154 135 140 90 58 -119 43 -153 66
4747 66 -82 102 19 84 -27 -108 -56 -35 27 177 87 -43 -95 -52 -146 120 -42 -120 -106 19 -115 77 77 73 -85 41
4773 41 63 -28 121 -19 -58 50 -34 -112 224 13 -173 106 40 -44 -81 -126 -17 -106 -7 22 -102 71 -82 33
4797 33 -129 -3 28 -46 -80 54 -1 -50 87 -1 48 -13 -141 70 66 -67 222 33 -62 151 -17 33 -147 82
4821 82 -30 -156 -22 34 4 -16 53 -63 42 -147 17 105 -52 -77 -23 60 2 166 28 -24 205 81 -129 -103
4845 -103 -20 114 -11 116 -108 55 45 -78 -42 -59 23 0 -102 71 29 23 -41 19 -65 30 26 151 -17 51 -59
4870 -59 72 178 23 5 -72 13 58 42 -208 -107 -7 56 -81 116 -115 -75 -34 40 -31 -45 -179 -214 89 81 24
4895 24 -33 -7 20 -46 90 54 118 -76 85 -279 -32 110 146 106 -49 -100 23 -150 3 108 24 49 -37 22 -85
4920 -85 90 2 -91 1 -12 88 51 -96 61 -42 -17 85 22 33 -78 -13 49 41 17 25 -167 -91 -27 78 -154 85
4946 85 -60 -81 22 -103 -110 70 -155 -86 157 54 86 61 -53 -24 9 -97 77 38 -68 49 112 -8 -121 -71
4970 -71 -51 -97 57 56 -37 82 -175 -75 66 74 -107 -137 -59 -132 100 32 -17 26 57 188 0 147 -279 -193 0
4995 0 12 29 -18 103 -90 -29 12 -73 -11 -147 -69 -158 -40 -22 -36 -122 142 58 -33 -43 -136 15 -39 -113 142 -6 4
5022 4 -7 -62 36 -74 62 -23 21 127 12 59 47 -16 -92 -95 57 7 -144 58 -170 70 14 -18 -32 111 -49 117
5048 117 -57 -142 -68 96 17 -160 -48 -109 -75 -49 -165 1 20 -26 -31 12 55 89 57 -79 1 -46 24 -3 -48 74
5074 74 -10 -62 -71 34 19 6 103 -23 62 207 2 -63 -74 74 104 -68 121 50 -73 -16 -37 -17 10 25 94 -269
5100 -269 -66 58 57 14 -93 67 -115 137 51 -13 -60 -23 2 5 78 222 52 -94 16 50 -51 60 80 165 -94
5125 -94 112 -33 8 11 -72 148 -18 -21 52 -47 -40 -97 -64 -184 -107 -106 -8 -7 28 67 -143 40 29 -68 -69 105 12 -65 70
5154 70 208 -61 107 -80 -126 57 -8 -110 4 44 -148 -9 62 -94 74 98 61 -37 12 -71 -18 91 -13 -14
5178 -14 10 -120 26 -27 21 -137 100 -120 -67 1 -79 107 -119 -84 -100 79 -68 -17 -53 65 -47 49 93 190 3
5203 3 -64 -64 71 -20 39 -22 -38 37 -100 -148 91 38 -61 -120 58 165 35 85 39 11 -86 -110 -4 68 -114 29 122
5230 122 -76 85 56 -24 137 58 -9 -33 108 6 55 140 4 -9 -14 23 108 -154 33 68 22 -104 -19 56 -13 -34
5256 -34 -120 28 71 56 71 -21 -82 56 23 -54 -140 -182 53 -177 -35 -61 -75 101 20 25 1 -6 -84 -150 34 35 -70 53
5284 53 -11 -111 80 16 -80 28 161 -75 -53 18 -67 -128 83 -146 -98 52 102 -205 95 -46 -95 38 49 -6
5308 -6 -23 -3 -49 55 -64 -1 43 60 85 -105 35 11 -114 46 18 26 -54 30 88 -31 -16 -53 41 -221 61 87 37
5335 37 100 34 190 52 75 78 -98 -112 53 -20 -63 -20 -51 -70 -3 -2 20 -95 43 -41 14 83 69 -35 14 -138 13
5362 13 -3 -107 -80 58 -147 -80 -65 2 -24 104 -78 46 29 135 103 19 16 -140 75 66 110 95 5 17 -39 -9 -108
5389 -108 49 37 -39 -106 -1 104 26 84 -32 -62 1 125 88 -118 -109 -39 24 71 148 83 -8 73 34 141 -53 -25
5415 -25 -30 -143 -52 16 -26 70 -35 -35 -169 -59 100 -59 -50 -29 -140 96 29 -18 -127 74 84 38 239 -31 42 -53
5441 -53 99 14 21 -80 85 87 -37 -7 -44 24 -42 34 -145 144 148 17 17 30 9 32 -61 133 -84 63 -150 100
5467 100 -28 -48 89 86 -191 69 -95 132 -71 -113 -31 -8 -64 73 -157 64 73 78 -16 142 54 37 357 -25 90
5492 90 -2 59 129 -61 105 118 -70 -74 -252 54 -44 71 12 -78 -45 -88 -148 -130 -82 102 -79 80 -51 213 65
5517 65 151 -13 -2 117 -108 115 10 60 57 38 7 78 -257 -122 84 63 65 195 77 -61 -38 37 8 -27 53 -122
5543 -122 -130 -72 27 65 -99 -222 145 0 83 -97 9 27 3 196 98 24 58 -66 -24 -34 -1 -134 48 126 52
5568 52 14 -48 -112 -84 63 92 96 57 -22 178 111 -77 -191 110 95 27 92 73 -57 71 39 -41 40 -77 11 -70 -67
5595 -67 142 -204 30 -260 127 55 -39 -87 -39 -2 -122 -129 -61 17 -94 -74 -30 14 183 68 54 -182 148 27 -145
5620 -145 161 -58 196 -72 22 0 45 94 -93 149 60 -3 -51 -9 -104 -14 31 -12 -17 78 -67 -30 107 -126 104
5645 104 67 66 92 173 -23 173 19 -62 -95 -14 -47 -84 43 40 30 34 -172 71 -98 -39 -12 -108 -41 -30 -17 -99 6
5672 6 -108 8 82 12 -172 107 -36 73 -132 48 -122 -203 41 76 -147 38 5 179 68 -93 -88 101 18
5695 18 -34 32 -38 82 -28 129 -37 1 -6 -22 -13 -39 49 -52 -142 -76 142 129 181 36 -11 119 89 -107 95 103 86
5722 86 -63 78 -21 -92 -63 -99 -166 -33 -51 44 -4 191 149 -34 18 171 55 101 -100 61 129 -28 20 -178 -104
5747 -104 147 129 43 82 38 -77 -121 85 -44 -11 65 -96 -72 90 -110 -22 10 -128 -59 -76 -40 22 2 130 33
5772 33 -22 -40 -2 -71 79 -65 -164 65 62 27 13 -65 -6 -14 30 83 -116 0 20 177 13 45 9 -64 58 167 -15
5799 -15 -59 31 23 -12 98 90 56 -14 -22 -45 59 90 -14 93 67 68 22 1 -56 20 80 15 119 -16 136 -5 -10 -20 -20
5828 -20 175 -90 73 -160 19 -218 -107 57 2 -196 45 61 -83 -100 -9 26 -129 79 -99 -34 -99 114 -245
5851 -245 -117 149 30 90 97 -165 124 98 -24 19 -5 57 -23 -127 -149 -27 -34 5 60 -115 -34 155 -25 21 -16
5876 -16 15 36 10 80 53 85 109 -98 1 -20 18 -17 -160 -9 30 -21 35 -101 82 -113 -27 -1 94 -123 87 52
5902 52 51 17 112 184 42 -98 -101 -42 127 62 -12 -5 84 58 2 51 191 -94 -1 -99 18 156 10 13 -54 8 -47 99
5930 99 199 10 69 115 60 -93 12 80 76 129 60 -7 -98 12 91 73 -68 -27 -29 -13 -170 115 138 12 -33 78
5956 78 -87 34 140 142 -47 -54 -10 133 21 -36 47 -19 -16 25 -26 -99 -20 -107 -145 -171 144 19 48 49 86 5 15 110
5984 110 5 -30 -42 -10 24 -43 28 -75 56 -1 -119 62 5 -142 -58 -27 27 -34 70 96 -83 93 -16 -215
6008 -215 -163 -26 49 -41 -17 -18 -90 -74 70 -34 28 -57 -77 141 82 18 -2 -234 51 35 108 106 1 -43 -43 78 -58
6035 -58 -56 21 46 -91 -39 87 40 -60 12 -81 -187 -23 40 9 -89 42 -28 1 53 6 7 73 -30 -108 35 -17 1
6062 1 -36 140 -15 50 65 -17 100 -70 -126 -16 83 64 53 -15 174 -58 84 -32 -15 27 50 17 -212 69 0
6087 0 79 -108 -6 -14 -111 43 74 -15 12 68 -41 -144 -159 44 68 -20 93 78 -10 -16 -140 15 96 33 115 -14 4
6114 4 24 -3 -3 7 -109 16 -24 79 53 17 90 42 40 -25 -114 -63 105 -75 23 11 -38 -2 -3 35 -37 113 -107 63
6142 63 -162 87 28 114 75 -70 69 315 18 -108 -12 -116 -75 -61 28 -37 -129 94 -35 -31 -51 -51 34 -93 -135 13
6168 13 117 83 -121 -128 158 -40 103 -113 76 -42 28 -34 -117 -94 -35 91 132 -57 -47 126 28 64 112 14 31
6193 31 -28 -31 -44 226 -26 -75 -15 100 -60 42 30 77 4 -54 17 97 22 2 40 46 -7 -65 27 -6 -83 -70 16 67 -41
6222 -41 -23 -109 53 -157 3 62 -44 -141 -221 -157 -52 -68 81 0 -157 217 60 -73 -39 -63 15 -70 -28 21 27 89
6248 89 -105 30 -95 -105 -18 3 -60 -110 -64 57 133 -28 66 -169 3 -39 -48 138 58 -21 -147 120 -35 146 -45
6273 -45 34 -109 30 55 -124 -59 -13 10 84 -154 33 -31 236 140 1 -51 -99 95 8 6 30 -161 -61 -127 5
6298 5 93 72 -24 -31 19 -32 -50 -141 -13 -28 -241 -77 -111 165 -51 -86 3 80 -15 -98 3 71 210 -68 45 69 16
6325 16 -25 -69 -25 -235 -14 -37 -36 125 -99 -67 -65 69 -15 -92 97 -83 11 -90 -24 -106 -178 1 -23 -112 52 165
6351 165 78 -59 39 143 -111 -3 -108 -89 -119 -50 114 52 147 10 13 83 -31 102 -5 -62 -28 -6 -20 33 -97
6376 -97 -43 103 11 -119 -61 -166 44 23 -165 10 50 -24 28 -96 42 53 -42 84 -96 117 96 -33 -112 61
6400 61 -21 31 15 134 86 -1 -30 168 17 4 49 45 27 91 116 9 17 -88 16 6 -72 -27 -109 19 -27 47 -65
6427 -65 72 -25 -39 -146 -19 65 -35 8 161 76 5 24 -66 -104 -113 -24 -99 -138 57 -51 75 29 -42 62 26 -3
6453 -3 65 56 93 -6 -120 -88 207 92 -139 46 70 -85 -9 -31 -88 -24 83 -112 -106 84 71 68 -74 72 -17 50 -26
6480 -26 -116 -91 -40 5 -47 -104 73 5 78 -13 -20 3 21 107 -180 6 -152 2 136 -75 151 -101 75 -79 -6
6505 -6 -129 7 104 -7 50 -99 -67 54 -31 232 -79 37 -13 -17 37 -19 62 56 -186 -96 106 -211 62 -16 119
6530 119 -51 -28 -8 133 111 119 -58 -110 27 35 54 140 -78 -82 7 -232 -244 118 41 79 -46 73 112 162 -29 -46
6556 -46 -77 6 3 8 -71 127 4 63 45 25 66 -33 -6 -58 15 -88 86 92 -39 -13 113 12 -49 33 -31 -23 5 175
6584 175 55 -60 -135 66 63 -71 24 47 100 -21 -97 -5 -57 -138 121 43 84 60 -102 -58 114 91 -26 -130 38
6609 38 45 -60 -50 10 -37 -51 45 20 -62 111 -59 140 9 -96 141 -37 79 112 -137 112 -59 68 27 -92
6633 -92 40 -70 -83 34 -69 -54 98 66 85 -23 87 -81 98 51 -15 81 -35 -93 -77 5 -45 157 70 217
6657 217 22 38 -111 1 123 73 9 -70 33 36 -82 -61 26 122 -58 -37 65 37 -31 -20 -90 -7 103 3 -70
6682 -70 33 68 100 -12 -162 46 142 -3 139 -128 21 -40 -44 -37 -41 25 116 -154 -132 -57 4 -20 -229 37 -50 198
6708 198 -52 -148 53 -48 7 151 -67 33 53 -99 -93 64 -92 -114 82 -107 -32 11 104 -82 -25 -27 -122 -43 -3
6733 -3 1 10 -51 46 70 118 -22 -99 49 -63 74 -108 49 127 -193 -54 113 -84 -65 -63 47 17 -43 -109 -24 60 -53
6760 -53 35 1 -13 18 -119 -143 -115 122 154 -36 71 67 50 -215 14 8 -44 100 -125 -32 -35 -48 39 -34 48 -32 -5 114
6788 114 -157 36 -46 265 -37 66 32 160 22 -92 -7 -16 -179 71 -38 176 50 12 -108 -6 -138 -122
6810 -122 171 29 -52 -230 -22 70 113 13 -35 68 57 82 -20 -79 45 -174 70 18 8 83 97 85 1 -70 8
6835 8 -33 -22 -41 -209 -96 -3 -164 11 6 45 64 116 -69 -3 -22 -35 -24 -49 189 -181 -67 47 -5 61 -75 74
6861 74 18 -48 113 120 -10 88 -109 -8 51 12 2 18 -26 -191 -27 7 -41 -29 89 46 88 -199 -29 99 -32
6886 -32 37 118 34 -14 -56 -57 33 -98 -117 76 96 -92 45 105 -71 -122 -145 9 38 61 99 -20 196 -80 109 -121
6912 -121 -63 -134 92 14 67 -225 -23 18 -168 47 -58 59 -121 -58 -74 31 -7 -167 -4 -87 -25 7 194 -102
6936 -102 -70 39 124 152 130 -47 102 -78 -38 9 -143 92 2 19 118 -120 -115 83 12 34 9 179 -72 -21 87
6961 87 101 -97 -63 45 -37 -62 84 -134 -134 -20 -15 -29 7 44 207 -29 84 -161 -2 160 8 -28 -10 143 30
6986 30 -46 11 9 -30 -59 -78 80 -59 -86 -238 56 75 24 43 32 -79 -16 -20 -120 -111 -27 53 -79 12 74 -24 58 91
7014 91 91 27 60 15 108 12 12 14 -198 -45 81 -66 -26 59 125 -31 -44 -69 165 30 123 -43 -78 85 -178 -93 84
7041 84 -42 69 -6 -31 18 -43 -154 93 -24 15 -27 179 -34 -51 18 183 -27 30 161 -6 -32 41 46 88 38
7066 38 4 32 19 -41 -79 33 79 3 -8 -93 93 35 146 75 106 64 -2 -59 189 -104 -162 -46 -111 -7 69 80 -46
7093 -46 -76 21 178 -217 46 26 36 141 -179 83 41 -42 111 -1 -77 25 31 -52 -140 -1 -104 161 40 -30
7117 -30 -37 -29 127 -90 -34 -6 -98 16 -2 -98 44 -25 314 5 175 -119 -102 40 36 -77 -89 -119 139 38 -18 -35
7143 -35 90 68 23 41 -133 -102 43 -151 17 79 -31 74 97 -108 6 -87 8 0 52 -62 48 -58 -25 -62 88
7168 88 70 59 18 -9 -48 -10 -32 -37 2 11 111 -122 150 114 -18 -39 25 38 50 80 37 26 -5 144 76 -109 -86 -47
7196 -47 1 -4 -82 15 92 -61 151 -40 21 -25 -8 7 -11 -8 -11 -45 -147 74 -121 -17 -6 16 55 -110 -151 136 -87
7223 -87 -97 -35 67 -30 -110 -67 -75 -43 -16 12 65 14 96 163 178 67 -34 101 -56 150 36 51 74 -58 11 -157
7249 -157 97 146 108 -132 -58 39 18 75 22 73 78 -71 108 31 -43 101 30 1 -173 -98 77 9 82 -112 17 -26
7275 -26 -56 -128 171 102 -74 45 -68 28 36 5 -127 -77 58 -5 47 39 -44 -92 15 -10 15 -37 -33 -67 -59 -15 -165 -89
7303 -89 29 95 46 25 98 18 85 29 70 37 174 -150 36 -80 129 25 -96 -27 88 -17 -25 22 -38 110 14
7328 14 -30 46 125 -107 98 98 8 106 -76 -113 73 -13 24 -110 -22 -19 -220 37 65 -26 -35 82 122 45 37 -50 99 -21
7356 -21 137 -12 90 -75 132 76 -91 78 95 -34 -77 27 103 -7 1 -96 -22 -137 172 -101 -38 77 -48
7379 -48 -138 -159 -19 -58 18 -140 -83 -87 51 -63 39 -1 -69 -15 -106 36 -51 -94 43 98 123 34 98 -37 -5 -138
7405 -138 -60 200 -13 95 -120 51 181 -78 126 -32 -39 -63 -45 54 85 -112 -131 39 -158 -30 -63 115 65
7428 65 -10 -5 -135 71 -67 -101 66 109 92 42 -80 1 -78 -23 51 -27 23 121 -68 126 175 45 -100 140 -75
7453 -75 30 51 -206 -80 17 7 41 -94 39 -77 -33 30 49 47 -56 -8 58 -76 -81 -83 -38 83 89 -53 47 -6 3
7480 3 107 -65 30 129 31 6 -35 159 82 31 77 -10 180 -64 69 118 134 -114 -123 1 84 -42 3 -45 -70 -35 -59
7507 -59 -36 44 -33 25 -24 105 -24 -99 82 10 -221 -52 188 53 9 168 -28 -57 -58 31 9 -53 -117 125 190 44
7533 44 -21 -120 51 -135 54 71 9 65 -80 54 -114 -28 -99 75 -64 6 -82 47 73 -8 70 79 35 55 -3 200
7559 200 162 41 -88 60 -47 -34 1 -65 -38 145 41 -116 -5 39 -48 -98 41 28 43 -9 47 104 -1 -69 171
7584 171 71 -62 -53 -25 -105 -17 -43 -90 -82 -25 21 -39 -34 40 -189 56 -30 18 132 167 159 -52 285 13 25 135 113
7611 113 186 112 -5 43 1 -38 4 -106 5 -11 160 -117 -262 79 94 -162 -66 -55 -72 16 -28 8 48 -30 -218
7636 -218 -14 50 -69 36 54 -23 87 -48 77 92 68 -20 13 -26 -10 60 82 -18 10 -18 91 -114 -42 -108 -215
7661 -215 -42 -4 -165 52 64 -83 -41 33 40 139 -90 -37 93 249 26 6 20 -8 -71 91 54 -31 71 -54 152
7686 152 30 45 -36 14 62 70 -36 -73 96 81 -1 64 31 -12 -35 113 60 -58 186 -86 -59 18 146 -133 -159 -4
7712 -4 -18 -39 50 -14 -52 144 5 124 -49 -63 179 -20 -191 74 167 54 -6 -202 63 -134 149 -170 40
7735 40 -4 137 79 -71 -107 -39 -12 -15 42 81 -241 -42 17 -49 -98 -50 -89 106 -27 -45 3 57 -119 -145 -23 -25 91
7762 91 23 -130 3 -83 63 16 128 -48 1 99 56 30 -198 170 13 -163 -93 132 72 179 -46 -48 49 116 51
7787 51 45 86 -107 -34 37 119 -29 -65 -261 -102 -128 -23 -67 -39 8 -151 168 -16 61 -61 -182 -42 -91 16 -92
7812 -92 -128 142 110 41 262 42 -28 -12 39 -131 -73 107 -65 -53 -107 68 -85 -124 -58 7 6 96 -31 68 4 79
7838 79 107 36 -70 -66 -93 117 51 33 -53 122 -7 116 39 -35 -4 -43 21 34 -53 56 120 104 -39 -51 45 -57 -27
7865 -27 -5 -170 111 215 19 46 -146 -4 -183 -11 -54 -50 -51 -137 -32 -134 -116 -20 14 -70 185 135 121 42 -324
7890 -324 89 -5 112 157 -2 113 24 -25 13 41 236 116 81 70 -162 -21 73 42 71 3 44 58 25 14 48 -95
7916 -95 21 -36 -29 105 50 -32 -64 -62 -10 -109 -170 184 -175 52 8 5 135 -30 -22 63 8 134 87 -21 146 -48 88
7943 88 157 -43 -13 117 -69 -71 129 -24 -3 -18 23 -25 215 76 25 -13 -36 1 -151 -87 -31 -143 21 34 -120
7968 -120 -11 85 31 61 -99 -135 57 -49 111 -39 -32 -143 15 123 -31 16 77 176 61 110 -65 179 152 77
7992 77 -9 -93 11 -68 65 -23 -1 -103 136 121 -49 -6 25 -83 56 -85 -74 -8 -109 43 10 69 -144 64
8016 64 -102 127 -81 7 128 -23 -5 48 55 19 -29 -178 -129 -26 10 -101 -164 26 53 -77 -33 156 21 -250
8040 -250 112 118 -48 -7 -120 -103 -87 -137 -54 34 49 -19 -43 -104 -21 29 72 62 66 70 104 -14 174 -49 -3 29 -166 70
8068 70 74 48 141 32 88 22 -107 0 18 33 -30 -40 74 -60 62 130 -29 39 -173 130 -152 -17 193 -10
8092 -10 22 -16 -13 87 -15 -75 4 209 -68 4 115 -71 -41 -29 131 -42 -45 89 40 -44 -25 -90 60 60 16 0 -105
8119 -105 -67 191 -111 -71 -126 110 37 19 -107 -125 13 149 -152 -40 96 -18 -10 -239 -101 42 -29 220 150
8142 150 92 121 8 -60 -102 18 -31 -141 -159 207 8 -18 148 121 -1 -47 -108 30 111 1 -62 -51 -9 134 -129
8167 -129 83 0 62 71 -70 109 -32 42 -54 37 17 -28 -19 -70 120 -22 -21 -98 34 -50 -40 -62 -12 149
8191A49
$$ Imaginary data points
##PAGE= N=2
##DATA TABLE= (X++(I..I)), XYDATA
0 0 0 0 0 0 0 0 0 0 0 0 0 0 0 0 0 0 0 -8 8 -8 8 -8 8 -15 16 -16 22 -24 26 -32 35 -40 47 -51 58 -66 74 -83 92
39 92 -104 114 -129 141 -157 173 -191 210 -233 256 -281 311 -342 376 -416 460 -509 567 -631 705
59 705 -795 902 -1037 1205 -1427 1736 -2191 2935 -4367 8153 -40218 -107966 -72324 -36543
73 -36543 16441 70611 129449 155834 151770 128211 107827 80758 58298 38381 25555 12680
85 12680 -2481 -20652 -32762 -42204 -47354 -58678 -81720 -107233 -124509 -136464 -135224 -108469 -52112
98 -52112 8056 49426 78940 96858 88245 62092 45505 50997 65496 78223 93596 104622 94685
111 94685 66261 29139 -6294 -36611 -65601 -88914 -103225 -110598 -109640 -100663 -84375 -58132 -29548
124 -29548 -10652 -6209 -7250 -3810 -779 5254 32171 74094 107264 122111 123772 112640 81547
137 81547 37737 4415 -12629 -23658 -30923 -34146 -35211 -41411 -55432 -67715 -74272 -76636 -75187
150 -75187 -71350 -63338 -47182 -25601 -385 26505 55349 81792 90901 81977 69551 56131 38950
163 38950 25805 26969 38314 41865 32596 19416 -534 -30110 -61071 -81001 -85054 -80709 -73059
176 -73059 -58602 -40905 -26300 -14980 -6487 3235 12940 19428 23656 27304 34974 47044 55311 61821
190 61821 70102 71107 57030 31822 7163 -13664 -34762 -48815 -46553 -36918 -30971 -30572 -32102 -34740
204 -34740 -42843 -51790 -50629 -40614 -25560 -8387 10010 29737 45060 53379 56290 54437 49934
217 49934 42360 29255 17843 13830 12546 10384 7534 7428 3164 -13245 -33492 -48080 -58337 -65329
231 -65329 -64158 -50116 -28984 -12804 -1578 8713 14476 14647 12039 12004 18009 24905 31769 39882
245 39882 46834 51160 48952 38717 25313 10689 -6390 -24429 -37856 -40634 -37555 -35838 -30473
258 -30473 -22110 -18094 -22133 -29107 -31065 -29213 -26525 -17621 199 20170 35968 45411 51027 51927
272 51927 44451 32351 21741 13643 8497 4865 2458 3090 3367 -1020 -10278 -21726 -30615 -40756
286 -40756 -50988 -52945 -44812 -32921 -20758 -6936 8858 19774 20886 19244 18801 18316 17008 17958
300 17958 24861 33558 37296 37162 34185 26349 13620 -3360 -18900 -29092 -35442 -37699 -36126 -30188
314 -30188 -21234 -16461 -16484 -16084 -15260 -16181 -17422 -13602 -2151 10407 20281 31376 41718 45464 41145
329 41145 32344 24473 15577 5173 -1775 -3520 -2805 -2912 -5427 -8503 -12569 -20109 -29012 -36777 -39176
344 -39176 -35720 -30755 -22659 -9233 4258 13404 17184 19943 22106 19564 15275 15002 18538 22362 23823
359 23823 24929 26566 23007 12640 1095 -9638 -18917 -27558 -32850 -31456 -26531 -21816 -17352 -13730
373 -13730 -10552 -8939 -10864 -11505 -7738 -1588 4837 11976 22228 31666 34567 32709 29496 23995 15613
388 15613 5244 -1279 -2740 -4296 -6597 -6930 -6713 -9065 -15840 -22961 -26723 -29162 -29765 -26549 -19251
403 -19251 -8549 1267 8138 14441 19064 20521 17961 14576 14602 15700 15230 16172 19003 20978 17866 10816
419 10816 3164 -4536 -14968 -24541 -28707 -27432 -24123 -20953 -15519 -9337 -6362 -6803 -7405 -6695 -4322
434 -4322 -1464 2836 10437 18770 24918 27467 27918 27231 22586 14038 5685 -226 -4483 -8616 -10686 -8714
450 -8714 -6275 -7946 -11676 -15383 -18985 -23646 -27448 -25263 -17322 -9374 -848 8251 15960 20006 19454
465 19454 16975 15443 14185 12631 11453 12354 14765 14834 11801 8619 4633 -1734 -10777 -19713 -24005 -26458
481 -26458 -27366 -24214 -16949 -8855 -4120 -2509 -442 208 -1631 -2374 982 7827 14931 20254 25333 27876
497 27876 26409 21059 13452 6869 1468 -4822 -9973 -11600 -11623 -11691 -12759 -12871 -11840 -13467 -17242 -19870
513 -19870 -19685 -16862 -13013 -6247 4650 14734 20319 22120 22256 20310 15398 10449 8848 9718 10682
528 10682 10315 9037 7010 3073 -3976 -11116 -15938 -19601 -22834 -24925 -23166 -18141 -13985 -9297 -3337
543 -3337 2809 5992 5097 4519 5891 7617 9226 13575 19762 24720 24698 20887 15920 8766 289 -6956
559 -6956 -11484 -12013 -12123 -13055 -13077 -12492 -12971 -14667 -15712 -14355 -12258 -11005 -8510 -3872 2650 8888 13300
576 13300 18548 22703 22324 18270 13436 10046 7122 4004 3410 5330 5491 2673 -2574 -8481 -13631 -19010
592 -19010 -22582 -22129 -18678 -14487 -11108 -7390 -2469 1287 2903 4662 7222 9685 10076 9866 11614 14735
608 14735 16163 16364 16295 15257 10388 2239 -5026 -9911 -13584 -15526 -14615 -11401 -8436 -8729 -10312 -11070
624 -11070 -11407 -11705 -10554 -6318 -552 4874 8488 12230 15377 17183 16409 14467 13217 10707 6485 2245
640 2245 653 739 -57 -1377 -2069 -3620 -8019 -13561 -17896 -19178 -17901 -15407 -10464 -3665 1959 4900
656 4900 5282 5881 6611 6071 6130 7731 10446 12404 12373 12349 12028 10258 6158 1354 -2492 -6401 -10999 -14645
674 -14645 -14481 -12532 -10201 -8014 -5656 -3711 -4230 -6767 -7171 -5720 -2858 922 5621 11655 15776 16165
690 16165 14793 12738 10051 6495 2476 723 102 -1015 -2459 -3447 -3262 -3831 -6503 -9313 -10718 -12467
706 -12467 -13982 -13740 -10486 -4983 -161 3821 8006 10261 9939 7658 5527 5734 5912 6141 7585 9370
722 9370 10126 8202 4495 1327 -1798 -6338 -10188 -12023 -11943 -11105 -10733 -8539 -5266 -2730 -2244 -1966 -1105
739 -1105 -523 -1087 -117 3096 7240 10449 12433 13523 13595 10789 6037 2415 -447 -2328 -4151 -4924 -3722
756 -3722 -3396 -4703 -6111 -7305 -7852 -9310 -10885 -9784 -7102 -4728 -1955 1689 5913 8906 8980 8940 8569
773 8569 7418 5642 4121 4500 5861 5742 5005 4252 2555 -507 -5376 -8543 -9703 -10760 -11331 -10054
789 -10054 -7418 -4592 -3157 -2560 -1092 310 387 -54 1485 3844 5779 7145 9265 10764 11239 9153
805 9153 6506 4195 1529 -1994 -4121 -4514 -4177 -4309 -4982 -4896 -4980 -6311 -8163 -8909 -8180 -6244 -4928 -2326
823 -2326 1757 4791 6458 7028 7702 8201 6778 5059 4631 4940 4757 3909 3782 3867 2710 -570 -3418 -5632
841 -5632 -7409 -9523 -10520 -8869 -6453 -5016 -3393 -1648 -286 288 -592 -228 1265 2680 3886 5516
857 5516 7973 9914 9601 8097 6835 4603 1474 -1775 -3318 -3477 -4044 -4641 -4315 -3390 -3659 -5095 -6661
874 -6661 -6738 -6630 -7119 -5712 -3085 530 3170 4900 6867 8016 7572 5896 4434 4146 3693 2645 2757
891 2757 3579 3721 2464 429 -1226 -3397 -6245 -8678 -9313 -8311 -6970 -5869 -3796 -809 531 438
907 438 571 1042 1479 1430 2041 3913 6234 7368 7711 7816 7495 5446 2013 -605 -2243 -3898 -5239 -5536
925 -5536 -4359 -3385 -3653 -4165 -4089 -4365 -5037 -5987 -5044 -2997 -799 1260 3947 6641 7716 7352 6416 5868
943 5868 4559 2759 1524 1750 2241 1610 878 528 -419 -2472 -5080 -7000 -7523 -7713 -7877 -6544 -3896
960 -3896 -1624 -198 861 2317 3130 2640 2238 2788 3984 4858 5048 6076 7173 6578 4767 2353 433
977 433 -1554 -4084 -5678 -5497 -4978 -4891 -4774 -4337 -3536 -3570 -4270 -3975 -3057 -2052 -767 760 3468 5680
995 5680 6680 7201 7392 6732 5342 3040 2132 1652 952 -5 -321 -366 -1245 -3440 -5129 -5965 -6826 -7583 -7486
1014 -7486 -5802 -3701 -2262 -999 980 2628 3266 3333 3438 4514 4865 4395 4865 5747 6061 5468 3964
1031 3964 2765 958 -1704 -4087 -5498 -5614 -5816 -5937 -5088 -3912 -3397 -3909 -4069 -3119 -2400 -1876 -414
1048 -414 1877 3986 5423 6075 6835 7503 6542 4953 3757 2800 1740 77 -879 -656 -1077 -2070 -3339
1065 -3339 -4084 -5019 -6681 -7767 -7186 -5757 -4129 -2234 -196 2258 3360 3106 3234 3725 4201 4103 4043 4980
1083 4980 5666 5144 4448 3541 2623 1021 -1750 -3441 -4613 -5855 -6521 -6403 -5183 -3726 -3346 -2956 -1922
1100 -1922 -1752 -2122 -2110 -902 1362 2862 4238 6126 7152 7072 5859 4542 3676 2216 474 -685 -1023
1117 -1023 -1024 -1821 -2753 -2909 -3020 -3853 -4991 -5872 -5460 -5217 -4780 -3106 -701 1656 3042 3807 4679 4685 3838
1136 3838 2990 2752 3244 3745 3715 3486 3517 2328 425 -1311 -2459 -3724 -5017 -5914 -5315 -4585 -4299 -3378
1154 -3378 -2123 -548 -258 -461 12 455 813 1369 2366 4141 5529 5699 5329 4919 3719 1750 -206
1171 -206 -1239 -1366 -2093 -2489 -2479 -2403 -2512 -3548 -3758 -3555 -3473 -3567 -3197 -2157 -379 725 1800 3433 4648
1190 4648 4454 4098 3361 2944 2390 1336 1442 1935 1957 1319 230 -559 -1913 -3492 -4500 -4674 -4490 -3918
1208 -3918 -3609 -2511 -1140 -463 -241 287 1110 1759 1715 1905 2696 3330 3565 3591 3918 3810 2868 1218 145
1227 145 -871 -1952 -3023 -3210 -2612 -2324 -2717 -2773 -2654 -2680 -3025 -3061 -2085 -699 101 1007 2193 3322 3862
1246 3862 3565 3328 3522 2857 2024 1249 1145 1169 431 -317 -253 -766 -1713 -3170 -3891 -4048 -4193 -4029 -3163 -1696
1266 -1696 -488 -191 194 1060 1440 1230 1293 1861 2727 3223 3091 3523 3726 3081 2132 766 183 -847 -2259
1285 -2259 -2920 -2734 -2660 -2483 -2611 -2104 -1584 -2198 -2400 -2424 -1797 -1091 -631 638 2466 3314 3671 3627 3677 3087
1305 3087 2317 1201 1208 1134 422 84 -82 204 -441 -1609 -2523 -2916 -3391 -3904 -4064 -3211 -1999 -1277 -391 750
1325 750 1535 1588 1120 1363 1719 2002 1976 2313 2965 3345 2879 2331 1768 738 -748 -2046 -2554 -2591 -2909 -2961
1345 -2961 -2369 -1719 -1511 -1747 -1760 -1378 -1369 -1463 -969 35 1309 2158 2551 3378 3890 3313 2542 1811 1270 611
1365 611 -90 -267 50 -3 -560 -1088 -1174 -1789 -2680 -3330 -3080 -2831 -2353 -1738 -858 445 1174 1314 1479 1803
1385 1803 1684 1255 1275 1964 2102 2233 1980 2054 1814 1163 -173 -1039 -1449 -2220 -2890 -2847 -2270 -1771 -1759 -1505 -999
1406 -999 -688 -826 -1108 -585 294 662 1174 1923 2651 2956 2569 2205 2253 1521 505 220 -126 -139 -524 -1188
1426 -1188 -913 -1137 -1599 -2167 -2457 -2320 -2133 -2175 -1505 -526 245 635 960 1515 1863 1533 1474 1554 1878 1788 1556
1447 1556 1636 1706 1191 210 -250 -732 -1310 -2119 -2496 -2116 -1930 -1928 -1757 -1255 -776 -757 -843 -498 -67 379 702 1234
1469 1234 2140 2495 2341 2390 2345 2021 1217 329 42 -107 -662 -974 -971 -933 -1278 -1953 -1916 -2136 -2354 -2336 -1945 -1060
1491 -1060 -259 82 798 1477 1977 1883 1610 1591 1669 1718 1403 1340 1572 1505 957 371 16 -668 -1565 -2497 -2675 -2408
1513 -2408 -2456 -2434 -1684 -888 -614 -578 -530 134 384 223 653 1517 2099 2403 2731 2752 2609 1948 1008 630 7
1534 7 -474 -1252 -1453 -1048 -1265 -1743 -1729 -1734 -1759 -2316 -2399 -1864 -1250 -657 -157 729 1824 2265 2235 2327 2333 1948 1556
1557 1556 1184 1349 1424 985 792 557 199 -620 -1608 -2056 -2279 -2486 -2631 -2511 -1760 -1383 -1073 -498 355 530
1577 530 471 642 892 1277 1593 1820 2362 2720 2581 2090 1589 940 222 -843 -1230 -1354 -1410 -1701 -1971 -1556
1597 -1556 -1678 -1615 -1942 -1729 -1273 -1201 -1068 -349 665 1279 1545 1891 2347 2496 2029 1527 1498 1119 953 408
1617 408 339 435 -7 -732 -1073 -1661 -1763 -2396 -2420 -2004 -1617 -1411 -1171 -481 81 500 411 786 1243 1319 1147 1430
1639 1430 1842 1983 1703 1490 1360 822 359 -723 -952 -980 -1409 -1689 -1489 -1189 -1259 -1494 -1541 -991 -969 -915 -541
1660 -541 240 630 901 1129 1713 1860 1558 1651 1393 1506 1012 368 280 130 59 -315 -921 -678 -1198 -1685 -2029
1681 -2029 -1846 -1479 -1456 -1021 -547 280 411 338 750 885 937 894 1231 1478 1527 1361 1353 1157 1002 485 -220 -487
1703 -487 -778 -1082 -1565 -1444 -1335 -1057 -1256 -942 -780 -591 -534 -674 -109 367 583 951 1508 1874 1788 1341 1400
1724 1400 1310 673 191 163 129 30 -519 -525 -494 -851 -1149 -1322 -1629 -1339 -1417 -1534 -842 -270 357 527 779 1244
1746 1244 1139 916 606 898 1105 1157 882 1202 1019 698 180 -2 -363 -911 -1397 -1733 -1492 -1421 -1176 -1120 -521
1767 -521 -272 -518 -536 -187 56 88 98 676 1126 1527 1450 1657 1659 1265 710 205 -77 -223 -379 -577 -637 -557 -838
1790 -838 -1049 -1103 -1157 -1246 -1400 -1267 -770 -460 -351 151 776 1233 1260 1147 1151 1188 1028 816 870 873 853 409 481 422
1814 422 -176 -718 -1239 -1233 -1206 -1554 -1515 -1014 -666 -668 -492 -289 22 91 58 289 639 753 945 1170 1456 1550 1230
1837 1230 778 585 455 4 -395 -565 -517 -653 -892 -965 -811 -843 -1351 -1384 -938 -743 -700 -415 158 611 905
1858 905 698 959 1237 1072 725 854 921 895 595 465 603 206 -137 -610 -762 -831 -911 -1363 -1216 -839 -849 -852
1880 -852 -564 -247 -70 -125 -88 246 674 607 832 1212 1266 1051 767 900 886 531 177 -37 -132 -188 -545 -763
1902 -763 -674 -761 -1054 -1020 -1121 -724 -730 -794 -444 186 488 553 602 920 1041 650 691 812 669 880 714 527 682
1925 682 226 -147 -403 -461 -680 -1174 -1349 -1068 -779 -765 -702 -232 -10 -234 -182 54 251 400 580 760 1133
1946 1133 1143 894 1039 1008 689 127 -49 -195 -430 -690 -721 -546 -609 -746 -601 -684 -700 -874 -818 -706 -352 71
1968 71 229 556 853 1108 1137 775 697 807 385 275 632 408 259 62 -54 -131 -464 -894 -1153 -1095 -1165 -1012
1990 -1012 -1198 -525 -189 -5 164 294 471 470 454 680 934 832 870 931 936 1007 606 249 90 -144 -342 -1036
2012 -1036 -970 -876 -812 -1111 -820 -622 -587 -604 -643 -301 -121 96 249 493 1053 1158 1012 1245 1101 996 595 367
2034 367 339 228 -227 -182 -190 -390 -639 -1066 -1071 -912 -1262 -1217 -872 -533 -204 -376 48 586 477 525 730 944 1049
2057 1049 783 851 967 916 652 522 165 394 -158 -586 -629 -733 -930 -954 -1162 -707 -679 -893 -737 -439 -199
2078 -199 46 -76 278 825 849 976 884 1192 1106 723 448 567 466 186 -108 -29 -175 -573 -825 -750 -960 -1056
2100 -1056 -1057 -1121 -750 -612 -559 -28 141 370 518 358 595 874 927 823 896 987 978 568 229 456 133 -325 -594
2123 -594 -518 -648 -1068 -1008 -772 -743 -538 -592 -562 -322 -314 -140 46 558 724 730 792 1279 1089 736 656 524 644 261
2147 261 -35 -91 18 -289 -419 -609 -473 -800 -946 -749 -717 -520 -649 -329 -89 346 277 400 601 609 640 413
2169 413 439 754 803 474 573 376 429 118 -324 -281 -456 -802 -862 -891 -579 -536 -631 -318 -142 -23 -57 -130 361 410
2193 410 254 434 616 831 762 605 603 574 334 -13 -73 -163 -225 -572 -630 -466 -379 -552 -773 -654 -511 -545 -577 -240
2217 -240 163 12 380 555 745 446 325 592 583 547 242 129 141 343 -84 -197 -217 -212 -532 -958 -642 -708 -586
2240 -586 -441 -521 -252 -150 -29 95 290 447 447 237 712 659 565 527 418 387 424 330 -184 -202 -354 -515 -500 -654
2264 -654 -407 -441 -742 -481 -423 -502 -322 -114 61 204 174 310 700 674 674 523 517 628 501 390 256 171 54
2287 54 -51 -277 -255 -379 -589 -642 -639 -606 -692 -399 -276 -216 -69 -132 72 309 346 265 358 565 622 566 565 474 436 377
2313 377 121 -38 25 -241 -430 -223 -266 -454 -593 -625 -438 -423 -591 -273 -195 -27 -4 275 256 553 524 514 621
2336 621 639 375 475 438 409 151 134 52 110 -214 -269 -594 -471 -467 -562 -474 -497 -560 -241 -190 45 141 -53 138 202
2361 202 273 529 407 316 654 625 548 385 163 231 -214 -319 -331 -440 -423 -470 -418 -342 -368 -573 -362 -312 -239 -196 -192
2386 -192 61 247 277 403 352 535 350 342 522 339 271 138 141 191 113 -227 -222 -299 -312 -489 -561 -478 -373 -480 -391
2411 -391 -201 -72 -62 37 187 123 204 221 150 519 393 266 344 368 418 303 -16 -103 -219 -266 -417 -249 -295 -254
2435 -254 -247 -365 -160 -132 -159 -116 -122 132 189 204 133 587 517 278 265 360 300 -62 -52 130 -91 -41 -198 -284 -240 -225
2461 -225 -333 -349 -325 -349 -317 -267 -155 -71 -84 302 119 469 413 217 466 549 261 145 159 113 198 16 -157 -144
2485 -144 -243 -269 -260 -391 -390 -454 -242 -174 -171 -143 -75 -3 41 170 124 270 253 381 482 369 397 416 376 69 18 50 34
2512 34 -294 -290 -168 -278 -359 -365 -415 -478 -385 -285 -46 84 -27 174 288 248 281 276 472 398 215 491 237 292 310
2537 310 19 -94 -150 -137 -234 -551 -378 -287 -392 -393 -384 -206 -336 -356 -212 -10 126 10 194 329 530 445 592
2560 592 540 435 395 83 251 201 -125 -197 -274 -268 -280 -255 -460 -339 -453 -491 -427 -342 -109 -234 -44 48 245 287 372
2585 372 271 486 363 310 312 416 329 293 108 115 82 -162 -459 -460 -435 -324 -594 -536 -336 -368 -209 -254 -147 -48 61
2610 61 55 227 210 265 435 501 641 383 415 258 313 147 105 -130 -189 -190 -311 -306 -241 -186 -351 -386 -220 -140 -173 -219 -94
2637 -94 -27 132 121 371 301 450 211 303 189 255 160 126 110 -64 26 -2 -90 -230 -305 -231 -460 -425 -241 -174 -112 -119
2663 -119 -120 78 77 -14 284 234 120 306 325 197 202 -74 213 102 3 -139 -2 -75 -220 -276 -227 -290 -141 -193 -175
2688 -175 -100 -23 -89 -76 86 -32 169 348 253 289 294 227 309 171 268 46 -89 -18 -85 -177 -204 -97 -171 -203 -231 -169
2714 -169 -29 -38 -157 24 45 72 199 63 350 285 77 132 332 268 122 77 231 -19 90 -34 -112 -133 -338
2737 -338 -236 -331 -138 -93 -272 -144 -92 -85 -94 33 37 96 270 268 162 362 164 172 193 308 309 -22 -3 34 -17 -128 -309
2764 -309 -231 -182 -223 -231 -229 -278 -220 -227 15 83 96 162 178 216 179 198 208 460 277 186 313 209 -55 46 -84 47 -142
2791 -142 -184 -365 -330 -157 -71 -250 -235 13 124 -148 -153 86 19 203 78 297 332 332 296 185 314 142 189 -65
2815 -65 12 -13 -20 -150 23 -189 -169 -160 -141 -139 -65 -189 -170 34 -79 140 85 201 165 26 119 267 283 184 115 91 137
2842 137 22 52 -22 -154 -52 -222 -254 6 -219 -194 -231 -216 -93 -266 -87 -77 -45 -45 -30 -164 206 244 118 235
2866 235 427 340 234 132 4 -7 29 -173 -110 -78 -129 -200 -218 -53 -105 -111 -186 -131 -117 98 -217 -45 84 42 9
2891 9 177 242 192 84 19 156 297 -1 70 129 130 122 -125 15 32 -10 -274 -12 -77 -227 -120 -65 -44 -46 66 66 48
2918 48 10 31 -151 39 77 -27 143 226 66 133 -105 -93 90 -31 -15 -28 31 -57 44 -79 11 -128 -92 55
2942 55 -47 92 -10 -28 -43 31 260 210 78 -4 230 61 19 106 186 59 30 20 -109 -125 -168 -142 -187 -47 -67
2967 -67 -54 -2 26 126 -1 -29 64 88 143 48 105 113 192 128 58 -48 -44 91 12 26 0 -78 -5 -50 -14 -202 -242 78
2995 78 41 -177 -44 0 54 116 134 203 238 65 201 137 53 143 -12 0 149 -145 -110 -82 29 -42 -285 -416 -326
3020 -326 -270 -216 14 -123 46 37 -46 60 160 5 -11 128 169 139 220 62 158 133 47 -46 5 -121 -120 -187 -204 -139
3046 -139 3 -29 -141 -147 -261 -251 -20 -115 26 75 9 10 135 267 76 90 294 171 139 254 131 -59 -17 53
3070 53 -5 -19 -215 -211 -175 -191 -148 -218 -201 5 -167 -150 -80 53 226 -88 61 190 141 164 257 164 155 149 -26 80 -2
3097 -2 38 34 -64 -56 -222 -74 -161 -280 -271 -178 -127 -274 38 -10 95 -5 200 180 39 92 204 76 131 231 210 85
3123 85 79 -114 73 -68 -86 18 -199 86 -172 -219 -195 -171 -165 -33 -132 109 -72 -133 70 -61 221 128 42 106 44
3148 44 192 48 84 2 -107 7 16 -119 -25 64 -49 -9 -217 -236 -27 0 -112 -10 -217 -130 217 -55 97 -65
3172 -65 68 240 16 51 104 -11 162 72 -135 13 53 -118 -190 11 -184 -50 -141 46 40 33 87 -104 6 198
3196 198 73 208 124 85 -114 91 -8 -5 102 -85 48 -48 -149 48 -78 -192 -63 -154 -17 1 5 -135 -15
3219 -15 -69 -11 7 29 -59 96 95 121 206 145 71 65 -15 27 53 -58 -64 22 -117 -207 -60 39 -20 165 4 -41 -23 84
3247 84 41 -1 95 119 -18 143 161 -25 -56 92 71 74 -53 128 20 -12 -21 -228 -26 -65 -139 -109 -149 -94 -42 30 -46
3274 -46 65 -45 21 73 5 105 31 231 68 144 171 221 -178 77 198 -105 34 123 -102 -112 -158 -67 -131 -185 2
3299 2 -118 1 -6 -39 29 149 120 127 23 84 385 141 32 114 -42 98 6 48 -16 -62 -5 -46 14 -69 -220 -74
3325 -74 56 -205 -34 48 -59 -127 23 -61 70 217 1 89 17 126 93 -93 29 131 -31 148 27 52 -20
3348 -20 23 -5 -64 -38 -16 -134 -159 -65 28 -81 -109 195 -2 9 -55 127 103 144 25 90 -26 115 21 -9 11 149
3374 149 53 26 -44 101 -72 -26 -22 -17 39 -146 6 -38 -156 129 54 -94 75 -24 -154 -124 76 9 -37 25 166
3399 166 -38 15 8 71 32 -66 50 9 -31 -120 15 -59 -15 110 61 147 178 12 49 -71 178 91 165 176 -42 -10
3425 -10 85 212 15 124 -81 48 107 4 133 48 -10 63 -9 -152 -14 -38 33 7 -26 21 226 35 -42 14 -172
3450 -172 -89 -56 15 41 -18 -22 2 41 11 -35 75 -22 26 46 -64 13 99 96 48 -117 18 -66 -96 -4 71 133 -67 -7
3478 -7 22 112 -91 20 9 -115 -32 -199 55 14 -82 2 16 79 211 -106 -94 129 175 35 -56 221 -42 151 -55
3503 -55 121 -45 28 3 93 130 52 -31 53 -79 51 -96 101 -36 53 21 -73 36 -57 -55 -235 61 101 -81 -85 -28
3529 -28 141 39 182 17 33 140 11 67 -31 -59 33 45 148 55 -95 -65 -81 -10 -142 4 -95 -81 -71 22 -25
3554 -25 40 96 -23 -3 12 119 20 3 61 122 -18 151 -27 -19 160 112 -74 36 -155 -109 -119 -46 94 -9 -188
3579 -188 56 -84 49 -84 -21 -63 82 6 40 44 167 158 181 35 209 33 -142 32 73 71 -41 -82 36 218
3603 218 -117 -44 -68 -81 -73 59 68 -50 -80 -151 -59 40 96 -93 47 -12 24 57 -13 -15 154 196 -64 245 -2 32 49
3630 49 10 8 -42 32 -67 -30 37 -48 -58 57 -89 -11 -15 -47 -65 -5 -22 -80 107 244 -42 112 47 -30 -44 32 37 -29 -3
3659 -3 -85 102 -15 -2 10 -41 -93 105 53 -6 -97 -70 80 -19 40 4 -25 37 106 -130 12 53 117 14 154 -136
3685 -136 80 34 102 5 -98 -51 0 -77 53 71 114 20 140 21 -132 36 -45 -59 -35 -93 -6 -71 -13 -43 -163 41
3711 41 31 -3 -121 -83 17 -63 -86 -123 224 -4 86 3 -38 117 -93 -42 21 123 73 -3 143 -89 -97 218 -68
3736 -68 41 -203 -103 -82 -116 33 47 43 171 -17 -71 33 3 -49 78 -110 7 166 137 9 -87 21 -11 -82
3760 -82 -44 -96 67 28 -37 -127 138 -98 -39 -58 -113 58 -42 -94 104 78 155 3 -37 36 169 60 -7 32 6 120
3786 120 15 -2 155 -32 -137 138 -54 -248 -90 -60 -26 42 -15 -117 -36 -38 170 45 -22 199 120 17 6 56
3810 56 -132 104 175 -38 65 28 75 -65 -15 -65 18 -158 -133 -30 -54 -49 -81 -74 3 107 -39 -177 -89 72 -102
3835 -102 -88 275 17 119 75 19 58 76 2 69 97 -199 -15 129 -207 -124 3 0 -34 -35 62 -10 48 -83 -81 -83 6
3862 6 -107 75 -7 15 138 85 51 137 131 59 41 -40 -159 -43 -104 -152 83 28 -55 -27 -98 61 -130 -11 -26 35 145
3889 145 -29 75 176 -1 70 102 -84 15 154 28 -24 -31 -14 -40 -23 141 68 -17 198 5 -36 55 35 -3 93
3914 93 -112 -143 49 -22 75 140 69 -8 -113 -110 50 -2 143 -57 -52 -144 -17 56 -82 23 -89 49 -94 -59 115
3939 115 -19 84 51 50 136 -124 -36 96 63 4 -36 -20 -133 -75 43 44 81 -80 -66 -60 -9 -203 -126 127 154 54
3965 54 41 -29 -93 120 -137 75 51 -120 75 14 1 -9 -29 62 -34 -73 100 25 95 -106 -35 -51 53 -9 11 25
3991 25 24 -82 105 -37 -53 -27 164 -64 -123 2 176 97 -166 -1 31 -36 195 -44 104 96 -20 126 32 29 -3
4016 -3 -41 136 -68 27 12 -46 -82 26 83 67 33 -87 -74 -57 69 14 -133 115 -98 -138 263 45 2 -101 181
4041 181 124 45 -76 11 133 -97 -163 100 -40 -123 -27 165 70 -75 61 -130 -153 -43 -15 55 -187 -65 -54 -27
4065 -27 -43 24 -23 8 64 50 130 29 17 37 145 -65 42 40 -115 36 -79 51 59 -53 180 -37 -6 -30 -78 -34
4091 -34 50 50 167 111 -14 -109 -27 90 -26 -103 -2 -24 17 26 -101 -100 5 -79 -74 -1 -27 73 -18 -39 -94 -50 29 123
4119 123 56 30 125 2 84 22 -29 -127 -5 -78 76 49 24 62 -10 12 -83 -24 -2 56 37 -18 -63 -249 -189 271 32
4146 32 -99 105 143 157 -63 -115 141 195 -35 47 12 -117 -133 67 97 -84 21 37 35 24 -22 -88 2 -76 -74 -4 84
4173 84 23 -96 9 42 -22 207 106 262 73 118 5 -98 -94 36 15 153 0 74 25 21 -10 58 -152 -102 130
4198 130 -9 -96 43 -78 24 -19 -103 -94 -154 58 -80 -138 -92 50 118 50 -49 -47 27 10 -95 -7 -56 -38 -86 86
4224 86 -29 10 -49 41 34 -63 -168 3 -56 28 67 78 -65 -34 -9 -114 57 67 -28 59 -218 -118 -7 3 -3 -81 -66
4251 -66 -149 -10 46 159 8 37 -11 46 -53 90 67 51 107 87 -87 51 -104 5 5 38 57 14 279 66 -7 16
4277 16 -68 42 54 29 -7 67 46 -22 167 45 -61 67 120 14 5 5 -92 140 14 -32 -86 16 -31 -25 107 51 -108
4304 -108 43 105 -8 -148 -40 75 51 75 1 25 -82 61 91 182 81 18 -47 66 -23 -30 7 30 117 -47 -43 -65
4330 -65 -209 31 63 -132 -92 23 14 184 -140 -90 -58 224 7 -96 61 -102 91 -142 -166 119 53 39 61 -11
4354 -11 -22 126 -114 -12 -24 -9 -85 30 88 -92 -112 -53 28 -25 -42 -112 -31 -90 70 -122 69 -38 154 -8 -141
4379 -141 19 58 21 45 -37 -56 -141 90 -60 145 -48 69 -151 -35 63 27 -117 292 -56 -53 27 99 143 -39
4403 -39 76 -119 123 67 55 -5 11 -243 -34 -63 200 65 -115 33 42 157 12 -95 10 -63 68 -25 -66 -45
4427 -45 142 44 -130 7 -104 67 79 -130 46 -31 70 23 140 86 103 14 1 57 -82 82 -27 67 -14 130
4451 130 -51 -10 -136 -120 -46 -125 66 -144 158 -46 24 -135 60 -9 47 58 -42 -4 98 17 -9 109 -8 -78
4475 -78 0 170 -163 -93 -42 43 16 -128 9 -18 30 -95 -60 100 -24 -102 -5 -2 14 75 -92 -28 -32 -178 0 -48
4501 -48 -5 46 -22 -95 -15 -11 -40 49 51 -40 -14 70 -52 12 39 -194 46 41 74 82 9 -25 184 137 -76 29 -86 -9 -70
4530 -70 -11 -80 -59 48 -170 39 172 52 -56 -58 -86 -113 -12 197 -52 65 -144 2 -61 32 1 131 36 45 -5
4555 -5 23 -167 -6 -34 154 56 95 -2 106 63 -140 -66 -24 44 105 16 176 40 -201 86 -53 77 95 96 -108
4580 -108 43 -66 49 38 114 -62 59 53 -61 -20 34 -54 -70 13 142 14 -90 94 70 -201 -212 37 -126 17
4604 17 132 -27 -123 -8 141 4 -85 -12 -20 110 -61 -2 98 -86 -148 78 28 -18 -22 12 77 -34 -41 -11 78 127
4630 127 -80 27 -56 -71 58 -129 -52 82 91 137 111 26 27 30 39 -25 -109 30 -10 -73 -31 -82 98 49 -43 -88 -8 30
4658 30 29 -28 67 61 73 -92 -173 10 -24 50 -52 -26 45 -9 46 76 -34 -17 83 -163 117 -98 71 3 -93 -158 -37
4685 -37 35 117 33 3 98 -140 10 71 -41 18 -37 59 120 24 -150 -15 -62 -67 -70 114 107 -48 49 122 59 186 218 -23
4713 -23 74 69 -63 106 126 60 93 -180 -101 85 18 9 39 -99 -45 63 -23 43 130 23 -22 65 135 3 49 -93 -42
4740 -42 13 65 -19 -52 -70 6 34 8 77 130 25 -27 -77 41 109 -45 -3 24 -20 -64 165 105 -42 36 100 -47 -111
4767 -111 40 3 -126 123 41 108 116 -1 -73 -1 -25 -5 -102 149 -103 22 93 121 -62 -169 140 -58 -41 74
4791 74 144 119 53 -35 -59 -25 -86 -4 -156 23 -115 -84 1 31 -80 -33 74 -9 223 1 -93 -92 -33 107 68 80 -16
4818 -16 -15 95 133 -51 -7 75 90 -81 -97 -24 68 43 28 64 115 10 85 -29 -106 -54 10 -12 -3 -12 139 175 34 -151
4846 -151 20 27 75 4 -186 30 31 11 16 -30 17 172 -82 63 -110 -57 -13 69 -66 -157 -31 -49 39 64 55 -101 -120
4873 -120 29 -25 -41 76 -43 24 25 -4 29 297 0 32 -27 -48 71 69 -52 -6 110 -35 58 -69 -17 -72 -8 -55
4899 -55 2 -16 8 129 -52 -95 56 71 -67 34 -27 28 -87 -143 7 -22 237 123 -84 73 38 -10 -30 173
4923 173 69 -70 62 -48 12 -41 6 91 -102 -111 21 72 -3 96 38 -3 -41 -16 102 14 65 -24 8 -27 -85 23
4949 23 33 98 108 130 -15 -154 -92 74 69 -50 -49 77 -57 31 30 -40 -7 30 -4 -73 79 -119 -78 -96 23 9 93
4976 93 82 -92 -18 -9 97 22 76 90 -39 63 10 114 -98 -20 2 -3 29 -81 -235 60 102 58 -7 126 44 -30
5002 -30 122 -106 23 117 110 3 -94 145 -59 -116 43 90 -21 28 33 102 -206 27 10 -72 25 102 49 107 37 98
5028 98 53 47 -58 134 -65 -109 22 43 -223 -88 60 -155 -26 136 -58 -70 -4 57 65 -42 33 -161 -7 24
5052 24 10 41 87 38 82 4 128 -2 -30 125 84 2 25 78 32 89 53 53 -39 5 -12 -22 65 -1 -131 -45 9 115
5080 115 -67 21 27 -195 -60 10 -12 -180 -117 -9 -26 0 111 7 -25 -54 31 103 -55 28 75 3 -30 145 4
5105 4 1 -72 -114 74 -17 -6 -22 -14 -87 -12 -135 -155 -107 74 -82 80 80 208 120 -13 -68 -88 106 34 14 -120 -4
5132 -4 65 -90 111 161 46 -98 -163 9 5 54 -77 178 6 -41 -3 49 -67 6 53 88 2 -7 -138 64 -129 -60
5158 -60 138 43 77 -44 14 5 -17 135 34 36 84 19 -6 -58 57 -38 -100 -5 106 -23 -89 90 29 -21 124 83 122
5185 122 8 135 92 -1 89 -71 -34 86 -142 81 96 -147 34 117 -36 6 -32 -56 -23 160 -145 -156 58 -75
5209 -75 18 -60 47 0 25 -13 51 -10 53 -78 105 -5 6 79 19 108 103 111 50 -23 -42 -116 46 19 0 -31 -245 -37
5237 -37 -117 89 -93 -228 -18 -52 143 44 -83 137 25 -82 -10 -81 71 -111 -25 40 -23 44 -68 -69 -186 0
5261 0 63 133 13 -38 187 38 -15 -69 -31 -73 -115 -117 116 -72 45 130 56 54 44 -47 -69 100 -69 17 28 30 9 -37
5289 -37 46 84 -89 46 -122 28 -136 -293 -167 -30 -40 18 -35 -58 -85 -22 8 137 -29 94 -38 109 97 41
5313 41 -31 186 22 48 156 15 216 -54 74 31 27 -37 10 131 57 -141 -59 45 -51 78 68 106 -138 34
5337 34 44 1 -25 164 12 49 10 128 6 7 43 -75 98 -4 117 162 53 176 -119 47 126 36 33 -17 -205
5362 -205 73 -63 13 29 59 78 123 177 36 -69 -66 -60 129 0 -65 30 -49 -52 30 115 31 30 21 -27 -8 150 52 47 23
5391 23 81 49 134 -18 -84 -112 -51 -51 -138 -2 136 24 -35 63 37 -78 50 2 -2 -51 -99 -106 122 -13 26 27 -24 160
5419 160 261 48 -100 2 -24 79 14 -79 -46 -31 -75 -17 -34 -87 -56 69 -91 -15 -10 1 12 99 111 3 -142 -8
5445 -8 80 -66 70 -25 -66 -6 -129 -155 -130 106 -143 17 -122 -22 5 -87 66 75 56 51 38 55 -33 -39 -204 13 -123
5472 -123 -114 43 -68 61 13 -44 11 116 66 22 -15 -47 -62 -15 49 -42 -61 8 62 -185 -47 -55 29 52 -5 -193 66
5499 66 -98 55 -40 -96 -45 -81 -181 -219 7 128 -33 -39 67 42 -34 69 -30 -9 23 -23 101 -37 3 -29 123
5524 123 -26 64 -85 91 31 45 16 44 34 -159 35 122 -35 29 44 -70 86 -171 -99 66 161 92 103 -167
5548 -167 106 29 -12 -61 64 85 -25 -63 127 -64 58 56 -163 61 147 69 96 -35 123 45 32 85 61 22 185
5573 185 -95 -73 -8 77 -68 -102 121 28 14 137 -95 -9 112 -37 -175 -52 37 -34 -145 -49 51 75 156 155 13
5598 13 64 -92 -32 131 -34 -22 38 -77 -62 -120 -78 12 -39 -13 156 -28 -3 95 -33 33 16 33 147 -91 -116 71
5624 71 -126 109 44 -37 7 -22 67 59 -197 -99 -81 -44 -105 58 -44 70 172 -134 75 -136 -8 189 99 33 26
5649 26 15 39 -96 -36 76 -82 8 131 110 -165 41 43 -46 155 -29 120 93 6 56 -47 45 -94 44 91 -55
5674 -55 -102 41 69 13 22 -16 -40 126 185 92 30 -32 -33 90 139 86 -9 114 88 -88 -26 -43 73 -66 17 43 74 -6
5702 -6 141 41 -37 -92 35 34 6 70 -13 -119 11 124 -12 -35 94 176 -154 -82 -96 10 -93 0 -20 138 192
5727 192 191 36 -51 -60 -37 -45 -173 52 112 70 109 54 31 51 68 -34 -65 17 -91 -101 14 -7 103 -47 -23 -30 8 74
5755 74 1 118 119 128 -100 33 101 86 -8 -102 12 21 97 -135 -160 -213 73 81 45 -20 90 35 52 -100 68 -51 -96
5782 -96 -67 -191 -247 34 88 -60 -67 30 29 -105 -46 -31 46 -21 51 113 -65 12 -47 -120 53 -67 137 -4 126 -102
5808 -102 -78 -142 -249 13 -148 27 101 22 -135 105 23 164 34 53 90 -14 -16 23 89 19 -24 -27 27 11 109 -66
5834 -66 127 -184 55 -71 -64 62 -7 -10 -50 69 17 43 -43 53 -24 -43 -44 54 -109 -116 -62 65 1 8 -23 56 93 76 58
5863 58 31 -45 -86 -57 137 119 21 111 74 46 -20 -118 7 -130 -120 -53 -46 117 107 -38 44 -34 -11 12 97 -197 -111 -55
5891 -55 36 77 -83 -84 137 40 -11 -64 53 -78 -204 -2 68 -69 -34 157 -121 34 61 -139 -75 -27 30 3 153
5916 153 33 83 -25 -105 73 61 -63 22 -12 31 53 -124 -38 -38 48 -14 -58 84 -103 49 -44 28 28 -20 63 151 114
5943 114 -34 -113 6 -73 -93 -89 4 -242 -120 -86 -31 -110 -31 -59 -13 -41 126 -27 -149 78 -74 -132 33 30 5 -50
5969 -50 -59 17 104 3 68 -98 -3 42 173 7 -123 99 157 83 -40 54 20 -152 73 19 -75 -6 64 -51 18 4
5995 4 -42 -79 -10 -16 137 113 -17 -52 110 66 -40 67 -18 -22 -29 130 -28 -18 -15 92 -144 146 -11 61 36 -148 -17
6022 -17 -4 -100 172 -51 -50 7 37 -55 56 102 236 69 36 148 -11 -65 56 -35 -3 -97 -213 30 -132 28 -148
6047 -148 8 -39 2 198 -84 -136 -19 -19 33 16 37 12 84 -86 15 158 -12 -24 8 -65 -17 -60 60 164 96
6072 96 -83 -184 -157 133 17 99 -30 -22 52 -103 -124 -42 -76 -133 -22 -58 -4 -15 8 213 -93 79 -50 -25 67
6097 67 79 78 -52 -34 -97 -21 -28 -31 3 -27 58 -43 46 -66 106 -43 -25 -49 -118 1 41 -39 -59 -52 -45 -84 -13 -76 -19 -47
6127 -47 -131 21 -64 -1 -206 -63 -8 12 -5 141 90 80 -25 -61 72 -61 -113 -9 -4 65 128 -61 0 13 70 -32
6153 -32 158 -39 -145 -57 13 -142 66 -5 -36 -48 -57 14 -15 114 -26 -50 -4 179 -124 127 56 8 -77 -8 -39 -87
6179 -87 14 15 -137 -46 23 -52 -34 50 -30 77 63 50 -70 145 91 -47 148 -94 140 -49 55 -36 0 -84 -91 45
6205 45 -93 -155 101 100 -39 107 1 129 -22 -58 205 21 13 -33 -67 5 76 -35 -92 87 -44 148 -21 48
6229 48 202 -61 -109 40 -69 40 103 -138 14 -8 37 107 34 -16 -8 -44 -10 37 -17 4 94 96 -58 -10 -88 -39 -35 -22
6257 -22 -27 -55 -104 8 7 74 -8 -197 -99 93 22 29 30 -8 40 18 -52 45 102 153 -40 -56 119 90 -78 186 -85 -160
6285 -160 69 2 4 -44 -104 -228 -42 53 69 89 -224 13 79 -3 21 22 11 -95 2 -25 116 166 85 126 47 -110 -73
6312 -73 -8 -18 23 5 5 107 -4 92 82 127 140 132 -95 31 -131 23 -92 82 23 -19 -182 128 103 -73 186
6337 186 24 43 3 64 0 95 25 -39 -133 35 -169 71 -116 -11 8 -119 188 114 103 -114 -25 175 31 -114
6361 -114 -62 116 -54 20 24 8 153 -33 -67 86 191 -116 98 -101 99 -46 62 105 -116 69 -131 51
6383 51 -64 131 16 -70 77 77 5 -134 70 -54 55 106 65 181 -60 23 -27 -47 24 -207 49 -47 -93 14
6407 14 17 178 -63 63 -93 17 45 80 -74 16 1 82 -222 -86 -174 -5 26 -44 -53 155 -52 42 147 -55 22
6432 22 73 26 98 -64 -41 -47 -146 34 -119 -29 34 -77 -4 89 -106 60 35 -50 -48 0 -41 -38 -192 109 -84 -167 -126
6459 -126 -74 89 -123 8 106 101 115 87 -70 -94 -23 18 -150 54 121 52 115 3 138 -103 35 78 42 -17 8
6484 8 -109 36 -49 -15 70 -30 -8 -40 139 -133 -55 -23 53 -98 104 63 13 52 189 -88 -72 4 23 14 9 -53 44
6511 44 -62 96 193 112 -109 12 46 6 46 -89 -78 -112 42 -40 -28 -5 -27 -61 76 110 0 -34 -230 26 40
6536 40 37 66 -19 -128 100 78 23 -92 -35 -37 11 89 -66 0 -31 96 -114 83 84 -63 -63 88 -44 85 -1 -32 46
6563 46 -45 -16 -80 -65 185 51 47 36 51 74 -37 42 -114 -22 -43 26 -80 147 21 -184 -79 -25 6 -42 65 1
6589 1 76 41 143 74 16 -20 33 -35 3 43 -12 -95 197 73 53 121 27 69 57 42 2 25 -81 -135 -116 -69 79 -107
6617 -107 -137 -11 -145 174 44 -44 23 44 116 36 63 39 -61 -36 0 71 17 -87 -110 82 -81 -1 154 -63 -98
6642 -98 -45 88 123 76 13 -65 60 -93 61 44 -50 -10 -96 190 149 95 -108 -191 -38 -4 -79 -39 86 -94 -145 15
6668 15 -8 67 -15 17 73 -9 18 101 15 -71 73 -35 23 83 245 -125 53 8 85 -99 -61 241 -150 -1 139
6693 139 75 -107 19 -33 -74 -93 5 -43 11 -205 -62 30 4 -11 109 133 -97 -42 36 166 -55 55 92 -28 34
6718 34 159 -54 -117 201 73 -196 -67 185 -25 173 -78 -44 58 56 97 -18 -8 87 44 46 250 -76 46 8
6742 8 -35 81 -94 -60 -73 -143 -68 -42 18 31 -22 -29 -82 -39 67 24 -69 -100 0 42 -14 -14 65 -86 -86 -5 -35 -29 -85 -195
6772 -195 60 21 30 20 -71 -28 14 34 239 177 12 51 -78 -15 -55 117 78 -15 117 75 34 24 45 -47 176 -53
6798 -53 -5 -121 85 109 -76 8 65 -93 69 -75 -18 -16 -108 -31 -196 29 179 -8 -159 86 102 56 2 -156
6822 -156 232 27 125 -106 -27 49 103 156 -34 2 -86 20 83 21 -7 59 -19 10 89 -14 81 47 145 13 -54 -19
6848 -19 25 -27 47 9 -60 -61 -22 -38 43 -81 113 10 8 -7 130 34 38 -33 35 -29 25 -106 -40 89 101 -44 14 4
6876 4 36 64 -22 5 36 -12 40 176 -15 -12 62 -70 55 108 -141 -125 -68 50 81 149 36 100 -159 51 19 10 -72
6903 -72 -166 -34 19 -54 4 29 91 45 34 137 155 -155 37 52 45 57 47 21 152 198 39 21 47 63 -126 -61 10
6930 10 119 -3 92 -230 12 133 101 61 -30 11 60 -53 19 117 160 52 -161 -22 -2 -70 -73 183 60 -5 -8 21
6956 21 -64 -71 162 5 -13 -38 91 41 -44 108 154 -52 -24 -12 2 41 -24 -27 183 -83 113 7 84 -70 33 87
6982 87 -169 46 -72 82 -70 -10 -68 -68 36 6 -78 -45 -70 -8 18 -20 0 -11 -16 -113 13 -1 5 47 162 30 -50
7009 -50 -125 -109 -30 -51 108 83 202 -17 133 -99 -73 3 -168 83 -8 -103 -1 198 87 -56 24 158 108 31
7033 31 210 -55 183 97 37 89 36 -127 12 17 24 97 123 -35 -58 -4 50 183 24 -23 -78 15 -141 101 173 -52
7059 -52 13 -17 -153 116 -82 -21 42 64 39 218 35 -42 -59 10 105 96 14 61 -6 -98 57 -101 -48 -147 22 155
7085 155 37 -15 195 100 66 64 21 -142 14 -38 53 125 113 35 23 -63 47 -19 -92 26 63 145 112 138 -225 -47
7111 -47 -3 55 142 52 -24 -44 15 159 153 -102 3 -72 -49 -6 34 13 198 10 -68 -81 -71 -72 56 15 -57 -26 113 -66
7139 -66 -18 38 -61 -16 -68 33 -7 -59 -17 -110 45 -270 16 -91 23 -25 -23 150 -29 -90 46 4 -116 78 16
7164 16 4 63 -54 -186 63 97 -30 70 54 12 118 94 -53 8 -46 -67 93 -75 -108 -112 -145 -11 -7 92 0 11
7190 11 30 34 -98 18 -14 -41 14 -65 -63 -91 112 -60 -118 -18 -46 44 -29 6 -50 -39 -3 -12 -150 132 0 9 -30 -73
7218 -73 39 6 156 42 85 -22 -11 33 -3 -99 186 -67 -102 -64 74 -39 -31 127 -74 24 93 -138 -9 146
7242 146 -192 -21 -151 60 51 63 -25 25 -98 -189 58 -30 16 4 -34 34 -60 -43 -54 91 -59 13 0 41 -17 13
7268 13 -101 37 114 -85 80 -153 -41 45 229 -110 -103 74 -166 55 44 51 36 121 -72 28 -61 35 -6 -58 38
7293 38 131 49 74 -33 64 -55 -75 48 17 -24 121 67 88 120 -144 119 -135 -106 77 -129 -39 60 -117 18 -46
7318 -46 3 41 94 -32 -96 143 -139 118 9 34 84 97 -25 100 20 68 -7 16 72 -69 117 73 12 -21 -163
7343 -163 -107 2 173 117 -95 -103 1 -132 -58 -79 -12 -31 -108 45 52 -49 -50 -189 54 93 -60 70 -41 113 93
7368 93 29 0 -26 -18 -5 34 48 -21 -27 -120 29 13 -8 -114 -89 13 -17 34 -52 -23 -31 -41 35 18 53 -89 5 -60 -23 -66
7398 -66 181 -53 34 -40 44 -53 -53 2 -86 -75 -92 -17 2 -75 38 161 -21 -21 239 38 21 -71 77 39 -88 19
7424 19 -114 23 36 -79 -31 213 -21 -57 -14 -21 92 14 7 79 -118 33 -100 -80 -19 -8 1 -69 -14 -65 -48 -49 11 91
7452 91 -28 24 31 -135 -133 -20 78 19 95 71 117 -22 -183 59 71 -6 -62 -70 32 -74 -16 43 36 10 36 -22 -52 -132
7480 -132 -16 -16 -34 -99 92 18 -25 -133 34 146 -6 28 71 61 -96 44 -99 -27 -18 138 108 9 -97 1 -68
7505 -68 -4 -54 71 -28 72 145 -56 -2 -63 34 -103 -47 50 82 174 -143 -25 -22 28 27 -68 -22 44 7 147 -38 -28
7532 -28 28 38 -73 -72 44 140 -85 -33 11 -106 11 99 -48 98 84 84 -34 -15 -71 -52 -107 14 -58 25 -43 -7 54
7559 54 40 -185 -92 -11 172 -14 -110 -5 13 -91 84 -109 -25 -88 -136 122 89 -13 240 74 22 -79 -131 -9
7583 -9 6 -41 27 56 -10 16 5 292 30 69 126 -58 -146 146 86 15 -29 102 28 29 100 82 86 49 -17 74 -156 71
7611 71 -139 -47 -8 -59 -18 -139 -36 -35 -56 -104 192 -21 -19 -20 167 -56 -25 -32 -59 -50 -90 35 -58 23 40 -10 -21 53 58
7640 58 -153 -48 -62 60 -119 -67 61 -68 51 102 20 -25 83 -34 -160 -91 -47 1 -103 -100 24 -11 131 -15
7664 -15 107 119 -42 46 -190 64 -75 -110 130 -105 106 -139 -23 -43 32 154 -66 -31 -158 6 45 86 -27
7687 -27 -82 120 -3 -13 -50 -13 68 45 83 -13 -28 -12 65 48 -93 14 26 55 67 23 60 49 26 -169 -73 -25 5 -25
7715 -25 -56 -65 -7 -24 -56 82 -99 104 -24 168 83 8 105 188 13 14 -95 39 18 -11 -23 -65 94 64 47 44 21
7742 21 -56 7 -134 23 -208 -37 136 -83 102 26 -137 94 -6 -65 -69 1 36 -8 -141 32 -42 -22 -103 220
7766 220 -103 58 10 -139 -3 -22 -17 -58 32 91 41 -178 -18 14 -11 38 55 154 70 -17 -43 42 6 153 -61 23
7792 23 -11 55 -72 -100 53 103 -74 -78 -142 -25 157 -34 12 61 65 40 -152 -22 -39 -78 59 51 -142 102 49 -39
7818 -39 -16 -20 70 79 72 -29 168 -13 79 -69 30 -32 -106 37 50 51 -52 66 -27 -27 31 29 -112 52 117 -92 15 83
7846 83 -46 67 -57 -27 11 -4 17 67 -72 8 111 96 45 98 35 39 -36 30 -94 32 172 -153 -284 -109 56
7871 56 42 -87 -180 54 108 19 102 -24 -17 -90 161 -14 181 -147 -57 66 -177 80 61 0 -4 70 -47 -20 62 55
7897 55 -64 -40 26 9 -69 -12 28 -49 -58 132 143 12 10 -86 -32 103 -80 -42 46 41 -125 38 -95 59 19 -4 -79
7924 -79 -97 160 -28 -33 -30 18 -56 96 49 -52 80 -139 -54 114 182 -105 -27 128 28 162 -195 -206 -35 -113 -170
7949 -170 -68 -70 -16 -191 7 -188 13 36 79 207 69 -75 -16 -89 203 -20 -12 -81 -32 -49 77 -15 35 -20 -4
7974 -4 95 -110 -116 -51 -142 105 -46 -52 61 66 65 57 -197 -42 -80 14 41 60 -93 20 99 15 38 56 95 -66 117 -160
8002 -160 9 -15 -43 24 -21 37 -97 112 4 -42 31 31 10 -68 -13 -95 -18 106 -127 -52 105 42 -10 72 -9 -36 -144
8029 -144 -11 153 -45 -84 102 7 15 53 32 86 96 -2 -92 52 114 28 -20 129 -26 -123 -25 56 -6 -32 2 -80 -23
8056 -23 -90 14 -142 42 29 -27 68 3 -69 158 54 -21 31 175 -76 28 72 46 23 -20 21 10 88 -17 89
8081 89 -84 -12 31 71 31 -61 -38 80 120 -130 17 -180 -24 -17 106 -76 -73 -99 150 62 -63 -80 -28 -22 -73 -38 -6
8108 -6 17 45 -59 -206 26 98 54 -129 26 -69 -68 -20 -139 -17 50 -65 48 -27 190 58 64 -90 269 37 160
8133 160 -86 -41 -1 90 52 -51 1 66 106 73 -66 44 175 -55 54 84 -17 -50 -19 -118 119 109 -6 -142
8157 -142 -34 -185 90 4 -146 -71 -43 -56 -65 79 -46 -74 -122 122 56 86 -45 -26 -29 69 -76 -42 49 39 72 61
8183 61 -54 53 94 -15 -121 8 -79 -186
8191a86
##END NTUPLES=NMR FID
##END=
