##TITLE=1H_BX 2808
 CDCl3, 8 sc, 
 31.8.2020
##JCAMPDX= 6.0         $$ Bruker NMR JCAMP-DX V2.0
##DATA TYPE= NMR FID
##DATA CLASS= NTUPLES
##ORIGIN= UXNMR, Bruker Analytische Messtechnik GmbH
##OWNER= root
$$ XWIN-NMR		Version 3.5
$$ Mon Aug 31 09:42:13 2020 Russian Standard Time (UT+4h)  she@DPX200
##.OBSERVE FREQUENCY= 200.1315066352
##.OBSERVE NUCLEUS= ^1H
##.DELAY= (6, 6)
##.ACQUISITION MODE= SIMULTANEOUS
##.ACQUISITION SCHEME= undefined
##.AVERAGES= 8
##.DIGITISER RES= 18
##SPECTROMETER/DATA SYSTEM= spect
##.PULSE SEQUENCE= zg30
##.SOLVENT NAME= CDCl3
##.SHIFT REFERENCE= (INTERNAL, CDCl3, 0, 15.7039)
##AUDIT TRAIL= $$ (NUMBER, WHEN, WHO, WHERE, WHAT)
$$ ##TITLE= Audit trail, XWIN-NMR		Version 3.5
$$ ##JCAMPDX= 5.01
$$ ##ORIGIN= Bruker BioSpin GmbH
$$ ##OWNER= she
$$ F:/spectra/data/she/nmr/H-F/1/audita.txt
$$ ##AUDIT TRAIL=  $$ (NUMBER, WHEN, WHO, WHERE, WHAT)
(   1,<2020-08-31 09:40:57.81 +0400>,<she>,<DPX200>,
      <created by zg, POWCHK disabled, PULCHK disabled
       configuration hash MD5:
       00 E9 B6 7A A2 85 ED C7 34 08 36 98 17 FE 4E 26
       data hash MD5: 16K
       76 A1 DF 19 45 73 D6 E7 DC 0B 0A 30 7B DE A4 97>)
$$ ##END=
$$ 
$$ hash MD5
$$ 64 FD 9A 64 47 D9 5A 07 56 52 D0 56 56 11 25 68
##$RELAX= 
##$RELAX= 
##$RELAX= 
##$RELAX= 
##$RELAX= 
##$RELAX= 
$$ Bruker specific parameters
$$ --------------------------
##$DU= <F:/spectra>
##$EXPNO= 1
##$NAME= <H-F>
##$PROCNO= 1
##$TYPE= <nmr>
##$USER= <she>
##$AMP= (0..31)
100 100 100 100 100 100 100 100 100 100 100 100 100 100 100 100 100 100 
100 100 100 100 100 100 100 100 100 100 100 100 100 100 
##$AQSEQ= 0
##$AQ_mod= 1
##$AUNM= <au_zg>
##$AUTOPOS= <>
##$BF1= 200.13
##$BF2= 200.13
##$BF3= 200.13
##$BF4= 200.13
##$BF5= 200.13
##$BF6= 200.13
##$BF7= 200.13
##$BF8= 200.13
##$BYTORDA= 1
##$CFDGTYP= 0
##$CFRGTYP= 5
##$CHEMSTR= <none>
##$CNST= (0..31)
1 1 145 1 1 1 1 1 1 1 1 1 1 1 1 1 1 1 1 1 1 1 1 1 1 1 1 1 1 1 1 1 
##$CPDPRG= <>
##$CPDPRG1= <>
##$CPDPRG2= <>
##$CPDPRG3= <>
##$CPDPRG4= <mlev>
##$CPDPRG5= <mlev>
##$CPDPRG6= <mlev>
##$CPDPRG7= <mlev>
##$CPDPRG8= <mlev>
##$CPDPRGB= <>
##$CPDPRGT= <>
##$D= (0..31)
0 1.2 0 0 0 0 0 0 0 0.06 0 0.03 0 0 0 0 0.0002 0 0 0 0 0 0 0 0 0 0 0 0 
0 0 0 
##$DATE= 1598852457
##$DBL= (0..7)
120 120 120 120 120 120 120 120 
##$DBP= (0..7)
150 150 150 150 150 150 150 150 
##$DBP07= 0
##$DBPNAM0= <>
##$DBPNAM1= <>
##$DBPNAM2= <>
##$DBPNAM3= <>
##$DBPNAM4= <>
##$DBPNAM5= <>
##$DBPNAM6= <>
##$DBPNAM7= <>
##$DBPOAL= (0..7)
0.5 0.5 0.5 0.5 0.5 0.5 0.5 0.5 
##$DBPOFFS= (0..7)
0 0 0 0 0 0 0 0 
##$DE= 6
##$DECBNUC= <off>
##$DECIM= 32
##$DECNUC= <off>
##$DECSTAT= 4
##$DIGMOD= 1
##$DIGTYP= 9
##$DL= (0..7)
0 120 120 120 120 120 120 120 
##$DP= (0..7)
150 150 150 150 150 150 150 150 
##$DP07= 0
##$DPNAME0= <>
##$DPNAME1= <>
##$DPNAME2= <>
##$DPNAME3= <>
##$DPNAME4= <>
##$DPNAME5= <>
##$DPNAME6= <>
##$DPNAME7= <>
##$DPOAL= (0..7)
0.5 0.5 0.5 0.5 0.5 0.5 0.5 0.5 
##$DPOFFS= (0..7)
0 0 0 0 0 0 0 0 
##$DQDMODE= 0
##$DR= 18
##$DS= 0
##$DSLIST= <SSSSSSSSSSSSSSS>
$$ [...]
##$SUBNAM2= <"">
##$SUBNAM3= <"">
##$SUBNAM4= <"">
##$SUBNAM5= <"">
##$SUBNAM6= <"">
##$SUBNAM7= <"">
##$SUBNAM8= <"">
##$SUBNAM9= <"">
##$SW= 16.880792210976
##$SWIBOX= (0..15)
0 0 2 0 0 0 0 0 0 0 0 0 0 0 0 0 
##$SW_h= 3378.37837837838
##$TD= 16384
##$TD0= 1
##$TE= 0
##$TE2= 300
##$TE3= 300
##$TEG= 300
##$TL= (0..7)
0 120 120 120 120 120 120 120 
##$TP= (0..7)
150 150 150 150 150 150 150 150 
##$TP07= 0
##$TPNAME0= <>
##$TPNAME1= <>
##$TPNAME2= <>
##$TPNAME3= <>
##$TPNAME4= <>
##$TPNAME5= <>
##$TPNAME6= <>
##$TPNAME7= <>
##$TPOAL= (0..7)
0.5 0.5 0.5 0.5 0.5 0.5 0.5 0.5 
##$TPOFFS= (0..7)
0 0 0 0 0 0 0 0 
##$TUNHIN= 0
##$TUNHOUT= 0
##$TUNXOUT= 0
##$USERA1= <user>
##$USERA2= <user>
##$USERA3= <user>
##$USERA4= <user>
##$USERA5= <user>
##$V9= 5
##$VALIST= <valist>
##$VCLIST= <CCCCCCCCCCCCCCC>
##$VD= 0
##$VDLIST= <DDDDDDDDDDDDDDD>
##$VPLIST= <PPPPPPPPPPPPPPP>
##$VTLIST= <TTTTTTTTTTTTTTT>
##$WBST= 1024
##$WBSW= 4
##$XGAIN= (0..3)
0 0 0 0 
##$XL= 0
##$YL= 0
##$YMAX_a= 466669
##$YMIN_a= -478420
##$ZGOPTNS= <>
##$ZL1= 120
##$ZL2= 120
##$ZL3= 120
##$ZL4= 120
##$ABSF1= 10
##$ABSF2= 0
##$ABSG= 5
##$ABSL= 3
##$ALPHA= 0
##$AQORDER= 0
##$ASSFAC= 0
##$ASSFACI= 0
##$ASSFACX= 0
##$ASSWID= 0
##$AUNMP= <proc_1d>
##$AZFE= 0.1
##$AZFW= 0.1
##$BCFW= 1
##$BC_mod= 2
##$BYTORDP= 1
##$COROFFS= 0
##$CY= 11.3945322036743
##$DATMOD= 1
##$DC= 2
##$DFILT= <>
##$DTYPP= 0
##$F1P= 16.9975609425685
##$F2P= -3.02152046262296
##$FCOR= 0.5
##$FTSIZE= 0
##$FT_mod= 4
##$GAMMA= 1
##$GB= 0.15
##$INTBC= 1
##$INTSCL= 1
##$ISEN= 128
##$LB= 0.24
##$LEV0= 0
##$LPBIN= 0
##$MAXI= 10000
##$MC2= 0
##$MEAN= 0
##$ME_mod= 0
##$MI= 1.114404
##$NCOEF= 0
##$NC_proc= 0
##$NLEV= 6
##$NOISF1= 3.799351
##$NOISF2= 2.8
##$NSP= 1
##$NTH_PI= 0
##$NZP= 0
##$OFFSET= 15.70392
##$PC= 1
##$PHC0= -10126.26
##$PHC1= 6.200918
##$PH_mod= 1
##$PKNL= yes
##$PPARMOD= 0
##$PSCAL= 0
##$PSIGN= 0
##$REVERSE= no
##$SF= 200.130013532006
##$SI= 16384
##$SIGF1= 3
##$SIGF2= 2
##$SINO= 400
##$SIOLD= 16384
##$SREGLST= <1H.CDCl3>
##$SSB= 0
##$STSI= 0
##$STSR= 0
##$SW_p= 3612.71676300578
##$SYMM= 0
##$S_DEV= 0
##$TDeff= 0
##$TDoff= 0
##$TI= <>
##$TILT= no
##$TM1= 0
##$TM2= 0
##$TOPLEV= 0
##$USERP1= <user>
##$USERP2= <user>
##$USERP3= <user>
##$USERP4= <user>
##$USERP5= <user>
##$WDW= 1
##$XDIM= 8192
##$YMAX_p= 0
##$YMIN_p= 0
$$ End of Bruker specific parameters
$$ ---------------------------------
##NTUPLES= NMR FID
##VAR_NAME=  TIME,          FID/REAL,        FID/IMAG
##SYMBOL=    X,             R,               I
##VAR_TYPE=  INDEPENDENT,   DEPENDENT,       DEPENDENT
##VAR_FORM=  AFFN,          ASDF,            ASDF
##VAR_DIM=   8192,          8192,            8192
##UNITS=     SECONDS,       ARBITRARY UNITS, ARBITRARY UNITS
##FACTOR=    0.000296,      1,               1
##FIRST=     0,             0,               0
##LAST=      2.424536,      0,               0
##MIN=       0,             -478420,         0
##MAX=       2.424536,      466669,          0
$$ Real data points
##PAGE= N=1
##DATA TABLE= (X++(R..R)), XYDATA
$$ [...]
2899b662O085k524l722K844O34J659m102p28N838l184j090j77P81M356o643L04
2915b331N695m031J236k328O30N916p469P18M324k863K018m184J924M921o501
2930b325J478J124K24J807o295M522K400n014K779k770L515J562q040O598K48
2945A813l407L311n338N729Q84p838O555j234n71J518n564P062j343m743M603
2960A437k775L678k118m502Q312m454o60K197m235P485n203l089Q225o066K510
2975G42l89l940Q760o810j065N882n280M472l579j454P509p256K021J299k668
2990a756N794p444K482M878p249N400l558J75O378j0056N533K048n923O813o652
3005c137K814M902r463O696j266k257N260p771N662R95o111O489n031L003J872
$$ plain form
2899 -2662 3423 899 -2823 21 655 2314 -1788 -2516 3322 138 -952 -1129 -348 4008 -2635 -2331
2915 -2331 3364 -667 569 -1759 -1129 4787 -2682 -1964 2360 -503 1515 -2669 -745 4176 -2325
2930 -2325 -847 277 501 2308 -3987 535 2935 -2079 700 -2070 1445 3007 -5033 1565 1813
2945 1813 -1594 1717 -3621 2108 2992 -4846 1709 475 -96 1422 -4142 2920 1577 -3166 1437
2960 1437 -1338 2340 222 -4280 4032 -422 -1082 1115 -3120 4365 -838 -3927 4298 -1768 742
2975 742 353 -3587 5173 -1637 -2702 3180 -2100 2372 -1207 -2661 4848 -2408 -387 912 -1756
2990 -1756 4038 -3406 -924 3954 -3295 2105 -1453 -1278 5100 -4956 577 2625 -3298 3515 -3137
3005 -3137 -323 4579 -4884 1812 546 -1711 3549 -4222 1440 2435 -3676 2813 -2218 785 2657
3020B657p652Q544l780j785N515p954P386j491o348R553o852J774L490q056Q972
3035C973m100l203P408p357M982o67m931Q444o863J843L024o479P870n517o26
3050b199O755q888O574j415m671R087q818L290M004q630Q634m669j568P351r235
3065d398O061j20n165P768p088L200K541p247Q232n172j30N493q686P700k318
3080F71m597Q944q598M016K564q182R631n677j318P110q938O598j294m793Q578
3095D715p678K941K628o645P917n689L43N607q640P197k481l491Q286r168M914
3110G56K301p991R257o080P1O298r655P543j284m844P910p534L962J977p228Q265
3126C724m979J74M215p560P852l355l511P791p765M932J35o596J0159o970k87
$$ plain form
3020 2657 -4995 3549 -231 -2016 3499 -4455 2931 1440 -4908 4645 -2207 -433 3057 -4999 3973
3035 3973 -127 -3330 4078 -3279 1703 1036 -3895 4549 -2314 -471 2553 -3926 3944 -1573 -2199
3050 -2199 4556 -4332 2242 827 -3844 5243 -3575 -285 3719 -4911 3723 -946 -2514 4837 -4398
3065 -4398 1663 1543 -3622 4146 -2942 258 2799 -4448 3784 -1388 -1518 3975 -4711 2989 671
3080 671 -3926 5018 -3580 436 3000 -5182 4449 -1228 -2546 4564 -4374 2224 930 -3863 4715
3095 4715 -2963 -22 2606 -4039 3878 -1811 -1468 4139 -4501 2696 215 -3276 5010 -4158 756
3110 756 3057 -4934 4323 -1757 -1686 4612 -5043 2500 1216 -3628 4282 -3252 710 2687 -4541 3724
3126 3724 -1255 -1081 3134 -4426 3426 71 -3440 4351 -3414 1518 1653 -4943 5216 -1754 -2041
3141b041N817p948P488l248m136R206p810K684J693n245P999o602J90N710o883
3156c126N534l553j114P365r047M266J505m800P254p898K694N819r429O411j969
3171h8j809O630r455N038L089o758N659m596K522L438q364O428r75j817L525o930
3187d463P054l09o612P152m444K493J561q000R279k520m342N689n331N217j030
3202A394o299Q538l768o79J876m373P269m225l118O370m385L056k222k762Q282
3217D954o606M1L469l937N670n544q71P704p124K053M92k077O023p120J051N307
3233C485n065K515k590J190M319p178L039J640j930K477n551M563K482o965M512
3248I43j345O30K368p125N941J425n635L701k238K628Q77o357N573K96k527R53
$$ plain form
3141 -2041 3776 -4172 3316 68 -4068 5138 -2672 12 1705 -3540 4459 -2143 -1953 3757 -3126
3156 -3126 2408 -1145 -2259 5106 -3941 325 1830 -2970 4284 -3614 -920 4899 -4530 1881 -88
3171 -88 -1897 4733 -4722 316 3405 -3353 2306 -2290 232 3670 -4694 1734 759 -1058 2467 -4463
3187 -4463 2591 2282 -4330 2822 -1622 871 2432 -5568 3711 1191 -3151 2538 -2793 2424 1394
3202 1394 -4905 3633 -135 -814 1062 -3311 3958 -267 -3385 2985 -1400 1656 -566 -3328 4954
3217 4954 -1652 -1611 1858 -2079 3591 -1953 -2824 4880 -2244 -191 301 -1776 4247 -2873 -1822 3485
3233 3485 -1580 935 -1655 -465 3854 -3324 -285 1355 -575 1902 -3649 914 3396 -3569 943
3248 943 -402 228 2596 -4529 1412 2837 -2798 903 -1335 1293 2170 -4187 1386 1682 -845 108
3264A08k396N021j760m312M742j217R77j660k724P054l575k837L691j811L122
3279B423l237k650P119l378j902J585p15L696m061j698N290j852r59j221J241
3294c19L588m891j29K884l84L74l998K622L850n375O38J336N38J263n149K458
3310f94M061m307k53N80J671R05m652J759L287j926j716l78L483j52l984J495
3326h21J902L63k262j813M646j69l869J220J254J274j806k811M145J045l699K4
3342a377J707J506j698k614K799K049k725j678K071K060j887k361J865K300j390
3357F27k769J337L170j829k662J639K018m95k524k87L901o88l784J683K051m02
3373I86j638j562L523R96m392Q00K490K5j657j776L144J221l287m97J980J718
$$ plain form
3264 108 -2288 2733 973 -3339 1403 186 1163 -497 -3221 3833 258 -2579 1112 -699 2423
3279 2423 -814 -3464 3655 277 -1625 -40 -755 2941 -1120 -2818 2472 620 -339 -1560 -319
3294 -319 3269 -1622 -1751 1133 749 1123 -2875 -253 3597 -1778 -1140 196 734 1997 -3152 -694
3310 -694 3367 -940 -1193 -613 1058 1963 -2689 -930 2357 431 -1285 -1663 1820 1668 -2316 -821
3326 -821 1081 1444 -818 -2631 2015 1846 -2023 -803 451 1725 -81 -2892 1253 2298 -1401 -1377
3342 -1377 330 1836 138 -2476 323 2372 -353 -2031 40 2100 213 -2148 -283 2017 627
3357 627 -2142 -805 2365 536 -2126 -487 1531 1036 -1488 -1775 2126 1438 -2346 -663 1388 986
3373 986 -652 -2214 1309 2305 -2087 -1287 1203 1228 -429 -2205 939 2160 -1127 -1624 356 2074
3389B074k373k217L509N87j799j162M02L786k738k989L985j5o49j468q74M860
3405B919k358l416L433K71J70k195q89M707k005k427J332R81J663m033K4M290
3421B467k321m97j081J355L380n571P26L666k376J121k912J539M267n963Q75K587
3437A262j138J273l980K371L225m544Q98J99J564N55n100M135J128k853J333k581
3453b253M145J76o047N195k26j344J222l992N341l54n248M458j124R18l04l849
3469c286N855j678k729K312j664L689k897k670N994l401L76J10k313O160m971
3484a113j579N502m051K417j785j866O525n498k38L302k765L397m090K69N050
3499C477n232J840k78m97L874o315K994K616m461L650l616J875L602p373M746
$$ plain form
3389 2074 -299 -2516 993 1580 -219 -1381 -979 2807 69 -2920 1065 1050 401 -1067 -1941 2919
3405 2919 561 -2855 578 849 1019 -1176 -2065 2642 637 -1790 -458 523 2186 -1847 -1823 2467
3421 2467 146 -351 -1432 -77 3303 -2268 -1542 2124 -252 869 -2043 -504 3763 -2200 -1325 1262
3437 1262 124 1397 -2583 -212 3013 -1531 -633 -434 1130 1685 -3415 720 1848 -1005 328 -2253
3453 -2253 1892 2068 -3979 1216 990 -354 868 -3124 2217 1863 -3385 1073 -51 867 563 -3286
3469 -3286 2569 891 -1838 474 -1190 2499 -398 -3068 2926 -475 -99 11 -2302 3858 -1113
3484 -1113 -2692 2810 -1241 1176 -609 -2475 4050 -1448 -1686 1616 -1149 2248 -1842 -1573 3477
3499 3477 -1755 85 -193 -690 3184 -3131 -137 2479 -1982 1668 -1948 -73 3529 -3844 902
3514I02M06k940M091n449L576K389o411M820j581j62K466n561N134l89l542L998
3530A747l776L622l17n101O804l469m20K756n200O266k478l869O661m807K081
3545E00O36m566O974m184j452M538m511M048k385k124O023n339J829Q55l023N573
3561C392n565J024M286n968M729k474j380O090p294L168K230m933N454m542Q57
3576i26M409o678M365p56j865M341n931L817J133m671N144m155J841K573o518
3591c877O232k103k227N021o329M589O33n668O780m187L56L355o091N711j712
3606D83k831M932m831L289n7l895N793m386J232K274n196N915l252j486N312o229
3622b933M196n3m513O692n070Q93L445n891N461k218k140N069n343L281K74l822
$$ plain form
3514 902 1308 -1632 2459 -2990 586 2975 -3436 1384 -197 -359 2107 -3454 1680 1291 -2251 1747
3530 1747 -2029 1593 1276 -3825 2979 -490 -910 1846 -3354 2912 434 -3435 3226 -1581 500
3545 500 1136 -3430 3544 -640 -2092 2446 -2065 1983 -402 -2526 3497 -1842 -13 842 -2181 3392
3561 3392 -2173 -1149 3137 -2831 1898 -576 -1956 4134 -3160 8 2238 -2695 2759 -1783 -926
3576 -926 3483 -3195 1170 414 -1451 2890 -3041 776 1909 -2762 2382 -1773 68 2641 -3877
3591 -3877 2355 252 -1975 3046 -3283 1306 1939 -3729 3051 -1136 -780 2575 -3516 2195 483
3606 483 -2348 2584 -2247 1042 985 -2910 2883 -1503 -271 2003 -3193 2722 -530 -2016 3296 -2933
3622 -2933 1263 1210 -3303 3389 -1681 -788 2657 -3234 2227 9 -2131 2938 -2405 876 1150 -2672
3638b672N415m293J345K063m822N618l252j131M642n708M337q23l783O588n216
3653a692J037K921n366N746l021j850N310n219K835P8l115N374m651R82K510m073
3669b194M421l476jM322n710L657n06k462N225n871K289L015n609M807k610n23
3685a226M351o042L397R58l393L979l984K191J958m966M309j907r0K442n064M833
3701A746p67l345M591l987K576Q22n117N874k266j664L427m164L945q67l667N081
3717B218k838N35P62k828M679l051j036L257l003K873k163j392N109m650J031
3732d97J532k683M194l989j89M651m651J859j46j212L815m568J159K588k889J946
3748I20k309J321K455m560K372L51q15J709m020L320J304m301K970j338J013J287
$$ plain form
3638 -2672 2743 -1550 -205 1858 -2964 2654 -598 -1729 2913 -2795 1542 719 -3064 3524 -1692
3653 -1692 -655 2266 -3100 2646 -375 -2225 3085 -2134 701 779 -2336 3038 -1613 -631 1879 -2194
3669 -2194 2227 -1249 -1250 3072 -2638 1019 513 -1949 3276 -2595 -306 2709 -2900 1907 -703 -1226
3685 -1226 3125 -2917 480 1438 -1955 2024 -1960 231 2189 -2777 1532 -375 -465 1977 -3087 1746
3701 1746 979 -2366 2225 -1762 814 1636 -3481 2393 127 -1537 1890 -2274 1671 804 -2863 2218
3717 2218 -620 -85 677 -2151 2528 -523 -1559 1698 -1305 1568 -595 -1987 3122 -1528 -497
3732 -497 1035 -1648 2546 -1443 -1632 3019 -1632 227 81 -1131 2684 -1884 -725 1863 -1026 920
3748 920 -1389 -68 2387 -2173 199 550 -265 1444 -2576 744 2048 -2253 717 -621 392 1679
3764A679m800M142N76l131K128j789K276K59m074L568M2j106K28j618L523j364
3780E39k422K503p34J296j668j708M749k488j440J845j214K691k458j864M594
3795B221j925j106N86l93K676k601j311L065o51m42j426R09K566l107q1J331K38
3812E49N55l210J788K684l288K06M66P71J023l602J442K667k335m65Q5J421O84
3829A441l064Q44K083o77j380n60K428J43k537N70J198P48j644j564L123J73k414
3846a089M04P17J293j169k268K650J187k461l62J145J181q39k044J509J906j676
3862H4j659J458J527j109j689R23J811o11k099M24K611r36k240R72J508q4j742
3879h51o72K825M5k916Q38J583L9j152j569K570J062l097K87J665M07j099j686
$$ plain form
3764 1679 -3121 1021 1597 -1534 594 -1195 1081 1340 -2734 834 876 -230 -2 -1620 1903 539
3780 539 -1883 620 -114 1182 -486 -2194 2555 67 -1373 472 -742 1949 -509 -2373 2221
3795 2221 296 -810 -224 -617 2059 -542 -1853 1212 561 119 -1307 -398 2168 -939 -1020 311 549
3812 549 1104 -2106 -318 2366 -922 -716 -250 521 1544 -2058 -616 2051 -284 -749 -664 757 1441
3829 1441 -1623 -779 1304 627 -753 -1313 1115 1258 -1279 -709 489 1237 -407 -1971 1152 1325 -1089
3846 -1089 -685 32 1325 156 -2112 538 1725 -736 -1098 47 1228 389 -1655 -146 1760 84
3862 84 -1575 -117 1410 301 -1388 -465 1346 735 -1364 -940 1671 735 -1505 -533 975 891 -851
3879 -851 -1523 1302 1347 -1569 -731 852 891 -261 -1830 740 1802 -1295 -1008 657 1064 -35 -1721
3896a721K162J193k160p79J267J786j784j869K455N50r26j210j01L396j998k430
3912b169K775Q5j04j331r60L921j609k557K037L70O58k008p63L506j252j686L89
3929f98J006J677l339K2K888j347j45j477J211K899m321M54K464j248Q45k656
3945a765J323L272m157K77J586j15Q16l383J960K385l000L78l71J877L43m081
3961b655L007R11j606O13k367L639J23m525L613k73l25N09l358M418j73l772K685
3978D64o37J267q39k775M367j097j682R32j100L374k673j982M350k253N71o85
3994c98j425M974l981j066L632k529K050k159r72N073m212j65J987j430K567l564
4010a618M84L654l604J204q01N57K674n179K619J710k912K637l407K158K707n821
$$ plain form
3896 -1721 441 1634 -526 -1305 -38 1748 -36 -1905 550 1100 174 -1036 -1137 2259 261 -2169
3912 -2169 606 691 587 -744 -1704 2217 608 -1949 88 458 1116 -892 -1655 1851 599 -1087 -698
3929 -698 308 1985 -1354 -1332 1556 209 64 -1413 -202 2697 -1624 -1170 1294 46 891 -1765
3945 -1765 -442 2830 -1327 -1050 536 421 1237 -2146 -186 2199 -801 -423 -794 1083 1426 -2655
3961 -2655 352 1263 -343 270 -2097 1542 1665 -2860 753 480 155 664 -2694 1724 1551 -2221 464
3978 464 -173 1094 255 -2520 1847 750 -932 0 -1100 2274 -399 -2381 1969 -284 287 -398
3994 -398 -1823 3151 -830 -1896 1736 -793 1257 -902 -1874 3199 -1013 -1178 809 -621 1946 -1618
4010 -1618 -1134 2520 -1084 120 -681 -124 2550 -2629 -10 1700 -1212 1425 -1982 176 2883 -2938
4026b938L416L40j547K462m384L367J522m641L205j191P84J015m420M448m11k443
4042a416K338k672L551j032l835N154k382J73R76l597N461k438k920M738l152
4057a053J892l92l192N588l184j068K592k544L391k751j207M639l971J590l60
4072c0j569M776n047P90L310l986L380k679k52M665n796K372J299k820L871m218
4088a934J302L343m933K999j025l96K879m847L287N99k874L253l500K417J456
4103B026n073M819j837r64L277n037M083J70m207M893l178Q81J890m501M623j630
4119B35j738L270l575L014p13k652M489l529J224J124l494M782l229o65L954m778
4135b281L469p11k847N267m375Q77K546m153L957k200q50L695m344K676k17k039
$$ plain form
4026 -2938 478 818 -729 1733 -2651 716 2238 -2403 802 -389 395 1410 -3010 1438 1027 -1416
4042 -1416 922 -1750 1801 769 -3066 2088 -294 -121 855 -2742 2719 281 -2639 2099 -1053
4057 -1053 839 447 -2745 2843 -341 -1409 1183 -1361 2030 -721 -1928 2711 -1260 330 -30
4072 -30 -1599 3177 -1870 -1080 2230 -1756 1624 -1055 -1307 3358 -2438 -66 1233 -1587 2284 -1934
4088 -1934 -632 2711 -2222 777 -248 -644 2235 -2612 675 1274 -1600 1653 -1847 570 2026
4103 2026 -3047 1772 -65 -1029 2248 -2789 1294 1464 -2743 2150 -1028 -147 1743 -2758 1865 235
4119 235 -1503 1767 -1808 1206 493 -2159 2330 -1199 25 1149 -2345 2437 -792 -1457 2497 -2281
4135 -2281 1188 477 -2370 2897 -1478 -601 1945 -2208 1749 -451 -1301 2394 -1950 726 509 -1530
4151a530L635l795J839J317l699M178k815R1L041m865L931o53k742M409m050J765
4167E7J745m422M492k127r08L160m062L139m83k439L853l276J537Q22l101L993
4183A980k797J19K596m041L584j281j939M268m224J909J315l680M142k582m23
4198a054L132m039K796l45k000L286l229J715Q71k955L374k313M76J798l658L632
4214A487j319j743L497l621K288N23l492M378k331n86K518l416L039q37k157L501
4230A729k546R59K92k007L486k613l0J933k484K727k082p19L703l776J477O32
4246F81k077L456l221J45L084l361J788o07p86K948l463J020J492j710J520k101
4262a192J173J643l159J954m45l1J390l421K727O99k831K297j657J193J156l756
$$ plain form
4151 -1530 2105 -1690 149 1466 -2233 1945 -870 -779 2262 -2603 1328 675 -2067 2342 -1708 57
4167 57 1802 -2620 1872 -255 -1163 1997 -2065 1074 591 -1848 2005 -1271 266 1088 -2013 1980
4183 1980 -817 -698 1898 -2143 1441 160 -1779 2489 -1735 174 1489 -2191 1951 -631 -1054
4198 -1054 2078 -1961 835 490 -1510 1776 -1453 262 1133 -1822 1552 -761 -285 1513 -2145 1487
4214 1487 168 -1575 1922 -1699 589 1112 -2380 1998 -333 -919 1599 -1817 1222 385 -1772 1729
4230 1729 -817 142 434 -1573 1913 -700 -730 1203 -1281 1446 -636 -1355 2348 -1428 49 681
4246 681 -1396 2060 -1161 -1016 2068 -1293 495 -112 -898 2050 -1413 -393 1099 -611 909 -1192
4262 -1192 -19 1624 -1535 419 -26 -57 1333 -2088 639 1338 -1493 804 -853 340 1496 -2260
4278b260K978K24j783J420j744J937K64k853K332k38o9j18j598K904j090j431
4294a125J570r53J672j344j519L412j715o90R53j133K419j791j460L125j273m08
4310b60Rl66K212j879r29J876l20Pj354P12J837k109k3N33M52O79k588J226J899
4329A614k132K36j02N79J158k731Q01K007j436m09k29J127O65k135K82J419n5
4346F59j045p38J921J18j746L02O75Q65j063j526K271N09j881O5N80J071p47j908
4364a618J776J184j689n87Q03J080n04j764R23J727j125j358Q19J371n81j487
4380a030L93J578j17j874J34K066m64j772O24J032K46j153j159K430L63k496N81
4397f18J166K43o65j721J985J167k387p7J218P35r62j645J790J063j454q67N89
$$ plain form
4278 -2260 718 942 -841 579 -1165 772 1036 -1817 515 277 208 90 -1508 1396 306 -1125
4294 -1125 445 -508 1164 -180 -1699 1713 -2 -692 261 -872 1547 -244 -1704 1421 148 -260
4310 -260 -251 -617 1595 -284 -1213 663 343 350 -1004 -292 1545 -564 -587 -54 398 1077 -1511 -285 1614
4329 1614 -518 -282 -384 195 1353 -1378 -577 1430 -6 -415 -644 483 1148 -987 -705 714 659
4346 659 -386 -1124 797 915 -831 -529 146 1011 -52 -1578 693 1202 -679 -614 -34 1037 290 -1618
4364 -1618 158 1342 -347 -934 -131 949 445 -1319 -396 1331 206 -1152 -333 1038 457 -1030
4380 -1030 -637 941 824 -1050 -916 1150 686 -1086 -462 570 816 -337 -1496 934 1297 -1199 -618
4397 -618 548 791 126 -1595 390 1557 -830 -907 311 1046 84 -1561 229 1292 -162 -1029 -440
4414d40K029j438j765J984L91l27j267l66L089j538k071K081O7L97j361j097L408
4431A776j125k049J227M28R56j981p06K850p83j136l88R91J771k991j0K305q91
4448B44K01j945J169K759l703L06J772o71R06k715J223K839l288J27Q43N05O26
4465A198l142J806J777j997J27r39K255L10l664K628M38p40L12k415L470K1l690
4482b245K722l06L99o6k929L989l37k864J836o15J739j183k399L801r26j090R7
4499c77n86L276k861j306L431j870J049j484r04M576l740p34K751j777J946k474
4515a084m41M197l366n8P99k93K234l841J043K806k735J045j480J310K241m692
4531b315K185J200j532J642l405K743J914m860K833p1m05J618m177L305J314l692
$$ plain form
4414 -440 1589 151 -1614 370 761 434 -833 -1199 1890 352 -1719 362 429 826 -535 -1632 1776
4431 1776 651 -1398 -171 257 1213 -768 -1474 1376 593 -543 -931 60 1831 -1160 -1170 1135 244
4448 244 445 -1500 -331 2428 -1275 -969 803 132 1038 -1677 -454 2385 -903 -776 67 572 1198
4465 1198 -1944 -138 1639 -358 -231 -1170 1085 1395 -2269 359 797 57 369 -2046 1424 1445 -2245
4482 -2245 477 171 570 504 -2425 1564 1227 -1637 199 -416 1323 140 -2259 1542 616 -474 -377
4499 -377 -963 2313 -548 -1854 1577 -293 756 -728 -1632 2944 -796 -1530 1221 -556 1390 -1084
4515 -1084 -1525 2672 -694 -752 47 -246 1988 -1853 -810 1996 -739 306 -1174 136 2377 -2315
4531 -2315 -130 1070 -462 1180 -2225 518 2432 -2428 405 334 -71 1547 -2630 675 1989 -1703
4547a703K067j059J589J75l698L866n78j143R36k376L950j452l118M165k005P84
4563D00K9k922M926k190k154L204k216K269j475k166M781k804m67J240j591L320
4579B184l104n85L507k852J459j292k90L735m570J250K003k725K984l119M41L799
4595B825m784J950O55j513K738l734J631K162l501K297j456Q40J692m266L269
4610H05k1j790K296l159K829M56l922L987j703p2J723l909M122p82k993L694k456
4627h95J424L61l240M172j709j123J982k270K910j826j475L603k825J311j80j885
4643a665M167l580m7K931l357K827j650j224M232m007R57J470k317K976k780K30
4659h37K782l317J929q02l60K487l698K096P21k337K801k880J372J956m135L208
$$ plain form
4547 -1703 364 -695 894 1069 -2629 1237 659 -484 452 -1924 2026 574 -2544 1621 -384 400
4563 400 429 -2493 2433 243 -1911 1293 -923 1346 -129 -2295 2486 -318 -785 455 -1136 2184
4579 2184 -920 -1505 2002 -850 609 -683 -973 2762 -1808 -558 1445 -1280 1704 -1415 -974 2825
4595 2825 -1959 -9 646 -867 1871 -1863 -232 1930 -1571 726 -730 110 1802 -2464 805
4610 805 784 -1006 1290 -1869 960 1416 -2506 1481 -222 -294 1429 -2480 1642 860 -2133 1561 -895
4627 -895 529 890 -2350 1822 113 -1010 972 -1298 1612 -214 -1689 1914 -911 400 220 -1665
4643 -1665 2502 -1078 -1125 1806 -1551 1276 -374 -1598 2634 -1373 -416 1054 -1263 1713 -1067 -837
4659 -837 1945 -1372 557 -245 -605 1882 -1816 280 1001 -1336 1465 -1415 -43 1913 -2222 986
4675I86p30j245K743l634K329R06l304L107j622L10J474l217K911o84j323K141
4691A148k497K217l01k259L271k358P00J136l004L472j516j260K952l064J979
4706F16J72k488L399k292M8J753k625K425j019j002K376k496J621q9j581K569
4722A387k339R51J000k574K888j667n48K492l088K114K4k235L120k159K30J563
4738A159k560K299q30j012K034j923J275k44j228K337k049P19O57j734K434j978
4754f44r6K170k610J708k65j421K800k587M42J621k180J769r35l90J909k188Q90
4771gM38r31J330j775J027P50j730J521j047M81R79k546K135m1j459J746j714
4788h43J157O57k422K053k69q01J036j472J420N4j553J340m39L44k58r28J874
$$ plain form
4675 986 256 -989 1754 -1880 449 1355 -1949 1158 -464 -154 1320 -1897 1014 330 -993 1148
4691 1148 -1349 868 567 -1692 1579 -779 -79 1057 -1947 1525 9 -1251 1701 -1363 616
4706 616 788 -1700 1699 -593 -545 1208 -1417 1008 -11 -1013 1363 -1133 488 399 -1182 1387
4722 1387 -952 -1 999 -1575 1313 -354 -902 1590 -1498 616 640 -1595 1525 -634 -404 1159
4738 1159 -1401 898 68 -944 1090 -833 442 198 -1030 1307 -742 -23 634 -1100 1334 -644
4754 -644 -740 1430 -1180 528 263 -1158 1642 -945 -503 1118 -1062 707 -228 -618 1291 -897 -7
4771 -7 431 -500 830 -945 82 832 -898 623 -424 57 1036 -1510 625 584 -875 871 -843
4788 -843 314 971 -1451 602 333 -468 568 -904 516 570 -983 357 -82 262 4 -924 950
4805I50r32n12P66p97J505j232q90K342j383o4M03q80J878j397q22K002q95p3
4823c1k05j75J450j305l59R07K4K3j179P07J205j431J18Q3M28O05j945Q91J224
4842A035j382K51k62N58P49j929N40J360p93l66k60Q83L86j407J11J015J75r45
4860b81n38J420Lr80p4L75J003r48j128J649L29j282NK76Q99l72j519J152J101
4879A090j265n39O43O86j99j291M31J377o32j180N11J103l01j153J87J125P8j342
4897f71j69J732k52j439L82Q04M18r82j093K007L12j879L60P38M81n91j499J658
4915C17R00j790j58Q40P54p02j339J241Q78q47r23L40J773j237j237J399K57N6
4933E22j179l94K628j301j482J355J44N03j313p25K573q69j413O67N02R37j866
$$ plain form
4805 950 18 -494 272 -525 980 -252 -1142 1200 -183 -247 156 -724 1154 -243 -1065 937 42 -31
4823 -31 -236 -411 1039 -266 -625 282 306 329 -850 -143 1062 -369 -251 -168 260 865 -1080 -189 1035
4842 1035 -347 -96 -358 200 949 -980 -440 920 127 -239 -499 384 770 -637 -526 489 664 -281
4860 -281 -819 601 604 -376 -450 -75 928 -20 -1148 501 830 -452 -447 -171 728 356 -1163 -11 1090
4879 1090 -175 -714 -71 615 416 -875 -444 933 301 -879 -368 735 434 -719 -532 593 671 -671
4897 -671 -840 892 640 -799 -417 387 805 -177 -1270 737 1049 -830 -470 268 749 158 -1341 317
4915 317 1217 -573 -731 109 863 161 -1178 63 941 94 -829 -489 1284 47 -1190 209 466 522
4933 522 -657 -1051 1577 276 -1206 149 293 796 -517 -1242 1331 462 -951 -284 218 1155 -711
4950g11l45K057m95p48o79J081J427k561K02J413m01K95j961J280K014k824K93
4967f63R69j0N43k352J291J940k258j6K32R93K36k503J517J161j069k70r13K358
4985A186k98k636K061R4%k96j964L318m82k670J950k68P60n97k078L165l85j802
5003i42P60j50J827j739j423K820q05l05p58r1K806k572p52K228r19Q87j884p6
5021a088L428l041j83J322o58J654k669K33K943k353q8J60M72J395l017J058J580
5038A148j281M16j759K013J216l719K029M69o41R99k895K643J052l324J798l03
5054a39O10M02k973K887L52j986R56r84K044n59k588K828m50l44r9j363L295j795
5072I4j678K618j471J343j034j717M091k371j077J930j287J812j738r53L182j930
$$ plain form
4950 -711 -1056 1001 506 -242 -921 160 1587 -974 -772 641 240 535 -1426 -146 1868 -956 -663
4967 -663 306 296 839 -1513 -222 1718 -540 -556 -324 669 905 -1598 -81 1080 11 -259 -1172 1186
4985 1186 888 -1748 313 407 407 111 -1853 1465 983 -1687 263 -5 755 158 -1920 1245 860 -942
5003 -942 -182 -332 1495 -244 -1667 1153 348 43 -715 -806 2000 -572 -1324 904 -15 872 -1012 -1088
5021 -1088 2340 -701 -884 438 -220 1434 -1235 -1002 1941 -412 -500 -340 132 1527 -1490 -432 1148
5038 1148 -133 283 -1476 537 1753 -1966 63 532 -109 890 -2005 638 1690 -1634 164 -139
5054 -139 471 873 -2100 787 1139 -847 109 -875 1169 610 -1978 850 400 56 -43 -1406 1889 94
5072 94 -1584 1034 -437 906 -128 -1845 2246 -125 -1202 728 -559 1253 -485 -1438 1744 -186
5088a86j95J10j30K256l056M55K059j909J285j700N42K676l745J256J014j185
5104d53J658k787J476K031l387J584r8j64J573l279J975J224k263J166j132J528
5120F52L40k880K540k90n63P31k282L089n24k681K929j385O14L15k648L552r64
5137E45j927K086j289J582r20j757L167j494l61N05j111K663k168p80K548j768
5153d79J135j119n87L160l071L63J464j692K165k250r0K935k929Q52L98q37K025
5170A443k572O93J687j953J171j135P07J296k899J943Q6r60J558k566J980Q44
5186A323k987K393q75l0J335k792K227K18j898J777j270R83K81k158K311q29l00
5203b91Q36j693K255j034j235K312j840J014K9j690K850j829m62J903k023J610
$$ plain form
5088 -186 -381 -271 -401 1855 -1201 -746 1313 -596 689 -1011 -469 2207 -1538 -282 732 -453
5104 -453 1205 -1582 -106 1925 -1462 122 24 -140 1433 -1846 129 1353 -910 256 -876 652
5120 652 992 -1888 652 362 -201 530 -1752 1337 813 -1868 1061 -324 290 605 -2043 1509 545
5137 545 -1382 704 -585 997 77 -1680 1487 -7 -368 137 -974 1689 -479 -1259 1289 -479
5153 -479 656 -463 -1050 2110 -961 -598 866 -826 1339 -911 -1001 1934 -995 -143 255 -582 1443
5170 1443 -1129 -436 1251 -702 469 -666 41 1337 -1562 381 467 -493 1065 -1501 479 1323
5186 1323 -1664 729 -146 -176 1159 -1633 594 812 -1086 691 -579 404 685 -1473 838 9 -291
5203 -291 545 -1148 1107 73 -1162 1150 -690 324 353 -1337 1513 -316 -778 1125 -898 712
5219G12o61j124K464j917K42P63j168J638j423%J393j645J221o89k05J574k208
5236a033J196M09j427J844j748N12J369k346J714k36r67J749j947R49P54j757
5252i65J475o81l0Q40j463J286l11n79J067j327J165k17j119J794j394L19Q50
5269G10j753J821p45q61J812j611O38N07j343J485q98j48J010j263R75l25l55
5286c44R07j116Q27n5p61J252j233N24N99j505J540n97n23J228j421R45K58j395
5304h70J426n98j68O19r63R68k76n58P18n25N47l99m12J169r39J70L02o52J186
5323G45j049k54J407j215L91N6o10J324r96l12J073o49J38k39K9P11p62o3L20
5342D5J09J49r15O57M42p36L24k91M17L70j358P96N83q56L48l78L90M83j144L73
$$ plain form
5219 712 51 -1073 1391 -526 -284 479 -689 949 -474 -474 919 -726 495 -194 -399 1175 -1033
5236 -1033 163 572 -855 989 -759 -247 1122 -1224 490 254 -713 1036 -911 38 792 -965
5252 -965 510 -171 -201 639 -824 462 151 -428 639 -688 477 260 -859 935 -459 -140 710
5269 710 -1043 778 33 -828 984 -627 11 518 -825 660 -238 -386 624 -639 336 11 -344
5286 -344 563 -553 274 219 -542 710 -523 1 600 -905 635 38 -485 743 -678 267 525 -870
5304 -870 556 -42 -210 409 -554 414 138 -420 298 -227 320 -79 -491 678 -261 -91 211 -441 745
5323 745 -304 -558 849 -366 25 81 -529 795 -201 -513 560 -89 49 -190 -161 550 -212 -275 45
5342 45 154 303 -612 45 487 -249 75 -216 201 571 -787 9 592 -264 84 -294 96 579 -565 -192
5362a92O78m45j62k57N48K83q05K6N18K47o22l71R45p1n20j3Q4P21n38p98J063
5383C19J27o07r4R9O48k28j117Q68O65q00k84K74N12r6q38K42R83n30p23L95O76
5404D91k37p13J33O51J76r28j92J265k85r31M15K88M57o28q76J450J39j282L48
5423b59L69M70m86r95J171M65j007k24M43P40o15q30Q35M42l66q27L46J284j013
5442e7o27P63Q9M00j196o6J834j120p45P40J11N79j207l09J784p37p19J03O28
5461B48N89j441k2J193j98l85q61J137Q39j865M21O33k7K24j710J302J205k034
5479g52M29L24L14K80j777J135J121j389n7L1J078j97j721J283M69l77m24p75
5497a005K159o52j661J394j17M92p60j285K655p09j503J105k69J037j023j207
$$ plain form
5362 -192 486 41 -121 -378 170 453 -352 -326 192 439 -183 -554 391 320 -200 -213 -129 592 54 -744 319
5383 319 446 -161 -255 -156 492 264 -853 15 680 -120 -404 -130 382 286 -552 -310 673 143 -580 -185 491
5404 491 254 -459 -326 325 501 -427 -619 646 361 -570 -155 133 590 -38 -914 536 675 -607 -259
5423 -259 110 580 94 -901 270 735 -272 -496 -53 687 72 -758 77 519 153 -674 -328 956 -57
5442 -57 -684 79 168 568 -628 -694 1140 20 -725 15 126 705 -502 -811 973 236 -483 -380 248
5461 248 837 -604 -626 567 369 -16 -877 260 1099 -766 -345 288 261 485 -1225 77 1282 -752
5479 -752 -323 1 315 595 -1182 -47 1074 -315 -372 -341 737 540 -1181 102 571 194 -230 -1005
5497 -1005 1154 502 -1159 235 118 610 -150 -1435 1220 511 -992 113 -156 881 -142 -1349
5513a349K309m75r83J95R8J370j540n66J580l91P3j164M06K019k260N8J143o19
5531i6R46j829M15K186k132J0O17n5R52k133P22J637j526J51m43R40P27k345J109
5550a47Q48o95J82j374J890L27k350J546j83L33J18k196K535J86k129J240l99
5567b68R21j48k033K234o8j022J94m23J855j218j268K020p27L50p19p06K659j855
5585b22q38J723r44J144j388n63K711j906l34Q00m80J506k006j10K223j507J1
5602a80k99M59J298k291O32R60o18O19j902J496J335k841J344J69k48J077k489
5619a479J600J341k396Q95k07P02L03k166J797L72j030L64j084J934l75k016K021
5636E76m40O9n5j472K527q43j484J599q63J122p31j504K805j118q73R25q01J578
$$ plain form
5513 -1349 960 485 -498 -303 -205 1165 -375 -941 639 248 321 -843 -437 1582 -678 -620 523 -96
5531 -96 850 -979 -564 1622 -510 -500 117 62 1014 -1119 -397 1240 -286 -135 -578 362 1089 -1256 -147
5550 -147 701 6 188 -1186 704 1031 -1319 227 44 377 495 -1701 834 1020 -1109 131 -268
5567 -268 653 505 -1528 706 638 -384 -190 -613 1242 24 -1244 776 49 399 -320 -1026 1633 -222
5585 -222 -1060 663 -281 863 -525 -1088 1623 -283 -617 183 -297 1209 -797 -907 1316 -191 -180
5602 -180 -479 -20 1278 -1013 -381 579 -39 580 -1322 174 1509 -1332 12 181 -67 1010 -1479
5619 -1479 121 1462 -934 -39 -246 456 759 -1407 390 762 -268 96 -988 946 571 -1445 576
5636 576 136 205 150 -1322 1205 362 -1122 477 -386 736 5 -1499 1306 188 -685 240 -561 1017
5654A017j163j017K143r60K6l45j77J825j978L3J237r54J079j487R6K218k427
5671h34N79N85o90J345j952N83J614j840O79k47J61R99k098J145O65r81O52j168
5689h03J182M58k039J567k95j6N02j787J922n0j691J563q33N47L46j853J957k61
5707D16j087R99p62J048m92j057J594p07P6q9o09J780j409l65J394j179J017p46
5725a78o88K135j723j6J014j028J235j097l64J727j387K31J18j80R68j397M04
5742b26P58q03O47r66O55Q11j730J111p4m68R57j564J002P42j685J171l88j09
5760a59Q07j515J067L43r99O22m64N56J02j041J082m26NK16q78J349n99o56J145
5779E57r20O40o3j024J529q15l12R06r46Q15k47o67J076o76M0J89m32P67o37j
$$ plain form
5654 1017 -146 -1163 980 20 46 -299 -476 1349 -629 -596 641 -313 766 -721 -625 1593 -834
5671 -834 -255 330 -360 985 -967 -384 1230 -610 69 -178 -17 982 -1116 29 694 -287 365 -803
5689 -803 379 837 -1202 365 70 54 556 -1231 691 641 -1050 513 -320 227 573 -1280 677 416
5707 416 -671 328 -434 614 122 -935 659 -48 28 -61 -670 1110 -299 -664 730 -449 568 -178
5725 -178 -866 1269 -454 -470 544 -484 751 -346 -710 1017 -370 -139 -21 -201 767 -630 -226
5742 -226 532 -271 376 -590 65 876 -854 257 183 -285 672 -892 110 852 -833 338 -50 -159
5760 -159 648 -867 200 543 -456 166 -298 258 360 -681 401 -25 -20 196 -682 667 68 -588 557
5779 557 -363 277 214 -810 719 -96 -408 498 -448 367 120 -547 529 -147 -107 82 -350 417 -220 -221
5799b21N44o14N71m89JP49j024O07J19o92J010q42K0Q03j050P18l8n27P65o44
5819b34J53L64n75N08k40o3K62m51N35l48mM57p36N68r9n04Q91p06K7O56q46N79
5841A94j28m09P74o25J1M61m14K31j95KL24l36R5k4J56Q0n77N08K3l10L70m55
5863b44L29K27q25O57R6m70M31l84K14L12p02L15L37l14n5j14K34J32l31j5K34
5884F4J67l96j15N47k03k08R0p9N21l87m85P54m6l75J31r9L98j08o25N32L30m98
5906i0o9N4L08K0n39J81N34l02m13J95M24k00l05K7L24J32n69m8Q04l76l57K01
5928f4N4M13m93n20J052q9p27L06J17L03l22o10P87K40o18j48L39M17m83l74M92
5949G2K03j18o63L67Q31q77j95M43M1L27q82O2J186q58l12L04J35M57r20p5J097
$$ plain form
5799 -221 323 -291 280 -209 -208 541 -483 124 243 -449 561 -281 -261 542 -508 210 172 -355 410 -234
5819 -234 -81 283 -292 216 -24 -87 175 -276 259 -89 -93 364 -372 196 97 -407 484 -222 -195 461 -385 194
5841 194 66 -343 431 -194 -183 278 -136 95 -100 -98 226 -110 -15 -39 117 197 -380 128 151 -159 211 -244
5863 -244 85 312 -513 144 240 -230 201 -183 31 343 -359 -44 293 -21 -76 -190 44 176 -155 -170 64
5884 64 231 -165 -280 267 64 -144 -54 -133 388 1 -484 270 224 -151 -20 -119 279 171 -454 78 408 -90
5906 -90 -159 -105 203 223 -316 -135 399 97 -316 -121 303 103 -202 -175 149 281 -288 -336 468 92 -265 -64
5928 -64 -10 403 -90 -610 442 353 -374 -68 49 352 30 -580 207 447 -171 -319 20 437 -46 -420 72
5949 72 275 157 -506 -139 692 -185 -380 63 104 431 -451 -389 797 -61 -373 -69 66 523 -397 -472 625
5970F25n41l93L1M55L22q84J08O01lk52p49R92L97j261M60J42K21P6j302J194
5990B39N09j262L57J04L95lj167R41M55p21j21o8R18l47r85Q72J38pn70l63J650
6011I64q45q04Q39k48P16q53o63J843p40p35N20r5Q07r51n63J470l93m13k83L55
6031g2R96j389j2Q38k36K31j115O90J126j664M27L14o1O44j725Q41J265j606L17
6050a91Q1K78N09j604P68R10q07p6m11J143j16j426J099M2O7j67j158J909k82
6069E68j522J105k52N71l69j260J940k62j152O27k37J027p52j129J747l64m51
6086a65j56o9J429j206o15J201l37M23j218J73J865j789m0P17l29J026j574l9
6104g03J998j550p1J99J43Q89j644L28J139p16O6q07J029P00k007R03L73j45K72
$$ plain form
5970 625 84 -309 -278 177 499 -385 -277 324 321 69 -680 312 709 -552 -92 50 271 347 -955 239
5990 239 748 -514 -157 -53 342 339 -828 113 568 -153 -274 -342 576 229 -756 116 254 247 -323 -686 964
6011 964 119 -685 154 -94 622 -231 -894 949 209 -526 -6 -101 706 -245 -808 662 269 -144 -427 -72
6031 -72 924 -465 -477 361 125 356 -759 -69 1057 -607 -180 134 73 717 -1008 -167 1098 -508 -191
6050 -191 -110 168 677 -927 -159 751 -56 -132 -543 600 484 -942 157 199 266 99 -1059 850 568
6069 568 -954 151 -101 470 101 -1159 781 519 -633 -6 -243 784 32 -1097 650 286 -165
6086 -165 -321 -390 1039 -167 -782 419 82 505 -713 -540 1325 -464 -504 213 -116 910 -664 -703
6104 -703 1295 -255 -326 -127 16 905 -739 -411 728 12 78 -729 300 1000 -1007 -104 269 124 396
6123C96j485J457N41j824R25j69N11K74j918J725L27j352O80m95R43j05j542J455
6141C44M9m17j46n51J704r10q90J278o14P57p97q22K253j248p18J057o54J051
6159G26j007o50J905r71l11J51l7J138j484m0J240p66L26q39M76J280j885N07
6177b41O16m31O37j504R09J064j805P04N0J4P59j806J081Q89j424M81k94O40K48
6196E87j537J105J68k47p2p79J509l27j319J316n37M40j50j261J984n08j151J017
6214B38m41P41m36j075J666m32n55K48k11J057r54n31J190n01K44o63J6J415j423
6233d07M4O73n39R21j286J17J546j541L16K08k38Q99j307J90J113r24J25j59L28
6252G9N33j203N12L43k17J85r40J016L49j385R06k71J70L60j321J227J63j130
$$ plain form
6123 396 -1089 368 909 -915 10 -159 352 626 -1292 433 760 -592 88 -407 536 431 -1111 344
6141 344 393 -24 -170 -721 983 73 -817 461 -153 604 -193 -1015 1238 -10 -728 329 -325 726
6159 726 -281 -931 974 3 -308 -157 -194 944 -540 -580 660 -106 220 -619 -143 1137 -748 -241
6177 -241 375 -56 581 -923 -14 1050 -755 -51 -1 13 772 -1034 47 936 -488 -7 -301 339 587
6196 587 -950 155 323 76 4 -775 734 407 -912 404 -133 307 157 -1104 880 372 -779 238
6214 238 -203 538 102 -973 693 261 -294 -46 -257 800 -154 -685 505 4 248 -415 -399 1016 -407
6233 -407 -363 310 -229 692 -594 -477 1069 -472 -156 52 -186 713 -594 -404 709 -215 -90 -249 79
6252 79 612 -591 -79 264 47 232 -708 308 657 -728 178 -93 77 437 -884 343 506 -624
6270f24Q22m33M42J22j082J012M3n04K48l69P42l42n75P48k92J92k53m77J273
6289F93q14k26O46o06O92m65m59J246q18j50N03m42O20n74k23P77m71P2r9N0N07
6310D59p91K81K17l18M16o94M83M09r29N73p7k21N83q49M21N36r33N37j10p2L79
6331C00n86L33J97l53J31j28L25j32l44N46l41J41K0m44O66l04l46O55n16L07
6351A27P6n92O70k25l34M34k72J15Q1k25K12k2p9J6j3J63k64J62N1k22L23k71
6373h9j6L63m79K38K00n15M63j86j45L79l78J24J90l23J99M6j60J54j17L4O8o5
6395a5j11R3J81k75N2K23k42Q2M4j75M07l10k10M42j61n6J04k27K13O2m12M21
6417A30P7l13R4JJ15L5k79O7K45p4l04J57J89j11q8MJ09J54m46J5N72l53j76K04
$$ plain form
6270 -624 198 -235 207 329 -753 259 302 -202 46 -323 419 77 -498 250 -42 150 -103 -580 693
6289 693 -121 -347 299 -307 385 -80 -539 707 -111 -261 242 -200 420 -154 -377 400 -71 1 -98 -48 459
6310 459 -332 -51 166 -152 264 -430 53 462 -467 106 29 -192 391 -458 -37 499 -434 103 -7 -79 300
6331 300 -286 47 244 -109 22 -106 219 87 -257 289 -52 89 109 -335 331 27 -319 336 -180 127
6351 127 203 -389 281 56 -278 156 -116 -1 80 -145 67 45 -34 -18 -31 132 -132 30 81 -141 182 -89
6373 -89 -105 258 -221 17 217 -298 165 -21 -166 213 -165 -41 149 -174 25 71 -89 65 -52 -18 50 -15
6395 -15 -126 -33 148 -127 -75 148 -94 -12 32 -143 264 -46 -256 186 25 -31 73 -154 59 121 -291 130
6417 130 207 -106 -12 -11 104 139 -140 -73 172 98 -206 -49 140 29 -59 -55 54 208 -238 -223 349 -4 -180 24
6441B4p0K87l10l18P17k05l47K01l1K96k21l53N04pj97j80K41L17m44m7J18K23
6463A98lo20L77N46p50J08J22N9L76q42K01P62p15RJ14J35L25p47J29N61k81j66
6485a02j72M72J63p50L11J79J27k16o20R67%p73M24j08L66j5r89J011K21q67L61
6506a0j26M73j00q32P99J35l67k10LP73m98m86N45l4K93o83j30J219q23l28M60
6527G3j64O31q45k82J321p29l25K69k6O67r46j42J022k93k33m59N77N30j118K50
6547b22M33p5J96j103R05O15j315N01O8J92K80j360R32O41j042K45r8N28J05j221
6567g95Q22M52m43j54l94J163l02j074Q03K8L23n29p07J655o17p69O59k85P46
6586E82n75r70J688m04o85K47j07R10p91n78J072k13J4p23K73J166j246j22O76
$$ plain form
6441 24 -46 241 -69 -387 330 125 -222 -21 -52 244 23 -330 174 167 -30 -210 31 348 -96 -143 -25 198
6463 198 195 -425 -48 498 -252 -144 -22 37 413 -429 -228 534 -181 -172 -58 77 402 -345 -216 345 64 -102
6485 -102 -274 198 361 -389 -78 101 228 12 -608 359 359 -414 10 -98 268 253 -736 275 496 -371 -10
6506 -10 -136 337 237 -595 204 339 -28 -238 -235 538 40 -446 99 65 358 -325 -455 764 -59 -387 73
6527 73 -91 540 -305 -587 734 5 -320 -51 -77 590 -356 -498 524 231 -2 -461 116 646 -472 -222
6547 -222 211 136 332 -771 134 749 -566 -65 3 195 475 -885 47 688 -354 -109 -207 321 426 -795
6567 -795 27 479 36 -118 -512 651 349 -725 78 106 429 -100 -807 848 231 -538 121 -164 582
6586 582 7 -963 725 321 -364 -117 -224 686 -105 -683 389 176 190 -533 -260 906 -340 -462 214
6605B14j71M11j097K31J414j339M9L25M2O31j491M59J197j054Q3k00M43O10j456
6624f99M40P50l92j25o42J059K61j332O60K6L23m2j331J615L7j303P68k46N71
6643C98q6j302J362J48q41R9r1R70o34q71J186j20l8m93k41J484r70n10P95k28
6663A7N37j013j56J592j097k81M12j72R82j349j53J531q72j98p1K65P66j233R7
6682c96P69k36l5r08J035N71j482N45K41j5L82j376R54Q62j458M74m5M20J61j326
6702h63J012M93q41Kk14R89k25j153R61J39p0l43o06J442m72q96P80j97N91o35
6722a06p77J658n69o79N49l35R43p44p72J333k45m07j31J65Q05r57k13P51j41
6741A28J98q87L30J120j267J17L01n4N57j191L65J076j088O4J34J41N22j172L38
$$ plain form
6605 214 43 454 -643 -412 1002 -337 -288 37 79 710 -781 -322 875 -179 -96 -296 147 757 -699
6624 -699 -259 491 99 -26 -668 391 652 -680 -20 6 329 287 -1044 571 608 -695 73 -173 398
6643 398 312 -990 372 520 -321 -222 -313 657 23 -848 338 218 180 -313 -554 930 -40 -550 245 17
6663 17 554 -459 -615 977 -120 -401 11 -161 821 -528 -681 850 -22 -220 -291 -26 740 -493 -396
6682 -396 373 137 102 -806 229 800 -682 -137 104 89 471 -905 49 911 -547 -73 -118 302 463 -863
6702 -863 149 642 -199 -197 -411 578 353 -800 161 300 230 -113 -719 723 251 -645 135 -62 529 -106
6722 -106 -883 775 206 -473 76 -259 684 -60 -832 501 256 -151 -282 -117 688 -269 -482 269 128
6741 128 326 -561 -231 889 -378 -261 40 -14 543 -648 -283 793 -295 -231 -97 44 566 -606 -268
6760b68P36n29rk84O55J58j000M89K55j7j08p11J013k9q37N88k06M39j21j031
6780h17J262L9q42M14j96M56j45p92Q20O9l56j24L7O38n17k98N28p5K07o13o7
6801c72J066q72j49M80k81N05n52k92J101o89j61K30j10M20n69o1O25l09r9k15
6821c04L84K94p31K24K02L1O8o37N63L07p37L08o1R6K44o80M31L96o69J92N9J24
6843A04J37n62K93K66k11j45p4M81k41l01K94k0J82k41k83O84l09k79L51k12K34
6864A48o0m88O25o5l95K36m5J54o8k26K71Q0j89j75K01J60k56R2l3k5K11l80J87
6887d0L58m71J35J44k74L73k71j24M57l11m7J25n4M7p1l4J18mr8jQ8j7q5J70j25
6912a2L9K6j73J50oj67K41j37j23L04j95N7J13k87K06J02k53J38L8j96J57k7O
$$ plain form
6760 -268 468 -61 -70 -354 301 459 -541 -52 203 186 78 -633 380 351 -486 102 -104 335 214 -817
6780 -817 445 484 -358 56 -140 316 171 -621 199 268 -88 -212 -175 463 -54 -352 176 101 308 -305 -372
6801 -372 694 -178 -327 153 -128 377 -175 -467 634 -55 -216 14 -96 324 -245 -306 319 10 -89 -304
6821 -304 80 374 -357 -133 69 100 168 -469 94 401 -336 -28 -89 7 251 -429 2 398 -271 -79 -20 104
6843 104 241 -321 -28 238 27 -118 -192 289 48 -253 41 21 203 -38 -321 363 54 -225 126 -86 148
6864 148 88 -400 225 160 -235 1 -44 110 42 -184 87 167 -22 -197 4 164 -92 0 -33 -58 153 -227 -40
6887 -40 318 -153 -18 126 -148 225 -46 -170 287 -24 -71 54 0 47 -24 -58 60 56 -42 -43 45 28 -57 113 -12
6912 -12 27 53 -120 30 24 -143 98 -39 -162 142 -53 4 117 -170 36 138 -115 23 61 -135 22 -5 1
6935AQ6j50J9J51l4j58J17K2n8jk4j7K45k59q3L89k81k3J91k74L56k02k76M63
6959B00j78j36J64j20J70m5k61K60P9j82j09J99J04j73j7L0P5J69m92K69K77n36
6981b53K87jr8L71n49Q1M69m50Q9RL6K46m35M4L93j62j78o6K99J1l33J48pK20
7005A71j50m13P14j59l96K49j45L16j4p03P61N5m51J67j20L68j44m85M93R1j37
7026F8k23k4N55m47j70K93k0K71n75m7Q72o42j10K44j72N57o73j57R02n21j50
7047a69N3O0M98o99m1N49j54r2l51M36L53p15J81J33J32Q0q85P63L50q02K88q3
7069a15K39K58j006O55M48o84J13j21M24J23q36M41L11j26k49l02R18l67n30M13
7089Gm5M25m75n25J237m50m98L54j39N85n16n91J059k20l69M1o5P36o93l17O79
$$ plain form
6935 1 87 -63 -44 107 73 -85 32 54 -4 -5 -29 -46 199 -60 -143 246 -35 -58 133 -141 215 13 -263 200
6959 200 22 -114 50 -70 100 55 -206 54 133 -49 -158 41 145 -28 -45 -15 60 229 -263 6 283 -253
6981 -253 34 33 -65 306 -243 -162 307 -143 -54 -45 -9 237 -198 -154 239 77 -101 -167 132 143 -190 -42 -49 171
7005 171 21 -392 322 163 -233 16 -129 187 173 -530 231 286 -165 2 -118 250 106 -379 114 205 68
7026 68 -155 -179 376 -71 -241 52 32 303 -272 -319 553 -89 -199 45 -127 430 -243 -400 502 -19 -169
7047 -169 -116 -56 442 -257 -298 251 97 5 -346 90 443 -272 -91 42 174 254 -631 132 482 -320 -32 -115
7069 -115 124 382 -624 31 479 -205 -92 -213 211 334 -502 -61 250 124 -125 -427 491 124 -406 7
7089 7 -38 387 -88 -613 624 174 -324 30 -109 476 -40 -631 428 208 -161 -120 -185 551 -142 -459 220
7110B20mj12n11K75P32q42j7K68M9L62j069M44R25r90R7J38J4M82j031L10Q10
7131E50n92j17r2N18J29r24L92L87p6j57n80R28O7r39M17J04K74j93q37J139l6
7152C62p64L78j69O27k14j020J066J25n62m1qP25m25o46O31K00k1o60N7J050p64
7173g3k76M09j07N97r15k09J346p64l19K69Q5N08r02q8R44l90k47k22M38M87r56
7194c85R4M86K4q4q02P76M99r47J59J01L03Q5j009P63N14r17K36j06M70J81j117
7215f76N85N90m93j87r1O94j09q15M35J93J90n30k92J102m33n97M81j73N72n52
7235a06n58J200l34m99K27o7N96n83m27Q58j18k56k34J86O37o73k41N57MM8o86
7256d69L19P20q32Q6J40R5L64q97L49O99o97k5j8L19K91r01K36O16l74j80j81
$$ plain form
7110 220 216 104 -407 -132 600 -242 -259 9 58 420 -649 -205 720 -270 -173 -35 -21 461 -570 -260 550
7131 550 -42 -159 -251 267 396 -528 -136 251 175 18 -562 366 433 -506 -89 15 289 96 -741 398 362
7152 362 -402 -24 -193 434 220 -800 266 391 -171 -212 -220 505 80 -566 65 265 244 -416 -359 691 -73
7173 -73 -349 60 -47 550 -365 -574 772 8 -311 -42 43 551 -351 -439 505 115 -132 -354 84 571 -385
7194 -385 -291 195 219 135 -667 109 608 -339 -180 -79 224 309 -700 63 577 -340 -104 -210 260 441 -676
7215 -676 -91 499 6 -181 -272 422 313 -502 -67 126 316 -214 -506 596 163 -434 47 -126 446 -106
7235 -106 -664 536 202 -297 -70 -137 459 -124 -551 307 189 -67 -301 -115 522 -151 -392 165 169 217 -469
7256 -469 -150 570 -262 -176 -36 59 423 -474 -125 574 -123 -148 -166 153 444 -457 -221 395 21 -159 -340
7277c40N46J66p57K73J82J88k89m98Q39M6p20L54p5M23k60o86R07J25o50J19N2
7298e5L64k34n14N79J35k43k81J07N25m47k90L87Q3K05o81L7Q70n89k01K30K5
7319A2L75o67j24Q83m00l39J61J17L63n07j88N46o6k13k55M31J98n38Q4J23K12
7340B08mo16M68L35o41J42J34J45M9o37L37M55n12k7O6J99O5m32J46L08j04k10
7362a26q1M42j75k93J80Q6J98l58j47N86k22k75K34j12K73j99l53N44nl83J38
7383d8P4J47j64k28K19J87k10j95K64J16k68N3N6L9R3l67J44L65m19N8J18j9J58
7406A73l03K6L22k01j29J37K2L8j04o2J89mk08JK34j21k2j8L5P7l2k52K70P7k83
7431a38J65l9qR1j88O5K30k43l7J77j44Q7n6n1J86p8j22J34L1o1k8M9l1N1n1l4
$$ plain form
7277 -340 206 372 -385 -112 70 258 -31 -529 310 356 -364 -10 -85 338 78 -608 299 424 -226 -107 -55
7298 -55 309 75 -439 140 275 32 -249 -142 383 -64 -354 33 116 321 -360 -323 547 -42 -243 -13 12
7319 12 387 -280 -404 479 79 -260 -99 18 381 -126 -314 232 166 -47 -302 129 327 -211 -127 -4 208
7340 208 204 -412 56 391 -250 -108 26 171 220 -417 -80 375 -137 -164 -98 101 166 -266 -120 188 84 -126
7362 -126 -207 235 60 -233 -53 33 231 -127 -274 312 90 -185 49 -63 210 11 -342 202 197 -186 -48
7383 -48 26 173 9 -219 0 187 -23 -218 46 162 -106 -53 3 42 135 -232 -88 277 -142 -84 34 15 173
7406 173 -130 -104 218 17 -112 25 47 85 -19 -81 108 104 -104 -103 131 10 -12 -30 5 82 50 -202 68 145 -138
7431 -138 27 -12 -20 71 -117 -52 178 -65 -102 75 -69 18 -38 -89 97 19 -103 31 62 1 -27 22 -9 42 -9 -43
7457d3J58r2k9J22j30l7J96k39J51J2k40K73j09q6K00j49NR9j35P3N7j27Q4J5
7481B9q6J8M6J0m6N2n9OJ69l35K46J38l38K60j26o8K62k83Q0J95k62J21j01PK13
7506A48j93k0J55m1j02o6K09p0j01J21j82K93j35k58M45j11k91K91k46L05o9l76
7528b94M31Lk87J72p2J43n0j88K23J7l2j97O4L28l70N1P5o3K85m57j8N52m20j2
7552a16J20j23L81l85j35N39k98k6m6L0L28m41O3K22mj23k87L31K12m31J26J9
7574d4J33J06o07N17J79m89K58j34K66O3n95L85J83l16L3r3L07nm09K33J31P8
7596A80l10j06N37k66k36K14n2L06l53l18Q15l50k35K15j76M96m11l38O25j73
7616F4j51j5N3L54m13j22L15oO6m81K31N58o44N9M8J81K47p68L52N30o08R3l8
$$ plain form
7457 -43 115 23 -6 116 -14 -51 145 -94 57 69 -171 102 -7 -93 107 -42 -37 62 -73 0 57 -70 14 29
7481 29 -57 -39 7 17 -29 23 -36 -30 139 -196 50 188 -150 110 -16 -84 178 -105 -25 170 -92 29 -72 -65 148
7506 148 -45 -65 90 49 -53 -119 90 20 -81 40 -142 151 16 -242 203 92 -199 92 -154 151 82 -294
7528 -294 137 140 -147 25 -47 96 46 -142 81 98 66 -131 -67 261 -109 -58 17 -46 239 -218 -236 316 -104 -116
7552 -116 4 -119 262 -123 -258 281 -17 -43 -89 -59 269 -172 -109 113 109 -14 -301 30 242 -189 -63 -44
7574 -44 89 195 -412 105 284 -205 53 -81 185 248 -347 38 221 -95 -62 -155 152 147 -262 -29 102 180
7596 180 -130 -236 301 35 -201 13 -39 267 -86 -404 411 61 -174 41 -135 361 -50 -388 237 64
7616 64 -87 -102 -49 305 -108 -230 85 79 145 -336 -105 453 -191 -132 -84 97 344 -424 -72 458 -150 -57 -95
7639i5J55K96p52K76M57l38r9j84M40J15n53J27K24J29k42l80P64j31n02L08p5
7660f0L76k37o67Q81m4m79J55r8M59j83n97O67J04k91j54J1N61l79l56L55J03
7681A27L4m66J4P35m88j30J08O6L84o74k4Q04n08j10O8Q1M38o98j00O57k09j50
7703d1j93K87L00n78N2K23J76j25n93O49K00o25J84K2K53J06q79O48L38n12R2
7724a6j41L84J5o69M44K35k15j69j10N93j77n28L08J68J37l74j80P09k91l05J62
7745b0RL28m20l64R07l11l06J38k1M60m73l43O26K0j92l65L69L44n43r5K76K00
7767B24J5o19L25M77n40k4J04K00J85p46K86M88m20p3m3L52J08o41J83M16j31
7788A26k72j90N53J4m56J43J30J68l03l58P18rn28J76NL83k29n50P16P2m33j4
$$ plain form
7639 -95 60 356 -396 -120 337 -1 -100 -284 156 271 -282 -155 69 198 -44 -424 340 209 -293 15 -60
7660 -60 316 79 -588 293 249 -230 -75 -173 286 103 -494 173 277 -14 -168 -157 404 25 -331 24 127
7681 127 161 -305 -291 444 -44 -174 -66 0 384 -290 -314 490 -18 -128 -60 21 459 -239 -339 318 109 -41
7703 -41 -234 53 353 -225 -173 50 226 101 -492 157 357 -268 -84 -62 191 297 -582 66 404 -108 -16
7724 -16 -157 227 242 -427 17 252 37 -132 -242 351 174 -354 -46 122 259 -115 -295 414 123 -182 -20
7745 -20 -11 317 -103 -467 440 129 -177 -39 -60 400 -73 -416 210 230 38 -327 42 386 -157 -252 24 224
7767 224 239 -380 -55 422 -118 -142 -38 162 347 -399 -113 375 -45 -118 -161 191 299 -342 -159 257 126
7788 126 -146 -336 217 231 -225 -82 48 216 -87 -445 273 264 -264 -88 -83 300 71 -479 237 309 -124 -138
7810a38J1L78j50m49L79J97k26k65J44M79m04j62J83J16J55n40J18N45m53n4O5
7831g1M8L05n24l0N85k33k44J1K31J68m44o3M00K3k68k18M88R7m13L0R6K00l6
7854A38n16M61K01m53Q4lK49k9m83L86K01l18o9N1K49o3l13J70K36j09k57N6M05
7877B74j83k35O5J20J67l36r5M84j59l03J38N1J53j61k41L87Mk45pJ28J54j65
7899ek16K25K68k61j83J90J64k05o9L7J75K0l78J72L29k86q2J16K8J36l03k0L64
7922B16j70k03J32J14K1j02j05J90N0k42m2K60m2j88L0P5J68j64j71K65O1k85
7944a32M9R3N4O2l02J67K05k29q0J63P0p2j08PJ95j06j56J51J48k11RO3k1N9j59
7969h1n6L25j42j67J84r6P1l6j81K55L1k85J71L5m3N4j03Q1N3j71J15J2k7k3m4
$$ plain form
7810 -138 -127 251 101 -348 31 228 2 -263 -119 360 -44 -206 -23 93 248 -292 -174 371 -82 -136 -71
7831 -71 -23 282 -242 -272 313 80 -164 -153 78 246 -198 -261 139 162 -106 -324 164 261 -152 -122 -26 174 138
7854 138 -378 83 284 -169 -85 -88 161 132 -351 35 236 -82 -151 -100 149 86 -227 -57 179 70 -187 -131 274
7877 274 91 -144 -79 41 208 -128 -223 261 102 -201 -63 -12 141 -20 -261 126 130 -115 -122 6 160 -5
7899 -5 -221 4 272 11 -172 18 182 -23 -92 -55 120 140 -238 -66 263 -23 -105 11 39 175 -128 -148 216
7922 216 46 -157 -25 89 110 8 -97 93 143 -99 -141 119 77 -111 -81 -6 162 -2 -173 92 153 -132
7944 -132 -83 10 64 126 -176 -9 196 -33 -113 50 120 48 -60 -53 142 36 -120 31 179 -32 -23 40 19 78 -81
7969 -81 -137 188 46 -121 63 -33 38 2 -179 76 107 -178 -7 28 -15 39 -64 17 70 -101 14 26 -1 -24 -68
7994f8O6M9j1j4n9J45k33O3J86k15J87r0r0J69j13o7K26j77M4Lj15K01n9j03J53
8019G8j08K8m8O5n5OJ22j75J05K8j51K07j09j22K31j07p0K03k25J11O7k44K53
8042I0n0q6N2j03J10K7q5M8K7J8j44L3K18k29J21m1l1J56k57Q9J67k96K38m8j04
8067h0K49k72rK26j73M4k7N9R1j54OM2N2o8j48K29%j96J64j40J91J7l27K87rj12
8093e8J11j65K30j2l43L21N2j49M4j07J92j21j33J83MN9k27l7L84k63q2J29o8
8116e6K51k82j27M21j97q2L6o5L09l33j42M38r0j54J0M2K57l34qJ23P9Nl70L43
8140G4J67l95J54m8J22J35n38L01K96l92J28j53K35J20m67J21K98j46r7n4K67
8161A28M1l62J03J21J16j69k20M82j18k74J28p9M19k58m24N75j29j83J31j83M06
$$ plain form
7994 -68 -2 47 36 22 -37 108 -125 -62 124 -91 96 6 -84 85 -28 -95 131 -46 -2 1 -114 87 28 -75 78
8019 78 -30 -2 -50 15 -40 -34 88 -87 18 46 -105 102 -7 -129 102 -5 -75 128 -97 14 81 -163 90
8042 90 40 -46 6 -97 13 40 -45 3 30 48 -96 -63 155 -74 47 6 -25 131 -126 -37 130 -166 72 24 -80
8067 -80 169 -103 -112 114 -59 -15 -42 17 108 -46 -40 2 54 -14 -162 67 67 -129 35 -105 86 103 -224 63 54 -58
8093 -58 53 -112 118 106 -237 84 136 -13 31 -76 116 -5 -138 45 49 108 -119 -156 228 -35 -117 12 -56
8116 -56 195 -87 -214 207 10 -72 -36 -101 208 -125 -267 171 81 -73 -63 -21 236 -98 -106 17 96 101 -269 74
8140 74 241 -154 0 -48 74 209 -329 -28 268 -124 4 -149 86 206 -261 -140 158 12 -85 -139 128
8161 128 169 -193 -90 31 147 -22 -242 240 122 -152 -24 -103 316 58 -366 209 80 -103 28 -155 251
8182B51k24l14L64M8j30j49P9L38k97
$$ plain form
8182 251 27 -287 77 125 -5 -154 -75 263 -34
8191c4
$$ Imaginary data points
##PAGE= N=2
##DATA TABLE= (X++(I..I)), XYDATA
0@%%%%%%%qJ6j6J6j6K4l2M0n6P2q8J04j22J46j76K09k43K84l33L88m47N12n86
30c12O68p61Q63r77J104j241J390j554J734j931K147k383K640k921L228l563L927
47B058m326M766n247N777o365P015p739Q551r468J0515j1721J3127j4789J6788
61H942j9243K2334k6357L1821l9662N1836p3208J20476l76875R5257O71348q08814
73c42145N49025l02014j03106O42362p40999K67580J60807k68359M35053o65774
83c67570M19484K84946p19472N92264k98509j445M75000q30834N50552J33123
93B37539n02084M60868m13560L14481J36483o39349O40548k46648p5708L17888
103B30458o16596O29954q5468n31696O32538l66893J40554J08521m83060O19151
$$ plain form
0 0 0 0 0 0 0 0 0 -8 8 -8 8 -8 16 -16 24 -32 40 -48 56 -66 80 -96 113 -130 154 -179 209 -238 274 -312
30 -312 356 -405 458 -519 585 -656 734 -820 914 -1017 1130 -1253 1387 -1534 1694 -1869 2058
47 2058 -2268 2498 -2749 3028 -3337 3678 -4061 4490 -4978 5537 -6184 6943 -7846 8942
61 8942 -10301 12033 -14324 17497 -22165 29671 -43537 76939 -299936 -204679 466669 -342145
73 -342145 206880 -95134 -198240 444122 -296877 -29297 131510 -136849 298204 -367570
83 -367570 51914 336860 -382612 209652 -88857 -90302 384698 -446136 104416 237539
93 237539 -264545 196323 -217237 97244 233727 -405622 234926 -11722 -87430 230458
103 230458 -386138 243816 158348 -373348 259190 -107703 32851 141372 -341688 277463
113B77463k76593j57313L17396l82403M78723k86453k71995O62345n22684J52459
123i055J30535m03208O13598m21165j29463M94659m40256K74275j44695j46064
133a80839N09745n25907J57285J79856l15272M15495m11494O6453M11197n36090
143b29571K87203l9079j23697L56566m96932K57374J73476l73850L38495k90887
153a40902J38679K51319n55029M07493j1973k27315L15366l88733K75872J17966
163A82743m30572L63882j42100K6056J18712l68264M17162j13872k11085K97122
173A39784k91410K73687m6273l42617M81233k38196m8853J81930k98578L73517
183A84224j70186k15302L82231k55718J13041j2618j99614L91359k73305m7236
$$ plain form
113 277463 870 -156443 160953 -221450 257273 -29180 -301175 361170 -161514 -9055
123 -9055 121480 -281728 331870 -89295 -218758 275901 -164355 109920 -34775 -180839
133 -180839 328906 -197001 -39716 140140 -175132 240363 -171131 -104678 306519 -229571
143 -229571 57632 18553 -105144 251422 -245510 11864 185340 -188510 149985 -140902
153 -140902 -2223 249096 -305933 101560 89587 -137728 177638 -211095 64777 182743
163 182743 -247829 116053 -26047 9 118721 -249543 167619 53747 -157338 139784
173 139784 -151626 122061 75788 -266829 214404 -23792 -72645 109285 -189293 184224
183 184224 14038 -201264 180967 -74751 38290 25672 -173942 217417 -55888 -103124
193a03124K16934k12857K29484j90745o5552L32550l08294R9087K9465j20665
203i3717K82928l18125O1983K33586k83198J87727j17402k2602K64572l45111
213a49359J32770J11933j77206J81996k05242R2462J59833k80932J69073l4315
223A013k1121J24819k56118K01484L1848j85444J76389j48853J10465N7971k56467
234a64014K47378n5838q7179J33191j82908J78928r092j92666K09377q8767J0272
245a318L8977j42113J94221p6836q4773J22422r3295J00609o4798p9355J85546
256I9287j27641J1378M2147q6170J53162j24754l3765J54734j29757N6261j3564
267A318n5108J43737j28117j240R1433p9116N7789n8342L594Q9570j03322L2934
$$ plain form
193 -103124 113810 -99047 130437 -60308 -125860 206690 -101604 -2517 26948 -93717
203 -93717 189211 -128914 -66931 166655 -116543 71184 -46218 -68820 195752 -149359
213 -149359 -16589 95344 -81862 100134 -105108 -12646 147187 -133745 35328 1013
223 1013 -20108 104711 -151407 50077 81925 -103519 72870 -75983 34482 92453 -164014
234 -164014 83364 27526 -59653 73538 -109370 69558 60466 -132200 77177 -11590 -1318
245 -1318 37659 -104454 89767 12931 -71842 50580 -42715 57894 -6904 -86259 99287
256 99287 -28354 -16976 25171 -60999 92163 -32591 -66356 88378 -41379 14882 1318
267 1318 -53790 89947 -38170 -39410 52023 -27093 30696 -27646 -24052 65518 -37804 -4870
279d870J1077j3320N0071r7269N8065M0065q1126N6868m0990K2701M6503j06296
291e8521O7588K2331n8403M5605m2292K6928L2657p3811L7449J8798k3371P520
303B478j9184K5352N605k7616P845P380J1820j9436j0495L0670j1631q631N798
316d5o681J8460q118k2842K7924K916k5866J8982l829p960K4715l3055R039L2188
330B5828m7730K5713Q563l3623M3576l1484k939L8049m7428K8426J106k4503L5484
343A9038l3523J9489M376l0465M4899l8440J4535J8057n1418O7604m3053j7385
355b6286P0580q0585M9889L119o3527R9823p3939l614P0725q7794O7503k5167
367G27l8487R2807q8201K9986K5394n5630P8518p9541K4192N8708r8426Q2117
$$ plain form
279 -4870 6207 -7113 42958 -54311 3754 43819 -37307 19561 -21429 1272 47775 -58521
291 -58521 9067 31398 -27005 18600 -23692 3236 35893 -37918 -469 18329 -5042 2478
303 2478 -16706 8646 14251 -13365 -5520 1860 13680 -5756 -16251 14419 2788 -5843 -45
316 -45 -6726 11734 3616 -19226 8698 11614 -14252 4730 901 -7059 17656 -15399 -6360 25828
330 25828 -21902 3811 12374 -21249 22327 -9157 -12096 25953 -21475 6951 8057 -16446 19038
343 19038 -14485 5004 9380 -21085 23814 -14626 -91 17966 -33452 34152 -8901 -26286
355 -26286 44294 -36291 13598 16717 -46810 53013 -20926 -24540 46185 -41609 25894 727
367 727 -37760 55047 -33154 -3168 22226 -33404 45114 -34427 -10235 48473 -49953 32164
379C2164m6489p361Q8965j38960Q9720K0161r6765J17347j04643M0150P8174j58901
391h6438J22673k1073n4769J00610j30438R3539K3886j21432J22042p4529L1744
402E815L8923j33478J52199n7706n1334J02261j27210J26030l2313j20973J88320
413I0534j21426J8627O1518j43300J82846r0530p9096J65938j36757Q2163j6937
424A3580r9891J91670j42180L406Q5012j15403J46392j22333k0064J69082j81500
435g2229R6374j7675p1709J87563k08085O0739J16491j77290J56026j12123l601
446d5519J75439k38904J22275L3773j13377J58922j80042Q4671J03067k05351
456a05046J56194o9979L40J11946k20552J78994j655j34892J65923j63689J15457
$$ plain form
379 32164 -14325 -21686 67279 -71681 18039 38200 -58565 58782 -45861 -5711 72463 -86438
391 -86438 36235 15162 -39607 61003 -69435 24104 47990 -73442 48600 -25929 5815
402 5815 44738 -88740 63459 5753 -45581 56680 -70530 55500 23187 -97786 90534
413 90534 -30892 -12265 49253 -94047 88799 -1731 -80827 85111 -51646 30517 13580
424 13580 -86311 105359 -36821 -33415 51597 -63806 82586 -39747 -59811 109271 -72229
435 -72229 24145 6470 -65239 122324 -85761 -25022 91469 -85821 70205 -41918 -45519
446 -45519 129920 -108984 13291 47064 -66313 92609 -87433 -2762 100305 -105046
456 -105046 51148 -18831 -18491 93455 -127097 51897 50242 -84650 81273 -82416 33041
467C3041M7542k25077K32559q6018m7979J26461j98971J97396l5198j66709K19973
478I7020j43270O1654L3988j79600K47725j24089o8296J55741j61775J60201q1613
489b314j08066K42727j90538N5016M0237j36771K40985k03680j4750K09411k27439
500i5182J50402n9329r2622K55943k45130M6841J22188j56094J59405j56088L3635
511c6031J65413k36288J42902l9048m1235J76839k74222J54321R8943k28589J92287
522G5292j28244L7219J44243k76249J87076J1451j10366J38262j95191J71678
532E5171L2760k35097K31781j08000J3108R8339k43862K43325l1506j63758J79653
543G1914j36981J24682k4154j76278K61137j44417j597Q4556j89127K67177j35982
$$ plain form
467 33041 80583 -144494 88065 2047 -45932 80529 -118442 78954 43756 -122953 97020
478 97020 -46250 15404 49392 -130208 117517 -6572 -74868 80873 -80902 79299 -2314
489 -2314 -110380 132347 -58191 -3175 37062 -99709 141276 -62404 -77154 132257 -95182
500 -95182 55220 -4109 -96731 159212 -85918 -39077 83111 -72983 86422 -69666 -36031
511 -36031 129382 -106906 35996 -3052 -44287 132552 -141670 12651 111594 -116995 75292
522 75292 -52952 -15733 128510 -147739 39337 50788 -59578 78684 -116507 55171
532 55171 87931 -147166 84615 -23385 -10277 88062 -155800 87525 56019 -107739 71914
543 71914 -65067 59615 35461 -140817 120320 -24097 -25694 58862 -130265 136912 930
554I30j42799K79050j93846P0874K0631j58028K60506j62373m8736J45178j33103
565f1716J53081j40721l4402K35791k37454Q8702K8145j16290K25888k22986J9046
576f2916J89412k05050J20490p3905q629J76478k54585J27414N1069j34466J79205
587A04517k04722Q5198J56980k75715J67529j0500o7570J36811k02494J36348
597B6382M4442j51615J37339j24268J08941L1481k27444K52859q5562p9839J58446
608I1162k05797J77904N337k09865K25472r2402k038M9959j44481K05745j01935
619i39p5175J49806j40355J34875o5413j19437K48696j66968o167R3565j26135
630g3647J69321j27207m6578J83199j58050P7872l4491n4460J96514k12299M1378
$$ plain form
554 930 -141869 137181 -56665 14209 34840 -123188 137318 -25055 -73791 71387 -61716
565 -61716 91365 -49356 -83758 152033 -85421 3281 31426 -84864 141024 -81962 -62916
576 -62916 126496 -78554 41936 -31969 -40598 135880 -118705 8709 59778 -74688 104517
587 104517 -100205 -15007 141973 -133742 33787 23287 -44283 92528 -109966 26382
597 26382 70824 -80791 56548 -67720 41221 72702 -154742 98117 12555 -67284 91162
608 91162 -114635 63269 68606 -141259 84213 -8189 -10227 39732 -104749 100996 -939
619 -939 -76114 73692 -66663 68212 2799 -116638 132058 -34910 -41077 52488 -73647
630 -73647 95674 -31533 -78111 105088 -52962 24910 -9581 -64041 132473 -79826 -38448
641c8448J24744j54850J34131j08135r170J76782k03136O8632L9327o0573J08363
652G7667j67568R1993Q3441j63759J20459q0105L5312J00352k21523J53532K8709
663E8510j20732J17893j26244R4549N4887j87811J49336k9609k4161O0307j43776
674i6851J54901j3603j26335J27302p6669O1466k2j30051J72499o2835m8333O9627
686C1096r0187J30445o8853q9432J64735r9711K4753J1931q7380J63641j05033
697a3995n0256J23233q8531O3393m7678m2764J42264j15150O729M3146m7876R1556
709F4071j11850J6181J04724j14674N6344k8470q322J00321j43019N3353O2194
720E0853q7103P0609p3128L0786P8767j32981O5831J6905l5858N2133r1540O6375
$$ plain form
641 -38448 86296 -68554 65577 -42558 -51728 125054 -78082 -9450 29877 -30696 77667
652 77667 -89901 2092 85533 -78226 42233 -37872 -2560 97792 -123731 29801 58510
663 58510 -62222 55671 -70573 23976 78863 -108948 40388 10779 -13382 46925 -96851
674 -96851 58050 44447 -81888 45414 -31255 30211 30189 -99862 72637 9802 -38531 31096
686 31096 -59091 71354 2501 -86931 77804 -21907 2846 14777 -72603 91038 -13995
697 -13995 -64251 58982 -29549 33844 -13834 -56598 85666 -29484 -22755 20391 -27485 64071
709 64071 -47779 -31598 73126 -41548 14796 -13674 -21996 78325 -64694 -11341 50853
720 50853 -36250 34359 -38769 -7983 70784 -62197 3634 20539 -15319 36814 -54726 11649
732A1649L5883r4044O0487k6136K4449J8144r4467R3939p971m9748M7441n6585
744c6959O9579r271q6623R8559l0384j3902K3949n9772Q5766k7316o1053P2462
756B5035k9870J7568j3396l8287Q1080m2313k1747L0554k1237M6336n0493j3395
768c0165P0217n1004R991l019j3043O0682o5973j200N4687m1183J8621k1432l86
781a3207N1965n6868K257L0056j3986J1576l3171J8084K9983l8746O225J735J3383
794I286N914m3320L1952J4028k6296J0007j5426K4201P985m5009K8030J2928j7800
807c520M145j3621K0084Q672l1770R933J6388n309r936m466J5272L401j4497m373
821i597J3415P625j7345m114J5885R90r718m070O438R700p830j4408J5301R703
$$ plain form
732 11649 47532 -46512 13975 -12161 12288 30432 -64035 29904 21933 -27815 19626 -36959
744 -36959 32620 23349 -63274 35285 4901 -9001 14948 -44824 40942 13626 -47427 25035
756 25035 -4835 12733 -663 -38950 42130 -183 -21930 8624 -12613 33723 -16770 -30165
768 -30165 40052 -10952 -961 -3980 -17023 43659 -22314 -23514 31173 -10010 8611 -12821 -13207
781 -13207 38758 -18110 -15853 14203 217 11793 -21378 -3294 26689 -12057 -5832 -4097 9286
794 9286 15200 -28120 3832 17860 -8436 1571 -13855 10346 18331 -26678 1352 14280 -3520
807 -3520 625 -12996 7088 15760 -16010 -6077 10311 5002 -4934 -9400 5872 9273 -5224 -9597
821 -9597 3818 11443 -5902 -10016 5869 6859 -2859 -6929 -491 9209 1379 -13029 2272 11975
835A1975j9062L820L943j12R537k2940Q418K1935k7066P478M753p389J8016k3958
849a0652M453K1339k2403P987k860P33J3163k3894J3763L347r518J3227k2453
862a3768K0328L673k8438L2115j9467J619K1062m0431L5692m038k9023M0982l2285
875a1979J0840J7516l9858L9398j5950j2572L0692l5114K6071m693k1000L7498
887B0849l6135J7796R581l4687M5465l4204K800L4400n5073M4819r960k9457N4736
900C0930n3743K2732K3958n6336N4631k6148j0106M1395n6188M1613k645l3745
912b3652M8451m4551K6318R088m8435O1988l9414O65L5208o1676O3512k4464l5946
925c2908P2290o4760L0133J5083o0736P9864m8121j3148N6155o4191N0857j8594
$$ plain form
835 11975 -7087 -3267 676 564 10101 -12839 -4421 17514 -9552 -2074 2679 -4710 13306 -10652
849 -10652 -6199 15140 -7263 724 -2136 -1403 11760 -12134 1629 4976 -4542 8685 -13768
862 -13768 6560 10233 -18205 13910 -5557 -3938 17124 -23307 12385 8347 -20676 20306 -11979
875 -11979 -1139 16377 -23481 15917 -33 -12605 18087 -17027 9044 4351 -16649 20849
887 20849 -15286 2510 12091 -22596 22869 -11335 -8535 25865 -29208 15611 5651 -23806 30930
900 30930 -22813 -81 23877 -32459 22172 -3976 -14082 27313 -28875 12738 10093 -23652
912 -23652 24799 -19752 6566 15654 -32781 29207 -10207 -9542 25666 -36010 27502 3038 -32908
925 -32908 39382 -25378 4755 19838 -40898 38966 -9155 -22303 33852 -30339 20518 1924
937A924l2479P1333o4274K3637J5538m5294O8027o0828Q937N1544p4474N9650
949B3241k7672k0707P4838q9724M2279K6056o5698P3734n9292J1268N7449r1628
961d5856O3530j0296l0690O2983q1146N1950J9000p1858P3671n0233J8334L5385
973C4774q9235Q6569k4605l6463O5439p8414O6623k811p8177J01839o0012O407
985h066L8904q5148R8053l8237m9749Q7130p1398M5510n510o1454J02878o8258
997a5345j407M2916o4104Q3758o0783k3082R4795r0995M5666m229m8135J04624
1009F3679r7101J0999O8240q3734P0841n0241j1616R4014j10202M5355K0749n1031
1021c0048P8372q9986L2590O1073r6836O6186l3781L379O0661j13518Q0298P649
$$ plain form
937 1924 -30555 40778 -23496 141 15679 -29615 38412 -22416 -13479 38065 -36409 23241
949 23241 -4431 -25138 49700 -40024 2255 28311 -37387 36347 -22945 -11677 45772 -45856
961 -45856 17674 7378 -23312 39671 -41475 10475 29475 -42383 31288 -18945 -611 34774
973 34774 -54461 32108 7503 -28960 36479 -41935 24688 21877 -56300 45539 -14473 -8066
985 -8066 30838 -54310 43743 5506 -44243 42887 -28511 16999 11489 -49965 52913 -15345
997 -15345 -16752 26164 -37940 45818 -14965 -38047 56748 -34247 11419 7190 -40945 63679
1009 63679 -33422 -22423 45817 -37917 32924 -17317 -28933 65081 -45121 234 20983 -30048
1021 -30048 48324 -41662 -9072 52001 -44835 21351 -12430 -9051 51610 -61908 18390 26039
1033B6039o3337P9660q8542N6805M1061j23007J04131k6285k9223O4896r8467
1044e6269Q0965O553q1403Q1538n2708L5739Q464q5680J12637n1117k6364O3297
1056C5652q3780Q8472k8226p4073J16293p0361J1559K3238o7238J04392o8686
1067a2758k3646Q1462q0203O5811l5050m4465J19364j01482J3069N0833o9586
1078c6651Q0465o5858o887Q3091q8186M6660j8412j4214P9170j13992N6303L9374
1090D0863q5958Q5770o9751J4140P9574j24049O8594J3784m8962O2624q0976N5564
1102A1217K7901q8493P6173m1092J6009L6035j03393R9009j0304o4306P3066o3966
1114c2144N2852N156q6307R9346l9501j0182L1605p0812R8925m2856n9381R8942
$$ plain form
1033 26039 -37298 42362 -46180 10625 51686 -71321 32810 6525 -22698 42198 -56269
1044 -56269 24696 31249 -50154 31384 -21324 14415 22879 -62801 49836 -1281 -27645 35652
1056 35652 -48128 40344 12118 -61955 54338 -16023 -4464 18774 -48464 55928 -12758
1067 -12758 -36404 45058 -35145 30666 -4384 -48849 70515 -30967 -17898 32935 -36651
1078 -36651 43814 -22044 -28931 54160 -34026 12634 -5778 -19992 59178 -54814 1489 40863
1090 40863 -45095 40675 -29076 -14936 64638 -59411 9183 22967 -25995 36629 -44347 11217
1102 11217 39118 -49375 26798 -14294 1715 37750 -65643 33366 23062 -41244 31822 -32144
1114 -32144 20708 25864 -60443 38903 -598 -10780 20825 -49987 48938 6082 -53299 45643
1126D5643o6776L1987L058o8649J08420n6024l0213N7468m7541N7817m9567k2287
1138c6664Q9482p6959K7550l16l5437R3833r4696M419P8954p9989M8941l0947
1150a1829j3953Q4790r4519K3859L5130m1251N0948o9745K9333N7245q8933M7465
1162H540j0406n825M8733q9890N4018K8603o2006M6159m3403L5894K5629q9258
1174e3212P2921q543k5572L9920o9293O6341P298p7786O9711k5315O000J5359
1186A7829o2512P4402j7249l8958M1615l4948M6392k3752m4634P9219m3330n17
1198f443J5422l9425P1466m8078k7317O8217m7196K2890j2150k5924P2531n8163
1210a4170o066M0444l3424L5536l8501l217N7890n5652J2950N990r395L8140n8969
$$ plain form
1126 45643 -21133 10854 13912 -54737 53683 -2341 -32554 24914 -22627 35190 -14377 -36664
1138 -36664 52818 -24141 3409 3093 -32344 61489 -33207 -28788 50166 -29823 19118 -11829
1150 -11829 -25782 59008 -35511 -11652 23478 -17773 33175 -36570 -7237 50008 -38925 8540
1162 8540 -1866 -7691 41042 -48848 5170 33773 -28233 17926 -25477 10417 36046 -53212
1174 -53212 19709 11166 -14406 25514 -43779 22562 29860 -47926 21785 -3530 2470 17829
1186 17829 -44683 29719 12470 -26488 15127 -19821 26571 2819 -41815 37404 -5926 -6443
1198 -6443 8979 -30446 41020 -7058 -34375 33842 -13354 9536 -2614 -28538 43993 -14170
1210 -14170 -20236 20208 -13216 22320 -16181 -19398 38492 -17160 -4210 1780 -7615 30525 -28444
1223b8444K1278L5406m5290K7035k5131J3765L5464o8380L5460J6230k9131K7595
1235A5857m0907K9965K4338n8959L3770K47l493J2478m3065M2478M833l6201K3645
1248D986j4838K4824o398m0112M9812j1789j3930J1954k4039M2751j7672l4191
1260b8642M5080j5630J347j731k1319M4743k0900k2557K7291q712J2342j8357
1272g045r418L7351k1606o809N246k34K1941l2727J270K9436k0649M694j0049
1285h599M644K6464l6134L570K2231j2963N349j6094Q940K1434k7640P05J1764
1298C671J623n30j8719J4829J1339j5798j117k05J4647l662k1450J7762N713q647
1312e44j593o703J7868q47k1578J2540Q317n655m675m458J2833K760j5850J441
$$ plain form
1223 -28444 -7166 28240 -17050 9985 -15146 -1381 34083 -34297 1163 17393 -11738 15857
1235 15857 -25050 4915 29253 -29706 4064 4311 818 13296 -29769 12709 17542 -18659 4986
1248 4986 -9852 14972 8574 -31538 18274 6485 -7445 4509 -19530 23221 5549 -28642
1260 -28642 16438 808 2155 424 -20895 23848 2948 -19609 7682 -1030 11312 -7045
1272 -7045 -16463 20888 -718 -7527 -2281 -2515 19426 -13301 -12031 17405 -3244 1450 -8599
1285 -8599 -3955 22509 -13625 -10055 12176 -787 4562 -11532 -2592 18842 -8798 -8093 3671
1298 3671 5294 4764 -13955 874 12213 -3585 -4702 -4907 9740 6078 -15372 2390 8103 -544
1312 -544 -2137 -8840 9028 8181 -13397 -857 7460 1805 -2870 -7328 5505 8265 -7585 -6144
1326f144J2886j331j0682L7Q566L148q848o202J2522L976j2436j498Q443L905
1340F342p898n224P869N265n590r404R014Q918j3223J17L965J691M854j6347O798
1355b853J4579j6798K951J737j14R393j7663N270J2779j2144K524l829O195N679
1369G706j6741R598K151k498L268j4200J7319m43j6786J6777r781N643N033k2129
1383a5083K4262m580j4667J8240j5367J1542J782k0205K3756r427m293R421j4795
1396i414J9000r917q673J9163j7416J2460m385j2238K7212k3830M685J3524k3441
1409a3270K5772j5821p530K8608l0279J4668M502k0085K8614k2976K711J8300
1421A3214k6416K1711j0137n893K1935k7869J8488l62j6820K7451k6828J1797
$$ plain form
1326 -6144 6742 5411 -5271 -5234 3332 6480 -2368 -8570 3952 7928 -4508 -6006 2437 6342
1340 6342 -1556 -6780 1089 6354 764 -8640 374 9292 -3931 -3814 151 1842 6696 -9651 -2853
1355 -2853 11726 -5072 -2121 -384 -498 8895 -8768 -3498 9281 -2863 -339 -4168 2027 7706
1369 7706 -9035 563 2714 216 3484 -10716 6603 6160 -10626 6151 -3630 2013 7046 -15083
1383 -15083 9179 4599 -10068 8172 -7195 4347 6129 -14076 9680 253 -4040 5381 -9414
1396 -9414 9586 -331 -9004 10159 -7257 5203 818 -11420 15792 -8038 -3353 10171 -13270
1409 -13270 12502 -3319 -10849 17759 -12520 2148 6650 -13435 15179 -7797 -5086 13214
1421 13214 -13202 8509 -1628 -7521 14414 -13455 5033 4671 -12149 15302 -11526 271
1433B71J2030l0641L2856j7921o619K8684l6257K4386Q05k5448L6414k8068N412
1446d096J8741l2102L0037j4470q235K7274l2292K1806k771j7402L2423l3358
1458a4445J5105J2977l3193L6562k4083j377L0607m4493L1012j026k5132L8103
1470B0617l5758J4708J7938l9617L6030j6577m866K5457l9421L1907l443k3639
1482a6664L4126l2342K0294P120l7710M4846k3743m407K6019m1073L9680j0608
1494E538k8500M5397l4982J4887R084l6728M8431k6855r877L1720l6087L2644
1506A4672j4337k0862M5864l8339J3104P917k7013M4226l7822J852L3202m2312
1518a9848L4310j8504j2406M7798n3279K0789J6911l6011M2350l5596M013L6734
$$ plain form
1433 271 12301 -18340 14516 -3405 -10024 18660 -17597 6789 7594 -17854 18560 -9508 -4096
1446 -4096 14645 -17457 12580 -1890 -10125 17149 -15143 6663 3892 -13510 18913 -14445
1458 -14445 660 13637 -19556 17006 -7077 -8454 22153 -22340 8672 7646 -17486 20617
1470 20617 -15141 -433 17505 -22112 13918 -2659 -7525 17932 -21489 10418 6975 -16664
1482 -16664 17462 -14880 5414 12534 -25176 19670 -4073 -8480 17539 -23534 16146 5538
1494 5538 -22962 22435 -12547 2340 11424 -25304 23127 -3728 -13605 18115 -17972 14672
1506 14672 335 -20527 25337 -13002 102 8019 -18994 25232 -12590 -10738 22464 -19848
1518 -19848 14462 -4042 -16448 31350 -21929 -1140 15771 -20240 22110 -13486 -9473 27261
1530B7261m9740K9780n075j3101L3923m6071K6912J1897l5589L7071l1208J4039
1542I9K2456n2752M4751r638j9269L5269m4887L3974O108m4644M8289k6522L797
1555b969K0323m6516M8762j3782k6816M0290l4594K5043k048l3988N0474l0433
1567f254L13J7264l2567M6209l1302j3877M7794m5229K5221l024k8847N6510m4889
1580a2678j324L5195l7868L1886k2426p758M3776m6725J8485N190j8567L8296
1592B5482m7092J6231L0967m6819L2075j6842j378L4830n4308K9665J1704k8939
1604a4424L0998l7007K4751J9811n4479M2528j0062r513K7287m8316L8885P687
1616A8146m1395L4530j9480J5330M257m0053M7566j6502j1415K0485l4478M5133
$$ plain form
1530 27261 -22479 7301 2226 -10875 23048 -23023 3889 15786 -19803 17268 -13940 99
1542 99 22555 -30197 14554 4916 -14353 20916 -23971 10003 16111 -28533 19756 -6766 -2969
1555 -2969 17354 -29162 19600 5818 -20998 19292 -15302 9741 7693 -26295 24179 -6254
1567 -6254 -5941 11323 -21244 24965 -6337 -20214 27580 -17649 7572 4548 -24299 32211 -12678
1580 -12678 -14002 21193 -16675 15211 -7215 -14973 28803 -17922 563 5753 -12814 25482
1592 25482 -21610 -5379 25588 -21231 10844 -5998 -7376 27454 -26854 2811 14515 -14424
1604 -14424 16574 -20433 4318 24129 -30350 12178 2116 -7397 19890 -28426 10459 18146
1616 18146 -23249 11281 -8199 7131 11388 -28665 18901 2399 -9016 11469 -23009 22124
1628B2124j6221l6143N3812k9553N616R150l4570N0922k3945k1519L5560k4896
1640i663K2877j6384j8302M9048l5867J712J3707k1116L7800l4960n418M0972
1652B4406l5512J5382q233o801L8496m6422J2259K2246k8197K7747k9935P143
1664g421L6142m9746K0714P530j4843K4876l6850J9053J9970l4515K0459j2670
1676g301J0923J2472m1750L5041o20j8953K1279k9313K8744M216m0828L8143j0410
1689A643m431J2116l0810L6753o503k8058K9467j5254J2299l628k4662L9207j6272
1702A867j1685J5068j4658K5583j9576j4019L5221k1936M739j742j0823L4615
1714B2654l1233m395K7567k1044J4404j4653m326L3649l1861J594J3952r675J5504
$$ plain form
1628 22124 5903 -30240 23572 -5981 -365 8785 -25785 25137 1192 -20327 15233 -9663
1640 -9663 13214 -3170 -21472 27576 -8291 -6579 7128 -13988 23812 -11148 -16566 24406
1652 24406 -11106 4276 -3957 -10758 27738 -18684 -6425 15821 -12376 15371 -14564 -7421
1664 -7421 28721 -21025 -311 7219 -7624 17252 -19598 -545 19425 -15090 5369 -7301
1676 -7301 3622 16094 -25656 9385 8765 -10188 11091 -18222 10522 14738 -26090 12053 1643
1689 1643 -2788 9328 -21482 15271 8768 -19290 10177 -5077 7222 3594 -21068 18139 1867
1702 1867 -9818 5250 -9408 16175 -3401 -17420 17801 -4135 604 -1138 -11961 22654
1714 22654 -8579 -12974 14593 -6451 7953 -6700 -11026 22623 -9238 -7644 6308 -3367 12137
1727A2137k5039P327K3078k5598P658l761N397J3858l2942J7614J1817j7539J0876
1740D883j6726J6124J1334l3855J9956M411p635P316k1002K1545O350k6308J4458
1753H51n53M874j475j9411K3835p49j3714N801n209J7363j0154j6693K4022o152
1767B636k901j158q332K4153j3466j4119J9543n279K877p385o165K2610j2000
1780A014r557R384O01O098j4229k26J6959r626l346j768O046R321j9491L765J2585
1795G530p264O51q246P675J1238j9009K187J0054k579n83r432P766R465j2938
1809c485k120O405M723m208r213Q509N626o192m717J462J0567n106j0448Q582
1823C85M280l086n041j357J0959j987j1224N135P060k743n782n59P334J857r455
$$ plain form
1727 12137 -12902 -5575 17503 -8095 -437 -4198 1199 15057 -17885 -271 11546 -5993 4883
1740 4883 -11843 4281 15615 -18240 1716 6127 -1508 5808 -15194 6351 12701 -13607 851
1753 851 298 5172 3697 -15714 8121 7372 -6342 -541 -5750 11613 1459 -15234 8788 2636
1767 2636 -265 -1423 -9755 14398 932 -13187 6356 1077 3954 -3431 -9596 13014 1014
1780 1014 -8543 841 1442 7540 -6689 -6915 10044 418 -2928 -4696 1350 10671 -8820 -5055 7530
1795 7530 266 917 -7329 346 11584 -7425 -5238 4816 2237 1654 -7778 -12 9453 -3485
1809 -3485 -5605 800 5523 1315 -7898 611 6237 45 -4672 -3210 7357 2251 -8197 385
1823 385 4665 1579 -3462 -4819 6140 4153 -7071 -1936 5124 2381 -3401 -3960 3374 5231 -4224
1838d224j013J0461j547p533Q81M485L675o794m900R973J320p367j561N003M607
1853E466o864l570O037K972k833p532O206P098r664m1K345K216L080j2252N759
1868a577R352j0747J602j61K575M971j2945N136P510o710M47l658P108K068j1448
1883f477O813R11N00m32r355J3733k175r901R375n896O650q75j3053J6954m515
1898B257o946P904q271J0518l465j0747J4718o060l22J115o396J3746r615l424
1912d988R868q560Q850p576l792J6699j5803M120M874r901J5242j3767n51J5588
1926A0303j7063Q855j336o270J5366j6624N046Q142j2468J1577r772K556J0145
1939H457j7265J2634l246m782J2728j8059J2445L072j5923J8305j2812K562J1136
$$ plain form
1838 -4224 -5237 5224 3677 -3856 -2975 1510 5185 -1609 -6509 3464 4784 -2583 -4144 859 5466
1853 5466 -1398 -4968 1069 4041 1208 -6324 -118 6980 -2684 -2725 -380 1836 4916 -7336 -1577
1868 -1577 7775 -2972 -1370 -1531 1044 6015 -6930 -1794 5716 -994 -547 -4205 2903 4971 -6477
1883 -6477 336 1247 1747 1315 -8040 5693 3518 -6383 2992 -2904 3746 2871 -10182 6772 2257
1898 2257 -4689 3215 -5056 5462 1997 -8750 5968 -92 -414 701 -5695 8051 -1564 -4988
1912 -4988 4880 -3680 5170 -2406 -6198 10501 -5302 -1182 3692 -6209 9033 -4734 -5285 10303
1926 10303 -6760 2095 759 -5511 9855 -6769 -1723 6419 -6049 5528 -4244 -1688 8457
1939 8457 -8808 3826 580 -4202 8526 -9533 2912 5984 -9939 8366 -4446 -1884 9252
1952I252k1154J8038l610j0562J7313j6724R223M085j6088J8415j0919J18R670
1965G057j6473J6461p321o297J6373j8440J2291K67j4322K1956j7486L038J2918
1978A0022k1776J9468p357q727K0443k1149J0635M672j6452J9846j4408K436J1105
1991H758j9493J7970p940n032J6103k0944J5599q35j5167K2708j8696N981J0248
2004I260k2766K3484j0412q050K0613k2355J4293Q76j6915K3873j7105K386J1195
2017H377j9312K0083j1000n386J8792k1220J4100k008j2310K3227k1908P045J1014
2030I494k1592K2227j3674l353K1218k6776J6006J471j5403K2843k1181P223J2501
2043A1004k3508K0135r410k849J5949k4015J7929o92j3930J9689j9614J2391N272
$$ plain form
1952 9252 -11902 6136 2526 -8036 9277 -7447 1776 5861 -10227 8188 -2731 -2613 7057
1965 7057 -9416 7045 -276 -6573 9800 -8640 3651 3918 -10404 11552 -5934 -2896 10022
1978 10022 -11754 7714 357 -8370 12073 -9076 1559 6231 -10221 9625 -4783 -2347 8758
1991 8758 -10735 7235 -705 -5737 10366 -10578 5021 4186 -10981 11727 -6969 -988 9260
2004 9260 -13506 9978 -434 -8484 12129 -10226 4067 4943 -11972 11901 -5204 -2818 8377
2017 8377 -10935 9148 -1852 -7238 11554 -9666 4434 2426 -9884 13343 -8565 -1520 9494
2030 9494 -12098 10129 -3545 -6898 14320 -12456 3550 5021 -10382 12461 -8720 -1497 11004
2043 11004 -12504 7631 -1779 -4628 11321 -12694 5235 4543 -9387 10302 -9312 3079 8351
2056H351k3321K6065j3123k995J5933k5061K2855l899j8607K5950j8196O736O316
2069G004k1201K6022j2431o986J6494j8358J8025q284j2345K6156k0541O223M915
2082D693j6222K6012j9677l258K1141k1940J5756p871q773K7077k6386O498J1011
2095H061j7334K0832j8683O47K1592k5277J2437j856n460J8092k5432J2660Q720
2108H999j7974J7406j7067Q565J4062l0234K1559j458j0661J7713k3917J6082
2120C075Q105k4843J9973q495K177Q373k3279K2991l575j3005J5794j6186J5686
2133F791j204k0762K5805j1496j666P923j7482K3944j0961j2531K2162j6524J0411
2146D410k364j5375K8289j7858m603J5542j5347J5829j0813p440K2588j7901M551
$$ plain form
2056 8351 -14970 11095 -2028 -5023 10910 -14151 8704 4805 -13802 12148 -6048 688 7004
2069 7004 -14197 11825 -606 -7592 8902 -9456 8569 285 -12060 14096 -6445 -222 4693
2082 4693 -11529 14483 -5194 -8452 12689 -9251 6505 -1366 -10139 16938 -9448 -2950 8061
2095 8061 -9273 11559 -7124 -6477 15115 -10162 2275 419 -5041 13051 -12381 279 8999
2108 8999 -8975 8431 -8636 -71 13991 -16243 5316 3858 -6803 10910 -13007 3075
2120 3075 11180 -13663 6310 -2185 -8 8365 -14914 8077 4502 -8503 7291 -8895 6791
2133 6791 5587 -15175 10630 -866 -2532 5391 -12091 11853 892 -11639 10523 -6001 4410
2146 4410 2046 -13329 14960 -2898 -7501 8041 -7306 8523 -2290 -9730 12858 -5043 -492
2159d92J280o405J8290k1470M817J4203j7872J3902j1253M09J9577k6610J0807
2172h17P480j2739J4421j7161P520J3660k2865J2561j555j962J0019k0762J5113
2185B913N073j5776J1752r386R040L537k0525J9303l099o166P621j4422J8453
2198H318l490j7504J9864q322K196K153j5062K1961p343j1810J3609p591Q902
2211E881o455r474J9912j0151k403K930m874J5486j5251l383J6640j1519N238
2224B577n735k388J8518j8611j2J1531q233P831j1351J499J5923j6443J966L969
2238A041j169P069j5257O552R968j1660L685m478O484N529j7644J0375M244o355
2252a616M037j0172J1356M002j6798R996J075q53J509j1255J2799J847j1827N590
$$ plain form
2159 -492 788 -5617 12673 -8797 -3980 10223 -7649 6253 -5000 -4591 14986 -11624 -817
2172 -817 6663 -6076 8345 -8816 -1296 12364 -10501 2060 505 -1457 8562 -12200 2913
2185 2913 7986 -7790 3962 -5424 3616 7153 -13372 5931 2832 -3334 4287 -10135 8318
2198 8318 4828 -12676 7188 -1134 1062 3215 -11847 10114 2771 -9039 4570 -3021 5881
2211 5881 -574 -10048 9864 -287 -2690 240 -4634 10852 -4399 -7782 8858 -2661 2577
2224 2577 -3158 -5546 12972 -5639 -5651 5880 -2353 5478 -5873 -4374 11549 -4894 -2928 1041
2238 1041 -128 6941 -8316 -1764 8204 -3456 229 -4249 2235 7764 -9880 495 4739 -1616
2252 -1616 2421 -7751 3605 7607 -9191 805 1880 1027 2536 -8719 4080 5927 -5900 -310
2266c10n40N332l420r336J2579j127m976K55j957J0982p682p313J1660l021J51
2281A277l438k886J3329q300o410Q972j580J840n671j865J1544o057n023L579
2295f89K434K468q416J013Q056l831k562k106N334M042j0699K324O273k454r52
2310B35n009N595N470j0069M10N673Lj887m999M696N135o506k779M428L535l684
2326B47m651M414L775l130m291K016O160l415n647M042L746k001m030K84N983
2341C502p88o862K272N629k339l675m9L972K241o804p61P384j674m066k31K805
2357E56L596n755k500O410M82l646k450L757L774n654j451L241K295j127o418
2372d890N168M347o627O77K58K850J600q971N331M842o149R76j547L944J979q827
$$ plain form
2266 -310 -850 4482 1062 -8274 4305 3178 -1798 -1543 -3500 7482 -200 -7513 4147 1126 1277
2281 1277 -2161 -5047 8282 -18 -6428 2544 964 2804 -2867 -4732 6812 755 -4268 -689
2295 -689 1745 4213 -4203 -3190 4866 1035 -1527 -3633 1701 5743 -4956 -2632 3641 1187 235
2310 235 -4774 821 6291 -3778 -3368 2305 2308 421 -4578 118 5253 -1253 -4032 396 3931 247
2326 247 -4404 10 3785 655 -3636 -1620 4540 1125 -4522 -480 3266 1265 -2765 -2481 3502
2341 3502 2714 -4148 -1876 3753 1414 -2261 -2310 1662 3903 -2901 -3662 3722 2048 -2018 -2249 556
2357 556 4152 -1603 -4103 2307 2789 -857 -3307 450 4224 -1430 -2881 360 2655 1528 -4890
2372 -4890 278 4625 -2002 -1325 -1067 1783 3383 -5588 -257 4585 -1564 -588 -2135 1809 3788 -5039
2388e039M634L297k654o23l358O786l25o801M397k99K474k316n876J0122k778
2403A641m925M500l672O363l230p060J1039l834k573K495m124Q270m934m919Q464
2418C501l779J408k455j810R067q044n7M108l780O245p961P86R384j0474M172
2433C11J73l086Q872j1012K921P376r306N778l715K28P426j1289N555K388m904
2448b284N738q048N694L442j0139Q388l840N52M980j1546J0571p89p938R755q394
2463c858N196K808j1819J2453m244l759P369r384Q843j908p587J0970p463L035
2477F52J303p702J1933q007j148P691r807R618n044m966J3253j2279M416L597
2491C510r559J2658r152j262J0675j2179P734j776n131J1304j1401M343L850q515
$$ plain form
2388 -5039 -405 2892 238 -385 -3743 3043 2718 -4083 314 15 2489 173 -5703 4419 1641
2403 1641 -3284 1216 -2456 3907 677 -6383 4656 822 -1751 744 -3380 4890 -44 -4963 3501
2418 3501 -278 1130 -1325 -3135 5932 -2112 -2169 1939 -1841 4404 -3557 -2771 6613 -3861 311
2433 311 484 -2602 6270 -4742 -1821 5555 -3751 2027 -1688 -1460 5966 -5323 232 2620 -2284
2448 -2284 3454 -4594 1100 4542 -5597 2791 -1049 -497 4483 -7063 3508 2719 -5219 4536 -3858
2463 -3858 1338 4146 -7673 4780 536 -3223 4146 -5238 3605 1697 -5890 5080 -2383 652
2477 652 1955 -5747 6186 -1821 -2969 4722 -5085 4533 -511 -5477 7776 -4503 -87 3510
2491 3510 -6049 6609 -2543 -3805 6870 -5309 2425 649 -4482 6822 -4579 -236 3614 -4901
2505d901J0142q663J976P513j2718J0466l783m084J1266j3667P935K976j1630
2518g172J3477r234P24Q915j4105J1109k420o360J1565j1663O361K418r780J1934
2532E769q773J820O357j1987J1754n582l447J1211j3722Q968Q46j0169J4078j1081
2546c958K394Q157j4388J2346m135n142J1621j3019P771K095j0199J2208q977
2559c226K593N709j2470J2405n207l540R790j2731J0366r76j0185J4568j0602
2572c506K944N710j3444J4659o182n660J2055j1967Q395p43r510J4515r864J131
2586a467N280r835J2409q159k732J1271j1980Q347k818o111J4610j3853L499O848
2600E309j1603J2410q619j876J2947j4667P172J032o720J1622j2290M271O867
$$ plain form
2505 -4901 5241 -3422 -1446 6067 -6651 3815 32 -4052 7214 -6453 1482 4458 -7172
2518 -7172 6305 -2929 -2205 6710 -7395 3714 1294 -5066 6499 -5164 1197 3615 -6165 5769
2532 5769 -3004 -1184 5173 -6814 4940 -642 -4089 7122 -6600 2368 3214 -6955 7123 -3958
2546 -3958 -1564 6593 -7795 4551 416 -4726 6895 -6124 1647 3742 -6457 5751 -3226
2559 -3226 -633 5076 -7394 5011 -196 -3736 6054 -6677 3689 2713 -7472 7096 -3506
2572 -3506 -562 5148 -8296 6363 181 -5479 6576 -5391 3004 2261 -7249 7266 -2598 -1467
2586 -1467 3813 -6022 6387 -1772 -4504 6767 -5213 3134 316 -5795 8815 -5038 -1539 5309
2600 5309 -6294 6116 -2503 -4379 8568 -6099 1073 2105 -4615 7007 -5283 -1012 5855
2613E855j1602R798o443P24Q641j4550J0080l3o972J0334j1828P340M263j3687
2627h080J2942n802j048P807j3905J2126p48r947J1886q695M614K588j1422J3121
2641E437n373k957O442q895J0591n169o173J2707j0088M634O27q471J4816j0438
2655b310k249J0687j0632Q092m072n112J3691j1597J696M840o798R529r474O61
2669c048R961j1176N731k231j418R313j3387N830M966q374P751q450M263P513
2683G244j4666Q958K11m004P227j1756Q209M479j2003Q087l044J765L190j1251
2697g354J0515l79n864N003o232Q603k060r598J1780m567K8J781q087J2687m976
2712A280p508J0087n418L938k081o774J2852o175l733N090l724P010o604l155
$$ plain form
2613 5855 -5747 4051 -2392 -1668 6973 -7577 2503 2470 -4502 5832 -5996 1344 5607 -8080
2627 -8080 4862 -940 -1988 5819 -8086 4040 3292 -6655 5231 -3464 1150 3738 -7684 5437
2641 5437 64 -2893 3549 -5346 5245 76 -6097 6610 -3478 1156 1783 -6688 8128 -2310
2655 -2310 -4559 6128 -4504 3588 -484 -5596 8095 -3502 -1806 3034 -3764 5765 -3709 -3048
2669 -3048 6913 -4263 1468 -763 -2181 7132 -6255 -425 4541 -3833 3918 -4532 -269 7244
2683 7244 -7422 1536 1747 -2257 4970 -6786 1423 5902 -6101 1986 -1058 707 3897 -7354
2697 -7354 3161 2782 -3082 1921 -4311 4292 2232 -7366 4414 -153 -125 1656 -6431 6256 1280
2712 1280 -6228 3859 -1559 2379 298 -6476 6376 201 -3532 1558 -2166 4844 -1760 -4915
2726d915J0420o433Q22j039j187R113j0352L81P359n782M222n819R74R544j1359
2741d051K231M077l280M774q189L095P190q801K306P3J364K927r078N591L210
2756C439m873J914m007O139J012r423P051L28j699J310o218Q253L21q655N903
2771G95l16R57o86n821Q111l49n624K403J5L897l762m024P277j512j933j089m2
2788a703O643o098k672O262j872N85l304k66P643n909k784M617k71J062m460K66
2804b261O463l920k778J646K506Q81n629J457M471j848k094j613M471J606o709
2819c351J854L548q01j301l275M302K916o333K42L661K82j761l024L229L276m326
2835h62k052L486K084k772k738K785K715k215l154J904L907k417l776K679K863
$$ plain form
2726 -4915 5505 -928 -106 -1145 -2332 6781 -3571 -3190 4169 -1613 2609 -3210 -2236 7308 -4051
2741 -4051 -1820 2257 -1023 3751 -4438 -1343 5847 -2954 -648 -575 789 3716 -5362 229 3439
2756 3439 -1434 480 -3527 2612 3624 -5799 1252 1580 -119 1191 -5027 3226 3547 -5108 795
2771 795 479 1436 750 -5071 3040 2691 -2933 -530 -515 3382 -380 -4404 2873 1361 -572 -1661 -1703
2788 -1703 4940 -1158 -3830 2432 560 1145 -2159 -2425 5218 -691 -3475 1142 871 1933 -2527 -2261
2804 -2261 4202 282 -2496 -850 1656 2537 -3092 -1635 2836 988 -1106 -2719 1752 3358 -3351
2819 -3351 -1497 2051 1250 -51 -3326 976 3892 -2441 -2199 1462 1744 -17 -3041 188 3464 -862
2835 -862 -2914 572 2656 -116 -2854 -69 2646 431 -2723 -819 3088 671 -3105 -426 2437
2850B437j719k716L91L894k03n160J701M189k020k298k82L015J715n361N3M998
2866B634j361k431q34K641K520m847q57M023M63k354k418L631K116m274l15J589
2882g4K272j246m934M850K049m254O41o52L439J2o445M828K213l350J42j535M293
2899B249p6n844L689J507n70j773k092N914j770l742K597m20L197l753l013P658
2915C758l341j880J563j832N579m641l238P420l325m04l10j264O090n329j625
2930b779M775k096J655l904R35N700o382J301J131q30L971p316K994N132o942
2945b655L395j785M97M948q768M046L540n202L456m013L041L199p776M733J50
2960H06r54J985o094O570l3n805N439l674L334M44p450Q965k612l439M855n655
$$ plain form
2850 2437 718 -1998 -1607 2287 2084 -3076 -1375 2814 794 -1504 -1786 1229 2944 -2417 -2364 2634
2866 2634 1273 -1158 -1992 649 3169 -1678 -2535 1488 1951 -403 -2821 810 2926 -1348 -1663 -74
2882 -74 2198 952 -3982 868 2917 -1337 -696 -1348 2091 2103 -4342 486 2699 -651 -509 -2044 2249
2899 2249 2173 -3671 18 1525 955 -818 -2910 3004 1234 -2508 89 -331 2866 -887 -3900 3758
2915 3758 417 -1463 100 -1732 3847 -794 -4032 3388 63 -341 -651 -1915 4175 -1154 -2779
2930 -2779 1996 -100 1555 -2349 -1414 4286 -2096 -795 336 -494 3477 -3839 -845 4287 -2655
2945 -2655 740 -1045 -548 4400 -4368 -322 3218 -1984 1472 -2541 500 3699 -4077 656 806
2960 806 -148 1837 -4257 2313 2280 -3525 1914 -1760 1574 2018 -5432 3533 921 -2518 2337 -3318
2976c318O195j414o569Q769l988k93K011n132P690m009l246O164m686L885k560
2991e01l059Q564p103J139K780m982P606o575q37Q163q508M320n29l655Q442q383
3007c118J637N248o931N718m054j91O345q491M671K07l169N925p671M509K628
3022C263p521P440m848P65N283r782P751o53n519Q052p547L712L100q641Q433
3037C288l613j586N480p753O624j318m734P582o749L667J150o640R046o068j07
3052a731N744q627P840k878m436R456q873L619K860p744R008n678p82O556q489
3067d155O261j568l641P502p916M285J545o479Q274o416J397M985r200Q323k934
3082B63l698Q390r145N196J866p947R438n934j34N788q725P480k213m099P822
$$ plain form
2976 -3318 2877 1463 -5106 3663 -325 -618 1393 -3739 3951 -58 -3304 2860 -1826 2059 -501
2991 -501 -3560 5004 -2099 -960 1820 -3162 4444 -2131 -2968 5195 -3313 1007 478 -3177 5265 -3118
3007 -3118 -1481 3767 -3164 2554 -1500 -1691 4654 -3837 834 1041 -2128 3797 -3874 635 3263
3022 3263 -4258 3182 -1666 -901 4382 -5400 2351 1698 -3821 4231 -3316 396 3496 -5145 3288
3037 3288 -325 -1911 3569 -4184 2440 1122 -3612 3970 -2779 888 2038 -4602 4444 -1624 -1731
3052 -1731 4013 -4614 3226 348 -4088 5368 -3505 114 2974 -4770 4238 -1440 -2222 4334 -4155
3067 -4155 2106 538 -3103 4399 -3517 768 2313 -4166 4108 -2308 -911 4074 -5126 3197 263
3082 263 -3435 4955 -4190 1006 2872 -5075 4363 -1571 -1705 4083 -4642 2838 625 -3474 4348
3097D348p630M264R63o120Q563o584J148M701q230Q118m013k704Q480r517N265
3112A052J319o975R307p111R22N975r126P181k326k998P271q391M835J315o045
3127c795P416o121K460L473q386Q221l539k034O432q816O982j33p234R427o279
3142a926J416L882q637Q859k991m132P163o678M916n81n802Q855n685N05K813
3157A977n745Q027n374k004P416p269M803j717l974R606q497J135M944o717O966
3172C577n149j536Q551q478K965J090l179O455p560K198M660o262M581l888J421
3187e54N161r307N670O89l754N510p545M736L669r024O475j788o89M102q148O338
3203A541J199n934M970l747L427Q60p161P454j892j873K578n041O994k374n261
$$ plain form
3097 4348 -3282 982 1945 -4175 4388 -2196 -1048 3653 -4577 3541 -472 -3176 5304 -4213 1052
3112 1052 2371 -4604 4703 -2408 -1486 4489 -4637 2544 218 -2780 4491 -3900 935 2250 -3795
3127 -3795 3621 -2500 -40 3433 -4953 3268 -271 -2305 4127 -4689 2293 2160 -5074 4353 -1926
3142 -1926 -510 3372 -5265 3594 603 -3529 3634 -3044 1872 1291 -4511 4344 -1341 -836 1977
3157 1977 -3768 4259 -1115 -3119 4297 -2972 1831 114 -3860 5746 -2751 -1616 3328 -3389 3577
3172 3577 -1572 -3108 5443 -3035 -70 1020 -2159 4296 -3264 -1066 3594 -2668 1913 -1975 -554
3187 -554 4607 -4700 970 1659 -2095 3415 -4130 606 4275 -4749 1726 -62 -751 3351 -4797 1541
3203 1541 2740 -3194 1776 -1971 1456 2316 -4845 2609 717 -1156 1422 -3619 3375 1001 -4260
3218d260P226m056K035k00n111Q822m468l054N366m102M243k695l643Q112m793
3233e78o64J854k269N239n317o97N592m215J941k368K81N650p381J865L238l452
3249a281L664n105J734N567p578K507J455j516L154n913K973L767n268J718q28
3264i50K074J111o008M424J124k369J014l206N066j89o002N035n16j50J86m332
3280c688O302p19n079L753n96J579j333l737N806p70l153R81J46L225l319k202
3296b804M627r99p06j723M43M843m689j473L887j012Q32l117J67N451m191j871
3312b335K746L30Q11l523L59M455k405k162P30K361N25m171J125K947q96j511
3328f14j603L569J132m815J242K344k27j017k496L177K087m330j50K628N83j415
$$ plain form
3218 -4260 2966 -1090 945 745 -4366 4456 -12 -3066 2300 -1802 2441 -254 -3897 4215 -578
3233 -578 -1242 612 -1657 3582 -1735 -2432 3160 -1055 886 -1482 -1201 4449 -2932 -1067 2171 -1281
3249 -1281 2383 -2722 -988 4579 -2999 -492 963 -553 2601 -3312 -339 3428 -1840 -122 -950
3264 -950 1124 2235 -3773 651 1775 -594 420 -2786 2280 2091 -3911 1124 608 458 644 -3688
3280 -3688 2614 1895 -3184 569 -27 1552 219 -3518 2288 1518 -1635 -654 -508 2717 -602 -2804
3296 -2804 1823 824 118 -1605 -1162 3681 -1008 -2481 1406 394 1226 -1891 -1724 3727 -464 -2335
3312 -2335 411 741 1552 -1971 -1612 2843 438 -1724 -994 1367 1892 -2279 -1154 1793 897 -614
3328 -614 -2217 1352 2484 -2331 -1089 1255 1028 11 -2485 692 2779 -1551 -1701 927 1510 95
3344I5k318K317K395k929j715K312J869j896k255J909K305j656k531J362L028
3359B292j603l057J878K321j102k180o8L290Jm187J333L163j468j511p13K488
3375H77J620m325J7L641p89j707j096K314J795l485o37K590Q92j830k340L169
3391G06J382k964l12O94K549j189m100L972J277k691L0p94L501n37m804L648J398
3408A766j756n78j316L955n61m059K439J014M17k272j401M869j717k313J156m
3424c61L008l727j739N631k629q22J74q32M602m287j811N092k149J38j470r6M681
3441C403m434p67K642m98J186m048J818L938m764J181k22Q07K637o346L087L301
3457B921m461K155k212J976K877o734L446J859k469J673l653L733J484n504L348
$$ plain form
3344 95 -2223 94 2489 -440 -2155 157 2026 130 -2125 -216 2089 433 -2098 -736 2292
3359 2292 689 -2368 -490 1831 729 -1451 -1519 1771 1772 -2415 -1082 2081 613 -898 -1611 877
3375 877 2497 -1828 -1811 1830 1041 -666 -1762 552 2347 -1138 -1775 815 1707 -123 -2463 706
3391 706 2088 -876 -1188 -494 2055 866 -3234 738 2015 -676 -646 -1440 2061 1524 -3280 368 1766
3408 1766 10 -568 -1884 2071 1510 -2549 -110 904 1321 -951 -2352 2517 800 -1513 -357 -361
3424 -361 2647 -1080 -2819 2812 183 -639 -465 -1297 3305 -982 -2793 2299 150 288 -1182 -1278 3403
3441 3403 -1031 -1798 844 346 1532 -2516 -698 3240 -1524 -343 -565 242 2879 -3467 -380 2921
3457 2921 -1540 615 -1597 379 3256 -3478 -32 1827 -642 1031 -2622 1111 2595 -2909 439
3472D39l85P19K65m637N718p32l423L151k874L873j112n154O971k399j571K284
3488A133l870N619k215m263O048k843P56j80k906O159l878j554L500k749L508
3503B265l521j031O041n456J552N55k270N520n998P28N010n659L454j827j063
3518a700N721o844K174K809l927L747l954J475L680o119L772p83q29L403o147
3533c522M640R80m987N137l955K025K443p058O446j233l057M659n364M273M91
3548A918n726O279k956P6K109m921N847k321k665M707m398L696j267l585O946
3563C739n211P56K728n090O241l872k074O593o165K972K96l824O580n341L03L983
3579B614m968M339k875p75N110o175L335K15k844N258n863K449L043o203N649
$$ plain form
3472 439 54 773 1038 -3599 2119 1387 -2036 1115 -1759 2114 1002 -4152 2819 420 -1151 1133
3488 1133 -2737 2882 667 -3596 2452 -391 365 185 -2721 3438 -440 -1994 1506 -1243 2265
3503 2265 -1256 -2287 3754 -1702 -150 405 -1865 3655 -2343 -1615 3395 -2264 1190 -637 -1700
3518 -1700 4021 -2823 -649 2160 -1767 1980 -1974 -499 3181 -2938 834 51 -778 2625 -3522
3533 -3522 1118 2098 -2889 2248 -1707 318 2761 -4297 2149 916 -2141 2518 -2846 1427 1918
3548 1918 -3808 2471 -485 -409 1700 -3221 2626 305 -2360 2347 -2051 1645 378 -3207 3739
3563 3739 -1472 -716 2012 -3078 3163 -709 -2783 3810 -2355 617 913 -2911 3669 -1672 -1369 2614
3579 2614 -2354 1985 -890 -1665 3445 -2730 605 820 -2024 3234 -2629 -180 2863 -3340 2309
3594B309l151o64N196p263M603P07m652N848m959J633L174o103N159j948j265
3609a376M025n535M281m64l370N233m990K596J636n520O341l556r01M739o433
3624c294M900m35m252O410n270J632K766n686N488k571j241M293n514M045m13
3639H58l214N056m793K523J387n012N846l514k75L911o156N299j018l842O030
3654C086n074K163J930n561O039k746j492M004m809M088j022l188N245m129J745
3669B79P65l732N651m040l19L783m830M423k175k372O223n677J676K066m287N309
3685B743l829o59M777n095K793n96j730M500n020J880J930l526L759l580J307
3700c46L135n722M101q08j743M006n451L332J843n212M545k271J39K727n253M132
$$ plain form
3594 2309 -842 -1506 3690 -3573 1030 1737 -2915 2933 -2026 -393 2781 -3322 1837 -111 -1376
3609 -1376 2649 -2886 1395 931 -2439 2794 -2196 400 2036 -3484 2857 -699 -1600 3139 -3294
3624 -3294 1606 1171 -3081 3329 -1941 -309 2457 -3229 2259 -312 -1553 2740 -2774 1271 858
3639 858 -2356 2700 -2093 430 1817 -3195 2651 -863 -1138 2773 -3383 1916 898 -2944 3086
3654 3086 -1988 175 2105 -3456 2583 -163 -1655 2349 -2460 1628 606 -2582 2663 -1466 279
3669 279 1044 -2688 2963 -1077 -1396 2387 -2443 1980 -195 -2567 3656 -2021 -345 1721 -2566 2743
3685 2743 -1086 -1745 3032 -2063 730 134 -1596 2904 -2116 -236 1694 -1832 1927 -1653 -346
3700 -346 2789 -2933 1168 360 -1383 2623 -2828 504 2347 -2865 1680 -591 -452 2275 -2978 1154
3716A154P2l009L179l009K640J76l932M501k008JJ214l505M968k235k530M394
3732B071l303K145m40l290N729l204j331L074k817L101k007j964M784l184K28
3747d08N37j196L491l777P3L102k718J829k073L80L684m976J596J512j844K566
3763A778l848J555L402m757J729L21l44K018m197K133K309l105J000r15J834O24
3779A537l891K673N04q05K75k437L792l62l621L003o74O36j31l161M320l16l172
3796a830K016m17J401q91k622L533j43j732QJ66K459k314j449K763m20M5j800
3813a227K06L578k994j132K154l13Q16k365n6L684k348j361J276N72Q30k552K6
3830a206K863j115j490l5J807O06k803M62J827l2j170j432K453J048l090M31J488
$$ plain form
3716 1154 1226 -1783 1396 -1613 1027 1203 -2729 1772 -236 -235 979 -2526 2442 207 -2323 2071
3732 2071 -1232 913 473 -2817 2912 -292 -1623 1451 -1366 1735 -272 -2236 2548 -636 -408
3747 -408 129 -1067 2424 -1353 -1280 1822 -896 933 -1140 -760 2924 -2052 -456 1056 -788 1778
3763 1778 -2070 -515 2887 -1870 -141 180 -164 1854 -2343 -210 2099 -1006 -6 -921 913 1537
3779 1537 -2354 319 823 18 293 -2144 1648 1286 -2335 668 -6 630 499 -2662 1658 1342 -1830
3796 -1830 186 -231 1170 279 -2343 1190 1047 -685 -677 -511 1948 -366 -1815 948 528 573 -1227
3813 -1227 -1021 2557 -437 -1569 585 272 1088 -1277 -1333 2351 3 -1358 -82 490 1320 -1232 -1206
3830 -1206 1657 542 -948 -983 824 1430 -1373 -911 916 884 -286 -1718 735 1783 -1307 -876 612
3847F12K82o47k043J943J899k840n00J756N96q13j722J216K062j701j700J487
3863a13J645j279j727J139J726q02j928M59K404o05k571J079J866o98j427m13
3879a245K250N66l162N94K297o19j076r60J755J538l110k18K437j66j116j191
3895a426J581J662k430p81J649J183j264k097K358J086j848m98KK460p58l382
3911b503K869J066j693j51r95K826l7l742K327J238q25q03j212L146k98k808J166
3928d29Q44J000k044j310L689j110j456L01M3K798l040j518M108j574m92m28m77
3945a095L784l275j506L428j034K71j823J79L658l206o68J503J77J106l620J493
3961f28K960l204P15p49J233K089n189K413K342k794J427k240J921K324n115K263
$$ plain form
3847 612 894 247 -1796 147 2046 -794 -1294 462 1058 245 -1477 -261 1801 100 -1600 -113
3863 -113 1532 253 -1474 -335 1391 589 -1339 -880 1524 919 -1652 -573 1293 595 -832 -1245
3879 -1245 1005 1571 -1591 -997 1300 681 -395 -1355 400 1938 -1172 -1390 1047 881 -235 -1426
3895 -1426 155 1817 -613 -1394 255 1438 174 -1923 435 1521 -327 -825 -823 1637 879 -2503
3911 -2503 366 1432 -261 -412 -1407 1419 1382 -2360 -33 1205 380 -423 -1635 1511 1213 -1595 -429
3928 -429 415 1415 -629 -1939 1750 640 -816 -515 -472 2326 -714 -2232 1876 302 -190 -618 -1095
3945 -1095 2689 -586 -2092 1336 302 573 -1250 -1071 2587 -619 -1287 216 393 1499 -2121 -628
3961 -628 2332 -872 -157 -906 327 2416 -2773 -360 1982 -812 615 -1625 296 2620 -2495 -232
3977b32J316j179Q27k954L098J014l768J969m66J399k84l635M519o02k293J817
3993E46k086L534j261l882N053j640o25Q69k711M665k050l031M206j832R39r08
4009b14j905M732k838j036J900j425K941l495l12M541m113J362k81j155M498n164
4025a964O31L854l889K330j935k6M194n301J572J837k143K480l752K030K660m696
4041b118K609q10L15K019n108M091N95l390L156l137K648J208n539M981p98j829
4057a107K637m031L951Q4m323M258j869P67M54l572N079k100j802K953l056L636
4073A959j896k830N603l738N94J226l283N278l559j520M797m147K421p83k266
4088b144N190m337K55K604l043L370l038K3L822m533K424n67j251L948n107K352
$$ plain form
3977 -232 1084 -95 732 -2222 876 1890 -1878 91 -375 1024 740 -2895 1624 1022 -1271 546
3993 546 -1540 1994 733 -3149 1904 264 -361 508 -2203 2462 412 -2619 1587 -245 694 -214
4009 -214 -2119 2613 -225 -1261 639 -786 2155 -1340 -1652 2889 -1224 138 -143 -1298 3200 -1964
4025 -1964 -1333 2521 -1368 962 -973 -999 3195 -2106 -534 1303 -840 1640 -2112 -82 2578 -2118
4041 -2118 491 -319 -4 2015 -3093 998 1593 -1797 1359 -1778 870 2078 -3461 1520 722 -1107
4057 -1107 1530 -2501 1450 1534 -2789 1469 -400 367 821 -2751 2328 228 -1574 1379 -1677 1959
4073 1959 63 -2767 2836 -902 -308 918 -2365 2913 -646 -2166 2631 -1516 905 122 -2144
4088 -2144 3046 -1291 -1036 1568 -1475 1895 -1143 -1120 2702 -1831 593 26 -1225 2723 -2384 -32
$$ [...]
8191b72
##END NTUPLES=NMR FID
##END=
