##TITLE=1H_BBz1701KR
 CDCl3
 8 sc, 
 18.1.2022
##JCAMPDX= 6.0         $$ Bruker NMR JCAMP-DX V2.0
##DATA TYPE= NMR FID
##DATA CLASS= NTUPLES
##ORIGIN= UXNMR, Bruker Analytische Messtechnik GmbH
##OWNER= root
$$ XWIN-NMR		Version 3.5
$$ Tue Jan 18 11:30:39 2022 Russian Standard Time (UT+4h)  she@DPX200
##.OBSERVE FREQUENCY= 200.131346
##.OBSERVE NUCLEUS= ^1H
##.DELAY= (6, 6)
##.ACQUISITION MODE= SIMULTANEOUS
##.ACQUISITION SCHEME= undefined
##.AVERAGES= 8
##.DIGITISER RES= 18
##SPECTROMETER/DATA SYSTEM= spect
##.PULSE SEQUENCE= zg30
##.SOLVENT NAME= CDCl3
##.SHIFT REFERENCE= (INTERNAL, CDCl3, 0, 15.7039)
##AUDIT TRAIL= $$ (NUMBER, WHEN, WHO, WHERE, WHAT)
$$ ##TITLE= Audit trail, XWIN-NMR		Version 3.5
$$ ##JCAMPDX= 5.01
$$ ##ORIGIN= Bruker BioSpin GmbH
$$ ##OWNER= she
$$ F:/spectra/data/she/nmr/H-F/1/audita.txt
$$ ##AUDIT TRAIL=  $$ (NUMBER, WHEN, WHO, WHERE, WHAT)
(   1,<2022-01-18 11:29:07.50 +0400>,<she>,<DPX200>,
      <created by zg, POWCHK disabled, PULCHK disabled
       configuration hash MD5:
       00 E9 B6 7A A2 85 ED C7 34 08 36 98 17 FE 4E 26
       data hash MD5: 16K
       0E B5 64 7B 63 EA 23 9C B1 B6 C3 8F 1D E3 4F FC>)
$$ ##END=
$$ 
$$ hash MD5
$$ E2 43 88 1F 78 A8 8B BB 23 BC EC 45 FE 6D D3 D7
##$RELAX= 
##$RELAX= 
##$RELAX= 
##$RELAX= 
##$RELAX= 
##$RELAX= 
$$ Bruker specific parameters
$$ --------------------------
##$DU= <F:/spectra>
##$EXPNO= 1
##$NAME= <H-F>
##$PROCNO= 1
##$TYPE= <nmr>
##$USER= <she>
##$AMP= (0..31)
100 100 100 100 100 100 100 100 100 100 100 100 100 100 100 100 100 100 
100 100 100 100 100 100 100 100 100 100 100 100 100 100 
##$AQSEQ= 0
##$AQ_mod= 1
##$AUNM= <au_zg>
##$AUTOPOS= <>
##$BF1= 200.13
##$BF2= 200.13
##$BF3= 200.13
##$BF4= 200.13
##$BF5= 200.13
##$BF6= 200.13
##$BF7= 200.13
##$BF8= 200.13
##$BYTORDA= 1
##$CFDGTYP= 0
##$CFRGTYP= 5
##$CHEMSTR= <none>
##$CNST= (0..31)
1 1 145 1 1 1 1 1 1 1 1 1 1 1 1 1 1 1 1 1 1 1 1 1 1 1 1 1 1 1 1 1 
##$CPDPRG= <>
##$CPDPRG1= <>
##$CPDPRG2= <>
##$CPDPRG3= <>
##$CPDPRG4= <mlev>
##$CPDPRG5= <mlev>
##$CPDPRG6= <mlev>
##$CPDPRG7= <mlev>
##$CPDPRG8= <mlev>
##$CPDPRGB= <>
##$CPDPRGT= <>
##$D= (0..31)
0 1.2 0 0 0 0 0 0 0 0.06 0 0.03 0 0 0 0 0.0002 0 0 0 0 0 0 0 0 0 0 0 0 
0 0 0 
##$DATE= 1642490946
##$DBL= (0..7)
120 120 120 120 120 120 120 120 
##$DBP= (0..7)
150 150 150 150 150 150 150 150 
##$DBP07= 0
##$DBPNAM0= <>
##$DBPNAM1= <>
##$DBPNAM2= <>
##$DBPNAM3= <>
##$DBPNAM4= <>
##$DBPNAM5= <>
##$DBPNAM6= <>
##$DBPNAM7= <>
##$DBPOAL= (0..7)
0.5 0.5 0.5 0.5 0.5 0.5 0.5 0.5 
##$DBPOFFS= (0..7)
0 0 0 0 0 0 0 0 
##$DE= 6
##$DECBNUC= <off>
##$DECIM= 32
##$DECNUC= <off>
##$DECSTAT= 4
##$DIGMOD= 1
##$DIGTYP= 9
##$DL= (0..7)
0 120 120 120 120 120 120 120 
##$DP= (0..7)
150 150 150 150 150 150 150 150 
##$DP07= 0
##$DPNAME0= <>
##$DPNAME1= <>
##$DPNAME2= <>
##$DPNAME3= <>
##$DPNAME4= <>
##$DPNAME5= <>
##$DPNAME6= <>
##$DPNAME7= <>
##$DPOAL= (0..7)
0.5 0.5 0.5 0.5 0.5 0.5 0.5 0.5 
##$DPOFFS= (0..7)
0 0 0 0 0 0 0 0 
##$DQDMODE= 0
##$DR= 18
##$DS= 0
##$DSLIST= <SSSSSSSSSSSSSSS>
$$ [...]
##$SUBNAM2= <"">
##$SUBNAM3= <"">
##$SUBNAM4= <"">
##$SUBNAM5= <"">
##$SUBNAM6= <"">
##$SUBNAM7= <"">
##$SUBNAM8= <"">
##$SUBNAM9= <"">
##$SW= 18.0517287032376
##$SWIBOX= (0..15)
0 0 2 0 0 0 0 0 0 0 0 0 0 0 0 0 
##$SW_h= 3612.71676300578
##$TD= 16384
##$TD0= 1
##$TE= 0
##$TE2= 300
##$TE3= 300
##$TEG= 300
##$TL= (0..7)
0 120 120 120 120 120 120 120 
##$TP= (0..7)
150 150 150 150 150 150 150 150 
##$TP07= 0
##$TPNAME0= <>
##$TPNAME1= <>
##$TPNAME2= <>
##$TPNAME3= <>
##$TPNAME4= <>
##$TPNAME5= <>
##$TPNAME6= <>
##$TPNAME7= <>
##$TPOAL= (0..7)
0.5 0.5 0.5 0.5 0.5 0.5 0.5 0.5 
##$TPOFFS= (0..7)
0 0 0 0 0 0 0 0 
##$TUNHIN= 0
##$TUNHOUT= 0
##$TUNXOUT= 0
##$USERA1= <user>
##$USERA2= <user>
##$USERA3= <user>
##$USERA4= <user>
##$USERA5= <user>
##$V9= 5
##$VALIST= <valist>
##$VCLIST= <CCCCCCCCCCCCCCC>
##$VD= 0
##$VDLIST= <DDDDDDDDDDDDDDD>
##$VPLIST= <PPPPPPPPPPPPPPP>
##$VTLIST= <TTTTTTTTTTTTTTT>
##$WBST= 1024
##$WBSW= 4
##$XGAIN= (0..3)
0 0 0 0 
##$XL= 0
##$YL= 0
##$YMAX_a= 272519
##$YMIN_a= -220723
##$ZGOPTNS= <>
##$ZL1= 120
##$ZL2= 120
##$ZL3= 120
##$ZL4= 120
##$ABSF1= 10
##$ABSF2= 0
##$ABSG= 5
##$ABSL= 3
##$ALPHA= 0
##$AQORDER= 0
##$ASSFAC= 0
##$ASSFACI= 0
##$ASSFACX= 0
##$ASSWID= 0
##$AUNMP= <proc_1d>
##$AZFE= 0.1
##$AZFW= 0.1
##$BCFW= 1
##$BC_mod= 2
##$BYTORDP= 1
##$COROFFS= 0
##$CY= 11.3945322036743
##$DATMOD= 1
##$DC= 2
##$DFILT= <>
##$DTYPP= 0
##$F1P= 2.36226072786647
##$F2P= -0.459571619588291
##$FCOR= 0.5
##$FTSIZE= 0
##$FT_mod= 4
##$GAMMA= 1
##$GB= 0.15
##$INTBC= 1
##$INTSCL= 1
##$ISEN= 128
##$LB= 0.24
##$LEV0= 0
##$LPBIN= 0
##$MAXI= 10000
##$MC2= 0
##$MEAN= 0
##$ME_mod= 0
##$MI= 1.114404
##$NCOEF= 0
##$NC_proc= 0
##$NLEV= 6
##$NOISF1= 3.799351
##$NOISF2= 2.8
##$NSP= 1
##$NTH_PI= 0
##$NZP= 0
##$OFFSET= 15.70392
##$PC= 1
##$PHC0= -15866.36
##$PHC1= 6.400779
##$PH_mod= 1
##$PKNL= yes
##$PPARMOD= 0
##$PSCAL= 0
##$PSIGN= 0
##$REVERSE= no
##$SF= 200.130013532006
##$SI= 16384
##$SIGF1= 3
##$SIGF2= 2
##$SINO= 400
##$SIOLD= 16384
##$SREGLST= <1H.CDCl3>
##$SSB= 0
##$STSI= 0
##$STSR= 0
##$SW_p= 3612.71676300578
##$SYMM= 0
##$S_DEV= 0
##$TDeff= 0
##$TDoff= 0
##$TI= <>
##$TILT= no
##$TM1= 0
##$TM2= 0
##$TOPLEV= 0
##$USERP1= <user>
##$USERP2= <user>
##$USERP3= <user>
##$USERP4= <user>
##$USERP5= <user>
##$WDW= 1
##$XDIM= 8192
##$YMAX_p= 0
##$YMIN_p= 0
$$ End of Bruker specific parameters
$$ ---------------------------------
##NTUPLES= NMR FID
##VAR_NAME=  TIME,          FID/REAL,        FID/IMAG
##SYMBOL=    X,             R,               I
##VAR_TYPE=  INDEPENDENT,   DEPENDENT,       DEPENDENT
##VAR_FORM=  AFFN,          ASDF,            ASDF
##VAR_DIM=   8192,          8192,            8192
##UNITS=     SECONDS,       ARBITRARY UNITS, ARBITRARY UNITS
##FACTOR=    0.0002768,     1,               1
##FIRST=     0,             0,               0
##LAST=      2.2672688,     0,               0
##MIN=       0,             -220723,         0
##MAX=       2.2672688,     272519,          0
$$ Real data points
##PAGE= N=1
##DATA TABLE= (X++(R..R)), XYDATA
0 0 0 0 0 0 0 0 0 0 0 0 0 1 -8 8 -8 8 -16 16 -16 24 -25 32 -40 48 -56 64 -73 84 -97 113 -129 145 -167 187
34 187 -211 240 -268 300 -337 375 -417 464 -515 570 -629 697 -768 847 -932 1028 -1132 1247
52 1247 -1375 1519 -1677 1858 -2062 2296 -2571 2895 -3282 3759 -4362 5150 -6229 7813 -10366
67 -10366 15184 -27560 134519 249261 115856 111743 50684 -16961 -61093 6304 50399 39532
79 39532 12757 30859 -3772 -105625 -203683 -213918 -207526 -220723 -194578 -81772 16966 50809
91 50809 67521 115605 127499 73814 27323 47816 74867 72539 82580 138533 176171 142744
103 142744 83288 51283 4640 -85571 -161639 -169045 -147277 -146428 -134957 -77728 -26729 -26931 -45423
116 -45423 -38414 -23853 -36228 -45494 -3784 61663 100870 122150 157070 185880 161877 101936
128 101936 61047 33540 -12610 -59979 -68943 -46183 -38958 -54356 -55311 -44571 -62276 -105080 -126060
141 -126060 -109408 -93459 -89363 -52278 19697 72367 87091 100257 125970 124142 80552 48044
153 48044 52730 53621 29721 19142 44287 56671 19627 -20837 -31233 -53250 -108918 -146990 -130243
166 -130243 -100648 -97494 -80371 -20953 27977 27223 18078 39717 56486 31363 12980 45905 82171
179 82171 77923 71378 98727 112653 68575 13730 -2726 -19417 -71235 -110139 -94172 -63775
191 -63775 -69133 -75271 -40811 -10979 -30205 -55806 -39715 -14458 -21865 -24136 23829 77324 87249
204 87249 84870 107447 120353 83149 32977 19651 15308 -17075 -44656 -30456 -6505 -18215
216 -18215 -42801 -38890 -34119 -65399 -98931 -92039 -66306 -58665 -49849 -4448 47606 62280 58291
229 58291 70440 82244 61818 29196 27046 42969 37782 24533 34109 49913 35226 -2803 -26196
242 -26196 -37026 -65980 -99730 -103057 -79268 -60627 -52706 -29281 7318 20915 9950 6387 17648
255 17648 21030 10809 17786 49985 72912 72701 72733 80418 70360 30013 -8926 -23280 -37111 -62807
269 -62807 -73476 -53328 -31449 -34164 -39564 -25517 -18426 -38950 -56357 -42454 -18510 -11941 -1640
282 -1640 38767 77896 80456 69135 73741 73739 41299 3273 -649 8217 -5734 -20452 -6153 11626
296 11626 -5369 -36548 -42173 -41214 -66554 -90337 -74497 -39999 -26577 -19153 16361 54610 53068
309 53068 34121 37619 47655 30198 6381 18408 45877 44118 29154 37419 47507 21018 -23238
322 -23238 -40131 -40813 -62165 -85384 -70381 -36150 -24867 -27974 -9813 16101 8993 -13911 -10708
335 -10708 8967 10572 5061 26553 62720 70440 56637 56242 58919 34265 -6621 -25157 -22272
348 -22272 -31701 -47805 -38771 -14628 -10485 -25342 -29508 -21546 -30454 -51627 -49884 -25836 -7282
361 -7282 1140 21644 54609 68404 56090 46205 45064 33334 7750 -5830 3475 11017 3544
374 3544 1083 10186 8518 -14940 -38975 -45208 -49546 -63392 -65648 -42556 -15024 -2960 5621 26368
388 26368 41118 30053 14184 16259 22907 16200 10504 27160 48317 45386 30996 29046 25287
401 25287 -2295 -36818 -46920 -41483 -48997 -57037 -38736 -10660 -5455 -14760 -9269 3807 -5775
414 -5775 -24453 -16969 7973 17583 17427 37101 65300 64202 41542 32836 32080 10349 -21673 -28244
428 -28244 -13713 -14478 -26924 -18751 29 -5813 -30500 -37712 -28507 -35349 -51261 -38905 -5369
441 -5369 11608 13089 29225 54602 53476 29407 20493 26786 17797 -1836 -345 20725 25370 10062
455 10062 6673 13268 -837 -33021 -48850 -43610 -45150 -54924 -43676 -13220 3416 2406 7842
468 7842 22182 21562 3491 -2426 10780 17941 14634 22343 43344 51097 36932 23902 20080 5505
482 5505 -21794 -38851 -35459 -30017 -33701 -30294 -12219 -1317 -8827 -18103 -15078 -12734 -22320 -25793
496 -25793 -7765 13247 22287 29117 44718 55313 44113 24190 15980 11582 -3758 -17994 -13537
509 -13537 149 241 -8160 -4861 -427 -14292 -35978 -41637 -34087 -34494 -37321 -20289 8063 21050
523 21050 19777 26139 37955 31180 9751 4316 14559 14034 4522 10525 29093 29888 11117 1609
537 1609 2249 -12513 -39397 -48248 -35438 -28685 -33462 -22707 3114 12472 1132 -1550 9280 7020
551 7020 -9307 -8281 13624 24766 21209 27632 45183 44676 21169 4987 4862 -6140 -29762 -35826
565 -35826 -19446 -10675 -18496 -16552 -30 676 -18605 -27019 -17886 -14954 -23435 -17093 9464 27097
579 27097 26120 29116 41513 40528 19476 4022 6364 4639 -8771 -10782 3483 11181 1830 -6354
593 -6354 -3909 -9303 -28944 -40960 -35347 -26898 -26231 -19493 2544 20168 19795 16547 21476 22293 9706
608 9706 -630 5540 15107 14302 13886 22846 29643 19747 1836 -6755 -11902 -25985 -39758 -36472 -22846
623 -22846 -17307 -16502 -6163 7132 5762 -4891 -7198 -1443 -1509 -6117 1705 21120 30756 28088 29851
638 29851 35667 28472 6693 -6862 -6628 -11655 -23438 -22110 -7588 -932 -8629 -12159 -5258 -8674
652 -8674 -25293 -31828 -20002 -10553 -11634 -3136 20705 33723 26381 22096 28376 24645 4959 -5743
666 -5743 3246 8318 -284 -886 12401 16052 -537 -14314 -12530 -16319 -34618 -41300 -25556 -12241
680 -12241 -12870 -7626 12663 22769 11490 3571 10594 12265 162 -3700 11957 24303 19244 16272
694 16272 25790 25545 5696 -12469 -13153 -14920 -28675 -33411 -19017 -5818 -7725 -9194 649 5666
708 5666 -6275 -16283 -10104 -2056 -3775 -1887 14854 30320 28719 23162 25973 24049 8281 -7062
722 -7062 -8913 -5778 -10844 -14183 -5422 3500 -178 -9409 -11090 -10647 -19514 -28831 -23812 -11216 -4429
737 -4429 -387 11294 25187 26053 17543 14151 14550 8378 -1812 -2479 7090 11312 6934 7756 12220
752 12220 7259 -8109 -19093 -19725 -22519 -30103 -27765 -12859 -1561 -452 2128 11750 14145 3308
766 3308 -3362 2345 6467 2591 3873 18164 27790 21295 14429 16724 12252 -5714 -19969 -17393
780 -17393 -13495 -20299 -21400 -7437 3153 -2895 -9830 -4421 -1346 -12770 -20058 -8405 4351 4698
794 4698 6447 22240 33174 24778 13104 14420 13471 -1452 -13341 -7007 1772 -3042 -7221 1444
808 1444 7040 -4666 -17808 -16934 -14076 -22793 -27567 -14023 1419 3860 4525 15887 24736 16218
822 16218 4581 6589 10361 2934 -2520 6202 17193 14119 6859 8846 9434 -3815 -18869 -21035
836 -21035 -17520 -21332 -24027 -13759 -140 1608 -1268 2577 7208 1609 -7250 -4527 4120 6409
850 6409 6637 14825 25195 24661 15352 10638 8910 -514 -13277 -16373 -11163 -9013 -11396 -7874 433
865 433 768 -7224 -11869 -10076 -10509 -16086 -14188 -1665 8259 10412 13926 22019 24193 14749 5649 5397
881 5397 4054 -3417 -6683 528 7527 3925 -944 1825 1046 -10678 -21347 -20112 -15462 -17739 -17735 -4381
897 -4381 8693 8672 5820 11221 15032 6083 -3527 579 7990 5463 3014 11655 20950 14991 3792
912 3792 2422 1932 -10179 -22575 -19771 -11197 -12011 -14545 -4441 6646 3223 -4934 -2951 1858 -3760
927 -3760 -10733 -3035 9778 11481 9633 17131 24856 17804 4619 1927 3068 -6074 -15523 -11183 -1230
942 -1230 -1838 -6882 -2609 3378 -3753 -15198 -15277 -9568 -11089 -14395 -4979 9502 13310 10606 14266
957 14266 19536 13715 2090 -141 3965 1681 -3072 835 9139 9095 1663 -1578 -942 -7641 -18719
972 -18719 -21157 -15259 -11913 -12228 -6058 5192 9591 5509 4521 6988 5266 -1350 -2542 4538 10025
987 10025 9211 10620 16235 16974 7931 -1263 -3413 -6620 -14967 -18907 -12804 -6087 -5819 -5991 -243 3519
1003 3519 -2516 -8990 -7436 -3478 -4853 -5479 3897 15002 15786 13299 16580 18379 9954 -1241 -2931
1018 -2931 -610 -5108 -9734 -4466 3611 1762 -5278 -5075 -2438 -9648 -19173 -16922 -8400 -6990 -7507
1033 -7507 1657 14088 14432 8218 9442 12946 7304 -2580 -1382 6791 6638 1990 5853 12776 8365
1048 8365 -3239 -7208 -5474 -11772 -21197 -18258 -8375 -5273 -7017 -1427 8026 6832 -1402 -1947 3272
1063 3272 1739 -3574 648 12064 14759 10374 12269 16838 11164 -1062 -6307 -4559 -7781 -14384
1077 -14384 -12322 -3463 -695 -4594 -4719 -83 -2125 -10586 -12303 -6289 -2974 -3474 1393 11778 16841
1092 16841 13496 11515 13132 9767 708 -4262 -1550 493 -2498 -2390 3302 5008 -1282 -6838 -7385
1107 -7385 -8943 -15056 -17648 -11685 -4856 -2451 152 7353 12931 9508 4297 5023 6335 1978 -1608
1122 -1608 2852 9691 9299 6139 8033 9165 2083 -7659 -10926 -9593 -12817 -16704 -11676 -2595 -366
1137 -366 -2781 -76 4971 1795 -5368 -4446 1702 2444 660 6144 15698 16593 10523 9100 10427 4159
1153 4159 -6727 -9318 -4865 -5247 -10175 -7026 1155 994 -5929 -7668 -3762 -6389 -13449 -11686 -2059
1168 -2059 2318 1492 6312 15552 16731 8931 5921 8513 5259 -3133 -3965 2799 4548 -122 196 4945
1184 4945 2294 -7337 -12013 -9824 -11022 -16080 -13828 -4147 1317 477 2869 9313 9866 2863 -87
1199 -87 3840 4704 1428 2612 9693 13139 9312 6127 6972 3719 -5658 -11696 -10508 -9253 -11890 -11442
1215 -11442 -4173 409 -1441 -3084 -817 -65 -4246 -6793 -2125 3072 4278 6037 11922 16229 13176
1230 13176 7513 6150 4723 -1776 -7132 -6109 -2307 -2560 -4496 -1850 1081 -2329 -8475 -10065 -8007
1245 -8007 -9114 -11726 -7168 1811 5408 5228 8367 13051 11254 4318 2140 4306 3132 -1098 369
1260 369 6613 7732 2405 407 2159 -1845 -10656 -13941 -10342 -9127 -11743 -8377 867 4442 1120
1275 1120 1323 5521 4847 -1510 -2782 3696 6374 3873 5724 12613 13581 6499 1816 3042 -520 -9276
1291 -9276 -12226 -7217 -4502 -7473 -6425 364 2290 -3844 -6516 -3168 -2390 -6774 -6313 1939 7581
1306 7581 6367 7687 13233 13844 6992 1683 2632 1595 -4619 -6183 -921 1966 -947 -2973 -142
1321 -142 -450 -7243 -11687 -9335 -7136 -8896 -7522 230 6525 6221 5505 8415 9294 4344 -56 1545
1337 1545 3914 2288 1558 5153 8211 5443 579 -1042 -2284 -7676 -12583 -11617 -7828 -6748 -6303 -2202
1353 -2202 3073 3149 90 114 1726 612 -1842 231 5870 8068 7202 8744 11409 9278 2500 -1332
1369 -1332 -1511 -4061 -8831 -9047 -4026 -1573 -3730 -3744 -319 -678 -6429 -8486 -5000 -2990 -4355 -1853
1385 -1853 5935 10338 8543 7785 10382 9302 2497 -1697 677 1734 -2374 -2943 2266 4224 -603
1400 -603 -4553 -2990 -3618 -10446 -13336 -8259 -4277 -5185 -3579 4074 8486 5007 2579 5451 6133 836
1416 836 -1684 3029 7037 4300 3447 7610 8499 2354 -3487 -3544 -4186 -9567 -12317 -7474 -3071 -3933 -4019
1433 -4019 710 3433 -616 -4006 -1455 710 -1237 -1423 4057 9267 8533 6974 9036 9384 3688 -2032
1449 -2032 -2694 -1873 -4691 -6815 -3417 412 -1004 -3496 -2712 -1806 -5421 -8879 -7257 -3550 -2413 -1451
1465 -1451 2927 7961 8862 6319 5998 6405 3673 -632 -986 1440 2043 376 1759 3958 2408 -2167
1481 -2167 -4855 -5223 -6840 -9996 -9783 -4961 -1556 -1074 467 4642 5719 2077 36 1992 2406 158
1497 158 174 4841 7986 6100 4419 5872 5037 -923 -6021 -5448 -4503 -7589 -8179 -3339 400 -1309 -2513
1514 -2513 -163 1247 -2968 -5742 -2310 1182 588 743 6249 10566 8135 4449 5497 5582 -84 -4813
1530 -4813 -2809 -129 -2418 -4027 -280 2654 -1083 -5192 -4359 -3197 -6636 -9386 -5153 422 554
1545 554 525 5034 8816 6233 2139 3111 4157 793 -2081 764 4670 3155 736 2671 3795 -436
1561 -436 -5842 -6036 -4981 -7266 -9024 -5284 -103 381 -515 1800 4171 1815 -1515 -761 1970 1505
1577 1505 521 3546 7587 7543 4515 3857 3976 349 -4500 -5627 -3881 -3975 -4997 -3417 296 559 -1907
1594 -1907 -2589 -1713 -2328 -4951 -4737 -642 1896 2313 3941 7188 8251 5168 2669 2598 1466 -1961 -3257
1611 -3257 -844 1312 275 -1054 1000 1464 -2509 -5777 -5337 -4387 -6013 -6448 -2150 2332 2498 2368
1627 2368 4251 6046 3127 -677 173 2368 803 -597 2577 5933 4254 1103 1463 1745 -2359 -6893
1643 -6893 -6241 -3968 -4367 -5294 -1830 2502 1614 -760 89 1954 -476 -3706 -1727 2718 2431 1427
1659 1427 4498 7773 5702 1588 986 1767 -1570 -5685 -4423 -1080 -1107 -2899 -936 2211 371 -3714
1675 -3714 -3427 -1725 -2974 -4940 -2368 2654 3558 2605 4438 6755 4867 661 -339 1132 -169 -2593
1691 -2593 -1354 2194 2298 205 62 1152 -950 -5149 -5595 -3895 -3631 -4220 -2447 2132 3465 2308
1707 2308 2088 3617 2479 -626 -1627 610 1909 832 1496 4047 4853 2196 -1 -366 -1517 -4556
1723 -4556 -6005 -4229 -1954 -2114 -1793 915 2472 713 -1332 -641 18 -1683 -2241 226 3693 3624 3008
1740 3008 4566 5635 2895 -737 -1206 -468 -2524 -4426 -2341 618 503 -1317 -496 852 -1456 -4417
1756 -4417 -3957 -1926 -2052 -2685 120 4205 4618 2655 3131 4515 2255 -1580 -1521 979 622 -1414 462
1773 462 3523 2656 -813 -1341 -251 -2489 -6074 -5237 -2061 -1377 -2292 -266 3501 3314 336 247 1884
1790 1884 709 -2049 -1031 2411 3122 1580 2504 4797 3574 -299 -1860 -916 -2008 -4930 -4253 -1014
1806 -1014 26 -1067 -461 1877 1243 -2048 -2898 -1097 -844 -2032 -862 2657 4276 3037 2744 4093
1822 4093 2996 -213 -2086 -1099 -749 -2063 -1928 838 1924 420 -994 -328 -750 -3302 -4600 -2852
1838 -2852 -1070 -1053 -456 2095 4218 2985 1389 1636 1726 -308 -1563 -580 1389 1300 588 1946 3014
1855 3014 1252 -1520 -2154 -1563 -2981 -4786 -3108 -108 285 -490 890 2719 1864 -982 -1106 469
1871 469 -127 -1447 235 3185 3643 1976 1898 3253 1471 -2093 -2914 -1318 -1655 -3045 -2207 1019 1495
1888 1495 -682 -729 880 -370 -3085 -3057 -560 368 -791 728 4026 4509 1977 1216 2467 1135 -2049
1905 -2049 -2493 -257 358 -1147 -601 2015 1942 -1056 -2197 -1066 -1559 -3871 -3955 -721 744 12 721
1922 721 3268 3521 1025 -189 1066 847 -1285 -1280 1394 2635 1284 947 2188 1923 -1206 -2821 -2276
1939 -2276 -1984 -3289 -3354 -680 1050 505 -148 1317 1332 -458 -2012 -775 565 77 63 2239 3864
1956 3864 3100 1485 1507 1575 -842 -2681 -2177 -968 -1285 -1709 -487 1273 584 -1069 -1232 -866 -1739 -3012
1974 -3012 -2015 405 1182 972 1904 3723 3154 1121 329 939 20 -1549 -1273 1024 1457 177 114 1338
1992 1338 520 -2140 -2982 -2044 -1857 -3118 -2497 392 1635 524 584 2287 2163 -367 -1374 512 914
2009 914 -401 -21 2576 3265 1376 267 1282 518 -2388 -3346 -1659 -958 -2019 -1865 796 1688 -178
2026 -178 -915 204 256 -1847 -2398 11 1466 658 854 3072 3650 1587 -118 676 602 -1716 -2580 -639
2044 -639 330 -494 -900 791 1249 -926 -2258 -1521 -1144 -2120 -2318 -215 1634 1177 1041 2350 2717 1231
2062 1231 -536 -56 646 -352 -829 596 1818 1188 40 492 394 -1298 -2995 -2571 -1619 -1682 -1657 -412
2080 -412 1561 1318 437 710 1267 297 -755 -688 790 1244 628 1535 2705 2126 461 -102 188 -1022
2098 -1022 -2469 -2767 -1038 -418 -981 -710 663 848 -632 -1355 -467 -217 -1338 -1102 950 2331 1690
2115 1690 1589 2712 2647 528 -944 -28 3 -1284 -1833 217 1094 -183 -932 58 81 -1776 -3112 -1660
2133 -1660 -706 -1556 -1376 911 2558 1469 835 1686 2140 204 -1118 122 1208 301 15 1459 2371
2150 2371 518 -933 -395 -427 -2288 -3300 -1892 -621 -1324 -1381 490 1702 328 -737 58 827 -487
2167 -487 -1023 464 2138 1606 1067 2111 2786 1067 -630 -499 -242 -1407 -2399 -1148 -90 -237 -863
2184 -863 -206 389 -659 -1849 -1535 -649 -843 -927 387 2063 2160 1548 1752 2308 1216 -330 -410 -8 183
2203 183 -470 -35 1150 829 -430 -812 -616 -1248 -2288 -2431 -1231 -741 -666 -59 1085 1736 650 144
2221 144 985 783 -350 -386 694 1689 1089 900 1551 1685 -71 -1187 -1170 -844 -1886 -2440 -1052 58
2239 58 -467 -657 405 866 -179 -1397 -465 383 -111 -495 1125 2504 1800 986 1709 1980 168 -1295
2257 -1295 -711 -44 -897 -1534 -337 947 38 -1052 -681 72 -1221 -2380 -1248 99 -62 -338 940
2274 940 2484 1602 570 1010 1449 365 -1007 -166 992 420 -250 418 1305 201 -1347 -1044 -655 -1595
2292 -1595 -2570 -1591 8 63 -489 539 1585 1007 -204 27 720 154 -455 559 1703 1578 815 1019
2310 1019 1402 385 -968 -1288 -870 -967 -1848 -1170 -136 73 -556 -423 127 -140 -1114 -1166 64 241 196
2329 196 736 1977 2194 1416 862 1057 646 -463 -832 -285 35 -351 -533 58 344 -574 -1268 -1231 -967 -1583
2349 -1583 -1807 -811 137 308 266 1176 1935 1075 157 355 1019 149 -331 635 1346 909 111 404 977 -311
2369 -311 -1577 -1496 -887 -1315 -1818 -1017 267 164 -590 250 832 256 -774 -335 645 617 142 937 2110
2388 2110 1764 703 587 1100 197 -1220 -947 -226 -370 -1161 -644 471 -116 -1075 -951 -187 -726 -1494 -1085
2407 -1085 123 524 204 934 1956 1621 414 437 834 276 -601 -311 554 581 -110 -47 612 1 -1357
2426 -1357 -1434 -764 -895 -1414 -1049 101 356 7 229 944 788 130 -23 319 480 117 249 1115 1251 749
2446 749 200 504 249 -908 -1420 -934 -794 -1045 -813 -106 349 -103 -541 -132 271 -435 -633 1 597 556
2466 556 474 1146 1529 974 317 161 365 -270 -960 -512 -25 20 -442 -295 235 -342 -972 -934 -449 -587 -964
2487 -964 -324 658 647 292 834 1381 839 39 -106 511 372 -177 68 921 569 -245 -224 30 -330 -1368
2507 -1368 -1297 -603 -657 -1047 -464 396 448 -93 -46 403 161 -394 -187 714 864 401 625 1373 1148 209 93
2528 93 285 -304 -925 -1091 -399 -533 -570 -527 237 14 -871 -683 -331 -241 -647 -414 472 845 540 733 1329
2549 1329 1272 467 -53 94 171 -322 -495 223 276 -96 -408 -71 -178 -919 -1282 -868 -581 -891 -519 137 480
2570 480 290 226 674 721 261 -179 163 600 504 146 462 876 584 -42 -184 -177 -659 -1215 -1036 -362 -362 -663
2592 -663 -147 181 122 -368 -292 267 -26 -200 47 768 749 572 734 1109 741 -178 -155 300 -160 -705 -506
2613 -506 44 -30 -500 -429 160 -274 -1036 -924 -269 -281 -504 -57 590 954 410 366 776 506 29 -117 208
2634 208 289 -203 34 492 368 -213 -209 -62 -432 -1001 -1113 -406 -33 -504 -244 243 536 89 -41 426 300
2655 300 -35 -42 560 597 472 161 892 697 -22 -154 -176 -306 -653 -739 -278 -111 -194 -258 130 82 -431 -366 -281
2678 -281 -38 -116 -81 400 745 649 602 670 640 302 -170 -64 50 -219 -343 -160 182 -76 -446 -361 32 -667
2700 -667 -850 -269 -188 -232 -280 191 639 652 283 369 415 401 -60 275 297 417 158 31 287 45 -414 -447 -478
2723 -478 -426 -785 -589 -349 -70 -206 -119 229 261 -130 -155 192 215 39 58 491 821 463 417 607 396 -153
2745 -153 -400 -127 -195 -561 -515 -65 -58 -201 -331 -108 -217 -353 -591 -271 71 41 177 548 795 389 193 413
2767 413 577 -57 -226 78 205 -184 14 84 158 -193 -540 -215 -287 -515 -789 -295 6 -213 -243 339 364 220
2789 220 24 52 218 84 156 477 282 372 218 349 402 -181 -388 -236 -304 -334 -283 -285 -85 -87 -99 -80 8 33 -107
2814 -107 -149 17 158 208 259 419 523 324 184 312 -48 -133 -142 -24 -61 -255 -177 -47 -118 -238 -324 -150 -228 -444
2838 -444 -188 -57 4 106 42 349 318 144 50 123 124 191 -4 98 339 -22 27 64 75 -231 -453 -270 -159 -382
2862 -382 -182 -152 -71 -234 -42 240 260 -74 -39 244 105 258 59 385 274 199 182 28 5 -292 -319 -140 -6
2885 -6 -213 -276 19 34 -158 -219 -115 -77 -275 -210 219 193 160 223 318 480 114 142 275 153 -67 -40 97 106 -11
2910 -11 -48 -4 8 -45 -457 -236 -134 -327 -413 -181 78 35 138 364 254 187 -98 164 268 1 90 -32 163
2933 163 78 50 48 5 -165 -261 -319 -75 -275 -124 -215 -145 83 -46 45 36 -29 -113 -77 -58 119 140 258 264 186 246 172
2960 172 188 -106 -97 -146 -7 -38 -164 -81 16 -274 -192 -243 -244 -113 -34 -191 78 101 146 117 81 18 70 223 48 191
2986 191 -49 -70 130 155 -137 -88 -132 -30 -266 -80 -154 -145 -167 -132 37 -110 26 -34 7 14 36 -84 43 225 150
3011 150 187 334 242 -52 -142 -17 -277 -86 -101 126 104 -173 -251 84 -145 -142 -70 7 -218 -2 -74 -66 110 72 240
3036 240 119 -60 7 23 158 138 -151 -60 223 65 -212 -55 -55 -129 -200 -291 -55 -19 -129 -134 71 -32 -115 -133 -29
3061 -29 -42 83 102 36 9 172 -129 223 163 61 -38 -242 -66 -156 -49 -88 0 10 -72 60 -3 -12 -137 -150 -109 -177
3087 -177 -82 116 148 13 41 185 237 -69 -57 14 5 31 -60 47 135 70 -98 -42 -92 -320 -247 11 91 -60 -141 66
3113 66 148 -6 -55 106 -11 -38 -90 57 155 99 165 199 232 -165 -131 -27 23 -197 -234 23 140 19 -220 87
3137 87 49 -168 -312 -112 -56 -49 -1 93 134 228 -43 98 169 -19 -272 91 32 -196 -185 -27 180 -11 -158 -85
3161 -85 68 -264 -405 -265 112 -95 -100 52 131 145 9 48 161 72 -166 145 125 232 -43 90 224 85 -101
3184 -101 -101 -98 -99 -172 -198 201 -26 -47 -143 48 28 13 -77 -54 110 -73 -126 112 234 -23 -58 176 141 -4 -106 25
3210 25 -14 -190 -91 -4 104 108 -159 -54 -135 -274 -338 -94 241 -72 93 169 318 -38 52 8 264 47 -112 9
3234 9 208 43 -58 253 107 -157 -27 -155 8 -232 -322 36 86 -118 -149 101 81 -123 -232 -30 27 160
3256 160 -93 35 186 -93 -29 25 187 -95 5 59 97 -234 -290 22 291 -80 -105 -44 -9 -269 -207 -39 10
3279 10 19 -173 169 174 272 -138 143 193 -7 -212 -170 73 5 80 -111 105 -195 -125 -191 84 -126 -348 -45 115
3303 115 32 -120 60 279 105 22 103 -46 -135 -55 -28 443 222 74 9 204 47 -225 -173 -66 -71 -225 -462
3326 -462 -63 221 -187 -292 -88 247 -202 -225 38 16 -24 109 252 365 51 -95 162 241 -129 -283 82
3347 82 27 -138 -98 342 168 -44 -437 -179 145 -95 -319 145 165 50 -26 364 353 40 -22 128 243 -45
3369 -45 -98 162 421 -30 11 39 168 -330 -399 -208 109 -330 -303 -141 174 -10 -41 54 132 0 -146 -75 393
3392 393 32 -180 275 388 257 -170 4 83 93 -359 -169 25 -125 -338 -237 191 19 -165 -174 -45 -72 -368
3414 -368 27 151 47 -44 14 363 214 -27 -75 241 15 -217 -240 110 112 -71 25 184 18 -384 -220 -186 -34
3437 -34 -241 -237 83 336 203 19 356 162 -34 -169 93 189 -109 -97 146 307 8 -175 -121 199 -290 -400
3459 -400 -77 81 -84 -183 174 315 -59 -254 22 294 -137 -223 3 375 123 -104 174 417 150 -211 -241
3480 -241 265 -44 -397 -219 217 -116 -275 90 264 -129 -355 -188 56 -80 -258 -36 243 220 -145 207
3500 207 258 98 -67 -91 288 -26 -297 16 290 141 -150 -25 71 -53 -534 -152 217 -16 -122 -113 261 103
3522 103 -10 82 307 91 -325 -272 253 40 -124 266 518 163 -53 -192 47 -72 -336 -278 21 -81 -109
3543 -109 -80 254 43 -180 -229 -22 50 -65 -81 258 404 184 -131 190 344 -75 -175 4 34 -127 -320 -14
3565 -14 274 72 -239 97 -81 -152 -383 -256 125 -171 -365 245 473 193 -44 161 390 -31 -266 11 208
3586 208 -34 -297 96 412 28 -321 -314 105 -252 -465 -239 254 148 -203 248 272 214 -230 -105 288 62
3607 62 -243 -118 263 259 -236 118 342 268 -448 -295 30 37 -425 -318 156 174 -168 -10 236 -40 -278 -326 162
3630 162 231 -261 -75 483 248 -209 121 373 230 -251 -222 34 -99 -162 -156 112 135 -123 -263 83 -211 -438
3652 -438 -433 22 -106 -96 20 293 346 -9 -21 153 119 -221 -122 62 186 0 66 141 236 -162 -364 -34 43 -289
3676 -289 -455 -172 347 62 -142 79 224 8 -319 -276 122 -217 -199 73 334 498 46 141 344 -76 -380
3697 -380 -235 83 36 -442 -159 196 232 -209 -109 22 -133 -387 -153 95 178 -135 5 580 469 -20 121
3718 121 481 56 -383 -226 405 175 -242 1 404 140 -370 -323 95 -131 -673 -383 230 147 -283 54 466
3739 466 303 -241 -95 301 236 -160 -112 527 418 -100 -7 258 43 -380 -547 15 -33 -578 -257 294 418
3760 418 -63 -78 285 292 -252 -319 132 121 -81 -71 437 408 109 188 39 165 -337 -374 -5 34 -127 -193 152 276
3784 276 -74 -305 -43 -60 -565 -345 -20 213 3 19 357 322 -8 -137 24 94 -93 -170 248 305 45 -299
3806 -299 -7 267 -177 -315 -195 -165 -29 -377 -212 135 163 -169 85 269 249 -263 -273 351 215 -179 -39
3827 -39 397 151 -123 -27 425 46 -445 -417 77 31 -347 -119 241 264 -273 -199 105 180 -396 -263 288 304 6
3850 6 116 367 467 -60 -311 259 203 -285 -513 235 17 -256 -70 224 277 -514 -594 101 -14 -364 -271 334
3872 334 357 -79 -153 407 415 -122 -302 136 289 -273 -187 259 388 -106 -180 157 144 -336 -472 -319 -27 -329
3894 -329 -414 -17 345 -55 -90 211 364 -23 -344 26 164 138 -72 369 446 347 -194 129 179 -119 -259 -54
3916 -54 128 -51 -217 -66 203 -19 -405 -175 -79 -9 -435 -164 245 230 -13 30 448 219 -222 -89 61 37
3938 37 -418 -36 317 312 -213 -240 300 113 -386 -404 8 -48 -170 -169 266 195 -82 -215 295 261 -182 -357 210
3961 210 110 -94 -161 467 500 87 -221 94 230 -427 -495 -24 194 -220 -220 301 453 -140 -374 1 97 -161
3983 -161 -412 194 441 3 -112 249 297 17 -344 -110 94 -187 -406 154 412 -12 -274 36 326 -73
4003 -73 -450 89 189 -407 -374 198 559 239 -65 167 358 -96 -272 22 300 6 -88 -15 371 68 -240
4024 -240 -146 34 -155 -410 -286 99 26 -104 185 477 66 -163 43 187 92 -308 -6 399 281 -154 48
4045 48 393 211 -193 -247 -8 -38 -450 -300 -25 349 -99 -144 150 176 -304 -254 52 87 -289 -71 213 464
4067 464 147 -182 300 234 -104 -333 -41 148 -144 -386 140 294 -36 -307 127 165 -369 -481 -110 172 -47
4088 -47 -119 291 487 60 -297 66 290 -280 -467 122 296 15 -206 232 450 -70 -454 -43 144 -208 -531
4109 -531 -128 216 -76 -268 118 509 -41 -472 -149 277 -56 -306 295 656 130 -114 50 440 127 -389
4129 -389 -153 27 -245 -466 -140 285 163 -270 -6 236 -180 -490 -196 153 -190 -9 60 340 298 -121 173
4150 173 283 -37 -315 -161 135 105 -20 -138 320 150 -267 -137 -8 -158 -387 -374 40 176 -151 -140 277
4171 277 420 -59 -231 97 186 -125 -144 99 365 19 -120 231 335 -107 -445 -75 125 -287 -194 -127 339
4192 339 -53 -176 85 231 -189 -457 -51 192 -161 -214 187 464 89 -200 118 165 -64 -380 23 146 12
4213 12 -363 121 448 20 -354 -68 294 -182 -493 60 305 52 -192 285 623 141 -152 72 299 -25
4233 -25 -383 41 351 -8 -170 -83 216 77 -424 -322 24 -159 -610 -125 453 198 -71 142 239 324 -185
4254 -185 -80 287 -64 97 -70 330 260 -66 157 28 94 -430 -466 60 -25 -306 -54 73 201 70 -111
4275 -111 232 -59 -331 -226 139 225 -33 37 328 497 -22 -48 79 48 -297 -398 -60 176 -104 -191 229 151
4297 151 57 -439 -210 88 -273 -372 38 246 40 -121 245 395 151 -237 -48 362 -71 -166 -158 426 124 -8
4319 -8 55 198 -72 -394 -183 -2 -192 -408 43 275 203 -244 -46 327 -214 -486 -148 262 222 -251 88 282
4341 282 304 -300 -230 184 -105 -538 -382 114 -113 -248 -220 378 164 -521 -234 154 2 -242 -56 254 384
4362 384 90 63 370 241 -164 -218 204 -43 -176 -137 159 128 -200 -85 139 51 -380 -389 181 308 -388 -152
4384 -152 220 318 25 -71 272 286 -207 -385 144 67 -107 -158 128 146 -97 -188 147 -121 -461 -307 -75 252
4406 252 -139 -54 32 305 55 -131 -78 291 -95 -227 9 281 68 -167 269 433 4 -429 -156 44 -206
4427 -206 -492 -194 198 56 -333 11 95 9 -301 -183 105 -63 -265 11 359 341 -169 134 398 211 -356
4448 -356 -180 124 -8 -468 12 322 112 -193 -167 53 -122 -557 -416 121 100 -125 24 403 262 -122 -258
4469 -258 246 238 -223 -106 285 256 -115 -137 143 169 -150 -301 60 -198 -446 -401 257 167 -103 -34 264 267 -153
4492 -153 -231 102 251 -83 -163 396 443 126 106 441 302 -398 -211 7 -9 -320 -216 40 230 -156 -247 160
4514 160 37 -155 -396 -47 200 -173 -128 179 420 29 -42 98 248 -29 -316 29 65 39 -250 -121 115
4535 115 -104 -498 -364 139 -124 -273 -95 81 131 30 95 381 158 -275 -45 263 -21 -312 103 271 244
4556 244 -32 32 38 154 -303 -406 3 -58 -295 -287 215 253 -109 -61 193 114 -336 -214 125 268 -143 70 399
4579 399 344 -37 -279 27 109 -288 -480 -20 -13 -36 -189 133 311 -134 -191 25 218 -254 -121 100 233 104
4601 104 -71 331 471 -94 -155 348 122 -415 -242 179 174 -183 -167 5 188 -237 -539 -58 76 -279 -227 -7
4623 -7 282 83 -80 110 260 87 -190 164 365 20 -10 112 444 146 -75 -15 96 -251 -232 61 -33 -194
4645 -194 -382 -2 340 10 -199 44 5 118 -172 36 291 33 22 221 250 267 -107 -137 144 72 -353 -170
4667 -170 85 201 -280 -103 272 90 -220 -190 -28 -2 -211 -227 283 421 -30 -133 441 228 -129 -79 184
4688 184 172 -113 -60 188 361 -185 -145 131 108 -306 -480 -15 158 -266 -160 205 286 -70 -279 165 216 -168
4710 -168 -387 93 198 -13 -114 325 322 -56 -263 26 28 -241 -523 11 213 -186 -252 25 219 -274 -365 -179
4732 -179 216 -253 -283 168 293 66 -164 108 337 -178 -101 20 190 -166 -231 123 475 104 -251 -139 96
4753 96 -156 -330 -216 45 -107 -313 103 172 254 -56 -23 71 -170 -236 55 100 -1 -148 -70 356 41 -16 -127
4776 -127 -32 -171 -407 -86 161 176 -120 -73 178 124 11 -243 188 163 -132 -16 217 396 -84 27 383 194
4798 194 -177 -204 -125 13 -148 -118 -44 -19 -175 -212 -46 145 -255 -218 188 107 -186 -186 161 451 11 -212 201
4821 201 235 -119 -232 43 135 -31 -317 128 302 -89 -310 -65 81 -235 -402 -175 68 -14 -288 227 371
4842 371 41 -242 -66 217 -80 -251 137 341 -53 -99 82 246 -175 -318 -190 99 -266 -326 -203 130 57
4863 57 -117 21 259 -55 -141 49 116 13 42 96 454 143 -237 68 58 -98 -303 -244 109 -94 -289 59
4885 59 266 139 -179 -291 12 -118 -346 -160 135 171 -70 -175 367 54 -14 -76 173 -80 -135 -2 79 85 16
4908 16 -73 260 146 -291 -245 -66 -127 -221 -153 34 179 -63 -196 275 364 -17 -109 130 165 -96 -284 272 364
4931 364 -48 -76 95 96 -89 -406 -37 85 -240 -106 69 145 8 -89 60 157 -184 -309 -121 278 -68 -153
4953 -153 170 342 56 -151 -33 290 -49 -359 -70 149 -78 -161 132 31 -55 -175 -128 164 -21 -205 -323
4974 -323 440 122 -121 41 229 -116 -188 -140 7 129 -111 -60 267 144 -43 13 204 -46 -409 -98 -48 -28
4996 -28 -271 -135 221 63 52 -43 127 -28 -108 -43 47 54 9 61 264 67 -93 -31 64 36 -412 -100 89 114 -137
5021 -137 -206 122 104 -12 -120 5 164 -117 -99 54 194 51 -38 272 15 132 -163 142 205 -219 -263 42
5043 42 62 2 -16 76 341 -242 -287 26 -97 -149 -266 71 186 131 -176 130 204 3 -249 -122 251 -90 -213
5066 -213 -44 353 57 -315 110 230 -134 -357 -58 36 46 -158 -129 220 -33 -197 -24 149 -89 -193 -5
5087 -5 235 -4 -144 36 262 206 -204 -62 121 -36 -358 -16 170 32 -55 1 153 -83 -163 -34 153 -157
5109 -157 -177 -40 336 129 -168 -8 234 127 -18 -164 12 166 -129 -86 125 367 -43 -17 39 122 -175 -184
5131 -184 110 219 120 -27 211 173 156 35 124 41 -180 -284 -19 320 -122 -106 176 17 -99 17 156 -29
5153 -29 -237 -127 -23 111 -138 -28 -26 261 -72 24 -17 204 -128 -30 -17 185 16 -51 51 164 140 -320 -56
5176 -56 -46 -62 -37 -75 328 104 -355 -8 99 -64 -243 -101 212 -93 -127 -12 279 44 -45 -40 125 37 -217
5199 -217 -213 226 75 -293 -101 0 -65 -57 -161 -14 -91 -352 -14 -18 141 -118 97 321 83 -152 -76 180 57
5222 57 -250 -117 373 137 -46 154 261 226 -281 -87 23 0 -275 -147 48 179 -108 50 -33 38 -143 -395
5244 -395 36 52 1 34 158 217 -41 0 -37 145 -31 -82 183 143 -8 -31 236 95 -121 -257 -71 4 -49 -284
5268 -284 -27 108 -16 54 109 365 -14 -261 -70 178 -107 -153 4 202 121 -168 112 54 122 -190 -47 131
5290 131 -69 -91 -112 69 82 40 9 187 180 -228 -241 294 -58 -54 46 316 266 -35 64 326 8 -204 -64 251
5314 251 42 -233 53 234 118 -209 -230 -37 -7 -253 -80 149 30 -193 94 285 79 -215 -61 177 239
5335 239 28 -161 176 164 -78 -53 159 273 -149 90 97 80 -174 -138 25 164 -175 -119 170 70 -298 -170
5357 -170 81 12 -104 -260 59 44 -26 -19 51 133 -155 -69 -15 -137 -104 33 107 66 -48 45 51 -57 -1 -49 52 86
5383 86 34 -8 127 100 21 -126 41 3 -198 -198 -68 115 -72 -233 -13 102 -111 -197 -110 -43 7 -267 -131 34
5407 34 192 -132 -81 160 112 -177 -41 115 53 -69 -7 102 212 -43 185 149 -93 -194 -162 64 211 -81
5429 -81 -187 52 56 -68 -242 158 -3 -292 -234 239 -83 -294 -28 242 142 -196 -40 12 109 -201 -200 201 24
5452 24 -78 -11 143 96 -270 -260 116 -16 -323 -22 130 265 -58 6 83 246 -5 -208 -15 -34 -62 -75 -7
5475 -7 244 -110 -209 177 182 -101 -163 -88 9 -124 -32 56 195 -5 -172 152 127 -245 -320 6 1 -177 -40 101 120
5500 120 139 -67 73 271 18 -227 -35 22 57 -139 -28 93 239 -212 -13 72 -35 -206 55 112 22 -69
5522 -69 19 176 241 -106 -170 35 -234 -58 36 70 63 -76 -163 208 -57 -218 -209 109 55 -76 -129 105 -100 -232
5546 -232 -77 265 166 -183 -121 260 154 -228 29 107 142 -97 -130 20 12 -162 -328 84 147 -231 -92 71 84
5569 84 -170 143 98 210 -111 -274 179 197 -70 -137 201 131 -89 -152 -11 256 -239 -82 224 172 -152 -55 252
5592 252 104 -160 -171 59 187 -99 37 139 201 -22 26 179 63 -57 -148 -10 21 -92 -145 -70 193 12
5614 12 -173 15 133 -32 -242 -1 161 -97 -155 -62 252 106 51 68 51 126 -176 -70 110 89 13 121 150
5637 150 199 -190 -23 -109 -71 -95 0 184 -24 -17 50 283 75 0 -265 -31 -105 -122 -81 -35 133 2 -138 39
5661 39 -24 -208 -70 -15 84 -25 -270 68 178 12 -57 172 186 -146 -201 163 -21 -103 -47 62 125 -34 -59 50
5685 50 61 -88 -363 24 189 -112 -84 179 48 -228 -220 -27 118 -149 -173 121 112 -107 -98 348 309 -117 -189 -7
5709 -7 73 90 -54 56 118 142 -230 68 132 11 -225 58 -29 -180 -176 176 -26 -28 -11 110 43 70 -122 -205 222
5734 222 45 24 105 74 68 -183 -51 63 -140 -268 -51 151 183 -129 -32 134 -72 -212 -83 -1 -104 -205 -82
5757 -82 76 172 -61 77 96 65 61 25 190 65 -89 -56 132 129 -108 -26 52 3 -132 -135 74 -28 -199 -115 27
5782 27 197 -74 -217 110 31 -183 -86 234 109 -86 86 106 158 -109 -129 -30 160 -134 -185 168 183 -64 -127
5805 -127 148 19 -46 -301 4 100 -99 -211 -18 279 22 -133 150 1 1 -140 23 -72 -21 -155 67 72 -20
5828 -20 -37 63 96 -28 -299 -115 137 43 57 137 125 -58 -103 138 183 84 -216 79 26 20 -161 61 155 40 -194
5853 -194 48 178 -85 -94 31 3 39 -99 106 214 19 -106 25 -4 -15 -378 -93 166 46 -9 51 154 15
5876 15 8 -266 114 46 -68 -20 -18 112 -29 -98 45 -52 -256 82 -100 -49 -49 -156 78 122 89 -68 258 57 -75
5901 -75 -154 -48 30 -65 -132 24 178 21 -132 106 130 -130 -122 8 265 -338 -222 -35 234 103 -218 125 104
5924 104 34 -226 9 227 -9 -61 181 129 -95 -124 -5 23 -119 -135 38 67 -3 -197 101 245 60 -128 135
5947 135 102 -35 -217 37 77 6 -81 231 265 -80 -199 1 71 50 -126 -21 138 84 -259 -86 189 -94 -92
5970 -92 85 36 62 -188 100 235 99 -68 3 58 132 -159 2 144 -135 75 34 70 -27 -19 -11 -31 -65 -198 -80
5995 -80 27 139 -66 -117 -23 114 -176 -150 18 80 -124 -153 218 -80 -160 94 65 268 -41 -304 -10 -80 -139
6018 -139 -57 93 99 -31 -69 207 45 -188 -266 9 50 -136 -68 174 156 -146 -134 142 216 71 -165 54 36 -3
6042 -3 -169 135 117 24 -154 -44 -3 -142 -206 -69 22 -181 -107 102 169 -1 -161 40 151 46 -88 264 191
6065 191 -178 -7 97 179 -95 -124 -46 67 -132 -149 -105 139 -59 -204 -106 84 42 -129 -47 121 159 -205 81
6088 81 271 27 -16 66 164 31 -289 -120 71 73 -218 66 63 21 -6 -9 191 -61 -181 -47 62 15 -99 -50 159
6113 159 287 -88 -50 131 37 28 -17 1 1 -56 -12 -135 152 -130 -198 -54 40 -60 -84 168 59 44 -46 79 6
6138 6 -115 -114 296 226 -24 -86 265 140 213 97 133 266 6 -177 -45 94 -49 -99 102 152 -113 -210 -5 117
6162 117 -73 -225 -8 110 -40 -85 207 212 -14 -67 190 118 44 -72 60 87 114 -66 43 215 -56 -371 -33
6185 -33 1 77 -72 136 276 57 34 116 165 14 -169 117 232 8 62 -65 67 57 -140 38 -18 -50 -108 -135
6209 -135 74 14 -42 -96 15 162 52 -76 51 100 1 45 135 162 -110 49 227 267 13 58 139 1 -127 -107
6233 -107 135 106 22 -78 173 42 -137 -154 -49 46 -77 -70 51 226 -71 -30 298 303 -2 -6 -155 223 89 -177
6257 -177 -17 167 64 -216 -84 130 -63 -430 45 15 -16 -113 144 182 84 -50 103 167 7 -123 -42 244
6279 244 21 -111 28 251 11 -185 -2 80 -68 -354 -91 -9 -3 -252 97 99 61 -260 3 82 -127 -69 37
6302 37 120 122 -101 27 92 87 -212 -106 132 58 -132 -13 206 14 -173 109 250 -17 -130 32 -60 -109 -110 -60
6326 -60 56 70 -106 4 152 139 -32 -170 213 58 -196 -17 171 15 -97 -84 -56 -83 -239 -39 17 75 -12
6349 -12 -163 233 188 -28 -223 22 198 -267 -184 411 169 73 -9 116 125 -119 -124 -136 143 -120 -133 -119 205 25
6373 25 -74 -90 175 -35 -193 63 28 0 -119 -52 234 253 49 107 49 -68 -213 -120 144 28 -125 -37 194 -136
6397 -136 -25 -37 158 15 -175 -95 45 -18 -62 -24 186 71 -162 -69 313 78 -328 -122 196 60 -229 0
6419 0 278 72 -184 -162 94 199 -134 -206 179 -72 -49 13 111 18 -47 -21 218 191 -17 -111 116 145 -84 -57 193
6444 193 222 -258 -275 101 88 -208 -217 -108 -103 -131 -247 152 169 -224 28 55 37 -66 211 291 83 -111 -5 63
6468 63 112 -289 0 167 150 -141 62 32 109 -111 -143 151 25 -266 -156 -34 -37 0 70 103 52 16 -58 75 274
6493 274 -90 -119 -29 288 136 -192 -166 227 41 -205 18 -17 52 -279 -152 36 -42 -48 -166 146 124 -249 7
6516 7 123 -27 -130 1 201 93 -96 0 165 17 -218 53 126 18 -36 -291 88 -11 -300 -111 -18 -114 -249
6539 -249 -283 218 66 -245 62 181 163 -259 -49 28 -109 -131 0 122 123 -66 -141 206 10 -297 -151 -100 38
6562 38 -98 -215 91 169 -40 -98 215 319 -54 -32 117 170 3 -184 271 240 134 -90 16 -99 -124 -98 -28
6585 -28 -65 -214 -128 -74 54 -172 -99 -80 295 -182 -86 184 107 87 19 243 145 -12 -37 -61 6 -221 -209 -121 183
6610 183 -208 -73 -55 216 -59 -329 -89 37 67 -151 -112 243 86 109 36 -20 88 -137 -26 49 0 30 -3
6633 -3 288 99 -64 144 87 -109 -230 -189 10 39 -15 -234 60 178 -14 -81 116 177 147 -46 169 103 55 95
6657 95 134 218 -88 -63 125 158 -368 -22 125 314 -124 -146 115 14 -203 -172 43 41 -68 -26 47 40 -43 124 231
6682 231 154 14 -116 138 120 -164 -211 35 58 -78 46 211 122 -99 -410 -39 148 -20 -45 36 154 41
6704 41 -61 67 202 -12 -84 -29 146 169 23 143 11 16 -109 -88 19 -4 -203 -137 100 -57 -16 -93 186 3
6728 3 -70 -67 70 85 -164 60 190 18 -21 -38 131 177 -72 178 111 116 -283 -121 262 14 83 88 91 97 -52 -92 84
6755 84 9 -350 -104 162 262 -167 -25 89 74 -16 -25 147 157 -110 -96 84 61 -45 -111 112 -50 -206 -234 150
6779 150 50 -78 -156 293 312 -72 -222 182 167 -131 -199 64 87 -119 -109 15 69 -118 5 13 138 76 -200
6802 -200 39 120 -77 -296 90 -9 -106 -307 49 34 -64 -164 -46 279 -26 34 49 332 29 -120 39 102 -117
6825 -117 -175 45 109 -183 -243 -152 172 32 -141 175 122 -12 -55 129 86 -57 -159 -9 121 -23 -5 -131 191
6848 191 126 -10 -78 96 46 -266 -34 69 75 -99 -86 45 -99 -146 -102 86 195 -109 -180 189 87 -174 -118
6871 -118 205 300 9 -131 211 169 -170 -137 32 125 -128 -209 -53 140 -157 -349 -5 -64 -21 -1 203 150 -28
6894 -28 -50 314 183 -130 -146 93 122 -169 -151 10 109 43 -54 -2 154 30 -175 -52 36 -90 -210 39 207
6917 207 23 -119 46 306 26 -162 -134 109 -94 -176 2 98 -148 -149 57 343 -231 -152 162 -14 -227 -150
6939 -150 37 241 191 -38 4 352 21 -216 -20 201 66 -58 168 207 5 -83 67 173 60 -211 96
6960 96 121 -106 -68 23 156 -20 -190 -173 43 76 -123 -115 59 88 -139 -178 79 132 -223 -125 135 80 -145 -113 140
6985 140 83 -63 -70 6 168 9 -163 53 264 -443 -166 83 195 -38 -92 85 123 -64 -372 181 -48 -93
7007 -93 -41 107 152 30 -214 19 204 -147 -270 -39 63 55 -112 -47 198 -172 -122 -43 132 -4 -143 62 237
7030 237 105 -152 52 53 92 -108 29 197 195 -227 -18 119 -36 -137 57 67 77 -232 -80 132 24 11 25
7053 25 301 169 -199 73 45 16 -182 -140 96 119 -139 -59 95 21 -30 24 190 -45 -276 -143 43 37 -141 -190
7077 -190 16 41 -219 -142 130 198 -52 98 25 -85 -32 -13 268 -83 -162 28 24 100 -285 -115 35 39 -34 -153
7101 -153 15 25 -194 -119 -54 46 -192 -17 157 56 -77 -120 113 105 -120 15 108 99 -99 -285 150 57 -48
7124 -48 -122 -105 176 -136 -58 -84 133 -63 -165 15 154 -56 -147 -45 97 -123 -155 -180 84 65 -86 -165 289
7147 289 31 -205 -52 66 -9 -179 -5 -13 -69 -147 -5 128 66 -106 -9 64 109 -139 24 210 148 -24 -75 181
7171 181 111 -201 -105 210 25 -238 -34 158 65 -128 -129 133 -23 -198 -246 111 282 -268 -35 129 51 -8 -132
7194 -132 202 154 -118 18 14 145 3 -139 112 200 -75 -50 205 69 -278 -239 16 173 -2 -135 112 47
7216 47 26 -5 151 11 -133 -158 62 210 -10 -107 34 139 -201 -88 -74 26 80 -40 -2 148 8 -190 78
7239 78 153 -160 -140 -58 137 -47 -20 -10 185 75 -268 -10 59 33 -161 -219 42 54 -250 -43 37 128 -192 -38
7263 -38 99 4 -182 -108 86 158 -368 82 266 190 -145 43 255 3 -248 91 165 -16 -102 5 142 111 -43
7286 -43 -90 148 78 -209 -268 141 137 -105 -15 86 57 -247 -38 245 37 -125 -29 -13 125 122 -177 218 15 -135
7310 -135 -39 146 7 -125 -187 83 78 -109 -11 67 105 -42 -167 52 102 -167 18 62 143 -6 -5 85 146 -165 -197
7335 -197 -124 121 -36 -58 107 -28 15 -261 -68 12 31 -130 -185 178 50 -231 50 122 0 -143 -22 179
7357 179 -23 -135 118 145 -14 -26 -149 134 -30 -330 -12 193 69 -202 -90 112 30 -296 -131 191 103
7378 103 -150 -193 5 70 -196 -85 121 24 -159 79 97 199 -205 105 237 192 -125 -122 274 128 -144 -71 186
7401 186 26 -231 -268 41 277 13 -113 32 100 -231 -116 -5 36 -47 -28 23 126 -83 -266 18 41 -89
7423 -89 -241 24 44 -164 -154 106 296 -157 -112 99 20 12 -113 -16 130 -97 55 91 193 -102 -202 15 -43
7446 -43 -266 -101 43 69 2 -105 135 238 138 -181 5 128 -10 -172 98 156 -1 -69 -222 143 32 -51
7468 -51 27 62 -163 -106 -211 -56 18 -243 -89 151 -107 -5 -161 32 -52 -13 141 125 58 6 4 217 169 -99
7492 -99 82 14 71 -189 69 118 72 -109 -286 -8 -61 -206 -311 25 101 -143 -96 -13 102 -54 -303 -32 192
7515 192 -54 -45 128 233 -80 37 162 72 -11 -90 -79 71 -171 -261 -82 245 -63 -267 91 226 97 -22
7537 -22 -62 182 -77 -27 156 103 -89 -108 248 190 -38 -165 -98 71 -64 -139 -74 97 -13 -86 57 91 -110 -175
7561 -175 -62 74 21 -4 51 213 10 -207 48 178 32 -268 -62 149 40 48 34 198 113 -178 -42 77
7583 77 -49 -98 -125 124 66 -93 -4 143 -40 -208 -90 -10 97 -82 -35 59 131 -41 206 121 133 -204 -148 74
7607 74 128 -161 -312 112 137 -254 -165 56 -32 -165 -119 150 107 -184 -49 149 193 102 -114 102 146 -62 -142 -39
7631 -39 172 -64 -86 -18 171 -90 -267 -113 261 -63 -157 -5 96 -51 -110 -59 215 13 -134 142 248 22
7653 22 -169 125 180 36 -212 -51 163 -158 -250 98 108 -136 -99 -4 176 191 -41 188 132 81 -142 88 239
7676 239 -102 -32 109 164 113 -112 -39 128 -42 -95 -101 242 -16 -388 28 -27 2 -167 97 114 43 -225 13 156
7700 156 181 -170 -4 136 45 -50 -20 149 90 -181 -126 16 78 -232 138 55 -175 -64 -279 43 72 -164 -92
7723 -92 108 -20 -15 -82 62 19 53 -181 135 284 -35 -36 84 123 -172 -37 49 175 20 -161 83 170 -133 -214
7747 -214 -17 151 55 -101 60 287 -34 -63 -32 154 116 -190 252 278 -20 -148 37 161 -68 -301 -159 13
7769 13 -175 -266 24 150 -7 -86 -14 125 -106 -158 5 254 59 -109 -22 276 34 -190 -90 231 83 -168
7791 -168 25 155 118 -314 -134 111 24 -53 -179 -13 -161 -219 -149 84 -4 -91 -66 128 114 -63 -86 151 99 -35
7815 -35 128 191 24 -121 37 109 -49 -75 -179 27 111 -13 11 117 91 119 -208 50 134 -150 -54 46 181
7838 181 -255 -89 147 131 36 35 16 75 -190 -246 61 114 -53 -172 83 201 -11 -118 -153 19 124 -74 -54
7861 -54 193 -94 -183 -32 213 181 -104 78 299 151 -169 -44 -53 40 -255 -130 113 -209 13 -55 46 90 -120
7884 -120 10 87 94 -251 -96 203 -81 -57 -67 134 77 -205 -95 0 171 -219 -153 4 -42 -270 53 198 -145
7907 -145 -173 58 186 78 -174 52 219 206 17 -110 201 106 -132 16 225 20 -26 12 95 132 -44 -150
7929 -150 3 201 -61 -95 -60 25 1 -211 88 -15 62 -144 30 71 -38 -67 42 182 -70 -28 38 72 -94
7952 -94 -112 65 51 -118 88 -71 35 -73 -136 76 50 1 -151 177 -102 -24 0 -46 156 38 -188 110 62
7975 62 74 -77 -197 28 -88 -106 -186 -3 54 -123 -28 91 72 -116 -164 -26 -19 -167 -36 113 185 -93 -1 236
7999 236 96 -111 -4 251 70 -96 -181 300 -31 -126 -58 82 29 -81 -257 65 -69 -204 -116 90 -30 -212
8021 -212 -129 260 128 -176 -90 37 12 -105 8 63 -211 -39 42 94 142 -276 -38 -15 7 -73 -69 56 -35 1 -126
8046 -126 280 190 -26 26 78 -2 -51 -67 -11 153 17 -90 252 119 -179 -229 -69 -46 -92 -137 -52 98 -40 -134
8070 -134 -84 99 -42 -104 0 176 -52 -8 -62 103 69 -56 -50 45 40 -77 -119 174 81 -62 -141 112 -6 -160
8094 -160 23 123 -54 -158 22 -93 -17 -127 15 151 65 -111 5 170 101 -97 -52 235 178 -77 -200 200
8116 200 73 -119 -186 174 -36 -150 -96 48 12 -100 -62 126 -24 -69 48 79 -20 -121 -76 81 -45 -171 -189
8139 -189 78 129 -120 -250 26 -40 -73 -93 127 75 -64 -188 229 219 -92 -158 117 125 -182 -45 139 46 -73
8162 -73 -96 5 -22 -116 -172 130 224 -111 -261 60 22 10 -112 11 -60 36 -276 -49 72 5 -153 70 190 44
8186 44 -117 113 80 29 40
8191D0
$$ Imaginary data points
##PAGE= N=2
##DATA TABLE= (X++(I..I)), XYDATA
0 0 0 0 0 0 0 0 0 0 0 0 0 0 0 0 0 -8 8 -8 8 -8 8 -15 16 -16 22 -24 28 -32 39 -41 49 -56 63 -71 80 -91 100
37 100 -113 126 -142 157 -175 194 -215 237 -262 289 -320 350 -387 426 -468 518 -570 631 -698 777
57 777 -865 971 -1093 1243 -1428 1664 -1972 2406 -3046 4102 -6151 11641 -58671 -166208
71 -166208 -95352 -34568 5185 67557 195909 272519 250398 198054 180923 125334 14767 -66758
83 -66758 -56594 -31023 -47382 -51050 -404 15174 -48618 -118586 -135902 -154375 -203377 -213024 -136042
96 -136042 -47300 407 48141 123675 169286 141446 95535 91324 88512 51526 30799 67100
108 67100 109278 100584 72350 67390 44240 -32087 -112908 -147716 -155795 -173441 -177043 -127781 -60090
121 -60090 -28287 -18982 5515 30995 19551 -7877 2120 40008 60758 73672 110420 154560
133 154560 159834 123981 90642 65928 15325 -51496 -87414 -82827 -79418 -93122 -83705 -48365 -38397
146 -38397 -64896 -81475 -70042 -65717 -81401 -69562 -11896 41704 63023 87623 132018 151625
158 151625 116773 76464 69358 55422 10169 -18207 719 18997 -3240 -26387 -16908 -21534
170 -21534 -71264 -116030 -113811 -99531 -111045 -106687 -48142 11873 25305 31504 68193 92059 63787
183 63787 32276 46786 65678 47469 35511 65525 91341 65876 25850 18528 6194 -50214
195 -50214 -102964 -103191 -86002 -96016 -100112 -57074 -11500 -13293 -25230 -5257 14590 -2062 -19170
208 -19170 9535 50883 59376 62721 94791 120878 99057 57085 40917 28687 -15855 -57947
220 -57947 -56323 -38449 -44857 -56855 -39823 -19907 -37595 -66741 -66237 -52591 -56868 -60478 -27538
233 -27538 23496 48107 55850 79080 101171 88602 54230 38259 38689 22762 -160 2596 21504
246 21504 21410 73 -13479 -16927 -39743 -78752 -96485 -87019 -76661 -72563 -50454 -6166 24202
259 24202 27489 31052 44846 45799 26016 14721 31551 48395 46162 48479 67554 73682 46389
272 46389 11083 -4586 -22009 -59843 -86368 -76283 -55416 -53490 -51190 -24475 -581 -11219
284 -11219 -29005 -20416 -5626 -12078 -16159 15255 55861 65387 63273 79926 91020 63390 21482
297 21482 7367 5118 -20835 -45474 -32965 -9506 -14826 -32814 -27297 -17131 -40972 -71782 -66863
310 -66863 -44267 -40692 -38680 -2573 43995 55142 46739 58146 70639 49110 15259 12606 28024
323 28024 20232 3864 16985 37628 24864 -7845 -20475 -22094 -48574 -81991 -79235 -53777 -44319
336 -44319 -42367 -16592 19667 25724 10163 12743 25789 18072 1293 10637 39231 49493 43250
349 43250 51163 63882 49244 13003 -10007 -17056 -34918 -60100 -59947 -37389 -25995 -28880 -22654
362 -22654 -6615 -6891 -26472 -34262 -21780 -12937 -11862 2540 35287 58577 58685 56314 60955 52295
376 52295 23627 -1022 -5183 -5366 -16786 -21331 -6902 3471 -7452 -23756 -27037 -30042 -49591
389 -49591 -64270 -51814 -29426 -18731 -8163 19711 46705 46291 33221 34186 37283 21335 2641
402 2641 8913 27411 27290 17226 24256 32813 13854 -19391 -33950 -34760 -50362 -69056 -57174 -27902
416 -27902 -16498 -17505 -2440 19992 15862 -4896 -4773 11063 10680 2663 18348 48528 55658 42001
430 42001 41315 46998 26333 -10286 -25517 -20716 -28233 -45354 -36702 -11024 -7184 -21862 -21986 -10138
444 -10138 -18020 -40375 -38963 -14703 -2618 -1806 17048 49313 58761 43112 36910 41627 27714
457 27714 -676 -9245 2861 5506 -5814 -2942 11894 7710 -16509 -31015 -31203 -39047 -56021
470 -56021 -54487 -29595 -11298 -6239 7047 29384 36655 22781 13489 18950 17981 6419 6620 23526
484 23526 35752 30854 24822 27783 20156 -5916 -28991 -34602 -36010 -44906 -46694 -28074 -9055 -6659
498 -6659 -8089 -159 4934 -5429 -17333 -10483 4175 9232 13679 31265 50836 49807 35334 29203
512 29203 25177 4755 -19125 -23783 -15175 -15697 -22462 -14039 777 -3068 -20346 -25893 -21244 -26725
526 -26725 -39475 -31410 -4864 9435 11285 24415 44934 45230 25228 16014 20660 12569 -5247
539 -5247 -5438 12124 17815 5788 2632 10866 1689 -25840 -39402 -33260 -34131 -44814 -36672 -7876
553 -7876 7197 3713 8613 23804 23143 3710 -3093 10127 15073 6571 12379 34281 41375 25267
567 25267 14733 17286 5274 -23233 -36825 -28147 -24756 -32495 -27614 -5798 3916 -6716 -11915
580 -11915 -3880 -4045 -17569 -19929 -1125 14037 14640 22234 40646 46582 31863 17788 15495 8011
594 8011 -10964 -20486 -11959 -4145 -7821 -10094 -1453 958 -14073 -28292 -27660 -25298 -30198 -29113 -10540
609 -10540 9940 16242 19358 29427 34850 24800 9824 6878 10546 5515 8 7842 19664 18071
623 18071 6588 1815 -75 -14293 -33543 -38243 -31093 -27477 -27007 -15866 3877 11345 5719 5287
637 5287 11412 8472 -3368 -3898 10995 19426 17213 22608 35271 34709 16997 3450 1206 -7928
651 -7928 -26775 -32920 -20393 -11654 -16224 -14428 -206 3170 -12220 -20598 -12545 -9279 -17105 -13664
665 -13664 8995 25093 23112 24120 36006 35958 16184 1201 3931 3385 -10763 -14716 682 8904
679 8904 -1281 -8529 -2297 -4544 -24758 -35969 -26738 -19070 -22541 -17436 5023 21413 17040 13184
693 13184 22210 22935 7127 -3294 5297 13339 7349 5943 19230 25610 12520 -1748 -3787 -8231
707 -8231 -25438 -36761 -28325 -17339 -17011 -14608 -11 11186 5051 -3410 -13 3324 -3460 -6775
721 -6775 4471 18600 21114 20101 26977 30645 18647 2356 -4144 -6469 -15276 -23557 -17662 -6348
735 -6348 -4692 -7995 -5622 -1193 -7411 -19225 -20425 -13473 -9972 -8751 1551 18567 26495 22973
749 22973 21774 24191 17539 3266 -4426 -626 1309 -3761 -2339 7507 9494 -1102 -10049 -10772 -14914
764 -14914 -27485 -31949 -20790 -10211 -8201 -2758 12467 21356 13496 6322 10655 11261 1033 -3465
778 -3465 8081 18286 14414 10875 18707 19799 3478 -12402 -13402 -13419 -25127 -30934 -17526 -4365
792 -4365 -6098 -8003 2309 8677 -2006 -12362 -5688 2030 -1930 -2421 13247 27724 24333 17669
806 17669 21985 22042 5690 -9787 -9184 -5192 -12212 -17178 -6177 3985 -2066 -10548 -7717 -5499 -16144
821 -16144 -25540 -17798 -5562 -4183 -2150 11983 25182 22253 13575 15003 16352 5755 -4748 -1016
835 -1016 7066 5594 1211 6568 11904 3034 -10170 -14052 -14314 -21347 -28276 -21480 -8552 -3654 -2367
850 -2367 5146 13525 11095 2429 801 4902 3501 75 5425 16554 20298 15911 14088 15229 7736
865 7736 -6673 -14912 -14425 -14727 -18869 -16685 -5604 447 -2979 -5023 -1921 -1954 -10054 -13977 -6156 2075
881 2075 3307 7145 18658 26249 20824 12640 12158 9639 -2131 -10915 -7140 -994 -3445 -6210 803
896 803 5778 -3141 -13676 -13335 -11345 -18074 -22594 -12035 1973 4261 4435 13911 21828 15079 3766
911 3766 4655 8343 1880 -4613 2936 13298 11119 3758 6134 8771 -2706 -16975 -18042 -13560 -17353
926 -17353 -21509 -11534 2483 3302 -956 4020 9916 3282 -6546 -3369 5599 4910 2367 11426 22300
941 22300 19636 9910 8336 9000 -1929 -15264 -15083 -8420 -9269 -12936 -6327 3638 1369 -7715 -7621 -3803
957 -3803 -8186 -14801 -9955 2263 7129 6897 13716 22093 19801 10148 5733 6229 1258 -7276 -6557 687
973 687 2933 -566 -684 2970 -694 -11376 -16650 -14489 -14472 -16439 -12710 -1231 7021 7266 8110 13043
989 13043 13106 5338 -608 2471 5504 2690 3122 10533 15181 10625 3518 2002 -643 -10924 -19510
1004 -19510 -17495 -12077 -12087 -11915 -3247 5307 3007 -2475 -539 2127 -2344 -7036 -1411 8215 10269
1019 10269 9314 15502 21404 15706 4785 1595 1933 -5747 -14402 -11312 -2787 -3161 -7276 -3453 2556
1034 2556 -2691 -12971 -13129 -7567 -8945 -12224 -4580 8903 12524 9262 13093 19083 13520 2101
1048 2101 3 4404 1655 -4572 -633 8140 7085 -557 -2141 199 -6487 -18204 -19148 -11885 -10534
1063 -10534 -12551 -5766 6436 9040 3599 4611 9316 5704 -2331 -1587 6176 8609 5629 8713 15821
1078 15821 14189 4619 -1092 -1310 -6253 -15676 -16999 -9868 -6451 -7817 -5087 1762 2903 -3453 -6290
1093 -6290 -3418 -2893 -5628 -3565 5502 12452 12296 12500 16537 15224 6545 -713 -1416 -2184 -7330 -8927
1109 -8927 -3117 1472 -893 -3860 -2948 -2857 -9448 -15317 -12828 -7508 -6947 -5315 3259 12474 12621 8841
1125 8841 10104 11408 5740 -1195 -405 4250 4002 1095 4325 9215 5554 -3193 -6460 -6041 -11300 -18727
1141 -18727 -15976 -7448 -4917 -5583 -68 8001 7667 689 -132 4240 2727 -2249 901 10328 12973
1156 12973 8688 9677 14349 9334 -2269 -6889 -4952 -7988 -14682 -12872 -3637 -1196 -5426 -4379 1155
1171 1155 -407 -8631 -9811 -2911 -697 -3071 1889 12728 16096 11262 10241 13483 9572 -675
1185 -675 -4505 -1027 -686 -5266 -4228 2565 3157 -3780 -7217 -5332 -7897 -14838 -15868 -8380 -3159 -3291
1201 -3291 683 9411 12595 8472 5396 7379 6582 601 -1042 4057 7754 5677 4619 7818 7057
1216 7057 -736 -7399 -8487 -9567 -13950 -15358 -9636 -3281 -2399 -1893 2217 5006 1382 -2999 -1424
1231 -1424 2100 1464 1338 7155 13463 13297 9685 9317 9072 2435 -5575 -7499 -5505 -6505 -9210 -6036
1247 -6036 -91 -218 -4896 -5466 -3417 -5685 -10788 -9368 -1961 1925 1779 6121 13536 14558 8853 5820
1263 5820 7494 4480 -2790 -3642 1501 3084 -650 -663 3795 1861 -6378 -10425 -8118 -9058 -14000 -12288
1279 -12288 -3201 1855 435 2571 8998 9724 2780 -56 4098 4637 -105 1330 8431 11235 6387
1294 6387 4037 6215 3552 -6230 -11159 -8553 -7593 -11378 -10516 -2534 1760 -1432 -2556 1577 1688 -3863
1310 -3863 -5662 -338 3815 2639 4555 11627 14322 9857 5539 5913 4032 -3859 -8064 -4824 -2610
1325 -2610 -4635 -5039 -738 1501 -3249 -7015 -6072 -5526 -8655 -9531 -3792 2806 4093 5009 9689 12562
1341 12562 8740 3990 3250 3514 546 -2240 639 4266 3731 1248 842 849 -3422 -9698 -11219 -9123
1357 -9123 -9133 -9602 -5598 997 3659 2348 3542 6022 4672 -40 -739 3310 4826 3482 5162 10114
1373 10114 10395 5134 1540 1338 -1775 -8680 -11366 -7515 -5315 -6808 -5656 -83 2111 -2310 -4743
1388 -4743 -1827 -1214 -4807 -4532 2451 7324 6344 7021 12103 12726 6089 1028 1958 1136 -4786 -6928 -1677
1405 -1677 1277 -2081 -3730 -340 49 -6468 -10594 -7606 -5186 -7439 -6858 799 6932 5688 4628
1420 4628 8775 9675 3722 -324 1926 4056 955 -173 4670 7449 3309 -834 -484 -1275 -7561 -12092
1436 -12092 -9453 -6296 -7093 -6246 -382 4046 2299 -88 2054 3362 -26 -2437 1309 5583 5471
1451 5471 4856 8488 10685 6520 1295 -294 -1003 -5145 -8843 -6895 -3328 -3057 -3699 -1738 655 -1280
1467 -1280 -5011 -5243 -3096 -3276 -3821 -349 5217 7734 6951 7775 9178 6710 1697 -849 -15 -484 -2806
1484 -2806 -2090 1499 2436 -685 -2631 -2221 -3629 -8462 -9916 -6674 -3981 -3818 -1841 3652 7168 5208
1500 5208 3299 4705 4828 761 -1445 1950 4716 3198 2124 5759 6734 1700 -3226 -3307 -3661 -8111
1516 -8111 -10742 -6466 -2151 -3031 -2874 1178 4125 659 -3006 -913 1491 -905 -1834 3264 8183 7124
1532 7124 4949 7302 8209 2598 -2960 -2684 -1715 -4824 -7324 -3197 1020 -857 -3573 -1562 -21 -3904
1548 -3904 -7706 -5237 -1410 -1975 -1929 3307 8237 7419 4665 5745 6711 2573 -2011 -780 1647 318
1564 318 -1607 1226 4100 1227 -2995 -3413 -3158 -6175 -9177 -7425 -2917 -1912 -1579 1615 5365 4791
1580 4791 1530 1029 2951 1540 -1002 764 4366 5200 3844 4257 5466 3174 -1590 -4388 -4428 -5006
1596 -5006 -7006 -6312 -2310 -76 -1298 -917 942 680 -2461 -3715 -1593 400 -169 1271 5376 7805
1612 7805 6456 4373 4914 3938 -559 -3900 -2681 -1185 -2468 -3209 -73 2132 -395 -3478 -3070 -2441
1628 -2441 -5205 -7298 -4106 214 670 730 4383 7496 5633 1896 2300 3142 184 -2528 -222 3209
1644 3209 2510 475 1980 3559 107 -4750 -4938 -3368 -5481 -7529 -4366 929 1002 -285 1890 4507
1660 4507 2215 -1778 -1113 1814 673 -967 2105 6144 5546 2579 2681 3769 103 -4711 -4924 -2584
1676 -2584 -3458 -5223 -2579 1481 1342 -1564 -1180 580 -1332 -4378 -3410 449 1418 805 3310 6770
1692 6770 6282 3015 1764 2580 350 -3306 -3341 -537 -43 -1303 -615 1717 1221 -2446 -3882 -2997 -3348
1709 -3348 -5118 -4243 -309 2149 1774 2737 4909 4808 1864 -63 446 934 -807 -904 1804 3641 2395
1726 2395 801 1213 862 -2697 -5542 -4743 -3455 -4094 -3747 -730 2463 1676 534 1352 2167 -153 -2360
1743 -2360 -942 1624 1976 972 3530 5857 4519 1197 421 760 -1925 -5200 -4159 -1319 -1317 -2518
1759 -2518 -739 2100 994 -2652 -2489 -688 -1764 -3887 -1748 2307 3356 2012 3618 5966 4211
1774 4211 322 -552 924 -520 -3107 -1715 1713 1694 -546 -441 1283 -400 -4404 -5026 -2494 -2611
1790 -2611 -3942 -1867 2403 3263 1479 1728 3616 2386 -1144 -1453 918 1426 -458 767 3932 3872
1806 3872 1186 -60 513 -928 -4255 -5129 -2766 -1758 -2621 -1325 1771 2347 188 -915 315 -249
1822 -249 -2011 -1926 743 2623 2058 2340 4393 4693 1633 -529 -455 -855 -2751 -3644 -1380 452 -210 -586
1840 -586 747 778 -1198 -3220 -2634 -1566 -2253 -2080 434 3087 3251 2115 2942 3542 1344 -1133 -1147 74
1858 74 -420 -1312 268 2585 1957 -271 -466 -173 -1792 -4525 -4103 -1496 -1079 -1786 207 3207 2892 480
1876 480 409 1627 514 -1926 -1329 1467 2242 697 1604 3841 2748 -437 -1708 -962 -1846 -4160 -3828
1893 -3828 -606 276 -941 -309 2044 1604 -1420 -2308 -154 -135 -1903 -795 2352 3653 2024 2021 3436
1910 3436 2579 -803 -1986 -715 -821 -2573 -2346 821 1504 -329 -963 377 -298 -3057 -3859 -1631 -585
1927 -585 -1395 -432 2665 3739 2361 1250 2168 1963 -999 -1796 -77 762 41 63 1664 2454 252 -1492
1945 -1492 -1121 -1570 -3317 -4151 -2247 -333 -585 -191 1724 2576 1094 -404 22 586 -405 -1237 590
1962 590 2652 2549 1567 2089 2723 883 -1689 -2131 -1544 -2136 -2963 -1914 395 818 -395 -196 569 -345
1980 -345 -2331 -2218 -467 132 -365 832 3229 3724 1905 1297 2212 1059 -1431 -1954 -390 -26 -906
1997 -906 -708 1278 1419 -960 -1965 -993 -1236 -3440 -3480 -897 558 -165 537 2741 3044 904 -239
2014 -239 1001 1088 -1003 -1355 1228 2237 731 380 1975 1805 -1035 -2762 -1584 -1488 -3101 -3118 -416
2031 -416 1170 -67 -272 1425 1575 -662 -1621 -228 760 -510 -367 2137 3374 1887 947 1788 1567
2048 1567 -966 -2722 -1473 -845 -1690 -1641 85 1302 116 -1181 -551 -219 -1810 -2467 -1124 561 338
2065 338 454 2155 3278 2008 966 827 693 -349 -1436 -670 624 389 -452 387 1074 60 -1678
2082 -1678 -1948 -1326 -1983 -2559 -1679 453 1207 742 982 2149 1513 -91 -468 370 497 -437 80 1899
2100 1899 2109 1123 201 618 51 -2188 -2704 -1765 -1374 -1973 -1597 283 1365 117 -537 466 538 -1066
2118 -1066 -1530 101 1400 755 1052 2796 3312 1571 61 629 489 -1580 -2549 -909 95 -744 -1224
2135 -1224 206 941 -982 -2210 -1217 -628 -1967 -2104 -171 1721 1124 803 2473 2947 1186 -356 402
2152 402 1022 -418 -1234 538 1756 451 -437 439 531 -1435 -2952 -2040 -1107 -1833 -2305 -218 1402 777
2170 777 23 993 1654 221 -933 129 1198 793 441 1704 2624 1657 296 434 354 -1146 -2569 -2033
2188 -2033 -981 -1059 -1188 -443 610 164 -969 -869 -208 -671 -1292 -361 1130 1570 1455 1726 2612 2055 502
2207 502 -52 313 -200 -1331 -948 187 455 -412 -645 -144 -361 -1494 -2375 -1485 -1119 -1252 -918 782 1681
2226 1681 1188 846 1450 1523 186 -530 205 903 163 -46 1135 1771 690 -477 -264 -368 -1657 -2833
2244 -2833 -1939 -626 -955 -1054 319 1303 543 -525 101 671 -134 -999 346 1686 1279 736 1624 2379
2262 2379 1135 -659 -459 -121 -1268 -2055 -1225 98 -473 -991 -245 554 -424 -1924 -1169 -177 -647 -998
2280 -998 395 1960 1593 929 1567 2159 878 -607 -401 460 -44 -906 -382 844 375 -739 -717 -329
2298 -329 -1079 -2218 -1973 -698 -450 -863 131 1391 1396 656 563 1249 538 -468 11 1013 1183 518 678
2317 678 1513 966 -394 -767 -699 -1176 -1947 -2031 -795 -433 -510 -455 648 427 -301 -652 -85 72 -183 77
2337 77 1251 1802 1321 1339 1583 1405 -20 -726 -493 -236 -806 -1157 -374 251 -320 -986 -738 -403 -1309 -1897
2357 -1897 -1079 -369 -162 -203 879 1815 1554 735 903 1298 342 -560 -48 966 417 -194 402 1123 103
2376 103 -1024 -1058 -902 -1302 -2108 -1624 -284 -147 -631 121 1262 708 -354 -4 857 357 -171 223 1508
2395 1508 1495 568 1002 1408 586 -797 -911 -495 -893 -1595 -965 -68 -14 -681 -211 526 -335 -1152 -951 49
2415 49 93 -221 435 1701 1582 769 961 1211 682 -647 -545 5 -16 -549 -325 298 413 -578 -854 -601
2435 -601 -855 -1557 -1340 -514 -54 -149 305 1047 1340 550 383 419 511 125 -205 579 851 460 292 567 471
2456 471 -231 -1178 -840 -708 -1138 -1487 -611 29 118 -287 392 590 -8 -648 -155 532 210 138 938 1414 1120
2477 1120 536 454 627 -22 -915 -936 -357 -549 -866 -502 204 43 -792 -654 -223 -453 -1067 -621 249 506
2497 506 163 729 1515 1325 352 470 726 298 -559 -351 471 241 -285 -42 430 112 -1081 -1142 -588 -855
2517 -855 -1271 -957 -15 455 4 283 931 664 -117 -113 531 720 70 363 1046 1146 375 341 476 142 -825
2538 -825 -1067 -581 -783 -1162 -847 81 101 -332 -359 46 73 -538 -640 198 626 198 615 1238 1238 713 340 367
2560 367 306 -215 -688 -230 65 -301 -360 -166 -12 -440 -981 -689 -441 -856 -963 -317 391 410 416 841 960 528
2582 528 163 390 364 249 -148 196 684 553 15 125 342 -422 -936 -1208 -612 -733 -906 -528 175 328
2602 328 -82 -5 389 246 -131 -88 378 409 182 551 1079 975 186 -31 102 -144 -736 -794 -233 -140 -539 -367
2624 -367 165 -50 -385 -632 -165 -106 -783 -527 407 636 417 579 1003 797 126 -28 331 -47 -439 -286
2644 -286 202 242 -274 -141 141 -25 -760 -848 -516 -259 -697 -546 -68 475 43 328 633 604 86 0 404
2665 404 402 64 75 581 597 51 -90 44 -81 -667 -957 -553 -465 -525 -556 107 280 -23 -161 78 71 50 -224
2688 -224 340 394 376 389 679 810 373 35 -22 -65 -330 -440 -350 54 97 -438 -271 -48 -303 -530 -638 -186
2710 -186 -45 -241 92 527 595 406 454 637 636 132 12 318 208 -72 159 212 202 -225 -327 -90 -278 -598
2732 -598 -948 -504 -73 -339 -131 376 365 -34 174 407 185 -142 -36 340 600 276 381 582 549 3 -275
2753 -275 -238 -129 -571 -491 -354 -139 -465 -439 20 59 -331 -459 -267 -74 -398 -20 561 529 216 187 692 499
2775 499 60 -60 200 -32 -124 -238 -56 192 -100 -354 -104 -113 -645 -521 -307 25 -258 -133 201 235 195 208
2797 208 372 435 120 -25 122 415 184 194 248 270 63 -400 -205 -288 -506 -472 -288 -100 -46 -341 124 -9
2819 -9 60 -94 -84 93 130 -19 168 134 439 290 316 297 113 -142 -245 8 -106 -283 -185 34 127 -136 -267
2842 -267 -95 -56 -320 -322 -21 73 -88 152 577 317 132 74 394 238 88 -297 -118 79 -66 -38 138 194
2864 194 -271 -174 -153 -434 -291 -315 -179 -10 -25 113 171 325 159 165 287 93 127 -22 139 254 32 106 365
2887 365 146 -117 -240 -120 -214 -326 -358 -93 -57 -176 -161 -15 -55 -290 -153 9 46 32 124 364 332 176 78
2910 78 195 295 -13 76 -135 66 -147 -99 -94 -261 -135 -278 -180 -202 -523 -297 -20 126 148 90 192 234 196 204
2934 204 274 113 158 -2 278 195 169 121 71 77 -80 -64 -301 -237 -203 -300 -193 -207 20 216 -47 25 -55 -45 49 150
2960 150 41 109 322 207 334 362 208 210 59 -49 -140 -88 -61 -43 -94 -104 -213 -68 -131 -189 -93 -240 -149 114 -56
2985 -56 124 53 283 174 69 276 234 -82 77 103 106 31 -120 14 66 -125 -212 -157 -111 -133 -233 -34 298 7
3009 7 11 57 80 100 88 276 105 83 -108 144 131 65 153 97 160 51 -179 -5 117 -225 -85 -27 25 -130 -166 1
3035 1 -226 13 -184 -2 91 182 -19 116 251 232 -121 136 5 1 39 63 178 -76 23 -4 15 -46 -97 -168 -5
3060 -5 -237 -311 -74 80 45 -30 101 196 -6 -9 -94 10 16 -56 103 109 121 142 163 69 8 -15 -188 -6 -88 -240 -208
3087 -208 57 55 -109 116 50 -64 -12 -217 -105 173 -2 179 42 321 11 -161 -41 -24 -268 -174 -78 127
3109 127 -61 -266 1 -2 -27 -324 -122 -14 -93 -319 -26 43 -141 -14 122 126 0 -26 169 216 -161 8 122
3132 122 308 -149 -13 88 187 -137 -303 -41 140 -112 -121 72 16 -176 -80 -2 155 -140 69 -64 20 150
3154 150 -1 242 203 233 143 103 118 -74 -176 19 32 56 -108 -56 -11 -84 -282 -197 89 -145 -211 -54 182 47
3178 47 -32 -4 26 99 -86 -60 216 0 -23 -35 -27 -37 -229 -56 -17 -91 -206 -253 -138 -122 -93 -85 87 56 41 -209 106
3205 106 70 -89 -105 281 197 87 -15 218 146 75 35 173 1 -265 -143 75 90 -114 50 131 66 -115 -292
3228 -292 -200 66 -172 -176 130 63 -47 88 172 320 -122 -202 80 221 -123 -59 287 225 -8 -96 -20 30 -90 -312
3252 -312 -164 37 -127 -70 175 311 81 -47 102 178 -32 68 115 220 104 -17 389 369 93 -153 -45
3273 -45 47 -265 -311 -159 19 -48 -254 124 95 -10 -269 -123 116 -226 -259 143 388 84 180 188 377 132 -52
3296 -52 -5 85 5 -144 11 141 227 -76 -58 79 -91 -368 -280 -38 -24 -180 -164 276 338 209 -9 107 66 -92
3320 -92 -42 58 248 -79 -83 292 122 5 -110 -82 -122 -259 -307 -142 57 15 -192 257 284 -147 -51 87 145 -34
3344 -34 -43 173 423 195 58 232 146 -200 -178 -136 95 -342 -381 77 284 -23 -347 65 57 -158 -270 -45 -30
3367 -30 -64 -172 404 334 102 -191 73 418 -201 -243 76 295 180 -95 45 481 31 -123 25 67 -273 -356
3389 -356 -248 52 155 -271 71 351 119 -209 76 187 18 -98 36 427 268 -40 82 326 79 -339
3409 -339 -236 -93 -273 -258 -159 135 -57 -151 2 248 199 -192 -72 142 -69 14 92 342 308 -153 -9 251
3431 251 50 -259 -108 17 59 -244 -142 109 532 -117 -37 15 -7 -118 -288 -97 291 30 19 230 409 124
3453 124 -141 102 178 -19 -94 152 204 32 -115 61 244 -159 -267 -358 226 -237 -457 -26 289 36 39 25
3475 25 258 22 -321 27 233 101 -179 246 357 188 -108 -1 268 -62 -432 -168 61 -299 -389 40 165
3496 165 186 -380 -50 193 -228 -292 -75 256 39 -20 172 521 266 -11 -123 158 10 -359 -130 253 -5
3517 -5 -271 58 154 77 -146 -228 145 -120 -404 -203 304 113 -25 -55 467 257 -29 -69 207 56 -205 -103
3539 -103 454 221 43 -9 316 135 -348 -396 -84 -21 -342 -185 87 379 -81 -125 131 282 -131 -86 6 229
3561 229 -58 -127 277 354 -17 -216 134 39 -303 -474 -208 79 4 -241 57 56 -53 -309 -223 152 -162 -244 33
3584 33 284 382 -60 153 507 252 -305 -14 121 -38 -299 67 443 312 -274 -104 187 -22 -620 -241 -8
3605 -8 -48 -394 -99 396 112 19 132 362 171 -351 -162 253 84 -137 114 494 244 -159 -173 209 -43 -376
3627 -376 -296 39 -12 -149 -89 504 201 -236 -127 272 82 -233 -232 282 240 -75 132 444 236 -141 -109 85
3649 85 -12 -308 -308 104 -111 -131 -45 95 -7 -306 -310 -17 -14 -223 -52 236 284 116 -9 440 357 -93 -305 -163
3673 -163 -6 -88 -105 94 326 -52 -197 105 18 -326 -519 -172 55 -45 -239 215 405 234 -173 -42 218
3694 218 -80 -273 -64 418 214 119 159 527 74 -410 -107 165 -169 -426 -228 248 -57 -333 -91 256 158
3715 158 -462 -230 131 20 -396 -109 417 455 64 51 482 210 -353 -198 94 -117 -358 -163 273 220 -107
3736 -107 -23 165 103 -586 -424 -6 -21 -153 -137 421 301 -67 -30 589 194 -160 -63 168 376 -202 -178 312
3758 312 405 -207 -303 52 -108 -453 -386 84 301 -152 -68 259 383 35 -93 89 154 -185 -125 268 267 -94 30
3781 30 394 299 11 -386 -106 80 -389 -237 47 192 -127 -323 21 169 -196 -316 -57 38 -20 -240 356
3802 356 477 119 -22 -4 446 20 -329 -69 220 52 -214 8 460 170 -433 -206 70 -219 -545 -214
3822 -214 235 81 -28 -3 347 336 -199 -231 191 204 -246 -77 344 305 -169 36 188 96 -366 -367 76 -34 -425
3845 -425 -358 144 310 -105 -111 492 301 -253 -377 85 204 -144 -69 486 507 127 -148 328 63 -418 -266 162
3867 162 194 -320 -256 203 196 -266 -190 94 3 -234 -434 170 211 -183 33 446 503 2 -110 324 204 -56 -412
3890 -412 123 278 -116 -125 159 289 -116 -401 -185 -41 -184 -349 -133 142 24 -30 114 333 53 -361 -74
3911 -74 178 104 -346 114 424 227 51 34 385 9 -455 -327 225 -178 -258 -212 372 303 -130 -103 -48 36 -474
3934 -474 -285 313 161 -8 144 494 326 -71 -98 183 120 -317 -293 243 218 -132 -19 238 250 -257 -444 -57
3956 -57 -22 -379 -491 81 358 -3 -76 287 265 -91 -284 112 300 -136 -376 330 291 -153 -149 191 263 -403 -476
3979 -476 -70 31 -244 -467 409 193 -204 -219 235 304 -229 -323 184 269 -26 -7 351 349 160 -241 -7 144
4001 144 -334 -297 -51 119 -9 -458 62 470 -116 -382 26 297 -179 -482 138 313 180 -69 314 615
4021 615 182 -213 20 85 -139 -438 -257 368 166 -134 -105 202 -11 -396 -342 -114 15 -282 36 254 215
4042 215 -31 235 278 213 -407 -82 175 196 -40 77 131 253 -60 -176 158 20 -315 -441 73 -69 -300
4063 -300 13 329 292 -20 -108 -3 178 -307 -420 257 165 0 -15 442 415 -157 -172 11 46 -337 -450 126
4085 126 371 15 -97 2 148 -244 -466 10 124 -217 -288 273 528 176 -63 345 399 -102 -331 -7 71
4106 71 -98 -166 20 461 -16 -265 -40 163 -243 -641 -66 233 -75 -338 238 432 65 -434 47 506 24
4127 24 -410 -46 427 27 -185 393 449 116 -288 -8 90 -200 -422 -30 190 48 -248 186 212 121 -258 -162
4149 -162 292 69 -356 -89 348 313 58 71 255 142 -269 -229 125 -7 -386 -254 300 195 -176 -197 196
4170 196 34 -403 -430 -185 189 -180 -283 362 309 64 -63 149 132 -114 -379 110 302 -8 -181 114 392
4191 392 17 -273 -33 28 -340 -560 -112 210 114 -104 104 322 -82 -376 -14 94 -63 -294 218 488 -24
4212 -24 -123 272 366 -181 -395 -130 287 -226 -308 -165 295 172 -365 -51 290 -84 -443 -126 234 60 -247
4233 -247 57 533 291 -114 69 327 -97 -387 -254 360 60 -256 -45 249 128 -220 -227 153 118 -679 -170
4254 -170 115 62 -195 111 519 311 -116 -275 251 128 -401 -43 221 142 -110 -85 310 -75 -297 -364 -36
4275 -36 -105 -495 -93 357 129 -39 86 130 106 -193 -174 -36 71 -36 -277 104 489 173 -57 104 224 -82
4297 -82 -413 3 61 -233 -266 57 250 40 -336 44 341 -236 -399 -41 245 57 -129 228 689 164 -139
4318 -139 -12 343 21 -267 -77 154 34 -196 32 335 53 -428 -270 223 -343 -397 -102 286 187 -288 -3
4339 -3 425 -8 -348 -189 171 221 -232 -90 444 347 -145 153 347 -67 -537 -361 -70 -99 -406 -180 415 118
4361 118 -67 -242 383 87 -438 -155 271 245 -280 11 373 418 -159 -20 265 -87 -508 -358 99 70 -31
4382 -31 -83 374 284 -309 -321 30 88 -503 -205 259 162 105 207 246 258 -154 -156 240 272 -232 -114 306 387 5
4406 5 -211 203 205 -242 -353 -255 -40 -5 -116 127 382 50 -57 241 178 -6 -337 -57 240 53 -97 143
4428 143 338 101 -146 6 59 -81 -419 -254 214 -31 -295 -54 386 179 -267 -137 96 120 -240 53 433
4449 433 232 66 111 475 251 -180 -253 74 -102 -400 -293 298 52 -306 -90 366 -116 -628 -481 -75 36
4470 36 -191 -37 261 394 150 340 269 160 -371 -119 50 203 -115 -46 306 211 -221 -251 17 -19 -451 -487
4492 -487 -28 53 -338 -171 207 322 -119 -177 104 273 -241 -165 257 282 -113 -20 256 231 15 -231 -36 -167
4514 -167 -252 -288 -61 140 -93 -12 188 278 -129 -193 47 76 90 -201 206 385 165 -59 140 261 149 -336
4536 -336 -176 191 -25 -404 -65 177 79 -276 -141 80 -222 -434 -240 90 73 -369 56 528 431 -24 21
4557 21 187 304 -225 -82 304 206 -74 -32 396 276 -189 -288 164 -108 -420 -302 128 217 -145 -136 263 324 -65
4580 -65 -269 114 150 -292 -172 312 466 41 65 303 263 -301 -591 -105 -27 -168 -403 210 288 -242 -172 55
4602 55 68 -371 -401 202 302 -57 199 377 586 59 -9 253 330 -157 -282 -119 107 -137 -128 352 69 -288
4624 -288 -247 10 135 -423 -275 -68 63 -26 -33 309 202 -56 -214 102 192 -73 -168 118 344 72 -94 127
4646 127 176 67 -210 -491 103 -48 -447 -366 168 146 72 54 191 96 -351 -95 53 162 -165 -62 349 440
4668 440 3 -35 112 57 -313 -244 -30 -39 -236 -189 128 78 -159 -317 74 -54 -342 -282 268 134 -155 12 314
4691 314 280 24 -170 206 201 -363 -192 -101 221 -103 -130 268 149 -92 -322 -69 -24 -341 -242 99 253 -40
4713 -40 -65 328 322 -184 -281 41 264 -109 -109 253 489 -5 -94 188 199 -284 -300 -120 258 -220 -402 162 317
4736 317 -101 -198 130 53 -144 -244 -60 298 -57 -142 214 228 28 -152 9 201 -3 -382 -198 154 -7
4757 -7 -251 119 199 -216 -282 -92 141 -102 -221 -130 196 193 14 160 349 164 -109 -53 115 52 -205 -108 230
4780 230 94 -52 -100 199 -53 -406 -384 5 16 -140 -38 139 156 57 -63 45 115 -161 -277 276 312 -203
4802 -203 58 195 276 -153 -333 33 143 -166 -363 -58 384 -188 -320 125 400 -180 -169 93 26 -218 -278
4823 -278 141 496 128 -16 378 368 17 -302 -7 -71 -176 -253 88 176 -90 -347 17 117 -204 -291 46 81
4845 81 -165 -228 141 378 -21 -110 219 314 -32 -326 -163 75 -212 -113 86 277 39 -174 18 164 -197 -316
4867 -316 -153 220 -132 -101 67 141 30 -116 -26 46 -2 -79 -3 125 80 -106 105 213 84 -117 -227 -118 -80
4890 -80 -438 -119 69 117 -110 -165 128 7 -358 -104 -24 33 -1 -53 162 166 -51 -133 287 326 -145 -174 -10 162
4914 162 -58 -246 93 88 -34 -269 -61 -29 -167 -383 121 74 46 -98 163 378 109 9 81 117 -18 -60 155
4937 155 311 48 -72 117 327 -29 -173 -88 143 -287 -386 83 151 -15 -18 98 318 -82 -122 -153 145 3
4959 3 -111 5 291 265 -188 26 367 -186 -329 -143 256 -4 -386 86 63 -32 -449 -43 315 -138 -327 -58
4981 -58 89 59 -109 221 235 256 -81 -25 42 -87 -163 -98 88 -10 -326 -59 135 199 -308 -228 31 -193 -306 -15
5005 -15 42 112 -153 -107 12 5 -62 8 117 44 -148 12 313 243 109 -151 226 106 -138 -257 -140 125 -222
5028 -222 -74 71 238 -8 2 24 86 -299 -221 174 286 -12 -128 175 380 74 -94 46 101 -227 -270 21
5050 21 146 -178 -68 44 308 116 -165 -56 132 -34 -322 -65 195 70 -152 94 208 -4 -276 73
5070 73 170 5 -196 -52 341 153 -283 102 163 -56 -406 -372 -20 -86 -208 -83 135 35 -173 -70 228 89
5092 89 -244 -95 239 38 -89 -52 342 259 -203 -50 266 -30 -202 -275 -118 65 -124 -278 115 43 -69 113
5114 113 78 -260 -192 -20 263 195 39 -1 51 209 -3 45 6 -76 -155 -126 145 214 -168 -60 92 256 -246 -247
5138 -247 14 50 -201 -79 55 184 -19 6 -5 143 32 -115 67 174 -123 -270 83 236 150 -96 1 77
5160 77 63 -358 -48 164 -120 -98 83 261 132 -125 25 156 -11 -314 -27 319 77 -14 43 358 152 -376
5182 -376 -101 21 31 -320 -149 199 64 -116 15 228 88 -236 -1 54 37 -266 -139 228 199 -111 38
5203 38 346 139 -301 -187 260 45 -230 -62 213 86 -268 -137 74 -88 -241 -124 139 -65 -159 142 466
5224 466 2 -245 -167 177 152 -105 -233 11 93 71 42 272 200 -40 -18 81 -5 -159 -39 -24 166 -61 -170
5247 -170 126 18 -251 -124 99 13 -284 -142 115 189 -195 -92 213 145 100 -206 -11 -37 -116 -91 118 116 -50
5270 -50 -85 13 199 -45 -223 -76 111 63 -168 180 70 -3 -144 24 205 -135 -197 -10 175 -80 -49 -50 347
5293 347 254 -207 -138 192 -8 -200 -248 185 57 -23 62 260 -15 -165 -83 7 139 -144 137 192 247 -82 11
5316 11 257 -1 -95 -9 70 -96 -175 -20 133 103 -85 -175 62 14 -204 -343 200 67 -96 -85 287 339 54
5339 54 105 35 23 -31 -223 72 -41 -73 -215 98 63 70 -130 176 207 -187 -67 34 69 -107 -117 23 -10 8 -21
5364 -21 3 -48 -208 -189 136 98 -3 21 231 100 -132 77 -13 106 -182 -101 -113 264 -19 -83 3 117 7 -220
5388 -220 118 37 -63 -21 120 241 64 -302 -115 298 -54 -139 28 281 -49 -268 2 38 18 -178 -46 76
5410 76 -21 -127 -81 276 41 -27 43 386 248 -161 -119 152 -48 -141 49 131 149 -140 60 275 -61 -52 1 4 -5
5435 -5 -228 -31 318 210 -21 -56 160 281 -236 -272 202 188 -183 61 356 28 -121 197 86 4 -215 -138
5457 -138 224 0 -87 -311 -38 184 -104 -189 215 45 -197 -115 95 14 -58 -51 236 150 -128 -51 79 110 -97
5480 -97 -155 -1 -36 -40 -116 -66 157 -38 -192 -1 132 -125 -122 183 216 93 161 59 271 -107 -191 -94 5 -225 -138
5505 -138 75 52 124 -94 -62 112 -63 -194 -162 158 -138 -186 -131 244 177 -19 21 38 -82 -166 -30 61 116 -198
5529 -198 -81 190 177 -113 -107 52 189 -222 -57 42 118 33 -228 183 102 -82 -124 -9 1 -174 7 232 325
5552 325 -29 114 200 80 2 -56 36 10 -75 19 24 238 -36 -156 -80 134 -166 -207 22 -6 -190 -186 98 160 -213
5577 -213 -54 69 87 60 -231 16 159 -143 -186 33 215 -28 -91 192 148 -159 -232 38 191 -6 -238 253
5599 253 23 -29 -230 -124 79 50 -225 -37 173 9 -20 11 162 -61 58 8 4 -5 -83 -39 -54 86 -92 98
5623 98 253 -101 -187 37 19 -144 -103 -68 182 -124 -112 3 148 20 -242 -159 85 15 -60 -85 132 32 -133
5646 -133 -61 65 -78 -100 -79 26 127 15 -106 102 259 -150 7 228 -18 -142 -215 50 110 -92 80 -14
5668 -14 200 -34 -82 132 94 -154 -58 67 197 -131 -95 174 68 -221 -278 80 134 -240 -215 266 181 -47 -26
5691 -26 84 -19 -195 -92 244 72 -184 -80 111 206 -227 -258 112 266 -178 -246 97 8 -11 -148 144 184
5713 184 -80 27 274 68 -15 -68 -34 99 -69 -34 162 157 -101 -110 9 57 15 42 -3 53 22 -48 -32 67 -25 -375
5739 -375 -92 198 -70 -160 -15 75 155 -142 153 128 63 -192 -47 73 -115 -141 -1 241 86 -154 41 156
5761 156 -139 -141 43 315 50 -14 9 240 137 -71 -97 176 105 -37 -177 46 115 -151 -6 129 61 -209 -136
5784 -136 128 34 -175 -176 99 211 -39 -50 158 196 -10 70 89 125 -60 -168 119 166 20 -67 98 72 -166 -170
5808 -170 59 30 -193 -232 74 187 -100 -175 190 129 -27 -246 47 133 -105 -79 164 289 24 -87 41 55
5830 55 -123 -213 85 101 -32 -159 137 -28 -101 -248 63 58 -195 -258 -55 232 -48 -46 182 58 -42 -67 6 43
5854 43 -85 -252 -15 226 138 68 -62 36 -4 -261 32 26 -110 -57 -97 93 -14 77 210 317 32 3 -65 149
5878 149 124 -105 -134 44 257 -218 28 162 101 -183 -110 112 151 -213 -163 180 124 -44 -341 55 27 -45 -31
5901 -31 30 -56 -15 -17 218 198 -40 -12 121 173 -73 -117 139 271 -19 -163 119 114 -283 -200 -19 7 -57 -169 4
5926 4 100 -58 -3 199 278 -119 -159 26 -39 0 -20 188 313 -106 -131 68 34 -122 -214 -93 205 -190 -234 93
5950 93 146 -109 -204 19 110 -47 -108 95 60 -51 -80 -48 160 -129 -128 66 202 -63 -222 -103 173 -9 137
5973 137 -20 -27 -80 -129 19 -19 -14 -224 113 122 17 -98 196 209 136 -202 -78 37 -100 -129 -188 166 1 -46 -51
5998 -51 124 88 -273 -235 62 111 -67 -123 179 69 -177 99 24 245 -199 54 143 143 -11 2 89 126 -7 2 -80
6023 -80 48 -202 -11 5 81 -129 -79 30 64 -71 -196 34 -20 -84 -82 112 217 -55 9 288 110 44 -265 92
6047 92 21 -56 -27 67 101 -50 29 -222 263 -145 -301 -151 -26 -1 -175 55 124 52 -238 104 230 -24 -225
6070 -225 -36 111 -14 -154 -21 120 -46 -110 -141 26 -194 -141 -46 -35 53 -279 2 48 -37 63 -79 124 -36
6093 -36 -110 -55 176 -17 -9 58 131 128 -309 -58 1 16 -71 -119 64 43 -121 -71 74 -119 -93 68 71 170 -196 71
6119 71 145 64 -21 -85 105 79 0 -33 -33 138 -275 -60 96 110 -106 -122 -58 128 -269 -35 26 88 -160 -128 254
6144 254 267 68 46 176 171 36 -117 170 315 133 8 -23 151 87 -58 37 72 -70 -186 -5 241 -78 -160
6167 -160 62 264 64 -65 -124 116 37 -20 183 114 96 -149 -17 212 -45 -330 -197 -171 -90 -159 56 265 -93
6190 -93 -194 -86 -15 -166 -185 -147 96 28 -129 121 228 34 134 161 93 -58 13 -74 258 201 -32 12 153 83
6214 83 -117 -69 138 -5 -195 38 126 136 32 -143 135 128 -48 -25 296 183 -92 -82 106 58 224 74 219
6237 219 78 -45 -195 130 -87 -347 -65 51 75 -9 -53 -63 -23 -12 -169 -2 199 29 -70 206 294 66 -103
6260 -103 3 128 -70 -127 104 66 -164 -110 54 116 -239 -265 -84 139 -173 -269 43 283 -70 -45 3 156 158
6283 158 -261 -58 283 79 -144 -23 248 91 -276 -96 115 -96 -295 -220 244 56 -152 13 232 78
6303 78 -107 20 279 49 -3 -180 154 -24 -140 -48 241 53 -186 -134 201 -19 -221 -203 -78 -58 -138 4
6325 4 23 31 -176 -243 156 -51 -151 -120 174 190 40 70 292 192 -114 -87 95 33 -124 -15 288 92 -153 -10
6349 -10 196 135 -149 -85 -117 -35 -173 -19 67 106 -13 -24 -11 95 46 -158 146 106 -20 -45 82 418 113 -71
6373 -71 -67 264 -63 -195 6 19 -41 -57 125 39 -45 -115 -130 144 -86 -280 183 289 119 -85 132 260 -46
6396 -46 -50 -53 85 77 -187 -134 -11 -20 -172 -55 196 26 -281 -75 98 -16 -158 -83 279 154 -123 -2 317 74
6420 74 93 14 157 77 -39 64 134 58 -169 -84 80 -38 -143 -181 105 104 -161 31 256 -49 -199 -144 177 61
6444 61 -190 -99 261 23 -34 -78 293 39 -145 -226 -66 -141 -116 -261 -21 151 12 91 19 124 -110 58 167
6467 167 2 -132 -86 57 143 -5 -94 83 220 19 7 22 69 -102 -113 74 -32 -67 -306 -106 60 -93 -24
6490 -24 -14 155 27 2 51 201 -58 -68 -146 360 -63 -61 42 -24 -24 -164 39 59 86 -234 16 152 -15 -298
6514 -298 -167 90 10 -155 -128 276 130 -235 -25 170 124 -292 -14 204 138 -14 -210 117 0 -297 -160
6535 -160 150 -19 -91 -208 84 21 -282 -13 95 172 -196 -131 283 96 -221 -11 89 183 -135 -91 25 27 -118
6558 -118 -66 183 221 -121 -2 43 96 -38 -162 -9 -5 -191 -263 16 45 -118 11 154 177 96 -55 277 164
6581 164 -195 -172 203 139 -51 78 157 166 -29 -112 -38 41 -247 -386 73 64 0 -11 109 333 -119 -130 -144 73 95
6606 95 -41 2 -55 -16 81 56 175 26 -208 -124 -1 -12 -144 -3 17 -47 -204 26 28 72 -134 -107 -34 122 -22
6631 -22 82 19 94 -147 -52 44 32 -97 19 319 100 -296 -46 214 86 -179 -154 86 12 -389 -35 174 192
6654 192 -134 -17 241 220 -201 -57 172 121 -251 -74 141 344 -176 10 126 50 -76 -191 -5 -58 6 -166
6676 -166 106 156 -147 -148 64 177 -49 -117 253 78 141 36 45 235 28 -4 155 173 -158 -136 54 17 -47 -77
6700 -77 83 185 -50 -336 -152 36 -117 -127 72 173 13 -103 208 198 13 -69 -26 120 -17 44 -57 226
6722 226 139 -252 -49 24 -24 -351 -134 93 -19 -284 -72 93 19 -128 -37 90 213 -162 -19 43 187 -73
6744 -73 115 20 60 -236 -85 -28 150 -127 -149 47 -48 71 -130 33 69 -208 -184 53 44 -154 78 131 152 43
6768 43 -169 314 53 -47 115 191 102 -85 -210 35 189 -228 -217 77 13 -164 -339 13 86 -195 16 53
6790 53 -1 4 -240 149 306 -7 -162 88 -43 69 -99 171 239 -13 -194 72 55 -209 -150 33 139 -199
6812 -199 -168 37 131 -121 -225 48 192 -246 -181 20 276 -1 -105 133 94 -4 -190 0 192 -16 -173 -79
6834 -79 116 -4 -142 49 116 22 9 -193 2 47 10 132 172 86 -43 63 170 109 -133 -78 156 97 -68 18
6858 18 62 -9 64 -279 24 -46 -141 -115 132 52 -149 -137 209 248 28 -112 -69 44 -158 -64 154 59 -78 -116 121
6883 121 103 77 -78 86 95 -252 -216 27 155 -8 -187 79 260 -166 -102 -122 170 -60 -176 66 138 101 -181
6906 -181 229 155 -129 -137 -4 256 -151 -102 158 76 0 -182 -28 205 14 -171 -22 -23 -64 -135 99 208 40
6929 40 12 -66 182 47 -24 80 175 134 -166 -7 100 -183 -199 -58 48 -71 -170 -93 213 136 -32 -142 39
6952 39 132 -223 -63 139 -71 -145 -86 129 109 17 25 33 98 -81 -92 103 56 -167 -169 189 -97 -105 -124 90 95 -59 32
6979 32 81 129 -114 -66 10 126 -127 44 156 70 -101 -157 179 209 -110 -96 55 182 -96 -81 70 24 -86 -270
7003 -270 -74 197 -11 -305 -87 183 2 -225 -18 339 -56 -133 76 276 66 -171 0 124 -25 -57 -110
7024 -110 162 -52 -116 23 125 -37 -110 -202 185 22 -104 55 166 -90 -191 96 247 176 -314 -76 234
7045 234 100 -286 -139 170 1 -273 -55 120 -54 -314 -19 217 -12 -288 -80 142 132 93 -50 113 53
7066 53 -51 -26 94 4 -127 -80 190 59 -81 -115 65 82 -53 -268 47 150 -55 -129 80 112 -159 26 134
7089 134 -99 -155 -130 89 149 -125 -15 -16 216 -73 -16 102 98 -37 -67 43 170 -62 -98 118 -50 2 -100 214
7113 214 48 -32 -55 57 68 68 -165 207 105 -71 -143 -86 170 -93 -139 13 12 40 -289 42 390 -56 -221 33
7137 33 83 9 -154 63 133 31 -179 33 270 117 -195 8 250 5 -46 -58 356 -55 -262 -85 81 17
7159 17 -135 -69 74 -11 -278 -54 -9 83 -15 -77 256 35 -113 -142 224 151 -31 39 97 48 -143 -149 100 67 -161
7184 -161 -155 156 126 -268 -64 -7 210 -250 30 72 101 -210 -7 224 -13 -36 -64 186 231 -220 65 108 69 -24
7208 -24 -39 110 93 -101 -48 1 51 -83 -224 -83 121 22 -192 87 180 -162 -157 -14 247 -147 -23 142 167 -19
7232 -19 -154 103 67 7 -301 169 68 -125 -254 19 188 77 -92 -31 50 -8 -197 92 262 147 -257 -46
7254 -46 336 19 -146 -71 169 -214 -173 98 196 62 -194 -308 249 87 -153 -290 62 -20 -211 25 222 111
7276 111 -229 -55 303 -30 -158 58 204 54 14 -96 102 211 42 -154 319 99 -129 -53 -13 123 -254
7297 -254 69 171 95 -71 -121 159 194 -152 -35 101 -6 -139 -152 197 114 105 46 234 -71 -81 -117 99 123 -188
7321 -188 -78 101 103 3 -136 78 185 -41 -250 247 176 -86 -101 66 27 -187 11 259 173 19 -128 -22
7343 -22 36 79 -99 78 30 -124 -208 201 53 192 -139 -1 194 94 -256 -118 20 -90 -173 72 97 -52
7365 -52 -83 -90 308 44 74 107 44 -95 -149 58 -49 253 5 -104 91 210 34 -58 27 176 -9 -229 31
7388 31 -159 -153 -201 139 229 -93 -79 -11 60 -110 -97 86 145 -41 -89 157 136 -82 9 -60 103 -229 -41 111 57
7413 57 -54 -146 154 55 -104 -99 62 88 25 -308 82 245 -139 -145 98 -37 -194 -180 109 48 -32 -163 52 179
7437 179 -13 -63 -49 190 -172 -264 111 176 -60 -64 79 127 -154 -286 -79 87 74 -193 38 264 -231 -91 -17
7460 -17 125 30 -211 16 138 23 -189 0 232 142 -152 47 165 72 79 33 286 153 -240 -41 219 88
7482 88 -130 -51 182 66 -181 -89 200 24 -34 -189 230 173 -135 -27 245 134 -180 -66 144 47 -116 -55
7504 -55 100 136 -76 -96 110 14 -42 -84 -112 80 -203 -194 147 198 23 34 312 176 64 -130 23 68 -108 3
7528 3 54 136 -110 -84 -33 52 -248 -128 51 18 -84 -153 2 93 -95 -174 62 140 -115 -284 75 203 -161 -172
7552 -172 57 162 76 40 103 85 -4 -140 -112 163 -116 -253 155 201 -4 40 94 55 -34 -17 -53 191 16 -75 -102
7577 -102 112 79 -128 -21 49 -30 7 85 24 75 -38 -61 178 -90 -361 -140 44 77 -153 -37 165 215 -206
7600 -206 -111 117 248 71 -119 249 112 181 -137 192 102 -88 -281 54 125 -55 -181 148 71 -129 -95 82
7622 82 162 -188 -151 67 218 -134 -258 82 87 -22 -13 102 200 -80 -48 40 219 -47 -197 -116 104 -81 -220 190
7646 190 -23 -40 -81 29 244 -163 -84 148 67 -55 -77 64 93 28 -157 -3 28 45 -46 48 113 -112 -141 -220 39
7671 39 49 -164 132 121 -35 -14 -37 220 79 -88 -15 116 46 -159 -67 309 43 6 -12 113 13 -56 73 7
7695 7 -5 -148 64 136 -71 -111 -20 191 58 -276 -154 143 172 -12 -86 93 68 -172 -29 157 182 -5 -213
7718 -213 142 78 -172 -181 86 146 -229 -29 77 40 -102 -169 -104 205 -317 -52 72 132 -13 -261 198 198 41
7741 41 -239 82 40 -50 -157 61 -53 -55 -31 64 296 -27 -292 37 44 -32 -149 5 311 39 -162 -69 66 78
7765 78 -282 115 60 85 -139 78 134 -6 -190 -118 178 54 -221 -149 -81 -89 -211 -61 135 -93 14 -11 248
7788 248 42 -108 1 248 145 -221 -153 93 -47 -273 -56 19 -81 -126 -130 14 18 -110 -63 29 4 -2 -99 75
7812 75 41 -28 -273 139 13 -29 -35 69 38 -118 -131 91 150 -99 7 30 129 -122 -202 -58 -121 -190 -53 188 204
7837 204 -24 52 70 211 34 -147 106 99 3 19 163 234 65 -178 7 63 -133 -123 129 106 -154 -116 28 48
7861 48 -7 -159 -87 215 -168 -133 137 73 -159 -101 -37 69 21 -224 42 28 17 -170 40 71 -8 53 -95 209
7885 209 27 -104 -230 284 -34 -175 6 92 133 -187 61 210 80 -141 -56 293 40 -60 -137 294 78
7906 78 -243 -162 -54 44 -192 -98 106 38 -100 -138 180 62 -302 16 168 95 -158 122 92 15 51 -178 120
7929 120 135 -23 23 222 -14 -159 -195 28 22 -23 -226 35 -83 -129 -120 142 -32 -63 -9 109 143 7 -47 22 113
7954 113 -92 8 -34 11 -109 -130 -160 166 -18 -239 8 61 41 -106 145 -35 68 -192 42 69 89 48 -134
7977 -134 189 67 16 17 136 177 -98 -41 16 21 -320 21 220 -49 -112 63 111 -2 -93 -4 -45 134 -404 -65
8001 -65 220 171 -117 11 274 94 41 -89 175 -177 -129 -274 219 208 -203 -225 74 -26 -173 -47 -91 -86 -138
8024 -138 -126 138 142 -82 46 260 73 -82 -21 76 18 -84 -155 0 97 -125 -130 16 151 -170 -183 179 -11 -161
8048 -161 -86 75 96 62 -67 74 122 -75 -16 139 129 -76 -49 67 245 43 -145 247 108 -41 -26 0 92
8071 92 12 -77 150 121 -101 -151 65 -86 -177 -74 -87 118 39 -89 29 205 -25 -79 -85 81 35 -196 -28 85
8095 85 105 -98 -17 38 79 17 -112 35 119 -236 35 66 -67 -74 -82 44 96 -107 64 80 17 -194 68 175 43
8120 43 -116 7 175 161 -139 -120 116 21 -78 -35 47 101 71 -113 85 26 -92 -179 166 75 -148 -88 160 -12
8144 -12 -242 -4 112 181 -308 82 228 73 -133 -78 243 110 -197 76 -15 81 -182 -111 132 196 -178 25
8166 25 122 91 -57 -83 8 262 -95 -138 -20 51 54 -239 -60 -35 -80 -138 -139 136 -21 -123 95 158 116 -89 46
8191D6
##END NTUPLES=NMR FID
##END=
