##TITLE=1H_BABBF19-10-1
 D2O, 8 sc, 
 12.11.2019
##JCAMPDX= 6.0         $$ Bruker NMR JCAMP-DX V2.0
##DATA TYPE= NMR FID
##DATA CLASS= NTUPLES
##ORIGIN= UXNMR, Bruker Analytische Messtechnik GmbH
##OWNER= root
$$ XWIN-NMR		Version 3.5
$$ Tue Nov 12 14:12:03 2019 Russian Standard Time (UT+4h)  she@DPX200
##.OBSERVE FREQUENCY= 200.1315
##.OBSERVE NUCLEUS= ^1H
##.DELAY= (6, 6)
##.ACQUISITION MODE= SIMULTANEOUS
##.ACQUISITION SCHEME= undefined
##.AVERAGES= 8
##.DIGITISER RES= 18
##SPECTROMETER/DATA SYSTEM= spect
##.PULSE SEQUENCE= zg30
##.SOLVENT NAME= D2O
##.SHIFT REFERENCE= (INTERNAL, D2O, 0, 15.7039)
##AUDIT TRAIL= $$ (NUMBER, WHEN, WHO, WHERE, WHAT)
$$ ##TITLE= Audit trail, XWIN-NMR		Version 3.5
$$ ##JCAMPDX= 5.01
$$ ##ORIGIN= Bruker BioSpin GmbH
$$ ##OWNER= she
$$ F:/spectra/data/she/nmr/H-F/1/audita.txt
$$ ##AUDIT TRAIL=  $$ (NUMBER, WHEN, WHO, WHERE, WHAT)
(   1,<2019-11-12 14:10:48.67 +0400>,<she>,<DPX200>,
      <created by zg, POWCHK disabled, PULCHK disabled
       configuration hash MD5:
       00 E9 B6 7A A2 85 ED C7 34 08 36 98 17 FE 4E 26
       data hash MD5: 16K
       BD 91 31 8A 36 73 AA 95 D6 B6 C0 2B FF A8 C0 2A>)
$$ ##END=
$$ 
$$ hash MD5
$$ AD 4A A5 54 17 6E 03 14 D6 1B 12 7B DE 41 35 D9
##$RELAX= 
##$RELAX= 
##$RELAX= 
##$RELAX= 
##$RELAX= 
##$RELAX= 
$$ Bruker specific parameters
$$ --------------------------
##$DU= <F:/spectra>
##$EXPNO= 1
##$NAME= <H-F>
##$PROCNO= 1
##$TYPE= <nmr>
##$USER= <she>
##$AMP= (0..31)
100 100 100 100 100 100 100 100 100 100 100 100 100 100 100 100 100 100 
100 100 100 100 100 100 100 100 100 100 100 100 100 100 
##$AQSEQ= 0
##$AQ_mod= 1
##$AUNM= <au_zg>
##$AUTOPOS= <>
##$BF1= 200.13
##$BF2= 200.13
##$BF3= 200.13
##$BF4= 200.13
##$BF5= 200.13
##$BF6= 200.13
##$BF7= 200.13
##$BF8= 200.13
##$BYTORDA= 1
##$CFDGTYP= 0
##$CFRGTYP= 5
##$CHEMSTR= <none>
##$CNST= (0..31)
1 1 145 1 1 1 1 1 1 1 1 1 1 1 1 1 1 1 1 1 1 1 1 1 1 1 1 1 1 1 1 1 
##$CPDPRG= <>
##$CPDPRG1= <>
##$CPDPRG2= <>
##$CPDPRG3= <>
##$CPDPRG4= <mlev>
##$CPDPRG5= <mlev>
##$CPDPRG6= <mlev>
##$CPDPRG7= <mlev>
##$CPDPRG8= <mlev>
##$CPDPRGB= <>
##$CPDPRGT= <>
##$D= (0..31)
0 1.2 0 0 0 0 0 0 0 0.06 0 0.03 0 0 0 0 0.0002 0 0 0 0 0 0 0 0 0 0 0 0 
0 0 0 
##$DATE= 1573553448
##$DBL= (0..7)
120 120 120 120 120 120 120 120 
##$DBP= (0..7)
150 150 150 150 150 150 150 150 
##$DBP07= 0
##$DBPNAM0= <>
##$DBPNAM1= <>
##$DBPNAM2= <>
##$DBPNAM3= <>
##$DBPNAM4= <>
##$DBPNAM5= <>
##$DBPNAM6= <>
##$DBPNAM7= <>
##$DBPOAL= (0..7)
0.5 0.5 0.5 0.5 0.5 0.5 0.5 0.5 
##$DBPOFFS= (0..7)
0 0 0 0 0 0 0 0 
##$DE= 6
##$DECBNUC= <off>
##$DECIM= 24
##$DECNUC= <off>
##$DECSTAT= 4
##$DIGMOD= 1
##$DIGTYP= 9
##$DL= (0..7)
0 120 120 120 120 120 120 120 
##$DP= (0..7)
150 150 150 150 150 150 150 150 
##$DP07= 0
##$DPNAME0= <>
##$DPNAME1= <>
##$DPNAME2= <>
##$DPNAME3= <>
##$DPNAME4= <>
##$DPNAME5= <>
##$DPNAME6= <>
##$DPNAME7= <>
##$DPOAL= (0..7)
0.5 0.5 0.5 0.5 0.5 0.5 0.5 0.5 
##$DPOFFS= (0..7)
0 0 0 0 0 0 0 0 
##$DQDMODE= 0
##$DR= 18
##$DS= 0
##$DSLIST= <SSSSSSSSSSSSSSS>
$$ [...]
##$SUBNAM2= <"">
##$SUBNAM3= <"">
##$SUBNAM4= <"">
##$SUBNAM5= <"">
##$SUBNAM6= <"">
##$SUBNAM7= <"">
##$SUBNAM8= <"">
##$SUBNAM9= <"">
##$SW= 24.0689530833862
##$SWIBOX= (0..15)
0 0 2 0 0 0 0 0 0 0 0 0 0 0 0 0 
##$SW_h= 4816.95568400771
##$TD= 16384
##$TD0= 1
##$TE= 0
##$TE2= 300
##$TE3= 300
##$TEG= 300
##$TL= (0..7)
0 120 120 120 120 120 120 120 
##$TP= (0..7)
150 150 150 150 150 150 150 150 
##$TP07= 0
##$TPNAME0= <>
##$TPNAME1= <>
##$TPNAME2= <>
##$TPNAME3= <>
##$TPNAME4= <>
##$TPNAME5= <>
##$TPNAME6= <>
##$TPNAME7= <>
##$TPOAL= (0..7)
0.5 0.5 0.5 0.5 0.5 0.5 0.5 0.5 
##$TPOFFS= (0..7)
0 0 0 0 0 0 0 0 
##$TUNHIN= 0
##$TUNHOUT= 0
##$TUNXOUT= 0
##$USERA1= <user>
##$USERA2= <user>
##$USERA3= <user>
##$USERA4= <user>
##$USERA5= <user>
##$V9= 5
##$VALIST= <valist>
##$VCLIST= <CCCCCCCCCCCCCCC>
##$VD= 0
##$VDLIST= <DDDDDDDDDDDDDDD>
##$VPLIST= <PPPPPPPPPPPPPPP>
##$VTLIST= <TTTTTTTTTTTTTTT>
##$WBST= 1024
##$WBSW= 4
##$XGAIN= (0..3)
0 0 0 0 
##$XL= 0
##$YL= 0
##$YMAX_a= 211758
##$YMIN_a= -188820
##$ZGOPTNS= <>
##$ZL1= 120
##$ZL2= 120
##$ZL3= 120
##$ZL4= 120
##$ABSF1= 10
##$ABSF2= 0
##$ABSG= 5
##$ABSL= 3
##$ALPHA= 0
##$AQORDER= 0
##$ASSFAC= 0
##$ASSFACI= 0
##$ASSFACX= 0
##$ASSWID= 0
##$AUNMP= <proc_1d>
##$AZFE= 0.1
##$AZFW= 0.1
##$BCFW= 1
##$BC_mod= 2
##$BYTORDP= 1
##$COROFFS= 0
##$CY= 11.3945322036743
##$DATMOD= 1
##$DC= 2
##$DFILT= <>
##$DTYPP= 0
##$F1P= 19.5091578491511
##$F2P= -0.509923556040331
##$FCOR= 0.5
##$FTSIZE= 0
##$FT_mod= 4
##$GAMMA= 1
##$GB= 0.15
##$INTBC= 1
##$INTSCL= 1
##$ISEN= 128
##$LB= 0.24
##$LEV0= 0
##$LPBIN= 0
##$MAXI= 10000
##$MC2= 0
##$MEAN= 0
##$ME_mod= 0
##$MI= 1.114404
##$NCOEF= 0
##$NC_proc= 0
##$NLEV= 6
##$NOISF1= 3.799351
##$NOISF2= 2.8
##$NSP= 1
##$NTH_PI= 0
##$NZP= 0
##$OFFSET= 15.70392
##$PC= 1
##$PHC0= -9456.429
##$PHC1= 11.60088
##$PH_mod= 1
##$PKNL= yes
##$PPARMOD= 0
##$PSCAL= 0
##$PSIGN= 0
##$REVERSE= no
##$SF= 200.130013532006
##$SI= 16384
##$SIGF1= 3
##$SIGF2= 2
##$SINO= 400
##$SIOLD= 16384
##$SREGLST= <1H.CDCl3>
##$SSB= 0
##$STSI= 0
##$STSR= 0
##$SW_p= 3612.71676300578
##$SYMM= 0
##$S_DEV= 0
##$TDeff= 0
##$TDoff= 0
##$TI= <>
##$TILT= no
##$TM1= 0
##$TM2= 0
##$TOPLEV= 0
##$USERP1= <user>
##$USERP2= <user>
##$USERP3= <user>
##$USERP4= <user>
##$USERP5= <user>
##$WDW= 1
##$XDIM= 8192
##$YMAX_p= 0
##$YMIN_p= 0
$$ End of Bruker specific parameters
$$ ---------------------------------
##NTUPLES= NMR FID
##VAR_NAME=  TIME,          FID/REAL,        FID/IMAG
##SYMBOL=    X,             R,               I
##VAR_TYPE=  INDEPENDENT,   DEPENDENT,       DEPENDENT
##VAR_FORM=  AFFN,          ASDF,            ASDF
##VAR_DIM=   8192,          8192,            8192
##UNITS=     SECONDS,       ARBITRARY UNITS, ARBITRARY UNITS
##FACTOR=    0.0002076,     1,               1
##FIRST=     0,             0,               0
##LAST=      1.7004516,     0,               0
##MIN=       0,             -188820,         0
##MAX=       1.7004516,     211758,          0
$$ Real data points
##PAGE= N=1
##DATA TABLE= (X++(R..R)), XYDATA
$$ [...]
2785h103M208N937N004J515j903n807o638l313K205N774N351L429M80l651o392
2800a904m963j217K758N099N761L684j289n806o286l578N91L992N340M892J640
2815H714k836n816n205k602J076M603O579M511o68n178n443l991j176K248N648
2830D64N741K497j950m465n473m351k76M476O732M570M92l386m951n104k794J415
2846f363N448N501L053Q3l159o242n400j125L908N871M512J753j089m699n903
2861c851l683R28L901N027M706J976l049o342n615j547K204M491N218L605M6m634
2877C381n682l987n87K296N180N838K719k642n585n137k791L76L928N859M335
2892G501M01l237m827m914k363J130N393O324K857j265m335n058l945j059L121
$$ plain form
2785 -8103 -3895 2042 7046 8561 6658 851 -5787 -9100 -6895 -1121 4230 7659 8139 4488 -1904
2800 -1904 -6867 -8084 -5326 -227 5534 9218 7929 2123 -4163 -7741 -7150 -3158 2182 7074 8714
2815 8714 5878 62 -5143 -7745 -6669 -2066 4513 9024 8356 3178 -2265 -6256 -7432 -5184 464
2830 464 6205 8702 6752 2287 -3186 -7537 -7813 -3337 3395 7965 8457 5071 120 -4984 -7778 -6363
2846 -6363 -915 4586 7639 7722 4563 -1679 -7079 -8204 -4296 1575 6087 7840 6751 2052 -3851
2861 -3851 -7534 -6606 -2705 2322 7028 9004 5955 -387 -6002 -7549 -5345 -854 4364 7969 8015 3381
2877 3381 -2301 -6288 -6875 -4579 601 6439 9158 6516 931 -4206 -6997 -6621 -2693 3166 7501
2892 7501 7902 4665 -162 -5076 -7439 -6309 -916 5408 8265 7000 2665 -2393 -6338 -7397 -4276
2907d276N790M574J611j561m176n970l939J065N037N369L515M22k927n131n075
2922e672j599K094M700M705L181J17m300o217m253L98L467M864M244K205k031
2937E903n247n211k196M94L697N288M674N63l804n736m420q46J713M859N105K673
2953G509j178m291m787l609q35K863N787N056J345k926m704m656k725P00M512
2968a939N477L250q1k761m681n157j825K310N508N029J921j285l695n184l853
2983f966K30L534M638L933J919j817n001n706k369J703M373M793L055M64l523
2998C260n259l855q57J938M088M727L288j098m813n541k713K85L334M545M318
3013E647J267k598m772m199j921K96L765N781L725m64l942m845l619j377K385
$$ plain form
2907 -4276 1514 6088 7699 6138 1962 -4008 -7947 -6882 -1845 3524 7039 7461 4534 -597 -5672
2922 -5672 -7271 -5177 -477 4228 7409 7526 3226 -2991 -7244 -6846 -3379 1485 5729 7934 5903
2937 5903 656 -4555 -6751 -6257 -2560 2728 7402 7965 4161 -1575 -5995 -6841 -5128 -269 4836 7509
2953 7509 6331 2040 -2747 -6356 -7191 -4328 1459 6515 7860 4934 230 -4426 -7151 -6451 -1939
2968 -1939 3538 6788 6707 3946 -735 -5892 -7717 -5407 101 5130 7051 5766 2071 -3113 -6966
2983 -6966 -6736 -3202 1436 5369 7288 5471 470 -5236 -7605 -5902 -1529 3264 6319 6783 3260
2998 3260 -1999 -5854 -6711 -4773 -685 4042 7330 6232 1419 -4122 -6835 -6550 -3216 1329 5647
3013 5647 6914 4316 -456 -4655 -6576 -6280 -2515 3266 6991 6527 2585 -2260 -5879 -7256 -4871
3028d871M936M723J440j167l356m955l589l99L713N510L906M22k259m736m454
3043e136k203J698M508M242K540L13k964m930m595n81K798M499M334J842j108
3058E257m282n007k678N74L037M172M021J691k619n054m762j444J849L729M876
3073C360K915m65m006m515l106p32J875M371N028K147k153m504m251k563K60L353
3089b986N013L635kk471l833m180k242J082M532N071K580q02l304m590l576q32
3105f905L155M373L673J402r49l350n146l619J049L955M549K987P04k526m686
3120a334m036j305K014L521M031K965K3l672n051l570j3K750M043M261J575j884
3136D318m467l973j745L60K740M639L854N44l027m946l693r01J533L972M779K142
$$ plain form
3028 -4871 65 4788 6228 5061 1705 -3250 -6839 -7238 -3525 1985 5891 6313 4054 -682 -5136
3043 -5136 -7339 -5641 -1133 3109 5649 5962 2998 -1932 -6527 -7108 -4310 189 4523 6365 5257
3058 5257 975 -4032 -6710 -6136 -3099 1073 5094 6785 4166 -888 -5650 -7094 -5245 -1516 3360
3073 3360 6275 5810 1804 -2711 -5817 -6549 -4674 -303 4725 6872 4719 215 -4036 -6599 -6339 -2986
3089 -2986 2027 5662 5660 3189 -644 -4824 -7066 -5984 -1452 3619 6199 5397 2093 -2497 -6073 -6905
3105 -6905 -3750 623 4296 5698 4749 1399 -3747 -7366 -6317 -2362 2187 5174 5878 3352 -1334
3120 -1334 -5370 -6675 -4661 -1140 2891 5856 5879 2207 -2844 -6414 -6427 -3677 366 4627 6202 4318
3136 4318 -149 -4122 -5867 -5507 -2767 1872 5726 6270 3243 -1703 -5396 -6297 -4764 -792 3987 6129
3152F129j309l402l874l112q66K381M929M217J064k053l870m165k514R57L791
3167a697M273K779J20k236l841m464j768K357M315L885K006o72l258m862l019
3182f082L81L067L641L250J529j200m138m834j840J164L223M157L441K25l283
3197B701m359l314n66J571L396M172K608q03l760m562k411q0K294M450L923P97
3213F057k551l652l386k011M25L406M568L133l02k997m082l222j349K086M505
3228F28L718J356j241k891l783l264k30L057M443L230Q01j661m141m043j913J720
3244d214L425L497K392M57k305m615l648o77K402L679L600K013j012l925m050
3259b981k011M42K334L594L337J496k048m449l522j428Q76L368M141K980r18l137
$$ plain form
3152 6129 4820 1418 -2456 -5568 -6434 -4053 876 5093 6157 4104 234 -3931 -6445 -5488 -1697
3167 -1697 2576 5355 5475 3239 -602 -5066 -6834 -4477 -162 3723 5729 5057 1799 -3063 -6082
3182 -6082 -5701 -2634 1007 4257 5786 4586 448 -4386 -6226 -5062 -1839 2318 5759 5984 2701
3197 2701 -1658 -4972 -5538 -3967 -571 3601 6209 5406 1646 -2916 -5327 -5407 -3113 1337 5260 6057
3213 6057 3506 -146 -3532 -5543 -5118 -1712 2856 5989 5687 2690 -1392 -4614 -5963 -3877 628
3228 628 4346 5702 4461 1570 -2213 -5477 -5707 -2650 1793 5023 5824 4163 22 -4021 -5934 -4214
3244 -4214 -789 2708 5100 5557 3252 -1363 -5011 -5688 -3286 393 3993 6006 4994 1069 -2981
3259 -2981 -4992 -4550 -2216 1378 4715 6211 4163 -286 -3808 -5236 -4360 -992 3149 6129 5211 2074
3275B074l679k467r58J597L888M000J583j345l439l967k472P2L283M350K696J72
3291E388k100l110l528j980R35L920L872K252j17k857m111l305o84K722L956L049
3307D302J084r29k799m278k341K90L062L713K914R08k351m391l369q27J770K749
3323d93L477K577Nl211m088k700m26J974L717L696J435j741l947l376j217J45
3339d173K382L808L165L75k433l590l113j729J343L846L977J573j026k867l210
3354a672k567q42K333L780L257J124j008l578m072j969P14L524L609K039J34j575
3370C231l564l377j376J651L202L268K058j4l122m292k360Q5K531L349K725J146
3386E141j317l522l389j767Q50K641L290L236J59k769m162k255o98J208K896L699
$$ plain form
3275 2074 -1605 -4072 -5030 -3433 455 4455 6038 4693 1254 -2713 -5185 -5113 -1830 2520 5216 5388
3291 5388 3288 178 -3350 -5330 -4395 -475 3397 5649 5532 2675 -1436 -4741 -5425 -2703 1253 4302
3307 4302 5386 4457 1658 -2620 -4961 -4671 -1609 2104 5018 5926 3575 -816 -4185 -5012 -3242 -493
3323 -493 2984 5561 5566 2355 -1733 -4433 -4859 -2885 832 4528 5963 4222 275 -3101 -4318 -4173
3339 -4173 -1791 2017 5182 5557 3124 -466 -3579 -5308 -3965 -119 3858 5431 4405 1538 -1672
3354 -1672 -4239 -5081 -2748 1032 4289 5413 4405 827 -3245 -5214 -4500 -976 2633 4672 4806 3231
3370 3231 -333 -3710 -5086 -3435 -233 3035 5093 5079 1957 -2335 -4695 -4610 -2079 1270 3995 5141
3386 5141 3824 302 -3087 -4854 -4004 -1363 1927 5163 5322 2553 -1609 -3864 -4562 -3354 -458 3241
3402C241J933p66l143l252k464n09K357M013L182M81j928l091k942j599K39K906
3418a342L646K408j49j970l527l147j436K083M136K958P17p13k321l445k492j2
3434d606K668L020K703J192j351l711l594j569J435K845L214J989K2k024l646
3449a413k841m90J721K846L276K096j037l595l446j676N06J820L133L058P37j709
3465B986l328k945j418N42K854L754K248m19l037k912k216o03R63L691L122J276
3481D558j362k385l243k346p6K762L819K259J31j795k670k843j501Q16L132L032
3497B288J867j99j962l714k831n30K479L093K370J302n23k999l593j536L91K151
3513a946K903K758R25j979l563k866r22J178K628L021J989m34k105l420k422k02
$$ plain form
3402 3241 5174 4408 1265 -1987 -4451 -4960 -2603 1410 4592 5073 3145 54 -2888 -4487 -4248 -1342
3418 -1342 2304 4712 4563 2593 -934 -4081 -5517 -3434 702 3660 4377 3664 1343 -2102 -4594 -4606
3434 -4606 -1938 1082 3785 4977 3626 -85 -3679 -5248 -3813 -968 2246 4235 4257 2233 -1413
3449 -1413 -4254 -4744 -3023 -177 3099 5195 4158 563 -2883 -4559 -4053 -2233 900 3958 4695 2986
3465 2986 -342 -3287 -4705 -4163 -1309 2445 4693 4274 1237 -1675 -3891 -4494 -3531 160 3282 4558
3481 4558 3196 811 -2432 -4778 -4854 -2092 1727 3986 4117 2322 -348 -3191 -4692 -3876 -744 2288
3497 2288 4155 3956 1994 -1720 -4551 -5081 -2602 491 2861 4163 3640 641 -2952 -4488 -4097 -1946
3513 -1946 957 3715 4640 2661 -902 -3768 -4690 -3512 -884 2137 4126 3692 1587 -1833 -4255 -4457
3529d457J306L048L385J444j714l112k786j577K87K300L525K062K78j889k813
3544g13k590j548J187L242L217J425q52k042l058k156q46J899L377K756O93j005
3560B986k417l357k275Q73K878L172J629L89j562l021k872p14R75K630K870J834
3576D018K4k651l536k030J32K081K601K433R77j157k889k933j309N13J982L186
3592A442K623J01k527l034k018p96R37L064K758J389n59k445k868k023n32K103
3608b385L369K771K65j711k576k374j546M85K687K924J588J57j495l032k868q52
3624d593J894L098K391J040n96k219l048j994J51K035K618K361J078j064l215
3639f3l212r82J135K421K329K156R6k123k987k320l1R34K483L031J635j072k767
$$ plain form
3529 -4457 -3151 -103 3282 4726 3012 -100 -2886 -4463 -4176 -1876 1649 3711 3989 2100 -713
3544 -713 -3303 -4851 -3664 -422 2795 4220 3368 1326 -1732 -3888 -4734 -2835 542 3298 3991 2986
3560 2986 569 -2788 -5063 -4190 -1312 1860 3489 3878 2316 -705 -3577 -4291 -3316 -686 2184 4018
3576 4018 4042 1391 -2145 -4175 -4043 -1962 639 3072 4049 2892 3 -2930 -4239 -3726 -1744 1442
3592 1442 4065 4166 1639 -1395 -3413 -4209 -3272 -208 2550 3939 3380 935 -1933 -3956 -4488 -2385
3608 -2385 984 3755 4020 2309 -267 -2641 -4187 -3702 -1015 1909 3497 3654 2159 -873 -3741 -4593
3624 -4593 -2699 399 2790 3830 3234 1015 -2033 -4027 -3876 -1841 777 3138 4216 3152 -63
3639 -63 -3275 -4257 -3122 -701 1628 3784 3880 1757 -1230 -3550 -3581 -2647 -164 2867 4502 3430 663
3656F63l107j290K19J738K963K178P38j721k624k204j536N28K589L216K003p84
3672C569k085k648k177o28J489K832K680O78o09j986k877k136K2K372L215J775
3688C486K25j307k549k566j121J021K625K095J540L32j782l126k637MJ745K719
3704G04K012J029n77k522k571j673N45J611K371K638P18j657l250k276o65R76
3720b587K214K662J712m53k220k410j687o98R16K799L109R87j540k409k238j629
3736c472J75K100K771K033j78j277k244k247j445Q96K583K966R91l86j952k636
3752a322j876j08J718K408J788J012n11k227l012j690Q59K002K679J766J08j406
3768B188k853k042n80J104J956K405J679j55k215l147j733K51J467K525K060R84
$$ plain form
3656 663 -2444 -3734 -3515 -1777 1186 3364 4102 2381 -243 -2447 -3983 -3455 -866 2350 4353 3569
3672 3569 1484 -1164 -3341 -3969 -2480 352 3032 3710 3101 1115 -1762 -3898 -3876 -1504 1711 3486
3688 3486 3711 2404 -145 -2711 -3832 -2811 -186 1909 3449 3781 1999 -1127 -3764 -3760 -2015 704
3704 704 2716 3745 3168 646 -1925 -3598 -3053 -1442 929 3567 4285 2628 -622 -2898 -3563 -2587
3720 -2587 -373 2289 4001 3548 1328 -1082 -2769 -3467 -2551 248 3357 4344 2804 395 -1843 -3472
3736 -3472 -3297 -1197 1574 3607 3429 2152 -92 -2339 -3784 -2888 -305 2661 3652 3266 1314 -1322
3752 -1322 -3198 -3306 -1588 820 2608 3620 3109 882 -2130 -3820 -2961 -959 1720 3486 3594 2188
3768 2188 -665 -2707 -3287 -2183 -227 2178 3857 3702 1487 -1660 -3393 -3142 -1675 850 2910 3894
3784C894j186k572k256j096L64J623K914K003K9j976k378k175l02P89K564K320
3800B559R71p49j741k218j837l54J632K759K247M69j410k132k421j318N48K594
3816d01K297J215N1r76k578k470p83J452K524K155J079n73k004k640j619L53J562
3833a356K068J913Q81q01k492k809p35P60K054K248J606K8k020k382j616k32N87
3850b298K120K525J337p14k259k395j418J64J602K423J806K34j257j876j963j237
3866c206K37K106K806J282k43j753k257j868m93J416K644J444O83m26j551k387
3882a566j602k19K022K718J550M59j400k210k454n52Q67J980J796J543J22j403
3898A651k678k008q4J294K104J974J076r24k368j941j156J64J524K166J894N95
$$ plain form
3784 3894 2708 136 -2120 -3216 -2852 -1229 1685 3688 3717 1741 -637 -2812 -3114 -2325 239 2559
3800 2559 3530 2781 1040 -1178 -3015 -3369 -1737 1022 3269 3738 2328 196 -2225 -3543 -2995 -401
3816 -401 1896 3111 3162 2186 -392 -2862 -3645 -2193 331 2486 3565 2992 988 -1652 -3271 -2918 -1356
3833 -1356 712 2625 3506 2705 213 -2596 -3331 -2571 -517 1731 3337 3365 1345 -1037 -2653 -2885 -2298
3850 -2298 -178 2347 3684 2970 711 -1684 -3102 -2938 -1336 1087 2893 3127 1870 -6 -1969 -3206
3866 -3206 -2969 -863 1943 3225 2982 1229 -1028 -2896 -3389 -1973 671 2115 2798 2372 821 -1566
3882 -1566 -3168 -3387 -1365 1353 2903 3362 1962 -248 -2702 -3254 -2387 -407 1389 2932 3054 1651
3898 1651 -1027 -3035 -3119 -1825 279 2253 3329 2405 37 -1904 -3060 -2896 -1372 794 2688 3283
3914C283j278k725j815m39M06K145K235J470o56j916j871j511m66R46K458K179
3930B445N97r34j936k143j326J49K101K327J336P4j261j790j877j206Q62K138
3946d44K395R20k11j740k344j647J2J699J740J550P83l68j987k401j142M37J636
3963a112K024J928R0j270k506j860j81R83J360K008J438j85k012k083j505k05
3979c088J303K132K188N40j134k207j621p95M5J558K138J739R3j516k064j655
3995b344q11Q99K019K255P31p26j569j851j464k69J534K354J689N5m95k118k085
4012b196j143Q14K035J890J119j34j036j988k119l55J124J866J863R59l39j907
4028D53k175j391N60J287J568J974M52q49j997k006q44M85J645K196J299O0j809
$$ plain form
3914 3283 2005 -720 -2535 -2974 -2568 -423 1812 3282 2626 710 -1161 -2672 -3138 -2192 266 2445
3930 2445 3042 2108 172 -1971 -3297 -3148 -1047 1280 2616 2690 1429 -361 -2238 -3444 -2582 -444
3946 -444 1951 2871 2660 920 -1424 -3071 -3059 -1360 380 1930 2713 2345 358 -2043 -3185 -2748 -1112
3963 -1112 912 2840 2930 1660 -846 -2706 -2887 -1904 -544 1464 2902 2717 705 -1378 -2883 -3088
3979 -3088 -1785 347 2535 3075 1941 -266 -1887 -2682 -2637 -1079 1059 2798 2891 1375 -689 -2344
3995 -2344 -3155 -2256 -237 2018 2749 2023 454 -1397 -2861 -3130 -1596 758 2447 2502 2007 -111 -2196
4012 -2196 -3339 -2525 -490 1400 2519 2385 1349 -639 -2758 -3113 -1989 -123 1740 2699 2360 453
4028 453 -1722 -3113 -2553 -1266 302 2276 2728 1879 -118 -2124 -2968 -2483 -838 1358 2657 2717 908
4045I08j980j150l98O37J787K147Q42o10j743j899j154k57J437K360J410K17j033
4062A521j736j801r22N87J807K058J075j26j252j960j827m06J300K171J520M35
4078B444m05j624j835j299J83J392K079J164O51r29j955k114m83R26J565J562
4094A322J050J04j309k089j479j67J064J732J693R94p48k089j639r81L18J254
4110i70J726J558K11j092j845j384q17M76J830K078R38o29j437j477j216m69J012
4127a507J987J537O54p79j539j572j403K39J706K137Q36np60j485k008p45R80
4144a727J610J746J072k63j347k043j556J92J156J687J301P37m98j618j839j082
4160b472M56J416J534J576K51j407k094j153k73P49J485J497R51k38j382j788
$$ plain form
4045 908 -1072 -2222 -2620 -1983 -196 1951 2793 2183 440 -1459 -2613 -2870 -1433 927 2337 2554 1521
4062 1521 -215 -2016 -2938 -2351 -544 1514 2589 2463 1211 -749 -2576 -2982 -1682 489 2009 2444
4078 2444 2039 415 -1420 -2719 -2536 -1144 935 2099 2750 1821 -134 -2248 -2731 -1805 -240 1322
4094 1322 2372 2476 1167 -922 -2401 -2568 -1504 228 1921 2915 2167 78 -1561 -2542 -2224 -970
4110 -970 756 2314 2525 1433 -412 -1796 -2613 -2137 -307 1771 2709 2080 643 -834 -2050 -2519 -1507
4127 -1507 480 2017 2671 1892 353 -1219 -2622 -2383 -677 1460 2296 2291 1531 46 -1962 -2707 -1727
4144 -1727 -117 1629 2701 2438 1091 -952 -2508 -2316 -1160 527 1828 2565 2067 449 -1390 -2472
4160 -2472 -2016 -600 934 2510 2761 1354 -740 -1893 -2166 -1417 68 1565 2516 2278 896 -892
4176h92j126k33J036J722J696L10q65j610j491n67J52J297J738J178L4r44j664
4193b29j557p15N47K089J801M78m84j134j855j043j37J191J907J048O30o49j487
4210D01k050q15O39J465J758P90n6p34j710j735k74R30J302J712J093m60j703
4227E53j826j088M76J164J285J707K38o64j849j590n41K21J120J961J403l61j401
4244H08j532r91k65M24J674J723N33o66j081j435j314r9J193K103J106J34r81
4261A334j588j273p17N10J291J808Q44K4j035j775j504m21J338J698J252L60k78
4278A868j465j714p51K68J108J274J374M57q49j812j513m50Q56J332J390P44j60
4295A957j232j692p09l79N85J518J647P68o61j815j341m57j34J151J589J335m9
$$ plain form
4176 -892 -2018 -2251 -1215 507 2203 2513 1648 38 -1453 -2020 -1868 -571 1167 2345 2379 1435 -229
4193 -229 -1786 -2501 -1954 135 1936 2414 1930 796 -1059 -2102 -2239 -1048 859 1907 2537 1888 401
4210 401 -1649 -2464 -1825 -360 1398 2188 2132 1398 -312 -2047 -2321 -1391 -89 1623 2716 2256 553
4227 553 -1273 -2361 -1885 -721 564 2271 2509 1845 -4 -1594 -2135 -1914 -794 1167 2570 2209 808
4244 808 -724 -1715 -1980 -1556 118 1841 2374 1708 627 -808 -2122 -2221 -1028 1075 2181 2315 1334
4261 1334 -254 -1527 -2244 -1734 -443 1365 2209 2233 1198 -577 -2081 -2502 -1164 534 1786 2146 1868
4278 1868 403 -1311 -2062 -1794 -686 588 1962 2419 1570 -242 -1755 -2205 -1349 -17 1373 2117 1957
4295 1957 725 -967 -1676 -2055 -1470 48 1695 2463 1802 -13 -1354 -1811 -1945 -794 795 2130 2081
4312B081q56j368j297p30K89J681J721O71l92j226j364j049k69Q31J567J454L39
4329B083p32j034j535j196L67J439J514J030n4r12j225j513k86P99J187J171J045
4346B148Lj344j885j140J76J337J055J046N67n77j075j652p12J82R70J579J278
4363A956K36j229j535j147k98N19J303J447O83m38j109j287r92k00O71J778J651
4380B009J03r07j400j212p47M91J024J423R96j72n96j284j362o20P35J614J164
4397A259M41l94q38j362r79Q3P55J337J000N55l75j346j597p12N80J171J204Q32
4415A614L49j311j450q31k48N38J198J103J109m42j382j407q02L42P18J321J150
4432A569J62p18j007j307l99n5R42J697J138l57q15j430j016k69L93J482J405
$$ plain form
4312 2081 1225 -143 -1440 -2170 -1881 -200 1521 2192 1800 574 -790 -1839 -2108 -1277 290 1744 2083
4329 2083 1351 317 -1218 -2414 -2047 -608 906 1936 1882 970 -255 -1768 -2054 -1255 -68 1103 2148
4346 2148 2151 807 -1078 -2218 -2042 -705 350 1396 1963 1386 311 -1341 -2053 -1871 -901 678 1956
4363 1956 2192 963 -572 -1719 -2017 -1498 -195 1252 1935 1497 388 -899 -1891 -2091 -1420 358 2009
4380 2009 2112 1205 -195 -1407 -2154 -1663 -639 784 1780 1608 1012 -272 -1634 -2254 -1519 95 1259
4397 1259 1700 1306 468 -894 -1873 -1790 -1035 302 1302 1857 1482 136 -1461 -2173 -1593 -422 782 1614
4415 1614 1963 652 -798 -1629 -1877 -1339 -141 962 2071 1629 247 -1160 -1962 -1620 -902 419 1569
4432 1569 1731 1013 6 -1301 -1700 -1755 -813 884 2022 1665 850 -580 -1596 -1865 -1472 10 1415
4449A415K22l75q85j190q88k32J114J576R89L2q46j036j489n02O09J264J061O88
4467A527J09r19j400j299J2O80J352J126O16m85j141j236o28Q3R31J131P95L68
4485A622j57j690j208n69N54J274J086Q36j52j232j033r11k24Q05R93J413N98
4502B005o31j233j332n94K12Q45J338J057M7r00j093q55o60N5J383J516M77q9
4520A548r49j315r92k2Q41J315P52N00k46j099j370j101N22J181J180Q82J02p73
4538I56j252j183k61O92J128Q84P52j26o89j722o97j56P88R52J254L91n06j402
4556a97r72m54J55Q33J040J250J97j003j350q59j12P2J358J281M49l68r12q51
4574d43r65k62N49J592J019K20o57j020j234m76K31J164R75P52N5n87j096j165
$$ plain form
4449 1415 1637 1262 377 -813 -1701 -1933 -819 757 1746 1778 932 -104 -1593 -2095 -1486 -222 839 1527
4467 1527 1636 717 -683 -1982 -1970 -1290 62 1188 1804 1319 178 -1058 -1686 -1603 -672 459 1254 1622
4485 1622 1465 -225 -1433 -2002 -1448 -174 912 1748 1596 364 -669 -1580 -1804 -999 -6 1407 2005
4502 2005 1374 141 -1191 -1785 -1573 -728 610 1667 1714 814 -279 -1134 -1794 -1739 -356 1160 1637 1548
4520 1548 599 -716 -1708 -1730 -889 426 1178 1678 1432 333 -1037 -2138 -1616 -435 745 1627 1729 956
4538 956 -296 -1479 -1740 -1048 80 964 1716 1590 901 -821 -1518 -1674 -886 66 1320 1711 1205 -197
4556 -197 -1169 -1623 -1468 -635 405 1655 1852 849 -501 -1360 -1472 -1400 -42 1239 1688 1320 408 -443
4574 -443 -1408 -1670 -1121 471 1490 1710 1053 33 -1201 -1677 -1446 -282 693 1445 1500 913 -183 -1348
4592a348m37O24J153J301M96n26q25j109j102L45Q58R96P31L80k36j207j306n92
4610a804N42Q44J396N83J14p70j523o14k50O10P36J216O65j41j251j314n69J34
4628a396O50J276J125K2o80j073p66n33J02P98J576O07r4p13j371p10l56O30J127
4647B21J058L07l43q35q61r07k47Q84J414O19J18m09j003j057o06N37R48R55O56
4666A449j9n53j156j046o1M77J262P70M73k21j252j003o99M11O15Q59J031K82
4684A619n25j224p60n53K38R95J148O61k25j043o86p90j01L78R74J221L86n18
4702A195r51j024p12J47R13R60Q72J28o12j010p11p07L11J106R64P02q8j009j299
4721h25n77j01Q32R78Q90J88m15o22j097p55L14Q54J075N24K27o17j346o40j53
$$ plain form
4592 -1348 -1785 -1161 -8 1293 1789 1263 438 -671 -1773 -1428 -570 426 1157 1537 1301 94 -1212 -1804
4610 -1804 -1262 -418 978 1561 1675 905 -618 -1232 -1482 -872 -136 1080 1745 1604 353 -961 -1530 -1396
4628 -1396 -746 530 1655 1677 997 -76 -842 -1375 -1273 -475 1101 1708 1614 901 -470 -1180 -1536 -906 221
4647 221 1279 1586 1243 408 -453 -1360 -1607 -723 691 1310 1428 1019 16 -1041 -1647 -1110 -162 793 1449
4666 1449 1430 877 -279 -1325 -1386 -909 353 1123 1596 1375 123 -880 -1579 -1168 -553 306 1337 1619
4684 1619 1094 -130 -890 -1443 -1205 -210 938 1599 1374 331 -355 -1145 -1246 -868 106 1327 1713 1195
4702 1195 244 -780 -1492 -1345 -432 528 1400 1528 916 -94 -805 -1512 -1201 -95 869 1571 1483 474 -825
4721 -825 -1402 -1503 -671 307 1197 1385 970 348 -749 -1504 -1190 -336 739 1263 1490 873 -473 -1113 -1266
4740a266N73O05Q96O98J1r45j291n81m8P17R18R51M15o06j130p54k44l0M26J171
4760D86Q76K63p55r97j016j02L01Q99J125L79m53p03p77q30j42P44J115R88N5
4779A456o90p45r67n35M41P36J008M24on58p39j059k52O62Q43Q42K70J26r27j194
4799h64n10K37O37R15O39K53l10j198o24o38M38N61R04R73q8p79j203n08J30J21
4819i14N27J146P23j75j136r96m14j36O79J116R67k97n83p97m94o28K28P66R36
4838E18P05O1p07q68r44k88N66J117Q38K39n32l27r00q25m2N98J057P46L14m65
4858H61j078q94m43O70P97P59M71P1o94q76r09M2M80O93J008M84l53j029j022
4877i62m03L95N22P51O27L86o92r24o64k81K7Q74J012N12j56o13r49n30j60L15
$$ plain form
4740 -1266 -693 -88 808 1506 1517 572 -719 -1300 -1348 -631 287 1238 1653 1047 -83 -837 -1081 -1111 -685 486
4760 486 1362 1625 870 -127 -1143 -1245 -944 -45 1080 1459 1006 303 -474 -1304 -1446 -702 413 1401 1456
4779 1456 766 21 -946 -1481 -1040 -304 704 1128 1122 564 -175 -1234 -1486 -824 19 861 1131 1257 330 -864
4799 -864 -1374 -1137 -500 415 1054 1307 997 -201 -825 -1463 -1025 -464 440 1413 1325 546 -657 -1165 -1035 -914
4819 -914 -387 759 1482 1307 171 -825 -1239 -1375 -696 420 1387 1090 507 -290 -784 -1412 -1184 -418 518
4838 518 1223 1284 577 -291 -1235 -1523 -957 160 998 1237 705 378 -522 -1347 -1389 -791 266 1012 1326 861
4858 861 -217 -1111 -1554 -884 -87 672 1143 1214 520 -356 -1265 -1223 -743 -50 958 1442 1089 60 -962
4877 -962 -1365 -970 -448 303 930 1316 624 -300 -964 -1245 -1218 -344 668 1180 1024 411 -538 -1068 -1228 -913
4897i13J007R44J95n11n79r78m03j06R22J077N18q2o31o76o32m37L54Q13Q32M19
4917A133J12p40j039p69j0O72P45Q47J16j93o93r85o66L37O54R10M56L11p47p50
4937b99o29m37Q63K74P11P44l1r33o35q27j29N63Q74R74K37n61p47r48p2N9N15
4958d34Q84O26p5m74p09o64o42N45Q15J036J26q1o30o80o77j18N96Q71N55O8j47
4979G91o93q60n30K48Q46Q14M02j54m12r04m57k36L37P84O27P31m12n53r81o97
4999a309L47P64K94Q57J85n55o60o69j49j99O05Q03Q75o6o38r02m99k99N16Q15
5019A16O00M25k32o94q02n92K09M68Q04N89J23m31p36n55m87K22Q67O27M43L1
5039I95m96q53o27k16N22R41N50M28m24m87p89o60J76N40O50O67J98l58o68r65
$$ plain form
4897 -913 94 1038 1233 722 143 -835 -1238 -1344 -422 655 1173 1091 460 -216 -848 -1285 -931 -118 714 1133
4917 1133 1245 505 -534 -1303 -1313 -641 104 951 1067 874 181 -804 -1470 -1133 -479 431 887 1198 451 -299
4937 -299 -928 -1365 -502 -228 483 1227 1196 263 -372 -1199 -1328 -765 109 1083 1320 759 12 -936 -1008 -949 -434
4958 -434 450 1076 1001 527 -182 -846 -1488 -943 -128 908 1034 953 323 -357 -1034 -1152 -556 315 870 938 791
4979 791 98 -762 -1292 -1044 -198 616 1018 864 452 -452 -909 -1145 -808 -24 603 1334 922 369 -612 -1309
4999 -1309 -962 -198 96 953 1138 583 -77 -746 -895 -1094 -489 314 1189 1123 485 -417 -916 -1215 -699 116
5019 116 716 1141 909 215 -587 -1179 -970 -502 302 891 1014 583 -153 -708 -1195 -973 -106 521 964 995
5039 995 499 -354 -981 -1197 -675 266 816 1244 820 333 -456 -1116 -940 -400 250 917 1115 757 89 -876
5059h76l34N37P27O37M02j85m81o83n30j61L51O41O62M42j51r66o75l27J43M09
5079d18P91M92J21l46o72n93l06j86R95O60O29l50n16o99m13j8K76P43P50N8j49
5100H49n42p08o39J16N14P50N41J64k37q45o80k66L26M99N86N02L4n00q04p37
5120a077o6N74Q58N16L93l33r07n59j29j42O31N03O40J23j71j237k83l42L66R11
5140B69L36L45p1m60o73n25j05J42P47R67K69n87p52m27l51m6N06O88N51j28k20
5161D75m92p17n05L11R71P28M15m58m28n90o51j5L79Q46M86J68k6o50r26m26J91
5182i14O34O19O83j51l94m70p67k00L27M88M94P55l02l60q84p70K88N75N16O65
5202H32J77m92n34n25k79J34K75O21Q21j12n77o73l70m6K66O06O54M6j16m41p09
$$ plain form
5059 -876 -1210 -673 54 691 1093 908 427 -256 -786 -947 -596 45 707 1149 998 32 -643 -970 -827 -418
5079 -418 373 865 986 640 -32 -625 -931 -1117 -122 538 1167 817 301 -398 -811 -829 -553 190 940 998 849
5100 849 307 -401 -1040 -924 -410 340 881 1045 808 -37 -717 -983 -657 -158 428 930 964 464 -340 -1077
5120 -1077 -1143 -569 289 805 1198 865 -42 -601 -730 -872 -241 262 902 1025 854 -383 -666 -1008 -642 269
5140 269 605 950 879 419 -254 -779 -884 -742 5 972 1241 654 -98 -525 -876 -922 -416 272 823 695 475
5161 475 -17 -734 -1239 -928 43 771 1186 728 300 -290 -941 -956 -577 269 755 923 897 247 -679 -1105 -914
5182 -914 -280 339 1022 871 477 7 -760 -960 -633 -145 349 1104 802 442 -442 -1212 -924 -349 167 832
5202 832 1009 517 -17 -542 -821 -687 -412 209 1030 918 341 -332 -702 -748 -482 124 778 824 708 267 -442
5223d42l29k10L71P87N36K48k20q93l98m74L00O28M83M05J58m16p21o24l40L47
5243h04Q25O03K27k26l25q37l25K72K41O43M97J11l12o29n61l61K87O10N53M52
5263I41n1n43o69l54r8J33N97O93K83l08n44p05l37Q0M54Q73M02j9m92l80o28
5284f72r1j15Q16N49L72R6n43o98p03J15K93P86L53L13j78m90p02k89j07P15N48
5305C68M19M1l46l82p33m44M34M95P11Q3Q7l20o64n80j19L28P02N21J89p6o85
5326B9m82l35J99K84M39N78K22m74o30m41l30K60N76M90N08l55l76n12k40k99
5346h89L91L37Q21K15j92q02k58m45N7P36L05M49J99m73m55n89m23K60P12M89
5366D45L30j81k59o58m09k01O08O83M6M74l55m13o91l75J41O24N81L58J45m82
$$ plain form
5223 -442 -771 -981 -610 177 713 961 741 -152 -550 -1024 -724 -96 387 792 950 534 -187 -811 -1151 -804
5243 -804 21 624 851 625 300 -537 -862 -590 -349 294 791 902 590 -39 -600 -961 -674 -64 489 941
5263 941 890 347 -322 -676 -774 -641 -44 649 932 624 80 -625 -962 -882 -428 445 847 828 336 -44 -672
5284 -672 -763 -878 -62 487 859 955 412 -286 -989 -874 -581 205 558 871 693 203 -499 -788 -895 -180 368
5305 368 787 828 482 100 -633 -1077 -643 -148 563 646 733 413 -251 -831 -950 -622 80 601 790 714 29
5326 29 -453 -788 -589 -305 134 712 934 460 -170 -611 -941 -681 -105 385 893 538 162 -350 -590 -889
5346 -889 -498 -161 660 875 683 -119 -377 -822 -765 -29 276 725 924 451 -4 -593 -1016 -756 -44 445
5366 445 775 594 335 -323 -732 -933 -325 358 404 878 523 110 -581 -956 -815 -191 390 748 893 411
5386D11n36o11OK75K66O79L21k6n04o37m50J84J90M44O58L37n07p67l68j74K54
5407e55O3O16O01J39n08o78k59k55L15N42O01J33k59j53n36m93j82L20N75O09
5427F36N9j55n48n79k09J00P28K97M02o8j32q02l94k93M34O58M07J44j9n41p46
5448f21j67K13K66N91K43J63k57m47q34k8J94N91M19M46l4m49m39m83l9J97N21
5469D6N84K59k92m31o60lj36L71M30N00j3l73l26l60k33K5M50M89M44j09k96n41
5491a75m21j30K13P44M62O8k3n22m07o09K69K86L99M46K04l64o40n97m9L09N96
5512E9K08M59o3l78m70n47J17R8N91O10J0j54m79n76n2P1K86M12L81J56l19o21
5534b01k21k61p2P17P18L1l2n57l40k37j51J83M62N12K42l36l22l29o10K19M65
$$ plain form
5386 411 -125 -736 -730 -455 -189 490 811 785 281 -356 -806 -622 -432 12 670 1007 500 -267 -635 -809 -555
5407 -555 -492 124 725 864 356 -322 -581 -836 -521 21 622 755 496 343 -193 -686 -868 -548 27 636
5427 636 695 540 -8 -587 -796 -696 32 329 731 663 531 -271 -665 -958 -524 134 541 685 666 125 -621
5448 -621 -788 -575 -309 282 525 688 431 -16 -850 -878 -684 -93 326 772 738 289 -150 -633 -672 -475 46
5469 46 630 889 597 166 -494 -497 -633 -262 168 668 655 282 -44 -404 -637 -612 -162 327 771 662 366 -175
5491 -175 -596 -726 -513 231 693 761 738 216 -191 -800 -531 -245 154 600 804 440 -200 -797 -846 -537 59
5512 59 267 726 663 285 -185 -732 -615 -517 74 684 694 540 61 -515 -567 -496 -210 202 583 739 420 -201
5534 -201 -422 -683 -755 -38 680 711 679 122 -218 -455 -606 -423 39 551 793 457 135 -194 -804 -585 -120
5555a20L83L51J16l80l76m06j39l7N36M15L18J22m55n02n75K09J91O18L70l2j7
5576E90m48n21m13K52L88M48K96J22k06o94m34r5K37N12M31K50j99l08m18m47
5596f57R8K18N98K75K14l57m53k89j74J39J75N46K14J5k21l80m21k46L33M99M53
5617E79J83k84j60o05k45p4M42J55M98K55l23l33m25k91K35L35L45K44J27k62
5637C96m99m97r6K84M65K48M31j69o58k99m28K91K71L86N02O6k48o40j96k49j03
5658g42N86O28K28o6l55m98l30jP8N88K33K51k39l01j34m28l54M78O88L88j93
5679E05j17m81l40k08O1L45N66L41j88k86j06o31j0L37L56L08L9k22k15j98m43
5700e87O0K35N04K17J64r0n27k88l94J53N14K61J87K47n02l91j62J0j31M14O82
$$ plain form
5555 -120 263 614 730 350 -26 -432 -571 -608 -72 343 661 783 328 -174 -749 -540 -349 269 639 607 590
5576 590 142 -379 -792 -540 -152 296 592 714 508 -186 -620 -715 -478 34 465 715 516 208 -210 -657
5596 -657 -559 -341 257 532 746 389 -64 -353 -527 -388 -213 333 547 562 341 -39 -460 -706 -373 126 579
5617 579 762 478 318 -287 -532 -606 -164 -9 489 744 421 88 -337 -628 -393 -58 287 531 658 396
5637 396 -103 -600 -696 -412 53 301 732 563 -95 -394 -822 -531 -260 126 628 694 446 -194 -390 -639 -742
5658 -742 -156 472 700 634 279 -219 -549 -550 -472 116 349 600 361 60 -74 -502 -856 -378 310 698 505
5679 505 388 -93 -433 -641 -580 -235 331 672 484 198 92 -539 -549 -212 144 452 491 269 54 -144 -587
5700 -587 -527 -292 212 429 593 503 -24 -312 -706 -553 -39 222 409 656 154 -237 -399 -389 -520 -106 576
5721E76P7%o72l09l02L7K66M38K78L36o14k95m13J27N8K74M82K94j28l58l38m54
5743f40J10J78M80K06K15n2l24m15l96K3L84N08J11pJ5l64m81l19M51K89K23K81
5765D76j15j06n61m68K18J30N40L30J27l93k58k29l50J42J70N18L88R5j68n00
5785a4o55J66K51J85L57J86K10p42k33k68j35J52O72K82L72m75k46k00n40J90
5805d85L07M71K61M2l76k61n56np1O57N01N8j97l12k72l73R2L12L43L08no1l94
5828a6l53k10K48K24L16K79K0j61m34n17J04L47N6M02M61k57m26m60j80m6M38
5849a65L00K00J71j91m73j97j37j49N09L89K41n1l84k12l45K9j0N88K07J63l6
5870D47k43l80n27R3K57N47K58pL1m66l18l40J51P2O39K86j48m1m25n34K0O77
$$ plain form
5721 576 653 653 -19 -328 -630 -593 -327 111 389 725 111 -184 -597 -470 -412 -138 344 638 510 152 -186 -640
5743 -640 -530 -352 128 334 549 497 173 -242 -638 -615 -231 277 388 381 396 32 -449 -768 -317 -28 195 476
5765 476 361 255 -306 -774 -556 -426 114 444 571 178 -80 -309 -659 -517 -347 171 559 654 486 -14
5785 -14 -669 -503 -252 -67 290 476 686 -56 -289 -557 -692 -540 132 414 786 311 65 -135 -675 -485
5805 -485 -178 293 554 596 220 -41 -597 -602 -673 -16 485 543 346 34 -238 -611 -519 -207 136 444 439 378 -16
5828 -16 -369 -579 -331 -107 209 488 508 347 -87 -604 -500 -153 -97 305 766 509 83 -377 -557 -603 -165
5849 -165 135 335 506 315 -158 -355 -492 -641 -132 257 498 447 63 -149 -494 -465 -475 113 320 483 447
5870 447 204 -176 -703 -610 -353 194 452 445 476 10 -308 -648 -497 -425 214 500 352 311 -114 -648 -628 49
5892D9q7M26K16j67k71m77l01J94L47J54K27L30k16m36n40Q2J00J49N92R1%k19
5914B43m87p8j87Q6K08O23J93j08l52m48k13J57O0M92L42r7k20l25k85J8o8L09
5936a37N61J97j63j69m37k81jJ44M28K83N7O9m16l70l12J54K63K83K41J52l5n21
5958a0n64K1K16L39K84L28j52j53o14L6k99K72K93M03R2k2l39n56j74J23J19L94
5980C7L68L46k96o55j28q7J53K86L08K45k17k69j78j31j47N2N66K14M4k24k98
6001a1l19k76J33L70L83J31o2O9n09k96j44K04L97K77J70j4l60m00k72K39J28
6022a62L85K4J30R1m34j62n70L64K7M56M03j90j92m24L8l89K90K43K61L96j46
6043D39k91m47j70j42M05L28M78k37j46j65m57Q7j40K14N40K91l6l84k45k11l02
$$ plain form
5892 49 -38 388 604 437 166 -311 -612 -418 -71 83 310 640 424 -12 -552 -470 -370 -221 371 462 462 243
5914 243 -244 -322 -509 -423 -215 408 601 493 141 -307 -520 -363 -303 189 531 434 214 -111 -396 -378 -446 -137
5936 -137 424 621 458 289 -148 -429 -430 -286 142 425 482 551 135 -235 -547 -393 -130 153 394 546 511 -10
5958 -10 -574 -553 -337 2 286 614 462 309 -305 -269 -568 -296 -3 400 492 470 131 -425 -599 -476 -357 37
5980 37 405 751 455 -200 -328 -415 -262 24 332 577 360 91 -87 -218 -365 -313 253 467 511 287 -11
6001 -11 -330 -606 -473 -103 280 411 349 418 -91 -387 -531 -327 70 347 517 503 143 -257 -529 -290 -162
6022 -162 223 247 377 468 34 -128 -698 -334 -307 149 552 362 170 -254 -216 -605 -315 -72 189 585 439
6043 439 148 -299 -469 -611 -206 122 600 363 217 52 -405 -318 -458 -244 296 587 551 167 -78 -289 -591
6064e91L35L18K95Q2j76N2k52n55n0J24O79K34j25p3k60j37n16K54J65L48L19
6085D70j79r2l19l47J14K4L06L15K54j99k23l54l31L61J8K60K27L54j55m53m04
6106c53L7NJ59M24M22k97k19l30l4k26J13L07M44K73l36k56j60m32J72J64L16
6127A93L56j41j20m50J07k20j04J83K82L21p8j18m67j18KJ20L83K0L8J17k75j51
6149a20m24M3L88J82L94q7m8m40l06J1K52J66m4M97q7k61l58j08k46J84M09L99
6171C96nk30j96k09k89j7K94L07L01m3k05j86j19j92J57J95K93J59j32l22j62
6192b05k20J26o0M80K09N0pl78o6k96m3L03L52R6M6n4n16l40r6J88L91L06L9J92
6216D97l20n03M4J9K40oK67J40N3m06l28j07L8J22L91J87L52n58m37j84R6J27
$$ plain form
6064 -591 -256 62 357 439 263 315 63 -492 -542 -418 261 495 370 297 37 -100 -616 -362 -197 151 470
6085 470 291 199 -120 -467 -353 -329 -23 292 546 347 124 -230 -561 -200 -182 78 305 659 504 51 -353
6106 -353 -316 -311 -152 272 694 397 178 -152 -186 -412 -299 8 452 725 389 133 -27 -459 -287 -123 193
6127 193 549 408 288 -162 -55 -275 -379 -196 86 407 329 211 -256 -374 -372 -252 131 151 189 306 31 -120
6149 -120 -544 -501 -113 69 463 376 328 -112 -418 -407 -155 11 -33 464 377 116 -242 -350 -596 -412 -3 396
6171 396 391 161 -35 -244 -533 -550 -256 51 352 309 104 -82 -201 -393 -236 -41 252 411 279 -43 -205
6192 -205 -425 -299 -359 121 330 380 373 -5 -71 -367 -410 -107 245 341 387 333 -183 -523 -619 -431 -40 266 305 497
6216 497 177 -326 -282 -263 -23 -29 238 378 431 25 -303 -410 -372 -250 141 328 680 122 -315 -499 -403 -276
6238b76L6M80J74K5m32j98k94J4N5N35M28j03j91k88j81k78K09P1N15M5M7k65
6260A28k54q2j79N4L98K62N7j20l69k0k83M8J09K44K47K17j57k97l98k00K96L74
6282G5M42j32r6j24j00n12j67M29J65K29K03Rl47l15j72J02J45M74o4J81j97k59
6304c1k06k92K30R3L37K66Kk82j63l72J13m2L62L12P2j70j89J5m60j33L24L03
6326H9L48j53j01j74k13j34j8L01J05K94J08j60m21k45j79L83Q0L90J71k68k46
6347d3k49p4L8K26L25K00j22j84k05k11j11P1L19K81K23j37R5n42k05l3K02J29
6369gK57J65j89l34j6j4p3J86N9L49q2j93N7l51l25N8J25O64J7k0k73j16k84r0
6393d30K14K23K53J98j13l34l43j28J42J30M32m9J45o6j06l74j64J62M3M51K89
$$ plain form
6238 -276 -240 240 414 439 7 -191 -485 -471 -416 119 547 444 253 -35 -216 -494 -285 -214 301 346 393 128
6260 128 -126 -208 -387 -333 65 327 384 264 -105 -125 -408 -360 -251 -7 240 457 300 3 -395 -595 -299 75
6282 75 517 385 289 165 65 -447 -614 -185 -20 209 412 421 74 -241 -413 -311 -166 308 244 425 228 -31
6304 -31 -237 -529 -299 -206 131 397 399 117 -46 -418 -305 -347 15 327 399 229 40 55 -405 -538 -214 89
6326 89 437 284 183 9 -204 -338 -356 -55 50 344 452 292 -129 -374 -553 -170 -90 300 471 203 -43
6347 -43 -292 -366 -328 -102 223 423 301 117 -88 -299 -410 -339 -20 261 484 347 442 -100 -305 -338 -136 -7
6369 -7 250 415 226 -108 -124 -138 -211 -25 34 383 301 108 165 -186 -511 -453 -328 336 353 333 60 -56 -340 -430
6393 -430 -216 7 260 458 345 11 -332 -460 -318 -188 244 195 340 274 168 -206 -370 -208 -165 286 575
6414E75j40m09j57l08o9L43K27K31K08j59k63m30k7q0L95P3L59no9m30k01J40
6436a96k5K42L42P2l60O3m02Kk98L57K17K95J35j15m33l3j98P2L51j19N01m4k04
6459B22k72k35j92J52L26N10j73j76k11j6l89Q9L57l6K31L19l7l96l38j97J42
6480c20M15J04K31m9r5m09j40j79K92J96J47L17j32l22l74O2j66N32LJ08m7rj19
6503D6l58o0L7K72K72J93r7j01k64k37K53j61K33J61J89r9r2k39m05J47O7M01
6525A58L19j45O2m96l53K1K29J17K85J14P6k32l77k39J68L31L8K37K16j74j31
6546B24n60j08L44n2K13K04J91r5m63k78K09J3J45K85K01j32k87k03k32L7J49
6567a95J60K58J25j41o5k61r5K3M0M54J42K3m09n9k0k57M3J47N98j88j62k23O7
$$ plain form
6414 575 435 26 -131 -439 -508 -165 62 293 501 342 79 -351 -378 -458 -63 10 369 364 295 -135 -336 -196
6436 -196 -221 21 363 435 75 138 -264 -262 -560 -203 14 309 444 329 -104 -137 -335 -263 88 -31 470 426 222
6459 222 -50 -285 -477 -325 1 511 338 162 -49 -65 -454 -365 -8 -44 187 506 469 73 -265 -462 -320
6480 -320 95 199 430 381 286 -123 -263 -442 -150 46 193 510 378 56 -318 -256 -422 110 113 221 174 165 46
6503 46 -312 -372 -335 -63 209 402 305 204 -60 -297 -44 -205 28 189 378 279 187 -52 -457 -310 -243 158
6525 158 477 332 394 -102 -455 -434 -205 -88 197 311 387 155 -222 -461 -293 38 76 313 529 355 224
6546 224 -336 -444 -100 -152 61 265 456 361 -102 -380 -171 -158 -13 272 473 341 54 -149 -381 -344 -195
6567 -195 -35 223 348 207 142 -119 -214 -191 -151 303 445 468 59 0 -20 -277 -234 -87 511 323 161 -62 5
6590El11OJ76J96J35oJ24k30k27l72K23K30Q1K23K01l52j33j21p8n5K10K38J23
6613B86n4j17l60j59J40mM74oJ65k21j70j60p0o8J46K30L44J21m20j62k01j0N0
6636b26K43K98J05j88r1k37k05k18K11L72Q5K01j14l30j82j89L17K81L5K54j15
6657C07k49o0j96k82J66L32K37J2r6l5l84j31m1K85K21L06j71J86k27l74k99L52
6679a41J8K10K93p8l40j11j64P6l9J83L76J45j56j95k47k03K16P5L13J49j54n
6701B21k20j43k17q3J61L83L47j94j50j80j53k04L53K68J21q2j50J74m09j08j28
6722c93L25L00J0Np4l78j43J3oK20J40K60J2n3j90l13j33O5L39M24l7k18j39j69
6746a33j00L0k6M32j10K48k56j14k42M2O6J35J62K25M3k61j76j34j29J80K82L8
$$ plain form
6590 5 -306 -300 -124 72 207 201 325 95 -132 -504 -281 -51 30 253 454 102 -31 -152 -230 -285 -75 163 286
6613 286 232 115 -245 -404 -264 -268 206 200 365 144 -26 -186 -256 -324 -178 52 396 517 97 -65 -266 -276 -226
6636 -226 17 315 420 232 141 -96 -301 -519 -308 64 149 350 236 -94 -276 -465 -148 133 168 422 307
6657 307 58 -2 -198 -480 -314 18 255 267 171 136 -248 -379 -420 -135 86 392 221 407 180 -194 -493 -141
6679 -141 -123 87 380 302 -38 -149 -313 -237 -276 -93 283 428 272 77 -170 -373 -157 -82 231 380 226 221
6701 221 1 -142 -359 -442 -281 102 449 255 105 -75 -228 -432 -79 189 310 228 78 252 -157 -265 -393
6722 -393 -68 232 242 247 173 -205 -348 -335 -341 -121 19 279 291 238 48 -265 -398 -333 6 430 393 175 36 -133
6746 -133 -233 -203 -229 203 93 341 85 -29 -271 -229 -163 -28 134 359 402 141 -35 -169 -298 -118 164 202
6768B02K00j23j68m44j59K07J51J90J26K04j78n8m69j29N7K40L95Q6m2j86k20
6789a18k58J08J00K49J41n7K58k72l55j04p9K11M48K3o9L3k53l59N2K39J7K04
6811A59J74p6j42l25j21O9R0K56N2K64k49k31r0j24L20k44L09K15mj09k79j94
6833b80m8R9K11K11j5m7j14j53j55K5P5N80j02M1k01o4k38j61R7K57Q7K02J7m6
6857B78k31k18o9O5R2K63K2J37j89k80k69J21J50K79J2K24J2m57j26j70J77l3
6879b10K55K83Nl03j28j28j54K28K19K49o9q8l02n4j9j21K93J80J03N5q2j18j82
6902h8k05m7L66L82m5p5p3j97n33R0L54J14K22j13O0o2j92j23k27J84L12J16J25
6925C45l47M3l40j23J63L13R0m9K41p0l76j45m4K9M31K43%k97q0l20j39K44J91
$$ plain form
6768 202 402 279 111 -333 -492 -285 -134 56 182 386 208 150 -319 -448 -391 -151 244 330 288 102 -118
6789 -118 -376 -268 -168 81 222 165 423 151 -204 -308 -387 -176 272 295 226 259 6 -353 -301 -62 -45 159
6811 159 333 257 115 -210 -331 -262 -172 84 136 400 151 -80 -170 -294 26 -218 91 306 302 193 -86 -280
6833 -280 -328 -229 -18 193 178 131 17 -136 -291 -266 -191 389 287 328 127 63 -175 -336 -239 18 105 307 324 278
6857 278 47 -171 -240 -175 -83 180 202 339 150 -130 -399 -278 -128 151 163 387 399 -58 -184 -354 -177 -210
6879 -210 45 328 333 30 -98 -226 -380 -152 67 316 247 159 -143 -197 -216 -337 -44 136 239 294 212 94 -88
6902 -88 -293 -340 26 408 363 288 215 18 -515 -425 -71 43 265 152 212 150 -42 -165 -392 -208 104 220 345
6925 345 -2 41 -299 -422 -259 54 144 95 336 266 -110 -255 -299 -270 161 404 404 107 27 -293 -432 -188 3
6948CJ23O8L8j03j40k85L6R2J11J25J74P7l35o4m7j38k23N21L36j36j35m3r1j68
6972b04j5j3L72K19q0k91j55J9j87O4L70p2J99P2j04l13l57K50J9L86r5J53m0
6995A97k08p6k21O1J62K26K38j34k46j24Ok33J73J26J05L44k69r3k21j88J99P5
7017a01K02J99J53j70l95j07l6N2J37K32jK63l56r9j38j79J17K66L1J23n0j71
7039b8j94k8L16j30RK45O5j5j91j25j69k0L28k2J33O9j39k67n0k00K45K00K34
7062B66p1n6l7k49j86J36J13P6J98N0j5k97j60q1Q2L3J41L33P8l63j07L8k68J01
7086b45J21K84K79k29k68J38l07l4J3L81M13k67r4l47j21M2j01J82K33J76k58
7107iJ67K2m24j99K39L50J44j06r2O2n16K38k38K53K41j09K93p8k85k99J8J53
$$ plain form
6948 3 126 194 232 129 -11 -296 -260 -168 -57 68 242 319 -16 -80 -127 -265 -488 33 369 233 98 55 -36 -204
6972 -204 -219 -232 140 359 279 -12 -167 -148 -335 -271 99 27 226 298 194 -119 -476 -226 -207 179 84 237 197
6995 197 -11 -87 -308 -247 -85 141 379 245 -1 -125 -119 -352 -179 -53 52 396 127 34 -187 -375 -176 -101
7017 -101 101 300 453 283 -112 -219 -255 -203 -66 166 165 428 72 -27 -165 -344 -227 39 70 193 143 -28
7039 -28 -222 -250 66 -64 -55 190 255 240 49 -76 -245 -265 63 41 174 243 104 -163 -213 -413 -168 32 266
7062 266 195 139 102 -147 -333 -197 -84 -8 190 240 225 -72 -232 -313 -231 -198 -57 276 354 -9 -116 -78 -346 -245
7086 -245 -124 160 439 210 -58 80 -227 -261 -248 133 546 279 185 -162 -283 -241 -342 -160 73 249 -9
7107 -9 158 180 -244 -443 -204 146 290 184 92 154 -362 -124 -362 -109 132 23 316 238 -47 -346 -328 -175
7129a75J50K27K2K00k50k57m3Q8j49J80KK72Rl95k25P2M7J83R4N2L82k89j70l15
7153b88K4J00J82J82L5o4n5k62j51Q8p6L39K25j75k6j55j05L0j51K74N7K58k05
7176H1K66k91l87J04Q6K27MJ49r8l9k69k10rK39N51j96O9j77j27j93m6Q9PL81
7200B11l6J64k99j85r6J84j2J11J95O7m6k75j04q7qm5K67J70M09m46l21J92l72
7223c62K54R9J96J23k17jK7l50rj3K31L41j09mk0l34j83J33L03L3K56J4j38k03
7247F7l04q1J29K63%M09l54M2j34k43p9J53K8K72J68l27n4k91OJ16P5J81J98R5
7271C35k4l06k93J90p9L4L43k10K52k01r3j36o1M9K44R4Q3J3j69N2k42k53L71
7294gLL63O6j88k59j38j0J4K12JJ21p6Q0j59j52j61K03K3K16NP6l26n0o7K30o
$$ plain form
7129 -175 -25 202 224 424 174 -83 -126 -38 -187 -7 -5 267 276 -119 -344 -272 -225 -42 52 104 486 197 27 -288
7153 -288 -264 -164 18 200 235 171 116 -146 -297 -209 -285 54 279 104 78 -77 -182 -152 -303 -29 28 286 81
7176 81 347 56 -331 -227 -141 86 90 239 141 102 -167 -377 -386 -147 404 208 277 100 -27 -220 -266 -177 -170 211
7200 211 175 339 40 -145 -241 -57 -69 42 237 304 258 -17 -121 -208 -216 -261 6 176 585 139 -182 10 -362
7223 -362 -108 -9 187 310 93 92 119 -231 -240 -253 -22 319 210 206 186 -148 -331 -198 105 138 394 408 270 67
7247 67 -237 -318 -189 74 74 483 129 171 37 -206 -285 -132 -104 168 336 9 -45 -336 -330 -214 -139 42 240 335
7271 335 311 5 -288 -98 -177 -143 200 -10 242 41 -52 -188 -249 -200 44 138 221 234 65 117 -125 -378 -7
7294 -7 -4 359 425 237 -22 -160 -170 -156 56 57 178 102 182 23 -129 -290 -87 -64 152 157 233 -93 -143 -210 20 14
7320A4L5K08j1j18k38j19RL9k5M40O0j3k20j42j80K5K91J56j53O0R0k31k26N1
7344a98n7J63J48J95N6k77K2l19j3n3L79L26L8k11j45j44j53J48n7J69K59K1k54
7367D3L3j86nn7K57N4O4K8q7j86j78K5J87j10J78J70J70m19l1k16O0J51J04K54
7391C03m9p9k48j63n2L2K63L7K87O4k99j89r9K0R7J27J9K38r4ql85j82J38Q0L07
7416A65m5O5J1j95n1j84l5J21J37J33M7j02j62p4j4L8L88p5R8J10l24r5j74qK11
7441a4K1J6J61l2j01l13kJ32K0J88J16J58k30k15k5l7J26J70j61L77m1k04l80
7464b70R8q6K33K21J01j67k18L0j41J53j34J15Q7J55k34J86k63P6j10n0L24J89
7486B95j11j09J07m39J7j76K99K57L73j51l39j4j47j55J02K18J74n7K2j30k35
$$ plain form
7320 14 49 257 246 128 -110 -229 -220 -181 -206 234 294 281 61 -81 -261 -236 55 211 58 118 208 -23 -249 -198
7344 -198 -255 -92 56 251 307 30 52 -267 -280 -333 46 372 410 199 54 -90 -243 -95 -152 17 276 297 43
7367 43 76 -110 -115 -172 85 139 203 231 144 -42 -220 -195 -8 -118 60 230 400 -19 -50 -266 -206 -55 49 303
7391 303 254 175 -73 -236 -288 -256 7 44 331 395 96 -93 -192 -172 -75 52 71 309 215 207 -178 -360 -222 -142 165
7416 165 120 185 196 1 -50 -234 -269 -148 -11 122 169 67 -95 -169 -183 -145 243 168 266 376 52 -43 -217 -225 -14
7441 -14 7 23 184 152 51 -262 -264 -132 -112 76 192 350 120 -95 -120 -157 -31 139 -22 355 314 110 -270
7464 -270 -172 -258 -25 196 297 130 -88 -58 -199 -46 -180 -65 22 177 -57 129 -134 -58 -168 -218 106 295
7486 295 184 75 182 -257 -240 -416 -117 140 513 362 23 9 -138 -293 -191 27 201 144 166 36 -199
7507a99n4P6m5L07J17k7%j82k06j56J92N2K07Q0n6M6p4l48J99k3J19J35L10j69
7531C01m11O3p0m3Q7J81J77J8m8k01o2k53k9L37PL10m3k93l9j40n3j14K94K54
7555B30J72j53n8l42j4q7K01J85K13k53N3j74m2K0j08R1K63L5j81q3j36pK1O8
7579h6J92n5J50M4k88lj93m3L75j4Q0K14k71j89o7l9J95J3M1J91L6k65j18k53
7603c53M6J38L85l7J8j36J0j72k02K24j3K51OJ57k18j73j66J7O2K78k3Q5j28L8
7627I4j7l18j18K50K5K15k9J05k26j28qM1J19j5J87j2j6j38k52mP4J46L23j6N0
7652C32m49J18j37j6J68L9K4J99k75l0qn7j69J14L86M8j91j16j89K93l32o5M25
7675A12Q8j07J33l07J25k19J7OK48p1J76m7j78m3r9k07L12K35q1J84r4k38j08
$$ plain form
7507 -199 -253 -177 -222 85 202 175 175 -7 -213 -369 -177 -125 82 162 106 152 78 -270 -71 -94 25 160 470 301
7531 301 -110 -47 -117 -160 -73 108 285 303 255 54 -8 -261 -290 47 54 364 321 28 -11 -151 -204 -318 -24 230
7555 230 402 249 191 -151 -165 -252 -51 134 347 94 147 -27 -69 -49 -157 -66 197 232 51 -32 -168 -175 -154 -86
7579 -86 106 51 201 245 -43 -46 -239 -282 93 79 159 373 102 -87 -154 -193 2 15 56 247 283 18 -100 -353
7603 -353 -307 -169 216 179 197 61 71 -101 -303 -79 -92 159 165 322 104 -69 -235 -218 -156 122 99 184 56 94
7627 94 77 -241 -359 -109 -84 131 102 207 -19 -147 -155 -114 5 -10 177 165 149 11 -241 -245 -171 -25 298 282 332
7652 332 -117 1 -136 -152 16 55 79 278 3 -27 -35 -92 -261 -147 239 287 96 -20 -209 84 -248 -313 112
7675 112 200 93 226 -81 44 -175 -158 -152 96 25 201 154 -24 -67 -166 -373 -61 174 93 277 183 -55 -163
7698a63l3N7K22K2P2p2J71l35j09J02l6J62NL15k8j91l37j29K43K4J38j10P0J90
7722B50k26k24J29J10Q8J92j71j13k1o6j88N4K20J4J93j7j53q6o3l2m0m2L81Q1
7746B70j26r1J03J2l88J29L4L31M1O9k67k55j43K23j14K87l3J27%l51O8j59K5
7769b08K93k0L1J70l1l56L9R4j40P2J43J8M1j40k14J66j24J26M4J69k7k0k55j05
7793b34J64j04K14R4M1j7l3j83k32J10J8O9L38Jk47M7j04k1j12j62N18M1n8O0
7817B08n9m51qN7L94rJ9M9J41n24k30J06L03j1M9K89k73Rk24j96J00K71K14O5
7841B89q3N0l48r9Q5j04J21J98J40j19j44j70jj36J67L59j64J20j9j04O4j14k65
7864b77K99K26N1L0k74j40N6m2r1K24R3J53rk13J15k70j16mL27p8L5J83j44j85
$$ plain form
7698 -163 -196 -139 83 105 177 105 276 -59 -168 -66 -102 60 65 380 352 161 -176 -305 -62 -38 100 -10 60 250
7722 250 24 -200 -71 39 127 319 148 35 14 -52 -240 -186 34 48 241 224 71 -15 -78 -110 -150 -192 189 270
7746 270 144 53 156 168 -220 -91 -57 274 315 384 117 -138 -281 -58 -172 115 82 209 209 -142 -74 -233 -208
7769 -208 85 65 96 266 235 -121 -82 12 -128 -56 87 105 146 6 -208 -42 -166 -40 4 173 146 126 -129 -234
7793 -234 -70 -174 40 134 175 158 125 -58 -290 -180 -162 -93 245 246 -1 46 -58 -79 -191 -353 165 206 148 208
7817 208 149 -302 -310 -253 141 132 151 200 341 -183 -413 -307 -4 -15 34 323 50 59 -165 -361 -261 10 224 289
7841 289 206 256 -92 -191 -106 -210 -89 109 249 130 -14 -184 -185 -321 -154 205 41 161 142 38 102 -12 -277
7864 -277 22 248 299 329 55 -85 -29 -71 -162 62 155 308 299 86 201 -69 -185 -189 138 60 95 278 134 -51
7888e1k57P2J04J17K22N3j41j47j0l23M10J9J03K6K1j64j93q4K7K01Q2O9K01j79
7912A78k16j19q3Q7K58k6J39J32m70J37k96R2O8J53J59Q1l32l6m2l1j65J18K63
7935D9J49j3k66J26j29mj61M10j12J11j4J28l11j80k8J15K19J2J41J92k52l31
7957a49p0j24K79J23j3J72j18j24q5K0l9q5K38J91J2j36j75j85J2J68L0M99j31
7980C10j86o4j88R4j14L1K91m6J80l19K7j93j99K55kL16m2p7K22l50j67J6K0J66
8004a9P6L32j97k3k50n2J6J06L7J34O2k15K1P3j43pK7J13J93j19j97P7k80R6K5
8029a14R6J11K45j97j00k47m0Q4p7L77M4J01j30j48m15K52j08K23Q3n0J78p1k01
8052a04r3M3K11J87l3m9Q1m16r0J79j76J50K64J5j88Oj92K39k52K9L15o1J01m4
$$ plain form
7888 -51 -308 -236 -132 -15 207 260 119 -28 -38 -361 49 68 171 197 218 54 -139 -223 -196 5 87 156 357 178
7912 178 -38 -157 -240 -153 105 79 218 350 -120 17 -279 -187 -119 34 193 274 -58 -94 -136 -167 -332 -214 49
7935 49 198 185 -81 45 -84 -88 -249 161 49 160 146 274 -37 -217 -245 -130 89 101 242 434 182 -149
7957 -149 -219 -343 -64 59 46 218 100 -24 -109 -89 -128 -213 25 216 228 92 -83 -268 -256 -88 -58 441 310
7980 310 124 60 -128 -34 -148 -117 174 128 308 -11 16 -177 -376 -121 -123 193 151 74 296 -54 -221 -205 -185 -19
8004 -19 57 389 192 169 -81 -133 -117 -11 26 160 222 7 28 101 -42 -49 -22 91 284 165 -32 45 -235 -139 -114
8029 -114 -18 93 338 141 41 -206 -246 -162 -239 138 182 283 153 5 -410 -158 -266 -43 40 -10 168 97 -104
8052 -104 -197 -154 57 244 211 162 243 -173 -263 -84 -260 -110 154 169 -19 -13 -205 34 -218 -189 126 65 166 122
8076A22Lj92k4q7K0K67q2J48p1j05jj60%J72N9L2j06J26p0j77m2O3n9K03J19J31
8102B89k44j87m1q3J16K29m5K63nk95q5j92J72m2J38K99Nl36O1m9j91J54P2K69
8126B72J6k21r2j14o5K3J72K58r3M0j68P0k89j19J54K60pP3J33k34j63j96J45
8149a45J51n8L07j03O5j81j97r0J39K05k12L68n6j0k27n9j44K18J56J60m6J26
8171C67k41k01p6nKL04m0J27j34k23O6m6j15K10J06J82j37m9j60n1
$$ plain form
8076 122 125 -67 -91 -178 -158 109 27 175 104 -1 -2 -162 -162 10 69 101 -5 121 51 -126 -168 -105 -164 39 158 289
8102 289 45 -142 -183 -266 -150 79 34 297 292 -3 -88 -280 -108 -150 -12 287 292 -44 17 -32 -223 -69 3 272
8126 272 288 67 -25 -139 -204 -181 -9 249 156 196 28 98 -191 -310 -156 104 97 170 303 69 -94 -290 -145
8149 -145 6 -52 255 152 217 36 -161 -251 -112 93 -119 249 193 183 -44 -103 -247 -29 127 287 241 367
8171 367 126 -75 -151 -156 -154 150 110 237 103 -120 -54 -100 -215 -5 101 283 146 97 -63 -114
8191a14
$$ Imaginary data points
##PAGE= N=2
##DATA TABLE= (X++(I..I)), XYDATA
0@%%%%%%Nj3J6j6J6k4L2l5M4n3O3p8R3j10J30j51J76k03K32k68L06l49L98m46
30b35N03n69O38p16Q01q91R90j101J223j354J504j666J840k040K259k505K784
47A465l095L454l869M353m934N641o520P653r177J1354j4737K0781l4939J28878
61A06308J04059j79454j21488r1442K2597Q9059J50695J01016J8645q0894j14214
72D887j15556n7012K4265J15643J36661Q6306j4543q9324j24851j04707l9110
83a77341O5118J33429J24677M9802l3025j05837j37894r8019J1971J10730J36369
94G9980R1193J5661o7480j23964j18265m4906M7177J07239J13581P4403o17q6605
106H7397j34875j03084j2233P4808J14137J06279N2973l7415j15745j23684o3862
$$ plain form
0 0 0 0 0 0 0 0 5 -8 8 -8 8 -16 16 -19 25 -28 35 -43 50 -60 70 -81 95 -108 124 -144 162 -187 211 -235
30 -235 268 -301 337 -379 422 -469 521 -580 643 -711 793 -873 967 -1073 1186 -1319 1465
47 1465 -1630 1824 -2045 2308 -2626 3015 -3505 4148 -5029 6325 -8412 12369 -22570 106308
61 106308 210367 30913 -90575 -182017 -159420 -70361 80334 181350 199995 119101 4887
72 4887 -110669 -167681 -143416 -27773 108888 195194 180651 91327 -33524 -138231 -177341
83 -177341 -112223 21206 145883 195685 162660 56823 -81071 -179090 -167119 -56389 79980
94 79980 171173 186834 119354 -4610 -122875 -167781 -120604 -13365 100216 174619 174002 87397
106 87397 -47478 -150562 -162795 -87987 26150 132429 185402 147987 32242 -91442 -155304
117a55304J4743Q0671J20377J04336K0655p9707j26585j01832l5335M1520J03291
128a3170J18021O7371k0645r1940j11163q1888k0536N8678J19811J14279L6695
139A75513n3476j03657j05373o6496J1259R3079J21055P7680L767o1397j04595
150a2641j05571m6489M7600J12117J09251N2912j9967q3685j12439q4143o347
161a49402P3327J06362Q7122L5594l3776j00072j17315o0873K8576Q9702J03089
172F2334P5760J1865o8774j13941r1015k3358M3595Q9792J01971O3468j7567r3445
184D0685j11944o9580M38O4146J01758R2753L0828n2102r9150r1495m8059J2638
196a29084P7815J12289P8641l182p4105r9001q1973l0516M3544J00660R8509M2291
$$ plain form
117 -155304 -140561 -59890 60487 164823 185478 105771 -20814 -122646 -157981 -116461 -13170
128 -13170 104851 172222 151577 59637 -51526 -133414 -153950 -95272 24539 138818 175513
139 175513 122037 18380 -86993 -153489 -142230 -49151 71904 149584 153351 91954 -12641
150 -12641 -118212 -164701 -117101 -4984 104267 157179 137212 53527 -58912 -143055 -149402
161 -149402 -76075 30287 117409 153003 119227 19155 -98160 -159033 -130457 -40755 62334
172 62334 138094 149959 81185 -32756 -123771 -147129 -103534 -13742 88229 151697 134130 40685
184 40685 -71259 -140839 -140401 -76255 25503 118256 149084 96982 -2168 -93663 -141722 -129084
196 -129084 -51269 61020 139661 136479 62374 -36627 -118600 -149116 -105572 -4912 93597 135888
208A35888k6562p6396r5835p4142q838O9837J08379Q2387J7950m6442q9117r5403
220i8294n1030K7586Q7488R3603N8087M116n7255j01178r0341k1852N4321R2773
232a976Q5846M4326k1379q3482j00942n9666Q408O3287Q8071P8574K9201m5407
244H4861r8821r1894l5925K8956P5793R2803O5411m475p2204r3384o7080j7947
256a33906L7890Q6551R4393M4228l3010q3775q8015n5353J609O4195R6790P3892
268A05489J0297m9669q0260p9378m4695K1258Q3446R6503N2837j1750o2460q6955
280d5337p4294j7932N3290Q9546P5003L0351k2066p0411r2021o0841R008P0841
292e4863Q8301O4134J4800m4785q7885q2901k9561L4778P2522P8013N4021J5o4355
$$ plain form
208 135888 109326 32930 -62905 -137047 -145885 -76048 32331 114718 132668 86226 -2891 -98294
220 -98294 -149324 -121738 -34250 59353 117440 121556 64301 -36877 -127218 -149070 -94749 -1976
232 -1976 83870 128196 106817 23335 -77607 -137273 -128865 -65578 22493 101067 130268 84861
244 84861 -13960 -105854 -141779 -112823 -37030 55773 121184 116709 44505 -48879 -115959 -133906
256 -133906 -96016 -9465 84928 129156 96146 12371 -75644 -130997 -129388 -65193 31597 105489
268 105489 115786 66117 -14143 -93521 -138216 -116958 -33512 62991 115828 104078 41618 -45337
280 -45337 -119631 -137563 -84273 5273 80276 110627 88561 18150 -73871 -134712 -125704 -54863
292 -54863 33438 97572 112372 67587 -20298 -103199 -132760 -97982 -25460 52553 106574 106589 42234
305D2234r4930o7176o329M9042Q0015P8106L5448l2175q1234q0860m1504Q164
317a11199N5381Q5031P1871J2927n4044q5415p1046k8098K7001P5467Q6831M6295
329A11002j7682o4062p5472n9455j6337M4302Q7593P7441K4039l4341p1167p8336
341g2475m9247J1924O9136Q3942N2545L818m1985p4353p6019l2163L5081P8852
353a0944P6091M0176j0961o0788q4840o0021p4N3445P3512O2763K8412k5241p4725
366F805q2407m0532J9042O2116P6135N8109P561n3017q2154o2866j5814L0522
378g6500O4287P5318M6410j4244o7593p8675m9841l121M5867P8621P0123J8268
390A08920m0097o9501o4750l7166R100N9729Q1925N4827k007n0794p2020o3468
$$ plain form
305 42234 -52696 -119872 -126201 -77159 2856 80962 116410 84235 3001 -77859 -119363 -111199
317 -111199 -55818 29213 101084 114011 59967 -25448 -96494 -124592 -97591 -22124 64707 111002
329 111002 93320 29258 -46214 -105669 -122006 -77704 9889 87330 111369 77028 5861 -72475
341 -72475 -121722 -109798 -40662 43280 95825 99643 57658 -16695 -92714 -124877 -89796 -10944
353 -10944 65147 105323 94362 33574 -51266 -111287 -111361 -57916 15596 78359 106771 81530 6805
366 6805 -75602 -116134 -97092 -34976 41159 99268 106829 53812 -28342 -91208 -107022 -76500
378 -76500 -12213 63105 109515 95271 27678 -50997 -100838 -103959 -58092 20529 90652 108920
390 108920 68823 -678 -65428 -102594 -93494 -33765 48160 102987 100980 50186 -21834 -85302
402h5302k3364L4981P6549P0974K8691j8791n4092p1116n5831m632N3003P8030
414B9100N8917J6317l1500o8659p4152l5356K4744O4082O6953M3669M292m3607
426E4800p6169o4523j4572L8420O7083O5551L6090j6961o5326p5221m1579P530
438h4877M5492O5609O0051K1413l6375p2250o5519k7809J8318N7458P3684M8981
450A04176o985n5046o7740m9122j4846K9419O6468O9878L0346k3938n9933o5985
462d3308m4576P6N1654P5531N3047N302l6301n9337o0856l3548J8388O3688O9435
475E9195L8942n436m5983o9094n8166j0517M3015O6672N4963K3254j6296n4855
487B5694o9945m3817Q385N1396O4950N0535J3722l5516p0070o2327j9187K6406
$$ plain form
402 -85302 -108666 -73685 2864 73838 102529 83738 29646 -41470 -97301 -101933 -48930 29100
414 29100 88017 104334 72834 4175 -69977 -105333 -80589 -16507 50446 94115 98407 54800
426 54800 -21369 -85892 -100464 -62044 5039 70590 106680 89719 24393 -50828 -92407 -84877
438 -84877 -39385 26224 86275 107688 71313 -937 -66456 -94265 -75947 -18489 55195 104176
450 104176 97191 42145 -25595 -74717 -89563 -60144 6324 76202 106548 82610 22677 -43308
462 -43308 -87884 -87808 -36154 39377 92424 97726 61425 2088 -58768 -92316 -73928 -10240 59195
475 59195 98137 92701 46718 -22376 -80542 -91059 -48044 18628 73591 96845 80549 25694
487 25694 -44251 -88068 -79683 -28287 36663 87198 100920 65404 -4666 -66993 -86180 -59774
499e9774N3273O0103M1960j887n0946o9889m8454o869L4230O2179O2950K6416
511A03292k7771o2420n9771l1582N417M3230O5805N3194P830m0562o1937n4530
523e9805k5385J9946O0818O7656L2999j5236m6852n7556m7278j2017L6224O5621
535A9135N6156J8808k2800n3903o3368l9046J0597N4408O3101L9339M036l2111
547E4352n8460n8567k2621K7106N7416N6613L3700n835m8662o7927m5396J926
559g6355L9738N4982M9548K2689k1629n8109o0612l0211J1407M5090O0205M7526
571H4269N167m2743o3431m7307j2614K2136M9704N9150L4814j2919n0470n7409
583c1653m0407o555L5515O3657N4029J2091l0709n2299n0972l0306Q131M7279
$$ plain form
499 -59774 -6501 53602 95562 93675 42729 -27160 -75614 -82483 -48253 13926 76876 103292
511 103292 75521 13101 -46670 -78252 -72835 -29605 36200 89394 97224 56662 -5275 -59805
523 -59805 -85190 -65244 -4426 63230 96229 80993 34141 -23415 -70693 -82710 -46486 19135
535 19135 75291 94099 71299 17396 -45972 -85018 -74421 -20013 43088 82427 86463 54352
547 54352 -4108 -62675 -85296 -58190 -774 55839 89539 83704 35042 -32885 -78281 -76355
559 -76355 -36617 18365 67913 90602 68973 10864 -49748 -79959 -68552 -23462 36743 84269
571 84269 89436 46693 -16738 -64045 -76659 -54523 -4819 54331 89145 76226 25756 -31653
583 -31653 -72060 -78615 -43100 20557 74586 86677 55968 3669 -47303 -77609 -69478 -22199
595b2199O1284M0278l51l6254n5612n2052j9679K8530O0075N3829K0969j3158
607F5660m1452n6549m3427j508M0512N6319M4969J6523k2245n6500n9140k5918
619h2756J9274M8166N1602L5175L031l5271n8626m8009j1316K6938M9630N2433
631E0271L1090j3481n2956n8554l0731M624L3606N1842M7871J4433k9294n2988
643d267m8685k4684J0323M5943N9261L7694n963m1810n2566l9436j2041K3423
655e2808N1957N2532K2425j7226m3270n1131l8675j653M1987N9447M0076M442
667F8103k6173m6821m9712k5229J6550M7053N0582L1527j36l4769n5828m6665
679g1518q542L3129N1595M3238J9123j2564m3581n4506l2101O751L6218M7872
$$ plain form
595 -22199 39085 79363 79012 42758 -12854 -64906 -84585 -56055 4020 57849 78818 65660
607 65660 24208 -32341 -75768 -77276 -36764 19555 64524 81047 58802 2302 -56838 -82756
619 -82756 -63482 -15316 36286 71461 74492 39221 -19405 -67414 -78730 -51792 -2162 50271
631 50271 81361 67880 14924 -43630 -74361 -69737 -36131 15711 63582 78015 48721 -4267
643 -4267 -52952 -77636 -67313 -21370 37891 75585 69622 27812 -24754 -64190 -76231 -52808
655 -52808 -851 51681 74106 56880 13610 -37521 -76196 -77849 -35862 23585 63661 68103
667 68103 41930 -4891 -54603 -79832 -63282 -16229 34353 65880 65744 30975 -24853 -71518
679 -71518 -80060 -46931 4664 47902 67025 54461 10880 -43626 -75727 -68976 -32758 15114
691A5114M2559J4520k9219n6056m7745j5150J8020M1718M8869L3042m022l9081
703B2569n1024l7376p875K3796M8898N0783K1674k1407m8680m6655k5612L115
715f7794L4531N2687L9904L908k9019m4618m3697k3423J5109M9082N2098K5410
727F4178r072l6318m7021l7797p636K9360M9089M2151J5485j5177m0542n0787
739d4087l2374Q532M2787M8552L1368M934k4751m8594m5064j4148K0707M0517
751a1621M3635K9562k844l9086n2982l4761m32K9695M4318M0928J6953j8239m5032
764I4m5593k2373P311L2600M7250L9662M794l4087m8461l6710j2370J6244M1907
777i732M7590K4093j1163l5751m3164l3349o964K7867N0014M2083J0964k2366
$$ plain form
691 15114 57673 72193 42974 -13082 -60827 -75977 -57957 -16239 32630 65672 61650 22569
703 22569 -28455 -65831 -73706 -49910 -1012 49771 71445 50038 1358 -45297 -70909 -67794
715 -67794 -33263 19424 59328 63236 34217 -10401 -54098 -77521 -62412 -13330 38768 64178
727 64178 55106 18788 -28233 -66030 -73666 -44306 4783 46934 62419 47242 6700 -44087
739 -44087 -76461 -67929 -25142 23410 54778 59712 34961 -13633 -58697 -72845 -52138 -11621
751 -11621 32014 61576 58732 19646 -33336 -68097 -68529 -38834 5484 46412 63365 45126 94
764 94 -45499 -67872 -60561 -27961 19289 58951 63745 29658 -18803 -55513 -67883 -51639 -9732
777 -9732 37858 61951 50788 15037 -28127 -61476 -68440 -40573 9441 51524 62488 40122
789D0122m0842m1463k4516O931L8539M7455K9365J05k5006m2468m2923j6036K2820
802d7917M6369M0847J9305p573l4740m6389l2435R71L0161M1846L6030J4655j6921
815D4209m3371m6269k0947J4047L6838M0730L0116L342k9767m6396l5205p677
827f0350J8290L7092M3173K5703j1233m0705m3829k5341N40K6692M3571L7770
839E1373R411k2428l9840l7243k0384O788L5431M7093L0317m228l1463m0313l2860
852d8346j1434J9663M2970M0060J5536j1286l1375m1377l1689o16L3073M4527
864A9706L2091O403j9728l8388l9956j8878J3396L6695L8544K4886J370k6051
876C0090m4510l7146n778K5017L8499L5127J8377j0230l7068m1957k2938M450
$$ plain form
789 40122 -720 -42183 -66699 -59768 -21229 26226 55591 55696 30690 -11778 -54701 -70737 -47917
802 -47917 -1548 39299 58604 51031 16291 -30098 -62533 -61562 -31401 10445 46475 61130 44209
815 44209 838 -45431 -66378 -52331 -15493 25237 55353 58695 28928 -17468 -52673 -60350
827 -60350 -42060 -4968 38205 63908 52675 11970 -31859 -57200 -56660 -29968 13603 51373
839 51373 60784 38356 -1484 -38727 -59111 -52323 -16892 30201 60518 56290 24827 -15486 -48346
852 -48346 -59780 -40117 2853 42913 58449 47163 15788 -25589 -57278 -57894 -24821 19706
864 19706 51797 58200 38472 84 -39872 -58750 -45354 -8659 29885 54771 56141 30090
876 30090 -14420 -51566 -57344 -32327 6172 41299 59676 49446 12378 -29579 -52517 -48067
888d8067K6141L8225L5034J0911k2917m3030l6939j3288J3027L3338L9882K6309
900E8626l976l1525l8687k8016p855J7218L9492M0845J6092j6863l6018l6229
912b6896k3225J785K9693M2035K9350K731k0722l4403l5531j8910J2182L8056
924c855M0451K0889o239k7699l8132l1164n442K4841L7761L1193J3346r735l2543
937A3672m1447k4740P397L1631L7282K6897N788k1201l9600l4386j0430J5230
949c3907L0801L4866K4273j978l0954m1488k7228j216K2018L5356L3891J4075
961E8509j6543l5691l3499j7793L199K5169L9114L1028K927k5868l6860k9964
973c6272j2255J3451L4794L7112J8022q942k7198l3364k6981o816K2142L9829
$$ plain form
888 -48067 -21926 16299 51333 62244 39327 -3703 -40642 -53930 -40903 -7565 32317 58626
900 58626 54650 23125 -15562 -43578 -51433 -34215 5277 46122 62214 45351 9333 -26896
912 -26896 -50121 -48336 -18643 23392 52742 55473 34751 348 -35183 -54093 -41911 -3855
924 -3855 36596 57485 51246 23547 -14585 -45749 -51191 -26350 11411 42604 55950 46215 13672
937 13672 -27775 -52515 -45118 -13487 23795 50692 56480 35279 -4321 -38707 -49137 -33907
949 -33907 -3106 31760 56033 54055 23101 -18387 -45615 -46831 -24813 10543 44434 58509
961 58509 41966 6275 -27224 -45017 -41818 -16649 22465 53493 56420 30552 -6308 -36272
973 -36272 -48527 -35076 -282 36830 54852 45910 18712 -14652 -41633 -48449 -26307 13522
985A3522L2706Q404j6084l1840l4596k0779P430L1487L5270K2081K069j8524l4844
998c698l4509j2255J7964L4833L2564J7184n976k8579l7799k4530J561K3328L1538
1011A1626K8282J3092j3042l5451l6264j6010R591K7529L4277K5300J392k5528
1023B4794l5854k6040o892J2796K9318L5046J9906r167l1191l4261k1529r87K1699
1036b2362L5833L0066N919j8372l0143k8871j7554M754K8987L6829K3033l040
1048D5079k3032l2490k8408r289J7951L4234K9596J1839p870k4497l3492k4962
1060d5341j08K5485L4269K5425O667j4936l2596l2754j3638J2058K7898K9045
1072B1474K0165K205k1566l5575k8135m766J7627L0127K9770J5578r692l0522
$$ plain form
985 13522 46228 54632 38548 6708 -27888 -48667 -41237 -9750 25520 47601 49670 31146 -3698
998 -3698 -38207 -50462 -32498 2335 34899 52083 46107 17528 -20271 -44801 -43240 -19912 11626
1011 11626 39908 53000 39958 4507 -31757 -47767 -38176 -10647 23630 48930 50322 24794
1023 24794 -11060 -37100 -43992 -31196 -1878 33168 53074 43907 12716 -21545 -43074 -44061 -22362
1036 -22362 13471 43537 49456 31084 941 -27930 -45484 -40730 -11743 25086 48119 45079
1048 45079 22047 -10443 -38851 -48140 -30189 4045 33641 45480 37610 13113 -20379 -45341
1060 -45341 -45449 -19964 14305 39730 46397 31461 -1135 -33889 -47527 -35469 -7571 21474
1072 21474 41639 43844 22278 -13297 -41432 -46198 -28571 1556 31326 46904 37212 6690
1084F690l2750j7080L095J9737L0200K8024Q374j8235l3074k8656j1978Q505K7229
1097i919L3447K0581n178k4786k9178k2394p307J3735L1648L1569J1906j1599
1109C2525k7186k9988k0301J390K5052L3434K2016J855j5488k6807k8923j5203
1121d7624J0305K9375L0847J6935k694k1652l2560k5474k818K0246K8876K4043
1133B7805J1365p588k6307l2446j8678N267K3386K9366K3241N350j8333l2335
1145i907k6458p292J1598K3707K7803J9586k240k4749l1833k0741k559J6269K9118
1158B302K8712J0259j4612k7840k5842j4134J995K0692L1137K3315J818j8826
1170A8976k8059k5170j1063J1052K9109K9592J2963p146k0832k6252k2205m710
$$ plain form
1084 6690 -26060 -43140 -40045 -20308 9892 37916 46290 28055 -5019 -33675 -45653 -37148 -9919
1097 -9919 23528 44109 38931 14145 -15033 -37427 -44734 -30999 649 32218 44124 32525
1109 32525 5339 -24649 -44950 -43560 -18508 14926 36942 38797 23309 -3498 -32421 -47624
1121 -47624 -37319 -7944 22903 39838 37144 15492 -17068 -42542 -45360 -25114 3762 27805
1133 27805 39170 31582 5275 -27171 -45849 -40582 -17196 12170 35411 40761 22428 -9907
1145 -9907 -36365 -43657 -32059 -8352 19451 39037 36797 12048 -19785 -40526 -43085 -26816 2302
1158 2302 31014 41273 26661 -1179 -27021 -41155 -39160 -18468 12669 35984 37802 18976
1170 18976 -9083 -34253 -45316 -34264 -5155 24437 37400 30254 9422 -16830 -39035 -43745
1182d3745J8382L0637K4521P507j0822k5449k9466j6675P730K5275K6927J7361
1194C2183J994j4627k8292k6730q528J3428K6167K6263J5217m205k3822l1158
1206b2110j8734K584J7872K4691K2886J0618j1459k7864k7234j2510O094K1187
1218a3979K8600K1432l7k1156k7804k0064n770J0023K4235K7473J4743p246k3369
1231G081k6431j8356j927J7915L0274K3528L516j4383k3113k3251j4145M489K3517
1244a1286K8293J7010o41j6882k6422k4505o724J5320K7240K3181R476n849j9812
1257H399k6737j9348P88J9789K5797K0751P118j1792k7125k6998r742J0730K1472
1270f898K3124J6805Q08j7807k7561k0778m304J2780K3543K5388J3175q801k5105
$$ plain form
1182 -43745 -25363 5274 29795 37302 26480 1031 -28435 -45110 -37380 -12105 14822 32183
1194 32183 34177 19550 -8742 -35472 -44000 -30572 -4405 21858 37075 32870 9048 -22110
1206 -22110 -40844 -38260 -20388 4303 27189 37807 26348 -1516 -28750 -41260 -35166 -13979
1218 -13979 14621 36053 36016 14860 -12944 -33008 -38778 -28755 -4520 22953 37696 30450 7081
1231 7081 -19350 -37706 -39633 -21718 8556 32084 35600 21217 -1896 -25147 -39292 -34803 -11286
1244 -11286 17007 34017 33376 16494 -9928 -34433 -41157 -25837 1403 24584 34060 28211 8399
1257 8399 -18338 -37686 -36898 -17109 8688 29439 36557 24765 -2360 -29358 -39100 -28370 -6898
1270 -6898 16226 33031 33839 16032 -11529 -32307 -36611 -23831 -288 25100 38275 29474 4369
1283D369k5313j3137K247J6221K4665K2229N356j4931k4743k1652j1038N542K2898
1296g287K8448J5460m927j9379k3109j8308n645J2368K5369K3749Q783p979k0574
1309F969k4717j7068J602K0957K7008J6940J076j1821k2194k3383j0879R656K2597
1322c257K3050J4010l80j7663k7504k0304q39J6078K2850J9938R246p394k1885
1335E946k4898j3504L901J7665K3165J9764M930j5465k6696k0777n024Q802J9237
1348b954K3360J5317l812j9565k3385j6408l631J2564K4706K3285P463j1797k1809
1361C334k1079j1877K201J7466K4928J7764P80j4182k1445k0695j0211R134K4591
1374G09K3554R680n107j6482k2364j8140k071J5782K2773J8649P292p839k1014
$$ plain form
1283 4369 -20944 -34081 -31834 -15613 9052 31281 36637 21706 -3037 -24689 -35727 -30185 -7287
1296 -7287 21161 36621 31694 12315 -10794 -29102 -34747 -22379 2990 26739 35522 27543 6969
1309 6969 -17748 -34816 -33214 -12257 14751 31691 32767 20946 -1248 -24631 -35510 -25854 -3257
1322 -3257 19793 33803 33423 15760 -11744 -32048 -32887 -16809 6041 25979 35225 27831 5946
1335 5946 -18952 -32456 -28555 -10890 12275 32039 36969 21504 -5192 -25969 -30993 -22191 -2954
1348 -2954 20406 35723 31911 12346 -11039 -27447 -31078 -18514 6192 29477 36940 25143 3334
1361 3334 -17745 -29622 -27421 -9955 14973 32737 33517 19335 -2110 -22805 -33016 -23882 709
1374 709 24263 33943 28836 12354 -10010 -28150 -30221 -14439 8334 26983 34275 26436 5422
1387E422k4477j2805O156K0097K2004J4212J952j2954k3119k1109n409J0728J9578
1400B76K0645J3654k945k0777k4824j4180J432J3713K0802J9638P314j0695k1730
1413B323k0489j0278L819J7145K3482J7432m45j7165k2246j6504m997Q191K0425
1426F93K2645J0234o699j7476k0123j6085k537J5724K4674J8050K679j0722j8865
1439B192k0153j1210N138J8954K1712J3459j28j3000k1666k0237n736J2872K1950
1452D147J8136Q094m089j6913k2766j4657J891J5107J9348J7373O955j0125k2629
1465a28k0995p773P369J7077J9984J3694N8j5093k1702j6574l272R189J8867K1129
1479B1830J1086p432k0700k0083j0553N59J2940K1444J7728K832j1577j8577j8034
$$ plain form
1387 5422 -19055 -31860 -25704 -5607 16397 30609 32561 19607 -3512 -24621 -30030 -19302 276
1400 276 20921 34575 31630 10853 -13971 -28151 -26719 -13006 7796 27434 34748 24053 2323
1413 2323 -18166 -28444 -24625 -7480 16002 33434 32989 15824 -6422 -22926 -27923 -19732 693
1426 693 23338 33572 26873 9397 -10726 -26811 -29348 -13624 11050 29100 31779 21057 2192
1439 2192 -17961 -29171 -24033 -5079 16633 30092 29964 16964 -4702 -24939 -30675 -17803 4147
1452 4147 22283 30377 26288 9375 -13391 -28048 -26157 -11050 8298 25671 32626 22501 -128
1465 -128 -21123 -28896 -21527 -4450 15534 29228 29286 14193 -7509 -24083 -27355 -18166 701 21830
1479 21830 32916 25484 4784 -15299 -25852 -25293 -12353 9091 26819 29651 18074 -503 -18537
1492a8537j0254M572J9136K2530J2331l347j5411j8963j5644m789J0911K0607
1504C142J8091O826n648j5689k0764j5210J780J7630K0949J3621K238r673j9200
1517a907j9423p388P851J6848J8212J2351J43j4765k2459j6276r43J2590J8237
1530C071J6726P679n777j8700j9794j0143K730J2723J8800J7630L840j3339k1518
1543f072j6034n253O446J6420J9969J1160l617j5038j8242j3835l762R862K0409
1556B413J9311N970r660j7282j7372j0594J803J5429K0122J2954O45j0003j7159
1569c423j8165q626Q089J9999J8316Q514l574j3783j9369j4050r64J2371J8102
1582C437J4719O404n450j7246k0618j0639N372J6066J7356J2708J955j1509j9682
$$ plain form
1492 -18537 -28791 -24219 -5083 17447 29778 26431 11020 -7943 -23587 -28376 -17465 3142
1504 3142 21233 28059 22411 6722 -14042 -29252 -27472 -9842 11107 24728 26966 17293 -1907
1517 -1907 -21330 -28718 -20867 -4019 14193 26544 26687 11922 -10537 -26813 -27756 -15166 3071
1530 3071 19797 27476 21699 2999 -16795 -26938 -24208 -11485 7315 24945 28785 15446 -6072
1543 -6072 -22106 -27359 -20913 -4493 15476 26636 23019 7981 -10261 -24096 -27858 -17996 2413
1556 2413 21724 27694 18034 752 -16620 -27214 -25411 -9982 10140 23094 23739 13736 -3423
1569 -3423 -21588 -30214 -22125 -2126 16190 24704 21130 7347 -12022 -26072 -27036 -14665 3437
1582 3437 18156 24560 19110 1864 -18754 -29393 -24021 -7955 9401 22109 24064 12555 -7127
1595g127j5779l703P413J4978J7735J1756k617j7032j9845j1740M46J1151J7526
1608C162J6386N212r179j7226j5637q566J957J3445K0118J4396q67j3553j7553
1621g905j4090n133P544J8074J7303P261n015j2801j6708j3607k094J2745J9834
1634E408J4716K990q645j5730j7043q974N086J5797J6599J0058J100r629j8411
1647f678j7001m115J0373J7178J5195Q140l866j5371j8275j0606J830J1278J5393
1660C475J4592O000q188j8463j7075o187N315J3994J7077J1889r71j3072j7261
1673h875j1969l243O756J5546J7849Q520o254j6027j6092r933K96J1963J8041
1686F578J3721J373r054j4276j4628q557L270J5858J8447R904k391j2052j5856
$$ plain form
1595 -7127 -22906 -26609 -19196 -4218 13517 25273 22656 5624 -14221 -25961 -25515 -14364 3162
1608 3162 19548 24760 15581 -1645 -17282 -25848 -23891 -10446 9672 24068 23201 9648 -7905
1621 -7905 -21995 -27128 -19584 -1510 15793 23054 18039 5238 -11470 -25077 -27171 -14426 5408
1634 5408 20124 23114 14469 -1261 -18304 -27278 -22192 -6395 10204 20262 21362 11733 -6678
1647 -6678 -23679 -27794 -17421 -243 14952 23092 19226 3855 -14420 -25026 -23196 -11918 3475
1660 3475 18067 24067 15879 -2584 -19659 -25846 -20531 -6537 10540 22429 21458 8386 -8875
1673 -8875 -20844 -24087 -17331 -1785 16064 24584 18330 2303 -13789 -23722 -23426 -11463 6578
1686 6578 20299 21672 12618 -1658 -16286 -24843 -21573 -5715 12732 22636 20245 8193 -7663
1699g663j3982l240J0070J7035J3785N179l789j2617j7476j1821J599J3839J6436
1712G355J2110K832q467j6587j5866n306O822J3557J4204J0442N34j2015j8172
1725h557j2986j124R217J5219J4951O876o140j5843j5053p584J418J0026J5921
1738F341J4231K970j0721j6201j3643n361N151J4253J6857Q919l565j2213j4335
1751g317j1043l761Q229J6963J5251M773o771j3730j5120r507K253J3469J6283
1764I972R881M02p527j4044j4823o881O814J5664J4650P717j914j1838j6496j2098
1778b0521L93J0550J3942J1864N824m225j4530j6430q134L733J2067J4631J1642
1791B0806J500j0387j6123j2087k928N766J1895J4984R284k398j3373j5579r694
$$ plain form
1699 -7663 -21645 -24885 -14815 2220 16005 21184 17395 4778 -12698 -24519 -22920 -9081 7355
1712 7355 19465 22297 13830 -2757 -18623 -23929 -17107 -3550 10654 21096 21630 9615 -8557
1725 -8557 -21543 -22667 -13450 1769 16720 23596 17456 1613 -13440 -21024 -19606 -9580 6341
1738 6341 20572 23542 12821 -3380 -17023 -22384 -17233 -2980 13877 22796 19231 7018 -7317
1751 -7317 -18360 -22121 -13892 3071 18322 23095 16324 2594 -12526 -22033 -19780 -6311 9972
1764 9972 19853 20255 12728 -1316 -16139 -23020 -16206 -542 14108 21825 19911 8073 -8423 -20521
1778 -20521 -20128 -9578 4364 16228 22052 17827 3297 -13133 -21267 -17534 -5467 9164 20806
1791 20806 22306 11919 -4204 -16291 -19219 -13453 -1558 13426 22710 20312 6939 -8640 -18334
1804a8334q23Q880J5320J4331L566q390j3607j2255p133J103J1407J6339J1162
1817B1566l65j0051j4314j2418m921O944J5321J3872N199l582j0227j3699j1327
1830a8002j360J0446J5397J1920L183o062j3661j4817p357N151J2869J2865Q549
1843A9121J268q417j5019j3373l054P690J3292J3207P290k872j3759j5091q192
1856a7909J651Q951J2417J2255M865p117j4436j3469n626L382J1056J5210J0415
1869B1645j794j1230j3411r629l062N183J3264J4118O759m581j2229j3262r386
1882a7615m50J0347J5496J0994R15p391j1594j2080p338L132J2986J4212Q027
1895A9641r65q983j4177j2321k133Q999J3479J0857M801k989j0975j4108r365
$$ plain form
1804 -18334 -19157 -10277 5043 19374 22940 14550 943 -11312 -18445 -17342 -5935 10404 21566
1817 21566 21201 11150 -3164 -15582 -20503 -13559 1762 15634 20833 17251 7024 -6675 -18002
1830 -18002 -19362 -8916 6481 18401 21584 15522 1861 -12956 -20313 -15162 -2293 10572 19121
1843 19121 20389 11972 -3047 -16420 -19474 -11784 1508 14715 22005 19133 5374 -9717 -17909
1856 -17909 -16258 -7307 5110 17365 22230 15113 677 -12792 -18418 -15036 -3980 11230 21645
1869 21645 19851 8621 -4790 -14419 -17481 -12298 966 15084 21843 17262 5033 -8229 -17615
1882 -17615 -18065 -7718 7778 18772 19687 12296 702 -11378 -18716 -15584 -2598 11614 19641
1895 19641 18676 9693 -4484 -16805 -18938 -9939 3540 14397 19198 16209 5234 -8874 -18239
1908a8239J483J0232J3215J0426L191o988j4677j3109l577N502J0507J1788Q948
1921A8702J02j0518j4312r919j676O673J2921J3243N459o151j2580j2117o329
1934a6502Q31Q409J3254J1367J760q075j2785j1367n344L792J2432J4396O912
1947A9080l425r663j1345r916l077P110J3907J1686M131m545j0899j3453q304
1960a8713K091J1371J3152Q039O25o191j1831j2214n144N271J1971J1711P194
1973A7332p94r707j4555r753L37Q337J1240J0077N223l997j2335j2572o689K261
1987a5595R002J2653J0585J193r005j3165j0111k848M693R979J2355P866k532
2000A5070j0483j2026q586j717O985J3540J2027K285o519j0709j0269o855J161
$$ plain form
1908 -18239 -16756 -6524 6691 17117 20308 13320 -1357 -14466 -18043 -12541 -2034 9754 18702
1921 18702 18804 8286 -6026 -15945 -17621 -10948 1973 15216 20675 14524 1944 -10173 -16502
1934 -16502 -15671 -7262 5992 17359 19119 11044 -1741 -13108 -18452 -14660 -2228 12168 19080
1947 19080 15655 5992 -5353 -15269 -18346 -11236 2671 14357 18488 13943 3044 -10409 -18713
1960 -18713 -16622 -5251 7901 15940 16565 10374 -1457 -13671 -18815 -13544 -1573 10138 17332
1973 17332 16538 6831 -7724 -17477 -17140 -8803 2437 12514 17737 13740 1405 -11167 -17856 -15595
1987 -15595 -6593 6060 16645 17838 8833 -4332 -14443 -17291 -12598 -2619 9736 17602 15070
2000 15070 4587 -7439 -16025 -17742 -10757 2783 14810 17095 10576 -133 -10402 -17257 -16096
2013a6096R785J3252Q532K22p228j1922j1164m376N798J2635J1454M749k823q235
2027D583j1708r786q85Q800J1796R448L942m274j1843j2918n818M471R697J0813
2041F318P848R48p135j2714j0365k746N484J0711J1388O745k500j1342j2463o692
2055a6515R59O853J0571J0577L904o374j1306j0374n428J807R569J2939Q455j478
2069A4159q741j0820q549k998M803J0937J1497N245l428r282j0925q558p58Q974
2083h444J3030Q735Q34n484r533j0613o141L285J0395J0878O988K08p067j2518
2097e447j0308j684P173J1017R147M369k466r035j1852p380J248P712J0601R267
2111A2362L385n949j2508j0649l030M132Q528J0270P806l24q569j1403p804k387
$$ plain form
2013 -16096 -6311 6941 15473 15695 8467 -3455 -14619 -18995 -13197 -562 10892 15641 12818 4583
2027 4583 -7125 -16911 -17796 -8996 2800 12248 16190 11916 73 -12845 -18663 -14192 -4495 6318
2041 6318 14166 15114 7979 -4735 -15100 -17846 -12362 -1651 9737 16482 13982 2640 -9823 -16515
2055 -16515 -15556 -8703 1868 12445 16349 9975 -1331 -11705 -17133 -15326 -5757 7182 15637 14159
2069 14159 5418 -5402 -13951 -16949 -12146 -1209 10288 15533 12105 2823 -8102 -16660 -17418 -8444
2083 -8444 4586 13321 14155 8671 -862 -11475 -17616 -14331 -3936 6942 13930 14138 7071 -5447
2097 -5447 -15755 -17439 -10266 751 9898 14267 11801 2766 -9086 -16466 -15218 -7506 3095 12362
2111 12362 15747 9798 -2710 -13359 -16389 -12257 -3729 6541 14347 14023 5454 -5949 -13753 -16140
2125a6140M856J1052J1542M782m847j0485j0150n581O98O996J1123R448J049o239
2139H104r639r474n710K801J1079J1980N418k362p265r955q644k109O106J0811
2153A141R258L894k608r101j1366p701J842R447J0801O889R98m901j0274j0213
2167a1894l629M595Q569R733O786K77q798j2114p990J15O450R470R207L869l691
2182A0955r707r781n245Q32O973J0753R261J455p796j0924q214k566L399Q827
2196a778J0800N572k239p855r148p742k341N904J1653R659K524n038q939r345
2210h313n499J116Q413J0552O678O54n207r318j0318m034M784J0878R276M355
2224A4017j560p388j0381p639L2O535R237P957M116l445r879j0987m578K786Q396
$$ plain form
2125 -16140 -11284 -232 11310 16092 11245 760 -9390 -14971 -14273 -7277 3846 13294 14343 8104
2139 8104 -1535 -11009 -16719 -13918 -2839 9141 14559 12197 4932 -5023 -13667 -15776 -9670 1141
2153 1141 10399 14293 11685 2584 -8782 -16483 -14641 -5194 5607 12496 13494 8593 -1681 -11894
2167 -11894 -15523 -10928 -2359 7374 14160 14437 5639 -6475 -14465 -14350 -7900 1570 10777 14646 10955
2182 10955 1248 -8533 -13778 -12946 -5973 4780 14041 15496 7700 -3224 -11438 -14004 -10605 -1778
2196 -1778 9022 14594 12355 4500 -4648 -12390 -14731 -8827 2826 12485 15009 9971 1032 -8313
2210 -8313 -13812 -12696 -4283 6269 12947 13601 8394 -924 -11242 -15276 -10492 386 9662 14017
2224 14017 12457 5069 -5312 -12951 -12919 -6384 2853 10810 14926 11481 1602 -9385 -13963 -11177 -2781
2239b781R224O686Q83o238j0419q218j769L762P856R774O690k049r352j0410n717
2254a2078O9N729R901Q835K123n032q717q251n130R11Q162J0649P445r73p000
2269F643r273p666k657M248R853R125L601k594o654r226p787q76P701J0548P267
2284A2253J564m353q460r274m669K981Q278Q619N787J000n885j0220r119j674
2298a3172N998Q792Q081M273j911q621r569n472Q75N556Q582Q196L285n024j0149
2313b80q650l324L019P264R300O246p07p237q651o473k403L737Q951R805L985
2328A4582l639q533q449n323p5O747R980O797P87m726p415q555m834K202R191
2343a263R507M838j134o402q637p687j351N420Q733P150L505j775p186j0037o292
$$ plain form
2239 -2781 6443 13129 14012 7774 -2645 -10863 -12632 -8870 -1014 8760 15450 13401 4049 -6361 -12078
2254 -12078 -12009 -6280 3621 12456 14579 9547 830 -7421 -12551 -11640 -3478 7171 14616 13643 6643
2269 6643 -2630 -10296 -12953 -8705 1148 10273 13874 11280 4626 -4600 -12387 -13263 -5562 4986 12253
2284 12253 13817 9464 1004 -8270 -12939 -9958 -1680 6939 12726 13726 7841 -2379 -11498 -13172
2298 -13172 -7174 1618 9699 13972 12061 3440 -6129 -11601 -10726 -5170 3412 11608 14893 9869 -280
2313 -280 -8930 -12254 -9235 -1971 7329 13575 12868 5631 -3020 -9493 -11896 -8159 792 10597 14582
2328 14582 10943 2410 -6039 -11362 -11437 -4690 5290 12087 12874 8148 733 -7822 -12656 -10454 -1263
2343 -1263 8244 13082 11948 5546 -3091 -10778 -12129 -6709 2024 9174 12679 10904 3718 -6319 -12611
2358a2611J356P454Q663O414J636m611r252q216k588L249P095P858O183kp121
2373E507r984o598m71M960Q191Q034L443l320q385q005m156K24N515R297P832
2388A2084Q81n973q712p040l287K778Q284R110M174k151o127p464o674k217M988
2403g346R427P845K466l636p497q317n175J744P140Q321N214Q82l992p953q567
2418i444l400M085Q187P749M482j152o564r068o319N47N299P082O795L565k757
2433I087q215q855m331K186O627P875O463M59n760q618o101k126K709O789Q531
2448F720N254j948p351q062n456m64M704Q863P272J434m058p025o740m765P74
2463a0848O622R276N721m04n426p721o928k424L827Q599O997K705j469n696p786
$$ plain form
2358 -12611 -11255 -3801 4862 11276 12912 8301 -951 -9167 -11755 -8506 -1411 6447 12630 12628 5507
2373 5507 -4477 -11075 -11546 -6586 1605 9639 13082 9762 1377 -6628 -10784 -10560 -5045 4252 12084
2388 12084 12965 6992 -1720 -8760 -12047 -9269 -985 8125 12299 10148 4021 -3443 -10117 -12334 -7346
2403 -7346 2081 9926 12392 8756 1259 -7058 -12233 -10489 -3349 4972 10186 11068 7076 -877 -9444
2418 -9444 -12844 -8759 -572 7177 11659 10507 3943 -5125 -11444 -10897 -5598 1484 8279 11844 9087
2433 9087 872 -7983 -12314 -10128 -3501 4374 10837 11296 5536 -3082 -9183 -11309 -8600 -1811 6720
2448 6720 11974 10026 2675 -5387 -10843 -11307 -6603 2260 9532 10966 6908 -117 -6857 -11622 -10848
2463 -10848 -4226 5050 10771 10367 4941 -2780 -9708 -12132 -8305 294 7291 9996 8527 2831 -4955
2478d955o289o51O012Q409O154J915l093q036p874l712L187O262O862M999R56
2493A0146m662q640p252j442M226P034P260M156j902p392q262l912M41M519P049
2508A367P069K609m134q247o703l501J887O470Q182N240j059n989o865n392k015
2523a1081K757P562P988L323k669o493p365n060p3N944Q216N575N79l675o076
2538e48p179l889J990P126P812M174n03m881p957o615q71N041O886N785L043j318
2554H096o259q056n102J167N734O924O242J395m162q021o666j850K718N533O648
2569D341N320k66n775p865n542q00L544P121P511K979l509p000o069l650Q3M740
2585d837P900O082N73m369o941o321k916K368P159P554L339j804m819o308n587
$$ plain form
2478 -4955 -11244 -11895 -5883 2526 8680 10595 7502 -534 -8408 -12120 -8933 -2671 4191 9190 10146
2493 10146 5484 -3156 -10408 -11850 -7624 -590 6670 10826 8924 1532 -6730 -10642 -10201 -5682 1367
2508 1367 8436 11045 6911 -1336 -8039 -11540 -9653 -3183 4999 10239 9180 3191 -3674 -9066 -11081
2523 -11081 -8324 -762 7226 10549 7880 1387 -5978 -11038 -11111 -5167 3049 8624 9203 5528 -548
2538 -548 -7727 -11616 -9626 -2500 5312 9486 8983 4102 -3855 -10470 -11341 -6300 586 6371 9414 8096
2554 8096 1837 -6219 -11321 -10154 -4420 2504 8746 10141 5979 -2042 -8708 -10558 -7840 -2307 4341
2569 4341 9661 9395 3620 -4245 -9787 -10587 -7043 78 7589 10568 7059 59 -6010 -9660 -9577 -4837
2585 -4837 3063 9145 9718 5349 -1592 -7913 -10829 -8461 -1302 6252 9591 7787 2968 -3340 -8927
2600h927j754M139P758O465J945k419n837p513m578J616O252O688M166J102l202
2615E901p227o494k633L072O500O546L979o78n990p648m959M25M560N997N456
2630F807L191k331p273o849l321J286N059P214N753K35n234p007m913j849K413
2645f819N592P178M122j640n662o747m622j083M524P584O293R68l515n697n673
2660e197m096R63N523P371M462K19l915o875o469j858L641O952N865K530r80m850
2676C286o736n270j52M665O715N262K135k824o696p318k326K609N103N549M535
2691H537Q04m171p023n593j510K873O175O596L611j943o597o320l442L96L922
2706c685N884N915K015l709o340n766l019J175N485P589M134j129m733n638m659
$$ plain form
2600 -8927 -10681 -6542 1216 7681 9626 7207 1370 -6143 -10721 -9105 -2853 3835 8001 9103 5901
2615 5901 -1326 -7820 -10453 -7381 -881 5665 9644 8966 2976 -4672 -9631 -9206 -4646 1351 6807
2630 6807 9998 7667 394 -6455 -9776 -8490 -3431 3783 9536 9771 4537 -2470 -7383 -9232 -6819
2645 -6819 -1227 5951 10073 8433 2771 -3976 -8598 -9681 -5157 2427 8720 9688 6173 476 -5197
2660 -5197 -9293 -8330 -2807 4564 9026 9245 5330 -1545 -8014 -9872 -6231 721 6586 9116 8136 3286
2676 3286 -3450 -8720 -8872 -4207 2508 7770 9905 7081 385 -6933 -9259 -6650 -1547 4002 8537
2691 8537 9341 5170 -1853 -7446 -8956 -6083 92 6688 10299 8356 1759 -4561 -8003 -7607 -3685
2706 -3685 2199 8114 10129 6420 80 -5686 -8705 -7530 -2045 5544 9678 8549 3816 -1822 -6481
2721f481k123K828O462O224K655j697n270o403m845J20N294O988M541K72k776
2736E789n134o210l404K130N849N862M048J33m281p222n686k90M186N592N086
2751F448K609j476n464o351l711M87M336N920N572J459l660o982n529j511K127
2766e726M631N959M287l51m996o140m329j475K839O340O522K184l124n675n174
2781d228l316K96M383N986M979O86l351n486n766k789J825O525O176K861j420
2796G361m214n442m510j371L982N931M651K303j474n138o838l994J661N093N877
2811C878L685O35k863n931n555j940K359M900N561L924p7n322o867l977L24L665
2827c601M833N250K239k438n358n475k845L26L944O557M951J30m177o222m143
$$ plain form
2721 -6481 -8604 -5776 686 6910 9565 7868 2598 -3805 -8650 -8530 -3236 3752 8293 8565 5789
2736 5789 655 -5555 -8959 -6829 -980 4882 8930 9063 4782 -2440 -8126 -8416 -4230 1362 6448
2751 6448 9057 7581 2117 -4234 -7945 -7458 -3122 2798 8370 9829 6169 -813 -6342 -7853 -5726
2766 -5726 -1095 4864 9151 8800 3804 -2336 -6665 -8140 -5301 1039 7561 9745 6621 946 -4228
2781 -4228 -7544 -7248 -2865 3121 8100 8786 5435 -51 -5817 -8606 -6781 -256 5920 8781 7361
2796 7361 3147 -2295 -6805 -8176 -4194 1737 6388 8691 7217 2079 -4759 -8753 -7092 -1999 3878
2811 3878 7563 8198 5335 -596 -6151 -8091 -5732 -832 4729 8653 8576 3254 -3613 -7590 -7266 -3601
2827 -3601 1232 6482 8721 6283 925 -4550 -7395 -7069 -3125 3432 8383 8513 4336 -1886 -6029
2842f029j542J892N198N484L348j444m257n333m359j205L565O765N160R44k990
2857E197m485n484l212J013M799N739L446N67l112n601n746j718L015N918N116
2872E452K033r95m162n595m355J01L723M962M650K321k000o135n973k211J919
2887f265M278M974M136K12l685n733m471j138K153M892N601L370j636n505n607
2902d424k728O6L157N464M865J138l062m751m551k953N14M900O392L314p80l741
2918B820n170m197j354K705N329M607K307j438l832n443m327m3M544N778L641
2933E927P53k172m921n405k319J969M600M485L562N47l642n961m820m47L146M948
2949B50M365K348j330m588n519k765M03L155N018M921J378l470n629m520j500
$$ plain form
2842 -6029 -7571 -5679 -481 5003 8351 6907 2650 -2683 -7042 -8247 -4682 2083 7243 8187 5197
2857 5197 712 -4772 -7984 -6971 -2172 3567 7013 7580 4468 -1133 -6879 -8597 -5582 336 5452
2872 5452 7485 6490 2328 -3267 -7622 -7521 -3798 1164 5814 8135 6135 0 -5973 -8184 -6265
2887 -6265 -1987 2987 7123 7335 3650 -2083 -6554 -7692 -5539 -647 4954 8324 6688 1183 -4424
2902 -4424 -7152 -7086 -3929 1535 6400 7538 4476 -275 -4826 -7779 -7265 -2365 4027 7341 6561 2820
2918 2820 -2350 -6547 -7901 -5196 133 4740 7047 5609 1777 -3666 -7993 -8036 -3492 2286 5927
2933 5927 6680 4508 -413 -5818 -8137 -6168 -1568 2917 6479 7026 3384 -2577 -7397 -7844 -4698 250
2949 250 4615 6963 5633 1045 -4474 -7239 -6836 -3681 1337 6258 7636 4166 -1463 -5983 -7483
2964g483J350M403N239L197n83l766m897l645j538K246N506N264K095k389m521
2979D78m655k959L0L847N377L781L27k393m330n097k520J666N355N146K386o92
2995E747l451n055m108o30L287M528M237J958j210m366n594l277J303M110M818
3010B297L288R72k811n324m209j372J925L701M636L561j66m294n684l134j84K638
3026d160M781M426J984k571m324m425k259l9L426N485M075J50l314m727m236j361
3042g089J777M516M929K195r40l137m592l963j079L295N446M116J087k059m179
3057C23m621k654J094M187M469K786N26k344m746m787j511K549M684M105K453
3072F513p49m000m977l104J93K921L876M187K117j746m986n047j917J252L607
$$ plain form
2964 -7483 -6133 -1730 3509 6706 6123 2357 -2540 -6185 -7723 -5477 29 5293 7388 4999 478
2979 478 -4177 -7136 -7106 -3259 2118 5899 6226 3833 -497 -5594 -8114 -6448 -1093 4053 6439 5747
2995 5747 2296 -2759 -6867 -7497 -4210 318 4555 6513 5303 937 -4657 -7934 -6631 -2521 2297
3010 2297 5585 6557 3746 -1578 -5787 -7159 -5234 -1533 3103 6664 6498 2204 -3480 -6614 -6798 -4160
3026 -4160 621 5047 7031 4460 136 -4289 -6548 -6587 -3161 2324 6399 6549 3235 -1492 -5728 -7089
3042 -7089 -5312 -796 4133 6328 5388 2251 -2341 -6304 -7383 -4088 1358 5474 6561 4502 323
3057 323 -4298 -6952 -5858 -1671 2798 5584 6110 3766 -980 -5767 -7278 -4729 -45 4060 6513
3072 6513 5764 1764 -3213 -6317 -6124 -3203 673 4860 6977 5231 245 -4802 -6719 -5467 -1860
3087a860M777L449N5l567m457l388j331J581L991N005K796j375m100m803k644
3102e871k63L022M913L787O87k259l659l989k673M07M298N132K905l93k889m556
3118a401l913j122K551M260M091J526p10l269m492l815J8L752M627L358J117j974
3134D604m581m571j687J841L410L921K933O59l020n199l754p16K437M266M113
3149D656K044j461m162m280k061K60K182M339M023J341k656m636l887j771J172
3164d897L931M797K533p76l219l785l153j196J606M728M580J554j541l739m271
3179b848k748K75L401M684K676K55j642l783m445k152J808M170M180K271j43l091
3195B868m609l589j10K582L848L339J624p22l799m651k542Q21L099M070L480P19
$$ plain form
3087 -1860 2917 6366 6421 2854 -1603 -4991 -6322 -4741 -750 4255 7051 5676 1576 -3227 -5871
3102 -5871 -6134 -3112 1801 5588 6275 4016 357 -3632 -6305 -5898 -1600 3532 6437 6044 3155 -1401
3118 -1401 -5314 -6436 -3885 375 4466 5992 5282 2013 -2479 -6294 -6276 -2524 2103 5461 6578 4604
3134 4604 23 -4548 -6235 -4394 -984 2937 5870 6529 3509 -1690 -5444 -6160 -3723 543 4656
3149 4656 6700 5239 1077 -3203 -5264 -5004 -2822 1517 5540 6881 4225 -411 -4298 -6069 -4897
3164 -4897 -966 3831 6364 5588 2369 -1416 -4569 -5765 -4159 569 5149 6703 5162 1423 -2848
3179 -2848 -5596 -5321 -1920 2764 5440 5695 4053 270 -4175 -6327 -4519 -349 3831 6102 5959 2868
3195 2868 -1741 -5330 -5440 -2858 990 4329 5953 5231 1432 -3219 -5761 -4940 -1841 2229 5709 6428
3211F428k823m448l399r22J293L173L897K989k52l307m573l050n08K247M267M017
3227E029J238j996l642l452k149RK831M620L435O3k583l848l696j685J739M099
3243A2L994J709q01k542l821l461o42K721M090L565R10j223l873l906k326J024
3259d570L579L551K349N71j782m022m037j260J765L780L631K340n24l692m203
3274b524k491M12K076L285L464J783j572m138l744k049Q10L006M049L258k58k956
3290B411l701k518j131J091L328M308K054j095l226l741k739n75K649M552L038
3305D705L04j732k891l378k266J84L641M124K538j22k418l778l638j024K485L613
3321C47K991J614n06k798l990k924j7L077L644K900J073j542m035l963j267J444
$$ plain form
3211 6428 3605 -843 -4242 -5164 -3871 -698 3199 6188 5936 2629 -1944 -4994 -5502 -3255 1012 5029
3227 5029 6267 4271 629 -2823 -4972 -4963 -2132 2488 5923 5986 3403 -445 -4141 -5826 -4087 12
3243 12 4006 5715 4914 2372 -1449 -4910 -5552 -2831 1259 4824 5734 4511 638 -3268 -5594 -4570
3259 -4570 -991 2560 4909 5480 3698 -324 -4361 -5621 -3856 -76 3555 5895 5371 1679 -2524
3274 -2524 -5015 -4603 -2527 758 4222 6005 4433 295 -3449 -5498 -4688 -1682 2367 5625 5367 2411
3290 2411 -1290 -3808 -4939 -3848 -520 3788 5842 4747 1521 -2220 -4959 -5534 -2885 1667 4705
3305 4705 5009 3277 386 -2992 -5258 -5074 -1433 2691 5229 5107 2689 -1089 -4727 -5751 -3266 347
3321 347 3338 4952 4446 1648 -2342 -5266 -5283 -2206 1438 4338 5411 3869 -166 -4129 -5396 -3952
3337c952K913K926K729N22k527m156k990o50J502L499L881J910j518l675l170
3352b756j918l1K227L559L297P29j993l401l209j841P37L204M320K184r60k552
3368A596l028k712j107J462L963L460J305j096k829l797k860N30L174L888K264
3383D213J26j483l166l336j814J192L227L541K010J63k718m084l000j95K719K757
3399A52K790J639o82l219l830j923L36K435L448L235O01k452l847k787p81J038
3415c847K747L384K301k03k735l494k800m68J655L711L714R67k034l001k653k002
3431d758R7K627L670K475L44j966l131l426j502J421L644L401J425o36k280l054
3447a649k935n35K146L361K791J343q99l161l987j841J106K912K909K185N59j723
$$ plain form
3337 -3952 -1039 1887 4616 5138 2611 -1545 -4535 -5185 -3683 -184 3697 5607 4089 414 -2756
3352 -2756 -4674 -4705 -2478 1081 4378 5107 3114 -287 -3496 -5337 -4600 -1396 2924 5108 4148 1596
3368 1596 -1432 -4144 -5251 -3789 174 3634 4939 3843 1014 -2783 -5643 -5113 -1939 1949 4213
3383 4213 4339 2856 -310 -3646 -5460 -4268 -1041 2500 4510 4673 1955 -2129 -5129 -5324 -2605 152
3399 152 2942 4581 3899 680 -3150 -5073 -4737 -2302 1146 4381 4982 2530 -1317 -4104 -4885 -3847
3415 -3847 -1100 2284 4585 4382 1647 -1847 -4647 -5115 -3460 251 3965 4932 2898 -103 -2756 -4758
3431 -4758 -4661 -2034 1636 4111 4455 2489 -642 -4068 -5570 -4149 -505 2896 4321 3685 1405 -1649
3447 -1649 -4584 -5119 -2973 388 3179 4522 3623 462 -3525 -5366 -4260 -1348 1561 3746 4305 2582
3463B582l542l018r82J449K687L297K083l85k887l965k013L56J852K923K917J242
3479D596j254l271k996j500mK529L718K774l59k299k970k580r44J035L104L372
3495B951J475p58k359l218k535m91K082L894K862K80j503k587k991j965N71L103
3511a189L281J878K23j784l423l081q07K012L050K876J255o88k361l472k068J98
3527d100K056K902K649J188j612l400l285p11Q50K510K881K321L3k255l207k405
3543c585n92R12L270L313J592j320k989k797j870J50J914L130K635O33j676k674
3559D6k718j930P53K959L426J893p51j955k693k688m79J526L138K541J167n31
3575C704k359l639k049L27K567L328J844L44j288k732l100j112R19K780K652J929
$$ plain form
3463 2582 -960 -3978 -4960 -3511 -824 2473 4556 4171 1284 -2681 -4694 -4338 -2486 437 3354 4596
3479 4596 3342 71 -2925 -4425 -4429 -1900 1818 4592 4233 1934 -1036 -3616 -4560 -3525 -421 2951
3495 2951 4426 3668 1309 -1909 -4444 -4935 -2853 1041 3903 4183 2680 93 -2898 -4863 -4292 -1189
3511 -1189 2092 3970 4193 2409 -1014 -4095 -4902 -2890 160 3036 4291 3603 1242 -2230 -4298 -4100
3527 -4100 -2044 858 3507 4695 3083 -317 -3602 -4313 -3463 -953 1928 4249 4282 2027 -1180 -3585
3543 -3585 -4177 -3265 5 3318 4910 3590 601 -2196 -4066 -3916 -2002 1128 3763 4396 2720 46
3559 46 -2672 -4602 -3849 -890 2536 4429 3678 1723 -970 -3658 -4137 -2611 527 3068 4235 3704
3575 3704 1345 -2294 -4343 -4016 -1449 1879 3723 4067 2779 47 -3053 -4165 -3246 -466 2186 4115
3591D115L78k302l865k055jJ457K641K474J609r38k958k668j573j10K092K919
3607A215K789N42j847l328k387p33Q69K249L043J812m24k126k653k333q19J443
3623b688L515K676P54j276k412k541j741J80K282L145J903K82j518k475l033j283
3639d230J218L197K634R50k78j879k748k661J68J845K447K506J173q04k668l416
3655b546j584Q90K281K761J819J89j457k792k346p66R36K081K922J964l47k808
3671A197l083j562K94J404K562K603O49j425k328k378j533j1K330L147K158M1
3687D065k102k708k086p99Q06K991K653J131o55j796k752k270m12J840L468J925
3703C299M72r14k613k579j499P89K271K579J639K84j378k966k619p37J571K756
$$ plain form
3591 4115 4493 2191 -1674 -3729 -3730 -2273 368 2842 4451 3513 555 -2113 -3686 -3796 -1704 1215
3607 1215 4004 4546 2699 -629 -3016 -3749 -2880 -631 2412 4224 3800 1674 -979 -3312 -4131 -2688
3623 -2688 827 3503 4257 2981 569 -1972 -3713 -3533 -1251 1894 3797 4079 2561 86 -2947 -4230
3639 -4230 -3012 185 2819 3769 3491 1612 -1136 -3797 -3629 -1784 663 3169 4342 3538 870 -2546
3655 -2546 -4130 -3240 -959 1802 3621 3810 2353 -439 -2785 -3551 -2615 -534 2388 4352 4005 1197
3671 1197 -1886 -3448 -3154 -1750 812 3415 4064 2639 311 -2067 -3600 -3611 -1281 1866 4024 4065
3687 4065 1963 -745 -2831 -3630 -2824 167 2820 3951 3296 1500 -1252 -3522 -3934 -2094 1374 3299
3703 3299 3771 2857 244 -2335 -3834 -3045 -774 1805 3444 3728 2350 -616 -3235 -3972 -2401 355
3719C55K024J368m29k086k888j588R3J480K394K395J030j412k723k674j011O98
3735b974K284K518J911j42k161k331j886p61P32K630L057J391j152k628k332j632
3751c476O0J862K656K270J20j140k185k276j603L24K600K996J461l42j810k705
3767a188j874o91J673K497J919R71l83k091k887j931N64K278K284J795N98j229
3783B305k660k462p18J037J799K044K008R0j992k803k137J2J214K462K316J294
3799C809j189k369k281j320K00J537K492K174O24j785k462k183o56P00K155K455
3815A901J273m24j598k251j828o76J208K773K380O09j013k085k342j550L53K257
3831a013K342J390K21j090k128k610j173J270K493K256J263k68k016k523j782
$$ plain form
3719 355 2379 3747 3318 1232 -1656 -3244 -3151 -1671 723 3118 4148 2736 13 -2661 -3672 -2974
3735 -2974 -690 1828 3739 3597 1436 -895 -2781 -3542 -2810 -180 2877 4268 3116 488 -1844 -3476
3751 -3476 -3416 -1554 1102 3372 3492 2352 167 -2109 -3712 -3388 -788 2208 3669 3327 1517 -1188
3767 -1188 -3062 -3753 -2080 417 2336 3307 2924 833 -2054 -3985 -3421 -1143 1141 2936 3534 2305
3783 2305 -355 -2817 -3535 -2498 -699 1345 3353 3443 1451 -1352 -3489 -3477 -2263 199 2515 3809
3799 3809 2620 251 -2030 -3350 -3150 -1613 879 3053 3677 1892 -570 -2753 -3409 -2709 -554 1901
3815 1901 3174 2750 1152 -1099 -2927 -3603 -2395 378 2758 3367 2354 269 -2073 -3623 -3270 -1013
3831 -1013 1329 2719 2940 1850 -278 -2888 -4061 -2791 -298 1958 3221 2953 937 -1586 -3368
3846c368R4J500K119J677J162o10k268k603j337N98J773K351J776K88j728k304
3862h80j796n38P56J860K301J653n23k171k222j622j8J203K485K262M47j228j990
3879b1j712j563J51J840K591J841l58j301k407j800p08J016K529J907Q07n11j433
3896H68k216j872k31J679K623J582R54j390j924k364j143P93J874J959J268N45
3912C005j439k421k189n10J251K340J954J156n99k183k188j253L17J118K032J955
3928B346J060j259k231k161r34M76J739K339J669k02j783k062j320p32O76K067
3944c12K675O11o43j791k160j414oJ660K501J658q4r65j664k259j209Q21J774
3961h07K354J318J32j549k392j890l86J474K003J853P20l03j763k403j496K89
$$ plain form
3846 -3368 -3274 -1774 345 2022 3184 2574 306 -2297 -3634 -3036 -1263 1088 2864 3152 1424 -880
3862 -880 -2676 -3214 -2458 -598 1703 3356 2833 662 -1560 -3182 -3200 -1997 488 2750 3197 1969 -21
3879 -21 -1733 -3296 -3145 -1305 1286 3127 2769 1468 -939 -2739 -3447 -2431 98 2005 2812 2301 868
3896 868 -1348 -3220 -3451 -1772 851 2433 3387 1997 73 -2291 -3434 -2641 -767 1192 2460 3005
3912 3005 1566 -855 -3044 -3554 -2303 37 1991 3147 2548 365 -1823 -3076 -2759 -1641 391 2346
3928 2346 3406 2147 -84 -2245 -3179 -2703 -964 1375 3044 2842 1059 -1003 -2323 -3055 -2379 -312
3944 -312 2363 2974 2331 540 -1620 -3034 -3040 -1380 1121 2779 2695 1730 66 -2193 -3402 -2581 -807
3961 -807 1547 2865 2997 1448 -944 -2834 -3220 -1746 257 2110 2830 2527 764 -1639 -3135 -2846
3977b846J695J930J819N79j183k474j909m16O97J378K050J540J7j653k435j499
3993b710q1Q25K118K199R96j168j989j784r17q4J246K300J730K85j213k015j736
4010a998j056R20J989K213P39n23j446j423j942l45J109K177J993N68q29j583
4026E63k190j380N56J792K111Q21M17j034j967j915p24J061J724J774J497l01
4042B805j635k316j555L74J060J795J675Q34r79j711k109p35L03J294J789J975
$$ plain form
3977 -2846 -1151 779 2598 3177 1994 -480 -2389 -2805 -2108 -730 1320 2860 2877 1224 -1211 -2710
3993 -2710 -2791 -1966 152 2351 3347 2179 190 -1594 -2511 -2595 -1349 951 2681 2966 1753 -262 -1998
4010 -1998 -3054 -2134 -145 2068 2807 2284 838 -585 -2527 -2872 -1763 414 2407 2975 2146 563
4026 563 -1627 -3007 -2451 -659 1452 2273 2690 1656 -311 -2226 -2950 -1889 -165 1609 3106 2805
4042 2805 1170 -1146 -2701 -2327 -1267 528 2203 3037 2058 347 -1762 -2497 -2194 -900 889 2864
$$ [...]
8191a78
##END NTUPLES=NMR FID
##END=
