##TITLE=1H_B4f-4
 CDCl3
 8 sc, 
 28.6.2024
##JCAMPDX= 6.0         $$ Bruker NMR JCAMP-DX V2.0
##DATA TYPE= NMR FID
##DATA CLASS= NTUPLES
##ORIGIN= UXNMR, Bruker Analytische Messtechnik GmbH
##OWNER= root
$$ XWIN-NMR		Version 3.5
$$ Fri Jun 28 13:55:50 2024 Russian Standard Time (UT+4h)  she@DPX200
##.OBSERVE FREQUENCY= 200.1313
##.OBSERVE NUCLEUS= ^1H
##.DELAY= (6, 6)
##.ACQUISITION MODE= SIMULTANEOUS
##.ACQUISITION SCHEME= undefined
##.AVERAGES= 8
##.DIGITISER RES= 18
##SPECTROMETER/DATA SYSTEM= spect
##.PULSE SEQUENCE= zg30
##.SOLVENT NAME= CDCl3
##.SHIFT REFERENCE= (INTERNAL, CDCl3, 0, 15.7039)
##AUDIT TRAIL= $$ (NUMBER, WHEN, WHO, WHERE, WHAT)
$$ ##TITLE= Audit trail, XWIN-NMR		Version 3.5
$$ ##JCAMPDX= 5.01
$$ ##ORIGIN= Bruker BioSpin GmbH
$$ ##OWNER= she
$$ F:/spectra/data/she/nmr/H-F/1/audita.txt
$$ ##AUDIT TRAIL=  $$ (NUMBER, WHEN, WHO, WHERE, WHAT)
(   1,<2024-06-28 13:54:48.45 +0400>,<she>,<DPX200>,
      <created by zg, POWCHK disabled, PULCHK disabled
       configuration hash MD5:
       00 E9 B6 7A A2 85 ED C7 34 08 36 98 17 FE 4E 26
       data hash MD5: 16K
       6F 14 4C DF 15 46 A9 75 0D 73 4B 44 C2 31 1E 27>)
$$ ##END=
$$ 
$$ hash MD5
$$ 0B 0B ED 7C D8 03 8D AA C6 D6 9C A2 00 B3 85 72
##$RELAX= 
##$RELAX= 
##$RELAX= 
##$RELAX= 
##$RELAX= 
##$RELAX= 
$$ Bruker specific parameters
$$ --------------------------
##$DU= <F:/spectra>
##$EXPNO= 1
##$NAME= <H-F>
##$PROCNO= 1
##$TYPE= <nmr>
##$USER= <she>
##$AMP= (0..31)
100 100 100 100 100 100 100 100 100 100 100 100 100 100 100 100 100 100 
100 100 100 100 100 100 100 100 100 100 100 100 100 100 
##$AQSEQ= 0
##$AQ_mod= 1
##$AUNM= <au_zg>
##$AUTOPOS= <>
##$BF1= 200.13
##$BF2= 200.13
##$BF3= 200.13
##$BF4= 200.13
##$BF5= 200.13
##$BF6= 200.13
##$BF7= 200.13
##$BF8= 200.13
##$BYTORDA= 1
##$CFDGTYP= 0
##$CFRGTYP= 5
##$CHEMSTR= <none>
##$CNST= (0..31)
1 1 145 1 1 1 1 1 1 1 1 1 1 1 1 1 1 1 1 1 1 1 1 1 1 1 1 1 1 1 1 1 
##$CPDPRG= <>
##$CPDPRG1= <>
##$CPDPRG2= <>
##$CPDPRG3= <>
##$CPDPRG4= <mlev>
##$CPDPRG5= <mlev>
##$CPDPRG6= <mlev>
##$CPDPRG7= <mlev>
##$CPDPRG8= <mlev>
##$CPDPRGB= <>
##$CPDPRGT= <>
##$D= (0..31)
0 1.2 0 0 0 0 0 0 0 0.06 0 0.03 0 0 0 0 0.0002 0 0 0 0 0 0 0 0 0 0 0 0 
0 0 0 
##$DATE= 1719568487
##$DBL= (0..7)
120 120 120 120 120 120 120 120 
##$DBP= (0..7)
150 150 150 150 150 150 150 150 
##$DBP07= 0
##$DBPNAM0= <>
##$DBPNAM1= <>
##$DBPNAM2= <>
##$DBPNAM3= <>
##$DBPNAM4= <>
##$DBPNAM5= <>
##$DBPNAM6= <>
##$DBPNAM7= <>
##$DBPOAL= (0..7)
0.5 0.5 0.5 0.5 0.5 0.5 0.5 0.5 
##$DBPOFFS= (0..7)
0 0 0 0 0 0 0 0 
##$DE= 6
##$DECBNUC= <off>
##$DECIM= 32
##$DECNUC= <off>
##$DECSTAT= 4
##$DIGMOD= 1
##$DIGTYP= 9
##$DL= (0..7)
0 120 120 120 120 120 120 120 
##$DP= (0..7)
150 150 150 150 150 150 150 150 
##$DP07= 0
##$DPNAME0= <>
##$DPNAME1= <>
##$DPNAME2= <>
##$DPNAME3= <>
##$DPNAME4= <>
##$DPNAME5= <>
##$DPNAME6= <>
##$DPNAME7= <>
##$DPOAL= (0..7)
0.5 0.5 0.5 0.5 0.5 0.5 0.5 0.5 
##$DPOFFS= (0..7)
0 0 0 0 0 0 0 0 
##$DQDMODE= 0
##$DR= 18
##$DS= 0
##$DSLIST= <SSSSSSSSSSSSSSS>
$$ [...]
##$SUBNAM2= <"">
##$SUBNAM3= <"">
##$SUBNAM4= <"">
##$SUBNAM5= <"">
##$SUBNAM6= <"">
##$SUBNAM7= <"">
##$SUBNAM8= <"">
##$SUBNAM9= <"">
##$SW= 18.0517328524113
##$SWIBOX= (0..15)
0 0 2 0 0 0 0 0 0 0 0 0 0 0 0 0 
##$SW_h= 3612.71676300578
##$TD= 16384
##$TD0= 1
##$TE= 0
##$TE2= 300
##$TE3= 300
##$TEG= 300
##$TL= (0..7)
0 120 120 120 120 120 120 120 
##$TP= (0..7)
150 150 150 150 150 150 150 150 
##$TP07= 0
##$TPNAME0= <>
##$TPNAME1= <>
##$TPNAME2= <>
##$TPNAME3= <>
##$TPNAME4= <>
##$TPNAME5= <>
##$TPNAME6= <>
##$TPNAME7= <>
##$TPOAL= (0..7)
0.5 0.5 0.5 0.5 0.5 0.5 0.5 0.5 
##$TPOFFS= (0..7)
0 0 0 0 0 0 0 0 
##$TUNHIN= 0
##$TUNHOUT= 0
##$TUNXOUT= 0
##$USERA1= <user>
##$USERA2= <user>
##$USERA3= <user>
##$USERA4= <user>
##$USERA5= <user>
##$V9= 5
##$VALIST= <valist>
##$VCLIST= <CCCCCCCCCCCCCCC>
##$VD= 0
##$VDLIST= <DDDDDDDDDDDDDDD>
##$VPLIST= <PPPPPPPPPPPPPPP>
##$VTLIST= <TTTTTTTTTTTTTTT>
##$WBST= 1024
##$WBSW= 4
##$XGAIN= (0..3)
0 0 0 0 
##$XL= 0
##$YL= 0
##$YMAX_a= 288917
##$YMIN_a= -393817
##$ZGOPTNS= <>
##$ZL1= 120
##$ZL2= 120
##$ZL3= 120
##$ZL4= 120
##$ABSF1= 10
##$ABSF2= 0
##$ABSG= 5
##$ABSL= 3
##$ALPHA= 0
##$AQORDER= 0
##$ASSFAC= 0
##$ASSFACI= 0
##$ASSFACX= 0
##$ASSWID= 0
##$AUNMP= <proc_1d>
##$AZFE= 0.1
##$AZFW= 0.1
##$BCFW= 1
##$BC_mod= 2
##$BYTORDP= 1
##$COROFFS= 0
##$CY= 11.3945322036743
##$DATMOD= 1
##$DC= 2
##$DFILT= <>
##$DTYPP= 0
##$F1P= 15.6554695791079
##$F2P= 12.8336369535428
##$FCOR= 0.5
##$FTSIZE= 0
##$FT_mod= 4
##$GAMMA= 1
##$GB= 0.15
##$INTBC= 1
##$INTSCL= 1
##$ISEN= 128
##$LB= 0.24
##$LEV0= 0
##$LPBIN= 0
##$MAXI= 10000
##$MC2= 0
##$MEAN= 0
##$ME_mod= 0
##$MI= 1.114404
##$NCOEF= 0
##$NC_proc= 0
##$NLEV= 6
##$NOISF1= 3.799351
##$NOISF2= 2.8
##$NSP= 1
##$NTH_PI= 0
##$NZP= 0
##$OFFSET= 15.70392
##$PC= 1
##$PHC0= -25320.21
##$PHC1= 15.98748
##$PH_mod= 1
##$PKNL= yes
##$PPARMOD= 0
##$PSCAL= 0
##$PSIGN= 0
##$REVERSE= no
##$SF= 200.130013532006
##$SI= 16384
##$SIGF1= 3
##$SIGF2= 2
##$SINO= 400
##$SIOLD= 16384
##$SREGLST= <1H.CDCl3>
##$SSB= 0
##$STSI= 0
##$STSR= 0
##$SW_p= 3612.71676300578
##$SYMM= 0
##$S_DEV= 0
##$TDeff= 0
##$TDoff= 0
##$TI= <>
##$TILT= no
##$TM1= 0
##$TM2= 0
##$TOPLEV= 0
##$USERP1= <user>
##$USERP2= <user>
##$USERP3= <user>
##$USERP4= <user>
##$USERP5= <user>
##$WDW= 1
##$XDIM= 8192
##$YMAX_p= 0
##$YMIN_p= 0
$$ End of Bruker specific parameters
$$ ---------------------------------
##NTUPLES= NMR FID
##VAR_NAME=  TIME,          FID/REAL,        FID/IMAG
##SYMBOL=    X,             R,               I
##VAR_TYPE=  INDEPENDENT,   DEPENDENT,       DEPENDENT
##VAR_FORM=  AFFN,          ASDF,            ASDF
##VAR_DIM=   8192,          8192,            8192
##UNITS=     SECONDS,       ARBITRARY UNITS, ARBITRARY UNITS
##FACTOR=    0.0002768,     1,               1
##FIRST=     0,             0,               0
##LAST=      2.2672688,     0,               0
##MIN=       0,             -393817,         0
##MAX=       2.2672688,     288917,          0
$$ Real data points
##PAGE= N=1
##DATA TABLE= (X++(R..R)), XYDATA
0@%%%%%%%%%%%%%qJ6j6J6j6K4l2L5m3M8n6O9q0R1j04J20j39J60j80K04k31K60
$$ 0 0 0 0 0 0 0 0 0 0 0 0 0 0 -8 8 -8 8 -8 16 -16 19 -24 24 -32 37 -43 48 -56 64 -75 85 -95 109 -122 138
35A38k93L28l64M06m54N04n58O18o84P55q34R20j013J116j230J356j491J641j814
$$ 138 -155 173 -191 215 -239 265 -293 325 -359 396 -438 482 -531 585 -645 711 -780 861 -953
54i53K009k228K478k766L107l515M007m618N400o446P908j0089J3670k0520L7897
$$ -953 1056 -1172 1306 -1460 1647 -1868 2139 -2479 2921 -3525 4383 -5706 7964 -12556 25341
69B5341j56795k62363N26715J10161l67634J38910K37561l27054p7485L42207
$$ 25341 -131454 -393817 132898 243059 -124575 14335 251896 -75158 -152643 189564
79A89564j37253l30726K78555K06810l29372l4091K88055j61419j66884L38218
$$ 189564 52311 -278415 140 206950 -122422 -156513 131542 -29877 -196761 141457
89A41457Q1517l67421L8358K83447j77302j71289K61980L8976k54733J00349J73951
$$ 141457 222974 -144447 -106089 177358 56 -171233 90747 129723 -125010 -24661 149290
100A49290k25597q3749K47597k4354j71542J48006N7476k35016N6233K55976j38786
$$ 149290 -76307 -160056 87541 63187 -108355 39651 97127 -137889 -81656 174320 35534
111C5534j66465K21364M4607k57454N7613J82874j64750o6043K28514n5845k24801
$$ 35534 -130931 90433 135040 -122414 -64801 118073 -46677 -112720 115794 59949 -164852
122a64852J45751J42670j94850Q418K32383j25217j88263K00897O1239k52816
$$ -164852 -19101 123569 -71281 -62863 169520 44303 -143960 56937 118176 -134640
132a34640O6262K32527j74225j56475K29546L2649k40403R7396K15132j67658
$$ -134640 -68378 164149 -10076 -166551 62995 95644 -144759 -47363 167769 111
142A11j11595J99132k8441j94416J43319J35514k10013l5859K23085p9038j98400
$$ 111 -111484 87648 59207 -135209 8110 143624 -66389 -102248 120837 41799 -156601
153a56601J59278J23356j96529r788J95804j01694j55108J72511Q0018j80580
$$ -156601 2677 126033 -70496 -80284 115520 13826 -141282 31229 111247 -69333
163f9333K5313J55674j09202r9605J46223J0882j47383P7357J09473j42869m6382
$$ -69333 -44020 111654 2452 -97153 49070 59952 -87431 -10074 99399 -43470 -89852
174h9852J56861l5834j26072J13601P8485j44374j4663J31571n2033q9800R9136
$$ -89852 67009 31175 -94897 18704 97189 -47185 -61848 69723 17690 -72110 27026
185B7026K8456j10046L8712Q0202r6631k7714J24612k7905j05710P9149N5828
$$ 27026 55482 -54564 -15852 64350 -32281 -59995 64617 36712 -68998 10151 65979
196F5979j15406N95J19491n6972r0139R9851L6873j17990K2519J02062p1324n1332
$$ 65979 -49427 -48832 70659 13687 -76452 23399 60272 -57718 -35199 66863 -4461 -55793
208e5793J01116q732j01750O2861P2414j01648k0238J18578m0649j08490Q9734
$$ -55793 45323 36591 -65159 -2298 70116 -31532 -51770 66808 26159 -82331 7403
219G403O7656j19920j1873J19941m1088r0423P8222M1729r3793J5332Q7998o2167
$$ 7403 75059 -44861 -56734 63207 22119 -68304 9918 51647 -42146 -26814 61184 -983
231i83n6185R1133P407r5068M2336P3023p8484l4230R2476j1253q6278M7876O1299
$$ -983 -57168 33965 41372 -53696 -11360 61663 -16821 -51051 41425 30172 -56106 -8230 53069
244E3069o9758k4752P2954j4467n7188M4158K7672n2678Q167M3316l4994k0707
$$ 53069 -16689 -41441 31513 17046 -40142 4016 31688 -20990 -12823 30493 -4501 -25208
256b5208M9710p343n1387L3867L8257n2214j6620N4587r552m1425K9270J6631
$$ -25208 24502 17159 -34228 -361 37896 -14318 -30938 23649 14097 -27328 1942 18573
268A8573l6594R327L0356k9173j3132M0294q092l8368L2682K4554m9670p91N3837
$$ 18573 -18021 -8694 21662 -7511 -20643 19651 11559 -26809 5873 30427 -19243 -20034 33803
281C3803k6026m3572M4341K1539n3090J462M9600k3447l5111L8903J2559m1561
$$ 33803 7777 -35795 8546 30085 -23005 -21543 28057 4610 -30501 8402 20961 -20600
293b0600J4550L0909l5939r589M7689j3849m7308L4189L6350m5924j8948M7944
$$ -20600 -6050 24859 -11080 -20669 27020 13171 -34137 52 36402 -9522 -28470 19474
305A9474p98m2386J9692K6732l1608q834L1894p654k3233J6756J0775j9170L732
$$ 19474 18676 -23710 -4018 22714 -8894 -17728 14166 6512 -16721 35 10810 -8360 -4628
318d628J6068j3615q261K1462j922k1721J2280J5624j8131q318J6404K079j2136
$$ -4628 11440 -2175 -10436 11026 9104 -12617 -337 15287 -2844 -11162 5242 7321 -4815
331d815j855N914K957J002p633o371J3979R663j8786o632K1808k66j7314Q145
$$ -4815 -6670 -756 2201 3203 -4430 -10801 3178 12841 -5945 -12577 9231 8965 -8349 -204
345b04R512j3299l99J3952p281j2186J1304N199j3915L882J0722j4263k155K1172
$$ -204 9308 -3991 -4390 9562 2281 -9905 1399 6598 -7317 -3435 7287 -6976 -9131 12041
359A2041p459k1266J7291J7489k1667j0602K3491L587k2257K065J7031o411r073
$$ 12041 4582 -16684 607 18096 -3571 -14173 9318 12905 -9352 -7287 9744 3333 -5740
372e740M957M75j43N525n776p464R516O057j0037m754Q731R19n155K742J556l896
$$ -5740 -783 -308 -451 5074 -702 -8166 1350 7407 -2630 -7384 1347 2266 -2889 -147 1409 -2487
388b487L241K712l351L193j017q040Q247R081j6866r241K1904N000k6118J949
$$ -2487 754 3466 115 3308 2291 -5749 2498 11579 -5287 -14528 7376 12376 -13742 -11793
402a1793K6108j0679k0001J8858R504k0290M746J5461j5663m633K2222q225k3313
$$ -11793 14315 3636 -16365 2493 11997 -8293 -3547 11914 -3749 -8382 13840 5615 -17698
415a7698K1164J8430l2283p764L5734q795l1590K2583J8530l1333l036L3726j0304
$$ -17698 3466 21896 -10387 -18151 17583 8788 -22802 -219 18311 -13022 -16058 17668 7364
428G364k7291K1915J6218k4752j06K0387j5809r813K5471p357k6581K0816K0069
$$ 7364 -19927 1988 18206 -6546 -6652 13735 -2074 -11887 13584 6227 -20354 462 20531
441B0531l0151q154L2519m701k7437J6483J5980k2947q49K0552j4244r753K3544
$$ 20531 -9620 -17774 14745 10044 -17393 -910 15070 -7877 -8726 11826 -2418 -12171 11373
454A1373n292k2946K0566J4610k9249o61L2209j7808k6706L3013J2323m2655O606
$$ 11373 6081 -16865 3701 18311 -10938 -11599 20610 2802 -23904 9109 21432 -21223 -14617
467a4617L9923k4493k4966L3813M532l4053J8379K4151l6217o445M7119j6962
$$ -14617 25306 813 -24153 9660 14192 -19861 -1482 22669 -13548 -19993 27126 10164
479A0164m3840M1062K7134n4680k848N6525k3805m6358M3698K4744n4096Q81M9426
$$ 10164 -33676 7386 34520 -20160 -23008 33517 9712 -36646 7052 31796 -22300 -21419 28007
492B8007k7476l1902M6737P562n1118K1198M1241m3392j8283N4999r763n1900
$$ 28007 531 -31371 15366 22928 -28190 -6992 34249 -9143 -27426 27573 17810 -34090
504c4090L4809L5866n4715j3285O1133j3548n0837L5732K6794m7366K370M4332
$$ -34090 719 36585 -18130 -31415 29718 16170 -34667 1065 27859 -19507 -17137 27195
516B7195k7733k6497M5402J568n0532K5262M0296m6846j5592N8328j4557n4724
$$ 27195 -538 -27035 18367 19935 -30597 -5335 34961 -11885 -27477 30851 16294 -38430
528c8430L9079L3503n3364l843N4768k4476m2044M4682J4764n3268J7988M8302
$$ -38430 649 34152 -19212 -23055 31713 7237 -34807 9875 24639 -28629 -10641 37661
540C7661m5400k5549O0024r022n9411M2315M5471o1975j8244O7819j7870o0359
$$ 37661 -7739 -33288 26736 17714 -41697 618 46089 -15886 -34130 33689 15819 -44540
552d4540M8577L7965o3759l822O2453l4530m6804N9349J7635o4392K1090N4712
$$ -44540 4037 42002 -21757 -25579 36874 2344 -44460 14889 32524 -31868 -10778 43934
564D3934n5955l4127P5688K595p2937L5542N5575o5340k7465P3054j0487o1363
$$ 43934 -12021 -46148 29540 32135 -40802 -5260 50315 -15025 -42490 30564 20077 -41286
576d1286M7155L8424o9221r485O7035k6363m6344N9780J7945p3152J5960O2260
$$ -41286 5869 44293 -24928 -34413 32622 6259 -40085 19695 37640 -35512 -19552 42708
588D2708n1278l5302P4909O026p4513K5219N2316n5989k2113P1650q828o1588
$$ 42708 -8570 -43872 31037 37063 -37450 -12231 40085 -15904 -38017 33633 24805 -36783
600c6783L8515L0759o2943L418O6683l2677m4280N8012J1052p3436K0061O6885
$$ -36783 1732 32491 -30452 -27034 39649 6972 -37308 20704 31756 -41680 -21619 45266
612D5266m4606l5432O4637l429p1911L3642N3494n3597j6116O4516k0860o0109
$$ 45266 660 -34772 29865 26436 -45475 -11833 41661 -11936 -28052 36464 15604 -44505
624d4505M5137L1515o0600J0268O7245m5698n3241O5137J7702p1915K5493O7585
$$ -44505 632 32147 -28453 -18185 49060 3362 -49879 15258 32960 -38955 -13462 54123
636E4123n3720m3761O3928K588o5013L7138N3026o0338k1107O4827k3454n8541
$$ 54123 403 -43358 20570 23158 -41855 -4717 48309 -12029 -33136 31691 8237 -50304
648e0304N8025L8696o8951k201O4573l9774n0767O6833K5465p0451J2976O0596
$$ -50304 7721 46417 -22534 -24735 39838 64 -50703 16130 41595 -28856 -15880 44716
660D4716m9776m1272O4767R978n7189K8335L9328n8765j7164O5133j3938n1780
$$ 44716 -5060 -46332 18435 28413 -28776 -441 38887 -19878 -37042 28091 14153 -37627
672c7627M8669L1085o8906n586O4968k6357m2904N5331J8422o4560P449N0687
$$ -37627 11042 42127 -26779 -32365 32603 6246 -36658 18673 37095 -27465 -20016 30671
684C0671l7264k5261N9295o59n9749K6649L7231n2137p533O4047j9783n2294M4210
$$ 30671 -6593 -31854 27441 26782 -32967 -6318 30913 -21224 -28757 35290 15507 -36787 7423
697G423K5244o3073L473O6270k7095m5205M6904J1858n8470J8312N0139m0104
$$ 7423 32667 -30406 -26933 39337 12242 -32963 13941 25799 -32671 -14359 35780 -4324
709d324k3308N4772r941n7578L4474M1991n0980j0524N9603k0918n5224M2843
$$ -4324 -27632 27140 17199 -40379 -5905 36086 -14894 -25418 34185 13267 -41957 886
721H86L2243n3162J369N4606k9006m2338M4449J5199m8957J5481M4220l8613k6529
$$ 886 33129 -20033 -18664 35942 6936 -35402 9047 24246 -24711 -9230 34990 -3623 -30152
734c0152M8706m120m8851L3216L8614m9357j6704N1900j0930m4290L4156K8923
$$ -30152 18554 14434 -34417 -1201 37413 -11944 -28648 23252 12322 -31968 2188 31111
746C1111m4723k999M2403k4453l0877M1712J0942m4228J4214L4240l6533j8675
$$ 31111 -13612 -16611 25792 1339 -29538 12174 23116 -21112 -6898 27342 -9191 -27866
758b7866M7199l205m3324K6069L0522m3204j0702M6060j1245l5245L1629J7281
$$ -27866 19333 16128 -27196 -1127 29395 -13809 -24511 21549 10304 -24941 6688 23969
770B3969m0212K192L5732k2211k1102L7582J767m2653J8416L3034l5106j5739
$$ 23969 -16243 -14051 21681 -530 -21632 15950 17717 -24936 -6520 26514 -8592 -24331
782b4331M3521l975m0141K2448K5279l4141o813L8693j1270l0972K6166J4266
$$ -24331 19190 15215 -24926 -2478 22801 -11340 -18153 20540 9270 -21702 4464 18730
794A8730l4633N984L2499k3511k0385L4375K243l7962J5135L1472k8581j6870
$$ 18730 -15903 -9919 22580 -931 -21316 13059 15302 -22660 -7525 23947 -4634 -21504
806b1504L6101j190l5205J8194K4060k7401o371K9064j0997k2213K3667R146k9568
$$ -21504 14597 13407 -21798 -3604 20456 -6945 -13316 15748 4751 -17462 6205 15351 -14217
819a4217O374K7758k0827j8577K8596L824l0164J1654K3768k2177j2037K6439
$$ -14217 -7843 19915 -912 -19489 9107 12931 -17233 -5579 18189 -3988 -16025 10414
831A0414j372k3055J3135J4441k0079j490K1475j2183j5616K1667M572k4336O993
$$ 10414 9042 -14013 -878 13563 -6516 -8006 13469 1286 -14330 7337 11909 -12427 -5434
844e434K0334j7348j2080K2616J748k3154Q768J7755j6409p676J9107m015j4907
$$ -5434 14900 -2448 -14528 8088 9836 -13318 -4550 13205 -3204 -10880 8227 4212 -10695
857a0695J3864O676j8094K867J7990j2184j2439J8367L797k1517O663J8075j4889
$$ -10695 3169 9845 -8249 -5382 12608 424 -12015 6352 10149 -11368 -4705 13370 -1519
870a519j1277J8698J507j6624O768J1221j2283k974J4663n485j1728J1872O036
$$ -1519 -12796 5902 7409 -9215 -2447 8774 -3509 -6483 8180 2695 -9033 2839 8875
883H875j5661K295J4904j0715r927J5030L243j6134K690J3148o966q151R322J703
$$ 8875 -6786 -4491 10413 -302 -10229 4801 8044 -8090 -5400 7748 782 -7369 1953 3656
897C656q409M390N298p830J41Q465n405m853P966J631j0321K722R520o433p272
$$ 3656 -4753 -363 4935 -2895 -2754 5711 306 -4547 3419 5050 -5271 -2549 6971 538 -6734
912f734P853L387p595P87M984l834r35L948j777k065L501j18m021L183M013o424
$$ -6734 1119 4506 -3089 -2302 2682 -1152 -2087 1861 84 -1981 1520 1402 -2619 564 4577 -1847
928a847k308Q248p0q249K085N884l240l031K318M11r26Q96k52j545J793J601l601
$$ -1847 -4155 4093 4023 -4226 -2141 3743 503 -2528 -210 201 -725 171 -81 -1626 167 1768 -1833
945a833J19N161k750l696L647K623l744j174K804M34k107n13J121J04l17j083
$$ -1833 -1714 3447 697 -2999 648 3271 -473 -1647 1157 1591 -516 -1029 92 196 -121 -1204
961a204Q9L019r72m244K224M321k982k985K941J897j738l87r4o89J431J463l421
$$ -1204 -1115 1904 932 -3312 -1088 3233 251 -2734 207 2104 366 -21 -115 -804 627 2090 -1331
978a331q17M964k063n340N068L475p215r00P971j607p190M336M879n305j163O119
$$ -1331 -2148 2816 753 -4587 481 3956 -3259 -4159 3812 2205 -4985 -649 4230 -1075 -2238 3881
994C881l137m184O048k2o647M433M757q465j247J0241l004j0984O877R112r815
$$ 3881 744 -3440 2608 2586 -4061 372 5129 -3336 -4583 5658 2654 -8330 -1453 7659 -2156
1009b156m155J0508j578p882O559L702q852J945Q302o566n106R256n1j0487O174
$$ -2156 -6311 4197 2619 -5263 1296 4998 -3854 -1909 6393 -173 -5279 3977 3926 -6561 -387
1024c87Q269j1703l833J4508k885j2948P914Q719j0973k359J1561l702q691R101
$$ -387 7882 -3821 -7654 6854 3969 -8979 -1065 7654 -3319 -5678 5883 2181 -6510 2591
1038B591K472j0627M657R262j1499m719J5707k852j5165R540J0855j4598l933
$$ 2591 5063 -5564 -907 8355 -3144 -7863 7844 4992 -10173 -633 10222 -4376 -8309
1051h309J6006m416j3553J2026P513j5681J138J4782r702q354J4958L9j6432R634
$$ -8309 7697 3281 -10272 1754 9267 -6414 -5276 9506 -196 -8550 6408 6447 -9985 -351
1065c51J2572j6995o404K1074l020k0197J2518J3160j8914l335J9674o234j5208
$$ -351 12221 -4774 -11178 9896 6876 -13321 -803 12357 -6557 -9892 9782 3548 -11660
1078a1660J4691O557j8054L180J7367j3260j0828K1120O48k2576R293J7913j8305
$$ -11660 3031 9588 -8466 -5286 12081 -1179 -12007 9113 9761 -12815 -3522 14391 -3914
1091c914q489K2472k416k1610J1749J5378j9416m248K1575p207j6343J6966N637
$$ -3914 -12403 10069 7653 -13957 -2208 13170 -6246 -10494 11081 3874 -12469 4497 10134
1104A0134k1184O381K0295j6450j3074K2709J288k4103J0258J9531j9855q852
$$ 10134 -11050 -4669 15626 -824 -13898 8811 10099 -14004 -3746 15785 -4070 -12922
1116a2922K3833m516k1630J5023J3076k0327J97K0658j2831j5683K1540N485k4942
$$ -12922 10911 6395 -15235 -212 12864 -7463 -7266 13392 561 -15122 6418 11903 -13039
1129a3039Q813K1830k0538j3101K6309o29k5352J3510J9356k2505q824K4854n782
$$ -13039 -4226 17604 -2934 -16035 10274 9645 -15707 -2197 17159 -5346 -14170 10684 4902
1142D902k0276J8550J2246k5825J076K5206j6015j7598K6679O303k8849P482K4253
$$ 4902 -15374 3176 15422 -10403 -9327 15879 -136 -17734 8945 15248 -13601 -6119 18134
1155A8134k1686j5264K9919K453k8908J2249J9976k4665p189K8308o500k2736
$$ 18134 -3552 -18816 11103 13556 -15352 -3103 16873 -7792 -14981 13327 6827 -15909
1167a5909K0099J1443k8912J225K9185j4757j9410K7117N759l2326P370K6748
$$ -15909 4190 15633 -13279 -12054 17131 2374 -17036 10081 15840 -16486 -9116 17632
1179A7632j9053j4082K7003j58k7812J2314J8879k2469m385K8103r266k4211K0061
$$ 17632 -1421 -15503 11500 11342 -16470 -4156 14723 -7746 -12131 15972 6706 -17505 2556
1192B556J1323k7733N206K9501j7812k1341K5348N986k9170Q968K6689j9997j4327
$$ 2556 13879 -13854 -8648 20853 3041 -18300 7048 13034 -16136 -7168 19521 -476 -14803
1205a4803K5779l976k6502J8378J9646k5997l841K7744j3712k4504K6140J4038
$$ -14803 10976 7000 -19502 -1124 18522 -7475 -11316 16428 2716 -21788 4352 18390
1217A8390l0047L061K9281k0598k1734K8492P544k8519J0682K3671k4984j3865
$$ 18390 -11657 -8596 20685 87 -21647 6845 14389 -14130 -3448 20223 -4761 -18626
1229a8626K8439j824k4739J9625J7163l0607m669L1182j2111k4031K6977J4123
$$ -18626 9813 7989 -16750 2875 20038 -10569 -15238 15944 3833 -20198 6779 20902
1241B0902l2447l54K7589j6108j8232K8062O735k9426P164K1750k2777r759L0351
$$ 20902 -11545 -11899 15690 -418 -18650 9412 16147 -13279 -6115 15635 -7142 -16901 13450
1254A3450l018k6119J6815J5381k8474l610L2006q299k4425K1536J0894l0210
$$ 13450 10432 -15687 1128 16509 -11965 -15575 16431 8132 -16293 5243 16137 -14073
1266a4073K064K8390j3907j6387K3656J414k7481J0467K1019k1054o838K8756
$$ -14073 -12009 16381 2474 -13913 9743 11157 -16324 -5857 15162 -5892 -12730 16026
1278A6026p390k8231J8393J7171k5707m68K8478j2850k3398K1383R756k5740N706
$$ 16026 8636 -19595 -1202 15969 -9738 -10206 18272 5422 -17976 3407 13163 -12577 -6871
1291f871K4880j7163j6196K3562m73k4975J5310K0872k4174q998K7132o648k5220
$$ -6871 18009 846 -15350 8212 7739 -17236 -1926 18946 -5228 -14226 12906 6258 -18962
1304a8962J9556J7792k5521l981K5967j1574k0982K1366J0636k4616M736K1878
$$ -18962 594 18386 -7135 -11116 14851 3277 -17705 3661 14297 -10319 -5583 16295
1316A6295j8856j4551K5054K961k4722J1582J9310k2913r393K6454l395k3324
$$ 16295 -2561 -17112 7942 10903 -13819 -2237 17073 -5840 -15233 11221 7826 -15498
1328a5498J6807J5420k3461m721K2568p737j6315J8523O431k2889M752J8980j5930
$$ -15498 1309 16729 -6732 -11453 11115 3378 -12937 5586 12017 -10872 -6120 12860 -3070
1341c070j1145K3604K38k2904J0697J6243j9500o261K3309l608j9562J2997J0489
$$ -3070 -14215 9389 9627 -13277 -2580 13663 -5837 -12098 11211 7603 -11959 1038 11527
1354A1527j9375K67J9502j0217j3025J7068K908k0075P179J6902j5501r010K1302
$$ 11527 -7848 -7581 11921 1704 -11321 5747 8655 -11420 -4241 12661 -2840 -11850 9452
1367I452j720k1511J1189J5915j7443n400J9487n136j6481J3557Q226j7823J677
$$ 9452 7732 -13779 -2590 13325 -4118 -9518 9969 4833 -11648 1909 10135 -7688 -6011
1380f011J8008j1282j2589J7233L133j9855P565J7151j5494r868J9034N5j8109
$$ -6011 11997 715 -11874 5359 8492 -11363 -3798 13353 -2141 -12009 7025 7080 -11029
1393a1029Q823J3474j4541n002J6571m208j4024J1571P542j5899K156J4162r836
$$ -11029 -2206 11268 -3273 -8275 8296 4088 -9936 1635 9177 -6722 -4566 9596 -240
1406b40j0273J4899L693j6792M316J4255j0614q520J3959Q76j3052O957Q574j0910
$$ -240 -10513 4386 8079 -8713 -4397 9858 -756 -9276 4683 5559 -7493 -536 8038 -2872
1420b872k766J1750l836r337R407L947j2343K451J1632r017p551J2336K002j2743
$$ -2872 -5638 6112 2276 -7061 2346 6293 -6050 -3599 8033 -984 -8535 3801 5803 -6940
1434f940M425R459q499m269J0608j465r260O466N600j0175P40J0130o806o786
$$ -6940 -2515 6944 -1555 -5824 4784 3319 -5941 525 6125 -4050 -3310 6820 14 -6772
1448f772J0546J974j2122L042J0528p711o193J0157J301j1024M359Q139p709l717
$$ -6772 3774 5748 -6374 -3332 7196 -515 -6708 3449 4750 -6274 -1915 6224 -1485 -5202
1462e202R550j842p568O463L517q507M21R076n023p188P985L530r375N48Q578
$$ -5202 4348 2506 -5062 1401 4918 -3589 -3168 5908 885 -6303 1682 5212 -4163 -3615 4963
1477D963m641n343O489J927o177R77N322l664k313M771q17m815M049K445n380
$$ 4963 322 -5021 1468 3395 -2782 -1805 3517 -147 -2460 2311 1494 -3321 728 3173 -2207
1492b207j3N481k878l699L728K179m599k69M310j708k075J945O87k085K016M08
$$ -2207 -2220 3261 383 -3316 412 2591 -2008 -2277 2033 325 -1750 195 882 -1203 813 1221
1508A221k923J231K909k551j871L289K01l491J547K912l028j925L193L37k283
$$ 1221 -1702 -471 2438 -113 -1984 1305 1506 -1985 -438 2474 -554 -2479 714 1051 -1232
1523a232J225O48j437P16J196j589q11K482L86k940Q40K574k082j638K413R60
$$ -1232 -7 641 -796 -80 1116 -473 -1284 1198 1584 -1356 -516 2058 -24 -1662 751 1711
1539A711k464l20J425M92j218o81Q15N64n38k24L63M36l42L9M92k1p56O93l77
$$ 1711 -753 -1073 352 844 -374 -1055 -240 324 -214 -438 -75 361 19 58 550 529 -227 466 89
1558H9o44J086N6j836Q29K388k251k540L331J745l953n23M424j193l872L434J936
$$ 89 -555 531 587 -1249 -420 1968 -283 -2823 508 2253 -1700 -2223 2201 1008 -2864 570 2506
1575B506l571o37L867j561k541L239J65l967J902L941m487k119N480o36n160K862
$$ 2506 -1065 -1702 2165 604 -1937 1302 1467 -2500 -598 3343 -1144 -3263 2217 1581 -3579 -717
1591g17M104m780k021N729j10n301K463L733m082n76M042k614k359M814l97n040
$$ -717 3387 -1393 -3414 2315 2205 -3096 -633 3100 -982 -1558 2484 -130 -2489 2325 1928 -3112
1607c112K419M182m753k256N921l65o458M016M476n847j240O451k268m508M954
$$ -3112 -693 3489 -1264 -3520 2401 2036 -4422 -406 4070 -1777 -3017 3434 1166 -3342 1612
1622A612J412o259K473N380n781l061P502o07q092N462N673q551k476J0069k540
$$ 1612 3024 -3235 -762 4618 -1163 -4224 3278 2671 -5421 41 5714 -2837 -5313 4756 2216
1637B216p718N406N060p898l40Q355m434n959Q056K365j0030L034Q284p559m653
$$ 2216 -5502 -96 4964 -2934 -3274 5081 647 -5312 2744 5109 -4921 -1887 6397 -1162 -5815
1652e815J0281n66j0798N399Q446r238m116J1059j073r582O492N401r513N4R811
$$ -5815 4466 3900 -6898 -1499 6947 -2291 -6407 4652 3579 -6003 489 5890 -3623 -3569 6242
1667F242n175p373R345K276j1280L571J0002q319o663J1507P33j1728N269Q114
$$ 6242 1067 -6306 3039 5315 -5965 -2394 7608 -711 -7374 4133 4866 -6862 -1593 6521
1681F521q627l484J0823k647r232P882M664j0056R72J0210p203o870J1209R53
$$ 6521 -2106 -5590 5233 2586 -6646 1236 5900 -4156 -3184 7026 -177 -7047 4162 5115
1695E115j2382M954J0436r613n851J1738l41j1249O754P804j0969j693J1758n052
$$ 5115 -7267 -2313 8123 -1490 -7341 4397 4056 -7193 -439 7365 -3604 -5297 6461 1409
1709A409r332J0774M016j2739K756J1852r117q619J3639K500j4680N078J1173
$$ 1409 -7923 2851 6867 -5872 -3116 8736 -381 -9000 4639 7139 -7541 -2463 8710
1722H710j1386n798J4485j541j2288P701Q253j2316k264J3823n098j0838J1979
$$ 8710 -2676 -8474 6011 4470 -7818 -117 8136 -4180 -6444 7379 2281 -8557 3422
1735C422N447j5928J699J4583q763r376J3873K285j4904L987J1709r971n998J4171
$$ 3422 8869 -7059 -5360 9223 460 -8916 4957 7242 -7662 -3675 8034 -1937 -7935 6236
1749F236j187j2785P201P975j2528p54J4514n911j1170J0842M987j4445K286J3640
$$ 6236 5049 -7736 -535 7440 -5088 -5842 8672 2761 -8409 2433 7420 -7025 -4739 8901
1763H901q006r113J2527J158j3834N192J1476j0126m092J2576m165j1905J0170
$$ 8901 895 -8218 4309 5467 -8367 -3175 8301 -1825 -5917 6659 2494 -9411 759
1776G59P520j3203K52J4059p963j1772J2956M583j4365L963J3621j1095q936J3609
$$ 759 8279 -4924 -4672 9387 1424 -10348 2608 7191 -7174 -3211 10410 -685 -9621 3988
1790C988J042j3472Q079J0228j3387m400J4855m417j2473J2483P967j5757r52
$$ 3988 5030 -8442 -363 9865 -3522 -7922 6933 2516 -9957 2526 10493 -5264 -6216
1803f216J5051p849j1670J4146O273j5740J375J2974j0029p686J4307J442j4394
$$ -6216 8835 986 -10684 3462 9735 -6005 -4630 8344 -1685 -9371 4936 6378 -8016
1816h016P233R942j3491m253J5544k377j2858J0198P716j5734j452J5316n589
$$ -8016 -783 9159 -4332 -8585 6959 4582 -8276 1922 9638 -6096 -7548 7768 2179
1829B179j0419J1419M421j4433J911J1825q250n617J3343j045j3826O782R293
$$ 2179 -8240 3179 7600 -6833 -4922 6903 -1347 -6964 6379 5334 -8492 -1710 7583
1842G583j1992j837J4874m486j3197R813O632j3225P30J4206o979r866J1050J908
$$ 7583 -4409 -6246 8628 4142 -9055 758 7390 -5835 -5105 9101 2122 -7744 3306 5214
1856E214j3494N410J2014j0441n466J2654k453j3392R430R788j2609k682J4034
$$ 5214 -8280 -2870 9144 -1297 -6763 5891 3438 -9954 -524 9264 -3345 -6027 8007
1869H007n101j2613J0532P012j2692J286J2090q635q973J1897L023j2635M890
$$ 8007 2906 -9707 825 7837 -4855 -3569 8521 -114 -9087 2810 5833 -6802 -1912
1882a912J0938j1300o314J3761p91j2767Q327R787j2668m299J3179l067j0681
$$ -1912 9026 -2274 -8588 5173 4382 -8385 -58 9729 -2939 -7238 5941 2874 -7807
1895g807R499O513j3000Q5J1139o609p581J1526K286j2414M513R337r934m945
$$ -7807 1692 8205 -4795 -4710 6429 -180 -7761 3765 6051 -6363 -1850 7487 -2447 -7392
1909g392J2589k8j1634O078P639j0828k080J1660l332q977Q391L556j0758J279
$$ -7392 5197 5169 -6465 -387 7252 -3576 -5656 6004 2672 -6305 2086 5642 -5116 -3837
1923c837R757o525n692J0648L09j1791N031R309r316l560J1185j945j0212O453
$$ -3837 5920 -605 -6297 4351 4660 -7131 -2100 7209 -2107 -5667 5518 3573 -6639 -186
1937a86O233r205r38R844m307p910Q615K687j0464L074R672p816o256J0618Q77
$$ -186 6047 -3158 -4096 5748 1441 -6469 2146 4833 -5631 -2557 7115 -701 -6957 3661 4538
1952D538j1151M944Q754q811l965J0372j097r805O213O152q806j078R017m393
$$ 4538 -6613 -1669 7085 -1726 -5691 4681 3584 -6221 -8 6144 -2662 -3740 5277 884
1966H84p266Q402K888r408J996Q444o412n741R340J022q975L494O986o595l702
$$ 884 -6382 2020 4908 -4500 -2504 5940 -472 -6213 3127 4149 -4826 -1332 5654 -941 -4643
1981d643P700p82o480M753M036p276l23P354m051n173O929J769p907K089O768
$$ -4643 3057 2275 -4205 548 4584 -2692 -3015 4339 288 -4885 2044 3813 -4094 -2005 4763
1996D763n517m016P318Q72p205K824N034n411j424O044k054n568N607K555o845
$$ 4763 -754 -4770 2548 3420 -3785 -961 4073 -1338 -2762 3282 1228 -4340 1267 3822 -3023
2011c023M91O513l919m263O104J728p298J752O084m732l247O436m10n484K923
$$ -3023 -2532 3981 62 -4201 1903 3631 -3667 -1915 4169 -563 -3810 2626 2216 -3268 -345
2026c45L954n162r54N545j877n095M567K940o298L74O124l502m480N474J668n457
$$ -345 3609 -1553 -2507 3038 1161 -3934 633 3573 -2725 -2351 3773 271 -4209 1265 2933 -2524
2042b524P45M545k735k585M250o7m208K350L004l827r19M250j793l162L459J591
$$ -2524 -1779 2766 31 -2554 1696 1629 -2579 -229 2775 -1052 -1971 2279 486 -2676 783 2374
2058B374m183lL707j186l320K829J585l107N01K418j745j092K271m17k075J806
$$ 2374 -1809 -1812 1895 709 -2611 218 1803 -1304 -803 1615 -130 -1222 1049 632 -1443 363
2074C63J231k888j62L548j771k714K991J226l107L12K232j267j105J565N48k251
$$ 363 1594 -1294 -1456 2092 321 -2393 598 1824 -1283 -971 1261 -6 -1111 454 1002 -1249
2090a249Q50J624j570k24J877j290j457J972Q95k318k64K508p52j800R42J225
$$ -1249 -399 1225 -345 -569 1308 18 -1439 533 1428 -890 -1154 1354 602 -1198 -256 969
2106I69j631m09J719m44q11O08O08j066R40J55q45M2P37k58j079O19Q45q12k55
$$ 969 -662 -1071 648 204 -607 1 609 -457 483 638 -207 -165 572 314 -765 -146 699 -113 -368
2125c68N59J05o26r8M77J21m07k74J095j87m37l82Q17r5Ql33Q5j77n3M55l32o23
$$ -368 191 296 -330 -428 49 170 -237 -511 584 397 -40 -422 395 300 308 -25 60 -117 -170 285 -47 -670
2147f70J000k27r51J015P92j796l17J924p2j581O25J441j076j044J598p9j263
$$ -670 330 103 -848 167 959 -837 -1154 770 698 -883 -258 1183 107 -937 661 582 -681
2164f81Q66M07j207K34R51q62o87J626r9k118J233J823j628j319K278k62j677
$$ -681 185 592 -615 -381 570 -292 -979 647 548 -1570 -337 1486 -142 -1461 817 555 -1122
2181a122J136J230j807q6J693p92j416J744L28k538J636J767k553j379L555n19
$$ -1122 14 1244 -563 -649 1044 252 -1164 580 908 -1630 6 1773 -780 -2159 1396 877
2197H77k886J637K540k782j252L478o09k963K427J306l185N56L102k339k198L746
$$ 877 -2009 -372 2168 -614 -1866 1612 1003 -1960 467 1773 -1412 -856 2246 -93 -2291 1455
2213A455L48m341J581L934l774k116M772j52m302K263L126l552j402M135r80l372
$$ 1455 1803 -2538 -957 2977 -797 -2913 1859 1707 -2595 -332 2794 -758 -2160 1975 995 -2377
2229b377K790J976m010M09L969k722l301M756R06n036J483M190l671k568N102
$$ -2377 413 2389 -1621 -1212 2757 35 -3266 1490 2396 -2640 -1157 3033 -638 -3206 1896
2244A896Q3m673K108L512l573j325M550j725l554L881J598m919O28M697l076l480
$$ 1896 1979 -2694 -586 2926 -647 -1972 2578 853 -2701 1180 2778 -2141 -1513 3184 108 -3372
2260c372M887R41n558J840M572m186k489N352j40n057L394L080n135k70N491k737
$$ -3372 1515 2456 -3102 -1262 3310 -876 -3365 1987 1847 -3210 184 3264 -1871 -2141 3350 613
2276F13m476N079K027n710M31N824m063l816N801J240o346K215N060m887k335
$$ 613 -3863 1216 3243 -2467 -2036 3788 -275 -4091 1710 2950 -3396 -1181 3879 -1008 -3343
2291c343O071q28n420L963L688o303n59O468l040m895N879K398p197Q46O435m084
$$ -3343 2728 1900 -3520 443 4131 -2172 -2731 3737 697 -4198 1681 4079 -3118 -2272 4163 79
2307G9m432O186J349o576J981N173n071k383O952j248n696M067L481o271m55O829
$$ 79 -4353 1833 3182 -3394 -1413 3760 -1311 -3694 3258 2010 -3686 381 3862 -2409 -2864 3965
2323C965k707n754N680K531o943O64O408l908l632O087J29o280K778N043n033
$$ 3965 1258 -4496 1184 3715 -3228 -2564 3844 -64 -3696 2391 2520 -3760 -982 4061 -972
2338i72k002O436j708o196M758L704o660l34P351l461n648N588K776p099J405
$$ -972 -2974 3462 1754 -4442 316 4020 -2640 -2974 4377 916 -4732 856 3632 -3467 -2062
2353b062O830m525m569O489M00p012M102N291o435k000P142j872o744N470M523
$$ -2062 4768 243 -4326 2163 2563 -4449 -347 4944 -1491 -3491 3651 1779 -4965 505 5028
2368E028p267r92P361l784n451O387K356o780J531N961m934l638O519P05o950
$$ 5028 -2239 -3231 4130 346 -5105 1282 3638 -3142 -1611 4350 -584 -4222 2297 3002 -3948
2383c948L966M930o819k267P679j594o152N092L660p223r88P473l445m838O058
$$ -3948 18 4948 -1871 -4138 3541 1947 -4205 887 4547 -2676 -3664 3809 364 -4474 1584
2398A584K576p474J420N797n134k759P381L2p299L246M709o183j801P573j359
$$ 1584 4160 -3314 -1894 3903 -1231 -3990 3391 3423 -3876 -630 4079 -2104 -3905 3668 2309
2413B309o435M654K976o749K79P035l173m765N557J471p338K632O247n423l129
$$ 2309 -4126 528 3504 -3245 -2966 4069 896 -3869 1688 3159 -4179 -1547 4700 -723 -3852
2428c852P452o26p526L932N210o137j712P343k141o783N217L038o078M15O428
$$ -3852 3600 2974 -4552 -620 4590 -1547 -3259 4084 1943 -4840 377 3415 -2663 -2248 4180
2443D180l839n000O367J286p142K834O330n459l541O489j56o714L843N264n894
$$ 4180 341 -4659 1708 2994 -4148 -1314 5016 -443 -3984 2505 2349 -4365 -522 4742 -1152
2458a152k209O210j689n677N070L372o314N26N623l893m221O046K024o779K160
$$ -1152 -3361 2849 1160 -4517 553 3925 -2389 -1863 3760 -133 -4354 1692 3716 -3063 -903
2473i03N300n486k778O398j7o113L409M333n803j716O530k122n041N058K453o550
$$ -903 4397 -1089 -3867 2531 2514 -3599 -190 4143 -1660 -3376 3154 1032 -4009 1049 3502 -3048
2489c048Q48N874l993l474O136Q57o679J808N473m480k716N800P4n446K581L730
$$ -3048 -2200 3674 -319 -3793 2343 3200 -3479 -1671 3802 -678 -3394 2406 2480 -2966 -385 3345
2505C345n532o50O089j972m817M456K106n993R51N815l349m045N463R02n723J587
$$ 3345 -2187 -2837 3252 1280 -3537 919 3025 -2968 -2017 3798 449 -3596 1867 2769 -2954 -1367
2521a367M942m205k139N053n76n171L247L100m305r74N280k265m217M644K044
$$ -1367 3575 -630 -2769 2284 1708 -3463 -216 2884 -1421 -2395 2885 620 -3597 1047 3091
2536C091n632P45N419l223l693M693Q51m753J832L798l693k294N039p00m645L146
$$ 3091 -2541 -1796 3623 400 -3293 1400 2251 -2502 -670 3128 -565 -2859 2180 1480 -3165 -19
2552a9K661m451l59M947k213l578L864J897m595K55M696k964k849M212N37m067
$$ -19 2642 -1809 -2168 2779 566 -3012 852 2749 -1846 -1591 3105 141 -2708 1504 2041 -2026
2568b026J405L296l432j502M185q16l673K924K176m284l75M345j205l585L196
$$ -2026 -621 2675 -757 -2259 1926 1110 -2563 361 2537 -1747 -2122 2223 1018 -2567 629
2583F29J386l683M71L377k105k463L668L46l519J409K719l065j143L828j015l353
$$ 629 2015 -1668 -1197 2180 75 -2388 1280 1626 -1893 -484 2235 -830 -1973 1855 840 -2513
2599b513K620J769l140m21L389r95k793K539J438k989j5K985j788j681L030m54
$$ -2513 107 1876 -1264 -1685 1704 709 -2084 455 1893 -1096 -1111 1874 86 -1595 1435 981
2615I81k773J487K262k804r52L156n46k824J966J982k958J26K492j233j939J894
$$ 981 -1792 -305 1957 -847 -1799 1357 811 -2013 -47 1935 -1023 -897 1595 362 -1577 317
2631C17R39k377N39K113j946r62K315J11k399J073J620j962p95K478l08k262J712
$$ 317 1256 -1121 -582 1531 -415 -1377 938 1049 -1350 -277 1343 -619 -1414 1064 756 -1506 206
2648B06J040j614n76J797l29j709J576Q22k037O20J261j230o83J664k8j882Q18
$$ 206 1246 -368 -944 853 524 -1185 391 1213 -824 -204 1057 -173 -856 808 780 -1102 -284
2665b84J143j077o80J451M44j699O44O31r94RQ06n61m53J041M71j317L49Q38j083
$$ -284 859 -218 -898 553 997 -702 -58 573 -421 -412 394 -167 -620 421 892 -425 -76 762 -321
2684c21m82J219j35r11J09R09m10m74O16n0j94J33K35q38N86L44n45p7O25Lq04
$$ -321 -803 416 281 -630 -521 388 -22 -496 120 70 -124 9 244 -594 -8 336 -209 -286 339 342 -462
2705d62M00L67l55m85O97K50o81j91M86J47j18m4k88K91O1l6O0J17j99j48l4L16
$$ -462 -62 305 -50 -535 162 412 -269 -460 26 173 55 11 -277 14 75 39 99 216 17 -131 -165 151
2727A51o8r7p0k54N61k12n13J25N35k53l73J031l32p00O49L51m06q71J103n5o26
$$ 151 83 -14 -84 -338 223 11 -502 -377 158 -95 -468 563 231 -469 180 531 125 -746 357 302 -324
2748c24L77K14n58j31R52o96n80Q52L29j177P21Q01q32r18J377K70j360K29J085
$$ -324 53 267 -291 -422 530 -166 -746 106 435 -742 -21 780 -52 -970 407 677 -683 -454 631
2767F31l09q46P66J98j399J234Q7r71Q6J310m39j520J399N57j504L05J510q66
$$ 631 322 -524 242 440 -959 275 362 -609 -523 787 348 -1172 227 784 -720 -415 1095 229
2785B29j188J373K43j286L05J232j069n39J680l73j625J191Q01j723j96K136r66
$$ 229 -959 414 657 -629 -324 908 -161 -700 980 607 -1018 173 974 -749 -945 1191 225
2802B25j977K187Q34k049j74K436j249j480J739N86j913N93J851j978q39K076
$$ 225 -1752 435 1269 -780 -954 1482 233 -1247 492 1078 -835 -242 1609 -369 -1208 868
2818H68l43k097J451J556k053l18K256r16k276K214R16k557M78K368j452j502
$$ 868 525 -1572 -121 1435 -618 -936 1320 404 -1872 342 1258 -1299 -821 1547 95 -1407
2834a407J768P52k439J045J742k104r54L200q51k703J903J721k597m79K704q18
$$ -1407 361 1113 -1326 -281 1461 -643 -1597 1603 752 -1951 -48 1673 -924 -1403 1301 483
2850D83k314K296J303k844P2K896j640k062K796L72l036J440K099k531o61K558
$$ 483 -1831 465 1768 -1076 -1004 1892 252 -1810 986 1358 -1678 -238 1861 -670 -1331 1227
2866A227m62k829J907K547l288l00L062j448k425K535J602l505N40K662k166j748
$$ 1227 765 -2064 -157 2390 -898 -1198 1864 416 -2009 526 2128 -1377 -837 1825 -341 -2089
2882b089L470j53l171J775K141k908q17L210m85l184K155J985l277k37L475j429
$$ -2089 1381 1228 -1943 -168 1973 -935 -1752 1458 973 -2211 -56 1929 -1348 -1585 1890 461
2898D61k320K575J284l645P15L088k473j942L341N03l613J322K988k942j316L631
$$ 461 -1859 716 2000 -1645 -930 2158 -315 -2257 1084 1587 -2026 -704 2284 -658 -1974 1657
2914A657m93l093J820K300l579l76L500j609k275K780J201l518P06L296k503j940
$$ 1657 1164 -1929 -109 2191 -1388 -1764 1736 127 -2148 632 1833 -1685 -979 2317 -186 -2126
2930b126L595Q4m015J682L040k941j036L693r07l331K527J713l072j38L441j754
$$ -2126 1469 1553 -2462 -780 2260 -681 -1717 1976 1069 -2262 265 1978 -1094 -1232 2209 455
2946D55k771L455O32l763J149L294k710j773L591J11l857J678L019k922j374L422
$$ 455 -2316 1139 1771 -1992 -843 2451 -259 -2032 1559 1670 -2187 -509 2510 -412 -1786 1636
2962A636o96l428K993J804l537j17L651k488k537L802J209m101R15L392l099k119
$$ 1636 940 -2488 505 2309 -1228 -1345 2306 -182 -2719 1083 2292 -1809 -894 2498 -601 -2720
2978b720M034R7l542J826K652l321j118L875p56l342K975J814l924j56M022k592
$$ -2720 1314 1411 -2131 -305 2347 -974 -2092 1783 1027 -2315 660 2474 -1450 -1606 2416 -176
2994a76k280L587R27l847K92L424k142j977L605J41l730J973K211l075o56L911
$$ -176 -2456 1131 2058 -1789 -1497 1927 -215 -2192 1413 1554 -2176 -203 2008 -1067 -1723 2188
3010B188j153l196K489J688l779L70L590j247l312L209O40l638J206L091k192
$$ 2188 1035 -2161 328 2016 -1763 -1393 2197 950 -2362 847 1487 -2151 -945 2146 -46
3025d6j808L649n60l329J662K357k857k71L393j168l536K636K195l815L15L388
$$ -46 -1854 1795 1235 -2094 -432 1925 -932 -1203 2190 1022 -2514 122 2317 -1498 -1183 2205
3041B205j736k835L054R20l646J148L485l046j468L605o30l051J872K752l119
$$ 2205 469 -2366 688 1608 -2038 -890 2595 -451 -1919 1686 1056 -1995 -123 2629 -490
3056d90j349L577p43l384K665K042l775J99L050j723k522L245Q32l312J179K230
$$ -490 -1839 1738 995 -2389 276 2318 -1457 -1258 1792 69 -2453 792 1624 -1688 -509 1721
3072A721k530j194L723j17l504K170J797k865r28L499q50k724K033J438k908l9
$$ 1721 -809 -2003 1720 1603 -1901 269 2066 -799 -1727 1772 922 -1802 231 1669 -1239 -1278
3088a278K708j371j889K879K27k925J187K534k804q68L126m27l067J897J630k521
$$ -1278 1430 59 -1830 1049 1276 -1649 -462 2072 -732 -1600 1526 1099 -1968 -71 1559 -962
3104i62m52L069p49k599K097J089l018P23K788k063j484K372L08k807J282K145
$$ -962 -1414 1655 906 -1693 404 1493 -1525 -802 1986 -77 -1561 811 1119 -1688 -406 1739
3120A739k149j023K936n78k822K238J348k441m93K774r35k130K010P25k383M27
$$ 1739 -410 -1433 1503 925 -1897 341 1689 -752 -1245 1529 594 -1536 474 1199 -1184 -757
3136g57K231j492j765K614K76k515R91K083k140p61K282j74k337J215J627j938
$$ -757 1474 -18 -1783 831 1107 -1408 -417 1666 -474 -1235 1047 873 -1464 -249 1378 -560
3152e60n22K369j113j665J823J004k248L69J915j700j082K254P7j889P08J731
$$ -560 -1082 1287 174 -1491 332 1336 -912 -543 1372 -328 -1410 844 921 -968 -260 1471
3168A471j732r29K027o6j868J282Q89j792r1J800q75j253J629M33j800O32J513
$$ 1471 -261 -1190 837 771 -1097 185 1074 -718 -809 991 116 -1137 492 925 -875 -243 1270
3185A270j384j093J765K83j740O91J465j605o87J710k26j579R51J103j523j11
$$ 1270 -114 -1207 558 841 -899 -208 1257 -348 -1035 675 449 -1130 -179 924 -599 -710
3201g10J723j152r88J353P62j790K67J647q90j013J058N99j681N13J149r08p86
$$ -710 1013 -139 -1127 226 988 -802 -535 1112 222 -791 267 866 -815 -302 847 -61 -847
3218h47J164J2j091P48P77j335j49J329l07j050J004O11r60k66J110l66j081J099
$$ -847 317 329 -762 -14 763 -572 -721 608 301 -749 255 866 -94 -360 750 384 -697 402
3236D02J35j088N35N51r25q8Q37j73q50P92L81r46P4R43l11q06O19L16r30R0P24
$$ 402 537 -551 -16 535 -390 -478 359 186 -664 128 509 -437 -363 580 269 -537 82 398 -532 -442 282
3257B82n43l18M82K65n06L36K28o46K65N91l38p33N81L94n18J8L62K16o84L58
$$ 282 -261 -579 -97 168 -338 -2 226 -420 -155 436 98 -635 -54 340 -178 -160 202 418 -266 92
3277I2J25k64j75L77J7o36M46r2o1J38K04k94l19L22L04m90K09L81l36L1P0L32
$$ 92 217 -47 -222 155 172 -464 -18 -110 -171 -33 171 -123 -442 -120 184 -306 -97 284 -52 -21 49 381
3299C81l85J7k29L68j34J00j9j66R8j83L39j85n0K73j67l12M78j49l18K50J53
$$ 381 -4 13 -216 152 18 118 99 -67 31 -152 187 2 -48 225 58 -254 224 75 -243 7 160
3320A60l3l09l1N51j61m14N43l5n58pK06Q5J24o7o1m69N94l26m7J93kJ05l62P31
$$ 160 127 -182 -213 338 177 -237 306 271 -287 -294 -88 -3 121 54 -7 -476 118 -208 -255 -62 -64 41 -321 410
3344D10j44p22L69J89j56j12P45l85n35M89Jk04k86N26k17m15R76j30p35L88P68
$$ 410 266 -456 -87 102 -54 -166 579 194 -341 148 149 -55 -341 185 -32 -447 529 399 -336 52 820
3365H20j061n7Q63n92n06O91L85o36l33P69k99n56M48M65q90k3J442r40m76P46
$$ 820 -241 -298 565 -27 -533 158 543 -93 -426 343 44 -512 -64 401 -489 -512 930 -10 -486 260
3385B60K24j005J24J047m30o44J099l90j042N23Q25q20k52J136m08p67O23N56
$$ 260 484 -521 -397 650 220 -424 675 285 -757 -234 591 -229 -481 655 247 -520 103 659
3403F59j017O6J103r06r48J531K47j327J37J425r97q86J461R7j215N78M01q03
$$ 659 -358 -292 811 -95 -1043 488 735 -592 -455 970 -27 -913 548 645 -570 8 409 -394
3421c94j77J263n71j108J084O31j208r6J474r04j194J609L24j438L72J353j062
$$ -394 -571 692 121 -987 97 728 -480 -576 898 -6 -1200 409 733 -705 -333 1020 -42
3438d2o94J284k67j197Q29R12j136m16J606r26r31J348N79j597l5J642r89q95
$$ -42 -736 548 281 -916 -87 825 -311 -727 879 -47 -978 370 949 -648 -683 959 -30 -925
3456i25J398L78j481J59J439r68j081J820k58j630J256R77j762OJ590p35j914
$$ -925 473 851 -630 -471 968 0 -1081 739 481 -1149 107 1084 -678 -672 918 183 -1731
3473a731J919Q49j838K84J423p46j177J501P10j798K64J202o17j281J494K8j747
$$ -1731 188 1037 -801 -517 906 160 -1017 484 1194 -604 -340 862 245 -1036 458 486 -1261
3490a261J435Q64j355p99K109o16j409J213Q50j505j71J814r67j027J241M25j645
$$ -1261 174 1038 -317 -1116 993 377 -1032 181 1031 -474 -645 1169 202 -825 416 841 -804
3507h04P10J189j405o84J914k55j517Q46J085j626m86J853l67j688J534O73j641
$$ -804 -94 1095 -310 -994 920 665 -852 -6 1079 -547 -1033 820 453 -1235 299 972 -669
3524f69k68K300j470r72J658j22j595P31J497j610o40K269k35k060J009J347j504
$$ -669 -937 1363 -107 -1079 579 457 -1138 -407 1090 -520 -1160 1109 874 -1186 -177 1170 -334
3541c34n70K287r03k021J635J193j946J92J747j281j476J862N53k207J016J721
$$ -334 -904 1383 480 -1541 94 1287 -659 -467 1280 -1 -1477 385 938 -1269 -253 1468
3557A468j410j405K052j61j620Q22J713j913o33K005n07j883J863M98j653M43
$$ 1468 58 -1347 705 544 -1076 -254 1459 -454 -1087 918 411 -1472 391 889 -764 -321
3573c21J461j052j270J750L44j789M03J574j411q28J732j30j909J486R82j361
$$ -321 1140 88 -1182 568 912 -877 -474 1100 -311 -1139 593 463 -1446 40 1022 -339
3589c39n63J940p70j487J601J009k110P1J752j040j169J985K62k334Q23J678j668
$$ -339 -902 1038 268 -1219 382 1391 -719 -648 1104 64 -1105 880 1142 -1192 -369 1309 -359
3606c59p59J874J78k086J411O10j566k07K057o03j811J683N69k035M26J817j018
$$ -359 -1118 756 934 -1152 259 869 -697 -904 1153 550 -1261 422 991 -1044 -618 1199 181
3623A81j363J899K29k051N56J708j298q71J962l00k181J449J339j703l79J962
$$ 181 -1182 717 946 -1105 -549 1159 -139 -1010 952 652 -1529 -80 1259 -444 -823 1139
3639A139p72j655J587Q97k238J36K173p34j932J866O9j451P54J428j669n21J664
$$ 1139 367 -1288 299 1196 -1042 -906 1267 533 -1399 467 536 -915 -161 1267 -402 -923 741
3656G41l30j368J111J089j736o5J472q43j166J360Q29j761n5J781j093j067J565
$$ 741 411 -957 154 1243 -493 -558 914 71 -1095 265 1094 -667 -722 1059 -34 -1101 464
3673D64J69j894R33J514j364r06J951l40j531J023J233j828n69K063p73j420J381
$$ 464 633 -1261 -328 1186 -178 -1084 867 527 -1004 19 1252 -576 -1145 918 145 -1275 106
3690A06O85j786J46J725r38j007J674K5j303L40R17j032n34K189q13j298Q24J225
$$ 106 791 -995 -849 876 -62 -1069 605 630 -673 -333 584 -448 -982 1207 394 -904 -80 1145
3708A145j861k13J825m08j517J484J34j082k04J541p70q36J382j31j361O37J252
$$ 1145 -716 -929 896 488 -1029 455 589 -493 -697 844 74 -762 620 489 -872 -235 1017
3725A017j432l59J297Mj590J084O95j204j27J520n13j121J030L22j376K87J352
$$ 1017 -415 -774 523 527 -1063 21 716 -488 -615 905 392 -729 301 623 -753 -466 886
3742H86r69r47J753k60j336P45J141j082m00Q97P5j602J402N62j257l22J477q09
$$ 886 -83 -1030 723 463 -873 -128 1013 -69 -469 428 503 -1099 303 865 -392 -714 763 -46
3760d6q30J160L12j044o6J394j153k72R48K36j441P67Q12o51o39J117m03q89O52
$$ -46 -876 284 596 -448 -514 880 -273 -545 403 639 -802 -35 777 126 -513 604 201 -688 -36
3779c6N16j147K98R27k34o87O97J91j281M17R13q09m28R06Lm87q8Q93q09l96J068
$$ -36 480 -667 -369 558 324 -363 334 525 -756 -339 574 -235 -663 243 246 -241 -329 564 -245 -641 427
3800D27M5j217P03O60q60l53J015N2j046N90L35m15j73P83n01n89O89J01n62k6
$$ 427 472 -745 -42 618 -242 -595 420 472 -574 16 351 -64 -237 546 45 -544 145 246 -316 -342
3820c42P98m56n51J005l97n31P88J92o90l3M62j51o18P01K12p10p5P40j83o67
$$ -342 456 0 -551 454 57 -474 314 506 -184 -217 245 94 -524 177 389 -321 -396 344 161 -506
3840e06M39K7l23M94K26m43k56P46j67n18L42P5m55k6P16j41l13L27K51o08p2
$$ -506 -67 -40 -363 131 357 -86 -342 404 237 -281 61 136 -319 -345 371 230 -83 244 495 -113 -185
3861a85L02L76n04K49O6k81j78K63j05k87M41k2m13M07K06n61M22J26k95m2k82
$$ -185 117 493 -11 238 304 23 -155 108 3 -284 157 135 -278 129 335 -226 196 322 27 -15 -297
3882b97M60j40J2J7j33Q7J22j45J38k02j70J9j3M32m6j34j58K98k26L40n34N16
$$ -297 163 23 35 52 -81 6 128 -17 121 -81 -251 -232 -245 187 141 7 -151 147 -79 261 -273 243
3904B43l2l4j76J74j77k46L09k48k0J10P4m4o9k12M03j61j99L17pj8K11o3j88
$$ 243 211 177 1 175 -2 -248 61 -187 -207 -97 -23 -67 -136 -348 55 -106 -305 12 5 -13 198 135 -53
3927e3J73k7j52k16N42K9o18L48J61l90o6M14p3m56L88J01l53M21O6l55R8M04
$$ -53 120 93 -59 -275 267 296 -322 26 187 -203 -269 145 72 -384 4 105 -248 173 239 -116 -18 386
3949C86m52j88J96M54m29k46M96j19l98K25M15o49K31K71k02n25P44n4l97J41
$$ 386 -66 -254 -58 396 -33 -279 217 98 -300 -75 340 -309 -78 193 -9 -534 210 156 -241 -100
3969a00L14j65n15R34K6r73L05O57q40J28O00j53m03J82N53q11J39O96o44n05
$$ -100 214 49 -466 468 494 -479 -174 483 -357 -229 371 218 -185 -3 550 -261 -122 574 -70 -575
3989e75J025j67p99O21O20o52o35R50J20p50L06P76j141k68Q74q8j107Q58N90
$$ -575 450 283 -516 105 725 73 -562 388 508 -242 64 840 -301 -569 305 217 -890 -32 558
4008E58j009J67J068q59n88J180J12j080L7R52p58l31J134k96j402J358M86j021
$$ 558 -451 -284 784 -75 -663 517 629 -451 -414 538 -220 -551 583 287 -1115 243 729 -292
4026b92k21P84J99r98O10M65j005R1J201q87o14R53K87j153O9J301o25q50J443
$$ -292 -513 271 470 -528 82 547 -458 -367 834 -53 -667 286 573 -580 -511 790 165 -685 758
4045G58k72j171P43N43j096L1J243o11q85R67M53j265n1J364o42p50J108M60j605
$$ 758 486 -685 58 601 -495 -464 779 168 -717 250 703 -562 -613 751 109 -641 467 927 -678
4064f78N80R88j180n47J218J50j376Q78O57j115l75J160k17r81J143N12j488L33
$$ -678 -98 890 -290 -837 381 531 -845 33 690 -425 -800 360 143 -838 305 817 -671 -338
4082c38J291o55r09Q25N51j476O33Q74j117o05J532j29j559J091R92j596R3J310
$$ -338 953 298 -611 214 765 -711 -78 796 -321 -926 606 477 -1082 9 1001 -595 -502 808
4100H08p50j268J538L43j210p3J431q86p74J369J17j258L23J206j258m49J439
$$ 808 58 -1210 328 671 -539 -612 819 -67 -841 528 645 -613 -290 916 -342 -791 648
4117F48k88j403J306N70j250m3J420p97j151J054R85j744J16J443j026o33J454
$$ 648 360 -1043 263 833 -417 -460 960 163 -988 66 1051 -693 -577 866 -160 -793 661
4134F61L1j781P51J339j405l72J631m74j388R63J026j638j36J671m79j370J238
$$ 661 692 -1089 -338 1001 -404 -776 855 381 -1007 -44 982 -656 -792 879 400 -970 268
4151B68O24j757M50R98o96j131J496K73j462Q38J477j778n34J896l57j823J390
$$ 268 892 -865 -415 583 -113 -1244 252 525 -937 -99 1378 -400 -934 962 605 -1218 172
4168A72Q27j354m22J410m79j275J566K54j474L90J615j328j060J747L3j604P85
$$ 172 999 -355 -777 633 154 -1121 445 699 -775 -385 1230 -98 -1158 589 622 -982 -197
4185a97J439j433p52J820m45j401J174R19j784rJ644p60j178J483K21j396M43
$$ -197 1242 -191 -943 877 432 -969 205 1124 -660 -669 975 215 -963 520 741 -655 -212
4202b12J289j282n87J665k76j271L90J445j557n75J586p5j304O25J287j766j10
$$ -212 1077 -205 -792 873 597 -674 -284 1161 -396 -971 615 540 -764 -139 1148 -618 -728
4219g28J483m16j210J219N45j970L58J891j201j061J689K40j792R92J065j528
$$ -728 755 339 -871 348 893 -1077 -719 1172 -29 -1090 599 839 -953 39 1104 -424
4235d24l62J890n91j141Q73Q04j846M05J574r10j440J495N53j737L55J726j188
$$ -424 -786 1104 513 -628 245 1049 -797 -392 1182 272 -1168 327 880 -857 -502 1224 36
4252C6j116J471M57k013R33J205j232m29J531n29j311J057Q95j494J06J612j175
$$ 36 -1080 391 848 -1165 -232 973 -259 -688 843 314 -997 60 955 -539 -433 1179 4
4269Dr94J460K67j459M66J198j150q29J415Q5j248R20Q01j447m95J758l51j234
$$ 4 -990 470 737 -722 -256 942 -208 -1037 378 463 -785 135 936 -511 -1006 752 401 -833
4287h33J080N18j416K44J078n68j023J076P61j687L41J224p05q81J291j66j307
$$ -833 247 765 -651 -407 671 103 -920 156 917 -770 -429 795 90 -791 500 334 -973
4304i73J013Q95j271l81J734o88j165J076N60j491J13J359p41o69R73K04j536
$$ -973 40 935 -336 -717 1017 329 -836 240 800 -691 -578 781 40 -629 344 548 -988
4321i88N17J267q50p65J598l90j045Q20O29j188l2R66k47j031R23L07j254M83
$$ -988 -471 796 -54 -819 779 389 -656 164 793 -395 -427 539 292 -739 184 491 -763 -280
4339b80Q18k31j085J066J84j157L92R32n23m30P82j17q43O10M97j000kJ003l51
$$ -280 538 307 -778 288 472 -685 -293 639 116 -314 468 351 -492 118 615 -385 -387 616 265
4358B65j197J008L06p69KP99m88m87O76K70r35M36P60p69l56J077q5j082M73Q28
$$ 265 -932 76 382 -387 -385 414 -74 -561 115 385 -550 -114 646 -123 -479 598 513 -569 -96 732
4378G32j047m71J120j60p91P85J70p76P4Q78n47k40O31n6q00L74P13o26l12J009
$$ 732 -315 -786 334 174 -617 168 338 -438 -364 514 -33 -273 358 302 -498 -124 589 -37 -349 660
4398F60k55q20L76O02q16j42M58K94p88L58O86r57o6Q55m64l54N15M43r15J98
$$ 660 405 -415 -39 563 -253 -395 63 357 -431 -73 613 -344 -410 445 -19 -373 142 585 -330 -132
4418a32P57r27K1O28k51m74L92K99l43k27J73K5l18K47J17l23M49J78k69k10j31
$$ -132 625 -302 -281 347 96 -378 14 313 -30 -257 -84 -59 -377 -130 -13 -336 113 291 22 -188 -319
4439c19O68k41j56M60p95L30M08Nm19N4N1o3j35K25Q2k48J22N3j22J57j15j84
$$ -319 349 108 -48 412 -383 -53 355 360 -59 -5 46 -17 -152 73 155 -93 29 82 -40 117 2 -182
4461a82K60K2M3o37L60Q3j49j85P63l07j73lL57o13L42K9O3l10K63K71n33J8M42
$$ -182 78 100 143 -494 -134 -51 -200 -385 378 71 -102 -105 252 -361 -19 10 73 -237 26 297 -236 -218 224
4484B24l65P1K13k8m4R9j53j37j03J44L65j76j81k57K14o4Q9j39L58k90K84k89
$$ 224 -141 -70 143 115 71 170 17 -120 -223 -79 286 110 -71 -328 -114 -178 -89 -228 130 -160 124 -165
4506a65K83j70l4L3k93L75K46m67j7K21J27m38L61r6J02k6j51L80m65K52lm20
$$ -165 118 -52 -86 -53 -346 29 275 -192 -209 12 139 -299 62 -34 68 42 -109 271 -194 58 55 -365
4528c65L07L60j64j08pL70n90k6O11o72J41L47M4o22J87P22p60l07N75M0k16J21
$$ -365 -58 302 138 30 23 393 -197 -223 388 -284 -143 204 248 -374 -187 535 -225 -532 43 83 -133 -12
4550a2K68l71q8N50j36o67O00O9o00L05M42m22l34P26p1o28K20L95l96j91O40
$$ -12 256 -115 -203 347 211 -456 144 213 -387 -82 360 -62 -396 330 259 -369 -149 246 -150 -341 299
4571B99j55m92M25O01q01j20R22p85n62Q41M67j119K92M80N6j047J041m06l84
$$ 299 144 -348 77 678 -123 -243 679 -106 -668 173 640 -479 -187 293 349 -698 343 -63 -447
4590d47N20M08l86o78J420n40l05L09L80j014j90J007n58n43O83M42r88K52O22
$$ -447 73 481 95 -583 837 297 -8 301 681 -333 -523 484 -74 -617 66 508 -480 -228 394
4609C94o79n51J330M5r89J82J033j178KJ068o15m90O13M46q55m46J003M8q94Q66
$$ 394 -285 -836 494 539 -450 -268 765 -413 -411 657 42 -448 165 611 -244 -690 313 361 -533 333
4629C33J93j095L14P87o95o24Q17K04j130O93R43j062j74J331m64r58M82J019
$$ 333 526 -569 -255 532 -163 -787 30 234 -896 -203 740 -322 -496 835 371 -587 -105 914
4647I14j233PQ67o22o57J090J44j194L70Q62p57n60J301k14r27M92Q84q64n62
$$ 914 -319 -312 555 -67 -724 366 510 -684 -314 548 -209 -769 532 318 -609 -117 767 -97 -659
4666f59J099n2j300J052P88j618L11J017o58o29J222K03j343K90J117j086p30
$$ -659 440 388 -912 140 928 -690 -379 638 -20 -649 573 776 -567 -277 840 -246 -976
4683i76J676k2j384N82J304j577m24J461j51j366J004P55j188j80J183p20q56
$$ -976 700 678 -706 -124 1180 -397 -821 640 489 -877 127 882 -306 -486 697 -23 -879
4700h79J203N79j661N05J032p31j165J897k59j539R85J016j458k80J727n24j168
$$ -879 324 903 -758 -253 779 48 -1117 780 521 -1018 -33 983 -475 -755 972 448 -720
4717g20Q26O41j430K99J213r64p64J234N21j623K87J549j213m85J446k63j560
$$ -720 106 747 -683 -384 829 -135 -899 335 856 -767 -480 1069 -144 -629 817 554 -1006
4734a006Q01J421j696j78J254k36j312J006P36j801L22J704q76q29Q09M91j507
$$ -1006 -205 1216 -480 -658 596 360 -952 54 790 -1011 -689 1015 139 -690 119 610 -897
4751h97O87J338j546l60J504l00j323R59Q32j350k46J528q61r22J494O85j861
$$ -897 -210 1128 -418 -778 726 426 -897 62 894 -456 -702 826 -35 -957 537 1222 -639
4768f39M49J067r19r42J639L22j903N37J183j388k55J535k62j562J347R32j399
$$ -639 -190 877 -42 -984 655 977 -926 -389 794 -594 -849 686 424 -1138 209 1141 -258
4785b58n58J557n90j030J139N00j662L25J465p85j052J688j17j308J46J362j243
$$ -258 -816 741 151 -879 260 760 -902 -577 888 103 -949 739 622 -686 -540 822 -421
4802d21k49J584m61j387P89Q55j314r9J626m53j554J236L79j274J23J509o49j247
$$ -421 -670 914 453 -934 -145 710 -604 -703 923 470 -1084 152 531 -743 -620 889 240 -1007
4820a007J535j06j405N84J431j145n08J580o10j137N34J148j579j20J255k64j236
$$ -1007 528 422 -983 -399 1032 -113 -621 959 349 -788 -254 894 -685 -805 450 186 -1050
4837a050J219M92j257J15J557j153q56J231k7r29M87J120j406k52J494n03j299
$$ -1050 169 661 -596 -481 1076 -77 -933 298 271 -658 -171 949 -457 -709 785 282 -1017
4854a017J415M19j410l3J248l83j136J321L55j459J08J311r78o65J428j65j108
$$ -1017 398 817 -593 -626 622 239 -897 424 779 -680 -572 739 -239 -904 524 359 -749
4871g49N47J120j516J7J078j47j240Q65P44j526J20J266o92n43P83M46j146j37
$$ -749 -202 918 -598 -581 497 350 -890 -25 719 -807 -687 579 -113 -656 127 573 -573 -710
4889g10J534q78n19J191J44j389L59J045j103k61Q91k97o99N96P66j109J6J049
$$ -710 824 -54 -573 618 762 -627 -268 777 -326 -587 304 7 -692 -96 670 -439 -423 626
4907F26m57r82R40M24r08J11P72p83n64J429k70j019N28R92j025n93J520m63j000
$$ 626 169 -813 127 551 -357 -246 526 -257 -821 608 338 -681 -153 839 -186 -779 741 278 -722
4926g22O41O93j197M23P71m05p35P93K68j103L07Q71o92o85J326l8r07N04L90
$$ -722 -81 612 -585 -162 609 204 -531 262 530 -573 -266 605 -87 -772 554 516 -391 113 503
4945E03p95j88Q36k76p56Q26K57q63L48Q07r38l23R23qq03K54N56k48o95P58J49
$$ 503 -292 -480 356 80 -676 150 407 -456 -108 699 -239 -562 361 353 -450 -196 360 112 -583 175 324
4966C24o79M35K70q45J00N97j68n41Q12lj62k58O52l69n13O45r2o49N50L03k68
$$ 324 -355 80 350 -495 -395 202 34 -507 305 302 140 -118 534 165 -348 297 205 -444 106 409 141
4987A41o51Q64j19n22L83P5k90j11O54k51n92O88K14r67L21L51j73m32P09J23
$$ 141 -510 354 235 -287 96 171 -119 -230 424 173 -419 269 483 -484 -163 188 15 -417 292 415
5007D15o48L6M03k08j86L03m3n54P09j10l79J41M54k04k23J20L8l85J37O99l09
$$ 415 -233 -197 206 -2 -188 115 72 -482 227 117 -262 -121 333 129 -94 26 64 -321 -184 515 206
5028B06j86k34L55m26K06M26o01r8N53k58MLj55J15j01K99qn8J19K8j66J44k20
$$ 206 20 -214 141 -285 -79 347 -254 -352 201 -57 -53 -50 -205 -90 -191 108 100 42 161 189 23 167 -53
5051e3K01j80K18p1j98J21l7r6K28k2k33K52l05M2J7J07J5j72J26J65k10R1j9
$$ -53 148 -32 186 115 -83 38 1 -95 133 111 -122 130 -175 -133 -116 -9 6 -166 -40 125 -85 6 -13
5074a3j68R5J18O4l96M52l70Q3J44k22K32J4O8L35o30L08k14K11l64R9R5j45L11
$$ -13 -181 -86 32 96 -300 152 -218 -135 9 -213 19 33 101 436 -194 114 -100 111 -253 -154 -59 -204 107
5097A07L4l2k2K30m02K7J37nj44J27P4j30m37O16l11LK20J29m64L76O4m76L57
$$ 107 141 109 87 317 -85 -58 79 74 -70 57 131 1 -436 180 -131 -128 92 221 -243 133 197 -279 78
5120G8L75k00n86M97Ll56R1O19q98J79K57L08n88J46M48l86k97N76j04l86K34
$$ 78 453 253 -333 164 167 -189 -98 521 -377 -198 59 367 -221 -75 373 -13 -310 266 162 -224 10
5141A0N14n13l41N68o2n81L49K52o20N6Q18n48l41K72L14k14K24J54o53l08R10
$$ 10 524 11 -330 238 176 -405 -56 196 -424 -368 450 -98 -439 -167 147 -67 157 311 -342 -650 260
5162B60m2p28L45L39l09l28N57k50j98L22J62p08L79N65m77l00P01j05o28J93
$$ 260 218 -510 -165 174 -135 -463 94 -156 -354 -32 130 -578 -199 366 -111 -411 290 185 -443 -250
5182b50O62m82m93Q90l75m24O52M77p39j85N11j64o22Q33K10r20J64P74o29m61
$$ -250 412 -70 -563 327 -48 -472 180 657 -82 -267 244 80 -542 291 501 -419 -255 519 -110 -571
5202e71J088K4r77K49Q48o75k14N79l87l86N10K14o25j63J177q34o77Q45L99q20
$$ -571 517 541 -436 -187 661 -14 -228 351 -36 -422 88 302 -323 -486 691 -143 -820 25 424 -396
5222c96J35P28n60n71R90Q4r37N32N36q33j80J048j25j144O59M95j018J02R67
$$ -396 -261 467 -93 -664 326 410 -527 5 541 -292 -472 576 451 -693 -34 461 -557 -455 512
5241E12n24p26J103J13q64K18P66q95k57J253l06j052M10J100j340j64R92j42
$$ 512 -12 -738 365 478 -386 -168 598 -297 -554 699 393 -659 -249 851 -489 -653 339 197
5259A97p90R30L53j117K8R86p65o07J307n2j326N91J097q76n43J269k58j059N58
$$ 197 -593 337 690 -427 -399 587 -178 -785 522 470 -856 -265 832 -44 -587 682 424 -635 -77
5278g7Q08j283l04J274j78j099P55P38j175O7J275p60q55R41O07j360K89J106
$$ -77 731 -552 -856 418 240 -859 -104 634 -541 -474 801 41 -814 127 734 -626 -337 769
5296G69q55n16J345j39j397M53J218j365j35J279n88j082J206L03j181N14J023
$$ 769 -86 -602 743 604 -793 -340 878 -487 -622 657 69 -1013 193 496 -685 -171 852
5313H52p12r02J083L09j543O95J093q24o39J177k05j248Q48O96j055j14J095p24
$$ 852 140 -762 321 630 -913 -218 875 51 -588 589 384 -864 -16 680 -375 -489 606 -118
5331a18p42R58P64j405M2J344o81j074J469K88j433M49J117j357n42J434p3j198
$$ -118 -860 98 862 -543 -501 843 162 -912 557 845 -588 -139 978 -379 -921 513 440 -758
5349g58P41Q57j460p4J421q05r10J186N23j398M57R75p07o06Q29L02j138L49R13
$$ -758 -17 840 -620 -694 727 -78 -988 198 721 -677 -220 755 48 -558 271 573 -565 -216 697
5368F97j001l49J147j05q93N63N86j312N4J575r11r56J150M02j191L18J084q58
$$ 697 -304 -653 494 389 -504 59 645 -667 -613 962 51 -905 245 647 -544 -226 858 0
5386@o75Q46L86j246N73J008j420M2R56n6j536J240O69j433K37J098n63q35J208
$$ 0 -675 171 557 -689 -116 892 -528 -486 470 414 -1122 118 787 -646 -409 689 126 -709 499
5405D99L36j733N99J048o52q54J259P3j382O62J038j044n35J311k87r57P66L71
$$ 499 835 -898 -299 749 97 -757 502 575 -807 -145 893 -151 -686 625 338 -619 147 518
5423E18j069J01J058m76j001J077O20j696P12J058j315m48J200K50j052M71N78
$$ 518 -551 -450 608 132 -869 208 828 -868 -156 902 -413 -861 339 589 -463 8 586
5440E86j182l01J517j00j154R18L39r56j1J062n14r24Q70M42r73K56Q13j099k4
$$ 586 -596 -897 620 520 -634 284 623 -333 -344 718 204 -720 150 592 -381 -125 688 -411 -435
5459d35Q98p2j211O76R27j181k4R36j19q56O95L85j005j05J256p89n77P45M82
$$ -435 463 391 -820 -144 783 -398 -422 514 395 -461 234 619 -386 -491 765 -24 -601 144 626
5478F26j194K49J175j099l30J111Q3j147J78J020j060j02J073l56q62R09J08q46
$$ 626 -568 -319 856 -243 -573 538 621 -526 -348 672 -388 -490 583 227 -635 274 382 -464
5496d64K92N66j74j033J217J25j047O3R92q34l79P22K45o63K70Q20r88j99J012
$$ -464 -172 394 220 -813 404 529 -518 -455 537 -297 -676 46 291 -372 -102 718 -270 -469 543
5515E43n18n01O17P04j163J58O47o64m45Q97J80r44J99J105j056k23J079n52p65
$$ 543 25 -476 141 845 -318 -160 487 -177 -622 275 455 -489 -290 815 -241 -464 615 63 -702
5534g02O84P03r20KM57k81n38Q06M36q33o8N14m29k22P66j9r06N87N00p04l81
$$ -702 -18 685 -235 -233 224 -57 -595 211 647 -186 -254 260 -169 -391 375 356 -550 37 537 -167 -548
5555e48P04K78p42O33N9r52L24P52o07j05M18K36o52J46M97p59k9N93j71p30O02
$$ -548 156 434 -308 325 384 -568 -244 508 -99 -204 214 450 -202 -56 441 -318 -347 246 75 -655 -53
5576e3K79l94q6M71j03l00L35J20k50j95L83o6m05N12J00n75L90J73m42k31K99
$$ -53 226 -168 -254 217 114 -186 149 269 19 -176 207 141 -264 248 348 -227 163 336 -106 -337 -38
5597c8L4k50J36J89k02l83Q27k51j33j03O41m63k16M45k89k33L06K81m13j4J59
$$ -38 -4 -254 -118 71 -131 -514 313 62 -71 -174 467 4 -212 233 -56 -289 17 298 -115 -129 30
5618C0k1m65M57J32m86O17p3k37k5M89n70J8K45q5k80N5O09n97j74M25R8k13L80
$$ 30 9 -456 1 133 -353 264 191 -46 -71 418 -152 -134 111 26 -254 -199 410 -187 -361 64 162 -51 329
5641C29k04j00J1j37K92l88L29K28r40N48Q3k2J12k24K64l86L20k94L16j82j98
$$ 329 125 25 36 -101 191 -197 132 360 -580 -32 51 29 141 -83 181 -205 115 -179 137 -45 -243
5662b43K41o2M8o2N7OJ33k71K35O8k40N6j20K01r9k43K02J63M7q8m48L70M8l6
$$ -243 -2 -64 -16 -78 -21 -15 118 -153 82 150 -90 -34 -154 47 -52 -295 -93 70 117 29 -419 -49 -1 -37
5686c7k68L29l21K02O9KJ69j20J19k33K5R2J66l15K0J76j63J60J37l2n51M84j81
$$ -37 -305 24 -297 -95 -26 -24 145 25 144 -89 -64 28 194 -121 -101 75 -88 72 209 177 -374 110 -71
5709g1J8j1j3P0l13L02J42l30j3L82m23j1L65K37o66M32K71o45J41J37R9m49Q
$$ -71 -53 -64 -77 -7 -320 -18 124 -206 -219 163 -260 -271 94 331 -335 97 368 -277 -136 1 100 -349 -341
5732c41P95q69K39M59j08j68j0J67n15J97N65m22k83M93j7m25K43K18k96j60L93
$$ -341 454 -415 -176 283 175 7 -3 164 -351 -154 411 -11 -294 199 182 -243 0 218 -78 -238 155
5753A55j41n34N60o4m30K92M94n19l90P83P9l89R3J37Ln64M65M38q48M72M23n61
$$ 155 14 -520 40 -24 -454 -162 332 -187 -577 206 285 -104 -11 126 129 -435 30 468 -380 92 515 -46
5775d6m50J043k66p57M91K04o27N3O65k46l91M93J43o55R1N88k67n90P00J97n95
$$ -46 -496 547 281 -476 15 219 -408 -355 310 64 -327 166 309 -346 -255 333 66 -524 176 373 -222
5796b22N50Q4m18n48R52k99n07P02j95k72j13O63j71n73Q24j07m10l85R65m95
$$ -222 328 412 -6 -554 398 99 -408 294 99 -173 -286 377 206 -367 457 350 -60 -445 520 25
5816B5p90J248j70j124Q06N92j150K23P39l67o90P76L85q82KJ209o88p85Q12L67
$$ 25 -765 483 313 -811 -5 587 -563 -340 399 32 -658 118 503 -379 -377 832 144 -641 171 538
5836E38j333P97O05q02n83J299k55q05L48N88p57j75J202n01o72O50K67p60J20
$$ 538 -795 2 607 -195 -778 521 266 -539 -191 397 -360 -535 667 166 -506 144 411 -349 -229
5855b29M73j40m10N83J93p54L21O15p67l91R64j59q69M97O89r50p0R75m82m90
$$ -229 244 104 -306 277 470 -284 37 652 -115 -506 458 299 -570 -73 616 -334 -404 571 89 -401
5875d01P32K86j183M51O83l15r06P87J92r08K27Q84r84J58R29l23r44O46M75p05
$$ -401 331 617 -566 -115 568 253 -653 134 326 -582 -355 529 -455 -297 632 309 -635 11 486 -219
5895b19k65J293m36j003R24L52j173J65J236j072k73P97%o42K35P26o71o50J086
$$ -219 -484 809 373 -630 294 646 -527 -362 874 -198 -471 326 326 -316 -81 645 -26 -676 410
5914D10j90r46Q27M18q24p2J169p12q05J049P5p59L3R54j006l34J177J59j031
$$ 410 220 -726 101 519 -305 -377 792 80 -725 324 399 -360 -327 627 -379 -713 464 623 -408
5933d08M91N91p72o27J028j5p89O57N07j018j40J044k66j103R64M37q45k13J143
$$ -408 83 674 -98 -725 303 288 -501 156 663 -355 -495 549 283 -820 144 581 -264 -477 666
5952F66p19o35J157%p83K15P96j054J40J181p63r93O70J118j748M81P67k32p71
$$ 666 -53 -688 469 469 -314 -99 697 -357 -217 964 201 -792 -122 996 -752 -271 496 264 -507
5971e07R74J2j203P38O42o97l78O59J27j052O57N90j024J9J017l40r30J035L79
$$ -507 467 479 -724 14 656 -41 -419 240 367 -685 -28 562 -462 -443 574 234 -696 339 718
5990G18j223K06J128p83r13R66L76p92J98J095j249j92R33k67r30Q62O17j063
$$ 718 -505 -299 829 46 -867 99 475 -317 -119 976 -273 -465 468 201 -729 133 750 -313
6008c13j60J275n67r00R07L44j240K96Q73o32l76O89j00r33Q54O58p75m42Q41
$$ -313 -473 802 235 -665 242 586 -654 -358 515 -117 -493 196 96 -837 17 675 -100 -542 299
6027B99K40j196Q13M57r10k11J126m33o26P59J53p95N2J128j017l33P31J90r15
$$ 299 539 -657 156 613 -297 -508 618 185 -441 318 471 -324 -272 856 -161 -494 237 427 -488
6046d88J07R89r08j60J104k31r40O56M00j089J7R12qq99M90P24j038K14O87m55
$$ -488 -381 608 -300 -460 644 413 -527 129 529 -560 -543 369 361 -538 -48 676 -362 -148 539 84
6066H4m41N93K14r29M64K84l75k44O01k05p20P70L54o56j09R21o49l72O44J49
$$ 84 -357 236 450 -479 -15 269 -106 -350 251 46 -674 96 450 -206 -315 606 -43 -415 229 378
6086C78r32O67L14l48n31Q75O7j145L89P74n40l65N08j15m89M60L91l08n58Q99
$$ 378 -554 113 427 79 -452 423 490 -655 -266 508 -32 -397 111 -4 -493 -33 358 50 -508 391
6106C91j01q82R84k8q44L99N39n26m39P12P2n88L43J73n29J06M88k66l07L97M27
$$ 391 290 -592 392 364 -480 -81 458 -68 -507 205 277 -311 32 205 -324 -218 270 4 -303 94 521
6127E21o27k61R39m65k73L01J38m29j44L95m1l15M04q4m62M83L35m23O1J38j52
$$ 521 -106 -367 572 107 -166 135 273 -156 -300 95 54 -261 143 59 -403 80 415 -8 53 191 39
6148C9l11L46M43j179L70P79k60o42N71o5k83m9N11k54n08O76l61k85N25L5l20
$$ 39 -272 74 517 -662 -292 487 227 -415 156 91 -192 -241 270 16 -492 184 -177 -462 63 98 -222
6169b22N5O52l84m28N04j77p9N9L84m37J3J41J02p04N45k0n04K33K15R6j82J65
$$ -222 -167 485 101 -327 177 0 -79 -20 364 -73 -60 81 183 -521 24 4 -500 -267 -52 44 -138 27
6191B7J01k99LM37l24r3k9M37n3l82N43m63j05J02L57k83j61R9m7j18M79n3l22
$$ 27 128 -171 -168 269 -55 -148 -177 260 207 -175 368 -95 -200 -98 259 -24 -185 -86 -133 -251 228 175 -147
6214a47K86K47l21N0P5K7l24J92j27k11K04J52m36L16k09K66l59K14J45j7j39
$$ -147 139 386 65 115 190 217 -107 85 -42 -253 -49 103 -333 -17 -226 40 -319 -105 40 23 -116
6235a16J83nl8J82k98J92j38K03J01m4j99Q1k9J06j18K38k31J81m80J92K00j83
$$ -116 67 62 24 206 -92 100 -38 165 266 222 23 104 75 181 63 301 70 251 -229 -37 163 -20
6257b0R0j59r7K36j00k4J19Nm8k66M09l89M88k16l65R2J18q6K46l29K15K06j67
$$ -20 70 -89 -186 50 -50 -74 45 50 2 -264 145 -244 244 28 -337 -245 -127 -213 33 -296 -81 125 -42
6280d2J1K90Nk01L7r9J9MJ79n3j95J32k32j83L37K69k22k01K75K07m43j75N59
$$ -42 -31 259 264 63 100 1 20 24 203 150 -45 87 -145 -328 9 278 56 -145 130 337 -106 -281 278
6303B78l25Q7qJ34n14K13L87k81O3L5N3l40K04J87n40J70L57j22l35K37J37j19
$$ 278 -47 40 32 166 -348 -135 252 -29 34 69 122 -218 -14 173 -367 -197 160 38 -297 -60 77 -42
6325d2J13J95m16j3N14o1m67r7N31l35k15N04k11o7J76J25n20J71l3m3N4K57R0
$$ -42 71 266 -150 -163 351 290 -177 -274 257 -78 -293 211 0 -67 109 234 -286 -115 -148 -191 -137 120 210
6348B10l65M31K2l16k09M45o2j39j37M90m63l7M9K79k35K2J03m80K09N47k89m94
$$ 210 -155 276 298 -18 -227 218 156 17 -120 370 -93 -130 -81 198 -37 -15 88 -392 -183 364 75 -419
6370d19P75J91p34K29J81m20k16N09P5l14L3Q07r63j84N96l42j37L53L21o41J35
$$ -419 356 547 -187 42 223 -197 -413 96 171 -143 -110 697 -266 -450 146 -196 -333 20 341 -300 -165
6391a65O04j41m12L22K43p88K36N51o36l35P04k7p99M81K69j83j39O42j33n47
$$ -165 439 298 -114 208 451 -337 -101 450 -186 -521 183 156 -643 -162 107 -76 -215 427 294 -253
6411b53M08Q2l81j35N06K14o39M50L87j248P32K34k67k72N51j79o54N83L39p78
$$ -253 155 237 -144 -279 227 441 -198 252 639 -609 123 357 90 -182 369 190 -464 119 458 -320
6431c20j29R47l48l84M47J16m96M03j32K14q83R29O6p43j40Q14k18p02O90L8o89
$$ -320 -449 498 150 -234 213 329 -167 236 104 318 -565 364 430 -313 -453 361 143 -559 131 169 -520
6452e20L48M99k61k59M48n8n40L74N29q21n7P03p45l70R80o0o28N29K17n03k56
$$ -520 -172 327 66 -193 255 197 -343 31 560 -261 -318 385 -360 -730 250 190 -438 91 308 -195 -451
6473d51R17k72q25O86L35n93j06R15k54j065O77P42j237O7R32k57o49O95j91m55
$$ -451 466 194 -631 55 390 -203 -309 606 352 -713 -36 706 -531 -464 468 211 -438 257 66 -389
6493c89K20L69k68l12N31K8n93M51N73r26k95J041k60m38N83k14m35K12M87m10
$$ -389 -169 200 -68 -380 151 179 -414 37 610 -316 -611 430 170 -268 315 101 -334 -122 365 -45
6513d5m80Q43q1l46j45O03l78l88O69L1j079O67N30p28m7Q14m43l53M31K73n27
$$ -45 -525 318 237 -109 -254 349 -29 -417 252 283 -796 -129 401 -327 -374 440 -3 -356 75 348 -179
6534a79j80P65m42k59O39r0n63J67M72l69m83Q26m10l24J35O87o54l09J024k60
$$ -179 -359 406 -36 -295 344 254 -309 -142 330 -39 -522 304 -106 -430 -295 392 -262 -571 453 193
6554A93o88N56P7n86J46Q56o50m17P09J9n95K88N12o77m0R51p37m75N49N94p59
$$ 193 -495 61 138 -448 -302 554 -96 -513 196 215 -380 -92 420 -257 -297 654 -83 -558 -9 585 -174
6575a74j07N75p4m03L37L52j037N27N76n19m54O06L9p29M64P23o70m88Q10j14
$$ -174 -281 294 220 -183 154 506 -531 -4 572 53 -401 205 244 -485 -21 702 32 -456 354 240
6595B40o98N14L88p21J12P68n40q30J188k07o93K29P81p96l26R13k84o46N21N87
$$ 240 -458 56 444 -277 -165 603 63 -767 421 214 -479 -250 531 -265 -591 322 38 -608 -87 500
6615E00l53n46Q84j93q26L17N01n54J13O65q38j4M98J93r55O48N11q91oO36k20
$$ 500 147 -399 485 292 -534 -217 284 -270 -157 508 -330 -344 154 347 -608 40 551 -340 -346 290 70
6636G0p65O86M67l89l20O46k57p66P78J63o83K26N83l00m76N81k7n63L51M48m42
$$ 70 -695 -9 458 69 -251 395 138 -628 150 313 -370 -144 439 139 -337 244 217 -346 5 453 11
6657A1m34N40J12n35K38L15k78m3M77l93l94N59J86p25MP78n89l00O17K45q54
$$ 11 -423 117 229 -306 -68 247 -31 -74 403 10 -384 175 361 -364 -360 418 -171 -471 146 391 -463
6678d63M30N69q86J95J77J42l03L92J28o94J80M11k23o22P23J37p08J43O44k69
$$ -463 -33 536 -350 -155 22 164 -139 253 381 -313 -133 278 55 -567 156 293 -415 -272 372 103
6698A03o32P06R2n29J80K61l08j85O28k00n69N19J66k36m99Q75m91k85N23J22
$$ 103 -529 177 269 -260 -80 181 -127 -312 316 116 -453 66 232 -4 -503 372 -119 -404 119 241
6718B41m30k0L93k52l62N45P4j59Kq9k80K96r6O2j77L97K85n83K49j45J21n40
$$ 241 -189 -209 184 -68 -430 115 189 30 32 -57 -337 -41 -137 -75 -252 145 430 -153 96 -49 72 -468
6740d68K78L32n38L22O46n10j53J92N1k60l7M19l45l23N19K10n31K21j73p1J12
$$ -468 -190 142 -396 -74 572 62 -91 101 152 -108 -145 274 -71 -394 125 335 -196 25 -148 -219 -107
6761a07L19l11j7J52o4k60J95J44j8l15M32K31n12K53K01p0k14K69n02J31j70
$$ -107 212 -99 -116 36 -28 -288 -93 51 33 -282 150 381 -131 122 323 253 39 308 -194 -63 -233
6782b33M02m45J34m0j00J49J17J13r6r0L00j04k03M28k52k18JJ64K0k68L65J30
$$ -233 169 -276 -142 -182 -282 -133 -16 97 1 -89 211 107 -96 332 80 -138 -137 27 47 -221 144 274
6804B74k21R4l98OL63r2J08r4Jj20r7L75j38m2Q1j11p6M9n8o9K50k36M58k94K6
$$ 274 53 147 -251 -245 118 26 134 40 41 -79 -176 199 61 19 100 -11 -87 -38 -96 -165 85 -151 307 13 39
6829C9n9o1j3O7Q7m4j0k1j42j30L41j33j2j4K58j65q1J79L0j60J11R1j57j52K99
$$ 39 -20 -81 -94 -27 60 16 6 -15 -157 -287 54 -79 -91 -105 153 -12 -93 86 116 -44 67 158 1 -151 148
6854A48m1rm22M11k01J95k98J02m2j18N0L14j55L03m99N12M8j07J4k89L9ro2j39
$$ 148 107 98 -324 87 -114 81 -217 -115 -157 -275 -225 89 -66 237 -262 250 298 191 205 -84 -45 -54 -116 -255
6878b55M0J84J03P4R0j67k93R3J87j16j33L53r3j8lJ82m12K41j50K15o3q6L51
$$ -255 -215 -31 72 146 236 69 -224 -131 56 -60 -193 160 67 49 46 228 -184 57 -93 122 59 -27 324
6901C24k23k9K06j69r4J31k2l91M01J50l08k18K67J33k25m8K34Q6n58N39k31N1
$$ 324 101 72 278 109 15 146 124 -267 134 284 -24 -242 25 158 -67 -115 119 205 -353 186 -45 6
6923FK2O4j76J34R0k00l4R8O1j07P3K20o9l32L60j92k50K44K20r4j89O2J12l13
$$ 6 28 92 -84 50 140 -60 -94 4 65 -42 31 251 182 -150 210 18 -232 12 232 138 -51 11 123 -190
6947a90J28L33l57k03Q59n71l2J63J85l98k15M16j83J26N0J28l37J49R7m05K8
$$ -190 -62 271 -86 -289 570 -1 -33 130 315 -83 -298 118 -65 61 111 239 -98 51 148 -257 -229
6968b29J63N2q6P6L19m73q8J42L08k02j79N11n47K28K94m85k79O60J37m17j23
$$ -229 -66 -14 -100 -24 295 -178 -266 -124 184 -18 -197 314 -233 -5 289 -196 -475 185 322 -95 -218
6989b18K83j0n1L71n88J58J1K61l41n4K76q2k32N87k29l05M3O65n56k37N83l44
$$ -218 65 55 4 375 -213 -55 -44 217 -124 -178 98 16 -216 371 142 -163 -120 545 -11 -248 335 -9
7011in56N86K88l2n84M25k09m07N74L26l30k72M24m8k72L7K41m72K01O84p15l93
$$ -9 -565 21 309 277 -307 118 -91 -498 76 402 72 -200 224 176 -96 -59 182 -290 -89 595 -120 -513
7033e13Q02Q3m18J28p1k76n1Q12l60m29M85J91n90N5L45K7n40L17L74n44j5N56
$$ -513 289 372 -46 82 11 -265 -316 496 136 -293 192 383 -207 -152 193 220 -320 -3 371 -173 -188 368
7055C68m37l3R2J07k76L66L6k92l2M32o3o59M74J02o00K76M79k93j93K30j2j71
$$ 368 -69 -102 -10 97 -179 187 223 -69 -101 331 268 -391 83 185 -415 -139 340 47 -146 84 72 -99
7077i9K86P6o85O4M26L75q15L51L26l08k00M85j50l68M5P27o57l78R04m47j73
$$ -99 187 263 -422 -358 68 443 -372 -21 305 -3 -203 282 132 -236 -191 536 -121 -499 405 -42 -215
7098b15L20J56p19J91P69n06k45O66j82n18O56P3o34p8N31K7n49O66j04n37P6
$$ -215 105 261 -458 -267 502 -4 -249 417 235 -283 373 446 -188 -266 265 292 -257 409 305 -232 -156
7119a56N85m75j65L35N0m16J47K49k34j65M47k72L1N3M27m96j98P40q26p0P02
$$ -156 429 -46 -211 124 174 -242 -95 154 -80 -245 202 -70 -39 14 441 -55 -253 487 -339 -409 293
7140B93L2n62p8N37m96R0L45K08q73M61M81o76q7P57l61k76K84L49q10J70M93
$$ 293 325 -237 -315 222 -274 -184 161 369 -504 -43 438 -238 -325 432 71 -205 79 428 -382 -212 281
7161B81l01k31N56p2o41K70M61n13j13N00j18l76M11K95n43j83O25j03m66L83
$$ 281 -20 -251 305 233 -408 -138 323 -190 -303 197 79 -297 114 409 -134 -317 308 205 -261 122
7181A22J23n06L42L21n58k11N14L29r09L23O17n67k63K85K0j54K76l7l9l85M23
$$ 122 245 -261 81 402 -156 -367 147 476 -433 -110 507 -60 -323 -38 -18 -172 104 67 28 -357 66
7202F6n9n11N39L14n46J0L58k69m96O23N57j026M05L65n32j54K98L30n36K31L15
$$ 66 7 -504 35 349 -197 -187 171 -98 -594 29 586 -440 -35 330 -202 -356 -58 272 -264 -33 282
7223B82m24P5K48q1n20L76L32n75J34M75p11J77L51M7p43L32O60n33r5K99j51
$$ 282 -142 -67 181 100 -420 -44 288 -287 -153 322 -389 -212 139 186 -557 -225 435 -98 -193 106 -45
7244d5k90M26K43o64J77L34j55m62L50J55m44M53N7k68j48K31L10n86J90L74m15
$$ -45 -335 91 334 -330 -153 181 26 -436 -86 69 -375 78 135 -133 -281 -50 260 -326 -136 238 -177
7265a77J06J48J05m67K35M26m44k12M78J45n43L86J59m21M9N15p51j53M69j17
$$ -177 -71 77 182 -285 -50 376 -68 -280 198 343 -200 186 345 -76 -27 488 -263 -416 53 -64
7285f4N3k9L80m33l05L12J69n77O69j11l94J12M57N4k76L33j70k17j03M39l05
$$ -64 -11 -40 340 -93 -398 -86 83 -494 175 64 -330 -218 239 293 17 350 180 -37 -140 299 -6
7306fk27L51L79m33k93M28k99k5jO2l01M26L0l05N8L19j88m5J11J3j49k42O99
$$ -6 -233 118 497 64 -229 199 -100 -125 -126 -64 -365 61 91 -214 -156 163 -25 -70 41 54 -95 -337 362
7329C62q3o38M09j05K1kK89o9k58J75j30P6q4L5P5lR2n7n92N97K24l77M9J10p1
$$ 362 279 -359 50 -55 -34 -36 253 184 -74 101 -29 47 -37 -2 73 70 162 105 -487 110 334 -43 6 116 45
7354D5r1J45Q6j17j25J35m04M33K31k54l98M13R2l30K74J0N4n85K93Q1j38J20
$$ 45 -46 99 185 68 -57 78 -326 107 338 84 -314 99 191 -139 135 145 199 -386 -93 -12 -150 -30
7376c0j03P1J79m8l8j31K3J35j26q8K36R5l20K00M8m9j02J98r4k81N59k46k57
$$ -30 -133 -62 117 69 31 -100 -77 58 -68 -156 80 175 -145 55 103 54 -48 150 56 -225 334 88 -169
7399a69J4O92o85J78m4K80k13n5L3j18O2m5n2J8P2L9k12P3oP7J60j93j23K07R5
$$ -169 -155 537 -148 30 -14 266 53 -2 31 -87 -25 -70 -122 -104 -32 7 -205 -132 -138 -61 99 -94 -217 -10 85
7424H5J7l34J88j62L24j30o1j24R8p3K26j86J01j65K11O2j05P5r3O1k19K32n5
$$ 85 102 -232 -44 -206 118 -12 -73 -197 -99 -172 54 -132 -31 -196 15 77 -28 47 -46 15 -204 28 -27
7447b7P9q2l04L81k11K36kk83K5K89K54l72q9J45k07Q1j15J05L6J78r8k3k14K19
$$ -27 52 -30 -334 47 -164 72 70 -213 -188 101 355 -17 -106 39 -168 -87 -202 -97 -61 117 19 -4 -218 1
7471Ak3R5rJ8j08K07k57N7j25J67N5n9qL3Q9k92J6J48o3j61M75l55O0J19K17l14
$$ 1 -22 73 64 82 -26 181 -76 -19 -144 23 78 19 11 44 133 -159 -143 5 -58 -219 256 -99 -39 80 297 -17
7497a7K7L60m32k16M53q6l25l4J29p9J61L22m76ON38J48l75l77L56o8j22J77J62
$$ -17 10 370 -62 -278 175 89 -236 -270 -141 -220 -59 263 -213 -207 331 479 104 -273 83 15 -107 70 232
7520B32l15n1M62n24K66J28k14p7Q2k90K37j9K85n04K81R3j45k06K94J2j92J68
$$ 232 -83 -134 328 -196 70 198 -16 -93 -11 -301 -64 -83 202 -302 -21 72 -73 -279 15 27 -165 3
7542CK3jl6K42k08l8j52L68l34j30K92K26m10oN44o46J33L18l78L8K11P7j8k16
$$ 3 26 25 -11 231 23 -15 -167 201 -133 -263 29 255 -155 -161 383 -263 -130 188 -190 -152 59 136 118 -98
7566i8K68j96k47L34Q0l49J40M61m03J0J68k45k19K60K56l21q7M29n5o04L15J86
$$ -98 170 -26 -273 61 141 -208 -68 393 -10 0 168 -77 -296 -36 220 -101 -188 241 186 -418 -103 83
7588H3j40j01N14l59l16L04M90p35j1L32k2l0mK66l96K51J90k90k44L38j33k80
$$ 83 -57 -158 356 -3 -319 -15 475 -260 -271 61 39 9 5 271 -125 126 316 26 -218 120 -13 -293
7610b93J64M46o02M4O32k98l58O23j89k83K48J02k02j67N47k05o90M37L04k17
$$ -293 -129 317 -285 -241 391 93 -265 358 169 -114 134 236 34 -133 414 209 -481 -44 260 43
7630D3J12K00n72K30N06l07l78J34L52n10l1K52J78k49J5J07l40K26K50k74j49
$$ 43 155 355 -217 13 519 212 -166 -32 320 -190 -221 31 209 -40 -25 82 -258 -32 218 -56 -205
7651b05k3M77o80L05N02l85J37MK61n35P6L31l93k02N78j37l61L66M08o74k12
$$ -205 -228 249 -431 -126 376 -9 128 132 393 -142 -66 265 -128 -330 248 111 -250 116 524 -150 -362
7672c62M08J55l35L6L58m89J72K56j9k64R2P1k79J04L40j68k16P0j20k65M93M28
$$ -362 46 201 -134 -98 260 -229 -57 199 180 -84 8 79 -200 -96 244 76 -140 -70 -190 -455 38 466
7694D66o81K97M10o30j30L00J80m08k92M50O0k79L71J30n22L72L25m00k71L47
$$ 466 -215 82 492 -138 -268 32 212 -196 -488 -38 22 -257 114 244 -278 94 419 19 -252 95
7714I5p6m58P34j63j96O8L05k73j42K59Q6k54L7L80r00L28L98k6n25K02L92o9
$$ 95 19 -439 295 132 -64 4 309 36 -106 153 239 -15 22 402 -498 -170 228 202 -323 -121 271 202
7736B02l86O1K55m07K51R5k93q4N04k11j64L62j98j64j00M53k33l82M56l5l03
$$ 202 -184 -123 132 -275 -24 71 -222 -306 198 -13 -177 185 -13 -177 -277 176 -57 -439 17 -18 -321
7757c21K61L89k35l75M80o2n00L96R6l57J44K57J6n40K85K56n21Q7N87l96m33
$$ -321 -60 329 94 -281 199 137 -363 33 129 -228 -84 173 189 -351 -66 190 -331 -244 343 -53 -486
7778d86O80l85L8M3NK3J36N1r0j00J8K88m82J84P4P9l34K07N53o79L0L46j21l04
$$ -486 194 -191 -153 -110 -105 -82 54 105 15 -85 -67 221 -261 -77 -3 76 -258 -51 502 -177 -147 199 78 -226
7802b26L72J14n23L69J76k23k74M31j46m8q2K06m27K20L15j50l28L25j74r6J10
$$ -226 146 260 -263 106 282 59 -215 216 70 22 -60 146 -281 -61 254 104 -224 101 -73 -169 -59
7823e9m3L21n75N87k18j50Q0M13p95Q8N95m4l68L16j73k32P1J67P2J27j20m6l79
$$ -59 -102 219 -356 231 13 -137 -57 356 -439 -351 244 200 -168 148 -25 -257 -186 -19 53 180 60 14 -365
7846c65M59J18l54q7L37j04k72N07j30j78j03L08M3l38M45j76j62j41J61k26P9
$$ -365 94 212 -142 -229 108 4 -268 239 109 -69 -172 136 179 -159 286 110 -52 -193 -32 -258 -179
7867a79M17J91n15J61K69k68r3R9J00j93K4J66m33K07R9L10o54K62K51l81P8K65
$$ -179 238 429 -86 75 344 76 -17 82 182 -11 13 179 -254 -47 52 362 -292 -30 221 -160 -82 183
7889A83j38k10L43j70o1j88K14O4O3L91n26k5J87j14j82O3J97j91o4L43q4j34
$$ 183 45 -165 178 8 -53 -241 -27 37 100 491 -35 -60 127 13 -169 -106 91 -100 -164 179 95 -39
7911c9J7J75j11N3p9J87p8l01L76k12j33L76K1k71Q5K85m61J67L45k54l25q7L66
$$ -39 -22 153 42 95 16 203 125 -176 200 -12 -145 231 252 -19 66 351 -110 57 402 148 -177 -264 102
7934A02k44j39L66j59k4K83k46l5J17L60l09j51J64j68M2Q5j20R5j41J63k5j85
$$ 102 -142 -281 85 -74 -98 185 -61 -96 21 381 72 -79 85 -83 -41 44 -76 19 -122 41 16 -169
7956a69J43L34l64J94j36K07p8J33j25j17M5L2J2O0J5n99L30k9L2R0j73J43K66
$$ -169 -26 308 -56 138 2 209 131 264 139 22 67 99 111 171 186 -413 -83 -112 -80 10 -163 -20 246
7979B46k49k42L93l44J28n0K83l27J32r9m1J97k21P3k37M63J48l11L8o2K27j70
$$ 246 -3 -245 148 -196 -68 -118 165 -162 -30 -129 -170 27 -194 -121 -358 105 253 -58 -20 -82 145 -25
8001b5N1J50k91N7L2J79j21n3m4J32r7J44j33J62p5nn5q1m3K70k68J24l6L83l12
$$ -25 26 176 -115 -58 -26 153 32 -21 -65 67 -30 114 -19 143 68 63 8 -73 -116 154 -114 10 -26 357 45
8026D5J77o4j58k28K80J77k44P6J6o4j05n5j77Q08l81K26l92J35j82j6Q4r6K17
$$ 45 222 158 0 -228 52 229 -15 61 77 13 -92 -147 -324 484 103 329 -63 72 -110 -126 -42 -138 79
8049G9k67K20m2K93j97l5j57J21N0j2k70J10o8J92k8K23l3j42O3j33J08K57j86
$$ 79 -188 32 -10 283 86 51 -106 15 65 53 -217 -107 -175 17 -11 212 179 37 100 -33 75 332 146
8072A46j92p9NL26k21o8J60j14j98J62J46l22N05k50q4O7K41j49l13J35L4J26
$$ 146 -46 -125 -120 206 -15 -83 77 -37 -235 -73 73 -249 256 6 -78 -11 230 81 -232 -97 -63 63
8094F3j7j62J51q9M8q1L0Q2o7j33o0L01n8J30k03J47l05N8K65j42J16j99J53J13
$$ 63 46 -116 35 -54 -6 -87 -57 25 -42 -175 -235 66 8 138 -65 82 -223 -165 100 -42 74 -125 28 141
8118A41l18L47j64j91N3L86k20l4K61m77O7Q4J62l20J73JL4r8K18P9j88K0j02
$$ 141 -177 170 6 -185 -132 254 34 0 261 -216 -149 -65 97 -223 -50 -49 -15 -113 105 184 -4 16 -86
8141h6K24m19M02k64j26N70J45m83l1P5L8j50J71j1k90J88m4J53j58K27j40k40
$$ -86 138 -281 121 -143 -269 301 446 -37 -68 7 45 -105 66 55 -235 -47 -91 62 -96 131 -9 -249
8163b49J53P3k01O1L15J14k11j28L24m51J7L78k35m74Q07l18l74J43P49m61p9
$$ -249 -96 -23 -224 -163 152 266 55 -73 251 -200 -183 195 -40 -514 293 -25 -399 -256 493 32 -47
8184d7L20l28q0kJ40L6j9
$$ -47 273 -55 -135 -137 3 39 20
8191B0
$$ Imaginary data points
##PAGE= N=2
##DATA TABLE= (X++(I..I)), XYDATA
0@%%%%%%%%%%Qj6J6k4L2l3M1n6P2q7J03j20J44j69J94k30K70l14L62m16M79n46
$$ 0 0 0 0 0 0 0 0 0 0 0 8 -8 8 -16 16 -17 24 -32 40 -47 56 -64 80 -89 105 -125 145 -169 193 -223 256 -290
32b90O18p02P96q99J011j132J268j417J578j756J950k161K392k644K920l222L551
$$ -290 328 -374 422 -477 534 -598 670 -747 831 -925 1025 -1136 1256 -1388 1532 -1690 1861
49A861l912M312m751N235n771O370p047P811q681R687j0864J2261j3955J6056
$$ 1861 -2051 2261 -2490 2745 -3026 3344 -3703 4108 -4573 5114 -5750 6511 -7444 8612
63H612j8743K2324k7355L4994m8109P6684k51262J89853L01919m85161P7792L04577
$$ 8612 -10131 12193 -15162 19832 -28277 48407 -202855 -13002 288917 -196244 -118452 186125
75A86125k00099j62116L75272m2824l40912J92396K68550l45841j35026L01812
$$ 186125 -13974 -176090 199182 156358 -184554 7842 276392 -69449 -204475 97337
85I7337o1009k33886K72146J26556l58911k2291L44250j08391k23292K28705J09446
$$ 97337 36328 -197558 74588 201144 -157767 -180058 164192 55801 -167491 61214 170660
96A70660k72826L1920K17463j68892j30508K51267K8032k22426P9561J10085k04861
$$ 170660 -102166 -70246 147217 -21675 -152183 99084 127116 -95310 -15749 94336 -110525
107a10525J05K57268r4920k15207J90704J14344k41305J4424K34488j14686j33153
$$ -110525 -110420 146848 51928 -163279 27425 141769 -99536 -85112 149376 34690 -98463
118i8463J93879r137k47853R6848J89418j73422o4354K27124o2748k12087J76347
$$ -98463 95416 86279 -161574 -64726 124692 -48730 -113084 114040 51292 -160795 15552
129A5552J37271k29936L464K46606j33345k10388K00184R1510k43171L5537K36613
$$ 15552 152823 -77113 -73649 172957 39612 -170776 29408 120918 -122253 -86716 149897
140A49897j36222j67629J92249M7208j99072R4007J72741j83581r0252K20942
$$ 149897 13675 -153954 38295 85503 -113569 -19562 153179 -30402 -120654 100288
150A00288k4626k16857J24174J66906j84457p1365J99076n1372j81961J42563
$$ 100288 75662 -141195 -17021 149885 -34572 -105937 93139 41767 -140194 2369
160B369J22400j82414k6564J74872o8753j28647J36636N9570j50392L4423J30575
$$ 2369 124769 -57645 -84209 90663 21910 -106737 29899 89469 -60923 -26500 104075
171A04075j18846q4042J52989M390j46599P7937J05571j33533m6095J44944j8736
$$ 104075 -14771 -98813 54176 58566 -88033 -10096 95475 -38058 -84153 60791 42055
182D2055j12172P9890N9914j10646L511R7717p1152n5580J15917M86j19450N5722
$$ 42055 -70117 9773 69687 -40959 -37448 60269 -10883 -66463 49454 49940 -69510 -13788
194a3788Q3744r9377k7113J21538l0247j08980P9540O4325j14066o982J14216
$$ -13788 69956 -29421 -56534 65004 34757 -74223 5317 69642 -44424 -51406 62810
205F2810m8944p8952Q8962K1959j04981L8026R1314q3433m8091J13280r938j16983
$$ 62810 13866 -65086 23876 45835 -59146 -21120 70194 -13239 -61330 51950 42012 -74971
217g4971O6805R1212j08066m1207J22831j6952j08891O1053O7912q9133j3017
$$ -74971 -8166 83046 -25020 -66227 56604 39652 -69239 -8186 59726 -29407 -42424
228d2424R4362l9892p4779Q0476L3843r6300J8477Q7195o2683n4565Q7671J1453
$$ -42424 51938 12046 -62733 17743 51586 -44714 -26237 60958 -1725 -56290 31381 42834
240D2834r1605L0445P5850o1565m4681P3730L952o7783L1111M3504n1148r609
$$ 42834 -48771 -18326 57524 -4041 -48722 25008 28960 -38823 -7712 35792 -15356 -24965
252b4965N0451k2344l2654M4860P297n1977K1531M6807m4850k8730N5454L514
$$ -24965 25486 3142 -29512 15348 22645 -29332 -7801 39006 -5844 -34574 20880 24394
264B4394n0057K0582K9064l4922l719L4479k0314k3354L5916K973m1121K1206
$$ 24394 -25663 -5081 23983 -10939 -14658 19821 -493 -23847 12069 15042 -26079 -4873
276d873L3521m1579j2685N4080j2560m9872L6991L3252n1018j0301N2164j3877
$$ -4873 28648 -12931 -25616 28464 15904 -33968 3023 36275 -14743 -25044 27120 13243
288A3243m3798L1729K4152m1710J124L7671k5632k1190M3750k305m8881K4916
$$ 13243 -30555 1174 25326 -16384 -15260 22411 -3221 -24411 19339 17034 -31847 -6931
300f931M2783m0627k8006M8248R527m6399J1281L5371k6878j7804L3132q04k8821
$$ -6931 35852 -4775 -32781 15467 24994 -21405 -10124 25247 -1631 -19435 13697 12893 -15928
313a5928J2708J6558j8965l940J8115q940j2748J8565L801k1804P786J9745j5326
$$ -15928 -3220 13338 -5627 -9567 8548 -392 -13140 5425 9226 -12578 -4792 14953 -373
326c73j1551J8289M199j4593j136Q381J580k618n891l544R770P920j6664q899
$$ -373 -11924 6365 10564 -4029 -5165 3216 4796 2178 -3713 -7257 2513 10433 -6231 -15130
340a5130K1169L883j9977M713J4456j1147m335J4507l361j2974R597Q969j2904
$$ -15130 6039 9922 -10055 -5342 9114 -2033 -6368 8139 4778 -8196 1401 10370 -2534
353b534j601J1904r601o967J7387l051k1745J2576J9587j9743j3208K3448P685
$$ -2534 -4135 7769 -1832 -8799 8588 5537 -16208 -3632 15955 -3788 -16996 6452 14137
366A4137k3150l93K0394m853j3602O308M582l624L163k970o612Q113P155j0024
$$ 14137 -9013 -9406 10988 6135 -7467 -1159 3423 -201 2962 -8 -6620 1493 8648 -1376
380a376n950R291L025p355N87K839m439J140L913l183L55K319m868N169R531j2511
$$ -1376 -7326 1965 4990 -2365 -1778 1061 -3378 -2238 1675 -1508 -1153 1166 -3702 1467 10998 -1513
396a513r669J9535O799k4907l011K6242o110k4161J5144J4590k0379j625J8407
$$ -1513 -11182 8353 15152 -9755 -12766 13476 7366 -16795 -1651 12939 -7440 -9065 9342
409I342j0282j0316J9442q87k3169J5102K2026k6827j3691L5082L98l5244J5578
$$ 9342 -940 -11256 8186 7299 -15870 -768 21258 -5569 -19260 15822 16220 -19024 -3446
422c446K5269k8902j1594L2899m449l1399J6538K2881k3373q105K4824p675j5616
$$ -3446 21823 -7079 -18673 14226 9777 -21622 -5084 17797 -5576 -13681 11143 3468 -12148
435a2148K1853J281k7714J4397K4039k7361j4194L2187J677l0931J1053K3213
$$ -12148 9705 10986 -16728 -2331 21708 -5653 -19847 12340 14017 -16914 -5861 17352
447A7352k0737q947K2604o895j6285J9262K228k4648J3576J9940k5249p604L2270
$$ 17352 -3385 -12332 10272 3377 -12908 6354 8582 -16066 -2490 17450 -7799 -15403 16867
460A6867q346l0235K6020K0638l9312l732M2665j6284l4002L0044J5559l5505
$$ 16867 8521 -21714 4306 24944 -14368 -18100 24565 8281 -25721 4323 19882 -15623
472a5623O913L0431k8280j6783M3282n102m6826K9389L7038m8630j5359N8295
$$ -15623 -8710 21721 -6559 -23342 19940 14838 -31988 -2599 34439 -14191 -29550 28745
484B8745j0475n2497L5213L6211n0866j2432N2511j5120m3124L8169J9893n1713
$$ 28745 18270 -34227 986 37197 -13669 -26101 26410 11290 -31834 6335 26228 -25485
496b5485P941M8097l2987k9933N1380N210n5188K3116M5766m6488k5485N9990
$$ -25485 -17544 30553 -2434 -32367 19013 24223 -30965 -7849 37917 -8571 -34056 25934
508B5934l54n8307K5253L9374m3451j2250M7581j5826l6790L7649J4163m9242
$$ 25934 25580 -32727 -7474 31900 -11551 -23801 23780 7954 -28836 8813 22976 -26266
520b6266J2268M7455l6735k8675N4659K49n8295K8039M5762m7827j9111N5319
$$ -26266 -13998 33457 -3278 -31953 22706 22955 -35340 -7301 38461 -9366 -28477 26842
532B6842j1384n0387L6307K9531n0632J666N2118l2712l9101N4512Q938o1421
$$ 26842 15458 -34929 1378 30909 -19723 -18057 34061 1349 -37752 16760 25698 -35723
544c5723K6772N4613n4458l2971O6938N05o5563L5352N0883n8598k1880O4936
$$ -35723 -8951 45662 -8796 -41767 25171 25676 -39887 -4535 46348 -12250 -34130 30806
556C0806j6252n6535M8950L3465o4317O18O0667l9649m5734O8223J9941p6255
$$ 30806 14554 -41981 6969 40434 -23883 -23265 37402 -2247 -47981 20242 40183 -36072
568c6072J6757O5829n2087m2422P2693R316o8958K9364N0518o1112k5384P0828
$$ -36072 -19315 46514 -5573 -47995 24698 34014 -34944 -5580 44938 -16174 -41558 29270
580B9270q097n8466M4291L2812o9774j660P0567l3922m9425O5625K0723p7449
$$ 29270 21173 -37293 6998 39810 -29964 -31624 38943 5021 -44404 21221 41944 -35505
592c5505R330O5609m1235l7273O6916O671p0202K3611M7759n2599j3468O7603
$$ -35505 -26175 39434 -1801 -39074 27842 34513 -35689 -12078 35681 -16918 -30386 37217
604C7217j9097n8270M5761K7845o7566N675P3457l2746n2366N5341J5584p1085
$$ 37217 18120 -40150 5611 33456 -34110 -28435 45022 12276 -40090 15251 30835 -40250
616d0250K0486O6183m4630l5901O0181l738o4930L4307M8489n4022j1432O5486
$$ -40250 -19764 46419 1789 -34112 26069 22331 -42599 -8292 40197 -13825 -25257 40229
628D0229l0293o3435N7014L7984o9861M983P1750m1402n8182O1034K4822o5655
$$ 40229 9936 -53499 3515 41499 -28362 -23379 48371 6969 -51213 9821 34643 -31012
640c1012J9030O1012n1807l9484O4247j328o3243M3087N0281o6325k2026O8094
$$ -31012 -11982 49030 -2777 -42261 21986 20658 -42585 502 50783 -15542 -37568 30526
652C0526k0006n8469N6309M0144p0787p684O6849l2589n2103O1244K7517o3333
$$ 30526 10520 -47949 8360 48504 -22283 -29967 36882 4293 -47810 13434 40951 -22382
664b2382R035M8553m5911k9408O5042K924o0732L1546M1920o1880j9421P0292
$$ -22382 -13347 35206 -10705 -40113 24929 27853 -32879 -1333 40587 -21293 -40714 29578
676B9578j0016n5014M2871L0941o3193n576N9886k2170l8188N0354J2241o2765
$$ 29578 19562 -35452 7419 38360 -24833 -30409 29477 7307 -30881 19473 31714 -31051
688c1051J3446N0021l9923k2440O0242p018o0989L1713L9968n4996j0184O6978
$$ -31051 -17605 32416 -7507 -29947 30295 23277 -37712 -5999 33969 -21027 -31211 35767
700C5767j5364n7437L7368K9107n4063M639N7077l0530l8202M8294O132n8191
$$ 35767 20403 -37034 334 29441 -24622 -19983 37094 6564 -31638 16656 22788 -35403
712c5403K3464N2144m4050k7483N6510o040o0178L3443M5834m9146j5534N5099
$$ -35403 -11939 40205 -3845 -31328 25182 19142 -41036 -7593 38241 -10905 -26439 28660
724B8660j6489m9789L8268L0522m7610L12M8325k8540l7270M5095J1861m9650
$$ 28660 12171 -37618 650 31172 -16438 -16126 32199 3659 -33611 11484 23345 -26305
736b6305J9050M5271m3930k8966N1646L215m9252K3844L8046m0949j7210M5201
$$ -26305 -7255 38016 -5914 -34880 16766 19981 -29271 -5427 32619 -8330 -25540 19661
748A9661j0755l7466L5124K1939m4601J243M0060k6294k7220M3438Q147m6826
$$ 19661 8906 -28560 6564 28503 -16098 -14855 25205 -1089 -28309 15129 23276 -23550
760b3550J4519L7919l6274k1064M6123j12m1953K2537K6913l7297p709L9734j2246
$$ -23550 -9031 28888 -7386 -28450 17673 17561 -24392 -1855 25058 -12239 -19948 19786 7540
773G540k9323L1036J2066m2088Q487L8988k7574k5151M1027N384m3523J3498L3476
$$ 7540 -21783 9253 21319 -20769 -12282 26706 -868 -26019 15008 20392 -23131 -9633 23843
786B3843k8990j6333L7610k434l6020J9579K3596l1283m088L5101j5340k7335
$$ 23843 -5147 -21480 16130 13696 -22324 -2745 20851 -10432 -14520 20581 5241 -22094
798b2094L0450J0950l7113O806L5289k2478k5133L3109P327l5987R690L0189k3731
$$ -22094 8356 19306 -17807 -11001 24288 1810 -23323 9786 17113 -18874 -9184 21005 -2726
811b726j5366K9444k412k6301J7962J6613k6957j672K9624j3795k4260K5521J1783
$$ -2726 -18092 11352 8940 -17361 601 17214 -9743 -11415 18209 4414 -19846 5675 17458
824A7458l0714M274K7512j8207j8430K5019N518k5730P625J9145j6974q025K1567
$$ 17458 -13256 -8982 18530 323 -18107 6912 12430 -13300 -5675 13470 -3504 -11529 10038
837A0038n359j8999J8047J0463k3962J136K3302j2708j6654K0568P050k4012L602
$$ 10038 4679 -14320 3727 14190 -9772 -8636 14666 1958 -14696 5872 12922 -11090 -7488
850g488K0772j2804j3273J8082K065j7853R381J1314j6413j994J9103p530j5608
$$ -7488 13284 480 -12793 5289 7354 -10499 -1118 10196 -6217 -8211 10892 3362 -12246
863a2246J5513Q512k0311J437K0319j1121j5119J7245O532j9190K665J4524r785
$$ -12246 3267 11779 -8532 -7095 13224 2103 -13016 4229 10761 -8429 -5764 8760 -1025
876a025p155J3574j353j3404R254R635j4354j941J5845o240j2420J2453P106j6242
$$ -1025 -8180 5394 4041 -9363 -109 9526 -4828 -6769 9076 2836 -9584 2869 9975 -6267
890f267K04J4645n358j0991Q226N189r586J302P226o468k721Q694l044o955P474
$$ -6267 -6063 8582 3224 -7767 459 5648 -3938 -2636 4590 -1878 -4599 4095 1051 -5904 1570
905A570L770r537Q95R833m264q746P187N244q055r76O032k330l024L197j79k935
$$ 1570 5340 -4197 -3302 6531 2267 -6479 708 5952 -2103 -3079 2953 623 -2401 796 617 -2318
921b318K554J004m048J955M174m876k600P545J105q637J515P125k807m329K663
$$ -2318 236 1240 -2808 -853 3321 -1555 -4155 3390 4495 -4142 -2627 4498 1691 -2638 25
936B5J692j817J23M97k149J391J769l058k51M112j867m288L355L661l843j747
$$ 25 1717 -100 23 520 -1629 -238 1531 -1527 -1778 2334 467 -3821 -466 3195 -648 -2395
952b395L621R69k285j043J913N45j354m23j73J785m10m061K048M328k739m029
$$ -2395 1226 2195 -90 -1133 780 1325 -29 -452 -625 1160 750 -3311 -1263 3065 326 -3703
968c703L353K566k743o80J299m02Q77J079j971j427M488n89n538L406M679o409
$$ -3703 -350 2216 -527 -1207 92 -310 567 1646 -325 -1752 2736 2147 -3391 15 4694 -1715
984a715k675P681o99p567K917O118n209k746O265q91n382M872K423o545K411O057
$$ -1715 -4390 3291 2592 -4975 -2058 4060 -1149 -3895 2370 1479 -3903 969 3392 -3153 -742 5315
1000E315o441l424R551j001j0944M896J0084q939o897J0711J179r940M489O334
$$ 5315 -1126 -4550 5001 4000 -6944 -2048 8036 -903 -7800 2911 4090 -5850 -1361 4973
1014D973q319o25R355m512o773Q162L249j0317L046R746r420o289J3669K15j4290
$$ 4973 -3346 -3971 5384 872 -5901 2261 5510 -4807 -1761 7985 -1435 -7724 5945 6160 -8130
1029h130N419J0957j0061n480J1460p60j0329P040O030j0396P65J0953q556o846
$$ -8130 -2711 8246 -1815 -7295 4165 3405 -6924 116 6146 -4250 -3485 7468 -1088 -7934
1043g934J3800J080j5818O383J3092j1886q066J5684j64j5508Q304J0730j4454
$$ -7934 5866 6946 -8872 -2489 10603 -1283 -9349 6335 6171 -9337 -1033 9697 -4757
1056d757l464J6087n340j2026J3247L598j5891N028J5134j3146r995J9547J890
$$ -4757 -8221 7866 2526 -9500 3747 7345 -8546 -3518 11616 -1530 -11525 8022 9912
1069I912k1285P845J6919j6361q380J9702j598j8382J0965J1349j7157j595J8583
$$ 9912 -11373 -3528 13391 -2970 -11350 8352 6754 -11628 -663 10686 -6471 -8066 10517
1082A0517q923j4538J7999O556k2797M359K1528j4391j3558K1032K907k3010P618
$$ 10517 1594 -12944 5055 11611 -11186 -6827 14701 310 -13248 7784 10691 -12319 -4701
1095d701J9136j6739j0386K1530j335k0219J2235J1597j9399J21K1751j1612j7015
$$ -4701 14435 -2304 -12690 8840 7505 -12714 -479 11118 -8281 -8160 13591 1979 -15036
1108a5036J9994P839k4093M525K2681j5519j4921K2341K484k3860J0115J7932
$$ -15036 4958 12797 -11296 -6771 15910 391 -14530 7811 10295 -13565 -3450 14482
1120A4482j8456o723K1146o765j9118J7940J1421k3843J583K4042j4915j8404
$$ 14482 -3974 -10697 10449 3684 -15434 2506 13927 -9916 -8333 15709 794 -17610
1132a7610K4692O811k6982P321K3542j9138j4934K4413J892k3426J2444J7005
$$ -17610 7082 13893 -13089 -5768 17774 -1364 -16298 8115 10007 -13419 -975 16030
1144A6030k3848n734K6770r019k1916K2184J2551k8750Q05K7333j5188j9901K7176
$$ 16030 -7818 -13552 13218 4199 -17717 4467 17018 -11732 -10927 16406 1218 -18683 8493
1157H493R137l0875M836K5163j9309j3959K7568M12k6726J3827J7336k5857m943
$$ 8493 17630 -13245 -8409 16754 -2555 -16514 11054 11466 -15260 -1433 15903 -9954 -14897
1170a4897K9946p590k4873K1075J3031l0642J109L1044j3774k0921K3962O586
$$ -14897 15049 7459 -17414 3661 16692 -13950 -12841 18203 4429 -16492 7470 14056
1182A4056k8638O501K4346j7753j2445K6520l029k7790J5395J8605k4694k630
$$ 14056 -14582 -8081 16265 -1488 -13933 12587 9558 -18232 -2837 15768 -8926 -11556
1194a1556K9629j1824k6900K2311J4549k8240K268K9192j5320k1755K3334N678
$$ -11556 18073 6249 -20651 1660 16209 -12031 -9763 19429 4109 -17646 5688 11366
1206A1366k7335J2098K3817k2839j2318K6792n337k6679K0947K0385k9087n645
$$ 11366 -15969 -3871 19946 -2893 -15211 11581 6244 -20435 512 20897 -8190 -13835
1218a3835L0467j2379k6522K5685J6181k9741J717K6318j8660j9533K8016O377
$$ -13835 16632 4253 -22269 3416 19597 -10144 -8427 17891 -769 -20302 7714 14091
1230A4091k7449J1264K1260k6854j1530L2306l516k8342K0586J9219l0982p281
$$ 14091 -13358 -2094 19166 -7688 -19218 13088 9572 -18770 1816 21035 -9947 -17228
1242a7228L0913p751k3048K2964J2761l0456N6K6688j5242j6166K7616L624k9886
$$ -17228 13685 5934 -17114 5850 18611 -11845 -11789 14899 -343 -16509 11107 14731 -15155
1255a5155J0069K1083k3735r526L1958k565k9046J5415J7524k6265m333L0710
$$ -15155 -5086 15997 -7738 -17264 14694 12129 -16917 -1502 16022 -10243 -14576 16134
1267A6134q160k3012J9362Q886k6921M792K5304j5772j4702K5697p70k9986J3278
$$ 16134 7974 -15038 4324 13210 -13711 -8919 16385 613 -14089 11608 10838 -19148 -5870
1280e870K3649k2271q795K7732o568k7156J7609J7682k3902k196K6884j2370k1557
$$ -5870 17779 -4492 -13287 14445 7877 -19279 -1670 16012 -7890 -10086 16798 4428 -17129
1293a7129K0856Q404k5147Q343K3999k1051j5553K5846J012k6701J3695K2874
$$ -17129 3727 12131 -13016 -4673 19326 -1725 -17278 8568 9580 -17121 -3426 19448
1305A9448k3283j1532K6482m133k4358J7920J6679k3691l008K3418j2394j8327
$$ 19448 -3835 -15367 11115 6982 -17376 544 17223 -6468 -9476 13942 1548 -16779
1317a6779K2367Q980k5605M333K2686j8148j5325K6011L160k5451J0457J9788
$$ -16779 5588 14568 -11037 -6704 15982 -2166 -17491 8520 11680 -13771 -3314 16474
1329A6474k1081j0106K3919j501j9812J3957J1677k1667j281K2240j1147j5338
$$ 16474 -4607 -14713 9206 7705 -12107 1850 13527 -8140 -9421 12819 1672 -13666
1341a3666K0613N167k3982N107K0204j5602j1263K2026J217k1991Q279J5762j6435
$$ -13666 6947 12114 -11868 -6761 13443 -2159 -13422 8604 9821 -12170 -3891 11871 -4564
1354d564n407K0678n341j7154J4225Q167j9569K533J9146j1739j3427J8607L754
$$ -4564 -9971 10707 5366 -11788 2437 10604 -8965 -6432 12714 975 -12452 6155 9909
1367I909k2113O225J9789j4935j1066J9473j24j8292R612J3007j6474l077J8225
$$ 9909 -12204 -5979 13810 -1125 -12191 7282 7158 -11134 -1522 11485 -4989 -8066 10159
1380A0159o663j5705J4721Q439j9171K182J8864j2267j3773J7866M962j9043M646
$$ 10159 3496 -12209 2512 10951 -8220 -6038 12826 559 -13214 4652 9614 -9429 -4783
1393d783J6020j2239r377J6267L70j5894Q607J1143j4229l263J5727n585j2627
$$ -4783 11237 -1002 -10379 5888 6258 -9636 -1029 10114 -4115 -7378 8349 2764 -9863
1406i863J2748O908j6620L63J5801p690j1654J2817M497j4242L258J1614r647
$$ -9863 2885 9793 -6827 -6464 9337 1647 -10007 2810 7307 -6935 -3677 7937 -1710
1419a710n741J2406p69j0891P156O785j1405n63J2545o008j0210J0844M892j2768
$$ -1710 -7451 4955 4186 -6705 451 7236 -4169 -4732 7813 1805 -8405 2439 7331 -5437
1433e437P66J1605o750p056R932J654j0485M287P579q636k382J0681l773q940
$$ -5437 -4671 6934 184 -6872 3060 4714 -5771 -1484 6095 -2541 -4923 5758 1985 -6955
1447f955Q922M990j1735M48J1516n600q598R095L530j0955J802R784o514n854
$$ -6955 1967 6957 -4778 -4330 7186 1586 -7012 2083 5613 -5342 -3540 6244 -270 -6124
1461f124R113P21q448L902N667p137j468R004k745q540O566N640r025j311Q980
$$ -6124 2989 3710 -4738 -836 4831 -2306 -3774 5230 2485 -6055 511 6151 -2874 -4185 4795
1476D795k970p241N980L664o770j95N684k423l831M615L68m871K949L946n286
$$ 4795 1825 -5416 564 4228 -2542 -2737 2947 524 -3307 1308 1676 -3195 -246 3700 -1586
1491a586j005N324j241m426L108L099m625j113M295m49l617J651J482k244J085
$$ -1586 -2591 2733 1492 -2934 174 3273 -1352 -2465 1830 1381 -2236 -585 897 -1347 -262
1506b62J294k590O07L150k209k185L087J012l289O88L209k002k587K995R28k906
$$ -262 1032 -1558 -951 2199 -10 -2195 892 1904 -1385 -697 2512 510 -2077 918 1846 -1060
$$ [...]
8191A33
##END NTUPLES=NMR FID
##END=
