##TITLE=1H_B4f-2
 CDCl3
 8 sc, 
 25.6.2024
##JCAMPDX= 6.0         $$ Bruker NMR JCAMP-DX V2.0
##DATA TYPE= NMR FID
##DATA CLASS= NTUPLES
##ORIGIN= UXNMR, Bruker Analytische Messtechnik GmbH
##OWNER= root
$$ XWIN-NMR		Version 3.5
$$ Tue Jun 25 14:06:40 2024 Russian Standard Time (UT+4h)  she@DPX200
##.OBSERVE FREQUENCY= 200.1311
##.OBSERVE NUCLEUS= ^1H
##.DELAY= (6, 6)
##.ACQUISITION MODE= SIMULTANEOUS
##.ACQUISITION SCHEME= undefined
##.AVERAGES= 8
##.DIGITISER RES= 18
##SPECTROMETER/DATA SYSTEM= spect
##.PULSE SEQUENCE= zg30
##.SOLVENT NAME= DMSO
##.SHIFT REFERENCE= (INTERNAL, DMSO, 0, 15.7039)
##AUDIT TRAIL= $$ (NUMBER, WHEN, WHO, WHERE, WHAT)
$$ ##TITLE= Audit trail, XWIN-NMR		Version 3.5
$$ ##JCAMPDX= 5.01
$$ ##ORIGIN= Bruker BioSpin GmbH
$$ ##OWNER= she
$$ F:/spectra/data/she/nmr/H-F/1/audita.txt
$$ ##AUDIT TRAIL=  $$ (NUMBER, WHEN, WHO, WHERE, WHAT)
(   1,<2024-06-25 14:05:21.92 +0400>,<she>,<DPX200>,
      <created by zg, POWCHK disabled, PULCHK disabled
       configuration hash MD5:
       00 E9 B6 7A A2 85 ED C7 34 08 36 98 17 FE 4E 26
       data hash MD5: 16K
       1B DC 26 81 A5 18 E8 EE 05 93 6C 1D 93 9F 71 25>)
$$ ##END=
$$ 
$$ hash MD5
$$ 75 78 BD D7 0F 9B D2 58 C6 DC C0 09 41 A8 16 B9
##$RELAX= 
##$RELAX= 
##$RELAX= 
##$RELAX= 
##$RELAX= 
##$RELAX= 
$$ Bruker specific parameters
$$ --------------------------
##$DU= <F:/spectra>
##$EXPNO= 1
##$NAME= <H-F>
##$PROCNO= 1
##$TYPE= <nmr>
##$USER= <she>
##$AMP= (0..31)
100 100 100 100 100 100 100 100 100 100 100 100 100 100 100 100 100 100 
100 100 100 100 100 100 100 100 100 100 100 100 100 100 
##$AQSEQ= 0
##$AQ_mod= 1
##$AUNM= <au_zg>
##$AUTOPOS= <>
##$BF1= 200.13
##$BF2= 200.13
##$BF3= 200.13
##$BF4= 200.13
##$BF5= 200.13
##$BF6= 200.13
##$BF7= 200.13
##$BF8= 200.13
##$BYTORDA= 1
##$CFDGTYP= 0
##$CFRGTYP= 5
##$CHEMSTR= <none>
##$CNST= (0..31)
1 1 145 1 1 1 1 1 1 1 1 1 1 1 1 1 1 1 1 1 1 1 1 1 1 1 1 1 1 1 1 1 
##$CPDPRG= <>
##$CPDPRG1= <>
##$CPDPRG2= <>
##$CPDPRG3= <>
##$CPDPRG4= <mlev>
##$CPDPRG5= <mlev>
##$CPDPRG6= <mlev>
##$CPDPRG7= <mlev>
##$CPDPRG8= <mlev>
##$CPDPRGB= <>
##$CPDPRGT= <>
##$D= (0..31)
0 1.2 0 0 0 0 0 0 0 0.06 0 0.03 0 0 0 0 0.0002 0 0 0 0 0 0 0 0 0 0 0 0 
0 0 0 
##$DATE= 1719309921
##$DBL= (0..7)
120 120 120 120 120 120 120 120 
##$DBP= (0..7)
150 150 150 150 150 150 150 150 
##$DBP07= 0
##$DBPNAM0= <>
##$DBPNAM1= <>
##$DBPNAM2= <>
##$DBPNAM3= <>
##$DBPNAM4= <>
##$DBPNAM5= <>
##$DBPNAM6= <>
##$DBPNAM7= <>
##$DBPOAL= (0..7)
0.5 0.5 0.5 0.5 0.5 0.5 0.5 0.5 
##$DBPOFFS= (0..7)
0 0 0 0 0 0 0 0 
##$DE= 6
##$DECBNUC= <off>
##$DECIM= 32
##$DECNUC= <off>
##$DECSTAT= 4
##$DIGMOD= 1
##$DIGTYP= 9
##$DL= (0..7)
0 120 120 120 120 120 120 120 
##$DP= (0..7)
150 150 150 150 150 150 150 150 
##$DP07= 0
##$DPNAME0= <>
##$DPNAME1= <>
##$DPNAME2= <>
##$DPNAME3= <>
##$DPNAME4= <>
##$DPNAME5= <>
##$DPNAME6= <>
##$DPNAME7= <>
##$DPOAL= (0..7)
0.5 0.5 0.5 0.5 0.5 0.5 0.5 0.5 
##$DPOFFS= (0..7)
0 0 0 0 0 0 0 0 
##$DQDMODE= 0
##$DR= 18
##$DS= 0
##$DSLIST= <SSSSSSSSSSSSSSS>
##$DSPFIRM= 0
$$ [...]
##$SUBNAM2= <"">
##$SUBNAM3= <"">
##$SUBNAM4= <"">
##$SUBNAM5= <"">
##$SUBNAM6= <"">
##$SUBNAM7= <"">
##$SUBNAM8= <"">
##$SUBNAM9= <"">
##$SW= 18.051750892319
##$SWIBOX= (0..15)
0 0 2 0 0 0 0 0 0 0 0 0 0 0 0 0 
##$SW_h= 3612.71676300578
##$TD= 16384
##$TD0= 1
##$TE= 0
##$TE2= 300
##$TE3= 300
##$TEG= 300
##$TL= (0..7)
0 120 120 120 120 120 120 120 
##$TP= (0..7)
150 150 150 150 150 150 150 150 
##$TP07= 0
##$TPNAME0= <>
##$TPNAME1= <>
##$TPNAME2= <>
##$TPNAME3= <>
##$TPNAME4= <>
##$TPNAME5= <>
##$TPNAME6= <>
##$TPNAME7= <>
##$TPOAL= (0..7)
0.5 0.5 0.5 0.5 0.5 0.5 0.5 0.5 
##$TPOFFS= (0..7)
0 0 0 0 0 0 0 0 
##$TUNHIN= 0
##$TUNHOUT= 0
##$TUNXOUT= 0
##$USERA1= <user>
##$USERA2= <user>
##$USERA3= <user>
##$USERA4= <user>
##$USERA5= <user>
##$V9= 5
##$VALIST= <valist>
##$VCLIST= <CCCCCCCCCCCCCCC>
##$VD= 0
##$VDLIST= <DDDDDDDDDDDDDDD>
##$VPLIST= <PPPPPPPPPPPPPPP>
##$VTLIST= <TTTTTTTTTTTTTTT>
##$WBST= 1024
##$WBSW= 4
##$XGAIN= (0..3)
0 0 0 0 
##$XL= 0
##$YL= 0
##$YMAX_a= 736856
##$YMIN_a= -814926
##$ZGOPTNS= <>
##$ZL1= 120
##$ZL2= 120
##$ZL3= 120
##$ZL4= 120
##$ABSF1= 10
##$ABSF2= 0
##$ABSG= 5
##$ABSL= 3
##$ALPHA= 0
##$AQORDER= 0
##$ASSFAC= 0
##$ASSFACI= 0
##$ASSFACX= 0
##$ASSWID= 0
##$AUNMP= <proc_1d>
##$AZFE= 0.1
##$AZFW= 0.1
##$BCFW= 1
##$BC_mod= 2
##$BYTORDP= 1
##$COROFFS= 0
##$CY= 11.3945322036743
##$DATMOD= 1
##$DC= 2
##$DFILT= <>
##$DTYPP= 0
##$F1P= 15.6554695791079
##$F2P= 12.8336369535428
##$FCOR= 0.5
##$FTSIZE= 0
##$FT_mod= 4
##$GAMMA= 1
##$GB= 0.15
##$INTBC= 1
##$INTSCL= 1
##$ISEN= 128
##$LB= 0.24
##$LEV0= 0
##$LPBIN= 0
##$MAXI= 10000
##$MC2= 0
##$MEAN= 0
##$ME_mod= 0
##$MI= 1.114404
##$NCOEF= 0
##$NC_proc= 0
##$NLEV= 6
##$NOISF1= 3.799351
##$NOISF2= 2.8
##$NSP= 1
##$NTH_PI= 0
##$NZP= 0
##$OFFSET= 15.70392
##$PC= 1
##$PHC0= -25318.34
##$PHC1= 12.58748
##$PH_mod= 1
##$PKNL= yes
##$PPARMOD= 0
##$PSCAL= 0
##$PSIGN= 0
##$REVERSE= no
##$SF= 200.130013532006
##$SI= 16384
##$SIGF1= 3
##$SIGF2= 2
##$SINO= 400
##$SIOLD= 16384
##$SREGLST= <1H.CDCl3>
##$SSB= 0
##$STSI= 0
##$STSR= 0
##$SW_p= 3612.71676300578
##$SYMM= 0
##$S_DEV= 0
##$TDeff= 0
##$TDoff= 0
##$TI= <>
##$TILT= no
##$TM1= 0
##$TM2= 0
##$TOPLEV= 0
##$USERP1= <user>
##$USERP2= <user>
##$USERP3= <user>
##$USERP4= <user>
##$USERP5= <user>
##$WDW= 1
##$XDIM= 8192
##$YMAX_p= 0
##$YMIN_p= 0
$$ End of Bruker specific parameters
$$ ---------------------------------
##NTUPLES= NMR FID
##VAR_NAME=  TIME,          FID/REAL,        FID/IMAG
##SYMBOL=    X,             R,               I
##VAR_TYPE=  INDEPENDENT,   DEPENDENT,       DEPENDENT
##VAR_FORM=  AFFN,          ASDF,            ASDF
##VAR_DIM=   8192,          8192,            8192
##UNITS=     SECONDS,       ARBITRARY UNITS, ARBITRARY UNITS
##FACTOR=    0.0002768,     1,               1
##FIRST=     0,             0,               0
##LAST=      2.2672688,     0,               0
##MIN=       0,             -814926,         0
##MAX=       2.2672688,     736856,          0
$$ Real data points
##PAGE= N=1
##DATA TABLE= (X++(R..R)), XYDATA
$$ [...]
1965a118J855J123k095j966J682J749j124j984J958L054j631l699k74L154J459
$$ -1118 737 1860 -235 -2201 -519 1230 106 -1878 80 3134 1503 -2196 -2470 684 2143
1980B143k538k154K818K904j850l220L38K274P40j698q28J281O68p76n98R49N2
$$ 2143 -395 -2549 269 3173 1323 -1897 -1559 715 1455 -243 -1071 210 878 102 -496 453 505
1997E05o83o62R55P89j178p24J229J227q17j532j98J164M75j070j62J268O52r89
$$ 505 -178 -840 115 904 -274 -998 231 1458 641 -891 -1089 75 550 -520 -682 586 1238 249
2015B49q50O1M22j59K45M00l11q56K62J178o4q75l38J004R68j580j570J403J948
$$ 249 -601 -540 -118 -277 -32 368 57 -799 -537 641 577 -298 -636 368 1336 -244 -1814 -411 1537
2034A537n51j849M38J810k23j936j038J753J463j140j460J053J600q85j252K90
$$ 1537 986 -863 -425 1385 1162 -774 -1812 -59 1404 264 -1196 -143 1457 572 -680 -390
2050c90J292o32j613J7K258N72j931p67J878Q53k070k200J617K581j71k060l66
$$ -390 902 270 -1343 -1326 932 1504 -427 -1194 684 1537 -533 -2733 -1116 1465 1294 -766 -1132
2067a132K190R54k308k217J377K415l42j478j09J258M28j220p45P98M66r04j91
$$ -1132 1058 2012 -296 -2513 -1136 1279 937 -541 -650 608 1036 -184 -929 -131 335 -569 -760
2084g60J072R19r89r78P22J325o65j807p1J693J122j299j442J005J362l73j427
$$ -760 312 1231 242 -736 -14 1311 646 -1161 -1232 461 1583 284 -1158 -153 1209 836 -591
2101e91o82R27J507l41j679j79J383O49p05j057K94O90L06q39l46N16J034l93
$$ -591 -1273 -346 1161 820 -859 -1038 345 994 289 -768 -474 216 522 -317 -663 -147 887 494
2119D94m85j21P35q25p47L46Q86N8q19K93J097L78j704j218J168J656r08j582
$$ 494 9 -112 623 -202 -949 -603 283 341 -478 -185 912 1290 -414 -1632 -464 1192 284 -1298
2137a298M73K076Q49k466j542J481J678j025j810R96J885J62k108l28J451N57
$$ -1298 -825 1251 2100 -366 -1908 -427 1251 226 -1584 -588 1297 1459 -649 -977 474 1031
2153A031j479j262J429J668p95j513N17J399k76j841J06J598L14j274r43J798
$$ 1031 -448 -1710 -281 1387 592 -921 -404 995 719 -1122 -1016 582 896 -378 -1321 477
2169D77J313j232j955O71J856n34j795k07K276M62j159j370Q76J430m79j434j27
$$ 477 1790 558 -1397 -726 1130 596 -1199 -1406 870 1332 173 -1197 -321 1109 630 -804 -931
2186i31J177L93m72l83K54j82K37r8r9R0m2K7M54J34p10l46M37M91m60j08r1M1
$$ -931 246 639 167 -216 38 -144 93 -5 -104 -14 -56 -29 425 559 -151 -497 -60 431 -29 -137 -228 -187
2208a87L68M11l86n61j13N68O16m57j120J60J334N65j736p92J195J641j044j575
$$ -187 181 592 206 -355 -468 100 716 259 -861 -701 633 1198 -538 -1330 -135 1506 462 -1113
2226a113P8J960M62j753j021J197J260j085j188J176J284r72j339M44J455p8j879
$$ -1113 -1035 925 1387 -366 -1387 -190 1070 -15 -1203 -27 1257 285 -1054 -610 845 767 -1112
2243a112r6K363J34k156p29J911J364j817j421J169K319o18k777m5K265J168k049
$$ -1112 -1208 1155 1289 -867 -1596 315 1679 -138 -1559 -390 1929 1311 -1466 -1511 754 1922 -127
2260a27j350J547Q77o56j402P21J396j40j632K61R10K20j023j80R37L87q36p33
$$ -127 -1477 70 947 291 -1111 -390 1006 866 -766 -505 405 625 -398 -578 359 746 -90 -823
2278h23P09R33o66p73J02J036J06j209k04J082N80n93o10O7M83k63k77J23J04
$$ -823 -114 819 153 -620 -518 518 624 -585 -789 293 873 280 -330 -263 220 -43 -320 -197 -93
2297i3J63L04k9n17n52Q05M63k41q26L9J131N6r51p47R80Q60n47q76J81Q49l85
$$ -93 70 374 345 -172 -724 81 544 303 -523 -484 647 703 -248 -995 -15 845 298 -578 -397 452 67
2318F7n91K12J162l67j055j97J217K5q86l92J150J155j301j970R35K221K9k070
$$ 67 -524 -312 850 483 -572 -769 448 473 -413 -805 345 1500 199 -1771 -836 1385 1414 -656
2336f56p44K107Q28j649j682J278J846j63j654l07J298Pj343n1J479K72j003q69
$$ -656 -1400 707 1535 -114 -1796 -518 1328 1165 -489 -796 502 509 -834 -885 594 866 -137 -1006
2354a006J222P10j148j056R21J388k31j964N5J709P09j465p90P72J042n55j297
$$ -1006 216 926 -222 -1278 -357 1031 800 -1164 -1109 600 1309 -156 -946 -174 868 313 -984
2371i84K38J208P16r29p37M17N3n4j85O1L08q7jJ15R5j91k01j9K41k85K38J05
$$ -984 -746 462 1178 249 -488 -71 -18 -72 -257 -196 112 25 24 139 234 43 -158 -177 64 -221 17 122
2393A22p8N8R7J75l21k74rK93j62m58J81J163K46j239n75O39Q78p01r57O51P74
$$ 122 44 102 199 374 53 -221 -230 63 -99 -557 -376 787 1033 -206 -781 -142 736 35 -922 -271 503
2414E03K41j002m96J152P61j302j235J142J120m69j218M03J529Kj371o44R37M51
$$ 503 744 -258 -754 398 1159 -143 -1378 -236 884 415 -803 -400 1129 1131 -240 -884 53 504
2432E04j096k73J221Q57p86j496P12J016j86j396k26J827N37j417j108J178J429
$$ 504 -592 -865 356 1213 427 -1069 -357 659 473 -923 -1149 678 1215 -202 -1310 -132 1297
2449A297q37j576L5J553N13j415p90J238J015o04r85J90L94j98l60M72P59n9q80
$$ 1297 460 -1116 -1081 472 985 -430 -1220 18 1033 429 -556 -366 28 -170 -530 -58 701 642 -238
2468b38k8M49qn48l88P44O53l08q91J74R21j93n08n29M79P73q2o20k18L99L82
$$ -238 -266 183 175 -373 -761 -17 636 328 -563 -389 532 339 -169 -698 -219 554 472 -148 -366 33 415
2489D15k38l40l55L91N44j35n78J8L17P2j22q8k7L74j98l91M19K39k90j05k31
$$ 415 177 -163 -518 -127 417 282 -296 -278 39 111 -11 -99 -126 248 50 -341 78 317 27 -78 -309
2510c09Q36l13n11j23Q18L24q79r70O85J205l25j255MJ333L89j085p02P02P83
$$ -309 527 214 -297 -420 398 722 -157 -1127 -442 763 438 -817 -813 520 909 -176 -878 -176 607
2529F07n9j158J55R56J55j116l42P96R16q44q53N55J012l49r70K24R26j34r29
$$ 607 548 -610 -455 501 656 -460 -802 -6 910 66 -787 -232 780 431 -539 -315 611 477 -452
2548d52k76J024M96p05o50N37P87m40r32O4Q02L09r18k13O40M48k77p21J31N88
$$ -452 -728 296 792 87 -563 -26 761 321 -611 -547 255 564 -354 -567 73 521 244 -477 -346 242
2568B42J40m23l47K07L65j0l46k8J94K32j59k27k50K47K99k81J19O2J11j80p1
$$ 242 382 -41 -388 -181 184 174 -172 -200 -6 226 67 -160 -410 -163 136 -145 -26 36 147 -33 -104
2589a04Q0K39l0p87Q6J106M8r04l73P71N64n09j124K3J484N41j179q67R38J050
$$ -104 -24 215 185 -602 -516 590 638 -266 -639 132 696 187 -937 -914 570 1111 -68 -935 3 1053
2609A053r02j151L61J144M7j004Q0P70M45j025o97J116N67r29q17O33J105k26
$$ 1053 151 -1000 -639 505 552 -452 -372 398 843 -182 -879 237 804 -125 -942 -309 796 570
2627E70j394K11J321K27j515p84J275J270r59j035K62J468l31j052o35J268P20
$$ 570 -824 -613 708 935 -580 -1364 -89 1181 222 -813 -551 917 586 -466 -1101 167 887
2644H87p09j015P55Q02m00p85R2R86k03p56j61Q18O6l68l42N32M39o45p64N40
$$ 887 178 -837 -82 720 320 -465 -373 613 410 -346 -507 311 377 9 -333 199 638 -7 -771 -231
2664b31L43J20k25k47M73R9l41l56Q6L89M6l24lK82J29l9k99k47K70M93k66l62
$$ -231 112 232 7 -240 233 332 -9 -365 -279 110 156 -168 -171 111 240 201 -98 -345 -75 418 152 -210
2686b10l30N13M14l73l98K18N46q0n43l05Q45R9n12k08K45L35j47n09K89M84l74
$$ -210 -540 -27 387 14 -384 -166 380 300 -243 -548 297 396 -116 -324 -79 256 109 -400 -111 373 -1
2707ao76K80Q31J00p17l86P84P37q18j223O14J217l9j097k40J128M06p73r76N46
$$ -1 -677 -397 434 534 -183 -569 215 952 134 -1089 -475 742 703 -394 -634 494 900 127 -849 -303
2727c03P03k01q64L36O26K35o65j5N71Q0q36l93M95O94m63n18M88P57n44q04Q9
$$ -303 400 199 -665 -329 297 532 -133 -148 423 503 -333 -726 -231 463 0 -518 -30 727 183 -621 -532
2748e32Q95K09m69o84M55M74R4p42J03L58o3o8k47J45p9J65J79J38j0k54l46J67
$$ -532 363 572 103 -581 -126 348 442 -300 -197 161 98 30 -217 -72 -151 14 193 331 321 67 -279 -112
2770a12n5j51L2O38j11m7J10l88m2j50J32J20n6j04L01L66k37m49R5K81j39m45
$$ -112 -167 -318 -286 352 241 194 304 -84 -126 -276 -144 -24 -80 -184 117 483 246 -203 -108 173 34 -411
2792d11N1L73N52k97n54K50N21j76r94o2P10M96m05l97L04P24l34q98K6O08O9
$$ -411 -360 13 565 268 -286 -36 485 309 -685 -747 -37 459 54 -343 -39 685 351 -547 -521 87 156
2813A56l78j9P23p3m63k70J72N63n75o71N27P35j91p07J08O47L50q63n16K61Q92
$$ 156 -222 -241 482 409 -54 -324 -152 411 -164 -835 -308 427 236 -471 -363 284 634 -229 -745 -484 408
2834D08j19o79K50M02K76n15l74K64J29k21J32M4L10k06p0J72j12l00p5J16K64
$$ 408 289 -390 -140 262 538 23 -351 -87 42 -179 -47 -3 307 101 31 203 91 -209 -284 -168 96
2855I6m3l2k36L50K15k02l72l41L43K58L29k62k70L28K86k16n72k45M17N78l30
$$ 96 53 21 -215 135 350 148 -224 -565 -222 36 365 103 -167 161 447 231 -341 -586 -169 409 79
2876G9m35j2P78j41m61m91M85L98n3p13M47N08k31l75J10K80P5o32j51R33p2l86
$$ 79 -356 -368 410 269 -192 -683 -198 200 147 -566 -119 389 158 -217 -107 173 248 -384 -535 398 326 -60
2898f0l37N84L38l66n29m9Q43j9p06j72O22N20p58k52M94J83l25o43J57Q86j35
$$ -60 -397 187 525 159 -370 -419 424 405 -301 -473 149 669 -89 -341 153 336 11 -632 -475 411 276
2919B76o76k91P57M39m88k97J31M04k96l47L21J63J71l30j43J77K08m88n6M22
$$ 276 -400 -691 66 505 17 -280 -149 255 -41 -388 -67 96 267 -63 -206 -29 179 -309 -365 57
2939E7Q9k68K4j57K47L87l79j36J41L72m76qK9K08l6J24k41o5K05j60L6j92J2
$$ 57 146 -122 -98 -255 -8 379 0 -136 5 377 -99 -107 -78 130 94 218 -23 -88 117 -43 -7 -199 -187
2962a87o5N88k10k45L66j19K4k90J14K45j37l96K25K27J08m10j68K84K13j75o42
$$ -187 -252 336 126 -119 247 128 152 -138 -24 221 84 -312 -87 140 248 -162 -330 -46 167 -8 -650
2983f50O00N37k03o17j05P58J88n38o94N78N90j44o96L85L44Jm81k24K79L87m31
$$ -650 -50 487 284 -333 -438 320 508 -30 -724 -146 444 300 -396 -11 333 334 -147 -371 -92 295 -136
3004a36k29N30K58l84l79N07M61k70j037L87N69P4m45k90J85O44m89m60K04M87
$$ -136 -365 165 423 39 -340 167 628 358 -679 -292 277 351 -94 -384 -199 445 -44 -504 -300 187
3024A87j37k23N4M68j60j15j10j39L00J84o07K18K09K33m85J51j91M05l32j25
$$ 187 50 -173 -119 349 189 74 -36 -175 125 309 -298 -80 129 362 -123 28 -163 242 -90 -215
3044b15n0K13J15J22j33k1J39J65l16l23N4L90r0l08K02K28J08l38k78J7N83l71
$$ -215 -265 -52 63 185 52 31 170 335 19 -304 -250 140 50 -258 -56 172 280 -58 -336 -319 264 -107
3066a07l23J89N55J68n36l51M83N45o02m75L01K10J81l68k0K65L79m28n26K93
$$ -107 -430 -241 314 482 -54 -405 78 623 21 -454 -153 57 238 -130 -150 115 494 66 -460 -167
3086a67N17j27r08M04R58n10k77n5L59J00o21n61P42P29m28m78j6O99Q7m53p11
$$ -167 350 223 -685 -281 677 167 -110 -165 194 294 -327 -888 -146 583 155 -323 -339 360 447 -6 -717
3107g17N03M86k76m75M51M57j08n07L06l09L54n33o4M63M40l77j52L68Q4m59n12
$$ -717 -214 272 -4 -479 -28 429 321 -186 120 -189 165 -368 -432 31 471 94 -58 310 394 -65 -577
3128e77J36M13L19l01J89o2K40j88m11R3J82%pj96K8M93Q9l41k94p1L03p0j68
$$ -577 -441 -28 291 -10 179 117 357 169 -242 -149 33 33 26 -170 -142 351 440 99 -195 -266 37 -33 -201
3151b01J92K52K03n58l01L58J92l33j30J47K75J4j51J27K15R2l54n69L87L02p1
$$ -201 -9 243 446 -112 -413 -55 137 -196 -326 -179 96 110 -41 86 301 393 39 -530 -143 159 88
3172H8m12N3O36m5l24k73K79L87l46o19J97P82j72j61J2J59J0n99j62K42K44L02
$$ 88 -324 -271 365 320 -4 -277 2 389 43 -576 -379 403 231 70 82 241 251 -348 -510 -268 -24 278
3194B78m62K61J48k8k41k47N04j77l24J9L33L02j25o07K63L12k12m64j44N44L97
$$ 278 -184 77 225 197 -44 -291 213 36 -288 -269 64 366 241 -366 -103 209 -3 -467 -611 -67 330
3215C30k46j25pK48K12n44l31L50K53k94j99M89P3j09j49q5M48l09k02L04J32
$$ 330 84 -41 -48 200 412 -132 -463 -113 140 -154 -353 136 209 100 -49 -134 314 5 -197 107 239
3236B39k75j00J40R4K2j66k85r9M77J94p9j62n2J36J78o34l5K38L11L4m57O8K29
$$ 239 -36 -136 4 98 120 -46 -331 -430 47 241 162 0 -52 84 262 -372 -407 -169 142 176 -281 -213 16
3259A6K67j73k57o6K36P5k68J4L86L4k77l4n1K92l13j79K38L87l21k21q8N88K9
$$ 16 283 110 -147 -213 23 98 -170 -156 230 264 -13 -47 -98 194 -119 -298 -60 327 6 -215 -303 285 314
3282C14m88o8K22L09j41o08M03L83l9m35j18M62M0j79k83L47K23j04m63J13K92
$$ 314 -174 -242 -20 289 148 -460 -57 326 287 -148 -266 196 236 57 -226 121 344 240 -223 -110 182
3303A82Ol71j66K61M56k60l72J35L98k71j24N4K40k03j43P6J03J13j97oJ77J23
$$ 182 188 -183 -349 -88 368 108 -264 -129 269 -2 -126 -72 168 -35 -178 -102 1 114 -83 -89 88 211
3325B11j90K1oR9j22j50J47l62K61K84k0l91m6J58L04k69j02K3L38R4j59P8k20
$$ 211 21 42 36 135 13 -137 10 -352 -91 193 173 -218 -264 -106 198 -71 -173 -150 188 282 123 201 -19
3348a9K86l30j72J29J8J91k56K22K12j13m44m3K32m1pj33M42K28k29m47J86M90
$$ -19 267 -63 -235 -106 -88 103 -153 69 281 168 -276 -319 -87 -128 -135 -268 174 402 173 -274 -88 402
3370D02l64n96K08N33K06l67k0J4K83k55l00K11L3R4j01j79M37L8k78j48J25J1
$$ 402 38 -558 -350 183 389 22 2 16 299 44 -256 -45 -12 82 -19 -198 239 277 -1 -149 -24 -13
3392a3l7m90K41O46M2m35k66M91q3k47k02O0L72R1l49K43J55L2k39m25L92j3o6
$$ -13 -50 -540 -299 347 389 -46 -312 179 96 -151 -353 -293 79 170 -179 64 219 251 12 -413 -21 -34 -100
3415a00rL30p6L8p9r7o6L9J06l74M14k7M5J59j13N8k97j69k8K96n4J53j48K44
$$ -100 -109 221 145 183 104 7 -59 -20 86 -288 126 99 144 303 190 248 -49 -218 -246 50 -4 149 1 245
3439B45lo6l7l71j59J06L30q2l7J66j2L24n20p1K15q7j18O0R9K66l4k57m3J42
$$ 245 242 176 139 -232 -391 -285 45 -37 -74 92 80 404 -116 -187 28 -59 -177 -117 -18 248 214 -43 -86 56
3463E6L8l94J67K77l9j76j50M56L0j3p29J49N08O4o75L00L74J88m49k32l1M37
$$ 56 94 -300 -133 144 105 -71 -221 235 265 252 -477 -328 180 244 -431 -131 243 431 -18 -250 -281 156
3485A56j78k90KK67N68n97Q4j22M28m25k59J0K68o9L21rk1J02j77k62L89l76J01
$$ 156 -22 -312 -310 -43 525 -72 12 -110 318 -107 -366 -356 -88 -157 164 155 134 236 59 -203 186 -190 -89
3508h9l74L00K87L3j06j75R0j05r3N1LK29K9k2J6p5J43k61J36j45J50M6K07j85
$$ -89 -463 -163 124 157 51 -124 -34 -139 -232 -181 -178 51 80 58 74 -1 142 -119 17 -128 22 68 275 90
3532I0j26M58k72k14j39J47R4k99J81L6M17j71l06L19q3R3m79K45k1J00M0j48
$$ 90 -36 422 150 -64 -203 -56 38 -261 -80 -44 373 202 -104 215 132 225 -254 -9 -30 70 110 -38
3554c8j8L70k31j96J4R1Q0j82r7N70J30j82m35J40K14l53ql7k0N68j01k66r7K48
$$ -38 -56 314 83 -113 -99 -8 72 -110 -207 363 493 311 -124 16 230 -123 -131 -168 -188 380 279 13 -84 164
3578A64j34k58j92J12N05j12j60Q2J61l05j93R5L18l12r1O9N84j19j07%k35J79
$$ 164 30 -228 -420 -308 197 85 -75 7 168 -137 -330 -235 83 -229 -320 -251 333 214 107 107 -128 51
3600E1q1j49j54L90P2m3l9j24m2k6J20n0o0J78K11j05j52J8j9L7k7J75j27k57
$$ 51 -30 -179 -333 57 129 86 47 -77 -119 -145 -25 -75 -135 43 254 149 -3 15 -4 33 6 181 54 -203
3624b03K82J86k7o7l10J63Q4L2l58M5L00J06k83r6Q9K95k58J73k39j70J26J9N7
$$ -203 79 265 238 171 -139 24 108 140 -218 -173 127 233 -50 -146 -57 238 -20 153 -86 -256 -130 -111 -54
3647e4n9L42N1l61j80M45m6j83n7J94K09k03l13l2M05Ok95k30N87j5l12O1p4K09
$$ -54 -113 229 280 -81 -261 184 138 -45 -102 92 301 98 -215 -247 158 164 -131 -361 226 211 -101 -40 -114 95
3671I5Ql17J72K79om12k86M71M7n9m3k50M98k19j54P7J84J06m72q8K84K70n6k42
$$ 95 103 -214 -42 237 231 -181 -467 4 51 -8 -51 -301 197 -22 -176 -99 85 191 -281 -369 -85 185 129 -113
3695a13J96j71K14m50K58J25J66l25n7j51N18j69l12K74r3J27p1M7n7J37K13l59
$$ -113 83 -88 126 -324 -66 59 225 -100 -157 -308 210 41 -271 3 -90 37 -34 13 -44 93 306 -53
3717e3mj1K31k08l2m8L67j60J47m12JQ1j4O3r1J87J44l7k05K06j02j06k51K02
$$ -53 -57 -68 163 -45 -77 -125 242 82 229 -183 -182 -101 -115 -52 -143 44 188 151 -54 152 50 -56 -307 -105
3741a05J47j17r3R8K12P1k82k92J41L08Mm17J38K99K97l35m13N34j35k58l97M92
$$ -105 42 -75 -168 -70 142 213 -69 -361 -220 88 92 -325 -187 112 409 74 -339 195 60 -198 -595 -103
3763a03K23j49L4j37M11j03l37j41J11J80J6k69L06L11rl81o6N0J09k83q9L07
$$ -103 120 -29 5 -132 279 176 -161 -302 -191 -11 5 -264 42 353 344 -37 -103 -53 56 -227 -316 -9
3785iJ94L0l17L3O43n55j75o3K7K43Ol2j67N12j34k61j56J38o4J88k5mK54j90
$$ -9 185 215 -102 -69 574 19 -156 -219 -192 51 57 25 -142 370 236 -25 -181 -43 -107 81 56 52 306 116
3809A16J15j91j64j73J3L04J9M4K42j27j56M8j01m0M5j98J56M12k74p0J80L6j79
$$ 116 231 40 -124 -297 -284 20 39 83 325 198 42 90 -11 -51 -6 -204 -48 364 90 20 200 236 57
3832E7k91Rp0M31o3Q2J89j33k4l57j45L32k78L3J26K58L59m10k3l5j68nl01L63
$$ 57 -234 -225 -295 136 73 155 344 211 187 -170 -315 17 -261 -228 -102 156 515 105 82 47 -121 -126 -427 -64
3856f4J62m1j23P7L32k67J7l93J43J26r7rj25O45J89m63j18j64K19p6l08M09O7
$$ -64 98 57 -66 11 343 76 93 -300 -157 -31 -128 -137 -262 383 572 109 -9 -173 46 -30 -338 71 138
3879A38L6k3q3R5n1k33p1L8J01L9j12J69K30r3j76k22K16k41K56j55N6L74R0l32
$$ 138 174 151 68 163 112 -121 -192 -154 -53 -14 -126 43 273 180 4 -218 -2 -243 13 -142 -86 288 378 46
3903D6k79O2K5K66l14o3K80K97m8l38p4J80Nk41J05R1K47j63o0L5Q4mk08j01J15
$$ 46 -233 -171 -146 120 -194 -257 23 320 272 -66 -140 40 45 -196 -91 0 247 84 24 59 143 139 -69 -170 -55
3928e5L2j1j55J26J32J37l57K85J20m88l3j54N60J07k5l01K40M0j77j75l30O04
$$ -55 -23 -34 -189 -63 69 206 -151 134 254 -234 -267 -421 139 246 221 -80 160 200 23 -152 -482 122
3950A22k4k01k9K59K12m38qm8L20l55J76j17L03pk39K8J29J42l01j90J24L39K4
$$ 122 98 -103 -132 127 339 -99 -107 -155 165 -190 -14 -131 172 165 -74 -46 83 225 -76 -266 -142 197 221
3973B21m61L5L57M4k11j08M2K30j67j90J40L04j77j04j89L30j78J02l18O8J36
$$ 221 -240 -205 152 196 -15 -123 -81 149 -18 -208 -68 236 59 -45 -234 96 -82 20 -298 -230 -94
3994i4J94ml16M25k52M6j73R4Q8j20j1o6J18J69j42q9L1L62k70o5j27K21L77k40
$$ -94 100 96 -220 205 -47 -1 -174 -80 8 -112 -123 -189 -71 98 -44 -133 -102 260 -10 -75 -202 19 396 156
4018A56k94N3K59j96J64l08K17J62l74J02N6J14q2j14N9Q1R9n6k21J74J04j67
$$ 156 -138 -85 174 -22 142 -166 51 213 -161 -59 -3 111 29 -85 -26 55 154 98 -123 51 155 -12
4040a2k70K47J93M4l21q1L62k69K66m02M08J14j7l39j6M30k44k57kL69J96l92
$$ -12 -282 -35 158 202 -119 -200 162 -107 159 -243 165 279 262 -77 -93 337 93 -164 -166 203 399 7
4062Gj59L53j19k73J79k01J91K62k17n1L47j76Pk32j70N9J02J43l42M71M1q0o5
$$ 7 -152 201 82 -191 -12 -213 -22 240 23 -28 319 143 150 -82 -252 -193 -91 52 -290 181 222 142 77
4085G7j43J09J43l48K74J36Qj93l3J28R8j54m03N8L0J20R1lO3Q2K10k88m48J16
$$ 77 -66 43 186 -162 112 248 256 63 30 158 256 102 -301 -243 -213 -93 -2 -5 58 140 350 62 -386 -270
4109b70M49k21q0K09K31k43J27l44J50j98j3k64N22L71k54j17M5Q6P1n47j96L23
$$ -270 179 -42 -122 87 318 75 202 -142 8 -190 -203 -467 55 426 172 55 100 186 257 -290 -486 -163
4131a63O2M6j8M5N53k27m48j86L75j98r0J2L97k5K56n21J04j01r0j51K37K91P9
$$ -163 -101 -55 -73 -28 525 298 -150 -336 39 -159 -249 -237 160 135 391 -130 -26 -127 -217 -368 -131 160 239
4154B39j08k39L19J93m89l04J66J31J7j43J06J68L50l47k42J5P3n7k60Q6O43k8
$$ 239 131 -108 211 404 -85 -389 -223 -92 -75 -218 -112 56 406 59 -183 -168 -95 -152 -412 -326 317 289
4176B89N6r9k19q7J79o44J79L22K2L47k68K01j10j18k05l16J01K30jM3M61l0j45
$$ 289 345 246 27 -60 119 -525 -346 -24 -2 345 77 278 168 50 -155 -471 -370 -140 -141 -98 363 333 188
4199A88j49l97j2K64j03j5K95L76j38l44m6o4J64j18j77K69L80j93j79J80J3j35
$$ 188 39 -358 -370 -106 -209 -224 71 447 309 -35 -81 -145 19 -99 -276 -7 373 180 1 181 194 59
4221E9k04l36M05K64j79j4k3M54j60m48q5J01N8j90p7L55M00j50k77o1J00J0k31
$$ 59 -145 -481 -76 188 9 -5 -28 426 266 -182 -267 -166 -108 -298 -375 -20 380 230 -47 -108 -8 2 -229
4244b29p0L52J65k36k9q3P55k93o80L8j04L71q8J9K25L5O6n07P5J0J2N8K63J06
$$ -229 -299 53 218 -18 -47 -130 625 332 -348 -310 -414 -43 -131 -112 113 148 214 -293 -218 -208 -196 -138 125 231
4268B31R3j25k23K08J80o16q0M04p0r4R6o3K33R5j98k34o6Q7L23k67p1M30J9k58
$$ 231 324 199 -24 184 364 -252 -332 72 2 -92 4 -59 174 269 71 -163 -229 -142 181 -86 -157 273 292 34
4292C4j08K6Q1r7Pj02J73J37Q2o1j32NL0j40j81J1K19J62n0j38K50k42K08l54
$$ 34 -74 -48 33 -64 -57 -159 14 151 233 172 40 45 75 -65 -246 -235 -16 146 96 -42 208 -34 174 -180
4316a80J07K37k15k24L63j9K02m33j75M52l55K70l55J71M95k92m17K15L01K24
$$ -180 -73 164 -51 -275 88 69 271 -162 -337 115 -240 30 -325 -154 341 49 -368 -153 148 372
4336C72o07LL03k2k51J76k33M74k83r7J9K95l41O5j16K09K8j07n8J60mO9p7j42
$$ 372 -235 -232 71 49 -202 -26 -259 215 -68 -165 -146 149 -192 -127 -243 -34 -6 -113 -171 -11 -15 54 -23 -165
4360a65J34J97k83J70J4J29r6k10QJ80N1l32KK7K24j40K6Q1J67O8l40Mk06Q5M3
$$ -165 -31 166 -117 53 67 196 100 -110 -102 78 129 -203 -201 -174 50 -90 -64 17 184 252 -88 -84 -290 -205 -162
4385a62Q9k0N0J76M4j07l2K68l46j49J07K30Q1ql91Q9K35m09J05n4L66j66K6J68
$$ -162 -73 -93 -43 133 177 70 38 306 -40 -189 -82 148 229 221 -170 -81 154 -255 -150 -204 162 -4 22 190
4409A90J88k30j3k97K8L15k54j45J41K75K12l79j15M5J66j30n09N21J26J1j57
$$ 190 378 148 135 -162 -134 181 -73 -218 -77 198 410 31 -84 -39 127 -3 -512 9 135 146 -11
4430a1L3K77r4l60Op4K99j21n6J68J22J0l87j07K68j05J24m27N14J67P8l24L8
$$ -11 22 299 205 -155 -149 -223 76 -45 -101 67 189 199 -188 -295 -27 -132 -8 -435 79 246 324 0 38
4453C8j5o6k49q7J44K00J20R1K5m1Rk99M7j49P0J27j09L4L84j81j17M6l08J6J27
$$ 38 23 -43 -292 -379 -235 -35 85 176 201 160 169 -130 -83 -232 -162 -35 -144 -110 274 93 -24 22 -286 -270 -143
4478a43J3l9K86K87j04j25j8n0l49l4j72M48M56n12J08n2L85m49k71OL99m03L97
$$ -143 -130 -169 117 404 300 175 157 107 -242 -276 -448 0 456 -56 52 0 385 -64 -335 -329 70 -333 64
4501F4J17J58R8l80k71K59r3j98k34M27K24M48m07m3j20J94m31k44J71L64L52
$$ 64 181 339 437 57 -214 45 -48 -246 -480 -53 171 619 212 169 49 243 -188 -432 -261 103 455
4522D55k33j62K3J58l39j65K24Lj39l1L18J09J30j59j46q7m8m15K15J2N88k22
$$ 455 222 60 83 241 -98 -263 -39 -36 -175 -206 112 221 351 192 46 -41 -89 -504 -289 -277 311 89
4544H9J48j58J18j69j98k15K83J89J8J59l04M74k15k12k68J3J08m3r3K98J04J63
$$ 89 237 79 197 28 -170 -385 -102 87 105 264 -40 434 219 7 -261 -248 -140 -183 -276 22 126 289
4566B89l32N3M9k22j2K17j56K0K34k8P9j22R7l11k53K81K8J92K5K0K9J73l67j89
$$ 289 -43 10 59 -163 -175 42 -114 -94 140 112 191 69 166 -145 -398 -117 -89 103 128 148 177 350 -17 -206
4590b06p9J05M1j5J20M14L7l65k50J93j0j82j27J58M90O1j34j70j33K71k35k25
$$ -206 -285 -180 -139 -154 -34 380 417 52 -198 -5 -15 -197 -324 -166 324 385 251 81 -52 219 -16 -241
4612b41J2L21j70j11N98k97Q4j16m39L46L0o2k22L12L13j17j20k12j46L81k21
$$ -241 -229 92 -78 -189 409 112 196 80 -359 -13 17 -45 -267 45 358 241 121 -91 -237 144 -77
4633g7k74K71K82PK5l36K10k91R8m48L78J92j93O8j01M9K45j34j06O9O4r6J8J28
$$ -77 -351 -80 202 209 234 -102 108 -183 -85 -533 -155 37 -156 -88 -189 -140 105 -29 -135 -66 -2 -98 -80 48
4657D8K75j75j99j05K17j79N3q0R6J33J35j99j33K69j74j68k46L34J27J19k54
$$ 48 323 148 -51 -156 61 -118 -65 -145 -49 84 219 20 -113 156 -18 -186 -432 -98 29 148 -106
4678a06q9M91l81J43k3N4R9k74P0O3q2J01J15l69J31J96k44r7J23K53J63m61p2
$$ -106 -195 296 -85 58 35 89 188 -86 -16 47 -35 66 181 -188 -57 139 -105 -202 -79 174 337 -124 -196
4701a96JK30k7k49K31R6p1k05o7L46Lk64m0K44R1q9j62J12j4k4J2k04N6M64j96
$$ -196 -195 35 8 -241 -10 86 15 -190 -257 89 92 -172 -212 32 123 34 -128 -16 -30 -54 -42 -246 -190 274 78
4726G8R3k44J2J01j64k34L88N1J3k34J13J96j31p6L1R8k48J04J51J51j02p8k94
$$ 78 171 -73 -61 40 -124 -358 30 81 94 -140 -27 169 38 -38 -7 91 -157 -53 98 249 147 69 -225
4749b25J44j42J13j10j25L46K93m4j52n7q6P9l81J8L29L2K22j67J1K63k97l85
$$ -225 -81 -223 -110 -220 -345 1 294 250 98 41 -45 34 -347 -329 0 32 254 87 98 361 64 -321
4771c21K13J65j04j34K15Q3L94k14n78K12m7N1r9j51L80L76r5n47M15k30p6k06
$$ -321 -108 57 -47 -181 34 117 511 297 -281 -69 -116 -65 -164 -315 65 441 346 -201 214 -16 -92 -298
4793b98R0Q1J97q3J36J28M7k98l27L10m2K73m19j32N32L77m85j95L3Rl05p2L87
$$ -298 -208 -127 70 -13 123 251 298 0 -327 -17 -59 214 -205 -337 195 572 87 -108 -75 -66 -371 -443 -56
4816e6K74N0k69l02O09m10k17KJ54M12k65M0r5M00j64j75k23j7K44j32k8J50K25
$$ -56 218 268 -1 -303 306 -104 -321 -319 -165 247 -18 22 -73 327 163 -12 -235 -252 -8 -140 -168 -18 207
4839B07Q4j45l63Q7p3RR3r3L76m1j3J30k19j8n0k68K15J15N3L9k50K58L35m57
$$ 207 291 146 -217 -130 -203 -194 -101 -194 182 141 128 258 39 21 -29 -297 -82 33 86 125 -125 133 468 11
4863A1k27j63K43K45j79n1L61q5K90k52k09J42l7m47K63J07M2J80j91J05j2r9
$$ 11 -216 -379 -136 109 -70 -121 240 155 445 193 -16 126 89 -358 -95 12 54 234 43 148 136 37
4885C7l97J97O1J86J38m5R8J31l87o4j51J35J67k88J56J46J62k15j56J6LN0k86
$$ 37 -360 -163 -102 84 222 177 275 406 19 -45 -196 -61 106 -182 -26 120 282 67 -89 -73 -70 -20 -306
4908c06J66L08L08j52l04J64o6j03m73R7M14L6j55J7M29m7l35k34K17r1Jm2q7
$$ -306 -140 168 476 324 20 184 118 15 -458 -361 53 89 -66 -49 380 333 -2 -236 -19 -110 -109 -151 -238
4931b38N23k32j52N3J02L5j41k34J80J34J34Jj36K26J11j74m96J27q6L22J4q0
$$ -238 285 53 -99 -46 56 91 -50 -284 -104 30 164 165 29 255 366 192 -304 -177 -263 59 73 -7
4953gJ90K18l45m7j89J36Q0M0r1N3L24k76j16k15K45l07K33j29Q5K88M1j24J38
$$ -7 183 401 56 9 -180 -44 36 76 -15 38 362 86 -30 -245 0 -307 -74 -203 -118 170 211 87 225
4976B25K5k30k08j20M37q4k36N8J56K55k07l02K69r2J34k50q4K19L13n3m11J33
$$ 225 250 20 -188 -308 129 45 -191 -133 23 278 71 -231 38 -54 80 -170 -254 -35 278 225 -186 -53
4998e3Q8j09r0J86Q7j55K42j32K3q0m7k44L84o1K66k43q1J94j1p4k23M4J05P5
$$ -53 35 -74 -164 22 109 -46 196 64 87 7 -40 -284 100 39 305 62 -19 175 164 90 -133 -89 16 91
5022I1j81R1M5J42k59QK06pj82q4o2J21J7LJ48o9q9Q9Jj47K56j08k55J49l2K21
$$ 91 -90 1 46 188 -71 -63 143 136 -46 -130 -192 -71 -54 -51 97 28 -61 28 29 -118 138 30 -225 -76 -108 113
5048A13j29r6J89M0l4r2P6o9L5J7k87J93K15o6l17L53l20L02j19p8J03K12k51
$$ 113 -16 -112 77 117 83 -9 67 -2 33 50 -237 -44 171 105 -212 141 -179 123 4 -74 29 241 -10
5071a0K7J04J44j75k58j33K13O6k1l4j16L33k0j61q6L45k66k3k30Q4K66J67k12
$$ -10 17 121 265 90 -168 -301 -88 -22 -43 -77 -193 140 120 -41 -127 218 -48 -71 -301 -217 49 216 4
5094Dj76L34J9m10k64M65L01k46k42K07J90n1j92j45L78j47j19o3L56P3j98l00
$$ 4 -172 162 181 -229 -493 -28 273 27 -215 -8 182 131 -61 -206 172 25 -94 -157 199 272 74 -226
5116b26K31K83j57m32j85O02K71l30k8q1J6q8k77J96J79j24J40L1J05NJ60n21
$$ -226 5 288 131 -301 -486 116 387 57 29 -52 -36 -124 -401 -205 -26 -150 -10 21 126 131 291 -230
5138b30RQM1K4P6j19L04J58k58k6Q6j28k36J23K18k1J51l47K4J55K85m50j34L32
$$ -230 -221 -213 -172 -148 -72 -191 113 271 13 -13 73 -55 -291 -168 50 29 180 -167 -143 12 297 -153 -287 45
5162D5J75k36j2J17K65j58l81P6l7L6mJ4J39M27j51k13j29K8j0j59r8J30L47r
$$ 45 220 -16 -28 89 354 196 -185 -109 -146 -110 -114 -100 39 466 315 102 -27 1 -9 -168 -266 -136 211 202
5186B02j04J02K11m75j75j70L11K16l22L37J32lp4j58k12nJ12j94J33L81j36J04
$$ 202 98 200 411 -64 -239 -409 -98 118 -204 133 265 262 188 30 -182 -187 -75 -269 -136 245 109 213
5208B13m41K33J39j43l15j9L83L09k0k38l2L50l60j56n1j36K09K5K21Q1L9N3l20
$$ 213 -228 5 144 1 -314 -333 50 359 339 101 69 419 59 -97 -148 -284 -75 -50 171 252 291 344 24
5231B4j56j68K48k15K90N0L13k35j3k09M2l2j42l15L11N98k14m9j65J84q6j46
$$ 24 -132 -300 -52 -267 23 73 386 151 138 -71 -29 -61 -203 -518 -207 391 177 128 -37 147 61 -85
5253h5j67n9K25K87l94M96j05j22l64j9L74j06Q2j72K55J46o6k77K2K01l33l20
$$ -85 -252 -311 -86 201 -193 303 198 76 -288 -307 67 -39 43 -129 126 272 206 -71 -49 152 -181 -501
5275e01J77L25K46q5j34N8J29k71l49K59l5K70r1o9Q3K89k85m05J93L44j48j50
$$ -501 -324 1 247 162 28 86 215 -56 -405 -146 -181 89 -2 -71 12 301 16 -389 -196 148 0 -150
5297a50m7L39K4j12q9PJ28Qk39n4K74J28k66m8J85J31m0m34L53o7q4r3j5J10L06
$$ -150 -197 142 166 54 -35 -28 100 108 -131 -185 89 217 -49 -97 88 219 179 -255 98 31 -53 -146 -161 -51 255
5322B55j72ok0l9qj15O4qM2K9j44p4K12L8j81n1K06p3Q3Q6M4p0J9n23L66J01j08
$$ 255 83 77 57 18 10 -105 -41 -49 -7 22 -122 -196 16 54 -127 -178 28 -45 38 124 168 98 117 -406 -40 61 -47
5349d7J00p2J26J75n36J47r0K14p1K32l38M45j80n9k06J19N4L7k51j03M33K17
$$ -47 53 -19 107 282 -254 -107 -197 17 -54 178 -160 285 105 46 -160 -41 13 50 -201 -304 129 346
5371C46n80R7K75J6j20J21k35K53r7j07kk58K07n7Lm2L89l26K18k36P9K29m71
$$ 346 -234 -137 138 154 34 155 -80 173 76 -31 -33 -291 -84 -141 -138 -180 209 -117 101 -135 -56 173 -298
5394b98L05M5k6K9j98J26K87nk94j25k2L89m51P4M9P7K88o0k07J06j60j41j2K55
$$ -298 7 52 26 55 -143 -17 270 265 -29 -154 -176 213 -238 -164 -115 -38 250 190 -17 89 -71 -212 -224 31
5418C1mR7j71n4m4J97r6j09O0O4L4J98j76O0m1l22PR2L58P0k35n4K6P3j8j68N3
$$ 31 27 124 -47 -101 -145 52 -44 -153 -93 -29 5 203 27 87 46 -276 -269 -177 181 251 16 -38 -12 61 43 -125 -72
5445g2K27J32n04J74K48r1j59j12K08J07l03j28J42K97J23k06k92L07L2k23j14
$$ -72 155 287 -217 -43 205 114 -45 -157 51 158 -145 -273 -131 166 289 83 -209 98 130 -93 -207
5466b07N2K08J6k56K72P5L7m60J37K9o8K5J6j27M10J7k87J24j44L31o12M4N2O41
$$ -207 -155 53 69 -187 85 160 197 -263 -126 -97 -165 -140 -124 -251 159 176 -111 13 -131 200 -412 -368 -316 325
5490C25k57m2O9k9L9k82n9K12j05L05k86K39n4L07l62j77J31J57l16j3L04J28
$$ 325 68 26 95 66 105 -177 -236 -24 -129 176 -110 129 75 382 20 -157 -26 131 -185 -198 106 234
5512B34J38m17M5q2J65k25l40J09L16K16l4r9N3N3k74j57q5L10L9n6k7J03K24
$$ 234 372 -45 0 -82 83 -142 -482 -373 -57 159 125 26 79 132 -142 -299 -384 -74 -35 -91 -118 -15 209
5535B09m4k93Q8n1N3j06K09J49k59k4k11J23K09k66Q0j0K19m7R9j89J74o9q2k82
$$ 209 165 -128 -40 -91 -38 -144 65 214 -45 -69 -280 -157 52 -214 -134 -144 75 28 127 -62 112 43 -39 -321
5559c21L24K25j79L7j42L79j96J02m01P6J96j00j26P9M9J35k34KK15n9k98R6R9
$$ -321 3 228 49 86 -56 323 127 229 -172 -96 100 0 -126 -47 2 137 -97 -95 120 61 -237 -141 -42
5582d2J7o8K01j90L58m7j61j35j27J58k0L9K34J71j88l21j00J67P2k6k41L08K01
$$ -42 -25 -93 108 -82 276 229 68 -67 -194 -36 -56 -17 217 388 200 -121 -221 -54 18 -8 -249 59 260
5605B60J24j51j28l2j73lJ49j24N4L3K29n0n1N0j70l42k6L01J6Q9j21K96P9j04
$$ 260 384 233 105 73 -100 -103 46 -78 -24 9 238 188 137 187 17 -325 -351 -50 -34 55 -66 230 309 205
5629B05n0r6o9nj54J99K30j78j5j02k1K11m90L63j65K51K5o6J09j61M2k29n7L
$$ 205 155 59 -10 -15 -169 30 260 82 67 -35 -56 155 -335 28 -137 114 139 73 182 21 63 -166 -223 -220
5653b20J74K5L2K38R3m14O0k67M98k34J12m07M36j05K07k69K0K2J2r4r0K37K07
$$ -220 -46 -21 11 249 342 -72 -12 -279 219 -15 97 -310 126 21 228 -41 -21 1 13 -81 -171 66 273
5676B73j63l09M40nk3j33n2J19J1j15j21K15m2K8K1m55K72J08l42j04N65j67L8
$$ 273 110 -199 241 236 213 80 28 147 158 43 -78 137 95 123 144 -311 -39 69 -273 -377 188 21 59
5699E9l08M7K30j42J4j18R3J00J96%j08%l6j43N2J9j8N2R1j28k2pl1k33K44J25
$$ 59 -249 -202 28 -114 -100 -218 -125 -25 171 171 63 63 27 -116 -64 -45 -63 -11 80 -48 -70 -77 -108 -341 -97 28
5725B8J09k4j80L72m86J48j35J29O2k23J24R7J10j25j15L7K37j83j86K3mM09k88
$$ 28 137 113 -67 305 -181 -33 -168 -39 23 -200 -76 21 131 6 -109 -72 165 -18 -204 -181 -185 224 -64
5748f4N5O2J95k09k98K0J86K44j61K6k35L07q0j99R1K72j53j24kR6J44j70n0L6
$$ -64 -9 53 248 39 -259 -239 -53 191 30 56 -179 128 48 -151 -60 212 59 -65 -67 29 173 3 -47 -11
5772a1P6n9n6j49K25J17j88k01J11K81j85j73J07L05O0j76m9M0rj02k58J00K84
$$ -11 65 6 -50 -199 26 143 -45 -246 -135 146 -39 -212 -105 200 260 84 35 75 66 -36 -294 -194 90
5795I0QJ04j54J8K19j69l9P4j41J09k2N6k14K07k00Q4k99J05R7j98L52j01L18
$$ 90 98 202 48 66 285 116 77 151 10 119 97 153 -61 146 -54 30 -269 -164 -67 -265 87 -14 304
5818C04l04J62j79nL9k34l0K25k1L47k3q4J9l05J9m1O8l1Q9L5J03k4Om70K42K8
$$ 304 0 162 -17 -22 17 -217 -247 -22 -43 304 281 197 216 -89 -70 -111 -43 -74 15 50 153 129 135 -335 -93 -65
5844f5Q5j24J45j74K21K3j83L32k52r8j56K6L44L3r6j9J46L2m02M4l2J57m0qq9
$$ -65 20 -104 41 -133 88 111 -72 260 8 -90 -246 -220 124 157 61 42 188 220 -182 -138 -170 -13 -53 -61 -150
5869a50L58j44K58m37K51k31nj29M6J31K41j00j6o9j23K20m13K23J7K36k43K38
$$ -150 208 64 322 -115 136 -95 -100 -229 -183 -52 189 89 73 4 -119 101 -312 -89 -72 164 -79 159
5891A59l8Mn3k14O8rJ74j85mJ98K05j30j57j4N8k03N2k26O32k33j3j46o1K02l04
$$ 159 121 125 72 -142 -74 -83 91 -94 -98 100 305 175 18 4 62 -141 -89 -315 317 84 71 -75 -136 66 -238
5916b38K54l40K44M1mJ21K49l37L6j35l05L35NK8k67O21j90k7rj41P2j24n5j1
$$ -238 16 -324 -80 -39 -43 78 327 -10 26 -109 -414 -79 -74 -46 -313 308 118 91 82 -59 13 -111 -166 -177
5940a77K71J09m29K69J2k15J64o6P1K22j06j45Q6N2Ok51R2p2K99k54j48K51J19
$$ -177 94 203 -226 43 55 -160 4 -62 9 231 125 -20 66 118 124 -127 -35 -107 192 -62 -210 41 160
5963A60Qj93J35j30L18l30q6j16L45K28l70J90j84o9L98o51K12K64k06k9J06O6
$$ 160 168 -25 110 -20 298 -32 -118 -234 111 339 -31 159 -25 -94 304 -347 -135 129 -77 -106 0 66
5985F6M9L2j56j39L36j19j93K67j80P7M3j53J13j66J37k39J60j21L01j6j28j40
$$ 66 115 147 -9 -148 188 69 -124 143 -37 40 83 -70 43 -123 14 -225 -65 -186 115 99 -29 -169
6007a69K16Qo9N7O2J89l32O1l0J1q5j06k8K34J31k60J4R6n7m5K05N8O6n5k19O0
$$ -169 47 55 -14 43 105 294 -38 23 -7 4 -81 -187 -215 19 150 -110 -96 0 -57 -102 103 161 227 172 -47 13
6033A3O1l9o5J19j40J72o6j04pK77k74P2j8PK8m5mo5K14m78J83L8J23r8J14j76
$$ 13 74 35 -30 89 -51 121 55 -49 -56 221 -53 19 1 8 36 -9 -13 -78 136 -342 -159 -121 2 -96 18 -158
6059a58Q4J09j07n1M9K26m4l12q3K81K52m00K65j24r8K1q8L2K50j12m0j3J13m9
$$ -158 -74 35 -72 -123 -74 152 108 -204 -287 -6 246 -154 111 -13 -111 -90 -178 -146 104 -8 -48 -61 52 3
6083CM5o3M3j03N3K6n6J6q0R4K8l35M37R6k99j6k2L95m47k7J63O7O3k39J98j64
$$ 3 48 -15 28 -75 -22 4 -52 -36 -116 -22 6 -329 108 204 -95 -111 -133 262 -185 -212 -49 18 81 -158 40 -124
6109a24J94k19qK18jq6m5p6J05j3j06K45j04J46m5l45R6K12J09j65k61Q7J48J08
$$ -124 70 -149 -157 61 60 -26 -71 -147 -42 -55 -161 84 -20 126 81 -264 -168 44 153 -12 -273 -186 -38 70
6133G0j53K1J00R9j57m5n4k74M82j5j65O3L49k95j03j65K93N0j22l3L1K39m51
$$ 70 -83 -62 38 137 -20 -65 -119 -393 89 74 -91 -28 321 26 -77 -242 51 101 -21 -54 -23 216 -235
6156b35M05j21j25P3k7kJ90l31N3L14k03P3j61k13L29J50k64J41j05L44r0j50
$$ -235 170 49 -76 -3 -30 -32 158 -173 -120 194 -9 64 -97 -310 19 169 -95 46 -59 285 195 45
6178D5oMk17P7l18N21o9%L9o2J50r6k5k90L32j30PM0Q6N7m3j52n2J69R5k80O7
$$ 45 39 43 -174 -97 -415 106 37 37 76 14 164 68 43 -247 85 -45 -38 2 88 145 102 -50 -102 67 162 -118 -51
6205e1j11J26L34l34J00J74l69J09k66K97R4P6k72l0K27n4o2j97K42k6j6k72L39
$$ -51 -162 -36 298 -36 64 238 -131 -22 -288 9 103 179 -93 -123 104 50 -12 -209 33 7 -9 -281 58
6228E8O2J38k01l22L6M1P9L6J00J75j67l10M49l9k71K08j45P7J54j26m0K04j58
$$ 58 120 258 57 -265 -229 -188 -109 -73 27 202 35 -275 174 135 -136 72 -73 4 158 32 -8 196 38
6251C8M8j29j02J43j03K52J34j28p5lm4L2p6l4k41M5M45j59m6J53k45J76n5k13
$$ 38 86 -43 -145 -2 -105 147 281 153 78 75 31 63 -13 -47 -288 -243 202 43 -3 150 -95 81 26 -187
6275a87J15MM64n24J18N5M4r9K0j91J9L05q3p0J7O9k42J16j69K06j54K5QL42m4
$$ -187 -72 -68 396 -128 -10 45 89 -10 10 -181 -162 143 60 -10 7 76 -166 -50 -219 -13 -167 -142 -134 208 164
6300A64j18L3k84K06k32O8oL03j9L16m09m2Q7J9k57N3L5K26n2k79J24R8q5q4n1
$$ 164 46 79 -205 1 -231 -163 -169 134 115 431 22 -20 67 86 -171 -118 -83 143 91 -188 -64 34 -51 -135 -186
6325a86L60k10N1j82L16k79K98j94j01J55L3j25J3K73q6M9j43j42K04k29k9k8
$$ -186 174 -36 15 -167 149 -130 168 -26 -127 28 61 -64 -51 222 136 185 42 -100 104 -125 -154 -182
6347a82J20J18j32J19K15l21l9j3j42L15Pk3k22K02k2m3k17K26M2N1Pj35J10j47
$$ -182 -62 56 -76 43 258 -63 -102 -115 -257 58 65 42 -180 22 0 -43 -260 -34 8 59 66 -69 41 -106
6371a06R1M8q1J50k49K38n8K1P1J9k74j31K96j01Q2QK2O0j44J88j14o9m6j93j20
$$ -106 -15 33 -48 102 -147 91 33 54 125 144 -130 -261 35 -66 16 24 46 106 -38 150 36 -33 -79 -272 -392
6396c92M21J6K6j15J03k4pk63jJ88PO2L7j25K81j27j44K8K15q1k65P6J74j9J43
$$ -392 29 45 71 -44 59 35 28 -235 -236 -48 -41 21 58 -67 214 87 -57 -29 186 105 -160 -84 90 71 214
6421B14k61m6K3j23OK87J8m4j91J45Q6j5L8j63O6L2r3ML0J57j48M6l8P4q4o6j48
$$ 214 -47 -93 -70 -193 -187 100 118 74 -117 28 114 99 137 -26 40 72 -21 -17 13 170 22 68 30 104 20 -46 -194
6448a94J27K13j27l6L4l1K62m03J4n0l4K90k38K78j66R3j03p2RL50k93J03R2P5
$$ -194 -67 146 19 -17 17 -14 248 -155 -141 -191 -225 65 -173 105 -61 32 -71 -143 -134 216 -77 26 118 193
6472A93j31r3j1j71J03P8j86P1n0M90n90K05N6l3o3j40K77P5k4k9J12j49Q5Lk54
$$ 193 62 -31 -42 -213 -110 -32 -218 -147 -197 293 -297 -92 -36 -69 -132 -272 5 80 56 27 139 -10 75 78 -176
6497a76jL01l0o5P1M1Pr2k20J53j88L39q4n0K6R3j54O8M8q3q9j68K49q1L84l01
$$ -176 -177 124 94 29 100 141 148 56 -164 -11 -199 140 56 6 32 125 -29 39 87 4 -85 -253 -4 -85 299 -2
6523bq9J57j0j5j89K41j52P5M5K02j36k56jL3P9J07j05Rr0J88j21pP2r4J25j42
$$ -2 -91 66 56 41 -148 93 -59 16 61 263 127 -129 -130 -97 -18 89 -16 -7 -97 91 -30 -37 35 -59 66 -76
6549g6j77L27O0k5k2o5l5J20j4J69k26j10j20J62N1K11l44r6N07k45J05j78j9
$$ -76 -253 74 134 109 87 22 -13 107 93 262 36 -74 -194 -32 19 230 -114 -210 297 52 157 -21 -40
6572d0j01K87l03Q4j16K37n2L0J7J01j40R9m38M69j43K90l61K5J08Q9k69j4m0
$$ -40 -141 146 -157 -73 -189 48 -4 26 43 144 4 103 -335 134 -9 281 -80 -55 53 142 -127 -141 -181
6595a81K47n2J37o6k98L09q3j66J14m4K30J30l37q9O3m0L7L17k02Q0j57o6K11
$$ -181 66 14 151 85 -213 96 13 -153 -39 -83 147 277 -60 -149 -86 -126 -89 228 26 106 -51 -117 94
6618I4j16l1N4n4J03j90L9K59j51K39j92p0J7j4M7j18O0Q5k11J19no4R9r8M5j31
$$ 94 -22 -53 1 -53 50 -140 -101 158 7 246 54 -16 1 -13 34 -84 -24 61 -150 -31 -36 -100 -1 -99 -54 -185
6644a85J83J15K08m27K76pj62O1J45j11j87j00J48K73k19j02q2K28j51P8k11K15
$$ -185 -2 113 321 -106 170 163 1 62 207 96 -91 -191 -43 230 11 -91 -173 55 -96 -18 -229 -14
6666a4J85k52k8J6P2L33l12j42J87J0J74k00O1k4l4l50L70O9j10R6j31j79L21
$$ -14 171 -81 -109 -93 -21 312 0 -142 45 55 229 29 90 66 32 -318 52 121 11 107 -24 -203 118
6689A18q9k3o7K04N9p4j49L08k79n1P5j22K46j00k14J76j77L06j42o8J3K58r3
$$ 118 29 6 -61 143 202 128 -21 287 8 -43 32 -90 156 56 -158 18 -159 147 5 -63 -50 208 115
6712A15k14J80r4l5q5J07K0M8o5J37j79%J68j02l7K01p1j20m9j79K24k8l4m0N8
$$ 115 -99 81 -13 -48 -133 -26 -6 42 -23 114 -65 -65 103 1 -36 165 94 -26 -75 -254 -30 -58 -92 -132 -74
6737g4P0N0o6n1j8J13k69J88j3K97j77k22L9K27Qj77L7j36J21j13J95J00P1m90
$$ -74 -4 46 -20 -71 -89 24 -245 -57 -70 227 50 -172 -133 94 102 -75 -38 -174 -53 -166 29 129 200 -290
6761b90M01j19j11L40l23N4J98k38J85m1k09K4K92j29K9k0j40R2j71L58k78L9
$$ -290 111 -8 -119 221 -102 -48 150 -88 97 56 -153 -129 163 34 63 43 -97 -5 -176 182 -96 -57
6783e7J0k37N83q7j10m16L19J35j79%j00J71M9o5mk6p7N6Q5j47R4j82J18k5J5
$$ -57 -47 -284 299 212 102 -314 5 140 -39 -39 -139 32 81 16 12 -14 -91 -35 50 -97 -3 -185 -67 -92 -77
6808g7J08m2j0O1Q6j13j63J25j27M96k45n6j33L10j62j72%J98k69P1K8l9K39K8
$$ -77 31 -11 -21 40 126 13 -150 -25 -152 344 99 43 -90 220 58 -114 -114 84 -185 -114 -86 -125 114 142
6832A42k03J46j01oj54L38j76K02k28L2R9j35j47j8L92k18l6J30Q6j14J1M5l01
$$ 142 -61 85 -16 -22 -176 162 -14 188 -40 -8 91 -44 -191 -209 183 -35 -71 59 145 31 42 87 -214
6855b14K85m1j97%L1J67N1P4j58j53J22J11m07K80K39j10Q7k00j0L9O9j56o4L68
$$ -214 71 30 -167 -167 -136 31 82 156 -2 -155 -33 78 -329 -49 190 80 167 -33 -43 -4 65 -91 -155 213
6879B13k1k41M3j9J6j79J3J25j40L85K7j75J8R6l09kJ84Q6r6j71L1P3O0r3K26
$$ 213 192 -49 -6 -25 -9 -188 -175 -50 -190 195 222 47 65 161 -148 -150 34 120 24 -147 -116 -43 17 -76 150
6904A50j70Q7o7O6j23J90j99Q4J3j0j9K3M9j84K58m51L17K30l30j4K84l35J95
$$ 150 -20 67 0 66 -57 133 -66 18 31 21 2 25 74 -110 148 -303 14 244 -86 -100 184 -151 44
6927D4L5l40R2J61l24L93o8m7J52l21L78l10P2N2M8j17J13k41L87M8k56J5k1N4
$$ 44 79 -261 -169 -8 -332 61 -7 -54 98 -223 155 -155 -83 -31 17 -100 13 -228 159 207 -49 -34 -55 -1
6951aO1K93k17p7J39k43K03J0n0l01L33j84N4m4k68L03L0k44P2J42K8m0Lj25J12
$$ -1 60 353 136 59 198 -45 158 168 118 -183 150 -34 20 -24 -292 11 41 -203 -131 11 39 -1 2 -123 -11
6976a1J75k64O8o4Q3P3oq8J19p5J43k80K22k95L11j4j92J96k36J92l2O6J1J7r3
$$ -11 164 -100 -32 -96 -13 60 54 -34 85 10 153 -127 95 -200 111 97 -95 101 -135 57 25 91 102 119 26
7001B6k0J91j98Q8q4j43Q0K47k84J45r0Q3p9J9lj79K46l0l86M26jN7j08j80J73
$$ 26 6 197 -1 87 3 -140 -60 187 -97 48 -42 41 -38 -19 -22 -201 45 15 -371 55 54 111 3 -177 -4
7026dR9l6m1M2J04j26Q6K48o03J70j07l6J68J07k02K36K1j79k44OK34K9K07k75
$$ -4 95 59 18 60 164 38 124 372 -231 -61 -168 -204 -36 71 -131 105 126 -53 -297 -291 -57 -28 179 -96
7050i6l9K18j57k13L07n0p0J68l9J59Ll77J31K08k3j04k0lr6qQ7J62j57K2q3j14
$$ -96 -135 83 -74 -287 20 -30 -100 68 29 188 191 -186 -55 153 130 26 6 3 -93 -101 -14 148 -9 13 -70 -184
7076a84J64o1K18l9o4p3J62p0j36K60k94K40k10R0P6k22m9K12j55J0K91k86J81
$$ -184 -20 -81 137 98 34 -39 123 53 -83 177 -117 123 -87 3 79 -143 -192 20 -135 -125 166 -120 61
7099F1J2n6L1j76K26k1k38O6P1J50m57M08J78k94O7j46J86J70k89o2M6j60J43
$$ 61 73 17 48 -128 98 77 -161 -95 -24 126 -331 77 255 -39 28 -118 68 238 -51 -113 -67 -227 -84
7122h4K30j22j3k10K52L4k4M0O1p8r0J1R9q8K6J00r8O9J9j85k55M05O2j37L6J43
$$ -84 146 24 11 -199 53 87 63 103 164 86 -4 7 106 18 44 144 46 115 134 -51 -306 99 161 24 60 203
7148B03j81J08j56n4m1L01r7j61R3j46J34o1Q3j24J35N5m1N2M6j65l3J42J01j68
$$ 203 22 130 -26 -80 -121 180 83 -78 15 -131 3 -58 25 -99 36 91 50 102 148 -17 -50 92 193 25
7172B5q0K8p1q1J66j69J03J96p8J11j40J3O0k23Q4N0k7J18k03J46P9l5j44J26
$$ 25 -55 -27 -98 -179 -13 -182 -79 117 39 150 10 23 83 -140 -56 -6 -33 85 -118 28 107 72 -72 54
7196E4K1J90j01J5l50K97j68j61K50j86M27l07P0J00R5l83R4M7j96L00j71L5K36
$$ 54 75 265 164 179 -171 126 -42 -203 47 -139 288 -19 51 151 246 -137 -43 4 -192 108 -63 -28 208
7219B08n0l23OJ24J37l40K43PlK68k98Q2L0l1L5r8O4o9m3N9l9K14j28Q5m7p8m3
$$ 208 158 -165 -159 -35 102 -238 5 12 9 277 -21 61 91 60 95 -3 61 -8 -51 8 -31 183 55 140 93 15 -28
7246b8p3J6J55qJ15k42M0k10K90P7k19m6K07L8J64o4p3k21P8J45j24mM8P9m29
$$ -28 -101 -85 70 62 177 -65 -25 -235 55 132 -87 -133 74 112 276 212 139 -82 -4 141 17 13 61 140 -289
7271b89L57L43l30P3l01J20n6k5J49J28m1n4j5O4K7j20n0j88K64N3j09Q6o3J58
$$ -289 68 411 81 154 -147 -27 -83 -108 41 169 128 74 59 123 150 30 -20 -208 56 109 0 86 23 181
7295A81m43J64J34k81L63k1j37oL0K21k70Q7j27NL9J25L0j82J65j15J73k36J45
$$ 181 -262 -98 36 -245 118 97 -40 -46 -16 205 -65 22 -105 -100 -61 64 94 -88 77 -38 135 -101 44
7318D4pj48K81j56r7j96K03nN4p7R6j40J60k08J86o7L05j07k23k7J36q7j09J86
$$ 44 37 -111 170 14 -83 -279 -76 -81 -27 -104 -8 -148 12 -196 -10 -77 228 121 -102 -129 7 -80 -189 -3
7342cm1N1M4N5j26j9O5n3j46L04j40P3j28o1K78k91p2K21J62k33J68o5q8M5J72
$$ -3 -44 7 51 106 -20 -39 26 -27 -173 131 -9 64 -64 -125 153 -138 -210 11 173 -60 108 43 -45 0 172
7367A72j49j1pJ96k54K2R0Q1L9k68M3J04k72K66Q1k65J22q9j3J83j87R8K89n04
$$ 172 23 12 5 201 -53 -31 59 140 179 -89 -46 58 -214 52 133 -132 -10 -99 -112 71 -116 -18 271 -233
7391b33K68N2j76K39j29j16J21rr2RL01l55K93m20J36K15r9J67k32K46nk93L04
$$ -233 35 87 -89 150 21 -95 26 17 -75 -66 235 -120 173 -247 -111 104 5 172 -60 186 181 -112 192
7414A92l58L98j93J50j36Q0k32j05N29l92J3lm7J25q1J05k9LL1k30L09j08k01
$$ 192 -166 232 39 189 53 133 -99 -204 325 -67 -54 -57 -104 21 -60 45 16 19 50 -180 129 21 -180
7437a80J76qm6J39J45q1k54J7O4j25J21r4L54k50J59r5J5k10l9M7O4l8K2J06n2
$$ -180 -4 -12 -58 81 226 145 -109 -92 -28 -153 -32 -126 228 -22 137 42 57 -153 -192 -145 -81 -119 -97 9 -43
7462d3o7K49j70L7j5J1m0j90K94n3J24p1j64K0N3N7k06J41l0K16j14p8N4l4p3
$$ -43 -110 139 -31 6 -9 2 -38 -228 66 13 137 66 -98 -78 -25 32 -174 -33 -63 153 39 -39 15 -19 -92
7487i2j28L43j66J33J7M0p5M9l38K81j3q0L2j88N41j48l09J63j79j1Q6p4J90l7
$$ -92 -220 123 -43 90 107 147 72 121 -217 64 51 -29 3 -185 356 208 -101 62 -117 -128 -42 -116 74 37
7511C7k5q3O4L5P4j66L6j60K38j78N1j38L81j82Np1K04j17J3j48J16m5p0J35M7
$$ 37 12 -71 -7 28 102 -64 -28 -188 50 -128 -77 -215 166 -16 -11 -82 122 5 18 -130 -14 -59 -129 6 53
7536E3Mj40l7P1L6O1K07m00J31J09r6M7l12K07O7K1k25J13J39l1k16K26P4j70
$$ 53 57 -83 -120 -49 -13 48 255 -145 -14 95 -1 46 -266 -59 8 29 -196 -83 56 25 -191 35 109 -61
7560f1J77M5k89K08j15o8P8M9J71j35k2j39L1J46k5L4Lj71N7j09K09j8p3m2J05
$$ -61 116 161 -128 80 -35 -103 -25 24 195 60 38 -101 -70 76 51 85 88 -83 -26 -135 74 56 -17 -59 46
7585D6n4k9j5J19j40K9K3j8n0P4K2J04j27p0J06L6k17Q3J35Pq7J88l03J76J08
$$ 46 -8 -37 -52 67 -73 -44 -21 -39 -89 -15 7 111 -16 -86 20 56 -161 -78 57 64 -23 165 -138 38 146
7610A46J19l27Q0j91J07q7L42k9j31j17L73k36j34p7P4J5J80j99K9J14J6j8p4
$$ 146 265 -62 18 -173 -66 -153 189 160 29 -88 285 49 -85 -162 -88 -73 107 -92 -63 51 67 49 -25
7633b5l1j05L09k54L37j34nj67K87l69J92J6K0j04Q1r1J47j45L4n9J34m3l02L41
$$ -25 -56 -161 148 -106 231 97 92 -75 212 -157 35 51 71 -33 48 -43 104 -41 -7 -66 68 25 -277 64
7657F4j02N1o0RJ57j60J26qj12J42k9j48J97Q7j33L0r4K72l94k9J59j41J25l8
$$ 64 -38 13 -47 -38 119 -41 85 77 -35 107 78 -70 127 214 81 111 17 289 -105 -134 25 -116 9 -29
7681b9lJ10j02q3j85M51k06M5pJ23j25j07K64j39J9k15R5R0J21j72K84k63J42
$$ -29 -32 78 -24 -107 -292 159 -47 -2 -9 114 -11 -118 146 7 26 -189 -94 -4 117 -55 229 -34 108
7704A08M2j24j8J03k81J74kR4n2k21L31N6k81Q2m2J90j01j30J69j2j37j54K98
$$ 108 150 26 8 111 -170 4 2 96 44 -177 154 210 -71 11 -31 159 58 -72 97 85 -52 -206 92
7727I2k02K96k88n0j6J57K80j28j61%J01k06K40j72K27k00L53m49K68n6k00j3
$$ 92 -110 186 -102 -152 -168 -11 269 141 -20 -20 81 -125 115 -57 170 -30 323 -126 142 86 -114 -127
7749a27J17j20O0j18q5L58m9Pj18J20l0O5j40M8M5L7j54K0L19l67q9K29J03l1
$$ -127 -10 -130 -70 -188 -273 85 36 43 -75 45 15 80 -60 -12 33 70 -84 -64 255 -112 -201 28 131 100
7773A00j53j56L21j38R4J1j64J98n9N5l62K06n9L32r8j20L5k83L30j65k1J92l54
$$ 100 -53 -209 112 -26 68 79 -85 113 54 109 -253 -47 -106 226 128 8 43 -240 90 -75 -96 96 -258
7796b58J96j0j7Q1m1m2K09j11M5j90K7J35J03l97M04J14j94J31k91K12r0kl6o8
$$ -258 -62 -72 -89 -8 -49 -91 118 7 52 -138 -111 24 127 -270 134 248 54 185 -106 106 16 14 -22 -90
7820i0M9j9Q5j01J59r1p9J54O9k19M9L5J97k34j02J76Q2l09M89k93M7J8J0j15
$$ -90 -41 -60 25 -76 83 -8 -87 67 136 -83 -34 1 198 -36 -138 38 120 -189 300 7 54 72 82 -33
7844c3r4J9r9K13J8j27J16j15J27%J93j29J2l3J01k77m1M58l78J43K03l41L52
$$ -33 -127 -108 -207 6 24 -103 13 -102 25 25 218 89 101 68 169 -108 -149 309 -69 74 277 -64 288
7867B88k75J95k28j7J3N2L0l9j41Q0n8o9r0J87r1J94O9O7l25J90q8O6j00l0K54
$$ 288 13 208 -20 -37 -24 28 58 19 -122 -42 -100 -169 -259 -72 -163 31 100 167 -158 32 -56 10 -90 -120 134
7892A34j19j55j16L85j06m6q9J28m5K82l14o9j58M82l13kJ43P9k4j33j11K24J3
$$ 134 15 -140 -256 129 23 -23 -112 16 -29 253 -61 -130 -288 194 -119 -121 22 101 77 -56 -167 57 70
7915G0l63J70k4J4K69j90J22J5j82J46j6k1j76L2J28j60J85J02l79K48k4k2j8
$$ 70 -293 -123 -147 -133 136 -54 68 83 -99 47 31 10 -166 -134 -6 -166 19 121 -258 -10 -34 -56 -74
7938g4j7J9K11k18k2J47k68J74J40k01q3J15r6oK22P2P5j87j69K58N6l28q1K94
$$ -74 -91 -72 139 -79 -101 46 -222 -48 92 -109 -192 -77 -173 -179 43 115 190 3 -166 92 148 -180 -261 33
7962C3r9K36l37N0J63p7J80m57K48l8J67j14J24j00J38k75K9J18j11J33%NN0j83
$$ 33 -66 170 -167 -117 46 -31 149 -308 -60 -98 69 -45 79 -21 117 -158 -129 -11 -122 11 11 16 66 -117
7986a17K48j49J85j63R2j61J37O5j41K38n91N71l59O6J16k15O3J37N3QKk8j27
$$ -117 131 -18 167 4 96 -65 72 137 -4 234 -357 214 -145 -79 37 -178 -115 22 75 83 85 57 -70
8009g0k6K02k12J74j77K60j56j05L57n10L98o9j14j87n0K84J26k8l32J94J17j07
$$ -70 -96 106 -106 68 -109 151 -5 -110 247 -263 135 66 -48 -235 -285 -1 125 97 -235 -41 76 -31
8031c1N2j58K71o7j02j47J22n9N1k3J16J15j84k9J37N0m5k2J25l38J61K22l34
$$ -31 21 -137 134 67 -35 -182 -60 -119 -68 -91 25 140 -44 -73 64 114 69 47 172 -166 -5 217 -117
8054a17K13L2p3j18J60k38O3K39l65J11J62j67nL3O8n5M4l9L37l15j75J79L4j82
$$ -117 96 128 55 -63 97 -141 -78 161 -204 -93 69 -98 -103 -70 -2 -57 -13 -52 285 -30 -205 -26 8 -174
8078a74J64j7j4m4m1J00m3Q9j35O5P0j62n4J45K29r3R1j32L7P8j41M4J07k58j1
$$ -174 -10 -27 -41 -85 -126 -26 -69 20 -115 -50 20 -142 -196 -51 178 85 176 44 81 159 18 62 169 -89 -100
8103a00L0nN8M0j47J02n4K00l19P1O2j08K3J4J62K8Qkn1K11j17j67J89k55q8L39
$$ -100 -70 -75 -17 23 -124 -22 -76 124 -195 -124 -62 -170 -147 -133 29 57 65 63 12 223 106 -61 128 -127 -215 124
8129A24k55P8j14J25J37j52j07J09l7K9K02r3k6o5J05l0m8m4n8o3K59j56J44k1
$$ 124 -131 -53 -167 -42 95 -57 -164 -55 -92 -63 139 46 20 -45 60 30 -18 -62 -120 -183 76 -80 64 43
8153D3l9l7l9o7m3PJ13r8R9K53j01j48J74j10o7J46k08J71J69J9l46r0L41q0r4
$$ 43 4 -33 -72 -139 -182 -175 -62 -160 -61 192 91 -57 117 7 -60 86 -122 49 218 237 -109 -199 142 62 -32
8178c2J72j46Mk2J31M3q5j51K09j66m2J22j04
$$ -32 140 -6 -2 -24 107 150 65 -86 123 -43 -85 37 -67
8191f7
$$ Imaginary data points
##PAGE= N=2
##DATA TABLE= (X++(I..I)), XYDATA
0@%%%%%%Qj6J6j6K4l2L3m1O4q0R6j20J44j76K16k64L12l66M30n04N84o73P77q96
$$ 0 0 0 0 0 0 0 8 -8 8 -8 16 -16 17 -24 40 -40 56 -64 80 -96 120 -144 168 -198 232 -272 312 -361 416 -480
30d80J029j174J337j516J710j927K169k437K726l040L389l771M186m637N131n670
$$ -480 549 -625 712 -804 906 -1021 1148 -1289 1437 -1603 1786 -1985 2201 -2436 2695 -2975
46b975O261o909P615q391R245j0184J1223j2379J3669j5119J6764j8646K0821
$$ -2975 3286 -3623 3992 -4399 4846 -5338 5885 -6494 7175 -7944 8820 -9826 10995
59A0995k3369K6406l0098L4696m0612M8550n9822P7207j07813J77379o13244j10373
$$ 10995 -12374 14032 -16066 18630 -21982 26568 -33254 43953 -63860 113519 -499725 -610098
71f10098J105356k41604m13485J79138N82118k79607p38302k30576N10904K46163
$$ -610098 495258 253654 -159831 19307 601425 321818 -416484 -647060 -136156 110007
81A10007j83446j6923M34577J26591m31641l76099K22881K87238j47576k64290
$$ 110007 -73439 -90362 344215 470806 39165 -336934 -114053 173185 25609 -238681
91b38681K13020L84956o7011m33114q5383L26203J10797l61807k39704K81946
$$ -238681 -25661 359295 292284 -140830 -226213 99990 210787 -151020 -390724 -108778
101a08778L93508k5903k47471k1174J38448r5308k74980n3948K30828J63863l7843
$$ -108778 284730 258827 11356 -9818 128630 33322 -241658 -295606 -64778 99085 61242
112F1242k0934Q3504j7589j73613j02423Q3951R8310l115J944N6544k9526j45229
$$ 61242 40308 123812 106223 -67390 -169813 -85862 12448 9333 11277 67821 38295 -106934
124a06934n6120J30541J20985l6690n1570N9432K7637j25363j11460P2598J22374
$$ -106934 -163054 -32513 88472 51782 212 59644 87281 -38082 -149542 -76944 45430
135D5430j8119o5711O8356J04921p0288j58459J3873J50213N098j52150j4577
$$ 45430 27311 -38400 29956 134877 64589 -93870 -79997 70216 75314 -76836 -91413
146i1413J84956P5201j76750j38773J25243J49033j14404j94861P8435K51702
$$ -91413 93543 168744 -8006 -146779 -21536 127497 13093 -181768 -103333 148369
156A48369K8561k15240q9192J44079O1061j71156j11372J60430J88942n6681j45704
$$ 148369 176930 -38310 -127502 16577 77638 -93518 -204890 -44460 144482 87801 -57903
167e7903M0361J17756p8566j84703K5165K09194N8645j53741o4793J44805Q3500
$$ -57903 -17542 100214 21648 -163055 -137890 71304 129949 -23792 -88585 56220 139720
178A39720j51140j41372J12600J84519m2431j79412p946J58606L9928j43123q0636
$$ 139720 -11420 -152792 -40192 144327 101896 -77516 -85462 73144 113072 -30051 -110687
189a10687J03320J00981n1681q2074L4589O7662l5949p6238J5882O2288j5633
$$ -110687 -7367 93614 41933 -40141 -5552 62110 26161 -50077 -34195 28093 12460
200A2460n8045K1736P7486J419p8508l1660N3563L1219m6320l5105M6874N6216
$$ 12460 -45585 -23849 53637 55056 -23452 -55112 -1549 29670 -16650 -51755 -4881 51335
212E1335k0318n7580j1526K8329J3149r322m230O732R008J2227Q472j9528l8142
$$ 51335 31017 -26563 -38089 -9760 3389 -5933 -10163 -3431 5577 17804 26276 6748 -31394
225c1394m098M2463K3566l3926k6393L9245M2968l0145n4791J3691N4557n454
$$ -31394 -35492 6971 30537 -3389 -29782 9463 52431 22286 -32505 -18814 35743 30289
237C0289o0231q839O1711K6693n1687l3303M4641L6344m2212m2589L6022M4024
$$ 30289 -29942 -38781 22930 49623 -2064 -35367 9274 45618 3406 -39183 -3161 40863
249D0863l9610n9344L4023P8694j3225q5950p263Q5797K1398r2250m9250Q2866
$$ 40863 1253 -58091 -24068 54626 41401 -44549 -51812 33985 55383 -36867 -86117 -3251
261c251P5835n7392q5182L7409R3140j6306j00835j4654R1268L9128o8452m2315
$$ -3251 72584 15192 -69990 -32581 60559 44253 -56582 -71236 20032 59160 -9292 -51607
273e1607N7115M6314m6304m8011L9349M9945l5970n7922L0692P1031j6230p7224
$$ -51607 5508 51822 5518 -42493 -3144 46801 10831 -47091 -16399 54632 38402 -38822
285c8822j75P9282J8645p5087l7122O3584N0773m9126o2932K7561O5215p195n5385
$$ -38822 -38997 40285 58930 -16157 -53279 10305 61078 11952 -50980 -23419 41796 34601 -20784
298b0784k678M5902O122m1510j4839K2864L277k0737J1852M0367P47m7033j9128
$$ -20784 -23462 22440 28562 -12948 -27787 -4923 -1646 -22383 -10531 29836 30583 -16450 -35578
311c5578L5570J5256m3231k6205M7564N1580k1739m5362J0316L5410j5560m6087
$$ -35578 -8 15248 -27983 -54188 -6624 44956 23217 -22145 -11829 23581 8021 -38066
323c8066L017M6461J2316k7650L108L8358k463n0631j2846M4627J2362n2006k0604
$$ -38066 -35049 11412 23728 -3922 -814 37544 35081 -15550 -28396 16231 28593 -23413 -44017
336d4017O4710N3156m7181o8658K4590O8080j8047q2508p630P8525L0267n9558
$$ -44017 20693 73849 26668 -41990 -17400 50680 32633 -49875 -57505 21020 51287 -8271
348h271l1161N7024M0058n6187o3137K9392N8161j9168n2382K4376O8950o290
$$ -8271 -39432 17592 57650 1463 -61674 -32282 25879 6711 -45671 -21295 47655 41365
360D1365o8299r125N7658P108o9492k6417P0851N5746m5137n6064L8142O5021
$$ 41365 -26934 -36059 21599 28707 -40785 -67202 3649 59395 14258 -41806 -3664 61357
372F1357k7550q1038o516O4022J9562m4670r882N6816L2903m3069m6547J4240
$$ 61357 33807 -47231 -53747 10275 29837 -14833 -24715 32101 65004 21935 -24612 -10372
384a0372K2467k4581k3455L4581M5410j0936l3832Q983K3432k7873n2509N494
$$ -10372 12095 -12486 -35941 -1360 44050 33114 -718 8265 31697 3824 -48685 -43191
396d3191N6349J8224l8709j4833M0118K1007m0201l7325J6342K3674j7746j8194
$$ -43191 13158 31382 -7327 -22160 17958 38965 -1236 -38561 -22219 1455 -16291 -34485
408c4485K9354L6294j2492l0254Q475K1048k5764m1211J8215N4029K331m1952
$$ -34485 -5131 31163 18671 -11583 -3108 17940 -7824 -49035 -30820 23209 25540 -16412
420a6412M132N4573P935o5522l8416M7043M8741l1130m8465K5920N7593p725n1650
$$ -16412 -12280 42293 50228 -15294 -53710 -6667 42074 10944 -37521 -11601 45992 38267 -13383
433a3383k146M1842j411n0155j2326M5841K0684l7198j7097M6213K9033m9025
$$ -13383 -15529 26313 24902 -25253 -37579 8262 28946 -8252 -25349 20864 49897 872
445H72n0545K9506M9175k4243n4028K0998P2334N834p0340l0117N1454L3959m4869
$$ 872 -49673 -20167 29008 4765 -49263 -28265 44069 49903 -20437 -50554 900 34859 -10010
458a0010m2392L4110M9851j3717l6550J3692L5187j4546m4470j385L5521L331
$$ -10010 -52402 -18292 31559 17842 -18708 -5016 30171 15625 -28845 -30230 5291 8622
470H622k8610Q250M6743Q975m5713k2366L2164J7664l8388l0764L5777M8934j1499
$$ 8622 -19988 -11738 35005 43980 -1733 -24099 8065 25729 -12659 -43423 -7646 41288 29789
483B9789m3394Q4L4951N00l5340j0255K3843O486j9937P70K7929N133k9063j0481
$$ 29789 -13605 -13521 21430 21930 -13410 -23665 178 6664 -13273 -12503 15426 20559 -8504 -18985
497a8985K6204Q348l6063j9982L7944L5449k5250l6690K2105M1184j8940n4232
$$ -18985 7219 15567 -20496 -40478 -2534 32915 7665 -29025 -6920 34264 15324 -38908
509c8908j349N1935J7891l6389j4837L7227K0357l4932k7459K6273K2916k9744
$$ -38908 -40257 11678 29569 -6820 -21657 15570 35927 995 -26464 -191 22725 -7019
521g019k8960L1714M4873j5679m5171Q304M6351n517n7628j4920N3376K8650m2103
$$ -7019 -35979 -4265 40608 24929 -20242 -11938 34413 28896 -28732 -43652 9724 38374 -3729
534c729l2567M0080M5072l0199n7893Q218N3227L123m8094j0691M5115J8896l6673
$$ -3729 -36296 3784 48856 18657 -39236 -31018 22209 25332 -22762 -33453 11662 30558 -6115
547f115k1549L1096K0719l2645k6969K9849L6044k1759m0168J5306M4999o185
$$ -6115 -27664 3432 24151 -8494 -35463 -5614 30430 8671 -31497 -16191 28808 22623
559B2623m7615o334M4345J6412l7539k1930L3412L3349k1220l9170N202L3590
$$ 22623 -24992 -31326 13019 29431 -8108 -30038 3374 36723 15503 -23667 -18465 15125
571A5125K854k7288p249K1593J1280j1234n157J0094j75j7700p154J6906J1224
$$ 15125 17979 -9309 -16558 5035 16315 5081 -76 10018 9843 -7857 -15011 1895 13119
584A3119j4930j3009J5392J9783j0937k5203J935K2948L988k1390j0447J7113
$$ 13119 -1811 -14820 572 20355 9418 -15785 -13850 9098 13086 -8304 -18751 -1638
596a638J5378r364j6059P8R319L085N81K777l715p105N040J2326m870k2612o821
$$ -1638 13740 4376 -11683 -11605 -2286 799 1380 4157 442 -6663 -1623 10703 5833 -16779 -23600
611b3600K3034K0109j0113j6699Q952J7217j0390k5921k184K1621J0085q787l136
$$ -23600 -566 19543 9430 -7269 1683 18900 8510 -17411 -19595 2026 12111 3324 188
624A88J0297J633j3384o761Q844K627j1829p93K1349J1260k0776k1683J2543K2683
$$ 188 10485 12118 -1266 -8027 817 3444 -8385 -9178 12171 23431 2655 -19028 -6485 16198
638A6198r237k9040n42L1518J3730k2271j6329J9050J8308j8928k9896L837K6135
$$ 16198 6961 -22079 -22621 8897 22627 356 -15973 3077 21385 2457 -27439 -23602 2533
651B533N852j3715J510J9820K782k2712j2983J0873P246j2142k752K1757J5150
$$ 2533 8385 -5330 -3820 16000 18782 -3930 -16913 -6040 1206 -10936 -13688 8069 23219
664B3219j5321j8301J0611J8147j0954k6563J225K6531Q056j9767p747K0913J5341
$$ 23219 7898 -10403 208 18355 7401 -19162 -17937 8594 16650 -3117 -10864 10049 25390
677B5390j5951k3014P34J3076K08p461L715J2484L039n883l070l457j2600q286
$$ 25390 9439 -13575 -12841 235 443 -7018 -3303 9181 12220 6337 3267 -190 -12790 -21076
691b1076J1815J7554j323j2053L469J6246j293k2575j3621J2120J3585m944p218
$$ -21076 -9261 8293 6970 -5083 -1614 14632 13339 -9236 -22857 -10737 2848 -2096 -9314
704i314R659J3779k844r868j958j87q506m906J1227J2596m759r005J0329J7836
$$ -9314 345 14124 11280 1412 -546 -733 -9239 -14145 -2918 9678 4919 -4086 6243 24079
718B4079r925l0446o239K5721J4299j9559j6004J8968K5595r071k7946k556J9795
$$ 24079 14154 -16292 -22531 3190 17489 -2070 -18074 894 26489 17418 -10528 -13084 6711
731F711J311k1240m275K1867J1117j4013q383J3679N929j9075j5259J4632J7515
$$ 6711 8022 -13218 -17493 4374 15491 1478 -6905 6774 12703 -6372 -21631 -6999 10516
744A0516j1997j7340J4983K8312o443l2594n807K5486R083k4831j4358K2503K4941
$$ 10516 -1481 -18821 -3838 24474 18031 -14563 -20370 5116 14199 -10632 -24990 -2487 22454
757B2454r407k1371N108J7597o486k1846j546J8391O388j0767r85J3828M132j4672
$$ 22454 13047 -8324 -3216 14381 7895 -13951 -15497 2894 9282 -1485 -2470 11358 15490 818
771H18r373Q177M795j2622o611J6716J6412r757j6947N503J5150n923k1605m266
$$ 818 -8555 -378 4417 -8205 -14816 1900 18312 8555 -8392 -2889 12261 6338 -15267 -19533
785a9533J8618J0528j0169o037J1568P749j0949j2170L324N613n100k475J0879
$$ -19533 -915 9613 -556 -6593 4975 12724 1775 -10395 -7071 -1458 -6558 -9033 1846
798A846Q979p448q809Q916R974j3757k0367O288K4034M179j9568m801K0963J2294
$$ 1846 10825 3377 -5432 3484 13458 -299 -20666 -14378 9656 13835 -5733 -10534 10429 22723
812B2723j8032k0238N905J5690l651j2238O487J7256l68j4056j835R052m178j6091
$$ 22723 4691 -15547 -9642 6048 2397 -9841 -3354 13902 13534 -522 -2357 6695 2517 -13574
826a3574K71J8468P375j5214o889J7804J2155j9693k4036Q343K4603m34k1056
$$ -13574 -13303 5165 12540 -2674 -9563 8241 20396 703 -23333 -14990 9613 9179 -11877
839a1877k243K2642J1540j6766j6644O760J0805p225j0054R057J4169k871r981
$$ -11877 -14120 8522 20062 3296 -13348 -6588 4217 -3008 -13062 -4005 10164 7293 -2688
852b688K834Q635o053j4662J579J5529L089j2903k535J6370Q161j5247j5359P092
$$ -2688 146 8781 2728 -11934 -10355 5174 8263 -4640 -7175 9195 17356 2109 -13250 -6158
866f158J3461l001j1747N56J3334M341q703m994L875P03o445j448O196K346l520
$$ -6158 7303 4302 -7445 -6889 6445 10786 2083 -2911 964 1667 -4778 -6226 -30 2316 -1204
881a204M43N809m62q664l661P075M938p192o126P898J0246m219j0899R70Q220
$$ -1204 -761 5048 4586 -4078 -7739 -664 4274 -2918 -9044 -1146 9100 4881 -6018 -5048 3172
896C172j24q135n92Q141K412o146j755O793J105q136k251R323M033r680o381R970
$$ 3172 3048 -5087 -5679 2462 4874 -1272 -3027 3766 4871 -3265 -5516 3807 7840 -1840 -8221 1749
912A749J0006q725j3571M894J6717n00j7243n043J5102R678j2551j2065Q194J2412
$$ 1749 11755 3030 -10541 -5647 11070 10570 -6673 -11716 3386 13064 513 -11552 -3358 9054
926I054m386j2395J678J1901L46j0976j449R920N32j1131j533J2824N097j2346
$$ 9054 4668 -7727 -6049 5852 6198 -4778 -6227 3693 4225 -6906 -8439 4385 9482 -2864
940b864q190J0932J1067q907j5270M703J7505J816j5440n422J2452Q111q795j0025
$$ -2864 -11054 -122 10945 2038 -13232 -8529 8976 10792 -4648 -10070 2382 10493 1698 -8327
954h327M178Q980j007o387J024N386j76m071J076K902l796n867J941P090J568
$$ -8327 -4149 4831 3824 -2563 -1539 3847 3671 -400 676 3578 -218 -6085 -4144 2946 4514
969D514n084p86O328J981p554p236K716O281J49l198J543L634q3k493j020j277
$$ 4514 -570 -1356 4972 6953 -601 -7837 -5121 1160 1309 -1889 -346 3288 3205 712 -308 -1585
985a585l539l76N323M832m122n245M479P627l561j1558j117J0024M388p595l846
$$ -1585 -5124 -5500 -177 4655 533 -4712 -233 7394 3833 -7725 -8842 1182 5570 -2025 -5871
1000e871R272P748p257j1147K487Q947k049q827K153J1044K602q839l082P522
$$ -5871 3401 11149 3892 -7255 -4768 4179 2130 -6697 -4544 6500 9102 263 -2819 4703
1014D703J880j0845p239R031J0590n738j0713O074J3854k441j5478l807J1659
$$ 4703 6583 -4262 -11501 -2470 8120 2382 -8331 -2257 11597 9156 -6322 -10129 1530
1027A530M571j1924p218J1980J3404n737j3395K258J1806j764j3446k900J1158
$$ 1530 6101 -5823 -13041 -1061 12343 6606 -6789 -4531 7275 5511 -7935 -10835 323
1040C23O481n680m168O125M381p290p160M064N804l568n592N140R648r04q931
$$ 323 6804 1124 -3044 3081 7462 172 -6988 -2924 2880 -688 -6280 -1140 8508 7604 -1327
1055a327l107N725K355p188m941N681Q955P87n316j782K668R92l586n164j585
$$ -1327 -4434 1291 3646 -3542 -8483 -2802 6153 6940 1624 -158 2510 3502 -84 -5248 -6833
1070f833K942N813L335r47l103q14K686q68o436m955M072O501L87l147J939N044
$$ -6833 -3891 1922 5257 4310 1207 393 3079 2211 -4225 -9180 -5108 1393 1780 -1367 572 5616
1086E616j108o320l224K365M22l038K113Q666K127p498k569P057J941j1312q641
$$ 5616 4508 -1812 -5036 -2671 -2249 -5287 -3174 5492 7619 121 -2448 4609 6550 -4762 -13403
1101a3403R794J4688k666j3100J039J4061J207j6773r474J0883J1048o220q707
$$ -13403 -3609 11079 8413 -4687 -3648 10413 11620 -5153 -14627 -3744 7304 1084 -7623
1114g623P368J2403l214j3669k716Q579L17j0281r51J2957P458q211o492P367
$$ -7623 -255 12148 8934 -4735 -7451 1128 1445 -8836 -9787 3170 10628 2417 -4075 3292
1128C292O049j0753j3044N238J5355N65j1584m86J3606M045j3565j0466P208R276
$$ 3292 9341 -1412 -14456 -9218 6137 6702 -4882 -5368 8238 12283 -1282 -11748 -4540 4736
1142D736m364p818M375J1163k83r014k540N339L09n942j619O018L431k308o06
$$ 4736 372 -7446 -3071 8092 7809 -1205 -3745 1594 1903 -4039 -5658 360 3791 1483 877
1157H77L768L40o447m207L239M534k495k961L507N504n54m448k228O62j147j408
$$ 877 4645 4985 -1462 -5669 -2430 2104 -391 -3352 155 5659 5105 657 -1571 -909 -2056 -3464
1173c464R71K003M65L87L027J697n033n148K180N192l051o848K755J0844L619
$$ -3464 -2493 -490 -25 362 3389 5086 53 -5095 -2915 2277 -774 -7622 -4867 5977 9596
1188I596r215p251N759P253n153q881K453R862J498p041o36O510N7q222l027P532
$$ 9596 381 -6870 -1111 6142 989 -7892 -5439 4423 5921 -1120 -1756 4754 4811 -3411 -6438 1094
1204A094L871o814m047Q558P900q172j0954M038J1380k405j2160p53J3718O084
$$ 1094 4965 -1849 -5896 2662 10562 2390 -8564 -4526 6854 4449 -7711 -8464 5254 11338
1218A1338j1135r503O729J0115m586j0435J503R716J033p166j224N975J653o086
$$ 11338 203 -9300 -2571 7544 2958 -7477 -5974 3742 4775 -2391 -3615 2360 4013 -2073
1232b073k470N488K999n475l613N753M901m244n938K956O408j494p252o54P138
$$ -2073 -4543 945 3944 -1531 -5144 609 5510 1266 -4672 -1716 4692 3198 -4054 -4708 2430
1247B430L304n737m564L524M585j398l628M72K601l85j448J85N81j303q23K355
$$ 2430 5734 -3 -4567 -1043 3542 2144 -1484 -1012 1589 1204 -244 -59 522 -781 -1604 751
1263G51K211k774l501K546L986k082n123J199N611L08n547j745M968L435l853
$$ 751 2962 188 -3313 -767 3219 1137 -3986 -2787 2824 3132 -2415 -4160 808 4243 390
1278C90m128K924L483k965l173K950L967k072l953J838M996k344o484N41O982
$$ 390 -3738 -814 2669 -296 -3469 -519 3448 1376 -2577 -739 4257 1913 -4571 -4030 2952
1293B952J645o505k470O970M352o195p440L907Q045j396q318j119Q058M315o072
$$ 2952 4597 -1908 -4378 2592 6944 749 -6691 -2784 5261 3865 -4453 -5572 2486 6801 729
1308G29m494L115L583l069l865K395L947r92l073J965L838k521o102L56N847J216
$$ 729 -3765 -650 2933 -136 -4001 -1606 2341 1349 -1724 241 4079 1558 -4544 -4188 1659 2875
1324B875n591j711O242L959m597n863J545N742p7n091j876M088L389j024j916
$$ 2875 -2716 -4427 1815 5774 1177 -4686 -3141 2601 2524 -2567 -4443 -355 3034 2010 94
1339I4j93M91o2j06n26j417m85K567L472m21l817j036K631L34l133k081K575L250
$$ 94 -99 392 330 224 -302 -1719 -2204 363 3835 3414 -403 -1439 1192 1526 -1607 -3688 -1113 2137
1357B137l86j812M7J259o38j418k13J15j385m72L489L228k101l907J415M264j452
$$ 2137 1751 -61 -14 1245 607 -811 -1024 -909 -2294 -2766 723 3951 1850 -2057 -642 3622 2170
1374B170o982j973O547N643l211m741K585N395k393p733j257N797L374l630k073
$$ 2170 -4812 -6785 -238 5405 2194 -2547 38 5433 3040 -4693 -5950 -153 3221 -409 -2482
1389b482M221L509l001m719J084K368k239l275L126N290l20m445M26M545o02o740
$$ -2482 1739 5248 2247 -2472 -1388 980 -1259 -4534 -1408 3882 3562 -883 -457 4088 3486 -3254
1405c254l649N140N476k365l934L038N367j354p307k683L359L515j876k001K259
$$ -3254 -6903 -1763 3713 1348 -2586 452 5819 4465 -2842 -5525 -2166 1349 -527 -2528 -269
1420b69L537m2k699j524p83n40j48J703R03k09J11K630J136k659l605k62J818
$$ -269 3268 3226 527 -997 -1780 -2320 -2468 -765 138 -71 40 2670 3806 1147 -2458 -2720 -902
1437i02M61r92R65K892J158j455j290j578j543j98J730J847j014j464K123M318
$$ -902 -441 -1433 -468 2424 3582 2127 837 -741 -2284 -2482 -752 1095 81 -1383 740 5058
1453E058j540o421k385N616L372m301m900L334P575L0o725k382M438J998n020
$$ 5058 3518 -2903 -5288 328 3700 -601 -5501 -2167 5408 5438 -1287 -3669 769 2767 -2253
1468b253l362M132N361j975l439J946L208k822n236J028N439j83n645M06P851
$$ -2253 -5615 -1483 3878 1903 -1536 410 3618 796 -4440 -3412 2027 1844 -3801 -3395 4456
1483D456K677p897n196N199O007m577p970K435R608J881o933k997N195K893n796
$$ 4456 7133 -764 -5960 -761 5246 669 -7301 -4866 4742 6623 -310 -3307 1888 4781 -1015
1498a015m789L383N298r46l306Q44M213r13n022l40L121J49l639M36M998J790
$$ -1015 -5804 -2421 2877 1931 -1375 -531 3682 2769 -2253 -2593 528 677 -2962 -2526 2472 4262
1514D262m053k903K617K545k716m134J267M642J334k636n24J553M9k300p81J029
$$ 4262 209 -2694 -77 2468 -248 -4382 -3115 1527 2861 225 -299 1254 1303 -997 -1778 -749
1530g49J92j5J236J072j001j663R33K580j293m371N2M752J326m187k217M276L715
$$ -749 -557 -572 664 1736 735 -928 5 2585 1292 -3079 -3027 1725 3051 -1136 -3353 923 4638
1547D638l190m733J448M199j274m029P54M921K92m943p01M788Q67n453k004N241
$$ 4638 1448 -3285 -1837 2362 1088 -2941 -2187 2734 3026 -1917 -2618 2170 3037 -2416 -4420 821
1563H21L774m917n065M654P039l100q841L55Q689J947p851m260P523O247m825
$$ 821 4595 -322 -5387 -733 6306 3206 -5635 -5280 3409 5356 -2495 -6755 768 7015 2190
1578B190p322K402O914k098o506R19P034R36o334j720O142J946n861l820N208
$$ 2190 -5132 -2730 4184 2086 -4420 -3501 3533 4469 -1865 -3585 2557 4503 -1358 -5178 30
1593C0M952m360n896L179P484j229p608j286O931L101o016n037M349O079k123
$$ 30 4982 622 -5274 -2095 5389 4160 -3448 -4734 2197 5298 -718 -5755 -1406 4673 2550
1608B550n635j86N001L83l441q20L388J040k710j598J917J491j985j101J592K234
$$ 2550 -3085 -3271 1730 2113 -1328 -2148 1240 2280 -430 -2028 -111 1380 -605 -1706 -114 2120
1624B120j755k325J107K608m18k285o30K073J292j260j878K46J618N39J51j038
$$ 2120 365 -1960 -853 1755 1337 -948 -1578 495 1787 527 -1351 -1105 513 1052 1203 165
1640A65j166L19J626L09j670j064J928J566j477k844O40L262K74k966r03L012
$$ 165 -1001 -682 944 1253 -417 -1481 447 2013 536 -2308 -1668 1594 1868 -1098 -2001 1011
1656A011J910l075k705J668K869j042k837P32L287J79l246j71L011L35l806k014
$$ 1011 2921 -154 -2859 -1191 1678 636 -2201 -1469 1818 1997 -1249 -1420 1591 1926 -1880 -3894
1672c894M019L308k878l189K435M389j977n734l46N326K020m643k782M618M096
$$ -3894 125 3433 555 -2634 -199 4190 2213 -3521 -3867 1459 3479 -1164 -3946 672 4768
1687D768k809n063N15M164o5l052r38L892J650k809j332J621R39k844j985K478
$$ 4768 1959 -3104 -2589 1575 1510 -1542 -2480 1412 3062 253 -1079 542 1481 -1363 -3348 -870
1703h70L023j076k232J050L034r34m209j373K983K226j636k058J706L025n2k753
$$ -870 2153 1077 -1155 -105 2929 1995 -2214 -3587 -604 1622 -14 -2072 -366 2659 2607 -146
1719a46j959Q71R40O1o58M05P80J151L60n47j927j085R80J007l82p37J110J668
$$ -146 -2105 -1234 -294 -233 -891 -486 294 1445 1805 1258 -669 -1754 -774 233 -149 -886 224 1892
1737A892k11j665o93P02k62j066L21J082N13o99Q12J889r26l279j111K506J579
$$ 1892 1681 16 -677 25 -237 -1303 -982 100 613 -86 726 2615 1689 -1590 -2701 -195 1384
1754A384k052k359K948M229j215m615r22L021J242l330j797L387L452j984k893
$$ 1384 -668 -3027 -79 4150 2935 -1680 -2602 419 1661 -1669 -3466 -79 3373 1389 -1504
1769a504J239K463j482l223K95K833N40k204Q2L228P80l093k356J964J890k334
$$ -1504 -265 2198 716 -2507 -2212 621 1161 -1043 -961 2267 3047 -46 -2402 -438 1452 -882
1785h82k400K865L918o65l631r52K754M39l206j596K781L309j329k302O48J859
$$ -882 -3282 -417 3501 2836 -795 -1747 1007 1446 -1760 -3356 -575 2734 1405 -897 -249 1610
1801A610l52k706n45J211R77m63L18J045J61j477l95J175m97j796l93K593J426
$$ 1610 1258 -1448 -1993 -782 195 -268 50 1095 1256 -221 -616 559 62 -1734 -2127 466 1892
1818A892j339j240P34J295j018j650N3J053J95Q5N87N46r49o62J057K16j630j944
$$ 1892 553 -687 47 1342 324 -1326 -1273 -220 -25 60 647 1193 244 -418 639 855 -775 -2719
1836b719J917K939n06k964l09L052J338l400k544K162K978q79k520O56K471m51
$$ -2719 -802 2137 1631 -1333 -1642 1410 2748 -652 -3196 -1034 1944 1065 -1455 -799 1672 1221
1852A221k309m51K219O37k532o88K670J321k625j462K765K088k552l807J665M459
$$ 1221 -1088 -1539 680 1317 -1215 -1903 767 2088 -537 -1999 766 2854 302 -3505 -1840 2619
1868B619k44m170j173M604J724l367k767J709L194q87l013L38K920J92k515n22
$$ 2619 2375 -1795 -2968 1636 3360 -7 -2774 -1065 2129 1242 -1771 -1433 1487 1679 -836 -1358
1884a358K698M13k847q35K179J444j874j103J715J895j709k645P38K519j79k343
$$ -1358 1340 1753 -1094 -1929 250 1694 -180 -1283 432 2327 618 -2027 -1289 1230 1051 -1292
1900a292l87K434J135j724j511R55J522r85j187K98J058K2n53M78J87l29n95K52
$$ -1292 -1679 755 1890 166 -1345 -390 1132 147 -1040 -742 316 338 -215 263 450 121 -474 -222
1918b22O52j104m9J581P45j177j940J56K489%k030j05J888Q52k117r14J227J035
$$ -222 430 -674 -723 858 1603 426 -1514 -1358 1131 1131 -899 -1004 884 1736 -381 -1295 -68 967
1936I67j134o89J065J186j549j705J268K408j128k661O79L294m02l367r68L403
$$ 967 -167 -856 209 1395 -154 -1859 -591 1817 689 -1972 -1293 2001 1599 -1768 -2736 667
1952F67K344k532l746J994L462m70l388k69L091J018l163j226J995J879j723j112
$$ 667 3011 479 -3267 -1273 2189 1719 -1669 -1938 1153 2171 -992 -2218 -223 1656 -67 -1179
1968a179J691J650k083k676J699K977p02l267Q48L111K2l576j650L260K750j597
$$ -1179 512 2162 79 -2597 -898 2079 1377 -1890 -1042 2069 2091 -1485 -3135 125 2875 1278
1984A278l173R39K381k18k538m05J929J364j212r30Q89j1n87n31J061P06q64j058
$$ 1278 -1895 -956 1425 1207 -1331 -1736 193 1557 345 -585 304 293 -294 -825 236 942 78 -980
2002i80J193R85q32j505O02J410l70j485k28J569R86p53r04K72N5m67p1N52P9
$$ -980 213 1198 366 -1139 -537 873 503 -982 -1210 359 1345 592 -312 -40 15 -452 -523 29 108
2021A08P7L59J016r43j573n13J482J121j444p73J335J501j423j727N24J711J21
$$ 108 185 544 1560 617 -956 -1469 13 1134 -310 -1083 252 1753 330 -1397 -873 838 959
2038I59k080m01J875J069j063j326R33R40n98j555N17J552k47j106L78J412r2
$$ 959 -1121 -1522 353 1422 359 -967 -34 906 308 -1247 -730 822 575 -531 -153 1259 1167
2055A167k291p02K001J326j716j360J478K013p21k926L7K897O42k246k007J884
$$ 1167 -1124 -1826 175 1501 -215 -1575 -97 1916 1195 -1731 -1694 1203 1845 -401 -2408 -524
2071e24J790m27j789K14J752K06j420p80P66M55o60j08R89P48r36j143J161O82
$$ -524 1266 839 -950 -736 1016 1222 -198 -978 -212 243 -417 -525 464 1212 276 -867 294 976
2089I76p61j624K98J794P20j810p71J357J277p09k199l29J556J424n65j297J24
$$ 976 215 -1409 -1111 683 1403 -407 -1178 179 1456 747 -1452 -1781 -225 1199 634 -663 -539
2106e39J409J55j383q08J84J247M14o92n7O26J71n71p52J75N16k61k58N09Q25
$$ -539 870 1025 -358 -1166 -982 265 679 -13 -70 556 727 156 -596 -421 95 -166 -424 85 910
2125I10l29j148K20J002R8j508q68J662J617j378j829Q86J625M79k175q36J592
$$ 910 581 -567 -347 655 753 -755 -1623 39 1656 278 -1551 -665 960 1439 -736 -1572 20
2142B0J726j371k093R99K049q0k109k90J834M77j809j035J417J473o03j813O82
$$ 20 1746 375 -1718 -719 1330 1250 -859 -1149 685 1162 -647 -1682 -265 1208 605 -1208 -526
2159e26J449k72j711k7J660M39j651n89J768J021j640j232P77J803q26k145N32
$$ -526 923 651 -1060 -1087 573 1012 -639 -1228 540 1561 -79 -1311 -534 1269 443 -1702 -1170
2176a170K064N63j683q89J151J180j245j271L84J373L07o69k59K96J00j22j60
$$ -1170 894 1457 -226 -1115 36 1216 -29 -1300 -916 457 764 95 -164 132 232 110 -50
2193e0j39j20K3M40L67j21p18P0L72m5j91m31J32N83O8K86k84k73k20N52M1n53
$$ -50 -189 -309 -286 154 521 400 -318 -248 124 79 -112 -543 -411 172 240 526 242 -31 -251 301 342 -211
2215b11o62L84J583j33j276p37J291J353j450j659N72J966K61j589q13J483J049
$$ -211 -873 -489 1094 961 -315 -1052 239 1592 142 -1517 -945 1021 1282 -307 -1120 363 1412
2232A412j595j246R18J439n35j128P65J196p94j679K11K086j41j785n12K115R83
$$ 1412 -183 -1429 -511 928 393 -735 30 1226 432 -1247 -1036 1050 909 -876 -1388 727 1710
2249A710k252j604J623K212q59k084K5K081O24j794j059J532J237j136j717R15
$$ 1710 -542 -2146 -523 1689 830 -1254 -1229 852 1476 -318 -1377 155 1392 256 -1461 -546
2265e46J325r8j382K14J043J53j366j97Q66O57j071l48J040O61q48j176M27J073
$$ -546 779 681 -701 -487 556 709 -657 -854 12 669 -402 -750 290 951 103 -1073 -646 427
2283D27L16j432j49J069M21n52m83L94M56l02j95p73K99K24L57L19k33j81l7N39
$$ 427 743 -689 -838 231 652 100 -383 11 467 165 -30 -803 -504 -280 77 396 163 -18 -55 484
2303D84p84o04M45J133K03j210k55Q88L93n37r52M77Q08k00p93J74J069j06r03
$$ 484 -300 -904 -459 674 877 -333 -588 300 693 156 -796 -319 489 289 -504 -330 739 633 -270
2322b70j64P60K4j252k72J669R60j160j282Q13J568q64k174J07K427J012j510
$$ -270 -434 326 350 -902 -1174 495 1455 295 -987 -174 1394 530 -1644 -1537 890 1902 392
2339C92j646Q39J857r62j853M38J561K12j352j71J142J60j053n15J297O31j124
$$ 392 -1254 -415 1442 480 -1373 -935 626 838 -514 -685 457 617 -436 -951 346 977 -147
2356a47j319J132J763n59j722QJ853P2j848p92J545J140n25j289rJ319j20r56
$$ -147 -1466 -334 1429 870 -852 -844 1009 1081 -767 -1559 -14 1126 601 -688 -697 622 502 -454
2374d54m01R61K99j35l47m1K45lj45Q5R8l36r6r8L07K80j09K41k28j9k63P3K8
$$ -454 -855 106 405 270 -77 -118 127 124 -21 64 162 -174 -270 -368 -61 219 110 351 123 104 -159 -86 -58
2397e8k44N22K39k08o95K83Q18q8q54m38Q52P33r90p82R07J073n99r85m27J406
$$ -58 -302 220 459 251 -444 -161 657 569 -285 -723 129 862 -128 -910 -3 1070 471 -514 -941 465
2417D65M71j346q56J468J126r09j349J83J442M9j269l88J409M69j264q15J195
$$ 465 936 -410 -1266 202 1328 419 -930 -747 695 744 -525 -913 496 965 -299 -1114 81
2434H1Q34r96j022J095J120n00j529L5J331M98j369j026J616J176j292j495Q13
$$ 81 915 -81 -1103 -8 1112 612 -917 -882 449 947 -422 -1448 168 1344 52 -1443 -630
2451f30J602k3j345o24R65Q95o62q22M81N54l17o28J21O74J8o71L19M19J61q70
$$ -630 972 949 -396 -1020 -55 840 178 -644 -163 391 74 -554 -433 241 259 -412 -93 326 487 -383
2471c83l56O06N16o45k85M33O08J82r69j24L16N78k99m10k69N83P18l15j001m8
$$ -383 -739 -133 383 -262 -547 -114 494 676 -293 -417 -101 477 178 -232 -501 82 800 485 -516 -564
2491e64L57N73m76m40L65N21P0k39l84M0K78o0k78J80M19j42n09L56J60j09o54
$$ -564 -207 366 -110 -550 -185 336 406 167 -217 -177 101 41 -237 -57 362 220 -289 67 227 118 -536
2512e36l2P09L33o32n22N67J096m73j400O1J260K83j003n32Q30J001p76p69O7
$$ -536 -568 141 474 -158 -680 -113 983 510 -890 -829 431 714 -289 -821 9 1010 234 -535 -468
2531d68J114o6j222j93J302M62j088n22N50O12l29p22J3J164K0j136J08P01M03
$$ -468 646 580 -642 -835 467 929 -159 -681 -131 481 152 -570 -557 607 627 -509 -401 300 703
2550G03j141l50P25P47m39j040N31R61M6j057l40R12M35o36p73J35Q64J50p30
$$ 703 -438 -788 -63 684 245 -795 -264 697 743 -314 -654 258 693 57 -716 -581 283 433 -297
2569b97k60N19O15j33r20R1K99K60O5l51j02L57O8m09o5M81j44j25j02L40J58
$$ -297 -557 -38 577 444 -476 -385 -86 174 239 -112 -214 143 211 -198 -263 218 74 -51 -153 187 345
2590C45k15l18k5Q70m6q15o82J009P37q48q07M04Q91K31j009n02Q94J166r91j157
$$ 345 130 -188 -213 657 611 -204 -886 123 860 12 -795 -391 500 731 -278 -780 114 1280 289 -868
2610h68K98J265k14j067R6R25K40r47m08Q20O00q94p96O92J342p24j242Q1J509
$$ -868 -570 695 481 -586 -490 435 675 -272 -680 140 740 -154 -950 -258 1084 360 -882 -801 708
2629G08K65j429n71J211Q25r34j266Q61J540j86j775j22R75O96q29p18P27Q75
$$ 708 973 -456 -1027 184 1009 75 -1191 -330 1210 1024 -751 -873 102 798 -31 -749 -22 853
2647H53m41j091N11O54j09o79J4P36P9q02j69N33M75m49o22L06L36n8m43J63L95
$$ 853 412 -679 -168 486 377 -302 -288 448 527 -275 -444 89 564 115 -507 -201 135 77 -366 -203 192
2668A92L20m99j49n4M26k4m04q6K58L83J71n86r4K4P6L27q21J67N12K47n26j61
$$ 192 512 13 -136 -190 236 212 -192 -278 -20 363 534 -52 -146 -122 -46 281 -540 -373 139 386 -140 -301
2690c01L75M57k37r15N1N66M54k84j83L33J35k27o71K90M07k66k50L98N53o0j286
$$ -301 74 531 294 -621 -570 -4 450 166 -17 316 451 224 -447 -157 250 -16 -266 132 685 625 -661
2711f61l8J009M69j000o41N39J127k20j297J36R86L67j023o76O48P17j53q44O53
$$ -661 -699 310 779 -221 -862 -323 804 584 -713 -577 409 776 -247 -923 -275 442 289 -555 98
2730I8O33k92q85n5O00J05m43k46P96K88o90l34M96M91l64q18M3J026K34q72m37
$$ 98 731 439 -446 -501 99 204 -239 -485 311 599 -91 -425 71 562 198 -620 -577 449 683 -189 -626
2751f26M61R60n41n73k80N61J83j56k09L20K92j8m53j6j13k44M08q5L94J51m68
$$ -626 -165 795 254 -319 -599 -38 145 -11 -220 100 392 374 -79 -95 -208 -452 -44 -129 265 416 -52
2772e2L5K08j92l09J26K14p0m1J39l3k56M33ol35m21M21L84l01r1j4N43J40n05
$$ -52 -17 191 -1 -310 -184 30 -40 -81 58 25 -231 202 196 -139 -560 -139 245 -56 -147 -161 382 522 17
2795A7m97J46Q46l19o08l6P51J91m09o64N33M27l4j066K89P42j73l64Q5M83j00
$$ 17 -480 -334 512 193 -415 -451 300 491 82 -582 -49 378 344 -722 -433 309 136 -228 -143 340 240
2816B40l24j80L53K63l25o58N34O38k35p14J3R02J7r79l37O79P77k47o78O0M90
$$ 240 -84 -264 89 352 27 -631 -97 541 306 -408 -395 507 524 -455 -792 -113 664 417 -261 -201 289
2837B89J15p07L8J49J82Pk8j90L23j86q1j3K11l2k82K55oL2k87J44K72J18k62
$$ 289 404 -303 -265 -116 66 73 45 -145 178 -8 -89 -102 109 77 -205 50 44 76 -211 -67 205 323 61
2860F1j82k70L27K25j50j10l4K58L46l94l65j07M54K28k71l87K07N73J88q68k29
$$ 61 -121 -391 -64 161 11 -99 -133 125 471 77 -288 -395 59 287 16 -371 -164 409 597 -271 -500
2881e00O08N5j66k83Q4N63j67m96K05N18l01n41J0L92N68o42l81N25M24m48m35
$$ -500 108 163 -3 -286 -202 361 194 -302 -97 421 120 -421 -411 -19 549 -93 -474 51 475 27 -408
2902d08K80R7M44q93j45R46K47m33m77K42N66l64p77M22O62j38l68k10L54L66
$$ -408 -128 -31 413 -480 -625 321 568 135 -342 -100 466 102 -675 -253 409 271 -97 -307 47 413
2922D13n19m16M73L46q4m97L27K85l02j15o4J77K17n94J63M22J45k04o02L58K56
$$ 413 -106 -522 -49 297 213 -284 43 328 26 -89 -153 24 241 -353 -190 232 377 173 -429 -71 185
2943A85j96k82J27J16J42K1l38K14j4Q7k21J00k14J24K81j56j30l1J38M74m77
$$ 185 -11 -293 -166 -50 92 113 -225 -11 -25 62 -159 -59 -273 -149 132 -24 -154 -185 -47 427 -50
2964e0j61J13Q2Q7k23K6K52L1k90O4L8K06m01K34P7K80l71n46O19N10m44p24J83
$$ -50 -211 -98 -16 71 -152 -126 126 157 -133 -69 -31 175 -226 8 85 365 -6 -552 67 577 133 -591 -408
2987d08P52mm56m38M14P97m62m27j31P30K2o95K7L72K36l39k48N69J5k90n41M73
$$ -408 344 340 -116 -554 -140 657 195 -232 -363 367 389 -306 -279 93 329 -10 -258 311 326 36 -505 -32
3009c2O54o45l86J31N64q3l71j18L82K58k15o28L08N48j77k01k33L08L27l86k20
$$ -32 622 -23 -409 -278 286 203 -168 -286 96 354 139 -489 -181 367 190 -11 -244 64 391 5 -215
3030b15k4L11n6k42J98K56j72k21L24r8j03j71k2k2J66K30l81M13r7j92Q6o1j59
$$ -215 -239 72 16 -226 -28 228 56 -165 159 61 -42 -213 -235 -257 -91 139 -242 171 74 -118 -32 -93 -252
3053b52m7M66rq9k04N37k06n35Q5j2L71j09l99L32N37R1n51l01L62R4j48m63K12
$$ -252 -299 167 158 69 -135 402 196 -339 -254 -266 105 -4 -403 -71 466 557 6 -295 67 161 13 -450 -238
3076b38O49M7o01l8K43L50o18l07L13L63mn91N95M10l87o04J18N78K4m96m22O64
$$ -238 411 458 -143 -181 62 412 -206 -513 -200 163 159 -432 163 573 186 -418 -300 278 302 -194 -616 48
3098D8O69n43m12J99J98j46l07k80P04M07m29j83K07K10k51n65PM78Q7m20K41
$$ 48 717 174 -238 -39 159 13 -294 -574 130 537 108 -75 132 342 91 -474 -467 11 98 -322 -81
3119h1L55J70l89k40N8J33k58k85N79J76n8j37l17M28R1q3o14O9N01K41k24j20
$$ -81 274 444 55 -185 -127 6 -252 -537 42 218 160 23 -294 134 225 142 -472 -403 98 339 115 -5
3141eJ26L2J77k65k92J03K4J45m6J20K64p3k70j48L9N6l50N1K98N57k92k74j51
$$ -5 121 153 330 65 -227 -124 -100 45 -1 119 383 310 40 -108 -69 -13 -363 -312 -14 543 251 -23 -174
3164a74J91N9n56L8M32M53l17j15M5Q4J30o86j35O23J00m5l20K09L70m2n56J9
$$ -174 17 76 -480 -442 -10 443 126 11 56 140 270 -416 -551 72 172 127 -193 16 386 344 -212 -193
3186a93J48K18n34q0L97L75j55l40O1L24n7m58k09P91r5l21m5L26J98k87n29K91
$$ -193 -45 173 -361 -441 -44 331 176 -164 -103 221 164 -294 -503 288 193 -128 -173 153 351 64 -465 -174
3208a74K89R5m45L6N46K68m92m69K75L65l08m23K93K01J43q4j04M7l5J29k88k9
$$ -174 115 210 -235 -199 347 615 123 -346 -71 294 -14 -437 -144 57 200 116 12 59 24 153 -135 -164
3230a64M5K08Q9j60K62j06k19j10K26J08l31r1k6L02P9j9l4r9m5K03k44j30K96
$$ -164 -119 89 178 18 280 174 -45 -155 71 179 -152 -243 -269 33 112 93 59 -40 -85 118 -126 -256 40
3253D0J50pk38O4k6K26l11k37L61j2rl23K92J23M1k53p8M01k32p2p3kM58j65m52
$$ 40 190 183 -55 9 -17 209 -102 -339 22 10 1 -322 -30 93 134 -119 -197 204 -28 -100 -173 -175 283 118 -334
3278c34J34N36j20p11m7O11K20q2n78L61M15k07l94r4M71j07k57k18L06M15k37
$$ -334 -200 336 216 -495 -542 69 289 207 -371 -10 405 198 -196 -290 181 74 -183 -401 -95 320 83
3299H3l10K95J64O8o65J31L34K09l08j36M34N0j73l74J36J36k86j95K85L13J44
$$ 83 -227 68 232 300 -365 -234 100 309 1 -135 299 349 176 -198 -62 74 -212 -407 -122 191 335
3320C35j62l74K87j90O3q9Q3M70k98j68j26P8K98ll89o0K11K00j06j13J93r7J68
$$ 335 173 -201 86 -104 -41 -130 -47 423 125 -43 -169 -91 207 204 -185 -245 -34 166 60 -53 140 43 211
3343B11j50j75N0P6P4N1k77K95p6L1k57K06O5k20j08J85K53q3m37K03K54K71k44
$$ 211 61 -114 -64 12 86 137 -140 155 79 110 -147 59 124 -96 -204 -19 234 151 -286 -83 171 442 198
3366A98m58o5O53k15l00p2M37J91m12l16K37K92q5k40k94O35j11k13k67P50j26
$$ 198 -260 -325 328 113 -187 -259 178 369 -43 -359 -122 170 85 -155 -449 186 75 -138 -405 345 219
3387B19o28K34L23J13n73n6N1P64l33n61R2L45J73l74j13J04L03M2l96R9M12j86
$$ 219 -409 -175 148 261 -312 -368 -317 447 114 -447 -355 -10 163 -211 -324 -220 83 125 -271 -172 240 54
3409E4k56o9J98K18p8J4n9J37J65l31k25J62j34m2L35R2k19K56j79r1L09m07j18
$$ 54 -202 -271 -73 145 67 81 22 159 324 -7 -232 -70 -204 -246 89 181 -38 218 39 -52 257 -150 -268
3432b68K5L82j39N6n4K66q1r7r5m3q8J45K15k67o3K50L49l32l31J2K32k40J8J3
$$ -268 -243 139 0 56 2 268 187 90 -5 -48 -136 9 224 -43 -106 144 493 161 -170 -158 74 -166 -148 -135
3456a35K87K06j18j64l20K65J85l42l4J8K49Q4k01P3J10J1n54R6M47k53j74L22
$$ -135 152 358 240 76 -244 21 206 -136 -170 -152 97 181 -20 53 163 174 -380 -284 163 -90 -264 58
3478E8M16j77n05l21K73N22l77j66O9O59q3l02j12j20L18l28q0R3L13j5n7K31
$$ 58 474 297 -208 -529 -256 266 -111 -277 -208 451 368 66 -46 -166 152 -176 -256 -163 150 135 78 309
3500C09m8l17j99j7O4K22j23r1L38K35k94o8m8p3J69l37J51J85J45J96j57m89
$$ 309 261 -56 -255 -272 -208 14 -109 -200 138 373 79 11 -37 -110 59 -278 -127 58 203 399 242 -247
3522b47K13jk59J97j93L33L1K6N7j51J43j75j48j55L93k3k23J35J77K69k60l06
$$ -247 -34 -35 -294 -97 -290 43 74 100 157 6 149 -26 -174 -329 64 41 -182 -47 130 399 139 -167
3544a67j4Q4J7r9qK44L52k09j33j1o2l19p9K82J32M36l61r1P9R0n8l64l5M04Q8
$$ -167 -181 -97 -80 -179 -187 57 409 200 67 56 -6 -325 -404 -122 10 446 85 -6 73 163 105 -259 -294 110 198
3569A98k42l13L66N84m96k23m3L01j69j37r9L24R6o4k73L39j35r5j2j1K22l8p5
$$ 198 -44 -357 9 593 97 -126 -169 132 -37 -174 -273 51 147 83 -190 149 14 -81 -93 -104 118 80 5
3592Ej36L40M1l93N1K0K16q9k76J5M60j15l19K53M6j43J19k52MJ44R6j42J9J19
$$ 5 -131 209 250 -143 -92 -72 144 55 -221 -206 254 139 -180 73 119 -24 95 -157 -153 -9 87 -55 -36 83
3616H3o8j84J94m00M34nk12j92K17L17k65O7j18K15on2l09L20K1J10l44J18Q5
$$ 83 15 -169 25 -375 59 54 -158 -350 -133 184 -81 -14 -132 83 77 25 -284 36 57 167 -177 -59 26
3639B6M11m80j42J53K73j85l69K25J3J76ql10K48K57m15O9j47N77m84n0J39K42
$$ 26 437 -43 -185 -32 241 56 -313 -88 -75 101 93 -217 31 288 -127 -58 -205 372 -112 -162 -23 219
3661B19k74j19j33L12J51k86q5K28K55j74k15q5L74r8k56l82P18J58j92l09J15
$$ 219 -55 -174 -307 5 156 -130 -215 13 268 94 -121 -206 168 70 -186 -568 150 308 116 -193 -78
3682g8J58l3l10K30j14L66k27k48M48J21l07o8N8j32M7j14J49j2O2j08N9j55L11
$$ -78 80 47 -263 -33 -147 219 -8 -256 192 313 6 -62 -4 -136 -89 -203 -54 -66 -4 -112 -53 -208 103
3705A03k10k8K46k44L31l7lj02P6k0k91j40J14L07n9k77L89Q6q3K4m53M4J61o5
$$ 103 -107 -135 111 -133 198 161 158 56 132 112 -179 -319 -205 102 43 -234 155 241 158 182 -271 -227 -66 -131
3729a31l7J69O6K53j18l18N1L68m63l17M96L06k56p8J3J42j2n01qL43J79k07l06
$$ -131 -168 1 67 320 202 -116 -65 303 -160 -477 19 325 69 -9 4 146 134 -367 -375 -32 147 -60 -366
3752c66N03K03J61m61l16J29K62p1l41J85L81j68M4n5J1j33k15j72M64K01j03
$$ -366 137 340 501 40 -276 -147 115 44 -297 -112 269 101 145 90 101 -32 -247 -419 45 246 143
3773A43k35L14N3J33p97K22J31J59l14j11O38j82J25l09j06pL8l20K06J65L98
$$ 143 -92 222 275 408 -389 -167 -36 123 -191 -302 336 154 279 -30 -136 -143 -105 -425 -219 -54 344
3794C44q3k06j57K43Kl66%K0K29R8j7n1J71Ok12n6l59M44O8r2Q1K23j66k54j5
$$ 344 261 55 -102 141 143 -223 -223 -203 26 124 107 56 227 233 21 -35 -394 50 118 26 107 330 164 -90 -105
3819a05L5j72R0r3L15J43q2rk34k6L34k31k69J6J92M69l28NJ68K72l08l19Q4%
$$ -105 -70 -242 -152 -245 70 213 131 122 -112 -138 196 -35 -304 -288 -96 373 45 50 218 490 182 -137 -53 -53
3843e3N9k8l31N50L26k98k61M3j22J05l64M92J91m6l12K36P4j74p1l75K04K88
$$ -53 6 -22 -353 197 523 225 -36 7 -115 -10 -374 118 309 263 -49 187 261 87 16 -359 -155 133
3865A33r8j54K88j47K44k51l43J30K25j82k61M74J83o4k64P0L7k79J8n8K97J16
$$ 133 35 -119 169 22 266 15 -328 -198 27 -155 -416 58 241 177 -87 -17 20 -259 -241 -299 -2 114
3887A14l3J51o5%mm00r7K39J35n3j45K09N23m08j86k36J83p7o4K35O4J39J6j00
$$ 114 81 232 167 167 163 -237 -334 -95 40 -13 -158 51 574 166 -20 -256 -73 -150 -214 21 85 224 240 140
3911A40l02J41Lj51R7r3L08q9J36j51J27J88o75J58j03L25J02j80O9pK83l78j37
$$ 140 -162 -21 -18 -169 -72 -165 143 54 190 39 166 354 -321 -163 -266 59 161 -19 50 43 326 -52 -189
3934a89K08q9j16q5M48m5J3j74k10J68K20k61k07J86L50n5j27k24L21J5k17k77
$$ -189 19 -70 -186 -271 177 132 145 -29 -239 -71 149 -112 -319 -133 217 162 35 -189 132 147 -70 -347
3956c47N09J0k12k68L20K93L0k54k03M8J44p2k11K57K26k40j79J41J68O8n45N5
$$ -347 162 172 -40 -308 12 305 335 81 -122 -74 70 -2 -213 44 270 30 -149 -8 160 228 -317 -262
3978b62K04K07j02j33r3M40n2m56k3Q8K24k4qj34Q1M78m98J06k14K91M2j67o9
$$ -262 -58 149 47 -86 -179 261 209 -247 -270 -182 42 18 10 -124 -43 435 -63 43 -171 120 162 -5 -74
4001g4O9J70l47K28j03L16n58m8J66M17k34k27R6K35p5k7O7j75L12p9l85k1L40
$$ -74 -5 165 -182 46 -57 259 -299 -347 -181 236 2 -225 -129 106 31 4 71 -104 208 129 -256 -277 63
4024F3K56l97M2J9L28K1l77n7O6O9m27L84J99l3j71j61K52P6o7j21n8M0M00k73
$$ 63 319 -78 -36 -17 311 332 -45 -102 -36 33 -394 -10 189 156 -15 -176 76 152 85 -36 -94 -54 346 73
4048G3n30P09O3o9m12j2J15K66k38M0L00K16n22k86NN17k38l26K38R7M45j74m42
$$ 73 -457 252 315 246 -166 -178 -63 203 -35 5 305 521 -1 -287 -282 235 -3 -329 -91 6 451 277 -165
4071a65R7K42k88l18L04K29j6J4Jj08K35k24L0j84q0rL44K2K28N7l45k51J51M6
$$ -165 -68 174 -114 -432 -128 101 85 99 100 -8 227 3 33 -151 -231 -240 104 126 354 411 66 -185 -34 12
4095A2j49l43L57L0M78j38k32KJ19j7l87O6mL32K17n27L84Q9j42m99R8lK58R8
$$ 12 -137 -480 -123 -93 385 247 15 17 136 119 -268 -202 -206 126 343 -184 200 289 147 -352 -254 -257 1 99
4119I9l82M51L53k93n16J72Q6P0j04j79J63N31k26k77K1K98k27l20r8K20M11l91
$$ 99 -283 168 521 228 -288 -116 -30 40 -64 -243 -80 451 225 -52 -31 267 40 -280 -378 -158 253 -138
4141a38K9K63J49j38l80J26J96k00n23L96M66K02k51k52q7M85n22M5n3J40J80
$$ -138 -109 154 303 165 -215 -89 107 -93 -616 -220 246 448 197 -55 -142 343 -179 -134 -187 -47 133
4162A33J24k33O8K12k86l66q0N08Q7k06rL79k5m6l33k18K33J76m67J57M60J62
$$ 133 257 24 92 304 18 -348 -428 80 167 -39 -48 331 306 260 -73 -291 -58 118 -349 -192 268 430
4184D30j76j42R6k01j93m9K7K25J90k05j08K32q1q6l11K55j44J31r6K38J48J74
$$ 430 254 112 208 7 -186 -235 -208 17 207 2 -106 126 45 -41 -352 -97 -241 -110 -206 32 180 354
4206C54l8l41j36K49n0k15p3L18M25j44m65J91j08q4Q3l75K91N12k89o8J36J95
$$ 354 316 -25 -161 88 38 -177 -250 68 493 349 -116 75 -33 -117 -34 -409 -118 394 105 37 173 368
4228C68j30m56r9L56p4k37K63K29J53k52Q9j51K3k17q3k30P36J49l50J2r4J61
$$ 368 238 -218 -317 39 -35 -272 -9 220 373 121 210 59 82 -135 -218 -448 288 437 87 99 5 166
4250A66j24n16Q0N32L85m08k86K35M7j79k73K54QJ9j88K17J35K74l02m49J25J80
$$ 166 42 -474 -394 138 523 115 -171 64 111 -68 -341 -87 -79 -60 -248 -31 104 378 76 -373 -248 -68
4272f8M2q9J14O2J70j09p7QL75o49K1o7L94n7l2J27k19L45k39l22J99P6Kj11q4
$$ -68 -26 -115 -1 61 231 122 45 53 428 -221 -200 -267 127 70 38 165 -54 291 52 -270 -71 5 7 -104 -188
4297a88L06K6k26J81j14R8L3r3NN0L15j62k96l2L44j91l55K48j16K23Km02L47
$$ -188 118 144 -82 99 -15 83 116 23 28 78 393 231 -65 -97 247 56 -299 -51 -167 56 58 -344 3
4320CJ90k18j30o2L27o5k58M8K17K81k86J3k90L10P8k47j12M04M2l29o9M46j04
$$ 3 193 -25 -155 -217 110 45 -213 -165 52 333 47 60 -230 80 158 -89 -201 203 245 -84 -153 293 189
4343A89K4m10OR7K05l38R3m0K16j89N8K79O3k7k41n6j12K27l16J02L80l12k4J35
$$ 189 213 -197 -191 -94 111 -227 -134 -174 42 -147 -89 190 253 226 -15 -71 -183 44 -272 -170 210 -102 -126 9
4367IKJ03J88o75J63L58j21J03Mj41JM2J78j73m10L43J40p2q5J86k1k46M5K68
$$ 9 11 114 302 -373 -210 148 27 130 134 -7 -6 36 214 41 -369 -26 114 42 -43 143 122 -124 -79 189
4391A89k55O6k15K05L32k52j21k08K97J41k27N2j2K82P2k56q1L48j23k15l73P3
$$ 189 -66 0 -215 -10 322 70 -51 -259 38 179 -48 4 -8 274 346 90 9 357 234 19 -354 -281
4413b81K44J71l86M04K20q2l31n6L04q8j65k0J71J15J12k97L3j14%n8k5m6M09
$$ -281 -37 134 -252 152 372 290 -41 -97 207 119 -46 -66 105 220 332 35 68 -46 -46 -104 -129 -175 234
4436B34m2l18K61J03k22k32j13K92j16P6J39k5L10j12k83r1J79p8k42J53K4L68
$$ 234 192 -126 135 238 16 -216 -329 -37 -153 -77 62 37 347 235 -48 -139 40 -38 -280 -127 -103 265
4458B65J33l41K4k81J77l20P8J12K06kJ95j04R1k58l80J50n3K94q3M4j20L50l1
$$ 265 398 57 81 -200 -23 -343 -265 -153 53 51 246 142 233 -25 -405 -255 -308 -14 -97 -53 -173 177 146
4481A46K0o25J91K88j94k34M49K89Q0j51k67Q4q3k65L3kM34l5p6J01p8Qk62l28
$$ 146 166 -459 -268 20 -174 -408 41 330 410 259 -8 76 -7 -272 -239 -241 193 158 82 183 105 113 -149 -477
4505d77j2L55J92k10M52K20k20k74j85J57j72j88J01J89M26K18n87J9J22o8m64
$$ -477 -489 -134 58 -152 300 520 300 26 -159 -2 -174 -362 -261 -72 354 572 -15 4 126 58 -406
4526d06k8K93J38J64j30K54l5j80k70k28K83K1L1O7L39j51j93m8l6K12j49j61
$$ -406 -434 -141 -3 161 31 285 250 70 -200 -428 -145 -124 -93 -26 313 162 -31 -79 -115 97 -52 -213
4548b13J19L93j63r3J08j0k94M7j76k19L66K85j91K19m1J23n8k13l11j2K75J6
$$ -213 -94 299 136 43 151 141 -153 -106 -282 -501 -135 150 -41 178 137 260 202 -11 -322 -334 -59 -43
4570d3P6p5K76k11R2j8m76K08J01n4J4L91J7j62k68K24J39m11j58PJ99K15n4J50
$$ -43 33 -42 234 23 115 97 -379 -171 -70 -124 -110 281 298 136 -132 92 231 -180 -338 -331 -132 83 29 179
4594A79q6K82p98R4qM58o9k87J46L31Ll09j21N4K40k70j6M0M02J00l96j3J0Ol27
$$ 179 93 375 -423 -329 -337 121 52 -235 -89 242 245 -64 -185 -131 109 -161 -177 -137 265 365 -31 -44 -34 -28 -355
4619c55M4l6O33l50J21O2M9qm53j34N60J94l34k52K3N27j84J1j11K04k40j45k16
$$ -355 -311 -347 286 -64 57 119 168 160 -293 -427 133 327 -7 -259 -236 291 107 118 7 211 -29 -174 -390
4642c90M92j0J05j48j04J43j84P0k46K05J51k36J84q3J78lj26QP1j8K8o7R4j38
$$ -390 102 92 197 49 -55 88 -96 -26 -272 -67 84 -152 32 -51 127 124 -2 6 77 59 87 20 114 -24
4666b4J95Jk10K03J2j52l50L66J15o2o5k40L62O3m9l06J91q9J8l04J13J56R2j48
$$ -24 171 172 -38 165 177 25 -325 41 156 94 29 -211 151 214 165 -141 50 -39 -21 -325 -212 -56 36 -112
4690a12M2J58J08l27L1J36Q2r6j56J15j61K06j65j82M09k2o8j59p7L27M5k00j69
$$ -112 -70 88 196 -131 -100 36 118 22 -134 -19 -180 26 -139 -321 88 66 -2 -161 -238 89 134 -66 -235
4713b35L95R0l57p1R1K52j68j15L8J85J79p9n10L79j78l0n5R4M02j65j17J15k1
$$ -235 160 250 -107 -178 -87 165 -3 -118 -80 105 284 205 -305 74 -104 -134 -189 -95 307 142 25 140 119
4736A19no4l10R9M06m1j67kJ20J5j29k22J59J81j11o4j37N5M09k25k56Q4j4j3
$$ 119 114 50 -260 -161 245 204 37 35 155 170 41 -181 -22 159 48 -16 -153 -98 311 86 -170 -86 -100 -113
4760a13M5P6n7K61j66J05j83J67j22j03N4J46J35k04M0J23j30L1l91o9K59K26
$$ -113 -68 8 -49 212 46 151 -32 135 13 -90 -36 110 245 41 81 204 74 105 -286 -355 -96 130
4782A30j45j29L74M0l6l39J35j07j68l9J21K70rn0k0j23M01o17m6O5K35L42k48
$$ 130 -15 -144 230 270 234 -105 30 -77 -245 -284 -163 107 98 48 28 -95 306 -311 -357 -292 -57 285 37
4805C7K27P2n0k42l72O8K66k84L31M7J72j14j62M4PJ5l68o7J50L10L46k52Lnj49
$$ 37 264 336 286 44 -328 -260 6 -278 53 100 272 158 -4 40 47 62 -306 -373 -223 87 433 181 184 179 30
4830C0p4l23P8O0K87k61K76J23oj52k27N3j8j98K00M16Q2j18o4q4j38j1k57K07
$$ 30 -44 -367 -289 -229 58 -203 73 196 190 38 -189 -136 -154 -352 -152 264 346 228 164 80 -58 -69 -326 -119
4854a19r0J79L42j62j47k7j43q4n1J66J09M71n97K69l0N1L5l99k30K63M37l09
$$ -119 -209 -30 312 150 3 -24 -167 -251 -302 -136 -27 444 -153 116 86 137 172 -227 -457 -194 243 -66
4876f6K36OJ30ln10J13q0J42k18q2N70L0k9oj06j26j71j41K2K36J65k03J82K07
$$ -66 170 176 306 303 -207 -94 -174 -32 -250 -332 238 268 239 233 127 1 -170 -311 -289 -53 112 -91 91 298
4900B98L85n65m06J04K27L6k07K42K67l09%j85J62l62q4L18l9K41K53k43j24L3
$$ 298 683 118 -288 -184 43 79 -128 114 381 72 72 -113 49 -313 -397 -79 -118 123 376 133 9 42
4922D2J68k47l76K96K39k40Q2Q9J82r0j11k96r9K38k5r1J24L02P0k68j13J15m2
$$ 42 210 -37 -413 -117 122 -118 -36 53 235 145 34 -262 -361 -123 -148 -239 -115 187 257 -11 -124 -9 -51
4945e1k55j10K27N13Q2l39J62j19o9l57j33J22Q1L47P7k00J92k19L04m22l5K78
$$ -51 -306 -416 -189 324 406 67 229 110 41 -316 -449 -327 -246 101 178 -22 170 -49 255 -167 -202 76
4967G6n1l9j0J97q7j6j17J73M5l31l4L54m7J27p3k63K36j23Nk75L3K08M8k9j35
$$ 76 25 -14 -24 173 86 70 -47 126 171 -160 -194 160 113 240 167 -96 140 17 22 -253 -220 -12 36 7 -128
4992a28K76J99k19k51J54K6M9k29J42P5j6k4j55L39l04K4m80O09N7k04N1p9K52
$$ -128 148 347 128 -123 31 57 106 -123 19 94 78 54 -101 238 -66 -42 -522 87 144 -60 -9 -88 164
5015A64o3k77nJ32J61O6l07O9K39M4j19k34N4K79K6l16J38j57M9j12J07M4o9m8
$$ 164 101 -176 -181 -49 112 178 -129 -60 179 223 104 -130 -76 203 229 -87 51 -106 -57 -169 -62 -18 -87 -135
5039a35K9J29K25j20m20K10P6J97k01Q8k67M12K6j08j88O9J34k90M0J7J81j79
$$ -135 -106 23 248 128 -292 -82 -6 191 -10 78 -189 223 249 141 -47 22 156 -134 -94 -77 104 -75
5061g5j3j17J59pp8J72r1L11Q2o03L74J82j82m16p8J43L25j28J37l0J55l11k87
$$ -75 -88 -205 -46 -53 -131 41 -50 261 343 -260 114 296 114 -302 -380 -237 88 -40 97 67 222 -89 -376
5084c76R9K40K00k65J1J13J22K1k04j67M10k62k87J57J80K60j10l26K10P3J2l17
$$ -376 -277 -37 163 -102 -91 22 144 165 -39 -206 204 -58 -345 -188 -8 252 142 -184 26 99 111 -206
5106b06k70M81J82j98pJ51P3k25oj45K10n9k05K73J00M9j06j12m7J17j52j25Q
$$ -206 -476 5 187 -11 -18 133 206 -19 -25 -170 40 -19 -224 49 149 198 92 -20 -67 50 -102 -227 -219
5129b19L61K39k37j1K55l70J76m82k01M64K19p4K7p3J45l6k74Qj71J96p6J35L51
$$ -219 142 381 144 133 388 18 194 -288 -489 -25 194 120 147 74 219 183 -91 -83 -254 -58 -134 1 352
5152C52j15O8l75j45K56J06m52J85j09M26j3N3k45J77l4m63O4J07K45J57k67K04
$$ 352 237 305 -70 -215 41 147 -305 -120 -229 197 184 237 -8 169 135 -328 -264 -157 88 245 -22 182
5174A82J5n2l55j17K60j1j52K4K71O9L1l40K41l7j85j17J61L45P7k13j90K40J07
$$ 182 197 145 -210 -327 -67 -78 -230 -206 65 134 165 -175 66 29 -156 -273 -112 233 310 97 -93 147 254
5197B54q3n70J88K72M2q0O1L26k80n1k06n1P2m0j09K27K04K7L7k50l2R2j88j25
$$ 254 171 -399 -211 61 103 23 84 410 130 79 -127 -178 -106 -146 -255 -28 176 203 240 -10 -42 50 -138 -263
$$ [...]
8191F8
##END NTUPLES=NMR FID
##END=
