##TITLE=1H_B4f-1
 CDCl3
 8 sc, 
 25.6.2024
##JCAMPDX= 6.0         $$ Bruker NMR JCAMP-DX V2.0
##DATA TYPE= NMR FID
##DATA CLASS= NTUPLES
##ORIGIN= UXNMR, Bruker Analytische Messtechnik GmbH
##OWNER= root
$$ XWIN-NMR		Version 3.5
$$ Tue Jun 25 13:55:06 2024 Russian Standard Time (UT+4h)  she@DPX200
##.OBSERVE FREQUENCY= 200.131
##.OBSERVE NUCLEUS= ^1H
##.DELAY= (6, 6)
##.ACQUISITION MODE= SIMULTANEOUS
##.ACQUISITION SCHEME= undefined
##.AVERAGES= 8
##.DIGITISER RES= 18
##SPECTROMETER/DATA SYSTEM= spect
##.PULSE SEQUENCE= zg30
##.SOLVENT NAME= DMSO
##.SHIFT REFERENCE= (INTERNAL, DMSO, 0, 15.7039)
##AUDIT TRAIL= $$ (NUMBER, WHEN, WHO, WHERE, WHAT)
$$ ##TITLE= Audit trail, XWIN-NMR		Version 3.5
$$ ##JCAMPDX= 5.01
$$ ##ORIGIN= Bruker BioSpin GmbH
$$ ##OWNER= she
$$ F:/spectra/data/she/nmr/H-F/1/audita.txt
$$ ##AUDIT TRAIL=  $$ (NUMBER, WHEN, WHO, WHERE, WHAT)
(   1,<2024-06-25 13:53:50.04 +0400>,<she>,<DPX200>,
      <created by zg, POWCHK disabled, PULCHK disabled
       configuration hash MD5:
       00 E9 B6 7A A2 85 ED C7 34 08 36 98 17 FE 4E 26
       data hash MD5: 16K
       98 01 34 17 C0 16 CA 7E D5 F0 4E 01 5C 0A 12 AD>)
$$ ##END=
$$ 
$$ hash MD5
$$ 09 B0 39 5D 68 5D 5F 86 A3 AC E2 AA 8C 03 2E 86
##$RELAX= 
##$RELAX= 
##$RELAX= 
##$RELAX= 
##$RELAX= 
##$RELAX= 
$$ Bruker specific parameters
$$ --------------------------
##$DU= <F:/spectra>
##$EXPNO= 1
##$NAME= <H-F>
##$PROCNO= 1
##$TYPE= <nmr>
##$USER= <she>
##$AMP= (0..31)
100 100 100 100 100 100 100 100 100 100 100 100 100 100 100 100 100 100 
100 100 100 100 100 100 100 100 100 100 100 100 100 100 
##$AQSEQ= 0
##$AQ_mod= 1
##$AUNM= <au_zg>
##$AUTOPOS= <>
##$BF1= 200.13
##$BF2= 200.13
##$BF3= 200.13
##$BF4= 200.13
##$BF5= 200.13
##$BF6= 200.13
##$BF7= 200.13
##$BF8= 200.13
##$BYTORDA= 1
##$CFDGTYP= 0
##$CFRGTYP= 5
##$CHEMSTR= <none>
##$CNST= (0..31)
1 1 145 1 1 1 1 1 1 1 1 1 1 1 1 1 1 1 1 1 1 1 1 1 1 1 1 1 1 1 1 1 
##$CPDPRG= <>
##$CPDPRG1= <>
##$CPDPRG2= <>
##$CPDPRG3= <>
##$CPDPRG4= <mlev>
##$CPDPRG5= <mlev>
##$CPDPRG6= <mlev>
##$CPDPRG7= <mlev>
##$CPDPRG8= <mlev>
##$CPDPRGB= <>
##$CPDPRGT= <>
##$D= (0..31)
0 1.2 0 0 0 0 0 0 0 0.06 0 0.03 0 0 0 0 0.0002 0 0 0 0 0 0 0 0 0 0 0 0 
0 0 0 
##$DATE= 1719309229
##$DBL= (0..7)
120 120 120 120 120 120 120 120 
##$DBP= (0..7)
150 150 150 150 150 150 150 150 
##$DBP07= 0
##$DBPNAM0= <>
##$DBPNAM1= <>
##$DBPNAM2= <>
##$DBPNAM3= <>
##$DBPNAM4= <>
##$DBPNAM5= <>
##$DBPNAM6= <>
##$DBPNAM7= <>
##$DBPOAL= (0..7)
0.5 0.5 0.5 0.5 0.5 0.5 0.5 0.5 
##$DBPOFFS= (0..7)
0 0 0 0 0 0 0 0 
##$DE= 6
##$DECBNUC= <off>
##$DECIM= 32
##$DECNUC= <off>
##$DECSTAT= 4
##$DIGMOD= 1
##$DIGTYP= 9
##$DL= (0..7)
0 120 120 120 120 120 120 120 
##$DP= (0..7)
150 150 150 150 150 150 150 150 
##$DP07= 0
##$DPNAME0= <>
##$DPNAME1= <>
##$DPNAME2= <>
##$DPNAME3= <>
##$DPNAME4= <>
##$DPNAME5= <>
##$DPNAME6= <>
##$DPNAME7= <>
##$DPOAL= (0..7)
0.5 0.5 0.5 0.5 0.5 0.5 0.5 0.5 
##$DPOFFS= (0..7)
0 0 0 0 0 0 0 0 
##$DQDMODE= 0
##$DR= 18
##$DS= 0
##$DSLIST= <SSSSSSSSSSSSSSS>
##$DSPFIRM= 0
$$ [...]
##$SUBNAM2= <"">
##$SUBNAM3= <"">
##$SUBNAM4= <"">
##$SUBNAM5= <"">
##$SUBNAM6= <"">
##$SUBNAM7= <"">
##$SUBNAM8= <"">
##$SUBNAM9= <"">
##$SW= 18.0517599122864
##$SWIBOX= (0..15)
0 0 2 0 0 0 0 0 0 0 0 0 0 0 0 0 
##$SW_h= 3612.71676300578
##$TD= 16384
##$TD0= 1
##$TE= 0
##$TE2= 300
##$TE3= 300
##$TEG= 300
##$TL= (0..7)
0 120 120 120 120 120 120 120 
##$TP= (0..7)
150 150 150 150 150 150 150 150 
##$TP07= 0
##$TPNAME0= <>
##$TPNAME1= <>
##$TPNAME2= <>
##$TPNAME3= <>
##$TPNAME4= <>
##$TPNAME5= <>
##$TPNAME6= <>
##$TPNAME7= <>
##$TPOAL= (0..7)
0.5 0.5 0.5 0.5 0.5 0.5 0.5 0.5 
##$TPOFFS= (0..7)
0 0 0 0 0 0 0 0 
##$TUNHIN= 0
##$TUNHOUT= 0
##$TUNXOUT= 0
##$USERA1= <user>
##$USERA2= <user>
##$USERA3= <user>
##$USERA4= <user>
##$USERA5= <user>
##$V9= 5
##$VALIST= <valist>
##$VCLIST= <CCCCCCCCCCCCCCC>
##$VD= 0
##$VDLIST= <DDDDDDDDDDDDDDD>
##$VPLIST= <PPPPPPPPPPPPPPP>
##$VTLIST= <TTTTTTTTTTTTTTT>
##$WBST= 1024
##$WBSW= 4
##$XGAIN= (0..3)
0 0 0 0 
##$XL= 0
##$YL= 0
##$YMAX_a= 473902
##$YMIN_a= -594014
##$ZGOPTNS= <>
##$ZL1= 120
##$ZL2= 120
##$ZL3= 120
##$ZL4= 120
##$ABSF1= 10
##$ABSF2= 0
##$ABSG= 5
##$ABSL= 3
##$ALPHA= 0
##$AQORDER= 0
##$ASSFAC= 0
##$ASSFACI= 0
##$ASSFACX= 0
##$ASSWID= 0
##$AUNMP= <proc_1d>
##$AZFE= 0.1
##$AZFW= 0.1
##$BCFW= 1
##$BC_mod= 2
##$BYTORDP= 1
##$COROFFS= 0
##$CY= 11.3945322036743
##$DATMOD= 1
##$DC= 2
##$DFILT= <>
##$DTYPP= 0
##$F1P= 15.6554695791079
##$F2P= 12.8336369535428
##$FCOR= 0.5
##$FTSIZE= 0
##$FT_mod= 4
##$GAMMA= 1
##$GB= 0.15
##$INTBC= 1
##$INTSCL= 1
##$ISEN= 128
##$LB= 0.24
##$LEV0= 0
##$LPBIN= 0
##$MAXI= 10000
##$MC2= 0
##$MEAN= 0
##$ME_mod= 0
##$MI= 1.114404
##$NCOEF= 0
##$NC_proc= 0
##$NLEV= 6
##$NOISF1= 3.799351
##$NOISF2= 2.8
##$NSP= 1
##$NTH_PI= 0
##$NZP= 0
##$OFFSET= 15.70392
##$PC= 1
##$PHC0= -25320.75
##$PHC1= 16.98748
##$PH_mod= 1
##$PKNL= yes
##$PPARMOD= 0
##$PSCAL= 0
##$PSIGN= 0
##$REVERSE= no
##$SF= 200.130013532006
##$SI= 16384
##$SIGF1= 3
##$SIGF2= 2
##$SINO= 400
##$SIOLD= 16384
##$SREGLST= <1H.CDCl3>
##$SSB= 0
##$STSI= 0
##$STSR= 0
##$SW_p= 3612.71676300578
##$SYMM= 0
##$S_DEV= 0
##$TDeff= 0
##$TDoff= 0
##$TI= <>
##$TILT= no
##$TM1= 0
##$TM2= 0
##$TOPLEV= 0
##$USERP1= <user>
##$USERP2= <user>
##$USERP3= <user>
##$USERP4= <user>
##$USERP5= <user>
##$WDW= 1
##$XDIM= 8192
##$YMAX_p= 0
##$YMIN_p= 0
$$ End of Bruker specific parameters
$$ ---------------------------------
##NTUPLES= NMR FID
##VAR_NAME=  TIME,          FID/REAL,        FID/IMAG
##SYMBOL=    X,             R,               I
##VAR_TYPE=  INDEPENDENT,   DEPENDENT,       DEPENDENT
##VAR_FORM=  AFFN,          ASDF,            ASDF
##VAR_DIM=   8192,          8192,            8192
##UNITS=     SECONDS,       ARBITRARY UNITS, ARBITRARY UNITS
##FACTOR=    0.0002768,     1,               1
##FIRST=     0,             0,               0
##LAST=      2.2672688,     0,               0
##MIN=       0,             -594014,         0
##MAX=       2.2672688,     473902,          0
$$ Real data points
##PAGE= N=1
##DATA TABLE= (X++(R..R)), XYDATA
$$ plain form
0 0 0 0 0 0 0 0 0 0 0 0 0 0 8 -8 8 -8 8 -12 16 -16 24 -24 32 -37 40 -48 56 -64 75 -86 98 -109 125 -142 159
35 159 -181 202 -225 252 -281 311 -345 384 -424 466 -517 568 -628 691 -763 838 -927 1019
53 1019 -1127 1247 -1385 1539 -1720 1932 -2186 2494 -2881 3378 -4045 4990 -6429 8878 -13848
68 -13848 27943 -154056 -594014 -246650 348903 461387 -15467 -386330 -218536 206266
78 206266 292869 -11934 -257810 -105697 195033 223614 -58361 -256693 -118725 170068
88 170068 231397 -5629 -245357 -180193 110818 261255 69786 -216124 -227351 43350 232067
99 232067 103998 -155373 -209454 -14514 160464 101306 -85415 -147583 -23255 99615 64801
110 64801 -55249 -90851 -9298 76245 66877 -19823 -86501 -53355 53807 109466 27854 -106759
$$ packed form
0@%%%%%%%%%%%%Qj6J6j6J6k0K8l2M0m8N6o9P7q8J04j20J39j61J84k07K34k67L01
35A59l40L83m27M77n33N92o56P29q08Q90r83J085j196J319j454J601j765J946
53A019k146K374k632K924l259L652m118M680n375O259p423R035j1419J5307k2726
68a3848M1791j81999m39958L47364N95553J12484m76854l70863J67794M24802
78B06266Q6603l04803k45876J52113L00730K8581k81975j98332J37968K88793
88A70068O1329k37026k39728O5164K91011J50437j91469k85910j1227K70701J88717
99B32067j28069k59371n4081J94940J74978n9158j86721o2168J24328J22870l4814
110F4801j20050l5602Q1553Q5543r368q6700o6678L3146J07162N5659q1612j34613
$$ plain form
122 -106759 -122247 17520 142471 88251 -86067 -158237 -27894 140290 122387 -60606 -162131
133 -162131 -46364 127395 128762 -34173 -140259 -59881 88676 107801 -22302 -124527 -57307
144 -57307 94298 122984 -20198 -148088 -82271 100088 159653 11496 -156723 -123852 71121
155 71121 173199 46342 -139445 -134544 47274 151680 39857 -123180 -110407 52385 134847
166 134847 27883 -115021 -99001 48694 124663 28202 -104755 -93968 42310 119293 38400
177 38400 -90407 -101340 13418 103664 59633 -55407 -92951 -10852 77668 57328 -37333
188 -37333 -76094 -12211 60872 45268 -29726 -58992 -7097 49935 35010 -28013 -52814 -7435
200 -7435 46070 37612 -19835 -52919 -24993 26495 42575 9758 -32473 -38650 -2559 34702 29895
$$ packed form
122a06759j5488J39767J24951n4220j74318p2170J30343J68184j7903j82993j01525
133a62131J15767J73759J367j62935j06086Q0378J48557J9125j30103j02225O7220
144e7307J51605K8686j43182j27890O5817J82359N9565j48157j68219L2871J94973
155G1121J02078j26857j85787M901J81818J04406j11823j63037J2773J62792Q2462
166A34847j06964j42904J6020J47695P5969r6461j32957J0787J36278P6983q0893
177C8400j28807j0933J14758R0246m4031j15040l7544Q2099Q8520k0340r4661
188c7333l8761O3883P3083j5604p4994k9266N1895N7032j4925o3023k4801M5379
200g435N3505q458n7447l3084K7926N1488J6080l2817m2231o177L6091L7261m807
$$ plain form
213 29895 -11267 -37202 -14749 25853 29946 -6390 -33315 -13751 26786 31718 -10317 -43400
225 -43400 -18185 35678 44677 -7281 -50780 -26003 34371 50309 -103 -52006 -36474 28772
237 28772 58900 10864 -53574 -47223 20796 57452 13913 -46857 -40923 21964 53464 8902
249 8902 -50842 -41183 28892 61839 7257 -60966 -45569 32664 65391 8471 -59302 -47337
261 -47337 26436 63585 15401 -52115 -47324 22689 60107 13587 -49859 -41857 22742 53313
273 53313 10611 -44743 -38539 20027 51903 12727 -45441 -41914 20189 55654 16210 -43022
285 -43022 -43665 10435 46797 22246 -29522 -41910 -428 40108 26385 -21166 -38196 -4597
297 -4597 31021 23730 -11537 -28893 -9167 21666 25082 -5743 -31824 -16936 21181 32663 2479
$$ packed form
213B9895m1162k5935K2453M0602M093l6336k6925J9564M0537M932m2035l3083
225d3400K5215N3863Q999n1958m3499K4777O0374J5938n0412n1903J5532O5246
237B8772L0128m8036o4438O351O8019L6656m3539o0770N934O2887L1500m4562
249H902n9744R659P0075L2947n4582o8223J5397P8233L2727n6920o7773J1965
261d7337P3773L7149m8184o7516M791P0013L7418m6520o3446Q002O4599L0571
273E3313m2702n5354O204N8566L1876l9176n8168L527O2103L5465l9444n9232
285d3022o43N4100L6362k4551n1768j2388M1482M0536j3723m7551j7030L3599
297d597L5618p291l5267j7356J9726L0833L416l0825k6081J4888L8117J1482l0184
$$ plain form
310 2479 -31007 -26110 10133 35512 19756 -21216 -37797 -5039 36940 31037 -16002 -41656 -12230
323 -12230 33563 35539 -8391 -42755 -20740 31941 43172 -6290 -49353 -23404 37944 48694
335 48694 -8180 -55817 -29608 37929 58280 1694 -59879 -43606 31534 64698 9823 -56919
347 -56919 -44366 28412 61071 10563 -54612 -46574 24524 63445 16796 -53691 -50907 22332
359 22332 64164 17046 -52490 -49889 19812 62697 22275 -46929 -53916 10075 59486 28529
371 28529 -39173 -51688 4877 50894 27495 -29730 -44140 -574 41981 28537 -21591 -42585
383 -42585 -6572 36585 30571 -15116 -38642 -12132 26878 29082 -5562 -31767 -16961 20111
395 20111 31518 2735 -29265 -23424 11928 31254 12732 -19454 -26614 -1455 24225 19304 -11045
$$ packed form
310B479l3486M897L6243K5379j5756m0972j6581L2758M1979n903m7039k5654K9426
323a2230M5793J976m3930l4364K2015N2681J1231m9462m3063K5949O1348J0750
335D8694n6874m7637K6209O7537K0351n6586o1573J6273P5140L3164n4875o6742
347e6919J2553P2778L2659n0508o5175Q038P1098L8921m6649p0487K784P3239
359B2332M1832m7118o9536K601O9701M2885m0422o9204o987O3991M9411l0957
371B8529o7702j2515N6565M6017k3399n7225j4410M3566M2555j3444n0128k0994
383d2585L6013M3157o014m5687k3526K6510L9010K204l4644k6205J4806L7072
395B0111J1407k8783l2000N841L5352J9326j8522l2186p160K5159K5680m921l0349
$$ plain form
408 -11045 -27112 -6976 23675 23963 -7240 -30190 -14213 21731 31169 669 -31734 -22341 18202
421 18202 35845 5088 -33954 -27614 16674 39902 10387 -33110 -32924 11227 41005 16918 -29221
434 -29221 -35587 6405 39446 18715 -27066 -34716 5262 38673 18815 -27010 -36925 2835 39642
447 39642 23513 -23858 -38379 -900 36974 23816 -21287 -36023 -1688 34428 23986 -17005
459 -17005 -33575 -5351 28063 22271 -12081 -27587 -4483 23074 17409 -12032 -23877 -3598
471 -3598 20482 17002 -7339 -20834 -7304 14904 16771 -2381 -16541 -8098 9133 12165 -743
484 -743 -10476 -6663 4436 8553 1650 -7424 -7139 1765 7007 3131 -3558 -4533 -564 3279 4150 -263
500 -263 -5750 -5052 3376 9400 3195 -8370 -9847 759 10248 6936 -5573 -10993 -701 12321
$$ packed form
408a1045j6067K0136L0651K88l1203k2950J5977L5944R438l0500l2403R393M0543
421A8202J7643l0757l9042O340M4288K3228k9515m3497J86M4151K9778k4087m6139
434b9221o366M1992L3041k0731m5781p650L9978L3411j9858m5825r915L9760L6807
447C9642j6129m7371j4521L7479L7874j3158m5103j4736L4335L6116j0442m0991
459a7005j6570K8224L3414n792l4352j5506K3104K7557n665k9441j1845K0279
471c598K4080l480k4341j3495J3530K2208J867j9152j4160Q443J7231L032j2908
484g43r733L813J1099M117o903r074K85Q904N242l876o689r75L969L843Q71m413
500b63n487O98Q428O024o205j1565j477J0606R489l312j2509n420J0292J3022
$$ plain form
514 12321 8293 -9266 -14157 1549 15844 8497 -10239 -14776 554 14710 9178 -9159 -15736
527 -15736 344 16952 10076 -10959 -16573 1511 17056 9263 -10924 -16379 82 17207 11617
540 11617 -10544 -19399 -1235 18751 11675 -11277 -17433 1022 16727 9080 -10944 -15376 1552
553 1552 17247 8678 -13165 -16665 4269 19424 7544 -14141 -15756 2353 15141 7578 -8819
566 -8819 -12518 601 12265 6091 -9088 -11064 2949 12262 4664 -7912 -9274 1367 9889 5976
580 5976 -5955 -11120 -1306 11261 8450 -5420 -11138 -2721 7244 6782 -557 -5620 -3587 2552 5118
595 5118 366 -5062 -3264 2843 4830 1159 -3714 -5671 -1571 5872 7423 -1062 -10459 -6329 7203
610 7203 11508 123 -11082 -7325 6598 12384 981 -13583 -10469 8331 16819 2544 -15182
$$ packed form
514A2321m028j7559m891J5706J4295p347j8736m537J5330J4156n532j8337o577
527a5736J6080J6608o876k1035n614J8084J5545p793k0187n455J6461J7125n590
540A1617k2161q855J8164J9986p076k2952o156J8455J5705p647k0024m432J6928
553A552J5695q569k1843l500K0934J5155j1880k1685j615J8109J2788p563j6397
566h819l699J3119J1664o174j5179j976J4013R313p598j2576j362J0641Q522l913
580E976j1931n165R814J2567k811j3870n718Q417R965m62p339n063K033O139K566
595E118m752n428J798O107J987l671m873j957M100P443J551q485r397M130J3532
610G203M305j1385j1205L757J3923N786j1403j4564L114J8800Q488j4275j7726
$$ plain form
623 -15182 -12220 6858 15711 3056 -12914 -11689 6113 17279 5321 -15349 -16278 5382 20410
636 20410 8052 -15037 -17629 3546 20074 9191 -14827 -19232 2783 22024 10618 -16351
648 -16351 -21238 2616 21724 10964 -13894 -18681 1621 18469 9727 -11766 -16662 1265 17962
661 17962 9847 -10873 -17240 -1124 15302 11835 -5853 -14599 -4594 11036 11705 -2888 -13325
674 -13325 -5172 10421 12209 -1651 -12784 -7173 7177 11127 1121 -9315 -6471 4666 8872
687 8872 1183 -8022 -6718 2950 8924 4602 -4597 -8536 -3221 5875 8289 291 -8829 -6966 4436
702 4436 10350 2136 -9616 -8468 4271 11704 3433 -9988 -9925 4115 12984 4286 -10564 -10946 4207
717 4207 13813 5049 -9973 -11678 2474 13910 7928 -8333 -13652 -1121 13187 9747 -6661
$$ packed form
623a5182K962J9078Q853j2655j5970J225J7802J1166j1958k0670r29K1660J5028
636B0410j2358k3089k592K1175J6528j0883k4018m405K2015J9241j1406k6969
648a6351m887K3854J9108j0760k4858m787K0302J6848q742k1493m896J7927J6697
661A7962q115k0720o367J6116J6426l467j7688q746J0005J5630O69j4593j0437
674a3325Q153J5593J788j3860j1133N611J4350L950j0006j0436K844J1137M206
687H872p689r205J304R668N974m322r199l939N315R096K414p998r120J863J1402
702D436N914q214j1752J148J2739P433q271j3421O3J4040Q869q698j4850l82J5153
717D207R606q764j5022j705J4152J1436n982j6261n319J2531J4308l440j6408
$$ plain form
730 -6661 -13306 -1361 12169 8439 -7574 -13661 -984 13743 10308 -7593 -15261 -2293 13555
743 13555 9822 -7456 -13822 -1168 11927 8541 -5968 -11783 -2290 9506 8223 -4037 -9913
756 -9913 -1718 8065 5959 -3671 -7704 -1621 5979 5413 -1416 -6577 -2655 4819 6114 -993 -5693
771 -5693 -1997 3964 3886 -842 -3418 -1729 1743 2924 317 -2646 -2023 611 1925 144 -456 -560
787 -560 -803 -521 938 1732 -1085 -2203 223 2587 1017 -2460 -2870 -163 2968 2468 -1745 -4316 -299
804 -299 4959 3316 -3591 -5255 742 5369 2836 -2785 -4578 -769 4503 3724 -2722 -5240 504 6097
820 6097 2790 -4666 -5676 1821 6999 3149 -4680 -6796 -191 7173 4643 -4850 -7684 903 8013
835 8013 3265 -6244 -6798 1873 7698 3354 -5336 -6925 1116 7666 2970 -6824 -7066 2691 9066 2465
$$ packed form
730f661o645J1945J3530l730j6013o087J2677J4727l435j7901p668J2968J5848
743A3555l733j7278o366J2654J3095l386j4509n815R493J1796j283j2260n876
756i913Q195R783k106r630m033O083P600n66o829n161L922P474J295p107m700
771e693L696N961p8m728k576J689L472J181k607k963O23K634J314j781o00j04
787e60k43K82J459P94k817j118K426K364j570l477m10K707L131n00m213k571M017
804b99N258j643o907j664N997M627k533n621j793L809N272p79o446k518N744N593
820F097l307p456j010P497N178l850p829k116O605P364k530r493k834Q587P110
835H013m748r509n54Q671N825m344q690j589Q041O550m696r794k42R757O375o601
$$ plain form
851 2465 -6896 -6960 1323 7659 4379 -4114 -6723 193 6665 3571 -4936 -6132 1713 7135 3042 -4424
867 -4424 -6132 -519 5606 4850 -2397 -6338 -1141 5072 4164 -2426 -5563 -1395 3622 4060 -161 -4562
883 -4562 -3613 2100 4715 1566 -3435 -3678 556 3611 1942 -2407 -4199 -1011 4588 4852 -1859 -6868
899 -6868 -3091 5038 6815 -70 -6449 -4326 3714 6968 894 -6972 -5474 4237 9133 1408 -8727
914 -8727 -7225 3412 9846 3122 -7443 -7991 2337 10129 4091 -7969 -9678 2217 11503 5109
928 5109 -8265 -10775 611 11256 6632 -6675 -11171 -469 10584 7196 -6299 -10999 -575
941 -575 10592 7550 -5826 -11135 -1745 9413 8060 -3875 -9887 -2460 8447 7810 -3023 -9922
955 -9922 -3308 7564 8454 -933 -8833 -5152 4634 8105 1061 -7141 -5889 3386 7810 1830 -6533
$$ packed form
851B465r361o4Q283O336l280q493k609O916O472l094q507j196P845N422m093p466
867d424j708N613O125p56p247l941N197O213r08o590l137M168N017M38m221m401
883d562R49N713K615l149n001k43M234L055j669m349j792L188N599K64o711n009
899f868L777Q129J777o885o379K123Q040L254o074p866J498R711M896p725j0135
914h727J502J0637O434o724j0565n48J0328P792o038j2060j709J1895R286o394
928E109j3374k510J1386J0645m624j3307m496J0702J1053l388j3495m700J0424
941e75J1167l042j3376n309R390J1158j353j1935o012P427J0907o37j0833o899
955i922O614J0872Q90r387p900L681R786L471p044q202J252R275M424n980q363
$$ plain form
970 -6533 -5986 1969 7090 3068 -4537 -6374 -8 6225 4634 -3211 -6795 -1389 5612 5423 -1748 -6892
986 -6892 -3661 4332 7511 1297 -6998 -6412 2732 8105 2656 -6366 -6768 2047 7752 3492 -6014 -7715
1002 -7715 1073 9438 5199 -6187 -8804 378 9140 5418 -5448 -8994 -811 8467 6630 -3772
1016 -3772 -9841 -2584 8394 7542 -3361 -8910 -2478 7116 7034 -2873 -8909 -3604 7256 8428 -1899
1031 -1899 -9595 -4280 6686 7740 -1519 -7881 -3539 5056 6796 -423 -7123 -4190 4116 6723 -55
1046 -55 -6288 -3813 3175 5161 757 -4125 -3894 1146 4622 2302 -3795 -4619 731 4696 2258 -2638
1062 -2638 -3639 -515 3032 2746 -783 -3620 -1245 3209 3107 -995 -3802 -1685 2015 3088 971
1077 971 -2504 -3558 -140 3544 2167 -2573 -3562 669 3902 1718 -2885 -4005 -466 4236 3907 -2124
$$ packed form
970f533N47P955N121m022p605j837O366O233j591p845l584N406P001j89p171n144
986f892L231P993L179o214q295N86R144N373n449r022m02Q815N705m260r506j701
1002g715Q788Q365m239j1386k617R182Q762l722j0866l546Q183R278j837j0402
1016c772o069P257J0978q52j0903n549O432R594q2r907o036N305J0860J172j0327
1031a899p696N315J0966J054r259o362M342Q595J740p219o700K933Q306K607o778
1046e5o233K475O988J986m404m882K31N040L476k320o097q24N350L965k438m896
1062b638j001L124L547k86l529k837K375M454j02m102k807K117L700J073k117
1077I71l475j054L418L684j377m740r89M231L233k184m603j120L539M702l29o031
$$ plain form
1093 -2124 -5504 -1100 4873 3639 -2654 -4961 -292 4485 3221 -2200 -4981 -1468 4336 4531 -1545
1108 -1545 -5668 -1567 4319 3746 -1997 -4982 -1184 4144 4360 -1510 -5886 -2459 4529 5532 -836
1123 -836 -5659 -1952 4024 3529 -1945 -4939 -1339 4343 4309 -1704 -5709 -2233 4020 4426 -1129 -4569
1139 -4569 -1517 3146 3302 -784 -3640 -2034 2614 3863 -76 -4128 -2913 2036 3925 536 -3097
1154 -3097 -2289 1390 3278 757 -3026 -2652 1235 3888 1156 -3059 -3232 443 3264 1527 -1532 -2513
1170 -2513 -629 2168 1959 -879 -3099 -1218 2414 3032 -23 -3143 -2533 1392 3750 1335 -3119 -3349
1186 -3349 1298 4513 1098 -4102 -4017 1338 5301 2076 -3874 -4860 302 5145 2966 -3212 -5035 128
1202 128 5253 3556 -3390 -5704 -401 5725 4117 -2550 -6443 -1433 5303 5044 -2118 -6743 -1786
$$ packed form
1093b124l380M404N973j234o293k307M669M777j264n421k781L513N804J95o076
1108a545m123M101N886n73n743k985L798N328K16n870m376L427O988J003o368
1123h36m823L707N976m95n474k994L600N682l4o013m005L476O253M06n555l440
1139d569L052M663J56m086k856J606M648J249l939m052J215M949J889l389l633
1154c097Q08L679J888k521l783L74L887K653k732m215j73L675K821j737l059r81
1170b513J884K797k09k838k220J881L632O18l055l120O10L925K358k415m454k30
1186c349M647L215l415n200Q5N355L963l225n950r86N162M843k179o178j823N163
1202A28N125j697o946k314N303O126j608o667l893N010O736k59p162m625M957
$$ plain form
1217 -1786 5758 5675 -2137 -7035 -2245 5511 5760 -1379 -6697 -3070 4730 5922 -1018 -6164 -3047 4422
1233 4422 5585 -780 -5966 -3299 3084 5472 1053 -4784 -3984 2052 5444 1358 -4445 -4092 1688
1248 1688 4979 1936 -3341 -4383 104 4487 3162 -2489 -4832 -471 4169 2846 -2260 -4190 -1130
1263 -1130 3313 3952 -422 -4050 -2888 2340 4593 994 -3900 -3366 1323 4368 1656 -3243 -4383
1278 -4383 309 5262 3271 -3274 -5558 -179 5226 3409 -2577 -5062 -930 4556 3866 -2180 -6139
1293 -6139 -1771 5317 5441 -2027 -6270 -2347 4277 5082 -602 -5215 -2925 3642 5766 -349 -6059
1308 -6059 -3306 3884 5804 -126 -5532 -3541 2687 5181 807 -4966 -3986 2604 5804 929 -5080
1323 -5080 -3823 1925 4970 1644 -3263 -3675 251 4060 2019 -2601 -3498 347 3604 1738 -2223
$$ packed form
1217a786P544q3p812m898M790P756K49p139n318L627P800J192o940n146L117P469
1233D422J163o365n186K667O383K388m419n837Q00O036L392m086n803L53N780
1248A688L291l043n277j042M487M383j325n651k343M361M640j323n106j930L060
1263a130M443O39m374l628J162N228K253l599m894N34M689L045k712m899j140
1278d383M692M953j991o545k284N379N405j817n986k485M132N486o90o046l959
1293f139M368P088J24p468m243L923O624Q05n684m613K290O567K124o115n710
1308f059K753P190J920n930n406J991O228K494m374n773R80O590L200m875o009
1323e080J257N748L045l326m907m12L926L809k041m620q97L845L257j866l961
$$ plain form
1338 -2223 -3270 -466 3004 2717 -729 -3438 -1796 2360 3044 -451 -2887 -1441 1856 2788 409 -2377
1354 -2377 -2484 562 3201 1657 -1853 -2973 143 2513 1509 -1291 -2477 -175 2585 2466 -1557
1369 -1557 -3956 -1267 3073 3434 -785 -3867 -1729 2403 3102 -329 -3339 -1984 2602 3864 -305
1384 -305 -4122 -2072 2611 3958 62 -3395 -2311 1512 3468 331 -3251 -2352 2014 3854 323
1399 323 -3765 -2850 1588 3604 915 -2721 -2696 849 3273 865 -2861 -2716 1255 3446 978 -2967
1415 -2967 -2769 819 3018 1051 -2005 -2274 831 2577 761 -2190 -2424 574 2735 1189 -1824 -2384
1431 -2384 68 1826 1321 -969 -1829 -368 1704 1327 -970 -1996 -341 1492 1819 -289 -1715 -1389
1447 -1389 1156 1716 203 -1625 -1223 1031 1772 38 -1671 -1492 827 2084 1019 -1410 -1916 -114
$$ packed form
1338b223j047K804L470k87l446k709J642M156O84l495k436J446L297R32k379k786
1354b377j07L046K639j544l510j120L116K370j004k800j186K302K760j19m023
1369a557k399K689M340L61m219l082K138M132O99l431l010J355M586J262m169
1384c05l817K050M683J347l896l457J084L823J956l137l582Q99M366J840l531
1399C23m088R15M438K016k689l636K5L545K424k408l726J45L971K191k468l945
1415b967J98L588K199j967l056k69L105J746j816k951k34K998K161j546l013n60
1431b384K452J758n05k290q60J461K072l77k297j026J655J833L27k108j426L26
1447a389K545N60j513j828M02K254P41j734j709J79K319J257j065k429n06J802
$$ plain form
1463 -114 1715 1489 -1066 -2022 -327 2146 1556 -1261 -2529 -400 2475 2116 -1088 -3004 -1101 2500
1479 2500 2568 -1265 -3562 -835 2796 2866 -929 -3440 -1536 2080 3015 -299 -3292 -1543 2354 3330
1495 3330 -811 -3741 -1525 2660 3440 -72 -3430 -2627 1594 3698 712 -3489 -2640 1975 3699 190
1511 190 -3408 -2339 1657 3675 873 -2997 -2757 981 3645 983 -2945 -2561 1352 3196 878 -2420
1527 -2420 -2663 84 3043 2245 -1674 -3091 -564 2378 1882 -1129 -2228 -375 2124 2062 -418 -2663
1543 -2663 -1576 2092 3110 -201 -2837 -1921 1121 2222 643 -1910 -2079 653 2597 1366 -2137
1558 -2137 -2840 348 3184 1874 -1716 -2953 -992 2389 2539 -677 -3265 -1277 2984 3060 -1225 -3945
1574 -3945 -1338 2647 3278 -322 -3486 -2112 2311 3634 -47 -3774 -2017 2758 3856 54 -3649
$$ packed form
1463a14J829k26k555r56J695K473n90k817j268K129K875l59l204j916J903L601
1479B500O8l833k297K727L631P0l795k511J904L616R35l314k993J749L897R76
1495C330m141k930K216M185P80l512l358Q03M221K104k986m201Q49M615J724l509
1511A90l598J069L996K018k802l870K40L738K664k662l928L84L913J844k318l298
1527b420k43K747K959p98l919j417K527K942m96l011j099J853K499o2k480k245
1543b663J087L668J018l311k636R16L042J101j579k553j69K732J944j231l503
1558b137p03L188K836j310l590j237J961L381J50l216k588J988M261P6m285k720
1574c945K607L985O31l600l164J374M423J323l681l727J757M775J098l802l703
$$ plain form
1589 -3649 -2712 1390 3942 1396 -2830 -3535 861 3554 972 -2952 -2603 1350 3597 1153 -2978 -3398
1605 -3398 316 3645 1916 -2285 -3227 116 3080 1621 -1794 -2711 -44 2690 1953 -937 -3004 -1091
1621 -1091 2058 2488 -273 -2269 -1019 1433 1931 -148 -1901 -1374 1195 2474 464 -2288 -2305 643
1637 643 2638 976 -1616 -2255 -441 1831 1418 -921 -2115 -408 2054 1954 -848 -2393 -811 1681
1653 1681 2119 -46 -2160 -1499 1313 2501 -40 -2533 -1529 1511 2866 530 -2660 -2130 966 2820
1669 2820 944 -2255 -2210 741 2611 725 -2324 -2164 839 2768 616 -2171 -2357 227 2518 1234
1685 1234 -1680 -2446 298 2643 1209 -1742 -2210 213 2504 1517 -1355 -2205 -90 1982 1546 -1155
1701 -1155 -2154 -249 2075 1225 -1040 -1820 -301 1517 1248 -645 -1614 -595 1195 1123 -592 -1553 -607
$$ packed form
1589c649R37M102K552k546m226p05M396K693k582l924L49L953K247k444m131m20
1605c398L714L329j729m201r42L343K964j459l415r17K667K734p37k890k067J913
1621a091L149M30k761j996J250K452M98k079j753N27K569J279k010k752j7K948
1637F43J995j662k592o39J814K272m13k339j194J707K462j00k802j545J582K492
1653A681M38k165k114O61K812J188k541k493J004L040J355k336l190N30L096J854
1669B820j876l199M5K951J870j886l049J60L003J929k152k787j86K584K291j284
1685A234k914p66K744K345j434k951m68K423K291r87k872q50K115K072m36k701
1701a155r99J905K324q50k265p80J519J818k69j893r69J019J790p2j715r61R46
$$ plain form
1718 -607 1010 1375 8 -1093 -892 718 1445 475 -625 -1261 193 1253 448 -1021 -898 628 1388
1735 1388 569 -1023 -1245 48 1249 1025 -641 -1253 -265 1196 883 -701 -1157 -364 1040 1352 -270
1752 -270 -1509 -901 922 1470 -402 -1336 -566 1148 1295 -156 -1878 -1067 1181 2094 -98 -2106 -1415
1769 -1415 1032 1904 105 -1577 -920 1228 1466 -187 -1634 -1100 901 2099 401 -1956 -1523 1026
1785 1026 1755 75 -1493 -1143 794 1879 433 -1841 -2012 555 2315 873 -1796 -1738 484 1766
1801 1766 578 -1296 -1463 330 2081 1151 -1354 -1833 199 1965 1081 -791 -1518 -33 1130 819
1817 819 -453 -1557 -477 1289 1413 -276 -1885 -852 967 1522 144 -1191 -1126 421 1428 273
1833 273 -1430 -1060 687 1670 180 -1508 -1241 246 1360 1233 -842 -1776 -152 1574 1093 -822 -1647
$$ packed form
1718f07J617L65j367j101K01J610P27r70j100o36J454J060q05j469J23J526P60
1735A388q19j592k22J293J201k24j666o12R88J461l13j584m56P93J404L12j622
1752b70j239O08J823N48j872r34P70J714J47j451j722Q11K248R13k192k008O91
1769a415K447Q72j799j682O57K148K38j653j447N34K001J198j698k357M33K549
1785A026P29j680j568L50J937J085j446k274j71K567J760j442k669N8K222J282
1801A766j188j874j67J793J751r30k505m79K032J766q84j872p27J485J163l11
1817H19j272j104J080J766J24j689j609J033J819N55j378j335O5J547J007j155
1833B73j703L70J747R83j490j688K67J487J114j27k075r34J624J726m81j915q25
$$ plain form
1850 -1647 -341 1465 1469 -459 -1901 -1069 1216 2106 24 -2060 -973 1612 1618 -213 -2155 -982 1540
1867 1540 2102 185 -2119 -1672 932 2510 481 -2100 -1740 812 1952 597 -1387 -1656 390 2363
1883 2363 1186 -1412 -2032 149 2211 1007 -1230 -1707 7 1818 1132 -1071 -1940 -275 1988 1549
1899 1549 -917 -2018 -640 1656 1208 -359 -1537 -656 1059 1417 -85 -1605 -732 1000 1692 220
1915 220 -1364 -1086 315 1530 573 -863 -1287 -104 1481 847 -1080 -1580 -68 1432 1017 -413 -1464
1932 -1464 -755 1170 1088 -297 -1287 -733 867 1337 24 -1568 -896 1050 1362 426 -1437 -1436 597 1716
1950 1716 525 -1367 -1321 379 2034 889 -1446 -1611 115 1854 1044 -1090 -1764 210 1575 795
1966 795 -1187 -1634 222 1904 1019 -998 -1620 -25 1406 1265 -662 -1561 -281 1169 983 -499 -1613
$$ packed form
1850a647J306J806Mj928j442Q32K285Q90k082k084J087K585Oj831j942J173K522
1867A540N62j917k304M47K604J578k029k581L60K552J140j355j984k69K046J973
1883B363j177k598o20K181K062j204k237m77J714J811o86k203q69J665K263m39
1899A549k466j101J378K296m48j567j178Q81J715L58j502j520Q73J732O92j472
1915B20j584K78J401J215r57j436m24J183J585o34j927n00J512J500m15j430j051
1932a464P09J925q2j385r90N54J600M70j313j592O72J946L12r36j863JK033J119
1950A716j191j892M6J700J655j145k335j65J726J739q10k134o74J974J365p80
1966G95j982m47J856J682q85k017o22J595J431j41j927q99J280J450j86j482j114
$$ plain form
1983 -1613 -237 849 1305 -268 -1214 -901 945 1030 -41 -1294 -490 1026 850 -434 -1189 -564 923
2000 923 1000 115 -799 -760 462 827 470 -797 -745 263 703 196 -601 -606 -190 804 745 -406 -956 -268 600
2021 600 421 -138 -411 13 691 437 -163 -920 -707 792 1123 115 -755 -388 359 591 82 -556 -567 283
2041 283 927 60 -1042 -729 486 1046 189 -893 -812 135 929 156 -737 -791 654 1299 254 -1477 -1282
2060 -1282 341 1471 339 -832 -695 244 828 197 -984 -791 426 1314 210 -1372 -857 524 903
2077 903 576 -798 -889 -296 713 616 -549 -1028 63 1288 708 -825 -1040 237 902 846 -179 -886
2095 -886 -285 914 757 -450 -1008 230 959 623 -281 -1003 -562 585 786 46 -680 -453 507 845 -257
2114 -257 -886 -651 385 965 470 -657 -1168 -54 929 556 -682 -778 528 555 455 -796 -1040 -190 836
$$ packed form
1983a613J376J086M56j573r46L13J846Q5j071j253Q04J516j76j284p55O25J487
2000I23P7q85r14L9J222L65l57j267N2J008M40n07p97nM16R94n9j151n50O88Q68
2021F00j79n59k73M24O78k54o00p57K13J499L31j008q70L67P47K32n09o38j1Q50
2041B83O44q67j102L13J215N60q57j082Q1R47P94p73q93n4J445O45j045j731J95
2060a282J623J130j132j171J37R39N84o31j181J93J217Q88j104j582N15J381L79
2077I03l27j374r1N93J009r7j165m79J091J225n80j533k15J277O65n6j025p07
2095h86O01J199j57j207n58J238P29l36r04p22M41J147K01p40p26K27R60L38j102
2114b57o29K35J036N80m95j127n11J114R83l73j238r6J306K7j00j251k44Q50J026
$$ plain form
2133 836 955 -474 -1181 -405 873 818 -253 -914 -145 556 908 -149 -1093 -523 978 1357 176 -1277
2151 -1277 -1126 724 1090 147 -1174 -1035 376 1364 375 -1267 -1163 455 1305 437 -953 -896 143 1107
2169 1107 598 -765 -1038 186 1190 884 -752 -1254 -153 1186 905 -480 -1066 -249 978 748 -270
2186 -270 -1011 -316 1104 918 -260 -1035 -618 423 743 -223 -707 -440 569 636 80 -808 -541 440 998
2205 998 423 -657 -848 -76 928 629 -240 -782 -338 649 461 -139 -947 -266 585 781 -43 -758 -418
2224 -418 455 739 355 -794 -600 306 1112 312 -913 -713 511 1350 393 -610 -965 -37 884 689 -603
2243 -603 -978 70 998 608 -760 -1031 -22 1132 711 -397 -1012 -292 973 820 -677 -1109 44
2260 44 1340 560 -650 -955 -164 889 1028 266 -977 -293 403 716 -311 -447 -109 633 499 -290 -611
$$ packed form
2133H36J19j429p07P76J278n5j071o61P69P01L52j057r44N70J501L79j181j453
2151a277J51J850L66r43j321J39J411R88r89j642J04J618Q50q68j390N7J039R64
2169A107n09j363k73J224J004l06j636n02J101J339k81j385n86Q17J227k30j018
2186b70p41O95J420j86j178p75M17J041L20r66m84K67J009O7n56q88K67R81N58
2205I98n75j080j91P72J004k99q69n42M44R87j88o00q08O81Q51J96q24p15L40
2224d18Q73K84l84j149J94R06Q06q00j225K00J224Q39r57j003l55R28R21j95j292
2243f03l75J048R28l90j368k71J009J154m21j108o15P20J265j53j497m32J153
2260D4J296p80j210l05P91J053J39p62j243O84O96L13j027j36L38P42j34p89l21
$$ plain form
2279 -611 -392 283 718 67 -702 -325 364 416 -35 -253 -287 90 468 327 -627 -583 -50 682 345 -189 -457
2300 -457 -148 -91 350 32 -328 -118 320 317 -141 -890 -166 667 433 44 -143 -489 -45 561 168 -530 -279
2321 -279 412 761 98 -599 -402 257 623 85 -193 -440 175 507 240 -592 -614 364 858 -32 -451 -611
2341 -611 -173 747 589 -67 -637 54 691 269 -603 -549 275 511 181 -524 -622 -24 498 290 -213 -559 84
2362 84 590 248 -528 -657 129 496 498 -244 -564 -217 481 676 -93 -570 26 521 298 -223 -378 -35 400
2383 400 551 -51 -594 -351 361 603 -38 -393 -126 248 276 146 -313 -423 49 631 229 -298 -287 -145 206
2404 206 225 -32 -385 -111 487 324 -80 -540 -124 382 418 61 -481 -116 366 569 -281 -642 -190 484 611
2425 611 -103 -602 -461 155 725 144 -292 -491 103 404 122 -483 -426 520 666 70 -623 -493 90 688
$$ packed form
2279f11K19O75M35o51p69L77O89N2m51k18l4L77L78j41r54M4N33P32l37n34k68
2300d57L09N7M41l18l60K10M38lm58p49P24Q33k34l89j87l46M44O06l93o98K51
2321b79O91L49o63o97J97O59L66n38k78k47O15L32k67q32k2R78M94q90m19j60
2341f11M38R20j58o56n70O91O37m22q72N4Q24K36l30p05r8N98N22k08n03l46O43
2362H4N06l42p76j29P86L67Kp42l20L47O98J95p69m77N96M95k23n21j55L43M35
2383D00J51o02n43K43P12K42o41l55K67L74K8j30m59j10M72N82m02n27J1J42L51
2404B06J9k57l53K74N98j63m04m60M16N06L6l57n42L65M82K03q50l61M52O74J27
2425F11p14m99J41O16N70n81m36j99N94L01k82o05N7R46J46n96o93J30N83N98
$$ plain form
2445 688 318 -494 -487 134 614 273 -603 -724 -14 909 498 -445 -676 -111 574 328 -385 -432 -82 478 420
2466 420 -326 -757 -186 610 775 -96 -765 -254 346 453 -96 -276 -128 359 467 8 -497 -303 255 575
2486 575 353 -318 -326 -137 319 226 -212 -459 -159 413 398 -326 -591 -276 478 809 211 -493 -655 399 435
2507 435 128 -359 -185 270 561 -65 -506 -499 102 533 225 -484 -593 29 520 296 -505 -426 158 592 471
2528 471 -392 -675 -345 539 650 -237 -650 -284 597 246 -406 -372 -299 688 448 -356 -690 -412 599 702
2548 702 -133 -538 -256 318 359 -281 -460 -266 315 608 -85 -920 -502 204 655 195 -489 -114 40 309
2568 309 25 -643 -526 442 640 388 -620 -363 175 391 256 -63 -334 -88 243 71 -605 -453 101 243
2588 243 497 -195 -89 -202 225 354 284 -436 -377 198 317 -86 -222 -280 285 509 357 -412 -381 -246 200
$$ packed form
2445F88l70q12PO21M80l41q76j21P10R23m11r43k31N65O85k46p13m7L50N60n8
2466D20p46m31N71P96J65q71o69N11O00J07n49j80J48M87J08m59n05J94N58L20
2486E75k22o71qJ89M56r3m38k47L00N72j5p24k65L15P54L31n98p04j62J054L6
2507D35l07m87J74M55K91o26m41PO01M31l08p09j09O22M91k24q01P9N84M34j21
2528D71q63k83L30Q84J11q87m13L66Q81l51o52L4P3R87k40q04l34K78J011J03
2548G02q35m05K82N74M1o40j79J94N81K93o93q35M18P06M51m60o84L75J54K69
2568C09k84o68J17R68J98k52j008K57N38K16j35l19k71K46L31j72o76J52N54J42
2588B43K54o92J06j13M27J29p0p20N9N75J19m03j36n8N65K24j52p69L1J35M46
$$ plain form
2609 200 447 -126 -363 373 437 46 -111 -261 263 467 330 -290 -487 19 438 271 -330 -501 24 295
2629 295 289 -217 -582 -35 534 479 -176 -448 -108 269 291 -25 -230 -5 559 272 -399 -528 -506 419 438 -21
2651 -21 -355 -47 186 246 -135 -376 -120 286 374 -122 -289 -376 447 306 -187 -279 29 145 192 -123 -201 -92
2673 -92 393 431 151 -505 -457 144 186 265 -150 -265 -49 250 21 -193 -197 -28 144 312 -26 -115 -224 351 330
2696 330 30 -227 -83 116 323 -135 -294 -144 463 352 -102 -228 -245 206 415 168 -455 -285 143 331
2716 331 -132 -315 -321 99 604 273 -305 -293 23 474 268 -266 -239 -26 485 278 -313 -683 23 634 543 -200
2738 -200 -353 -217 79 234 -127 -286 -51 497 505 -389 -493 -27 213 508 -26 -210 -89 84 201 -25 -600
2759 -600 -43 259 337 135 -326 -487 167 270 336 -186 -216 -81 109 65 -466 -152 19 262 184 -410 -515 -182
$$ packed form
2609B00K47n73k37P36O4l91j57j50N24K04j37o20j97N06M19j67o01j71N25K71
2629B95on06l65N47N69n5o55k72L40L77K2l16k05K25N64k87o71j29K2R25J9m59
2651b1l34L08K33O0l81k41K56M06Q8m96j67q7Q23j41m93r2L08J16M7l15p8J09
2673i2M85L8k80o56M8O01M2P9m15j15K16K99k29k14mJ69J72J68l38q9j09N75k1
2696C30l00k57J44J99K07m58j59J50O07j11m54j26j7M51K09k47o23J70M28J88
2716C31m63j83oM20N05l31n78J2L16M51k06n34K7K13N11k07n91l70P06O11r1p43
2738b00j53J36K96J55l61j59K35N48Qq94j04M66K40K95n34j84J21J73J17k26n75
2759f00N57L02P8k02m61j61O54J03O6n22l0J35J90m4n31L14J71K43p8n94j05L33
$$ plain form
2781 -182 -63 411 -55 -335 -275 62 229 -198 -205 -89 15 526 360 -428 -485 51 351 195 -94 -389 -230
2802 -230 307 227 -8 -406 94 687 564 -366 -651 -3 557 502 -220 -435 -153 451 386 -103 -552 -168 498
2823 498 459 -231 -500 -299 406 493 135 -254 -392 493 551 158 -472 -242 64 785 100 -479 -479 -129 352 245
2845 245 -17 -495 -2 240 -36 -328 -245 46 435 418 -199 -593 -198 184 457 65 -593 -10 429 153 -77
2866 -77 -189 -256 80 484 75 -342 -294 68 245 131 -126 -374 235 127 172 -352 -283 -62 537 355 -227 -642
2888 -642 -122 119 231 -160 -180 -77 265 302 -209 -401 -296 461 333 -176 -237 -114 313 132 -118 -342 -367
2909 -367 579 411 -246 -544 -213 438 330 -54 -530 -195 137 620 306 -569 -159 96 164 -252 -398 -246
2929 -246 176 163 239 -194 -250 179 306 -6 -495 -250 369 345 241 -293 -246 -37 204 74 103 -108 106 179
$$ packed form
2781a82J19M74m66k80O0L37J67m27pJ16J04N11j66p88n7N36L00j56k89k95J59
2802b30N37q0k35l98N00N93j23r30k85O48N60n5p22k15K82O04o5m89m49L84O66
2823D98l9o90k69K01P05Q7l58l89j38Q85N8l93o30K30L06P21o85n79%L50M81j07
2845B45k62m78M93K42k76k92Q3K91L89j7o17l94L95L82K73l92o58N83M39k76k30
2866g7j12o7L36M04m09m17M8L62J77j14k57k48O09j08M5n24O9K21N99j82n82m15
2888f42N20K41J12l91k0J03L42L7n11j92J05P57j28n09o1J23M27j81k50k24k5
2909c67R46j68o57k98L31O51j08l84m76L35L32M83l14q75M10K55O8m16j46J52
2929b46M22j3P6m33n6M29J27l12m89K45O19k4j04n34M7K09K41j30K9k11K14P3
$$ plain form
2951 179 163 -92 -344 48 229 141 109 -282 -35 99 51 -2 -169 0 288 365 28 -152 -78 128 285 193 -187
2974 -187 -221 -126 210 215 -13 -335 -103 146 106 -277 -151 180 305 188 -117 -444 -112 267 90 -232 -170 -93
2996 -93 366 193 -342 -44 -88 174 316 -145 -53 -166 135 501 66 -225 -15 340 278 -73 -433 -10 326
3017 326 341 239 -304 -100 11 114 -49 -281 -162 282 319 17 -257 -211 88 309 311 -101 -326 286 275 82
3039 82 -44 -123 4 236 298 -264 -445 -260 368 349 -10 -230 25 277 165 47 -429 -231 242 471 8
3060 8 -422 -56 284 341 202 -71 -103 -26 186 86 -338 -555 121 309 363 -228 -339 -52 253 267 -16 -331
3082 -331 -161 133 408 -162 -423 -63 449 133 -4 -326 -236 353 545 36 -490 -120 59 482 -101 -323
3102 -323 -300 263 269 161 -209 -483 -1 240 388 -212 -266 368 339 -162 -113 -389 -194 260 435 -216 -434 -123
$$ packed form
2951A79j6k55k52L92J81q8l2l91K47J34m8n3j67J69K88P7l37j80P4K06J57r2l80
2974a87l4R5L36Nk28l22K32K49m0l83J26L31J25j17l05l27L32L79j77l22O2P7
2996i3M59j73n35K98m4K62J42m61R2j13L01L66m35k91K10L55o2l51l60M23L36
3017C26J5j02n43K04J11J03j63k32J19M44L7l02k74M6K99K21Km12k25O12j1j93
3039H2j26p9J27K32O2n62j81J85O28j9l59k20K55K52j12j18m76J98M73K29m63
3060Hm30L66L40N7j39k73l2P7K12j00m24k17O76J88N4n91j11K87L05J4k83l15
3082c31J70K94K75n70k61L60N12l16j37l22R0N89J92n09n26L70J79M23n83k22
3102c23K3N63Oj08l70k74M82K41J48o00n4O34k9n01M9k76J95M54J75o51k18L11
$$ plain form
3124 -123 445 355 -142 -86 -28 125 212 36 -277 -113 97 403 116 -440 -324 64 10 -35 -118 -39 157 170 200
3147 200 -174 -350 158 112 201 9 -238 -2 149 72 -227 -91 100 182 447 -165 -667 -75 249 490 81
3168 81 -171 -192 378 299 -90 -429 39 432 188 -91 -271 -371 13 679 14 -298 -117 122 159 -119 -541
3189 -541 -262 139 369 192 -183 -274 -170 230 246 -101 -230 153 384 125 -399 -298 61 401 349 -48 -359
3210 -359 -226 249 111 -138 -26 16 285 243 -253 -418 -168 209 210 58 -73 -112 162 198 -114 -196 45 235
3232 235 130 172 -202 -217 204 52 130 -184 -85 45 -75 -16 -164 -86 288 -64 55 -221 -123 -106 -15 119 49
3255 49 -184 -180 135 208 -183 -61 227 163 39 -154 -438 -45 186 189 185 -126 33 -2 188 -113 -67 -77 86 100
3279 100 48 -238 -332 -29 520 81 -76 -354 149 118 -12 45 -246 -84 83 204 -200 -294 -143 271 153 10
$$ packed form
3124a23N68r0m97N6N8J53Q7j76l13J64K10L06k87n56J16L88n4m5q3P9J96J3L0
3147B00l74j76N08m6Q9j92k47K36J51p7k99J36J91Q2K65o12n02N92L24K41m09
3168H1k52k1N70p9l89l39M68L93k44k79j80j00L84O66o65l12J81K39L7k78m22
3189e41K79M01K30j77l75r1J04M00J6l47j29L83K31k59n24J01L59L40n2l97l11
3210c59J33M75j38k49J12M2K69m2m96j65K50L77Jj52j31l9K74L6l12q2K41J90
3232B35j05M2l74j5M21j52P8l14R9J30j20N9j48P8L74l52J19k76R8J7R1J34p0
3255D9k33ML15P3l91J22K88o4j24j93k84L93K31Lml11J59l5J90l01M6j0J63J4
3279A00n2k86r4L03N49m39j57k78N03l1j30N7k91J62J67J21m04r4J51M14j18j43
$$ plain form
3301 10 10 120 98 -73 59 -369 -30 122 136 32 -339 37 331 -48 -172 18 -273 115 0 -1 -101 161
3323 161 198 308 37 -116 -175 197 59 335 206 -10 -52 108 -159 -337 -144 173 217 81 32 -291 -235 14
3345 14 131 -184 -49 -127 141 180 -293 -285 -12 -184 189 181 -150 -405 -103 226 96 -6 -384 304 116 98 -289
3368 -289 -313 92 354 180 -183 -217 142 401 62 -72 -439 -38 192 152 -224 -204 24 380 356 -57 -150 -26
3390 -26 149 107 48 -263 -6 295 114 183 -400 -168 122 157 214 -420 -161 190 -19 269 -286 -42 29 184
3412 184 198 -120 -117 -57 227 118 -90 -206 13 55 78 -186 -123 31 198 163 -41 -323 -39 29 7 -113 -302
3435 -302 -80 -128 306 -70 -127 -52 8 229 -49 -377 -74 -193 -32 -117 -129 -14 -33 206 -227 -196 -201 -107 283 158
3459 158 -202 -252 -119 227 -43 -12 -15 87 144 19 -237 -357 -15 317 41 -152 2 6 105 213 -56 -361 -159
$$ packed form
3301A0%J10k2j71J32m28L39J52J4j04l71L76K94l79j24J90k91L88j15jj00K62
3323A61L7J10k71j53n9L72j38K76j29k16m2J60k67j78J93L17M4j36m9l23N6K49
3345A4J17l15J35p8K68L9m73QK73j72L73ql31k55L02L29j30j02l78O88j88j8l87
3368b89k4M05K62j74l63l4L59K59l39j34l67M01K30m0l76K0K28L56k4m13r3J24
3390b6J75m2n9l11K57L01j81O9n83K32K90L5N7o34K59L51k09K88n55K44P1J55
3412A84J4l18LO0K84j09k08j16K19M2K3k64O3J54J67l5k04k82K84O8k2j20j89
3435c02K22m8M34l76n7P5O0K21k78l28L03j19J61q5j2J15j9K39m33L1nR4L90j25
3459A58l60n0J33L46k70L1lJ02N7j25k56j20L42L32k76j93J54MR9J08k69l05K02
$$ plain form
3482 -159 157 62 -392 -369 -215 199 66 -88 -425 -209 19 119 101 -17 -200 240 108 185 -134 -32 142
3503 142 162 -72 -10 -277 85 369 64 36 -66 -108 102 -112 28 -242 -206 88 130 20 110 -224 -166 -83 -72
3526 -72 17 192 96 -19 80 -374 -75 -70 147 15 98 -42 101 9 -21 -86 75 225 98 93 -33 -309 12 183
3550 183 103 63 226 -68 98 189 5 -111 -51 383 -77 83 37 131 256 -77 -213 -90 -53 175 53 -9 -133
3573 -133 242 295 199 98 -70 -138 -40 51 -43 -40 -8 362 290 -25 -100 -24 44 -46 -163 121 97 124 89 102 58 -145
3599 -145 132 -104 -119 -87 22 -37 53 -63 80 41 -316 -101 -35 -302 -66 -66 46 -70 -90 -114 -224 350 190
3622 190 -15 24 60 -136 201 143 -173 -31 73 16 80 -90 33 85 128 125 16 -116 37 153 -44 160 127
3645 127 -103 220 -116 51 -132 216 -39 192 -163 -81 -75 -85 13 -11 -160 11 138 -28 50 -1 62 170 13
$$ packed form
3482a59L16r5m54K3J54M14j33j54l37K16K28J00j8j18j83M40j32P7l19J02J74
3503A42K0k34O2k67L62K84l05k8j02m2K10k14J40k70L6K94M2j10R0l34N8Q3J1
3526g2Q9J75r6j15R9m54K99NK17j32Q3j40J43r2l0o5J61J50j27nj26k76L21J71
3550A83q0m0J63k94J66R1j84j16O0M34m60J60m6R4J25l33j36J23L7K28j22o2j24
3573a33L75N3r6j01j68o8R8R1r4LL2L70p2l15p5P6O8r0j17K84k4K7l5J3m4k03
3599a45K77k36j5L2J09n9R0j16J43l9l57K15O6k67K36%J12j16k0k4j10N74j60
3622A90k05L9L6j96L37n8l16J42J04n7O4j70J23N2M3lj09j32J53J16j97K04l3
3645A27k30L23l36J67j83L48k55K31l55Q2Oj0R8k4j49J71J27j66P8n1O3J08j57
$$ plain form
3668 13 -48 -199 168 314 234 -265 -166 138 88 -37 -224 -8 -72 -12 128 111 115 -242 7 56 31 -271 -237 -87
3692 -87 207 36 20 -204 -44 67 -8 -14 -246 215 -29 -87 26 -374 57 98 169 17 79 -162 118 -24 -42
3715 -42 -97 26 297 72 -36 -57 -123 205 -32 -91 -19 -167 -68 170 12 -46 11 150 32 214 -36 -77 -139 48
3739 48 269 -99 -30 -51 13 25 -232 -119 374 123 -35 -233 -54 278 361 88 -16 -171 45 179 -107 31
3761 31 -192 94 153 30 -47 -73 -116 -171 94 194 -207 -26 149 -9 -58 -54 97 27 298 13 -154 -212 -69 288
3785 288 156 7 229 70 0 -194 23 113 123 299 -80 -26 -106 -5 127 97 -43 122 -47 130 -187 -218
3807 -218 -23 -28 -4 -160 -42 -184 -62 101 101 6 12 -32 181 251 -94 -233 -24 -40 139 7 -243 38 69 114
3831 114 -113 -14 -119 -71 -84 92 47 -83 38 64 89 90 -130 -123 114 -72 -224 0 112 170 1 -136 113 220
$$ packed form
3668A3o1j51L67J46q0m99R9L04n0j25j87K16o4O0J40j7Ml57K49M9k5l02L4J50
3692h7K94j71j6k24J60J11p5ok32M61k44n8J13m00M31M1P1j52O2k41K80j42j8
3715d2n5J23K71k25j08k1o6L28k37n9P2j48R9K38j58n8N7J39j18J82k50m1o2J87
3739D8K21l68O9k1O4J2k57J13M93k51j58j98J79L32Q3k73j04j55K16J34k86J38
3761C1k23K86N9j23p7k6m3n5K65J00m01J81J75j58m9MJ51p0K71k85j67n8J43L57
3785B88j32j49K22j59p0j94K17R0J0J76l79N4q0J01J32l0j40J65j69J77l17l1
3807b18J95nK4j56J18j42J22J63%r5Om4K13P0l45j39K09j6J79j32k50K81L1M5
3831A14k27R9j05M8j3J76m5j30J21K6K5Jk20PK37j86j52K24J12N8j69j37K49J07
$$ plain form
3855 220 100 161 238 -17 23 117 91 -106 11 95 70 41 68 -1 59 57 -24 44 57 -37 -7 27 -132 -283 -150 19
3881 19 118 -39 -105 -211 65 77 223 -40 99 106 13 -130 88 20 70 53 113 -76 -32 -85 210 -79 8 115 80
3906 80 0 -65 32 -218 -37 -46 66 91 93 -15 -144 0 -18 123 2 1 41 -22 49 -18 -91 114 -103 -116 -14 111
3932 111 6 -140 12 217 -51 6 -66 -58 -31 147 151 152 -133 -62 222 74 182 -75 252 226 115 46 -231 -417
3956 -417 -73 -37 115 12 -140 95 55 27 -128 63 -201 72 49 -22 96 -47 309 -192 -53 -48 117 -90
3978 -90 133 -170 102 58 189 -149 -273 -129 -426 140 169 -82 -94 232 -164 13 28 -106 -130 -50 127 -124
4000 -124 -109 -139 -49 178 51 -63 8 269 61 216 -86 -98 38 -3 54 -16 -51 -158 -150 24 125 180 -23 -68
4024 -68 -62 29 107 118 -24 141 31 88 -157 9 -10 -149 -83 26 101 204 81 -191 -78 106 53 182 -162 -184
$$ packed form
3855B20j20O1P7k55M0R4k6j97J17Q4k5k9K7o9O0kq1O8J3r4L0L4j59j51J33J69
3881A9R9j57o6j06K76J2J46k63J39Pr3j43K18o8N0j7O0j89M4n3K95k89Q7J07l5
3906H0q0o5R7k50J81rJ12K5Kj08j29J44j8J41j21jM0o3P1o7p3K05k17j3J02J25
3932A11j05j46J52K05k68N7p2QK7J78MJk85P1K84j48J08k57L27k6j11o9k77j86
3956d17L44L6J52j03j52K35m0k8j55J91k64K73k3p1J18j43L56n01J39NJ65k07
3978i0K23l03K72m4J31l38j24J44k97N66K9k51j2L26l96J77J5j34k4Q0J77k51
4000a24J5l0R0K27j27j14P1K61k08J55l02j2J36m1N7p0l5j07QJ74J01N5k03m5
4024f8OR1P8J1j42J65j10N7k45J66j9j39O6J09P5J03j23k72J13J84n3J29l44k2
$$ plain form
4048 -184 -172 92 206 81 -43 -38 158 -196 -103 21 45 -145 354 -163 -134 259 205 15 88 -269 46 -139 24
4071 24 -108 -88 -208 25 32 -116 -65 292 192 -11 -48 -184 -9 80 57 -250 -48 -25 -73 59 -25 55 60 -104 30
4096 30 -173 130 102 32 99 119 -133 51 100 -277 -1 -136 -205 188 160 347 -66 -71 186 179 58 1 -43 -44 -36 46
4122 46 -14 -135 -192 -69 158 63 0 -114 120 139 -48 344 -49 117 88 -88 43 -248 -58 135 -222 70
4144 70 -176 -62 27 -55 -187 117 -198 195 46 5 -109 142 199 -24 -53 -105 282 -46 25 -47 -100 108 71 23
4168 23 -107 101 -2 -112 45 -43 -99 -34 12 109 -250 5 -160 177 -45 -166 73 -243 290 38 46 176 -97
4191 -97 -13 25 -6 28 83 13 31 -7 -234 251 30 53 -33 37 103 -92 16 131 -63 -17 -66 -170 -47 124 -89
4216 -89 -62 196 199 110 -50 24 -152 74 -55 20 -5 -87 -210 -12 65 -69 52 -127 118 -195 -117 -13 192 100
$$ packed form
4048a84J2K64J14j25j24NJ96l54R3J24K4j90M99n17K9L93n4j90P3l57L15j85J63
4071B4j32K0j20K33Pj48N1L57j00k03l7j36J75Q9k3l07K02K3m8J32q4Q0Nj64J34
4096C0k03L03k8p0O7K0k52J84M9l77K76j35o9L93k8J87m13nK57pj21n7m4jQQ2
4122D6o0j21n7J23K27r5o3j14K34J9j87L92l93J66k9j76J31k91J90J93l57K92
4144G0k46J14Q9q2j32L04l15L93j49m1j14K51N7k23k9n2L87l28P1p2n3K08l7m8
4168B3j30K08j03j10J57q8n6O5M6R7l59K55j65L37k22j21K39l16N33k52QJ30k73
4191i7Q4L8l1L4N5p0J8l8k27M85k21K3q6P0O6j95J08J15j94M6m9j04J23J71k13
4216h9K7K58Lq9j60P4j76K26j29P5k5q2j23J98P7j34J21j79K45l13P8J04K05r2
$$ plain form
4240 100 -9 149 -29 -180 178 50 -16 27 44 175 240 -29 152 61 62 -7 -155 60 -75 -6 -58 -29 36 -48
4264 -48 -19 -6 -108 -60 -191 112 36 -7 -208 -48 -82 66 -210 -99 -51 49 113 -81 42 -185 39 27 -116
4287 -116 -107 -35 -22 50 155 47 67 163 17 229 -112 -126 -9 -6 -2 9 45 52 134 -87 -106 -83 40 27 215 125 -174
4314 -174 256 188 -67 16 -131 120 -124 92 -42 -247 117 146 207 20 -36 -332 -106 98 126 -21 125 66
4336 66 147 46 45 83 48 46 -48 114 -38 21 212 114 -168 87 103 74 16 -36 -44 -198 1 155 40 -117 -122 -70 -19
4363 -19 -307 -158 41 92 177 134 -80 11 -132 -27 174 209 -10 34 54 11 59 -32 13 -20 -45 43 73 124 -58 62
4389 62 -211 -198 -10 -1 -260 155 -205 23 190 233 90 132 -83 -112 -112 86 58 28 -118 -64 -95 -60 87 7 -80
4414 -80 -53 -4 108 -203 -94 19 -287 -73 -129 12 -96 -188 -168 146 26 12 27 -57 -46 49 100 74 75 55 78 -167
$$ packed form
4240A00j09J58j78j51L58j28o6M3J7J31O5k69J81r1Jo9j48K15j35O9n2K9O5q4
4264d8K9J3j02M8j31L03p6m3k01J60l4J48k76J11M8J00O4j94J23k27K24j2j43
4287a16RP2J3P2J05j08K0R6j46K12l41j4J17LMJ1L6PQ2k21j9K3J23j3J88r0k99
4314a74M30o8k55Q3j47K51k44K16j34k05L64K9O1j87n6k96K26K04K8j47J46n9
4336F6Q1j01jL8l5kr4J62j52N9J91r8k82K55J6k9n8n2qj54J99J54j15j57nN2N1
4363a9k88J49J99N1Q5m3k14R1j43J05K01L5k19M4K0m3M8r1M5l3k5Q8L0N1j82J20
4389F2k73J3J88Rk59M15l60K28J67M3j43M2k15k9%J98k8l0j46N4l1L5J47q0q7
4414h0K7M9J12l11J09J13l06K14n6J41j08r2K0L14j20j4J5q4J1R5N1k6Jk0K3k45
$$ plain form
4440 -167 80 -170 34 -3 68 60 -15 -57 18 140 -274 -76 90 -81 207 -2 108 -48 -6 131 -240 194 -52
4463 -52 -149 -106 -181 72 96 207 23 106 104 -111 85 72 -16 159 186 -93 -140 -15 189 -229 -132 -31 -180 -160 86
4488 86 52 -208 -60 139 -77 -49 102 -24 7 -52 -82 161 3 -85 -173 -69 -231 2 -70 -19 -20 -12 135 -32 -119
4513 -119 -10 33 27 17 -167 56 -53 111 -108 -182 -176 -174 -55 45 -10 355 -121 -44 -131 -1 -66 -8 -24 160 -93
4538 -93 -65 -219 -118 156 -32 0 -108 77 101 -18 -220 97 95 50 26 -188 -61 -32 82 133 -43 58 -255
4561 -255 -18 60 -117 -207 -178 187 102 -11 -36 -61 -54 168 16 -151 -200 94 90 8 344 -49 -69 229 -66 -20 65
4586 65 -192 -6 -217 -48 25 27 -136 81 -31 49 -120 110 -118 -17 58 132 96 65 -25 -44 -72 35 77 -224
4610 -224 -81 -163 -143 33 -3 103 34 -78 -94 -37 35 -95 88 143 -45 -43 -129 44 -183 -30 20 172 199 1
$$ packed form
4440a67K47k50K04l7P1qp5m2P5J22m14J98J66j71K88k09J10j56M2J37l71M34k46
4463e2r7M3p5K53K4J11j84Q3kk15J96j3q8J75K7k79m7J25K04m18R7J01j49K0K46
4488H6l4k60J48J99k16K8J51j26L1n9l0K43j58q8q8J04j62K33p2N1jQJ47j67q7
4513a19J09M3oj0j84K23j09J64k19p4OKJ19J00n5L65m76P7q7J30o5N8j6J84k53
4538i3K8j54J01K74j88L2j08J85K4j19k02L17km5k4k14J27K9J14N1j76J01l13
4561b55K37P8j77r0K9L65q5j13k5k5PK22j52j67m9K94mq2L36l93k0K98k95M6Q5
4586F5k57J86k11J69P3Kj63K17j12Q0j69K30k28J01P5P4l6l1r0j9k8J07M2l01
4610b24J43q2K0J76l6J06o9j12j6N7P2j30J83N5j88Kq6J73k27J53N0J52K7j98
$$ plain form
4634 1 179 20 -153 -20 255 28 -86 74 -42 -33 -15 78 160 248 -42 -156 -74 60 29 135 6 58 -27 -102
4658 -102 -67 -13 -195 -240 -52 -164 -138 -74 -120 -107 147 155 188 -148 -109 219 4 -128 -12 44 -27 -59 94 -266 -50
4683 -50 182 0 17 -237 -105 35 -71 -39 -110 -160 -18 -99 -29 -125 31 -117 123 255 -36 -249 -227 49 0
4706 0 -217 122 105 -122 200 142 -79 30 -5 79 -44 -128 30 155 62 -4 -68 48 -47 25 88 83 0 0 -86 -213
4732 -213 7 7 6 68 -62 -105 -137 60 66 12 150 -46 -2 -20 -68 -130 57 51 226 37 -77 198 -3 -75 -22 78
4758 78 77 -16 -60 -151 66 84 -27 -36 67 -149 37 -91 90 35 -117 -13 -129 36 -152 -31 -114 -198 -119 -118 149
4783 149 -73 -177 -47 136 -29 49 6 106 186 -59 -314 -6 20 -56 38 176 52 -59 -153 13 210 196 -141
4806 -141 115 31 -58 -72 -53 -115 36 -28 42 -226 -160 -14 92 44 139 144 3 412 -136 -20 -142 177 35 -23
$$ packed form
4634AJ78j59j73J33K75k27j14J60j16RJ8R3Q2Q8k90j14Q2J34l1J06j29N2q5p5
4658a02L5N4j82m5J88j12K6O4m6J3K54QL3l36L9L28k15j32J16N6p1l2J53l60K16
4683e0K32j82J7k54J32J40j06L2p1n0J42q1P0r6J56j48K40J32k91k13K2K76m9
4706@k17L39j7k27L22n8k21J09l5Q4j23q4J58J25r3o6o4J16r5P2O3nq3%q6j27
4732b13K20%jO2j30m3l2J97On4J38j96M4j8m8o2J87oJ75j89j14K75k01p2N3J00
4758G8jr3m4r1K17J8j11rJ03k16J86j28J81n5j52J04j16J65j88J21q3q4P9JK67
4783A49k22j04J30J83j65P8m3J00Q0k45k55L08K6p6R4J38j24j11r4J66J97j4l37
4806a41K56q4q9j4J9o2J51o4P0k68O6J46J06m8R5Nj41M09n48J16j22L19j42n8
$$ plain form
4830 -23 -72 53 44 101 8 -33 -39 -232 -123 -203 105 63 15 55 40 171 -39 24 210 -85 -60 -99 -148 -51 -89 147 -108
4857 -108 -256 172 72 -104 179 30 -62 61 -29 147 -33 11 -5 141 -174 -8 15 -25 49 -155 -175 -7 137
4880 137 81 -149 -13 82 217 235 58 -297 -29 -5 181 199 -81 -157 -59 17 -217 -68 66 -220 -72 -211 66
4903 66 -36 -5 255 75 180 9 45 164 -72 -94 -23 -107 42 -240 -155 -42 -101 -182 -21 79 189 62 -13
4926 -13 -133 -59 -189 89 30 -49 23 20 -71 202 -79 18 -61 51 143 58 231 109 -49 -142 -15 -26 22 305 -82
4951 -82 94 -40 135 -49 94 -2 -142 -35 23 -97 -4 175 87 -131 -48 -13 110 41 -8 233 59 142 29
4974 29 46 -1 15 148 -5 67 -151 40 82 -7 98 -78 332 83 20 -132 -31 115 -1 105 -62 -25 -149
4997 -149 160 44 208 77 -41 -148 -51 -129 -30 30 -115 3 -19 -233 -232 93 -143 -187 36 20 9 -173 33
$$ packed form
4830b3m9J25rN7r3m1oj93J09q0L08m2m8M0j5J31k10O3J86k95K5l9m9R7l8K36k55
4857a08j48M28j00j76K83j49r2J23r0J76j80M4j6J46l15J66K3m0P4k04k0J68J44
4880A37n6k30J36R5J35J8j77l55K68K4J86J8k80p6R8P6k34J49J34k86J48j39K77
4903F6j02L1K60j80J05j71L6J19k36k2P1q4J49k82Q5J13n9q1J61J00J10j27p5
4926a3j20P4j30K78n9p9P2lr1K73k81R7p9J12R2q5J73j22j58r3J27j1M8K83l87
4951h2J76j34J75j84J43r6j40J07N8j20R3J79q8k18Q3L5J23o9m9K41j74Q3j13
4974B9J7m7J6J33j53P2k18J91M2q9J05j76M10k49o3j52J01J46j16J06j67L7j24
4997a49L09j16J64j31j18j07R7p8R9O0j45J18k2k14JL25k36m4K23j6j1j82K06
$$ plain form
5020 33 4 72 -73 39 -91 193 46 -15 84 -195 -46 66 124 13 195 31 238 -58 -98 84 -145 -92 125
5043 125 198 -25 11 95 75 -203 -295 -338 -24 -89 92 65 66 222 -59 140 155 -123 -186 168 118 27 44 -99 -84
5068 -84 38 -132 -10 -58 102 26 12 15 47 144 -174 -29 -179 1 -286 142 41 47 -101 -183 212 -23 -174 67
5092 67 -21 -69 -131 -191 37 -14 19 -65 -14 182 67 32 -91 15 79 -212 -129 -57 -93 -41 25 100 33 -65 -143 106 44
5119 44 45 154 3 132 110 -40 219 10 51 -43 -112 -83 30 -172 -87 166 -106 109 -18 44 -106 -4 139
5142 139 -17 -9 -191 -105 145 31 17 96 197 -130 -34 -93 -161 17 58 -3 -92 -31 -190 -167 7 43 113 -102 165
5167 165 12 -56 -43 7 28 161 138 125 28 -68 -156 41 120 47 -65 102 55 1 75 -97 -205 71 -72 68 20
5192 20 167 241 -145 56 -1 232 53 -104 66 316 63 125 -16 207 -230 -46 -119 -268 -41 -9 121 -29
$$ packed form
5020C3k9O8j45J12j30K84j47o1R9k79J49J12N8j11J82j64K07k96m0J82k29N3K17
5043A25P3k23L6Q4k0k78r2m3L14o5J81k7JJ56k81J99J5k78o3L54n0r1J7j43J5
5068h4J22j70J22m8J60p6j4LL2R7l18J45j50J80k87M28j01Oj48q2L95k35j51K41
5092F7q8m8o2o0K28n1L3q4N1J96j15l5j23J06O4k91Q3P2l6N2O6P5o7r8p8K49o2
5119D4JJ09j51J29k2j50K59k09M1r4o9K9J13k02Q5K53k72K15j27O2j50J02J43
5142A39j56Qj82Q6K50j14j4P9J01l27R6n9o8J78M1o1q9O1j59K3J74L6P0k15K67
5167A65j53o8J3N0K1J33k3j3r7r6q8J97P9p3j12J67m7n4P4j72j08K76j43J40m8
5192B0J47P4l86K01n7K33j79j57J70K50k53O2j41K23m37J84p3j49K27L2J30j50
$$ plain form
5214 -29 2 -19 -55 34 -86 71 27 64 -20 -53 130 -1 -45 -98 -162 -45 -31 146 -180 -70 -35 24 157 -176 -10
5239 -10 118 66 -295 -208 148 210 -226 41 123 -146 86 -20 33 -16 16 -206 -123 -57 -128 159 -63 139 -37 7
5263 7 141 101 -135 111 80 224 5 -119 21 -157 -128 41 83 -54 -1 -192 -28 92 79 202 257 36 -59
5286 -59 -99 -64 7 -5 81 -141 32 -76 70 -167 -110 -87 -39 141 -135 118 66 -283 -65 208 108 198 -112 -143
5310 -143 123 50 -59 59 -54 -39 -3 -79 -72 -112 -198 24 -79 -33 -175 126 10 38 38 125 167 -60 256 -162 -46
5335 -46 129 213 -32 -139 -3 6 119 175 -209 161 44 -40 28 57 -106 -57 71 160 247 -89 115 -171 127 187
5359 187 -122 -108 -176 105 -29 136 272 -13 -92 11 69 50 66 18 34 59 -78 49 209 132 -349 130 -90
5382 -90 119 -107 -72 -68 -66 8 -51 28 77 156 109 -54 -63 -98 70 103 -173 74 207 35 -152 -32 115 -26 -151
$$ packed form
5214b9L1k1l6Q9j20J57m4L7q4l3J83j31m4n3o4J17J4J77l26J10L5N9J33l33J66
5239a0J28n2l61Q7L56O2m36K67Q2k69K32j06N3m9L2k22Q3O6p1K87k22K02j76M4
5263GJ34m0k36K46l1J44k19j24J40j78K9J69M2j37N3j91J64J20j3J23N5k21r5
5286e9m0L5P1j2Q6k22J73j08J46k37N7K3M8J80k76K53n2l49K18K73j00R0l10l1
5310a43K66p3j09J18j13J5L6p6Pm0q6K22j03M6j42L01j16K8%Q7M2k27L16m18J16
5335d6J75Q4k45j07J36RJ13N6l84L70j17q4O8K9j63M9J28Q9Q7l36K04k86K98O0
5359A87l09J4o8K81j34J65J36k85p9J03N8j9J6m8J6K5j37J27J60p7m81M79k20
5382i0K09k26L5MKP4n9P9M9P9m7j63rl5J68L3k76K47J33j72j87J20J47j41j25
$$ plain form
5407 -151 -41 108 93 -92 -143 27 -4 -42 -133 143 31 -79 172 -116 -138 -159 79 -24 47 -17 -1 -141 32
5430 32 -72 -167 185 -61 190 9 42 106 152 -56 -72 4 -131 -108 156 227 -163 -79 71 -72 57 78 -149 -12
5454 -12 -45 -121 399 -115 -16 94 -7 41 108 -163 45 -14 151 19 -3 -4 210 -120 -119 -32 159 -67 19 27 -222
5479 -222 -46 -148 50 17 50 -304 74 12 7 -120 -82 152 -102 -5 -122 312 -1 5 136 139 27 173 -15 -146
5503 -146 -161 -65 -162 -85 -82 63 132 12 -48 -200 24 -36 74 55 143 109 -234 -91 142 -235 116 -51 65 58 60
5528 60 -181 -196 -68 -27 237 -37 -217 -54 140 -5 -129 66 202 -45 -136 -77 -133 -181 -42 15 -65 86 -17
5551 -17 -115 -89 151 168 1 -54 23 110 115 -171 37 -36 -51 -121 -158 67 71 -40 -13 47 -87 156 -56 115 101 164
5577 164 123 122 -127 148 -27 -156 -119 -203 54 77 63 30 51 -82 -71 23 -27 -8 125 -85 -44 166 29 -131 -225
$$ packed form
5407a51J10J49j5j85n1J70l1l8r1K76j12j10K51k88k2k1K38j03P1o4J6j40J73
5430C2j04r5L52k46K51j81L3O4M6k08j6P6j35K3K64P1l90Q4J50j43J29K1k27J37
5454a2l3p6N20n14R9J10j01M8O7k71K08n9J65j32k2jK14l30JQ7J91k26Q6Qk49
5479b22J76j02J98l3L3l54L78o2nj27L8K34k54R7j17M34l13OJ31Lj12J46j88j31
5503a46j5R6r7P7LJ45O9j20o0j52K24o0J10j9Q8l4l43J43K33l77L51j67J16pK
5528F0k41j5J28M1K64k74j80J63J94j45j24J95J36k47r1N9n6m8J39N7q0J51j03
5551a7r8K6K40J7j67n5P7Q7Nk86K08p3j5p0l7K25Mj11K7O0j34K43k12J71j4O3
5577A64m1jk49K75j75j29L7q4K57K3j4l3K1j33J1R4n0J9J33k10M1K10j37j60r4
$$ plain form
5602 -225 133 196 -86 -50 -83 68 -114 239 -96 -213 -9 125 193 -291 87 -42 234 223 71 -56 75 129
5624 129 51 306 -197 190 -49 -194 -104 -70 -31 132 -40 129 163 -130 -132 -20 91 -19 12 -31 -200 21 -15
5647 -15 -128 76 3 105 -205 205 39 13 42 -56 101 -21 -2 62 -210 10 196 -155 78 81 -47 -50 -16 -140
5671 -140 195 56 -86 348 -20 59 -50 -126 -97 -20 136 9 -265 -111 122 51 155 -81 -112 8 -122 75
5693 75 71 23 166 -173 112 -121 -10 10 69 -84 -174 84 46 -76 -18 -88 115 55 196 -23 29 -72 -81 104 -9
5718 -9 -74 102 -69 -74 81 -122 151 -98 -112 -76 -137 -139 21 -115 170 87 -68 -33 69 210 39 -98 -121 -63 -218
5743 -218 72 -94 -60 -127 -175 -175 -62 -47 -123 16 79 221 -93 56 14 107 -170 -69 34 44 -179 -311 -22 155
5767 155 214 35 -32 61 63 -60 43 23 -76 -14 175 -59 6 -78 137 -9 18 -17 -119 -84 77 155 138 152 73 -119
$$ packed form
5602b25L58O3k82L6l3J51j82L53l35j17K04J34O8m84L78j29K76j1j52j27J31N4
5624A29p8K55n03L87k39j45R0L4L9J63j72J69L4k93kJ12J11j10L1m3j69K21l6
5647a5j13K04p3J02l10M10j66k6K9r8J57j22J9O4k72K20J86l51K33Lj28lL4j24
5671a40L35j39j42M34l68P9j09p6K9P7J56j27k74J54K33p1J04k36l1J20j30J97
5693G5mm8J43l39K85k33J11K0N9j53r0K58l8j22N8p0K03o0J41k19N2j01rJ85j13
5718io5J76j71nJ55k03K73k49j4L6o1kJ60j36K85q3j55L5J02J41j71j37k3N8j55
5743b18K90j66L4o7m8%J13J5p6J39O3J42l14J49m2R3k77J01J03J0k23j32K89J77
5767A55N9j79o7R3Kj23J03k0r9O2J89k34O5q4K15j46K7l5j02L5J61P8j7J4p9j92
$$ plain form
5793 -119 52 74 18 -328 137 113 -20 -38 11 161 154 106 12 -70 157 83 249 0 -133 107 -8 -29 -78 123
5817 123 141 -100 182 21 91 -292 112 -111 -136 -29 79 223 64 124 -170 49 83 163 62 -214 -108 92
5839 92 68 59 34 -7 -86 -32 75 35 -62 203 42 -58 -95 9 71 -123 -123 113 -50 -113 -1 52 122 17 -102 -139
5865 -139 -70 -63 -70 174 -170 8 18 399 110 83 -53 92 21 11 166 1 -116 40 140 206 254 -67 -61 40
5889 40 4 108 3 77 59 -87 -188 -49 -188 -97 88 -41 95 262 234 89 54 98 320 -51 -4 -15 -139
5912 -139 -146 159 248 216 -8 -83 -151 -226 97 -99 296 -110 -133 184 108 78 -22 -214 -53 -123 54 -19 204 18
5936 18 -255 96 -40 152 22 -111 19 -94 -84 80 77 112 -90 148 -1 50 -32 -50 -50 158 -160 51 -97
5959 -97 185 1 7 -288 -171 -31 -200 116 37 11 139 25 86 -58 -125 26 62 -39 -80 128 -24 -186 -8
$$ packed form
5793a19J71K2n6l46M65k4j33j8M9J50pm8r4q2K27p4J66k49j33K40j15k1m9K01
5817A23J8k41K82j61P0l83M04k23k5J07J08J44j59O0k94K19L4Q0j01k76J06K00
5839I2k4rk5m1p9N4J07m0r7K65j61j00l7J04O2j94%K36j63o3J12N3P0j05j19l7
5865a39O9PpK44l44J78J0L81k89k7j36J45p1j0J55j65j17J56J00O6M8l21OJ01
5889D0l6J04j05P4j8j46j01J39j39R1J85j29J36J67k8j45l5M4K22l71M7j1j24
5912a39pL05Q9l2k24p5o8p5L23j96L95m06k3L17p6l0j00j92J61p0J77p3K23j86
5936A8k73L51j36J92j30j33J30j13J0J64lL5k02K38j49N1q2j8%K08l18K11j48
5959i7K82j84Ok95J17J40j69L16p9k6J28j14O1j44o7J51L6j01m1K08j52j62J78
$$ plain form
5982 -8 94 2 -157 -23 -84 46 -12 -197 -201 117 -121 -42 337 -106 -262 74 -6 189 -24 118 318 -7 11
6005 11 35 -163 -181 101 -15 141 -93 57 320 59 80 -44 200 -312 177 -123 0 -138 -122 -118 -59 -82 -122
6028 -122 -103 -311 -98 -2 88 -39 208 -152 -46 36 59 -130 75 -251 80 69 -71 180 -144 -69 -64 -16 -32 -77
6052 -77 -129 4 -99 279 -10 35 154 132 -89 51 -18 -149 -112 36 -103 -118 -157 39 18 -138 -79 -107 -102 -41 13
6077 13 -46 36 23 -2 37 -78 60 35 13 -112 -44 139 84 11 43 -273 -58 188 179 18 -61 83 -132 -41 -175
6102 -175 104 82 75 258 -116 23 -3 -221 29 -162 14 74 236 -19 240 -33 -142 18 31 78 4 263 -192
6125 -192 -68 87 285 -111 -79 -102 49 -34 -180 147 -49 -87 154 -87 4 155 -6 73 123 -81 -14 -75 100
6148 100 -6 -34 213 -201 -175 114 -71 22 96 75 6 65 24 55 79 39 -30 -71 -124 83 110 -26 71 -113 -182 -71
$$ packed form
5982hJ02r2j59J34o1J30n8j85mL18k38P9L79m43j56L36q0J95k13J42K00l25J8
6005A1K4j98j8K82j16J56k34J50K63k61K1j24K44n12M89l00J23j38J6MN9k3m0
6028a22J9k08K13R6R0j27K47l60J06Q2K3j89K05l26L31j1j40K51l24P5NM8j6m5
6052g7n2J33j03L78k89M5J19k2k21J40o9j31L7J48j39j5l9J96k1j56N9k8NO1N4
6077A3n9Q2j3k5L9j15J38k5k2j25O8J83n5p3L2l16K15K46rj61p9J44k15R1j34
6102a75K79k2pJ83l74J39k6k18K50j91J76O0J62k55K59k73j09J60J3M7p4K59m55
6125a92J24J55J98l96L2k3J51q3j46L27j96l8K41k41R1J51j61P9N0k04O7o1J75
6148A00j06k8K47m14K6K89j85R3P4k1o9N9m1L1K4m0o9m1n3K07K7j36R7j84o9J11
$$ plain form
6174 -71 -91 116 181 -35 181 15 -45 11 -55 63 246 89 214 177 349 110 -96 -102 -20 -98 -79 112 -168 108
6198 108 -29 119 201 82 -20 7 -114 -107 0 -79 112 -69 31 -180 -59 106 140 134 94 -34 -36 74 138 25
6222 25 15 -167 183 193 110 113 -116 310 111 29 -83 238 -145 56 128 -98 5 -100 133 106 -120 -54 105
6245 105 -243 -51 -85 135 23 116 60 -266 44 74 -250 -24 59 -157 82 -231 -26 264 65 -7 5 11 -100
6268 -100 -9 32 62 111 111 160 -170 13 -95 -71 -71 51 -92 -47 45 -86 2 -68 67 2 -9 -183 -23 -118 -97 -18
6294 -18 60 43 -103 -131 -14 -73 -77 15 52 62 -91 5 -28 -345 -65 153 -51 -65 -128 -85 156 115 55 55 -38 -26 -31 -68
6322 -68 -149 100 -201 107 173 -156 84 -5 -112 -16 208 348 -181 -101 -113 -100 -50 -79 183 438 -1 162 -28
6345 -28 -183 119 44 -87 -59 -84 18 38 31 97 95 -61 106 161 -58 15 292 27 99 91 117 312 43 49 -70 -31
$$ packed form
6174g1k0K07O5k16K16j66o0N6o6J18J83j57J25l7J72k39k06oQ2p8J9J91k80K76
6198A08j37J48Q2j19j02K7j21PJ07p9J91j81J00k11J21J65L4om0j28kJ10O4j13
6222B5j0j82L50J0q3Lk29M26j99q2j12L21l83K01P2k26J03j05K33k7k26O6J59
6245A05l48J92l4K20j12R3n6l26L10L0l24K26Q3k16K39l13K05K90j99p2J2Oj11
6268a00R1M1L0M9%M9l30J83j08K4%J22j43M5R2j31Q8p0J35o5j1j74J60r5K1P9
6294a8P8j7j46k8J17n9mR2L7J0j53R6l3l17K80K18k04j4o3M3K41m1o0%r3J2nl7
6322f8q1K49l01L08O6l29K40q9j07R6K24J40n29Q0j2J3N0k9K62K55m39J63j90
6345b8j55L02p5j31K8k5J02K0pO6kj56J67N5k19P3K77k65P2qK6J95k69Oj19L9
$$ plain form
6371 -31 -63 -124 55 28 17 -45 -29 -75 -22 -105 -65 -22 178 -8 -76 130 -62 84 75 38 -20 -6 -104 279 -177 -134 -52
6398 -52 282 -180 -128 -89 -153 -35 118 -150 4 295 -51 105 -7 30 -51 -113 50 -133 104 -176 -151 90 88
6421 88 -17 -2 -80 -3 16 -97 112 -122 -60 -26 135 -28 69 -21 -61 -117 79 56 146 64 103 -157 -146 -25 -35 71
6447 71 -72 -13 157 178 -125 102 -182 -186 28 -32 -3 -56 -11 136 21 -40 -66 -101 65 56 170 -89 32 87 92 -22
6473 -22 -126 224 41 67 5 -294 -64 124 -178 -49 -25 -32 117 8 18 122 101 14 -143 -42 -199 -71 -8
6496 -8 -9 165 84 106 48 -38 -58 -108 -10 43 199 -14 7 86 -23 -144 -23 -101 -1 91 -4 14 116 140 30 -190
6522 -190 -45 -261 -247 -22 47 170 80 -73 123 37 9 83 32 98 -124 -44 -130 -53 -35 110 36 64 57 -119 -148 -32
6548 -32 15 71 -42 -110 131 54 -101 18 96 -55 86 151 74 55 196 -42 174 -205 233 -122 -15 156 37
$$ packed form
6371c1l2o1J79k7j1o2J6m6N3q3M0M3K00j86o8K06j92J46rl7n8J4r8L83m56M3Q2
6398e2L34m62N2L9o4J18J53k68J54K91l46J56j12L7q1o2J63j83K37k80K5K41k
6421H8j05J5p8P7J9j13K09k34O2L4J61j63R7r0m0n6J96k3R0q2L9k60J1J21j0J06
6447G1j43N9J70K1l03K27k84mK14o0K9n3M5J47j15o1k6l5J66rJ14k59J21N5Nj14
6473b2j04L50j83K6o2k99K30J88l02J29K4pJ49j09J0J04k1q7j57J01j57J28O3
6496hjJ74q1K2n8q6k0n0R8N3J56k13K1P9j09j21J21p8J00R2r5J8J02K4j10k20
6522a90J45k16J4K25O9J23r0j53J96q6k8P4n1O6k22Q0q6P7J8J45p4K8pj76k9J16
6548c2M7N6j13o8K41p7j55J19P8j51J41O5p7j9J41k38K16l79M38l55J07J71j19
$$ plain form
6571 37 -239 -58 208 78 286 -238 -25 -178 63 -70 -34 -183 78 37 -2 34 -197 -295 -68 -44 187 -93
6593 -93 76 39 181 71 28 108 53 -53 -244 -139 167 -35 76 199 54 -13 -36 -2 -269 281 -137 115 197
6616 197 -42 31 19 -1 -19 71 -61 -29 166 -198 -44 75 -22 89 20 18 90 80 -83 61 4 -46 -111 -137 -87 -98
6642 -98 -193 0 65 15 16 -29 -69 42 35 -20 -129 30 -16 -81 24 13 -191 -34 148 11 -196 118 29 -156 -60
6667 -60 24 140 -50 304 106 -158 -21 -157 -107 5 66 124 -93 108 -75 -59 145 -10 26 22 -59 97 -63
6690 -63 -56 -106 15 -8 74 80 111 148 -69 17 44 66 37 -4 -109 -22 35 -9 186 -203 -134 -61 244 -57 -140 -97 81
6717 81 88 -48 215 -211 20 -49 -140 231 80 23 -76 24 -9 -110 -4 65 -51 -352 -57 50 -216 106 249
6740 249 36 -186 -74 4 -107 166 -69 -330 161 -84 -60 -65 -39 -33 -77 67 -222 48 -151 42 -94 10 -146
$$ packed form
6571C7k76J81K66j30K08n24K13j53K41j33L6j49K61m1l9L6k31r8K27K4K31k80
6593i3J69l7J42j10m3Q0n5j06j91J05L06k02J11J23j45o7k3L4k67N50m18K52Q2
6616A97k39P3j2k0j8R0j32L2J95l64J54J19r7J11o9kP2j0j63J44n7n0o5k6N0j1
6642i8r5J93O5n0Jm5m0J11pn5j09J59m6o5J05j1k04J57J82j37k07L14q9j85R6
6667f0Q4J16j90L54j98k64J37j36N0J12O1N8k17K01j83J6K04j55L6mq1J56j60
6690f3Pn0J21k3Q2OL1L7k17Q6K7K2k9m1j05Q7N7m4J95l89O9P3L05l01q3M3J78
6717H1Pj36K63m26K31o9r1L71j51n7r9J00l3j01J06O9j16l01K95J07k66L22J43
6740B49k13k22J12P8j11K73k35k61M91k45K4nK6Om4J44k89K70j99J93j36J04j56
$$ plain form
6763 -146 -158 94 -290 89 65 64 228 33 138 233 -55 -73 246 322 31 73 -58 -55 -92 -44 27 -89 -42 -27 -23 -67
6789 -67 -68 -81 -128 -4 -80 165 -134 -78 165 -89 -54 -124 78 14 90 -101 -5 -12 -93 52 95 82 -29 -13 337 -92
6815 -92 -125 83 87 -33 49 -165 46 -34 -50 -114 102 -52 -98 96 -40 235 76 55 -111 -119 -135 -74 -149 117 51
6840 51 71 -125 125 -122 -33 41 -92 340 -60 -70 167 21 11 -70 131 -87 -153 -163 144 44 223 -96 53
6863 53 -69 -212 52 101 208 -231 134 -72 -231 28 -2 223 6 1 90 102 139 -72 -73 38 -60 32 108 -47
6887 -47 -50 -52 47 -99 263 53 -148 -33 63 -73 180 208 76 67 78 -27 -7 55 66 2 -35 -182 184 -86 105
6912 105 -28 -111 203 17 -47 -31 148 -55 106 -65 12 -89 174 52 155 -15 -143 -16 -132 48 -58
6933 -58 -67 -95 150 1 63 -97 -112 -9 -211 229 32 -142 125 -66 -100 -95 17 -61 85 20 -99 -157 -42 127
$$ packed form
6763a46j2K52l84L79k4jJ64j95J05R5k88j8L19P6k91M2j31Ll7M8P1j16M7J5Mm4
6789f7jj3m7J24p6K45k99N6K43k54L5p0K02o4P6j91R6pq1J45M3j3j11J6L50m29
6815i2l3K08Mj20Q2k14K11q0j6o4K16j54m6J94j36K75j59k1j66qj6O1p5K66o6
6840E1K0j96K50k47Q9P4j33M32m00j0K37j46j0q1K01k18o6j0L07j00J79l19J49
6863E3j22j43K64M9J07m39L65k06j59K59l0K25k17nQ9J2L7k11jJ11r8R2P6j55
6887d7lkR9j46L62k10k01J15R6j36K53K8j32rJ1j05K0O2J1o4l7j47L66k70J91
6912A05j33q3L14j86o4J6J79k03J61j71P7j01K63j22J03j70j28J27j16J80j06
6933e8rk8K45j49O2j60j5J03k02M40j97j74K67j91l4NJ12p8J46o5j19n8J15J69
$$ plain form
6957 127 62 121 264 96 -135 132 -47 -69 -148 122 -133 369 -45 -103 -28 17 57 -77 196 -75 -138 85 56
6980 56 -38 -140 -88 -224 365 184 -155 60 -38 -88 -132 192 60 67 167 -141 132 92 -2 -24 31 -23 80 -101
7004 -101 -176 -123 -193 53 -48 -2 -68 -115 154 -76 71 130 167 -62 134 -80 -16 360 -141 167 83 -27 32 127
7028 127 -59 -24 88 12 34 -113 143 103 48 -299 -44 -28 -209 -78 -141 66 -11 143 -6 -51 -107 -109 150 21
7052 21 -177 48 55 275 -12 -236 -88 -67 6 92 -105 124 -12 133 -18 123 148 67 44 -13 -65 45 -19 -78
7076 -78 -140 -99 -276 45 40 -153 195 -132 1 126 113 -130 143 -4 3 33 -77 -157 -271 -119 -80 40 6 63
7100 63 56 0 -86 -27 18 -221 135 -3 108 139 -1 -8 106 -26 -98 -119 -101 -50 -183 -13 75 -106 46 -166 209
7125 209 32 68 -39 216 61 38 69 -115 -61 57 83 82 -3 -58 88 -120 86 0 -196 -104 -87 -24 -123 40 -47
$$ packed form
6957A27o5N9J43j68k31K67j79k2p9K70k55N02m14n8P5M5M0j34K73k71o3K23k9
6980E6r4j02N2j36N89j81l39K15r8n0m4L24j32PJ00l08K73m0r4k2N5n4J03j81
7004a01p5N3p0K46j01M6o6m7K69k30J47N9L7k29J96k14O4L76n01L08q4j10N9R5
7028A27j86L5J12p6K2j47K56m0n5l47K55J6j81J31o3K07p7J54j49m5n6kK59j29
7052B1j98K25PK20k87k24J48K1P3Q6j97K29j36J45j51J41K5q1k3n7n2J10o4n9
7076g8o2M1j77L21nj93L48l27J33J25j3k43K73j47PL0j10q0j14J52L9J20l4N7
7100F3pn6q6N9M5k39L56j38J11L1j40pJ14j32p2k1J8N1j33J70Q8j81J52k12L75
7125B09j77L6j07K55j55k3L1j84N4J18K6jq5n5J46k08K06q6j96R2J7O3r9J63q7
$$ plain form
7150 -47 -312 135 -66 -182 -95 105 78 -18 82 -354 -22 -32 10 -55 82 -138 -162 80 28 38 31 179 27 -34
7174 -34 -175 131 65 -265 -140 92 16 167 -60 47 -173 161 1 187 -7 -94 -83 17 -107 7 -91 124
7196 124 29 -257 21 138 143 -38 -95 96 39 95 -90 -31 29 -34 -58 -254 -21 -111 105 8 181 94 -4 18 -193
7221 -193 20 -118 -5 27 117 -20 -321 -85 222 81 12 -117 -63 -82 11 48 151 67 47 60 172 182 67 76
7245 76 67 100 40 -9 -122 -69 225 -171 -120 -149 162 -18 70 15 98 -179 -111 -45 -155 135 -151 50 -66 55 -60
7270 -60 21 -34 17 -105 180 210 24 103 150 33 -139 76 73 88 -186 74 -1 -134 157 186 -141 160 -82 -113
7294 -113 -71 -293 -1 -171 29 -75 -27 -106 -56 -97 225 159 129 40 -142 74 -1 -30 3 -199 87 -164 -116 -41
7318 -41 -16 -59 -66 -114 -60 -62 40 108 92 98 22 47 -64 -67 -22 26 115 53 136 4 -8 17 11 -233 -102 60 -24 138 161
$$ packed form
7150d7k65M47k01j16Q7K00k7r6J00m36L32j0M2o5J37k20k4K42n2J0pJ48j52o1
7174c4j41L06o6l30J25K32p6J51k27J07k20L34j60J86j94q7J1J00j24J14r8K15
7196A24r5k86K78J17Nj81n7J91n7N6j85N9O0o3k4j96K33r0K16r7J73q7r8K2k11
7221a93K13j38J13L2R0j37l01K36L07j41o9j29N4j9R3L7J03q4k0J3J12J0j15R
7245G6rL3o0m9j13N3K94l96N1k9L11j80Q8n5Q3k77O8O6j10K90k86K01j16J21j15
7270f0Q1n5N1j22K85L0j86P9M7j17j72K15lJ5k74K60p5j33K91K9l27L01k42l1
7294a13M2k22K92j70K00j04M8p9N0m1L22o6l0q9j82K16p5k9L3k02K86k51M8P5
7318d1K5m3pm8N4kJ02O8j6Op6K5j11lM5M8Q9o2Q3j32j2K5ok44J31J62q4J62K3
$$ plain form
7347 161 -189 -21 34 28 38 -197 -15 107 -27 3 82 165 152 31 -173 -50 -72 99 -102 130 -292 29 -26
7370 -26 -1 70 123 26 -51 -276 125 15 38 -108 -267 -25 -94 -123 -24 24 -53 251 15 208 -24 -178 -132 -19
7394 -19 -131 117 202 -204 152 -10 95 -190 -100 80 144 -64 121 -53 180 4 -10 -90 215 -17 -386 -17
7416 -17 73 -78 59 35 18 53 -64 -62 -85 -59 31 13 -53 -63 18 -34 317 -207 49 22 63 -177 -94 -6 -106 96
7442 96 128 -7 -43 320 63 -216 26 33 51 -74 129 -198 -33 -1 -21 -53 -59 163 78 47 -2 -117 86 137 -41
7467 -41 -29 -156 93 -98 26 -19 -51 -26 140 -134 -114 152 -65 -164 9 -160 -49 -89 -9 99 -190 9 -3
7490 -3 425 341 -10 52 -56 -60 -142 45 -143 92 78 -150 38 4 119 77 -95 66 -144 129 -31 -92 148 -101
7514 -101 159 57 -15 114 -17 160 199 208 181 -25 143 58 76 220 54 156 84 -36 45 -36 -151 -144 -15 -27
$$ packed form
7347A61l50J68N5oJ0k35J82J22j34L0P9Q3j3j21k04J23k2J71k01K32m22L21n5
7370b6K5P1N3r7p7k25M01j10K3j46j59K42o9k9R9M8p7L04k36J93k32j54M6J13
7394a9j12K48Q5m06L56j62J05k85R0J80O4k08J85j74K33j76j4q0L05k32l69L69
7416a7R0j51J37k4j7L5j17Kk3K6R0j8o6j0Q1n2L51n24K56k7M1k40Q3Q8j00K02
7442I6L2j35l6L63k57k79K42PJ8j25K03l27J65L2k0l2oK22q5l1m9j15K03N1j78
7467d1J2j27K49j91J24m5l2K5J66k74K0K66k17r9J73j69J11m0Q0J08k89J99j2
7490cM28q4l51O2j08mq2J87j88K35j4k28J88l4J15m2j72J61k10K73j60o1K40k49
7514a01K60j02p2J29j31J77L9Rk7k06J68q5J8J44j66J02p2j20Q1q1j15PJ29j2
$$ plain form
7538 -27 -29 -151 -61 9 12 113 0 -16 306 153 -47 -26 -85 -223 106 -187 36 0 -96 88 -105 68 30 16 -72
7563 -72 75 -14 4 -83 -198 -70 217 6 34 -23 -117 -30 113 17 106 -8 -27 -2 -114 -117 135 97 -116 60 24
7588 24 -223 14 -101 2 -193 95 31 105 -99 98 -124 49 34 -76 45 -94 -45 3 -103 178 -92 -80
7610 -80 -9 32 -1 -105 -98 70 -82 40 -69 -5 -1 -124 -98 -82 40 -60 -100 -36 -2 91 -306 79 71 60 -135 -7
7636 -7 61 -51 -2 45 -6 -129 56 34 -79 -180 37 137 -25 -22 -69 55 113 -13 30 -98 21 -271 5 -260
7660 -260 249 32 -123 85 113 114 -81 16 187 -29 63 112 218 -97 174 -98 -124 -1 -126 68 206 24
7682 24 14 69 -25 -103 -58 -52 -149 83 -100 0 10 -63 -12 37 145 -73 -52 34 -92 58 -7 52 27 -176 -6 -85
7708 -85 104 72 -107 -177 -57 -213 -205 100 58 57 -60 87 -51 -81 -69 -98 196 -55 -19 33 98 32 -64 108 -48
$$ packed form
7538b7kj22R0P0LJ01j13j6L22j53k00K1n9j38L29k93K23l6r6J84j93J73l8j4q8
7563g2J47q9J8q7j15J28K87k11K8n7r4Q7J43r6Q9j14j9K5j12lK52l8k13J76l6
7588B4k47K37j15J03j95K88o4P4k04J97k22J73j5j10J21j39M9M8j06K81k70J2
7610h0P1M1l3j04PJ68j52J22j09O4Mj23K6J6J22j00m0O4L4R3l97L85qj1j95J28
7636gO8j12M9M7n1j23J85k2j13j01K17J00j62Lm7J24N8j26M3j28J19k92K76k65
7660b60N09k17j55K08K8Jj95R7J71k16R2M9J06l15K71k72k6J23j25J94J38j82
7682B4j0N5r4p8M5Or7K32j83J00J0p3N1M9J08k18K1Q6j26J50o5N9k5k03J70p9
7708h5J89l2j79p0J20j56QL05m2jj17J47j38l0J2k9K94k51L6N2O5o6r6J72j56
$$ plain form
7733 -48 -77 -143 -154 12 185 -27 16 -150 2 435 26 -39 -93 -83 -13 -3 -17 -116 -74 79 -229 149 -134 99
7757 99 -279 -169 267 259 -149 79 -105 -84 -83 243 0 88 42 -65 43 72 0 -275 75 -25 -72 24 -145 60
7781 60 -132 -152 81 20 -36 67 60 -38 63 311 190 22 -51 37 65 -3 -18 99 -153 159 56 -54 -121 128
7805 128 -78 -153 23 70 145 -148 -35 -151 31 171 -155 278 144 -41 45 62 64 -33 -147 -107 -207 -107 -74
7828 -74 -74 -36 -115 -86 178 -35 31 25 -35 5 -13 77 77 247 12 -66 -117 -79 -237 -203 3 13 267 139 -88 94 8
7855 8 -155 -24 -66 138 39 -258 40 -90 -69 40 -194 -116 -120 218 -188 -34 34 -205 119 10 82 -126 171
7878 171 -161 -45 -17 -174 68 -120 -72 40 29 -33 32 82 -218 48 252 -116 28 -85 58 -40 36 -125 -48
7901 -48 107 -65 -88 -67 -56 -105 -303 43 50 -9 142 179 -81 -83 174 58 152 -58 127 -351 -45 -63 13 -26 -58
$$ packed form
7733d8k9o6j1J66J73k12M3j66J52M33m09o5n4J0P0J0j4r9M2J53l08L78k83K33
7757I9l78J10M36qm08K28j84K1JL26k43Q8m6j07J08K9p2k75L50j00m7R6j69K05
7781F0j92k0K33o1n6J03pr8J01K48j21j68p3Q8K8o8j5J17k52L12j03j10o7K49
7805A28k06p5J76M7P5k93J13j16J82J40l26M33j34j85Q6J7Kr7j14M0j00J00L3
7828g4%L8p9K9K64k13O6oo0M0j8R0%J70k35p8n1L8j58L4K06J0K54j28k27J82q6
7855Hj63J31m2K04r9k97K98j30K1J09k34P8mL38m06J54O8k39L24j09P2k08K97
7878A71l32J16K8j57K42j88M8J12j1o2O5N0l00K66K04l68J44j13J43r8P6j61P7
7901d8J55j72k3K1J1m9j98L46Pn9J51L7k60kK57j16R4k10J85m78L06j8P6l9l2
$$ plain form
7926 -58 -80 -89 58 -118 -14 -12 -80 -28 146 -46 -214 -24 40 -103 85 -57 -107 20 -76 10 -146 117 -47 -201
7950 -201 129 36 109 -24 37 28 -213 -11 135 192 117 -115 -77 -64 -97 182 110 33 -33 -85 218 78 -95 158 61
7975 61 -139 -91 -145 -77 -45 -143 187 -129 -48 145 90 -195 259 95 24 51 84 97 -104 167 4 -30 6 94 60
8000 60 233 110 40 -13 -149 -14 -65 -48 83 145 6 -51 51 173 -41 28 -49 -228 23 79 -134 3 52 -214
8024 -214 83 -151 96 109 -150 12 141 -130 -104 -238 335 186 -127 -28 -49 79 -27 133 16 81 0 14
8046 14 -42 -69 84 -7 -90 137 62 -275 200 52 220 56 -16 23 -190 -110 107 197 -276 -178 163 173 32 23 211
8071 211 29 -105 -122 -183 46 -99 -10 -96 -45 76 94 -118 88 -64 158 -29 -20 -108 53 -23 -51 -147 22 -52
8095 -52 -4 157 96 2 -9 9 -25 141 -191 92 -32 -3 -118 -17 -187 -64 -3 143 4 -141 82 -25 -99
$$ packed form
7926e8k2rJ47j76J04Ko8N2J74j92j68J90O4j43J88j42n0J27r6Q6j56K63j64j54
7950b01L30r3P3j33O1rk41K02J46N7p5k32L8J3l3K79p2p7o6n2L03j40j73K53r7
7975F1k00M8n4O8L2r8L30l16Q1J93n5k85M54j64p1K7L3J3k01K71j63l4L6Q8l4
8000F0J73j23p0n3j36J35n1J7J31O2j39n7J02J22k14O9p7j79K51N6k13J37M9k66
8024b14K97k34K47J3k59J62J29k71K6j34N73j49l13R9k1J28j06J60j17O5q1J4
8046A4n6k7J53r1q3K27p5l37M75j48J68j64p2L9k13Q0K17R0m73R8L41J0j41rJ88
8071B11j82j34j7o1K29j45Q9q6N1J21J8k12K06j52K22j87Rq8J61p6k8r6J69p4
8095e2M8J61o1r4j1J8l4J66l32K83j24K9j15J01j70J23O1J46j39j45K23j07p4
$$ plain form
8118 -99 2 -60 64 -138 -86 69 -60 -118 1 -39 15 65 -188 4 -13 6 -17 79 175 110 109 74 66 2 -71 -70 71
8145 71 55 42 -5 136 -270 49 0 -58 11 -141 32 46 -106 -75 75 -160 12 36 -28 -53 -42 151 -20 68 134
8170 134 -81 90 -66 230 11 -35 132 -49 85 -21 6 61 108 -154 38 -39 -110 -68 -181 25 56
$$ packed form
8118i9J01o2J24k02N2J55j29n8J19m0N4N0k53J92j7J9k3R6R6o5jl5qo4p3JJ41
8145G1j6j3m7J41m06L19m9n8O9j52J73J4j52L1J50k35J72K4o4k5J1J93j71Q8O6
8170A34k15J71j56K96k19m6J67j81J34j06K7N5M7k62J92p7p1M2j13K06L1
8191E6
$$ Imaginary data points
##PAGE= N=2
##DATA TABLE= (X++(I..I)), XYDATA
$$ plain form
0 0 0 0 0 0 0 0 0 0 0 -8 8 -8 8 -16 16 -24 32 -40 40 -56 64 -77 88 -107 126 -144 169 -198 225 -261 299 -339
32 -339 386 -438 493 -555 625 -699 780 -873 972 -1078 1198 -1326 1465 -1621 1788 -1971
48 -1971 2171 -2391 2636 -2903 3202 -3531 3901 -4323 4796 -5343 5978 -6725 7624 -8725
62 -8725 10116 -11926 14405 -18008 23758 -34421 60905 -273684 -209557 473902 341840 -164632
74 -164632 -467583 -128285 259183 247465 -133036 -283898 -58265 235352 157899 -139544
84 -139544 -263112 -27045 229333 192554 -100386 -261650 -105989 183709 230044 -18961
94 -18961 -250777 -150722 142880 250547 32579 -210012 -175671 70581 198036 66954
104 66954 -132673 -144760 13832 117162 41456 -83400 -88726 13083 75512 29546 -57776
$$ packed form
0@%%%%%%%%%qJ6j6J6k4L2m0N6p2Q0r6J20j41J65j95K33k70L13l67M23m86N60o38
32c39P25q24R31j048J180j324J479j653J845k050K276k524K791l086L409l759
48a971M142m562N027n539O105o733P432q224R119j0139J1321j2703J4349j6349
62h725J8841k2042K6331l2413M1766n8179R5326l34589O4127O83459j32062n06472
74a64632l02951L39298L87468j1718l80501j50862K25633K93617p7453k97443
84a39544j23568K36067K56378l6779k92940j61264J55661K89698M6335k49005
94a8961k31816J00055K93602J07667k17968k42591L4341K46252J27455j31082
104F6954j99627j2087J58592J03330p5706j24856n326J01809O2429m5966q7322
$$ plain form
115 -57776 -81275 -11284 81467 87240 -19677 -120854 -79280 71838 145260 35956 -127878
126 -127878 -136788 29923 161160 83919 -103800 -152795 795 146694 90973 -82001 -136037
137 -136037 -7247 125516 89055 -62608 -128072 -21640 115730 97421 -58351 -142352 -34041
148 -34041 127278 122734 -51564 -169852 -71673 121904 157617 -14079 -166046 -94690 101282
159 101282 154662 -1193 -145942 -84839 85668 125584 -11733 -129383 -66776 83261 111858
170 111858 -18027 -126988 -67863 77568 115332 1105 -109730 -74964 53204 106953 22686
181 22686 -86468 -83082 22505 91052 37255 -61409 -74382 8245 69060 30873 -44627 -51896
193 -51896 13710 57489 21156 -42953 -47123 12232 55042 26609 -34643 -50887 -6427 40216
$$ packed form
115e7776k3499O9991R2751N773j06917j01177M1574J51118P3422j09304j63834
126a27878q910J66711J31237p7241j87719m8995J53590J45899n5721j72974n4036
137a36037J28790J32763l6461j51663o5464J06432J37370j8309j55772q4001J08311
148c4041J61319m544j74298j18288R8179J93577L5713j71696j51967P1356J95972
159A01282N3380j55855j44749O1103J70507L9916j37317j17650O2607J50037K8597
170A11858j29885j08961N9125J45431L7764j14227j10835L4766J28168N3749q4267
181B2686j09154L386J05587O8547n3797r8664j2973Q2627O0815l8187p5500p269
193e1896O5606M3779l6333o4109m170N9355M2810k8433o1252j6244M4460M6643
$$ plain form
205 40216 35844 -8852 -41099 -27511 14688 38434 16922 -24752 -35177 -1181 33137 22605
217 22605 -18494 -34900 -4586 32422 25326 -18473 -39699 -5534 39010 30179 -24036 -48511
229 -48511 -5651 48644 41711 -19693 -57142 -21502 43241 53296 -5691 -56015 -28761 39251
241 39251 53854 -5384 -55796 -28484 37939 52149 -5228 -54299 -27359 39689 51893 -12534
253 -12534 -63940 -26240 50494 58783 -13258 -67237 -30585 44753 59090 -4779 -60461 -33467
265 -33467 38569 55776 -5086 -57721 -29146 37875 49861 -6579 -52076 -26364 34345 48902
277 48902 -2228 -50366 -28803 33832 50465 -2516 -51407 -29990 30264 49751 6154 -42187
289 -42187 -36735 13984 44800 17581 -29542 -33297 7309 34179 13011 -23567 -27570 2928 28670
$$ packed form
205D0216m372m4696l2247J3588M2199K3746k1512m1674j0425L3996L4318j0532
217B2605m1099j6406L0314L7008p096m3799k1226L4165M4544q831n4215k4475
229d8511M2860N4295o933o1404l7449L5640O4743J0055n8987n0324K7254O8012
241C9251J4603n9238n0412K7312O6423J4210n7377m9071K6940O7048J2204o4427
253a2534n1406L7700P6734Q289p2041n3979L6652P5338J4337o3869n5682K6994
265c3467P2036J7207o0862n2635K8575O7021J1986n6440m5497K5712O0709J4557
277D8902n1130m8138K1563O2635J6633n2981m8891K1417O0254J9487m3597m8341
289d2187N452N0719L0816k7219m7123l755M0606K6870k1168l6578m003L0498K5742
$$ plain form
302 28670 19158 -15152 -31892 -7459 27643 26970 -9520 -33119 -14781 21408 31821 3549 -31878
315 -31878 -30313 10420 41159 19161 -29527 -40531 930 39591 26430 -20516 -40219 -5965
327 -5965 38465 31620 -21186 -48115 -7108 47952 37938 -26061 -57195 -12925 49289 47589 -17251
340 -17251 -60325 -22796 47500 54692 -13945 -65136 -28009 46902 57540 -8741 -62107 -32440
352 -32440 39078 56472 -4347 -60913 -34483 40895 60256 -3691 -62822 -36088 38720 60586
364 60586 2294 -57715 -40717 29556 59390 9782 -52098 -42594 22576 53891 11901 -42946
376 -42946 -38457 15193 46629 16734 -33313 -38316 6554 40974 19861 -26428 -35174 2395 34982
389 34982 21160 -18708 -34004 -6567 28757 27705 -7794 -32037 -14891 20289 28163 294
$$ packed form
302B8670r512l4310j6740K4433L5102o73l6490k3599J8338L6189J0413k8272l5427
315c1878J565M0733L0739k1998m8688j1004M1461L8661j3161m6946j9703L4254
327e965M4430o845n2806k6929M1007N5060j0014o3999l1134M4270O2214j700o4840
340a7251m3074L7529P0296P192o8637n1191L7127P4911J0638o6281n3366K9667
352c2440P1518J7394o0819n6566K6430P5378J9361o3947n9131K6734P4808K1866
364F0586n8292o0009J6998P0273K9834m9608o1880R504O5170L1315m1990n4847
376d2946M489N3650L1436k9895n0047n003M4870L4420k1113m6289q746L7569L2587
389C4982j3822l9868j5296K7437L5324j052l5499k4243J7146L5180P874k7869
$$ plain form
401 294 -26366 -19406 11546 28121 10455 -20701 -26516 1400 27696 18091 -15093 -28315 -3966
414 -3966 26210 22506 -12286 -32692 -10432 28464 31691 -7678 -38103 -17838 26866 36127 -2595
427 -2595 -38009 -22766 23358 38684 2321 -37472 -27702 19493 39990 6326 -35914 -28930 16829
440 16829 39290 7998 -33893 -29468 15036 38963 9150 -34079 -32119 13464 41276 13747
452 13747 -31636 -33705 8467 36587 14581 -25412 -29151 6060 31722 13568 -22024 -26968 4079
465 4079 28010 12815 -18209 -22521 3095 22121 10333 -14423 -19225 805 19020 12437 -9830
478 -9830 -18370 -3147 13982 11499 -4644 -12462 -4236 7308 8368 -528 -7468 -4223 4552 7030
492 7030 58 -6114 -3891 2350 5652 3345 -1994 -6034 -3510 4318 7771 460 -8164 -5776 5004
$$ packed form
401B94k6660O960L0952J6575j7666l1156n815K7916K6296r605l3184j3222K4349
414c966L0176l704l4792k0406K2260L8896L227l9369l0425K0265M4704R261l8722
427b595l5414J5243M6124J5326l6363l9793R770M7195K0497l3664m2240O984M5759
440A6829K2461l1292m1891M425M4504K3927k9813m3229J960M5583K7812k7529
452A3747m5383k069M2172K8120k2006l9993l739L5211K5662j8154l5592m944L1047
465D079K3931j5195l1024m312K5616J9026j1788k4756m802K0030J8215o583k2267
478i830q540J5223J7129k483j6143p818Q226J1544J060q896o940L245Q775K478
492G030o972o172K223O241L302k307n339m040K524P828L453p311q624K388J0780
$$ plain form
507 5004 9762 1723 -9706 -9696 3763 13849 5567 -11247 -12624 4109 14810 3507 -12807 -10690
521 -10690 6835 15736 3922 -13786 -14068 4643 17803 6476 -13723 -14068 6143 17059 3646
534 3646 -14739 -12876 6510 18163 5951 -14838 -16728 4961 20425 7924 -15035 -15271 5179
547 5179 16738 3997 -14081 -11619 7469 17713 2997 -17500 -14483 8425 19522 3438 -16279
560 -16279 -11665 7929 14795 1045 -13073 -10187 5896 14320 3762 -11612 -10097 4683 11046
573 11046 1164 -9668 -5775 5964 10091 1563 -9712 -10186 2757 12711 6579 -7748 -10354 606
587 606 8951 4640 -3660 -5935 -1045 4942 4669 -1505 -5844 -1959 4338 4826 -430 -4530 -3987 692
603 692 5840 4992 -3242 -8813 -2072 9454 8266 -5076 -12405 -3321 10612 11644 -2914 -14573
$$ packed form
507E004M758q039j1429J0J3459J0086q282j6814j377J6733J0701j1303j6314K117
521a0690J7525Q901j1814j7708k82J8711J3160j1327k0199l45K0211J0916j3413
534C646j8385J863J9386J1653j2212k0789j890K1689J5464j2501k2959k36K0450
547E179J1559j2741j8078K462J9088J0244j4716k0497L017K2908J1097j6084j9717
560a6279M614J9594O866j3750j4118K886J6083Q424j0558j5374J515J4780O363
573A1046r882j0832L893J1739M127q528j1275m74J2943R954o132j4327k606J0960
587F06Q345m311q300k275M890N987k73o174m339L885O297M88n256m100N43M679
603F92N148q48q234n571O741J1526j188j3342p329R084J3933J032j4558j1659
$$ plain form
617 -14573 -7026 10184 13624 -2526 -16180 -6607 12417 14416 -2925 -16383 -8526 10685 16397
630 16397 590 -16210 -11033 10155 18315 745 -18826 -12525 10831 20371 2917 -19137 -15665
643 -15665 9069 22170 4482 -19507 -16477 9504 22299 4038 -18912 -15481 8335 19894
655 19894 4273 -16696 -14825 6817 18503 4978 -15009 -14225 4965 16398 5927 -11714 -13914
668 -13914 1798 14811 9029 -7729 -14311 -2347 12311 9899 -5272 -12188 -2426 10225 8626
681 8626 -3839 -11007 -3462 8341 9744 -864 -8962 -5209 4804 8002 1038 -6719 -6204 1378
695 1378 8023 5162 -4185 -9932 -3649 8027 9635 -1043 -11016 -6074 6845 10537 -440 -11371
709 -11371 -6814 7288 11577 -460 -12649 -7849 8160 13555 648 -12979 -9631 6364 13676
$$ packed form
617a4573P547J7210L440j6150j3654R573J9024J999j7341j3458P857J9211N712
630A6397j5807j6800N177K1188Q160j7570j9571O301K3356R540j7454k2054L472
643a5665K4734J3101j7688k3989L030K5981J2795j8261k2950L431K3816J1559
655A9894j5621k0969J871K1642J1686j3525j9987P84J9190J1433j0471j7641k200
668a3914J5712J3013n782j6758o582J1964J4658k412j5171o916R762J2651j599
681H626j2465p168P545J1803J403j0608q098L753J0013L198o964p757N15P582
695A378O645k861r347n747O283J1676J608j0678r973M942J2919L692j0977j0931
709a1371M557J4102M289j2037j2189M800J6009N395j2907j3627L348J5995P312
$$ plain form
722 13676 3542 -10868 -10837 3670 14038 4975 -11171 -12409 3332 14567 6051 -10115 -11889
735 -11889 2660 13658 5470 -10344 -12143 4102 15746 5858 -12099 -13582 2965 13945 6145
748 6145 -8751 -10634 1177 10312 4391 -7244 -9231 1666 9892 4251 -6848 -7870 521 7119
762 7119 4163 -3387 -6193 -795 5728 4554 -3092 -6045 -189 5755 3607 -2479 -4601 -1157 2723
777 2723 3138 143 -2334 -1337 1276 1536 -542 -1348 399 882 358 1190 647 -1944 -2647 463 3189
794 3189 1131 -2116 -1968 553 2173 619 -2785 -3119 1477 5246 2016 -5077 -5012 1832 5785 1566
810 1566 -3795 -3899 1240 4316 1581 -3893 -4383 1895 6197 1821 -5850 -4755 3191 6566 1061 -5732
826 -5732 -4609 2585 7123 1959 -6859 -6331 3355 9064 1849 -7518 -5740 3387 6968 822 -6015
$$ packed form
722A3676j0134j4410L1J4507J0368r063j6146j238J5741J1235q516j6166j774
735a1889J4549J0998q188j5814j799J6245J1644r888j7957j483J6547J0980p800
748F145j4896j883J1811R135n921j1635j987J0897Q226n641j1099j022Q391O598
762G119k956p550k806N398O523j174p646k953N856N944k148o086k122L444L880
777B723M15k995k477R97K613K60k078q06J747M83n24Q32n43k591p03L110K726
794C189k058l247J48K521J620j554l404l34M596L769l230p093O5O844L953m219
810A566n361j04N139L076k735n474m90O278M302m376p671J095P946L375n505o793
826e732J123P194M538n164q818N28R686N709p215r367J778R127L581o146o837
$$ plain form
841 -6015 -4432 3966 7628 305 -8525 -5883 4937 8819 626 -7891 -5291 3639 6883 693 -6286
856 -6286 -5386 2701 7399 1864 -6672 -5704 3186 6753 1360 -5508 -4482 2296 6055 2375 -4836 -5863
872 -5863 922 6544 3310 -4218 -5586 117 4778 3338 -1693 -3986 -1962 3107 4209 -361 -4464
887 -4464 -2336 2850 4240 511 -3836 -4021 377 4745 3372 -3185 -6008 -681 5989 4372 -3322
902 -3322 -6955 -1758 6128 6210 -1747 -8331 -4011 5629 7742 -1113 -8708 -4211 6410 8449 -918
917 -918 -9077 -5893 5702 9988 1320 -9768 -7367 5037 10803 1547 -10041 -8130 5068 11510
931 11510 2643 -9647 -9279 3805 12168 4368 -8975 -10244 2384 11269 4199 -8468 -9416 2318
945 2318 10642 4842 -7442 -9741 515 10205 6068 -5658 -9478 -782 8649 5750 -4400 -9058
$$ packed form
841f015J583Q398L662p323q830K642J0820L882q193q517K600Q930L244o190o979
856f286R00Q087M698n535q536R68Q890L567n393o868J026O778L759l680p211j027
872e863O785N622l234p528j368N703M661j440n031k293K024N069J102m570m103
887d464K128N186J390l729m347j85M398M368j373o557k823N327O670j617p694
902c322l633N197P886Q2p957o584M320R640K113q855p595M497J0621K039r367
917i18q159L184J1595M286q668j1088K401J2404N766r256j1588J911J3198O442
931A1510q867j2290L68J3084Q363p800j3343j269J2628Q885p070j2667r48J1734
945B318Q324n800j2284k299J0256R690m137j1726l820Q696R431k899j0150m658
$$ plain form
959 -9058 -1729 7497 7202 -2247 -8628 -3962 5571 7844 -253 -7042 -4317 4292 6724 92 -6209
974 -6209 -4677 2797 6991 2361 -5573 -6539 983 6994 4013 -3509 -6596 -1342 5564 5693 -1681 -7627
990 -7627 -3697 5549 7754 -362 -8168 -5263 4573 8038 1333 -7153 -5826 3401 8624 1616 -8099
1005 -8099 -7061 4049 9929 2067 -8199 -8339 2229 9591 5001 -5878 -8460 933 9007 4645
1019 4645 -6291 -8166 1251 9169 5186 -5460 -8646 -862 8304 6561 -4415 -9195 -794 8492
1033 8492 6073 -4446 -8490 -772 7031 5753 -2851 -7537 -2567 5537 5849 -1983 -6679 -1940 4995
1048 4995 4579 -1694 -5358 -2110 3301 5284 642 -4684 -3944 2053 5081 1010 -3237 -2797 1456 3316
1064 3316 1315 -2556 -3449 -74 3936 3040 -1998 -4076 -648 2619 2393 -373 -2470 -1691 1486 3361
$$ packed form
959i058P329R226k95r449o381M666R533K273q097o789K725Q609K432o632o301
974f209J532P474M194m630p934r66P522O011k981p522l087N254O906J29p374n946
990g627L930R246K205q116p806K905R836L465o705q486J327R227N223p008r715
1005h099J038J1110N880p862j0266j40J0568P362m590j0879k582R393Q074m362
1019D645j0936j875R417P918l983j0646l186P784R166j743j0976m780Q401R286
1033H492k419j0519m044P718P803j278q604m686M970Q104L12p832m696M739O935
1048D995m16o273l664L248N411J983m642n326P40N997L028m071m247M40M253J860
1064C316k001l871q93L375M010q96n038k078L428L267k26k766k097P79L177J875
$$ plain form
1080 3361 646 -3666 -3045 1882 4492 995 -3773 -3285 883 4054 1911 -3407 -4373 877 5111 2171
1096 2171 -4458 -4789 1289 5028 2411 -3362 -4440 19 4692 2701 -3149 -4870 564 5225 2573
1111 2573 -3669 -4905 311 5124 3347 -2649 -5355 -713 4796 3716 -3033 -5614 -49 5363 3332
1126 3332 -3543 -5136 -286 4817 3071 -2682 -4885 -138 5029 3272 -3010 -4928 146 4414 2880
1141 2880 -2004 -4024 -984 3213 3106 -844 -3894 -1269 3283 3129 -1136 -4032 -1555 2879 3138 -460
1157 -460 -3612 -2303 1691 3346 118 -3120 -2133 1818 3204 239 -2569 -2315 779 2835 1668 -1497
1173 -1497 -3122 -459 2316 2227 -1029 -2929 -969 2566 3000 -607 -4041 -2222 2847 4701 187 -4643
1189 -4643 -3144 2497 4575 356 -4487 -3425 2563 5412 1170 -4846 -4494 1791 5518 1833 -4284
$$ packed form
1080C361k715m312O21M927K610l497m768M88M168L171k143n318r66N250M234k940
1096B171o629l31O078L739k617n773j078M459M673j991n850j721N434M661k652
1111B573o242j236N216M813j777n996k706M642N509j080o749k581N565N412k031
1126C332o875j593M850N103j746n753k203M747N167j757o282j918N074M268j534
1141B880m884k020L040M197j07l950l050K625M552j54m265k896K477M434K59l598
1157d60l152J309L994J655l228l238R87L951J386k965k808K54L094K056j167l165
1173a497j625K663K775q9l256j900J960L535M34l607l434J819N069J854m514m830
1189d643J499N641K078m219m843J062N988K849m242o016L52O285L727l685o117
$$ plain form
1204 -4284 -4930 1464 5795 2433 -4508 -5505 1098 6329 3417 -4530 -6496 56 6672 4238 -3860
1219 -3860 -6554 -157 6188 3948 -3717 -6490 -596 6444 4612 -3486 -6663 -1259 5666 4740 -2213
1234 -2213 -5833 -1520 4477 4024 -1528 -5467 -2401 4093 5348 -444 -5487 -3340 2899 4974 654
1249 654 -4134 -3353 1851 4578 1325 -3729 -4138 1292 4856 1805 -3493 -4100 13 3697 2935 -1456
1265 -1456 -4044 -1281 3370 3610 -1138 -4530 -1934 2982 4458 343 -4193 -3730 1493 5185 1980
1280 1980 -4053 -4469 1636 5307 1740 -4550 -4617 1292 5523 2983 -3807 -5573 -129 5686 3867 -3488
1296 -3488 -5499 133 5486 3481 -3004 -5564 -1316 4847 4787 -1964 -6250 -1983 5087 4852 -1931 -5312
1312 -5312 -1605 4445 4644 -1315 -5293 -2747 4227 5701 -486 -5790 -2720 3523 4669 -144 -4062
$$ packed form
1204d284o46O394M331l362o941r97O603N231k912p947j966O552O616k434q098
1219c860k694O397O345k240p665k773N894P040j832q098l177N404O925r26o953
1234b213l620M313N997m53n552l939L066O494J255n792n043K147O239K075m320
1249F54m788P81N204K727l253n054m09N430L564l051n298o07M113L684p62m391
1265a456k588K763M651K40m748l392K596M916J476m115m536M63N223L692l205
1280A980o033m16O105L671l567o290o7N909M231k540o790j766N444N815j819p355
1296c488k011N632N353k005o485k560M248O163o0o751m286M267P070k35o783l381
1312e312L707O050J99n959l978K546O974J474o187n304L070O243J146m813l918
$$ plain form
1327 -4062 -2628 2044 4243 616 -3766 -3397 1602 4396 916 -3115 -2722 524 2937 1369 -1742
1342 -1742 -3109 -158 3258 2473 -1759 -3563 -633 2676 2725 -518 -2722 -1617 1556 2732 432 -2573
1358 -2573 -1996 1564 3054 732 -2375 -2111 761 3026 1708 -1769 -2948 -114 3236 1902 -2154
1373 -2154 -3632 -127 3324 2564 -1732 -3734 -1199 3025 3328 -968 -4057 -1088 3325 2708 -1485 -4029
1389 -4029 -877 2897 3187 -701 -3896 -1587 2837 3457 -689 -3705 -1317 2606 3005 -756 -3588 -1801
1405 -1801 2458 3459 -36 -3587 -2330 1923 3301 54 -2866 -1698 2121 2875 -58 -2985 -1908
1420 -1908 1459 2970 436 -2297 -1745 1134 2404 186 -2105 -1567 1192 2360 415 -1855 -1928 327
1436 327 1928 1308 -1143 -2020 27 1508 1069 -1087 -1693 -19 2098 1549 -784 -2235 -946 1486
$$ packed form
1327d062J434M672K199l627m382L69M999K794l480m031L93L246K413j568l111
1342a742j367K951L416p85m232j804K930L309M9l243k204J105L173J176k300l005
1358b573N77L560J490k322l107K64K872K265j318l477j179K834L350j334m056
1373b154j478L505L451p60m296k002K535M224L03m296l089K969M413o17m193k544
1389d029L152L774K90l888l195K309M424O20m146l016K388L923L99l761k832J787
1405a801M259J001l495l551J257M253J378l247k920J168L819P54k933k927J077
1420a908L367J511k534k733N52K879J270k218k291N38K759J168j945k270p3K255
1436C27J601o20k451q77K047J481m39k156o06J674K117n49k333j451J289K432
$$ plain form
1452 1486 1924 -346 -1611 -974 1126 1557 24 -1727 -1055 1163 2244 686 -1811 -2127 403 2356
1468 2356 1068 -1583 -2066 232 2303 1012 -1873 -2609 336 3298 1896 -2183 -3439 -49 3283
1483 3283 2051 -1736 -2959 -130 2768 1883 -1698 -3572 -521 3447 2771 -1910 -3771 -808 3386
1498 3386 2750 -1092 -3445 -1154 2766 3143 -951 -4030 -1683 3219 3495 -818 -3848 -1830 2466 3142
1514 3142 -26 -3035 -1609 2235 3352 -377 -3690 -1923 2456 3355 -137 -3026 -2274 780 2787
1529 2787 1101 -2230 -2814 693 2883 1007 -2257 -2639 383 2670 1902 -1138 -2949 -799 2382 2459
1545 2459 -832 -2786 -787 2170 2029 -793 -2681 -1422 1303 2936 938 -2776 -2381 1256 3143
1560 3143 895 -2409 -2283 787 2715 1697 -1864 -3236 -147 3535 2590 -1973 -3746 -187 3253
$$ packed form
1452A486M38k270j265O37K100M31j533j751O72K218J081j558k497l16K530J953
1468B356j288k651m83K298K071j291k885p36K945K962j402m079j256L390L332
1483C283j232l787j223K829K898q85l581j874L051L968o76m681j861K963M194
1498C386o36l842k353K291L920L77m094l079K347M902K76m313l030K018M296O76
1514C142l168l009J426L844J117l729l313J767M379Q99l492k889P52L054K007
1529B787j686l331n84L507K190j876l264l82L022K287p68l040j811K150L181P7
1545B459l291j954J999K957j41k822j888J259K725J633j998l714L95L637J887
1560C143k248l304J26L070J928j018l561j372L089L682r45m563j773L559L440
$$ plain form
1575 3253 2268 -1525 -3218 -499 3218 3137 -1466 -4142 -1395 3233 3371 -1197 -3860 -1292 2626 3165
1591 3165 -282 -3538 -2112 2414 3638 -226 -3602 -2267 2089 3592 -68 -3087 -2157 1603 3443
1606 3443 747 -3174 -2744 1334 3785 869 -2695 -2700 605 2726 1350 -1620 -2479 -67 2567 1459
1622 1459 -1589 -2414 177 2333 1856 -698 -2421 -897 1568 2090 -165 -2208 -1289 1469 2365 -87
1638 -87 -2383 -1707 939 2177 1092 -1588 -2011 200 2236 1308 -1434 -1872 179 1806 1465 -1072 -2262
1655 -2262 -525 2187 2295 -605 -2769 -1127 1943 2445 -628 -2596 -1056 1809 2307 -226 -2639 -1504
1671 -1504 1763 2854 389 -2608 -1704 1352 2334 -13 -2486 -1535 1360 2449 68 -2565 -2246 1110
1687 1110 2733 792 -1857 -1891 688 2272 516 -1885 -1706 521 2156 768 -1649 -2256 508 2262
$$ packed form
1575C253r85l793j693K719L717q1m603k676K747M628J38m568k663K568L918N39
1591C165l447l256J426M526J224l864l376J335M356J503l660l019R30L760J840
1606C443k696l921M30M078K451k916l564nL305K121j376k970q59K412K634j108
1622A459l048q25K591K156m77k554j723J524K465N22k255k043R19K758Q96k452
1638h7k296O76K646J238j085k680m23K211K036r28k742m38K051J627l41k537j190
1655b262J737K712J08k900k164J642L070N02l073j968J540K865M98k533k413J135
1671a504L267J091k465k997R04L056R82k347k473R51K895J089k381k633L19L356
1687A110J623j941k649l4K579J584j756k401J79K227J635j388k417o07K764J754
$$ plain form
1703 2262 1130 -1454 -1602 512 1464 438 -1264 -1423 359 1667 928 -980 -1502 -345 1158 1294
1719 1294 -322 -1173 -551 665 952 -241 -1098 -670 982 1469 -249 -1416 -1034 696 1287 174 -947
1736 -947 -649 280 994 241 -1074 -1109 481 1651 638 -1001 -1388 -186 1153 870 -225 -1058 -621 1018
1754 1018 815 -867 -1865 -145 1713 1140 -494 -1710 -570 1234 1519 -431 -1776 -751 1720 1647
1770 1647 -1090 -2249 -559 1843 1450 -464 -1687 -935 961 1760 -81 -1788 -864 1692 1742 -577
1786 -577 -2095 -755 1137 2050 178 -1803 -1549 803 1887 -37 -1970 -1192 1285 1827 197 -1719
1802 -1719 -1231 781 1992 271 -1709 -1424 688 1747 406 -1698 -1345 566 1480 549 -1070 -1517
1818 -1517 -151 1780 1135 -575 -1571 -285 1196 1106 -699 -1357 -593 979 1512 -44 -1879 -1017 1248
$$ packed form
1703B262j132k584j48K114R52j026j702j59J782J308p39j908n22J157J503J36
1719A294j616q51O22J216K87j193q57M28J652M87j718j167L82J730N91j113j121
1736i47K98R29P14p53j315l5J590J170j013j639l87J202J339k83j095q33M37J639
1754A018k03j682r98J720J858n73j634j216J140J804K85j950j345J025K471p3
1770A647k737j159J690K402l93j914j223P52J896P99j841j707R24K556N0k319
1786e77j518J340J892R13j872j981K54K352J084j924j933P78K477N42j630j916
1802a719M88K012J211j721j980K85K112J059j341k104L53J911R14r31j619m47
1818a517J366J931o45j710r96J286J481r0j805o58P64J572N33j556j835Q62K265
$$ plain form
1835 1248 1681 -176 -1252 -836 706 1201 424 -1252 -1442 468 1875 748 -1288 -1767 52 1671
1851 1671 962 -853 -1739 -167 1609 1578 -959 -2174 -324 1995 1581 -900 -2169 -521 1509 1599 -443
1868 -443 -2064 -1047 1755 1952 -448 -2529 -928 1504 1977 -118 -1910 -1250 898 2113 324 -1685
1884 -1685 -1311 984 2353 228 -1635 -1543 624 2110 818 -1452 -1802 287 1833 778 -1329 -1732
1900 -1732 329 1807 963 -1068 -1666 -254 1475 1345 -276 -1553 -505 1177 1248 -214 -1320 -301
1916 -301 1232 1344 -1 -1331 -975 502 1524 522 -1249 -976 142 1112 580 -1059 -1179 72 1441
1933 1441 1121 -865 -1526 -219 1386 1382 -711 -1384 -461 963 1009 -360 -1452 -861 1207 1639 -163 -2019
1951 -2019 -1309 1210 1956 519 -1371 -1233 574 1629 312 -1418 -903 739 1788 584 -1551 -1613
$$ packed form
1835A248M33j857j076M16J542M95p77j676j90J910J407j127k036m79J819J619
1851A671p09j815q86J572J776l1k537j215J850K319m14k481j269J648K030R0k042
1868d43j621J017K802J97k400k081J601K432M73k095j792O60K148J215j789k009
1884a685L74K295J369k125j863R2K167J486j292k270l50K089J546j055k107m03
1900a732K061J478q44k031n98J412J729j30j621j277J048J682P1j462j106J019
1916c01J533J12j345j330L56J477J022j002j771K73J118R70n32j639j20J251J369
1933A441l20j986o61J307J605mk093o73R23J424M6j369j092N91K068M32j802j856
1951b019P10K519P46j437j890J38J807J055j317j730N15J642J049j204k135o2
$$ plain form
1967 -1613 679 1797 463 -1339 -1435 450 1652 353 -1287 -1068 178 1701 821 -986 -1731 -117
1983 -117 1426 987 -561 -892 -41 990 667 -828 -1290 -176 1373 1071 -622 -1412 -320 1000 815
2000 815 -224 -849 -284 590 717 -15 -1112 -556 721 709 29 -420 -464 158 583 440 -404 -756 141 845
2020 845 271 -555 -593 226 717 373 -514 -995 -440 671 822 -519 -930 -13 562 602 -340 -863 -422 602
2040 602 919 36 -932 -649 567 847 -172 -1274 -241 966 602 -248 -1102 -823 664 1248 -47 -1427
2058 -1427 -769 841 1065 -350 -1175 -402 640 879 71 -999 -1022 534 1048 192 -1079 -661 723 939
2076 939 -187 -1065 -975 194 1262 449 -992 -1258 426 977 359 -763 -531 371 983 271 -860 -615
2094 -615 337 1058 497 -886 -925 102 975 440 -663 -747 247 753 374 -389 -1113 -215 1015 667 -319
$$ packed form
1967a613K292J118j334j802r6J885J202j299j640K19J246J523q80j807p45J614
1983a17J543m39j548l31Q51J031l23j495m62J114J549l02j693p90J092J320j85
2000H15j039o25N65Q74J27p32j097N56J277j2o80m49m4O22M25j43q44l52Q97P04
2020H45n74q26l8Q19M91l44q87m81N55J111J51j341m11R17N75M0r42n23M41J024
2040F02L17q83r68K83J216K80j019j102J033J207l64q50q54K79J487N84j295j380
2058a427O58J610K24j415q25P73J042K39q08j070k3J556N14q56j271M18J384K16
2076I39j126q78R0J169J068q13j441k66J684N51o18j122K32R02O12p12j131K45
2094f15R52P21n61j383l9J027Q73n35j103q4R94N06l79p63p24Q98J230l48r86
$$ plain form
2113 -319 -943 -325 526 664 69 -837 -624 234 885 -44 -1125 -603 457 1015 165 -876 -895 149 972
2132 972 437 -517 -1014 46 1463 579 -582 -1108 25 991 863 -202 -1081 -311 853 925 -503 -1031
2150 -1031 -376 1196 1013 -305 -1297 -797 771 1318 -5 -1295 -743 935 1010 -74 -1145 -427 612
2167 612 988 112 -1256 -1138 406 1437 278 -708 -960 415 1293 590 -1045 -962 238 1370 724 -702
2185 -702 -1148 -127 875 844 -118 -885 -158 661 739 -439 -797 -289 823 748 -331 -1154 -660 482 794
2204 794 270 -553 -476 394 511 149 -869 -695 154 821 467 -381 -806 -201 898 515 -150 -803 -110 710
2224 710 583 -421 -915 -484 850 1000 15 -867 -601 613 816 178 -770 -692 363 1055 122 -1188 -936
2243 -936 374 1346 579 -777 -715 342 735 321 -858 -968 217 995 339 -953 -1015 318 1177 513
$$ packed form
2113c19o24O18Q51J38n95r06K13Q58O51r29j081N22J060N58q50j041j9J044Q23
2132I72n35r54m97J060J417q84j161n26J133R66j28j065q79P70J164P2j428n28
2150a031O55J572j83j318r92N00J568N47j323j290N52J678P5j084j071P18J039
2167F12L76q76j368J18J544J031j159r86k52J375Q78p03j635Q3J200J132o46j426
2185g02m46J021J002l1r62p67P27Q19P8j178l58N08J112p5j079q23M94J142L12
2204G94n24q23P7Q70J17l62j018J74Q49O67l54q48m25O05J099l83o65o53O93Q20
2224G10j27j004m94M31J334J50r85q82K66J214K03o38r48P8J055O92r33j310K52
2243i36J310R72p67j356O2J057L93m14j179j10J185P78o56j292o2J333Q59o64
$$ plain form
2261 513 -659 -678 -97 533 687 -234 -943 53 889 347 -634 -760 13 844 406 -78 -794 -214 401 347
2281 347 -242 -959 -181 788 580 -335 -642 -249 432 540 198 -159 -365 95 557 65 -375 -238 420 164
2301 164 88 -251 -310 -387 519 671 -408 -416 84 486 168 -314 -651 -94 435 506 -55 -882 -359 420 381 -55
2323 -55 -569 -143 183 299 -9 -434 -338 115 815 167 -672 -537 305 588 -19 -600 -242 260 481 157 -640
2344 -640 -592 208 643 453 -553 -792 329 466 -78 -348 -314 75 506 82 -609 -675 287 752 258 -408
2364 -408 -501 215 634 179 -189 -338 170 687 605 -495 -537 3 345 202 -228 -313 127 160 117 -187 -519 84
2386 84 500 343 -446 -658 -154 310 299 173 -317 -291 74 117 -29 -487 -115 369 640 93 -493 -434 236 102
2408 102 272 -208 -357 20 645 393 -398 -427 104 789 384 -176 -594 -345 612 607 4 -395 -240 287 331
$$ packed form
2261E13j172j9N81O30J54r21p09R96Q36n42r81j26P73Q31m38m84p16N80O15n4
2281C47n89p17P78R69k08r15l07L93O81J08l42l57k06M60M62m92m40J37O58k56
2301A64p6l39n9p7R06J52j079qN00M02l18m82l37N57N29P1n61q27N23P79l9m36
2323e5n14M26L26J16l08m25R6M53P00o48q39J35Q42K83o07n81L58N02K21l24p97
2344f40M8Q00M35j90j006k39J121J37n44k70L4L89M31m24o91o6R62M65m94o66
2364d08r3P16M19m55l68j49N08N17q2j100m2N40L42j43m30q5M40L3m3l04l32O03
2386H4M16j57p89k12N04M64j1j26m90K6L65M3j46m58L72M84K71n47n86N9O70j34
2408A02J70m80j49L77O25k52p91k9N31O85m05n60m18K49R57no03l99J55N27M4
$$ plain form
2429 331 -178 -479 -265 565 572 120 -860 -566 328 596 -6 -744 -311 519 589 48 -772 -334 473 848 116
2450 116 -474 -630 62 735 126 -655 -336 408 553 114 -465 -454 127 568 370 -235 -532 -93 464 390 -317
2471 -317 -450 -88 605 358 -370 -319 -155 403 609 9 -555 -273 362 338 29 -344 37 141 365 -237 -469
2492 -469 -393 -7 413 460 -226 -395 -135 388 219 -18 -410 -194 407 499 -201 -676 -254 384 450 -20 -479
2513 -479 -213 502 296 19 -665 -281 268 587 83 -657 -392 96 578 375 -346 -641 -117 568 404 -493
2533 -493 -613 396 816 70 -715 -556 54 404 328 -379 -633 -236 724 282 -332 -572 101 541 555 -165
2553 -165 -652 -272 365 479 41 -589 -46 467 395 -328 -337 -27 604 435 -227 -391 -577 248 508 58 -287
2574 -287 -156 303 193 -52 -295 -333 -3 361 221 -75 -302 15 459 39 -71 -53 64 194 343 -67 -446
$$ packed form
2429C31n09l01K14Q30Pm52r80K94Q94K68o02p38M33Q30P0n41q20M38Q07L75p32
2450A16n90j56O92O73o09p81L19P44J45m39n79J1N81M41j98o05k97M39N57p4p07
2471c17j33L62O93k47p28N1J64N58K06o00n64K82O35k4l09l73L81J04K24o02k32
2492d69P6L86M20M7o86j69K60N23j69k37l92K16O01R2p00m75M22O38O6m70m59
2513d79K66P15k06k77o84L84N49L19n04p40K65M88M82k03p21k95N24O85j64q97
2533d93j20J009M20p46p85J59O10L50p6p07k54L97R60m42o14k40O73M40J4p20
2553a65m87L80O37J14m38o30N43N13p2p23rL10O31j69o62j64j86Q25K60m50l45
2574b87J31M59j10k45k43l8L30L64j40k96k27L17M44m20j10J8J17J30J49m10l79
$$ plain form
2595 -446 -168 503 491 -123 -693 -239 392 345 -36 -582 -331 11 540 171 -520 -223 258 597 187 -241 -225
$$ packed form
2595d46K78O71j2o14n70M54O31m7l81n46K51L42N29l69o91K97M81L39m10m28J6
$$ [...]
8191G
##END NTUPLES=NMR FID
##END=
