##TITLE=1H_B4e-K1
 CDCl3
 8 sc, 
 13.8.2024
##JCAMPDX= 6.0         $$ Bruker NMR JCAMP-DX V2.0
##DATA TYPE= NMR FID
##DATA CLASS= NTUPLES
##ORIGIN= UXNMR, Bruker Analytische Messtechnik GmbH
##OWNER= root
$$ XWIN-NMR		Version 3.5
$$ Tue Aug 13 13:47:35 2024 Russian Standard Time (UT+4h)  she@DPX200
##.OBSERVE FREQUENCY= 200.1313
##.OBSERVE NUCLEUS= ^1H
##.DELAY= (6, 6)
##.ACQUISITION MODE= SIMULTANEOUS
##.ACQUISITION SCHEME= undefined
##.AVERAGES= 16
##.DIGITISER RES= 18
##SPECTROMETER/DATA SYSTEM= spect
##.PULSE SEQUENCE= zg30
##.SOLVENT NAME= DMSO
##.SHIFT REFERENCE= (INTERNAL, DMSO, 0, 15.7039)
##AUDIT TRAIL= $$ (NUMBER, WHEN, WHO, WHERE, WHAT)
$$ ##TITLE= Audit trail, XWIN-NMR		Version 3.5
$$ ##JCAMPDX= 5.01
$$ ##ORIGIN= Bruker BioSpin GmbH
$$ ##OWNER= she
$$ F:/spectra/data/she/nmr/H-F/1/audita.txt
$$ ##AUDIT TRAIL=  $$ (NUMBER, WHEN, WHO, WHERE, WHAT)
(   1,<2024-08-13 13:46:01.82 +0400>,<she>,<DPX200>,
      <created by zg, POWCHK disabled, PULCHK disabled
       configuration hash MD5:
       00 E9 B6 7A A2 85 ED C7 34 08 36 98 17 FE 4E 26
       data hash MD5: 16K
       AE 19 12 40 69 DB 1B A7 78 EA AA 3A 47 3E DA BB>)
$$ ##END=
$$ 
$$ hash MD5
$$ A5 1D 3C 16 22 15 EC 3F 78 E0 29 C8 2A 90 00 74
##$RELAX= 
##$RELAX= 
##$RELAX= 
##$RELAX= 
##$RELAX= 
##$RELAX= 
$$ Bruker specific parameters
$$ --------------------------
##$DU= <F:/spectra>
##$EXPNO= 1
##$NAME= <H-F>
##$PROCNO= 1
##$TYPE= <nmr>
##$USER= <she>
##$AMP= (0..31)
100 100 100 100 100 100 100 100 100 100 100 100 100 100 100 100 100 100 
100 100 100 100 100 100 100 100 100 100 100 100 100 100 
##$AQSEQ= 0
##$AQ_mod= 1
##$AUNM= <au_zg>
##$AUTOPOS= <>
##$BF1= 200.13
##$BF2= 200.13
##$BF3= 200.13
##$BF4= 200.13
##$BF5= 200.13
##$BF6= 200.13
##$BF7= 200.13
##$BF8= 200.13
##$BYTORDA= 1
##$CFDGTYP= 0
##$CFRGTYP= 5
##$CHEMSTR= <none>
##$CNST= (0..31)
1 1 145 1 1 1 1 1 1 1 1 1 1 1 1 1 1 1 1 1 1 1 1 1 1 1 1 1 1 1 1 1 
##$CPDPRG= <>
##$CPDPRG1= <>
##$CPDPRG2= <>
##$CPDPRG3= <>
##$CPDPRG4= <mlev>
##$CPDPRG5= <mlev>
##$CPDPRG6= <mlev>
##$CPDPRG7= <mlev>
##$CPDPRG8= <mlev>
##$CPDPRGB= <>
##$CPDPRGT= <>
##$D= (0..31)
0 1.2 0 0 0 0 0 0 0 0.06 0 0.03 0 0 0 0 0.0002 0 0 0 0 0 0 0 0 0 0 0 0 
0 0 0 
##$DATE= 1723542361
##$DBL= (0..7)
120 120 120 120 120 120 120 120 
##$DBP= (0..7)
150 150 150 150 150 150 150 150 
##$DBP07= 0
##$DBPNAM0= <>
##$DBPNAM1= <>
##$DBPNAM2= <>
##$DBPNAM3= <>
##$DBPNAM4= <>
##$DBPNAM5= <>
##$DBPNAM6= <>
##$DBPNAM7= <>
##$DBPOAL= (0..7)
0.5 0.5 0.5 0.5 0.5 0.5 0.5 0.5 
##$DBPOFFS= (0..7)
0 0 0 0 0 0 0 0 
##$DE= 6
##$DECBNUC= <off>
##$DECIM= 24
##$DECNUC= <off>
##$DECSTAT= 4
##$DIGMOD= 1
##$DIGTYP= 9
##$DL= (0..7)
0 120 120 120 120 120 120 120 
##$DP= (0..7)
150 150 150 150 150 150 150 150 
##$DP07= 0
##$DPNAME0= <>
##$DPNAME1= <>
##$DPNAME2= <>
##$DPNAME3= <>
##$DPNAME4= <>
##$DPNAME5= <>
##$DPNAME6= <>
##$DPNAME7= <>
##$DPOAL= (0..7)
0.5 0.5 0.5 0.5 0.5 0.5 0.5 0.5 
##$DPOFFS= (0..7)
0 0 0 0 0 0 0 0 
##$DQDMODE= 0
##$DR= 18
##$DS= 0
##$DSLIST= <SSSSSSSSSSSSSSS>
$$ [...]
##$SUBNAM2= <"">
##$SUBNAM3= <"">
##$SUBNAM4= <"">
##$SUBNAM5= <"">
##$SUBNAM6= <"">
##$SUBNAM7= <"">
##$SUBNAM8= <"">
##$SUBNAM9= <"">
##$SW= 24.0689771365484
##$SWIBOX= (0..15)
0 0 2 0 0 0 0 0 0 0 0 0 0 0 0 0 
##$SW_h= 4816.95568400771
##$TD= 16384
##$TD0= 1
##$TE= 0
##$TE2= 300
##$TE3= 300
##$TEG= 300
##$TL= (0..7)
0 120 120 120 120 120 120 120 
##$TP= (0..7)
150 150 150 150 150 150 150 150 
##$TP07= 0
##$TPNAME0= <>
##$TPNAME1= <>
##$TPNAME2= <>
##$TPNAME3= <>
##$TPNAME4= <>
##$TPNAME5= <>
##$TPNAME6= <>
##$TPNAME7= <>
##$TPOAL= (0..7)
0.5 0.5 0.5 0.5 0.5 0.5 0.5 0.5 
##$TPOFFS= (0..7)
0 0 0 0 0 0 0 0 
##$TUNHIN= 0
##$TUNHOUT= 0
##$TUNXOUT= 0
##$USERA1= <user>
##$USERA2= <user>
##$USERA3= <user>
##$USERA4= <user>
##$USERA5= <user>
##$V9= 5
##$VALIST= <valist>
##$VCLIST= <CCCCCCCCCCCCCCC>
##$VD= 0
##$VDLIST= <DDDDDDDDDDDDDDD>
##$VPLIST= <PPPPPPPPPPPPPPP>
##$VTLIST= <TTTTTTTTTTTTTTT>
##$WBST= 1024
##$WBSW= 4
##$XGAIN= (0..3)
0 0 0 0 
##$XL= 0
##$YL= 0
##$YMAX_a= 569476
##$YMIN_a= -509961
##$ZGOPTNS= <>
##$ZL1= 120
##$ZL2= 120
##$ZL3= 120
##$ZL4= 120
##$ABSF1= 10
##$ABSF2= 0
##$ABSG= 5
##$ABSL= 3
##$ALPHA= 0
##$AQORDER= 0
##$ASSFAC= 0
##$ASSFACI= 0
##$ASSFACX= 0
##$ASSWID= 0
##$AUNMP= <proc_1d>
##$AZFE= 0.1
##$AZFW= 0.1
##$BCFW= 1
##$BC_mod= 2
##$BYTORDP= 1
##$COROFFS= 0
##$CY= 11.3945322036743
##$DATMOD= 1
##$DC= 2
##$DFILT= <>
##$DTYPP= 0
##$F1P= 15.6554695791079
##$F2P= 12.8336369535428
##$FCOR= 0.5
##$FTSIZE= 0
##$FT_mod= 4
##$GAMMA= 1
##$GB= 0.15
##$INTBC= 1
##$INTSCL= 1
##$ISEN= 128
##$LB= 0.24
##$LEV0= 0
##$LPBIN= 0
##$MAXI= 10000
##$MC2= 0
##$MEAN= 0
##$ME_mod= 0
##$MI= 1.114404
##$NCOEF= 0
##$NC_proc= 0
##$NLEV= 6
##$NOISF1= 3.799351
##$NOISF2= 2.8
##$NSP= 1
##$NTH_PI= 0
##$NZP= 0
##$OFFSET= 15.70392
##$PC= 1
##$PHC0= -25997.11
##$PHC1= 13.38749
##$PH_mod= 1
##$PKNL= yes
##$PPARMOD= 0
##$PSCAL= 0
##$PSIGN= 0
##$REVERSE= no
##$SF= 200.130013532006
##$SI= 16384
##$SIGF1= 3
##$SIGF2= 2
##$SINO= 400
##$SIOLD= 16384
##$SREGLST= <1H.CDCl3>
##$SSB= 0
##$STSI= 0
##$STSR= 0
##$SW_p= 3612.71676300578
##$SYMM= 0
##$S_DEV= 0
##$TDeff= 0
##$TDoff= 0
##$TI= <>
##$TILT= no
##$TM1= 0
##$TM2= 0
##$TOPLEV= 0
##$USERP1= <user>
##$USERP2= <user>
##$USERP3= <user>
##$USERP4= <user>
##$USERP5= <user>
##$WDW= 1
##$XDIM= 8192
##$YMAX_p= 0
##$YMIN_p= 0
$$ End of Bruker specific parameters
$$ ---------------------------------
##NTUPLES= NMR FID
##VAR_NAME=  TIME,          FID/REAL,        FID/IMAG
##SYMBOL=    X,             R,               I
##VAR_TYPE=  INDEPENDENT,   DEPENDENT,       DEPENDENT
##VAR_FORM=  AFFN,          ASDF,            ASDF
##VAR_DIM=   8192,          8192,            8192
##UNITS=     SECONDS,       ARBITRARY UNITS, ARBITRARY UNITS
##FACTOR=    0.0002076,     1,               1
##FIRST=     0,             0,               0
##LAST=      1.7004516,     0,               0
##MIN=       0,             -509961,         0
##MAX=       1.7004516,     569476,          0
$$ Real data points
##PAGE= N=1
##DATA TABLE= (X++(R..R)), XYDATA
$$ [...]
$$ plain form
2644 -1346 -2895 3048 -518 -3014 3391 333 -2413 3305 207 -2944 2970 309 -3207 2315 217
2659 217 -3035 2220 1099 -3732 1814 996 -3394 1883 1730 -3007 1983 1929 -2704 2138 2129 -3534 1515
2676 1515 2115 -4006 528 2244 -4027 697 2648 -3824 754 3054 -3136 1293 3255 -3452 1222
2691 1222 3509 -3584 546 2958 -4049 36 3058 -3794 8 2899 -3741 112 3659 -3424 168
2706 168 3718 -2969 19 3650 -3182 -338 3158 -3536 -1304 3051 -3028 -768 3078 -2647 -763
2721 -763 3276 -1866 -509 3449 -1756 -1287 3383 -1776 -2081 2933 -2010 -2117 3147 -1133 -2232 3223
2737 3223 -1098 -2344 3210 -584 -2888 3413 -305 -2999 3447 -378 -2811 3884 -410 -3473 3148
2752 3148 -624 -3556 2701 -495 -3597 3241 -2 -2986 3675 499 -3110 3369 536 -3336 2678
$$ packed form
2644a346j549N943l566k496O405l058k746N718l098l151N914k661l516N522k098
2659B17l252N255j121m831N546q18m390N277j53m737M990n4m633M842rn663N049
2676A515O00o121M534J716o271M724J951o472M578K300o190M429J962o707M674
2691A222K287p093M130K412p007M085L022o852L802K891o640L853L547p083L592
2706A68L550o687K988L631o832K844L496o694K232M355o079K260L846n725J884
2721g63M039n142J357L958n205M69M670n159l05N014m943j07N264m280j099N455
2737C223m321j246N554l794k304O301l718k694O446l825k433O695m294l063O621
2752C148l772k932O257l196l102O838l243k984O661l176l609O479k833l872O014
$$ plain form
2767 2678 -162 -3583 2232 125 -3315 2169 638 -2836 2296 991 -2454 2137 1458 -2923 1380
2782 1380 1376 -2853 1558 1483 -2994 708 2000 -2501 516 2228 -2449 81 2312 -2310 155 2856
2798 2856 -2432 94 3180 -2522 -612 3129 -2693 -919 3147 -2969 -1135 3434 -2488 -932 3603
2813 3603 -2582 -948 3855 -2325 -1108 3536 -2419 -1199 3798 -2215 -1523 3381 -2266 -1341 3451
2828 3451 -2312 -1665 3342 -2207 -1526 3223 -1478 -1591 3414 -1066 -2107 3314 -876 -2083 2777 -1031
2844 -1031 -2393 3005 -671 -1940 3105 -371 -2126 3043 -19 -2702 2623 -135 -2676 2581 292
2859 292 -3055 2759 476 -3022 2751 746 -3026 2368 468 -3284 2197 849 -3445 2238 1547
2874 1547 -3229 2098 1501 -3253 1961 1239 -3419 1969 1288 -3031 1761 1321 -3211 1493 1505 -3099
$$ packed form
2767B678k840l421N815k107l440N484j531l474N132j305l445M591o79m381M303
2782A380mm229M411p5m477L702J292m501L017J712m677K530K231m622K465K701
2798B856n288K526L086n702J910L741n822J774M066o116J834M569n922J556M535
2813C603o185J634M803o180J217M644n955J220M997o013O92M904n647R25M792
2828C451n763O47N007n549O81M749m701j13N005m480j041N421m190j207M860l808
2844a031j362N398l676j269N045l476j755N169l062k683N325k758k541N257k289
2859B92l347N814k283l498N773k005l772N394j900l752N481j348m294N683o91
2874A547m776N327n97m754N214p22m658N388o81m319M792m40m532M704J2m604
$$ plain form
2890 -3099 1336 1496 -2998 964 1651 -2353 826 1916 -2594 791 1576 -2688 435 1895 -2404 -48
2906 -48 2082 -2300 -406 2234 -1842 -237 2273 -1921 -568 2357 -1804 -866 2482 -1960 -709 2522
2922 2522 -1820 -977 2823 -1465 -1288 2539 -1520 -1711 2488 -1298 -1684 3000 -1104 -1434 2977 -658
2938 -658 -1327 2814 -780 -1689 2308 -904 -2233 2276 -409 -2076 2263 -336 -2139 2293 -1 -2360
2954 -2360 2498 48 -2570 2303 -6 -2566 1912 378 -2411 1857 474 -2572 1666 470 -2514
2969 -2514 1792 960 -2303 1900 1660 -2556 1750 1201 -3005 1256 1487 -3034 1289 1148 -2774 1243
2985 1243 1621 -2655 1327 1868 -2469 1169 1710 -3000 712 1870 -2910 719 2167 -2458 842 1914
3001 1914 -2577 558 1484 -2472 418 1975 -2458 683 2517 -1914 565 2561 -1847 -377 1969
$$ packed form
2890c099M435J60m494L962O87m004L179J090m510L385P85m264L123J460m299K356
2906d8K130m382J894K640m076J605K510m194J353K925m161R38L348m442J251L231
2922B522m342Q43L800m288J77L827m059j91M199l786l86M684m104l30M411l635
2938f58o69M141l594r09L997l212j329M509k685j667M339k599j803M432k294k359
2954b360M858k450k618M873k309k560M478j534k789M268j383l046M238j196k984
2969b514M306q32l263M203k40m216M306n49m206M261K31m521M323j41l922M017
2985A243L78m276L982N41m337L638N41m710L712J158m780L629J448m625L300J072
3001A914m491L135R26l956K890J557m433L141J834m431K479J996m408J470K346
$$ plain form
3016 1969 -2391 -488 1742 -2135 -676 1926 -1620 -30 2569 -1163 -119 2498 -1235 -871 2222
3031 2222 -1601 -1681 1820 -1272 -1366 2248 -1036 -1188 2455 -811 -1427 2423 -723 -1840 2450 -531
3047 -531 -1930 2356 -161 -2076 2486 -358 -2270 2263 -577 -2011 1627 -383 -2187 2400 151
3062 151 -1854 2509 480 -2066 2287 818 -2194 1686 231 -2775 1632 427 -2539 1791 438
3077 438 -2204 1646 1307 -1974 1890 1279 -2318 1119 1520 -2351 727 1111 -2345 632 1129 -2490
3093 -2490 499 1633 -2377 541 2064 -1905 577 2258 -2388 -34 2101 -2405 -275 2242 -2409
3108 -2409 -328 2284 -2251 47 2344 -2421 12 2481 -2260 -64 2642 -1988 -368 2764 -1922
3123 -1922 -260 2521 -1964 -712 2610 -1987 -909 2718 -1872 -666 2797 -1522 -752 2717 -1388
$$ packed form
3016A969m360J903K230l877J459K602l546J590K599l732J044K617l733L64L093
3031B222l823q0L501l092r4L614l284j52L643l266o16L850l146j117M290k981
3047e31j399M286k517j915M562k844j912M533k840j434L638k010j804M587k249
3062A51k005M363k029k546M353j469l012L880j455l006M407j205k966M330j353
3077D38k642L850l39l281L864o11l597L437M01l871L078L84l456K977M97l619
3093b490K989J134m010K918J523l969K482J681m646K354K135m506K130K517m651
3108b409K081K612m535K298K297m765K433K469m741K196K706m630J620L132m686
3123a922J662K781m485J252L322m597J078L627m590J206L463m319P70L469m105
$$ plain form
3138 -1388 -710 2195 -1217 -1203 1852 -1231 -1360 2079 -1272 -1455 2245 -534 -1291 2175 -634 -1275 2187
3155 2187 -436 -1773 1837 -271 -2027 2139 126 -1962 1602 260 -2062 2177 466 -2348 2058
3170 2058 540 -2242 1878 589 -2042 1828 628 -2556 1527 726 -2779 1325 755 -2589 1543
3185 1543 1193 -2311 1532 1396 -2322 1633 1165 -2394 913 868 -2552 889 1442 -1905 900 1486 -2054
3202 -2054 794 1522 -2227 395 1461 -2204 422 1496 -1724 47 1839 -1612 -70 1848 -1434
3217 -1434 -433 1596 -1882 -791 1745 -1632 -736 2165 -1338 -592 2467 -1188 -595 2172 -1419 -1070
3233 -1070 2126 -1748 -1068 2013 -1178 -1083 2331 -1000 -1196 2290 -1182 -1385 2074 -985 -1280 2185
3249 2185 -1093 -1266 2035 -846 -1379 2233 -275 -1440 2086 -583 -1404 1914 -225 -1719 1528 -305
$$ packed form
3138a388O78K905l412J4L055l083j29L439l351j83L700k779p57L466k809o41L462
3155B187k623j337L610k108j756M166k013k088L564j342k322M239j711k814M406
3170B058j518k782M120j289k631L870j200l184M083q01l505M104n70l344M132
3185A543l50l504L843j36l718L955m68l559L307m5l420L441N53l347K805N86l540
3202b054K848P28l749K622J066l665K626J074l220J771J792l451J542J918l282
3217a434J001K029l478J091K536l377Q96K901l503P46L059l655N93K767l591L49
3233a070L196l874O80L081l191R5L414l331j96L486l472k03L459l059k95L465
3249B185l278j73L301k881n33L612k508j165L526k669q21L318k139j494L247j833
$$ plain form
3265 -305 -1574 1499 -101 -1639 1765 394 -1521 1532 687 -1582 1388 719 -2153 1370 728 -1829
3281 -1829 1000 963 -1842 1411 1273 -1760 1165 1122 -2147 1024 1003 -2564 685 1193 -2353 796 1466
3298 1466 -1840 780 1774 -1817 750 1559 -2103 391 1171 -2321 402 1227 -1845 724 1644 -1473
3314 -1473 502 1534 -1777 -96 1322 -1859 -111 1404 -1530 -108 1616 -1090 154 1750 -1201
3329 -1201 -280 1506 -1479 -708 1426 -1073 -886 1510 -878 -535 1789 -876 -431 1746 -847 -1114
3345 -1114 1540 -813 -1113 1398 -1002 -1161 1667 -106 -1190 1727 -394 -1211 1639 -321 -1221 1649
3361 1649 -385 -1381 1786 -309 -1414 1441 -104 -1175 1569 289 -1289 1604 -226 -1646 1123
3376 1123 196 -1501 1176 135 -1666 1320 650 -1440 1205 356 -1693 1124 668 -1467 659 701
$$ packed form
3265c05j269L073j600j538L404j371j915L053q45k269K970o69k872L523o42k557
3281a829K829l7k805L253j38l033K925m3l269L171k1l567L249N08l546L149O70
3298A466l306K620R94l591K567Q09l662K494P80l492K723Q25l072K569R20l117
3314a473J975J032l311J681J418l181J748J515k934J422J724k706J244J596k951
3329a201R21J786k985P71K134k499J87K396k388L43K324k665M45K177k593k67
3345a114K654k353l00K511k400j59K828j773j084K917k121q17K850j960r00K870
3361A649k034r96L167k095j105K855j545j071K744j280j578K893j830j420K769
3376A123r27j697K677j041j801K986o70k090K645q49k049K817m56k135K126M2
$$ plain form
3392 701 -1568 562 745 -1555 764 886 -1254 727 1209 -1290 453 1257 -1288 146 1205 -1467
3408 -1467 -32 1334 -1127 109 1740 -1247 115 1720 -1306 -452 1457 -1833 -559 1763 -1655
3423 -1655 -450 1922 -1031 -250 1852 -1432 -216 1475 -1400 -728 1895 -1385 -533 1892 -1272 -475
3439 -475 2228 -1003 -567 1840 -1241 -843 1505 -1044 -791 1671 -883 -937 1983 -446 -812 1671 -670
3456 -670 -1062 1664 -617 -1173 1398 -393 -1135 1515 -123 -1211 1364 35 -1286 1541 68 -1570
3472 -1570 1351 339 -1407 1469 443 -1457 1353 265 -1760 1333 472 -1520 1044 271 -1583
3487 -1583 1283 572 -1753 880 435 -2018 957 873 -1893 853 694 -1777 1156 867 -1265 623
3503 623 798 -1612 447 998 -1703 261 877 -1462 262 1306 -1198 429 1226 -1308 59 1149
$$ packed form
3392G01k269K130J83k300K319J22k140J981M82k499J743Q04k545J434J059k672
3408a467J435J366k461J236J631k987J362J605l026Q54J909l290J274K322l418
3423a655J205K372k953P81K102l284J216J691k875O72K623l280Q52K425l164P97
3439d75K703l231M36K407l081L98K348k549K53K462k554n4K920k429l66K483k341
3456f70l92K726k281n56K571j791p42K650j638j088K575j329j321K827j473j638
3472a570K921j012j746K876j026j900K810j088k025L093q61j992K564p73j854
3487a583K866p11k325K633m45k453K975q4k766K746j59k471K933k89k132J888
3503F23J75k410K059N51k701J964O16k339J724J044k504J627P97k534J367J090
$$ plain form
3519 1149 -1174 -25 1353 -998 -60 1174 -638 -274 1304 -1391 -715 1479 -1290 -362 1503 -1178
3535 -1178 -365 1936 -1182 -393 1549 -634 -798 1649 -941 -1283 1537 -995 -1066 1729 -608 -969 1875
3552 1875 -497 -1035 1674 -496 -1172 1547 -383 -1180 1406 -188 -1060 1406 -238 -1261 1291 -97
3568 -97 -1358 1355 -79 -1342 1437 105 -1382 1268 334 -1336 1063 423 -1876 816 276 -1395
3584 -1395 840 782 -1682 1134 865 -1405 1398 925 -1630 735 645 -1827 762 533 -1591 583 821
3601 821 -1448 698 1090 -1419 723 1009 -1560 364 871 -1790 606 1076 -1678 550 1207 -1115
3617 -1115 328 948 -1530 66 1034 -1144 -173 1206 -1217 90 1458 -1050 225 1161 -877 -432
3633 -432 1134 -954 -440 1232 -926 -635 946 -765 -585 1646 -460 -656 1251 -506 -815 1341
$$ packed form
3519A149k323J149J378k351R38J234j812L64J578k695O76K194k769R28J865k681
3535a178Q13K301l118P89J942k183j64K447k590l42K820k532p1K795k337l61K844
3552A875k372n38K709k170o76K719j930p97K586j594q72K466j644j023K552j388
3568i7j261K713j434j263K779j332j487K650r34j670K399o40k299K692n40j671
3584a395K235n8k464K816k69k270K803m73k555K365r0k472K589k29k124K174K38
3601H21k269K146L92k509K142K86k569J924N07k661K396M70k754K228O57k322
3617a115J443O20k478J596R68k178R71J379k423J307J368k508J275R36k038M45
3633d32J566k088N14J672k158K91J581j711J80K231k106j96J907j757l09K156
$$ plain form
3649 1341 -660 -1101 1162 -451 -1199 1222 -170 -1064 1326 -212 -1041 1259 -141 -1037 1157 -332
3665 -332 -1411 1316 -281 -1443 1077 72 -1426 1272 -13 -1141 1054 332 -987 1080 -107
3680 -107 -1381 1051 141 -1291 947 439 -1271 969 756 -1083 620 119 -1031 549 368 -1367
3696 -1367 640 519 -1175 784 857 -1240 1000 1262 -1021 352 390 -1469 259 621 -1302 310 1076
3713 1076 -1197 507 1320 -880 313 911 -1312 -263 911 -1615 -245 1243 -1210 87 1515
3728 1515 -993 392 1323 -1329 -357 1061 -1363 -221 1194 -1173 -317 1250 -769 -158 1564 -612
3744 -612 -44 1312 -953 -379 1361 -911 -574 1115 -755 -406 1425 -591 -300 1179 -461 -641 1184
3761 1184 -231 -895 989 -568 -571 884 -499 -644 1143 172 -985 1212 183 -996 827 34 -1277
$$ packed form
3649A341k001m41K263j613p48K421j392q94K390j538q29K300j400q96K194j489
3665c32j079K727j597j162K520j005j498K698j285j128K195p22j319K067j187
3680a07j274K432r10j432K238n08j710K240k13j839J703n01j150J580j81j735
3696a367K007j21j694J959P3k097K240K62k283J373L8j859J728L62j923J612P66
3713A076k273J704Q13k200J193N98k223J049J174k526J370J488k453J297J428
3728A515k508J385R31k652R72J418k424J142J415k367Q56J567k019O11J722k176
3744f12N68J356k265N74J740k272L37J689j870L49J831k016K91J479j640j80J825
3761A184j415o64J884j557lJ455j383j45J787r71j157K197j029j179J823p93j311
$$ plain form
3778 -1277 966 88 -1172 726 317 -969 996 126 -1241 991 454 -1094 773 813 -1148 475
3794 475 552 -1328 611 429 -1237 777 635 -1327 1055 551 -1146 704 361 -1298 408 689 -769
3811 -769 336 966 -1161 546 1068 -1129 142 726 -689 144 645 -1046 -277 1064 -1005 146 1054
3828 1054 -879 -137 1224 -844 -169 949 -1001 -531 686 -555 -336 1567 -944 -380 1341 -955
3844 -955 -874 1142 -721 -561 1123 -802 -581 1452 -471 -751 1497 -338 -711 1508 -716 -774 1362
3861 1362 -430 -942 1414 -144 -780 1376 -440 -743 880 -491 -1049 941 -319 -729 1319 26
3877 26 -1200 1026 182 -973 861 -75 -1148 768 253 -925 1054 148 -1096 1052 268 -1304 664
3894 664 547 -1454 601 354 -1149 647 752 -1230 583 749 -1153 670 793 -1309 704 904 -1646
$$ packed form
3778a277K243q78j260J898m09j286J965q70j367K232n37j548J867M0j961J623
3794D75P7j880J939j82j666K014j42j962K382n04j697J850l43j659J706K81j458
3811g69J105O30k127J707N22k197J271N84j415Q33N01j691P69J341k069J151R08
3828A054j933P42J361k068O75J118j950M70J217j241K19J903k511N64J721k296
3844i55Q1K016j863J60J684j925K21K033j923k80K248j835l73K219k224n8K136
3861A362j792n12K356j558o36K156j816l03J623j371n58J990j260m10K048j293
3877B6j226K226q44j155J834r36j073J916n15j178J979r06j244K148p84j572J968
3894F64j17k001K055k47j503J796J05j982J813J66j902J823J23k102K013K00k550
$$ plain form
3911 -1646 551 763 -1326 576 1232 -1070 312 943 -969 226 823 -850 23 871 -1096 334
3927 334 897 -953 198 906 -936 -77 956 -1203 -42 737 -763 -181 985 -784 -218 915 -596
3944 -596 -185 1058 -721 -489 926 -623 -519 1057 -847 -458 1189 -471 -482 1126 -141 -527 1011
3961 1011 -391 -685 932 -268 -422 1047 -304 -824 1080 -295 -1163 916 -344 -711 1172 -61
3977 -61 -709 1226 -16 -1007 850 33 -1077 830 -79 -740 744 249 -839 1085 176 -845 928
3994 928 309 -1251 590 46 -1152 630 512 -977 480 598 -902 605 501 -1037 245 601 -1296
4011 -1296 160 606 -1052 468 729 -981 746 480 -1073 148 622 -1103 25 664 -1051 62
4027 62 1181 -618 182 981 -868 303 1057 -851 102 529 -1087 -90 759 -893 -349 1115 -595
$$ packed form
3911a646K197K12k089J902O56k302J382O31j912J195N97j673Q73Q48j967J430
3927C34N63j850J151P08j842Q59J033k159J161P79j500N82J166j769N66J133j511
3944e96M11J243j779K32J415j549J04J576j904L89J647j660j1J608j267l86J538
3961A011j402k94J617j200j54J469j351n20J904j375q68K079j260l67J883j233
3977f1o48J935j242r91J857q17j110J907r09o61J484m95j088J924r09j021J773
3994I28o19j560J841n44j198J782j18j489J457J18j500J507j04j538J282L56j897
4011a296J456M46j658J520K61j710J727k66j553J221M74j725J128O39j715J113
4027F2J119j799Q00P99j849J171P54j908R53M27j616R97Q49j652N44J464j710
$$ plain form
4044 -595 -138 1427 -775 -62 994 -745 -339 1063 -855 -553 924 -865 -148 831 -502 -269 988
4061 988 -370 -316 1053 -355 -383 942 -496 -348 993 -350 -540 997 -46 -370 397 -321 -757 733
4079 733 21 -764 811 20 -795 931 -172 -961 695 290 -635 685 237 -748 622 87 -1152 409
4097 409 130 -1058 678 215 -784 689 620 -924 945 212 -1361 234 216 -1008 132 338 -783
4114 -783 469 483 -544 665 667 -820 -115 565 -1039 -95 360 -730 -60 400 -624 67 887 -417
4132 -417 137 463 -615 -58 534 -594 -418 776 -490 -43 1091 -461 -240 856 -656 -548 701
4149 701 -544 -362 950 -587 -612 754 -216 -189 1100 -317 -306 891 -398 -883 769 -516 -749 750
4167 750 -486 -480 918 -227 -438 917 -95 -492 880 -345 -600 860 -391 -577 915 -66 -765
$$ packed form
4044e95M57J565k202P13J056j739M06J402j918L02J477j789P17R79j333K33J257
4061I88j358N4J369j408k8J325j438J48J341j343j90J537j043l24P67p18m36J490
4079G33p12p85J575p91q15J726j103p89J656m05r25J320m48r85J370n35j239J561
4097D09k79j188J736m63r99J473o9j544J869p33j573J595j8j224J140K06j121
4114g83J252J4j027J209Kj487P05O80j604R44M55j090O70M60j024O91Q20j304
4132d17N54L26j078N57N92j128J76J194j266M47J134j552K21J096j512J08J249
4149G01j245J82J312j537k5J366r70K7J289j417J1J197j289m85J652j285k33J499
4167G50j236OJ398j145k11J355j012l97J372j225k55J460j251j86J492r81o99
$$ plain form
4184 -765 795 98 -635 700 187 -741 830 433 -880 463 98 -778 633 488 -722 321 561
4201 561 -543 477 308 -926 589 245 -1048 254 476 -914 645 692 -1005 332 633 -951 83
4218 83 630 -616 -83 456 -845 341 688 -1017 313 635 -532 353 697 -727 -16 230 -817 -166
4236 -166 634 -595 276 406 -489 139 952 -446 -88 715 -600 -37 898 -514 -651 735 -499 -459
4254 -459 673 -203 -285 518 -333 -606 949 -463 -591 747 -128 -710 901 -229 -514 814 -203 -778
4272 -778 552 -124 -711 966 -35 -565 1122 140 -770 1051 -83 -881 706 -115 -689 767 -23
4289 -23 -710 680 215 -642 512 389 -867 595 229 -764 518 235 -1045 637 266 -748 498
4306 498 284 -667 383 255 -832 -94 617 -803 711 398 -581 397 629 -792 176 506 -961 293
$$ packed form
4184g65J560o97p33J335n13r28J571l97j313J343l65q76J411j45j210J043K40
4201E61j104J020j69j234J515l44j293J302K22j390J559M7j697J337L01j584J034
4218H3N47j246N33N39j301J186L47j705J330L22j167Q85L44j424P11K46j047O51
4236a66Q00j229Q71J30q95O28Q13j398L58Q03j315N63R35j412j37J386j234M0
4254d59J132q76q2Q03q51k73J555j412j28J338q75n82J611j130k85J328j017n75
4272g78J330o76n87J677j001n30J687r82r10J821j134p98J587q21n74J456p90
4289b3o87J390m65q57J154j23j256J462l66r93J282k83j280J682l71j014J246
4306D98k14r51J050j28j087P38P11j420J514l13r79R78K32j421R68L30j467J254
$$ plain form
4324 293 344 -995 81 678 -853 173 781 -574 274 657 -1052 271 816 -960 -151 834 -819
4341 -819 -289 603 -673 242 801 -626 -3 641 -601 -166 713 -625 -104 591 -587 -505 741 -359
4359 -359 -429 686 -404 -322 605 -394 -212 660 -293 -544 542 -184 -287 749 -114 -240 836 53 -806
4378 -806 621 -263 -835 751 -38 -549 739 -240 -546 672 143 -383 735 439 -549 247 -130 -819
4396 -819 318 -317 -927 450 120 -726 705 421 -732 638 358 -697 238 242 -893 138 358 -790
4414 -790 300 671 -575 322 524 -436 315 262 -572 326 93 -803 240 673 -539 299 654 -464 65
4433 65 461 -699 40 557 -742 13 351 -587 34 781 -590 251 575 -301 -292 507 -593 -313 295 -539
4453 -539 -24 673 -400 25 900 -485 -7 844 -176 -359 938 -475 -450 642 -372 -484 796 -105
$$ packed form
4324B93N1j339J076N97j531J026O08j355Q48L83j709J323N45j776Q09R85j653
4341h19N30Q92j276R15N59j427O23O44j242M35Q79j338N21O95j178Q2J246j100
4359c59p0J115j090Q2R27r99J82Q72r53k51J086p26j03J036q63j26J076p83q59
4378h06J427q84n72J586p89n11J288r79l06J218n29n26J118k96r88P96l77o89
4396h19J137o35o10J377l30q46J431k84j153J370k80j055R35Mj135J031K20j148
4414g90J090L71j246Q97K02r60P51n3q34Q98k33q96J043M33j212Q38L55j118N29
4433F5L96j160P39N17j299P55L38r38O21P47j371Q41L24q76RP99j100K80O08q34
4453e39N15O97j073M25Q75j385M78Q51j020j83J297j413K5J092j014j12J280r01
$$ plain form
4471 -105 -300 997 -429 -164 990 -153 -638 394 -294 -362 791 -373 -370 499 -75 -640 575 292
4489 292 -510 873 -10 -740 244 -219 -589 242 -128 -731 340 52 -620 436 390 -575 475 315 -422
4508 -422 209 238 -544 159 405 -734 351 285 -698 432 475 -742 136 499 -848 46 224 -839 141
4527 141 485 -459 280 620 -605 155 308 -946 193 475 -831 8 235 -671 -103 699 -376 388
4545 388 450 -547 161 562 -607 -174 620 -552 -177 628 -229 -197 609 -364 -204 699 -252 -254 431 -420 -445
4566 -445 652 -384 -508 606 -220 -418 608 -115 -293 648 -151 -654 707 -71 -459 498 -35 -723
4584 -723 518 -45 -499 715 182 -513 658 -166 -698 576 271 -542 665 -9 -571 581 198 -566
4602 -566 510 243 -549 591 28 -511 396 166 -858 407 551 -470 222 258 -338 338 482 -435 317
$$ packed form
4471a05j95J297j426K65J154j143m85J032o88o8J153j164LQ69n74n65J215k83
4489B92q02J383q83p30R84m63l70Q31l70o03J071k88o72J056m6r65J050j60p37
4508d22O31K9p82P03K46j139J085o6r83J130M3j217Q78L63j347Q94J78j063R80
4527A41L44r44P39L40j225P60J53j254J139K82j306Q39K27r06N68Q02j075P64
4545C88O2r97P08M01j169M33P94j172L75Q05q57L2Q06r73J60R03r51kO85q51k5
4566d45J097j036j24J114q26j98J026p23j78R41p99n03J361p78l88R57n33o88
4584g23J241n63m54J214n33o95J171q24n32J274l05q13J207o74n62J152l83p64
4602e66J076k67p92J140n63n39R07k30j024J265J44j021O92L6n96O76J44r17P52
$$ plain form
4621 317 260 -797 52 879 -752 -131 311 -675 157 784 -607 109 474 -440 91 391 -760 -57 673
4640 673 -351 -213 776 -400 304 858 -754 -371 423 -392 -226 792 -405 185 515 -365 -12 501
4658 501 -453 -426 509 -513 -519 613 -267 -186 696 -361 -259 728 -219 -292 610 50 -377 593 -383 -331 713
4679 713 -84 -262 563 69 -456 441 -370 -739 186 -43 -511 165 176 -477 377 266 -584 493 -112 -437
4699 -437 437 113 -628 385 183 -585 272 114 -634 633 381 -705 176 446 -729 287 304 -613 211
4718 211 277 -687 397 398 -446 511 164 -635 132 81 -516 29 93 -722 -36 542 -672 -15 293 -582 -86
4739 -86 336 -500 -288 693 -412 -52 808 -291 -219 575 -456 -185 528 -266 121 339 -269 -201 680 -356
4759 -356 -326 652 -503 -200 353 -300 -91 558 -266 -125 766 -374 -350 465 -199 -117 670 -124 -191 791 -445
$$ packed form
4621C17n7j057Q49Q27j631O21M42r86Q32O27j391P16L65r14N31L00j151P03P30
4640F73j024J38R89j176P04N54j612L83P94q15J66J018j197N90L30q80L53N13
4658E01r54K7R35j022oJ132q80Q1Q82j057J02R87r47p3R02n60m27R70r76N2J044
4679G13p97j78Q25m94n25Q97q11l69R25k29m68O76J1o53Q54j11q50J077o05l25
4699d37Q74l24p41J013k02p68Q57j58p48J267k52j086Q81K70j175J016J7r17Q24
4718B11O6r64J084Jq44R57l47p99P67n1n97N45O4q15O86N78j214O57L08q75M96
4739h6M22q36K12R81j105L60Q60j099P2P94j031K71P13p94L87K18o08O8Q81j036
4759c56L0R78j155L03N53o53K09O49q24J41Q91j140K4Q15o64Q2P87p94o7R82j236
$$ plain form
4780 -445 -462 670 -40 -264 445 -229 -381 235 -543 -473 580 -123 -282 423 453 -392 398 -40 -378 335
4800 335 -209 -267 138 158 -686 418 207 -568 392 5 -546 414 77 -360 327 233 -483 406 242 -593 201
4821 201 180 -616 290 172 -674 260 258 -658 531 311 -546 164 611 -839 232 127 -643 3 233 -602
4841 -602 88 310 -359 171 240 -215 166 379 -749 -62 443 -512 57 151 -790 -192 610 -431 174 575
4861 575 -156 182 670 -601 -230 509 -79 -288 446 -500 -513 422 -148 -418 442 -70 -428 353 -131 -282
4881 -282 727 -16 -658 455 -84 -261 417 -447 -765 -2 -197 -83 362 -158 -338 573 -126 -309 224
4900 224 -75 -614 345 154 -303 178 170 -378 456 -21 -447 60 -142 -422 170 257 -250 417 204 -351 64
4921 64 261 -258 -352 -25 -648 8 140 -540 261 209 -345 175 335 -499 402 280 -437 -101 438 -628 -215
$$ packed form
4780d45j7J132p10k24P09o74j52O16p78P0J053p03j59P05L0q45P90m38l38P13
4800C35n44n8M05K0q44J104k11p75R60l87n51R60l37m37O87r4p16Q89j64q35P94
4821B01k1p96R06j18q46R34kr16J189k20q57P10M47j450J071j05p70O46K30q35
4841f02O90K22o69N30O9m55L81K13j128O87N05r55N69R4r41N98Q02j041O05M01
4861E75p31L38M88j271L71P39n88k09P34r46j3R35n70k70Q60n12l58P81m84j51
4881b82J009p43o42J113n39j77O78q64l18P63j95J14M45n20j80R11o99j83N33
4900B24k99n39R59j91m57M81qn48Q34m77m26N07k02k80N92Q7n07O67k13n55M15
4921F4J97n19r4L27o23O56J32o80Q01n2n54N20J60q34R01j22p17L36N39j066M13
$$ plain form
4942 -215 176 -231 164 364 -337 114 502 -216 17 613 -465 -63 319 -438 -165 458 -66 -419 442 -527
4962 -527 -97 231 -432 -51 421 -136 79 468 -212 -212 297 -131 -544 533 -249 -231 126 -188 -378 388 73
4983 73 -71 447 -181 -314 429 -146 -184 364 -115 -504 387 48 -411 314 -184 -442 225 141 -480 151 1
5004 1 -441 274 -52 -610 536 61 -288 232 262 -648 -19 151 -687 163 334 -364 309 159 -797 200 116
5025 116 -486 249 477 -434 113 287 -269 160 270 -249 49 427 -290 101 507 -229 97 236 -182 32
5045 32 388 -382 45 305 -313 -108 317 -219 -13 312 -303 -106 332 -278 65 292 -176 -265 478 -283 -234
5066 -234 379 -333 395 334 -295 -186 307 -214 -35 464 -55 -313 235 -291 -257 510 180 -177 465 -226 -193
5087 -193 269 -385 -331 163 -191 -210 81 -66 -534 222 73 -321 286 -162 -433 393 250 -52 363 35 -240
$$ packed form
4942b15L91m07L95K00p01M51L88p18K33N96j078M02L82p57K73O23n24l53Q61r69
4962e27M30L28o63L81M72n57K15L89o80%N09m28m13J077p82J8L57l14j90P66l15
4983G3j44N18o28j33P43n75l8N48m79l89Q91l39m59P25m98k58O67q4o21O31j50
5004Am42P15l26n58J146m75l49N20L0r10O29J70q38Q50J71o98O73j50r56R97q4
5025A16o02P35K28r11N47J74n56M29J10n19K98L78p17L91M06p36L26J39m18K14
5045C2L56p70M27K60o18K05M25n36K06L25o15J97M38o10L43K27m68q9P43p61M9
5066b34O13p12P28o1o29J09M93n21J79M99n19k58N48n26L4P67l30l57O42o91L3
5087a93M62o54N4M94l54j9K91j47m68P56j49l94O07m48k71Q26j43l02M15l28k75
$$ plain form
5108 -240 342 192 -60 616 137 -635 118 -108 -427 313 215 -368 220 316 -188 -35 365 -294 146 114 -294
5129 -294 167 114 -346 426 337 -466 -223 445 -318 263 311 -497 -178 379 -121 -27 251 -615 152 515 -272
5150 -272 -46 -180 -443 16 264 -285 -57 104 -341 -76 455 -138 -14 483 -282 -280 492 -310 177 357 -548
5171 -548 -75 545 -290 -271 367 -103 -187 205 -274 -3 591 54 -341 258 -60 -162 227 -107 -163 397 -61
5192 -61 -207 111 242 -301 472 -176 -459 264 -163 -340 396 153 -357 528 276 -227 218 232 -345 340 204
5213 204 -577 111 238 -436 3 124 -234 182 375 -258 137 37 -438 227 536 -182 -134 178 -206 171
5233 171 114 -110 31 -28 -65 -209 167 -256 59 172 -285 98 339 69 69 530 -250 100 404 -293 -205 266
5255 266 -101 -239 609 -230 37 355 -464 -211 413 46 -282 267 -117 -181 331 -251 -204 485 -192 -233 337
$$ packed form
5108b40N82j50k52O76m79p72P53k26l19P40r8n83N88R6n04J53M00o59M40l2m08
5129b94M61n3m60P72q9q03K43O68p63N81M8q08L19N57n00R4K78q66P67L63p87
5150b72K26j34k63M59K48n49K28J61m45K65N31n93J24M97p65KP72q02M87J80r05
5171e48M73O20q35J9O38m70q4L92m79K71N94n37l95N99l18j02L89l34n6N60m58
5192f1j46L18J31n43P73o48k83P23m27j77P36k43n10Q85k52n03M45J4n77O85j36
5213B04p81O88J27o74M39J21l58M16J93o33L95j00m75O65L09p18M8L12l84L77
5233A71n7k24J41n9l7j44L76m23L15J13m57L83K41k70%M61p80L50L04o97Q8M71
5255B66l67j38Q48q39K67L18q19K53O24l67l28N49l84o4N12n82M7O89o77m1N70
$$ plain form
5276 337 -53 -283 241 -181 -328 383 -226 -242 487 -171 -144 115 -132 -102 305 -188 -283 293 501 -385 85
5297 85 344 -204 185 66 -281 300 -250 -129 177 -34 -243 638 304 -392 152 32 -418 315 400 -393 262
5318 262 222 -273 207 186 -89 166 52 -256 124 11 -253 -221 226 -170 154 422 -186 139 274 -411 -17
5339 -17 133 -434 73 287 -439 209 140 -39 117 323 -175 -192 211 -156 -14 165 -181 -275 399 -475 107
5360 107 277 -347 -211 267 -259 23 391 -106 -333 249 -104 -69 481 31 -40 537 -133 -190 21 -7 -335
5381 -335 201 -33 -327 403 53 -35 497 36 66 347 -392 -152 274 88 -147 126 -93 -178 169 81 -451
5402 -451 66 -183 -410 320 133 -371 366 104 -268 96 131 -335 162 93 -540 69 66 -115 79 351 -498
5423 -498 -4 347 -379 191 234 -434 67 138 -440 162 354 -380 -83 225 -176 220 -9 -366 427 297 19
$$ packed form
5276C37l90k30N24m22j47P11o09j6P29o58K7K59k47L0M07m93r5N76K08q86M70
5297H5K59n48L89j19l47N81n50J21L06k11k09Q81l34o96N44j20m50P33Q5p93O55
5318B62m0m95M80k1k75K55j14l08L80j13k64L2M47l96L24K68o08L25J35o85L94
5339a7J50n67N07K14p26O48o9j79J56K06m98j7M03l67J42J79l46r4O74q74N82
5360A07J70o24J36M78n26K82L68m97k27N82l53L5N50m50p1N77o70n7K11k8l28
5381c35N36k34k94P30l50q8N32m61L0K81p39K40M26j86k35K73k19q5L47q8n32
5402d51N17k49k27P30j87n04P37k62l72L64L5m66M97o9o33O09lj81J94K72q49
5423d98M94L51p26N70M3o68N01P1n78O02J92p34K97L08m01L96k29l57P93j30k78
$$ plain form
5444 19 -12 223 -329 43 445 -193 -84 114 -339 -58 181 -426 -45 379 -246 161 228 -12 108 445 -184
5465 -184 -228 438 -346 33 335 -297 77 260 -16 -139 75 -170 -85 378 -224 -287 448 -117 -165 269 -189
5486 -189 -286 210 -148 -264 382 -376 -310 244 -305 -288 302 172 50 483 127 -143 137 -114 -195 392 21
5507 21 -184 167 -21 -352 297 -28 -398 118 -74 -309 406 -88 -241 299 27 -287 49 220 -333 133
5527 133 -35 -171 389 71 -222 -83 225 -211 -32 232 -153 115 286 -204 -216 -37 -367 -87 296 -152
5547 -152 97 218 -176 44 281 -172 -23 257 -248 -103 458 -267 -260 478 -219 -246 571 -327 89 619 -218
5568 -218 65 330 -327 53 319 -27 -11 628 -114 -188 290 -262 -133 230 -228 9 379 -241 25 378 -232
5589 -232 -193 306 -8 -499 206 174 -214 -151 119 -343 133 72 -10 7 -86 -255 -2 32 -126 132 -78 -149 192
$$ packed form
5444A9l1K35n52L72M02o38J09J98m53K81K39o07L81M24o25M07O7k40J20L37o29
5465a84m4O66p84L79L02o32L74J83k76j23K14k45Q5M63o02o3P35n65m8M34m58
5486a89r7M96l58j16O46p58O6N54n49J7N90j30j22M33l56k70K80k51q1N87l71
5507B1k05L51j88l31O49l25l70N16j92k35P15m94j53N40k72l14L36J71n53M66
5527A33j68j36N60l18k93J39L08m36J79K64l85K68J71m90j2J79l30K80L83m48
5547a52K49J21l94K20K37m53J49K80n05J45N61p25PP38o97k7Q17q98M16N30q37
5568b18K83K65o57L80K66l46J6O39p42p4M78n52J29L63m58K37L70o20K66L53o10
5589b32L9M99l14m91P05l2l88O3K70m62M76o1q2J7r3j69K53L4j58K58k10p1L41
$$ plain form
5612 192 230 -278 -14 26 -354 248 91 -116 78 -182 -281 176 82 -242 41 163 -283 -191 76 -264 262 259
5634 259 -157 269 130 -168 159 -26 -445 -87 48 -426 165 198 -389 107 77 -23 -144 166 -289 288 -153
5655 -153 -341 -135 442 -271 -320 179 -41 -206 71 -238 -20 123 -200 -301 140 -210 127 8 -155 32
5675 32 326 -38 -184 36 -271 -309 467 -104 -211 368 -90 -31 176 9 -207 203 62 -154 -210 4 -360
5696 -360 422 164 -148 75 112 -113 235 91 -75 -68 -218 -131 350 47 -39 255 226 -180 116 -8 -206 151
5718 151 -61 -262 23 -10 -434 -17 -235 -272 246 -41 -485 -93 112 44 -98 105 -83 -141 179 -262 -136
5739 -136 61 -307 -135 -113 -246 -106 314 -84 107 96 -290 63 372 -60 -74 205 -34 -105 135 23 -172
5760 -172 211 -202 44 427 -151 -21 68 -445 -66 145 -182 -91 245 16 -52 509 -217 241 15 -175 -20
$$ packed form
5612A92L8n08K64M0l80O02j57k07J94k60r9M57r4l24K83J22m46R2K67l40N26l
5634B59m16M26j39k98L27j85m19L58J35m74N91L3n87M96l0j00j21L10m55N77m41
5655a53j88K06N77p13m9M99k20j65K77l09K18J43l23j01M41l50L37j19j63J87
5675C2K94l64j46K20l07l8P76n71j07N79m58N9K07j67k16M10j41k16n6K14l64
5696c60P82k58l12K23L7k25L48j44j66Pj50Q7M81l03q6K94k9m06K96j24j98L57
5718A51k12k01K85l3m24M17k18l7N18k87m44L92K05o8j42K03j88n8L20m41J26
5739a36J97l68J72K2j33J40M20l98J91j1l86L53L09m32j4K79k39p1K40j12j95
5760a72L83m13K46L83n78J30Q9n13L79K11l27R1L36k29o8N61p26M58k26j90J55
$$ plain form
5781 -20 231 28 102 268 -290 -20 287 -14 -204 203 -64 -254 125 -50 15 90 128 -191 174 60 -233 -5
5803 -5 -227 -202 93 318 -501 240 227 7 241 64 -494 -60 -46 52 127 44 -229 69 75 -88 111 236 -362
5826 -362 156 198 -288 -132 238 -291 68 210 -173 95 270 -377 -6 137 102 73 -67 17 -226 259 -274
5847 -274 432 216 -164 -61 303 33 -213 425 -297 -88 61 -108 -201 227 -286 -65 108 -96 271 168
5867 168 -192 -138 360 -83 -50 226 -245 4 185 -164 -115 140 -111 -314 -17 -79 -50 327 79 -76 256 103
5889 103 -221 246 -93 -186 224 -83 -229 366 56 -159 201 143 -230 -8 -76 -379 116 2 -28 236 211 -245
5911 -245 117 -192 -96 -9 100 -205 131 87 -20 9 184 -456 137 97 0 307 -197 -156 118 127 -427 -163 149
5934 149 -359 207 442 -183 162 -143 -407 51 64 -213 -47 253 -234 86 111 -310 29 115 -332 26 305
$$ packed form
5781b0K51k03P4J66n58K70L07l01j90M07k67j90L79j75O5P5L8l19L65j14k93K28
5803ek22K5K95K25q19P41j3k20K34j77n58M34J4R8P5q3k73K98Oj63J99J25n98
5826c62N18M2m86J56L70n29L59J42l83K68J75o47L71J43l5k9j40Q4k43M85n33
5847b74P06k16l80J03L64k70k46O38p22K09J49j69r3M28n13K21J73k04L67j03
5867A68l60N4M98m43L3K76m71K49J81l49M9K55k51k03K97o2K9L77k48j55L32j53
5889A03l24M67l39r3M10l07j46N95l10k15L60n8l73K22o8l03M95j14l0K64k5m56
5911b45L62l09R6Q7J09l05L36m4j07K9J75o40N93m0r7L07n04M1K74Rn54K64L12
5934A49n08N66K35o25L45l05k64M58J3k77J66L00m87L20K5m21L39Q6m47L58K79
$$ plain form
5955 305 -332 -89 154 -96 -114 155 -10 -28 -32 -242 -389 207 -142 99 -131 -258 -171 118 -69 -212 316 -78
5977 -78 -26 145 -204 -32 187 -203 -11 289 -105 46 462 64 -164 -27 -107 -151 302 180 -165 279 21
5998 21 -321 -33 -80 -403 -39 108 2 117 29 -3 197 -106 -185 228 32 -359 49 -64 -320 240 235 -170
6020 -170 -99 -46 31 145 -5 3 111 85 -168 436 -10 -39 -96 -58 79 55 64 -179 -40 117 -176 64 66 -380 123
6045 123 -50 -210 65 392 -81 247 369 -464 -85 149 -281 -313 393 -255 -24 220 -246 -58 283 -53
6065 -53 149 179 -181 -62 350 -369 -263 89 -255 -115 29 -196 -50 -62 -87 28 348 -144 -117 125 42 -224
6087 -224 194 34 70 76 -193 32 86 108 -162 55 -82 -175 75 154 3 296 173 78 85 141 -169 -4 142 -312
6111 -312 532 40 -306 423 101 5 -121 -104 -94 -21 0 -144 16 -100 -211 119 -71 -212 -80 47 -145 90
$$ packed form
5955C05o37K43K43k50j8K69j65j8mk10j47N96l49K41k30j27Q7K89j87j43N28l94
5977g8N2J71l49J72K19l90J92L00l94J51M16l98k28J37q0m4M53j22l45M44k58
5998B1l42K88m7l23L64J47j06J15q8l2K00l03p9M13j96l91M08j13k56N60nm05
6020a70P1N3P7J14j50QJ08k6k53O04m46k9n7L8J37k4Rk43J39J57k93K40Km46N03
6045A23j73j60K75L27m73L28J22q33L79K34m30l2P06o48K31K44m66J88L41l36
6065e3K02L0l60J19M12p19J06L52l44J40J44k25J46j2k5J15L20m92K7K42q3k66
6087b24M18j60L6Ok69K25N4K2k70K17j37r3K50P9j51K93j23r5PN6l10J65J46m54
6111c12Q44m92l46P29l22r6j26J7J0P3K1j44J60j16j11L30j90j41J32J27j92K35
$$ plain form
6133 90 65 -181 148 307 -209 17 181 -372 71 185 -209 -198 2 -322 155 67 -16 -189 174 -250 132 84
6155 84 -123 -70 209 -136 -347 312 -287 373 194 -225 -84 214 -146 7 14 39 -131 147 -8 -73 310 -299
6177 -299 -13 76 124 -150 91 -124 -426 88 -413 -101 274 -158 -146 279 -336 -279 213 30 -290 42 125 -261
6199 -261 112 -92 128 -1 152 -59 265 285 -287 424 127 -263 197 205 -5 139 -17 -61 150 -34 -22 149
6221 149 -55 -144 150 164 -225 -60 89 -44 99 271 -304 -56 -101 -54 145 123 87 95 22 -225 186 -19 -276
6244 -276 -77 284 -333 111 93 11 -124 -14 -191 -21 -69 -24 -9 -147 -288 71 126 357 -133 116 -355 239
6266 239 -105 -61 -141 164 -226 122 154 -13 33 222 116 -30 46 -152 -96 -14 -319 -233 301 -304 51 249 -33
6289 -33 99 -120 112 -261 64 -60 -248 136 -115 -54 227 14 -272 48 22 -126 -67 -362 170 204 -79 -188
$$ packed form
6133I0k5k46L29J59n16K26J64n53M43J14l94J1K00l24M77q8q3j73L63m24L82m8
6155H4k07N3K79l45k11O59n99O60j79m19J41K98l60J53PK5j70K78j55o5L83o09
6177b99K86Q9M8k74K41k15l02N14n01L12L75m32J2M25o15N7M92j83l20L32Q3l86
6199b61L73k04K20j29J53k11L24K0n72P11k97l90M60Qk10J44j56m4K11j84J2J71
6221A49k04q9K94J4l89J65J49j33J43J72n75K48m5M7J99k2l6Qp3k47M11k05k57
6244b76J99L61o17M44j8q2j35J10j77J70m8M5J5j38j41L59N5K31m90K49m71N94
6266B39l44M4q0L05l90L48L2j67M6J89j06j46P6j98N6Q2l05Q6N34o05L55J98k82
6289c3J32k19K32l73L25j24j88L84k51O1K81k13k86L20k6j48N9k95N32L4k83j09
$$ plain form
6311 -188 -108 -132 -245 114 224 -224 242 238 -228 91 -19 -95 57 116 -9 -83 -16 -215 67 120 -261 -58 127
6334 127 -91 295 16 -96 376 67 -203 36 135 -90 297 298 -322 -268 140 79 -141 230 -379 99 50 4
6356 4 -148 190 -157 -318 210 -113 27 395 -12 -122 18 -171 90 210 -31 -92 280 105 -142 312 -12
6377 -12 -29 208 -269 -47 226 -159 4 401 -319 -162 233 -45 -132 -13 -73 -269 75 -25 -107 74 -49 -118
6399 -118 107 -189 -309 290 168 -246 120 -210 -370 396 -25 -313 168 134 -248 267 18 -239 93 18 -293
6420 -293 -26 -138 -327 305 23 -338 -55 35 -64 152 50 -390 44 -14 -88 -146 97 32 14 32 18 3 320
6443 320 -211 88 170 -25 302 141 -45 96 332 99 176 90 -198 12 5 55 -135 -145 -122 -157 111 -67 -101
6466 -101 -76 -144 -142 195 -57 -44 -29 -119 -75 187 -276 -42 262 -25 -110 -94 11 178 -121 -145 -102 55 -128 -40
$$ packed form
6311a88Q0k4j13L59J10m48M66mm66L19j10p6J52N9j25p4O7j99K82N3l81K03J85
6334A27k18L86k79j12M72l09k70K39R9k25L87Jo20N4M08o1k20L71o09M78m9m6
6356Dj52L38l47j61N28l23J40L68m07j10J40j89K61J20k41o1L72j75k47M54l24
6377a2j7K37m77K22K73l85J63L97p20J57L95k78q7J19o0j96L44j00q2J81j23o9
6399a18K25k96j20N99j22m14L66l30j60P66m21k88M81l4l82N15k49k57L32p5l11
6420b93K67j12j89O32k82l61K83R0r9K16j02m40M34n8p4n8K43o5j8J8j4j5L17
6443C20n31K99Q2j95L27j61j86J41K36k33P7q6k88K10pN0j90j0K3l5K68j78l4
6466a01K5o8KL37k52J3J5r0M4K62m63K34L04k87q5J6J05J67k99k4M3J57j83Q8
$$ plain form
6490 -40 229 43 171 173 125 4 169 -232 -287 -121 100 -141 190 303 -101 -72 -67 32 294 79 -81 145 225
6513 225 174 88 115 153 273 101 -37 53 200 81 -116 -126 -174 -78 93 -167 192 422 -125 66 -195 -249 203
6536 203 201 53 -76 62 -194 145 63 -205 169 132 -305 320 36 -351 84 50 -126 42 310 -81 -11 -41
6558 -41 -85 -12 22 -94 19 169 -69 -236 373 119 -351 214 -124 -71 249 0 -106 286 83 172 163 130 -140
6581 -140 -98 173 -64 -108 -191 -87 178 -97 -110 3 -232 -103 6 29 -34 206 -217 -68 -37 81 -199 39
6603 39 153 -382 95 -48 -101 -61 10 -170 235 91 -68 318 257 -438 -149 -248 -52 11 29 -221 185 220 2
6626 2 144 27 -275 -57 -25 -57 123 -72 -201 -48 204 -350 -3 100 -53 -47 211 -118 -104 36 -140 -19
6648 -19 149 193 169 35 8 -166 186 9 203 161 -20 -57 -103 -119 -142 137 -322 107 173 -239 62 337 84
$$ packed form
6490d0K69j86J28Km8j21J65m01n5J66K21k41L31J13m04K9NR9K62k15j60K26Q0
6513B25n1q6K7L8J20j72j38R0J47j19j97j0m8R6J71k60L59K30n47J91k61n4M52
6536B03kj48j29J38k56L39q2k68L74l7m37O25k84l87M35l4j76J68K68l91P0l0
6558d1m4P3L4j16J13J50k38j67O09k54m70N65l38N3L20k49j06L92k03Q9rl3k70
6581a40M2K71k37m4q3J04K65k75j3J13k35J29J09K3o3K40m23J49L1J18k80K38
6603C9J14n35M77j43n3M0P1j80M05j44j59L86o1o95K89r9J96O3J8k50M06L5k18
6626BJ42j17l02K18L2l2J80j95j29J53K52n54L47J03j53OK58l29J4J40j76J21
6648a9J68M4k4j34k7j74L52j77J94m2j81l7m6j6k3K79m59M29O6m12L01K75k53
$$ plain form
6671 84 -137 3 0 4 386 49 -29 356 -105 43 290 64 -256 174 -201 -140 -156 38 41 82 167 -380 -22 -39
6695 -39 6 104 72 106 141 150 -215 -94 -67 -238 247 59 44 1 -78 -109 -5 61 -502 -56 -37 -184 259 -192 -92
6720 -92 193 212 -55 -133 286 -141 -81 138 -117 237 201 -26 166 77 -182 -29 31 -337 58 25 174 255 -5
6743 -5 87 -98 -75 -8 3 -83 -2 -162 226 -296 -16 174 -314 67 39 -258 79 248 -122 15 -1 -237 -9
6766 -9 -12 44 74 149 -55 -84 -161 119 40 268 -14 -14 253 296 3 -56 -213 69 175 -86 -82 262 167 -233 294 109
6792 109 58 351 -249 -121 53 149 -77 156 127 -127 92 88 -333 101 -31 -110 363 42 3 229 55 -45
6814 -45 221 128 -14 208 31 -248 -87 47 -258 124 -173 -199 37 195 -162 107 223 16 -74 140 -72
6835 -72 158 60 -178 342 -68 211 300 6 -263 72 78 -131 -235 225 -215 -63 125 -285 -167 348 -138 -182
$$ packed form
6671H4k21J40lML82l37p8L85m61J48K47k26l20M30l75O1j6J94LM1Q5n47L58j7
6695c9M5R8l2L4L5Rl65J21K7j71M85j88j5m3p9l1J04O6n63M46J9j47M43m51J00
6720i2K85J9k67p8M19m27O0K19k55L54l6k27J92q9k59J53O0l68L95l3J49Q1k60
6743eR2j85K3O7J1q6Q1j60L88n22K80J90m88L81k8k97L37J69l70J37j6k36K28
6766ilN6L0P5k04k9p7K80p9K28k82%K67M3k93n9j57K82J06k61ML44r5m00N27j85
6792A09n1K93o00J28J74R6k26K33k9k54K19mm21M34j32p9M73l21l9K26j74j00
6814d5K66r3j42K22j77k79J61J34l05L82k97k6K36J58l57K69J16k07r0K14k12
6835g2K30r8k38N20m10K79Q9k94k69L35Ok09j04M60m40J52J88m10J18N15m86m4
$$ plain form
6857 -182 371 -30 -116 104 -40 182 36 183 -38 -135 1 4 172 -378 24 59 -89 -141 148 163 80 -48 44
6880 44 63 87 8 282 282 196 -101 6 -101 -86 34 160 -279 331 73 -38 240 -101 26 -63 72 -53 147
6903 147 -233 -143 96 20 -97 -220 -194 -331 -81 20 -108 97 156 -381 -22 405 -258 -51 99 10 261 31
6925 31 -59 49 -87 155 -116 39 28 161 -175 -339 36 8 -358 -165 271 -172 309 76 -247 -40 43 -61
6947 -61 -1 197 158 101 90 -167 -61 132 -113 -1 -18 33 -214 182 -275 114 130 -178 79 489 65 33 100
6970 100 104 36 315 -141 -251 121 -134 64 27 -56 -214 79 -7 -28 68 109 -307 77 -89 20 116 -5 -351
6993 -351 -12 -262 -80 -34 -143 160 322 424 -328 179 -50 39 62 12 -155 57 -248 -353 296 172 -220
7014 -220 455 95 -375 85 120 -9 89 51 -63 130 -24 -480 126 222 -312 -29 -61 87 251 89 -219 42
$$ packed form
6857a82N53m01q6K20j44K22j46J47k21r7J36LJ68n50M02L5j48n2K89J5q3j28R2
6880D4J9K4p9K74%q6k97J07j07J5J20J26m39O10k58j11K78l41J27q9J35j25K00
6903A47l80R0K39p6j17j23K6j37K50J01j28K05N9n37L59M27o63K07J50q9K51k30
6925C1r0J08j36K42k71J55j1J33l36j64L75k8l66J93M36m43M81k33l23K07Q3j04
6947f1O0J98l9n7j1k57J06J93k45J12j7N1k47L96m57L89J6l08K57M10m24l2O7
6970A00Mo8K79m56j10L72k55J98l7q3j58K93q6k1R6M1m16L84j66J09R6j21l46
6993c51L39k50J82M6j09L03J62J02p52N07k29Q9K3n0j67K12l05j05O49j24l92
7014b20O75l60m70M60L5j29R8l8j14J93j54m56O06R6n34K83l2J48J64j62l08K61
$$ plain form
7036 42 22 -269 -82 -119 -340 95 170 -285 48 294 -25 186 83 -199 133 -13 -152 256 205 -218 111 273
7058 273 -205 157 -115 16 115 172 -141 45 51 67 3 68 -275 -107 171 -283 -66 402 -88 -16 16 119 71
7081 71 58 -57 135 21 -288 193 250 -184 -64 97 195 -31 281 3 -146 34 -323 -369 184 182 -241 245
7103 245 -142 -20 61 -271 -190 173 -205 -202 155 305 -58 260 123 -191 446 -108 -78 131 48 -324 17 -152
7125 -152 -42 125 -370 -269 60 -197 150 62 245 -109 -18 115 150 149 -35 -267 57 71 -89 -100 62 -300
7147 -300 88 102 -85 -61 135 -56 14 142 -163 34 180 -18 -57 117 -162 22 180 -296 -225 76 -150 -118
7169 -118 -1 -380 120 -129 -99 -120 177 -28 42 117 133 49 231 -15 -30 153 155 216 11 2 -189 11 17 -76 159
7194 159 34 -46 85 -259 14 94 105 196 350 65 24 223 137 23 -87 12 -117 288 -124 -148 153 122 101
$$ packed form
7036D2k0k91J87l7k21M35P5m55L33K46l19K11j03k82L32j46j39M08n1m23L29J62
7058B73m78L62k72J31R9N7l13J86OJ6o4O5l43J68K78m54K17M68m90P2L2J03m8
7081G1j3j15J92j14l09M81N7m34J20J61R8k26L12k78j49J80l57m6N53km23M86
7103B45l87J22Q1l32Q1L63l78LL57J50l63L18j37l14O37n54L0K09q3l72L41j69
7125a52J10J67m95J01L29k57L47q8J83l54R1J33L5jj84k32L24J4j60j1J62l62
7147c00L88J4j87K4J96j91P0J28l05J97J46j98l9J74k79J84J58m76P1L01k26L2
7169a18J17l79N00k49L0k1K97k05P0P5J6q4J82k46j5J83KO1k05rj91K00Or3K35
7194A59j25q0J31l44K73Q0J1R1J54k85m1J99q6j14j10R9j29M05m12k4L01l1k1
$$ plain form
7217 101 -143 -118 -269 138 -3 -9 -56 148 -60 186 -27 -29 -97 -156 -85 196 119 -249 -168 -12 -159 50 22 -19
7241 -19 -35 -38 27 55 233 84 -248 -185 -281 40 220 -129 -89 472 196 407 57 110 123 36 -35 70 158 -280 38
7266 38 10 -386 27 311 223 -39 -163 -312 -145 166 -301 162 146 -167 -214 233 42 -38 162 111 -96 31
7288 31 31 -21 175 91 80 41 -104 -102 123 66 -21 96 62 68 303 140 -177 55 5 -175 -136 -16 36 204 -312 -308
7314 -308 67 18 -187 243 96 -175 63 -176 -112 -51 -189 -280 -36 337 159 135 258 -114 -54 142 65 -286
7336 -286 297 -268 156 -76 10 -233 196 -13 33 113 -289 37 235 -190 135 -39 -15 -104 105 -192 -212 -47
7358 -47 -300 65 -72 225 -58 61 76 -107 117 104 -155 26 164 -125 -149 142 -8 229 -3 11 53 -132
7380 -132 -163 334 69 162 -19 28 51 -381 -295 -17 398 -116 -166 66 30 -44 -42 22 -89 129 122 -123 384 41
$$ packed form
7217A01k44K5j51M07j41om7K04k08K46k13ko8n9P1K81p7l68Q1J56j47K09k8m1
7241a9j6lO5K8J78j49l32O3r6L21J80l49M0N61k76K11l50N3J3q7p1J05Q8m38L18
7266C8k8l96M13K84q8k62j24j49J67L11m67M63j6l13m7M47j91q0K00n1k07J27
7288C1%n2J96q4j1l9j45KK25n7q7J17l4OK35j63l17K32n0j80L9J20N2J68n16M
7314c08L75m9k05M30j47k71K38k39O4O1j38r1K44L73j78k4J23l72O0J96p7l51
7336b86N83n65M24k32Q6k43M29k09M6Q0m02L26J98m25L25j74K4q9K09k97k0J65
7358d7k53L65j37K97k83J19J5j83K24j3k59J81J38k89k4K91j50K37k32J4M2j85
7380a32l1M97k65R3j81M7K3m32Q6K78M15n14n0K32l6p4KO4j11K18pk45N07l43
$$ plain form
7404 41 -159 332 -55 -249 21 75 105 -296 -55 153 -119 -112 -77 164 -200 -59 224 195 -44 -232 -21 34 287
7427 287 55 38 320 163 -162 23 -146 -126 7 -170 -217 34 -2 -141 38 49 -446 -17 199 -91 -91 161
7449 161 116 -250 -79 -187 149 -26 -134 39 86 97 238 49 41 93 43 -4 29 -110 -204 -92 152 -38 11 88
7473 88 157 -73 59 -171 54 -7 -22 10 -95 33 -66 206 -106 21 244 37 45 -8 -47 -13 59 144 25 -64 31
7498 31 -167 306 -203 104 286 -254 175 57 37 140 4 -95 6 38 35 -4 73 292 -174 150 -14 -156 169
7521 169 164 -52 -9 -31 27 157 -1 248 -310 105 -292 -60 431 -195 -92 -34 -310 -160 -59 18 -49 190 -237
7544 -237 45 155 85 126 54 -93 32 138 -143 111 -197 -209 239 142 -98 -63 384 -31 -40 -84 -137 194 334
7567 334 42 132 25 -6 -63 -48 -26 -281 -22 15 60 200 -213 330 228 79 -11 118 115 -165 237 -301 -146
$$ packed form
7404D1k00M91l87j94K70N4L0m01K41K08k72PL5K41l64J41K83k9k39j88K11N5K53
7427B87k32j7K82j57l25J85j69K0J33j77m7K51l6j39J79J1m95M29K16k90%K52
7449A61m5l66J71j08L36j75j08J73M7J1J41j89qN2n0m7L3j39r4J12K44j90M9P7
7473H8O9k30J32k30K25o1j5L2j05J28r9K72l12J27K23k07Qn3l9L4P2Q5j19q9R5
7498C1j98M73n09L07J82n40M29j18k0J03j36r9J01L2ll9P7K19m66L24j64j42L25
7521A69nk16M3k2N8J30j58K49n58M15l97K32M91o26J03N8k76J50J01P7o7K39m27
7544b37K82J10p0M1p2j47J25J06k81K54l08j2M48r7k40L5M47m15rm4n3L31J40
7567C34k92R0j07l1n7J5K2k55K59L7M5J40m13N43j02j49r0J29lk80M02n38J55
$$ plain form
7590 -146 198 75 109 93 142 -176 -3 -19 -134 24 -235 32 -35 -82 -422 -140 -99 127 -209 10 320 266 171
7613 171 -21 137 36 -134 228 5 -125 -7 204 -81 209 -9 87 83 178 20 -224 -38 53 -146 -121 -100
7635 -100 -63 165 -223 -159 27 -336 148 149 54 231 -19 -92 246 94 -111 -51 82 -134 138 244 -42 -231
7657 -231 -95 -135 -171 -1 36 77 -74 -9 -105 360 -52 -86 150 74 167 53 -345 -239 -19 -128 -22 -53 -117 82
7681 82 -45 -105 449 12 237 29 199 24 -87 70 -28 -208 90 186 -111 76 -132 9 -45 -128 -128 -83 -394
7704 -394 -125 203 -213 -109 432 46 -499 -39 -268 320 -12 -65 -49 -162 46 -125 173 16 -149 103 -88
7725 -88 -115 74 -204 -181 231 120 -79 298 235 -248 -323 168 -193 -11 -232 10 115 257 128 113 -139 -302
7747 -302 -34 -86 -440 -202 169 -370 -110 335 60 269 148 -131 153 -51 -20 20 229 -341 7 24 -76
$$ packed form
7590a46L44j23L4j6M9l18J73j6j15J58k59K67o7m7l40K82M1K26l36K19L10n4r5
7613A71j92J58j01j70L62k23j30J18K11k85K90k18R6mR5j58k44J86R1j99K5K1
7635a00L7K28l88O4J86l63M84Jr5J77k50p3L38j52k05O0J33k16K72J06k86j89
7657b31J36m0l6J70L7M1j51O5r6M65m12l4K36p6R3j14l98J06K20j09J06l1o4J99
7681H2j27o0N54m37K25k08J70j75j11J57r8j80K98R6k97J87k08J41n4q3%M5l11
7704c94K69L28m16J04N41l86n45M60k29N88l32n3J6j13K08j71K98j57j65K52j91
7725h8k7J89k78K3M12j11j99L77o3m83p5M91l61J82k21K42J05J42j29j5k52j63
7747c02K68n2l54K38L71n39K60M45k75K09j21k79K84k04L1M0K09n70L48J7j00
$$ plain form
7768 -76 72 8 179 -18 246 -95 11 53 -168 39 -171 112 176 190 -190 76 242 -223 -132 -203 -227 86 335
7791 335 133 142 134 -195 128 250 10 -7 -51 -133 -270 78 -171 50 288 -170 -224 9 -82 84 16 -76 33 229
7815 229 -6 -39 -135 -13 36 -30 172 91 136 -242 -133 -132 -178 -280 46 -21 -300 354 103 48 5 -9 -196 140
7839 140 -223 -165 -1 -22 -172 -114 191 -27 242 50 -146 46 299 -157 272 7 12 -265 109 169 -17 91
7861 91 -334 108 -26 -195 99 186 -15 -60 70 -28 -134 118 -33 11 119 -223 30 43 -163 16 223 -35
7883 -35 83 342 -1 236 364 -60 -58 375 -122 -53 -12 73 24 -13 -312 -303 313 -47 -222 191 -122 47 100 148
7907 148 67 389 -139 -7 89 -429 -320 -51 -240 -214 58 -2 80 268 160 -28 -32 -40 -74 43 -155 -96 232 147
7931 147 108 60 65 -138 181 -157 115 -117 83 84 47 224 -102 45 -50 -27 177 33 -403 153 -111 -178 258
$$ packed form
7768g6J48o4J71j97K64l41J06M2k21K07k10K83O4J4l80K66J66m65R1p1k4L13K49
7791C35k02Rql29L23J22k40j7m4q2j37L48k49K21K38m58n4K33r1J66o8r2J09J96
7815B29k35l3r6J22M9o6K02q1M5l78J09Jm6j02L26o7k79O54k51n5m3j4j87L36
7839A40l63N8J64k1j50N8L05k18K69j92j96J92K53m56M29k65Nk77L74O0j86J08
7861I1m25M42j34j69K94Q7k01m5J30r8j06K52j51M4J08l42K53J3k06J79K07k58
7883c5J18K59l43K37J28m24KM33m97O9M1Q5m9l7k99RO16l60j75M13l13J69N3M8
7907A48q1L22n28J32R6n18J09K69j89K6K72o0Q2J88j08j88mql4J17j98N9L28q5
7931A47l9m8Nk03L19l38K72k32K00Jl7J77l26J47r5K3K04j44m36N56k64o7M36
$$ plain form
7954 258 89 2 -137 400 13 8 -293 -150 -30 -43 19 134 0 -192 2 -178 65 113 -296 -110 -69 76
7976 76 -140 -70 -57 -78 62 153 157 -9 -94 -47 -144 92 -7 137 -124 -5 -203 -60 67 -109 116 -19 127 175
8000 175 5 -184 32 -35 160 314 196 -43 32 -46 -12 -113 -39 3 -83 -107 -277 -123 -231 -191 67 -67 40
8023 40 22 -133 -67 -32 -5 1 174 -212 66 -12 221 45 59 -2 103 -53 -556 -239 -128 -58 166 1 103 -168
8047 -168 -154 157 58 200 66 -353 235 132 108 204 -145 -159 5 84 -240 179 -41 -266 -125 144 12 22
8069 22 197 -244 219 -149 176 -72 -88 -57 -106 166 -124 -65 -259 -192 42 199 -16 -150 231 -77 -250 -101
8091 -101 -278 -50 36 88 -212 -68 -103 135 105 160 76 233 -43 -218 60 -28 44 -5 -73 -326 -226 197 -38
8114 -38 -56 187 21 63 71 -1 329 -182 -58 61 -139 -90 111 12 -306 91 33 89 60 140 -121 76 -58 77
$$ packed form
7954B58j69q7j39N37l87nl01J43J20j3O2J15j34j92J94j80K43M8m09J86M1J45
7976G6k16P0J3k1J40R1Mj66q5M7r7K36r9J44k61J19j98J43J27j76K25j35J46M8
8000A75j70j89K16o7J95J54j18k39P5p8L4j01P4M2q6k4j70J54j08M0K58j34J07
8023D0j8j55O6L5K7OJ73l86K78p8K33j76J4o1J05j56n03L17J11P0K24j65J02k71
8047a68J4L11r9J42j34m19N88j03k4R6l49j4J64P9l24M19k20k25J41K69j32J0
8069B2J75m41M63l68L25k48j6L1m9K72k90N9j94O7K34J57k15j34L81l08j73J49
8091a01j77K28Q6N2l00J44l5K38l0N5q4J57k76j75K78q8P2m9o8k53J00M23k35
8114c8j8K43j66M2Qp2L30n11J24J19k00M9K01r9l18L97n8N6k9Q0k61J97j34J35
$$ plain form
8138 77 -93 68 -38 89 -1 -86 33 131 -197 -75 100 245 59 -35 -170 -80 86 -113 0 36 51 284 236
8161 236 -203 -124 -136 30 289 -52 29 -99 333 -120 -19 91 -88 -235 308 -4 -179 119 -59 118 -155
8182 -155 -278 2 -83 75 128 177 131 -341 50
$$ packed form
8138G7j70J61j06J27r0q5J19R8l28J22J75J45j86r4j35R0J66j99J13L6J5K33m8
8161B36m39P9j2J66K59l41Q1j28M32m53J01J10j79j47N43l12j75K98j78J77k73
8182a55j23K80q5J58N3M9m6m72L91
8191E0
$$ Imaginary data points
##PAGE= N=2
##DATA TABLE= (X++(I..I)), XYDATA
$$ plain form
0 0 0 0 0 0 16 -16 16 -16 16 -32 48 -48 64 -80 95 -112 128 -160 190 -219 256 -295 347 -399 453 -517 592
27 592 -675 763 -862 968 -1087 1218 -1363 1521 -1694 1883 -2090 2319 -2568 2843 -3146 3485
43 3485 -3858 4277 -4746 5274 -5876 6567 -7375 8330 -9476 10886 -12672 15004 -18203
56 -18203 22872 -30333 44124 -77949 322157 320153 -216165 468939 56620 -321398 231448
67 231448 -91896 -509961 51546 -165199 -330720 219183 35182 -137846 351003 115616
77 115616 -53233 312419 31947 -185159 149968 -85151 -264228 63052 -34989 -162476
87 -162476 123376 47505 -108560 107487 94643 -76936 47485 8286 -173328 2241 82139
98 82139 -90121 60451 135054 -83080 91841 218773 -98493 -22602 99588 -244444 -140412
$$ packed form
0@%%%%J6l2L2l2L2m8Q0r6J12j44J75k07K40k88L50m09M75n51O42p46Q52r70J109
27E92j267J438j625J830k055K305k581K884l215L577l973M409m887N411n989O631
43C485p343Q135r023J0020j1150J2443j3942J5705j7806K0362k3558K7676l3207
56a8203M1075n3205P4457j22073M00106k004n36318O85104m12319l78018N52846
67B31448l23344m18065N61507k16745j65521N49903j84001j73028M88849k35387
77A15616j68849L65652k80472k17106L35127k35119j79077L27280r8041j27487
87a62476K85852p5871j56065K16047j2844j71579J24421l9199j81614J75569P9898
98H2139j72260J50572P4603k18134J74921J26932l17266P5891J22190l44032J04032
$$ plain form
109 -140412 91991 -224752 -126376 166508 -99932 12987 313077 27125 67698 269929
119 269929 -70563 -57511 113297 -212178 -164011 26297 -253734 -141540 126698 -85326
129 -85326 21623 261160 15955 38891 238371 7420 -34412 93763 -121682 -156566 1140
140 1140 -112434 -97557 51254 -52293 -31881 130625 31594 12919 143880 -7561 -85500
151 -85500 90815 -15604 -119651 78548 -7135 -143892 90745 62618 -107988 86705
161 86705 52837 -143274 48155 45511 -144967 43664 51417 -126510 83576 96261 -91367
172 -91367 118603 107285 -123835 68995 52555 -183664 28449 38457 -200458 8677 63661
183 63661 -130086 87562 137964 -85138 83513 120883 -86409 73456 69494 -166741 2093
$$ packed form
109a40412K32403l16743R8376K92884k66440J12919L00090k85952M0573K02231
119B69929l40492J3052J70808l25475M8167J90308k80031J12194K68238k12024
129h5326J06949K39537k45205K2936J99480k30951m1832J28175k15445l4884J57706
140A140j13574J4877J48811j03547K0412J62506r9031j8675J30961j51441p7939
151h5500J76315j06419j04047J98199q5683j36757K34637k8127j70606J94693
161H6705l3868j96111J91429k644j90478J88631P753j77927K10086J2685j87628
172i1367K09970j1318k31120J92830j6440k36219K12113J0008k38915K09135N4984
183F3661j93747K17648N0402k23102J68651L7370k07292J59865l962k36235J68834
$$ plain form
194 2093 30297 -168962 31608 63327 -155065 53648 120805 -101040 71739 129567 -110174
205 -110174 32154 104840 -121297 -438 77507 -122748 -2011 73337 -112792 15400
215 15400 91578 -94728 22662 89786 -101271 18421 105413 -88733 -2423 91362 -87416
226 -87416 -11724 99474 -71505 -32846 75640 -65904 -26060 81447 -53612 -28560 73297
237 73297 -45694 -16709 81887 -44568 -29288 77466 -44789 -39367 82461 -38139 -52703
248 -52703 83547 -27023 -60558 82621 -14244 -65552 71959 -12293 -67707 67099 -4156
259 -4156 -59661 67770 -2189 -56871 75342 2378 -64449 71397 -4121 -82627 67856
270 67856 3680 -91288 62769 17661 -84917 64769 36545 -74159 56126 36963 -73851
$$ packed form
194B093K8204j99259K00570L1719k18392K08713O7157k21845J72779N7828k39741
205a10174J42328P2686k26137J20859P7945k00255J20737P5348j86129J28192
215A5400P6178j86306J17390O7124j91057J19692Q6992j94146Q6310R3785j78778
226h7416P5692J11198j70979L8659J08486j41544L9844J07507j35059K5052J01857
237G3297j18991K8985R8596j26455J5280J06754j22255N422J21828j20600j4564
248e2703J36250j10570l3535J43179r6865n1308J37511q4252n5414J34806p1255
259d156n5505J27431o9959n4682J32213p2964o6827J35846p5518p8506J50483
270F7856o4176r4968J54057m5108j02578J49686k8224j10704J30285j9163j10814
$$ plain form
281 -73851 44113 29127 -80940 34485 24734 -83366 41320 36813 -80349 48424 51678
292 51678 -80271 44743 58056 -88498 25050 54783 -91933 11705 58420 -84244 10388
303 10388 69175 -68114 18627 75690 -67616 12461 68406 -78138 1920 60967 -90420
314 -90420 -7072 68721 -79208 -29 88428 -64613 -782 97484 -57168 -14576 84391
325 84391 -68067 -35943 69657 -69119 -36192 73788 -56236 -20724 89482 -41355 -11873
336 -11873 96378 -46572 -32378 82567 -59411 -52850 78374 -54413 -59742 83864 -30981
347 -30981 -42654 98359 -16030 -45368 83766 -22817 -52513 70253 -36791 -67537 65078
358 65078 -26914 -54309 84039 -9959 -53889 87859 -23 -61457 74927 -8208 -80665
$$ packed form
281g3851J17964j4986j10067J15425r751j08100J24686m507j17162J28773L254
292E1678j31949J25014J3313j46554J13548K9733j46716J03638M6715j42664R4632
303A0388N8787j37289Q6741N7063j43306Q0077N5945j46544Q0058N9047j51387
314i0420Q3348P5793j47929P9179Q8457j53041O3831R8266j54652M2592R8967
325H4391j52458L2124J05600j38776L2927J09980j30024L5512J10206j30837K9482
336a1873J08251j42950J4194J14945j41978O561J31224j32787n329J43606j14845
347c0981j1673J41013j14389k9338J29134j06583k9696J22766j07044l0746J32615
358F5078r1992k7395J38348r3998m3930J41748q7882o1434J36384q3135p2457
$$ plain form
369 -80665 55788 -6868 -76949 58052 10280 -61394 63582 21608 -54888 62454 20830
380 20830 -67977 42057 5832 -80701 41027 18232 -77039 42819 32319 -64121 54386
391 54386 50026 -65738 32650 38717 -73276 19847 36160 -77749 8111 38449 -63603 24411
403 24411 55392 -55480 25357 55770 -60505 18520 52604 -73192 -450 47171 -74257
414 -74257 -2870 62322 -57087 -713 68700 -47271 -202 71730 -46054 -12575 54064
425 54064 -59106 -18969 55653 -54536 -17718 60910 -46915 -10505 77262 -34004 -17683
436 -17683 68733 -40141 -33113 62147 -38928 -41895 54667 -34815 -36310 65761 -16141 -26839
448 -26839 65229 -17644 -33706 60259 -18740 -44415 48182 -26088 -52442 55264 -7662 -44747
$$ packed form
369h0665J36453o2656p0081J35001m7772p1674J24976m1974p6496J17342m1624
380B0830q8807J10034l6225q6533J21728k2795r5271J19858j0500r6440J18507
391E4386m360j15764R8388O067j11993R3123J6313j13909Q5860L0338j02052Q8014
403B4411L0981j10872Q0837L0413j16275P9025L4084j25796P2742M7621j21428
414g4257P1387O5192j19409N6374O9413j15971M7069P1932j17784L3479O6639
425E4064j13170M0137P4622j10189L6818P8628j07825L6410Q7767j11266J6321
436a7683Q6416j08874P028R5260j01075k967R6562q9482j495J02071q1902j0698
448b6839R2068q2873j6062R3965p8999k5675R2597p4270k6354J07706o2926l7085
$$ plain form
460 -44747 60826 -355 -46142 61942 7361 -52313 45915 -3178 -61622 40424 4660
471 4660 -54194 42531 10248 -49019 50187 19116 -48746 45900 11814 -63967 36905 13726
483 13726 -64421 35819 19842 -61575 36763 33683 -48848 35183 30649 -56246 22295 26977
495 26977 -56236 18642 23453 -60600 19689 36219 -48765 26285 41873 -52517 18628 44515
507 44515 -52721 8090 38818 -59630 -1718 43273 -51182 1097 49875 -46314 2270 55675
519 55675 -42541 2040 55045 -49472 -7857 50182 -52199 -9450 53450 -51953 -14215
530 -14215 56572 -44266 -8476 64296 -41362 -15341 60515 -38681 -14192 57859 -43208
541 -43208 -21874 51309 -39256 -14926 53345 -39178 -17336 53500 -33178 -15537 54658 -33192
$$ packed form
460d4747J05573o1181m5787J08084n4581n9674R8228m9093n8444J02046l5764
471D660n8854R6725l2283n9267R9206l1071o7862R4646l4086p5781J00872k3179
483A3726p8147J00240j5977q1417R8338l080q2531Q4031m534q6895P8541M682
495B6977q3213P4878M811q4053Q0289J6530q4984P5050J5588r4390P1145K5887
507D4515r7236O0811L0728r8448N7912M4991r4455N2279M8778r6189M8584N3405
519E5675r8216M4581N3005j04517M1615N8039j02381M2749O2900j05403L7738
530a4215P0787j00838L5790P2772j05658K6021P5856r9196K4489P2051j01067
541d3208K1334P3183r0565K4330O8271r2523K1842P0836q6678J7641P0195q7850
$$ plain form
553 -33192 -23070 52511 -27040 -23513 50516 -22003 -25822 46560 -18330 -26145 41255 -17238 -28654
566 -28654 35672 -16462 -28542 39139 -6974 -27434 39642 -2163 -28694 41447 3329 -36936
578 -36936 29426 -389 -41994 27888 5557 -43091 23923 11960 -35397 31044 20668 -37188
590 -37188 25382 20633 -39856 23187 19635 -48099 17183 21635 -47822 18664 26124 -47795 18133
603 18133 31695 -46311 16483 34719 -44904 14053 36483 -45139 10848 37255 -44612 7869
615 7869 33056 -49917 5309 35149 -46730 5671 37258 -43519 7890 45922 -36601 2846
627 2846 42058 -37432 -4554 39812 -37390 -12952 34934 -33450 -10382 39990 -26709 -10911
639 -10911 41950 -21746 -12636 41964 -21922 -21674 40604 -19242 -27523 41754 -14961 -30852 45894
$$ packed form
553c3192J0122P5581p9551L527P4029p2519l819P2382o4890p815O7400n8493j1416
566b8654O4326n2134j2080O7681m6113k0460O7076m1805k6531P0141l8118m0265
578c6936O6362k9815m1605O9882k2331m8648O7014j1963m7357O6441j0376n7856
590c7188O2570m749o0489O3043l552o7734O5282M452o9457O6486P460p3919O5928
603A8133J3562p8006O2794J8236p9623N8957K2430q1622N5987K6407q1867N2481
615G869K5187q2973N5226K9840q1879N2401L1587q0777N1409L8032q2523L9447
627B846L9212p9490L2878M4366p7202K4438M7886o8384K3068N0372o6699J5798
639a0911N2861o3696R110N4600o3886K48O2278n9846q281O9277n6715j5891P6746
$$ plain form
652 45894 -10874 -35621 46544 -9575 -39359 47551 -10137 -43557 51285 -6271 -42516 55437
664 55437 -5691 -46342 57968 -5078 -51313 55699 -10586 -55695 57033 -8352 -53767
675 -53767 58884 -6050 -47827 61134 -3457 -44758 54724 -8215 -43536 48556 -12067 -41970
687 -41970 43858 -11956 -35472 44342 -8267 -29275 42262 -4812 -26301 34629 -4643 -25940
699 -25940 24095 -3739 -23887 16456 991 -18122 13320 7960 -14622 10123 13657 -15564
711 -15564 3748 16051 -21304 -3355 20043 -22902 -7018 27041 -21769 -7125 36600 -20473
723 -20473 -8864 39170 -25416 -14013 39672 -30654 -17179 40067 -32457 -14493 45455 -29298
735 -29298 -9768 46804 -29350 -9588 43763 -31995 -13094 37698 -33374 -12466 37974 -28101
$$ packed form
652D5894n6768k4747Q2165n6119k9784Q6910n7688l3420R4842n7556l6245R7953
664E5437o1128m0651J04310o3046m6235J07012o6285m5109J12728o5385m5415
675e3767J12651o4934m1777J08961o4591m1301R9482o2939l5321R2092o0623k9903
687d1970Q5828n5814k3516P9814n2609k1008P1537m7074k1489O0930l9272k1297
699b5940N0035k7834k0148M0343j5465j9113L1442n360k2582K4745L534k9221
711a5564J9312J2303l7355J7949K3398m2945J5884L4059m8810J4644M3725n7073
723b0473J1609M8034o4586J1403N3685p0326J3475N7246p2524J7964N9948p4753
735b9298J9530N6572p6154J9762N3351p5758J8901N0792p1072K0908N0440o6075
$$ plain form
747 -28101 -8844 38526 -22447 -6314 35648 -21853 -10220 27994 -22939 -13070 24751 -18279
759 -18279 -12305 28442 -9298 -12188 31194 -3969 -19013 27701 -3890 -30416 22061 -1542
771 -1542 -34433 24343 6114 -33236 29814 15015 -31722 31154 13889 -40152 27717 11301
783 11301 -47426 25602 9613 -49279 31196 16424 -45766 35411 18390 -44795 35835 16062
795 16062 -47607 31078 11491 -48232 30409 11618 -45868 31299 13897 -41463 31799 13352
807 13352 -41184 29052 12848 -40781 24548 11546 -38129 24419 14976 -35434 19997 17497
819 17497 -31691 16576 17899 -32647 9787 18838 -30184 7006 20086 -28993 5675 23918
831 23918 -25116 4755 26148 -24614 580 27073 -24272 -5263 25476 -24550 -8662 26712
$$ packed form
747b8101J9257M7370o0973J6133M1962n7501J1633L8214n0933R869L7821m3030
759a8279N974M0747l7740k890M3382l5163j5044M6714l1591k6526N2477k3603
771a542l2891N8776j8229l9350O3050j4799m6737O2876j7265n4041O7869j6416
783A1301n8727P3028j5989n8892Q0475j4772o2190Q1177j7021o3185Q0630j9773
795A6062o3669P8685j9587n9723P8641j8791n7486P7167j7402n5360P3262j8447
807A3352n4536P0236j6204n3629O5329j3002m9675O2548r443n0410N5431k500
819A7497m9188M8267J323n0546M2434R051m9022L7190J3080m9079L4668J8243
831B3918m9034K9871K1393n0762K5194K6493n1345J9009L0739n0026J5888L5374
$$ plain form
843 26712 -21360 -8725 28585 -17118 -6676 30230 -16531 -8126 28793 -16930 -12084 24897
855 24897 -18229 -14903 26025 -14070 -15015 27071 -9891 -14316 28896 -7031 -17087 25443 -7997
868 -7997 -19972 24107 -6257 -22364 22688 -2144 -20285 25328 924 -23698 23267 3288
880 3288 -25643 21701 2444 -29638 21868 6517 -28917 22558 9064 -28396 23054 11210
892 11210 -31076 18308 10500 -31744 17741 10987 -32777 17498 14836 -29982 19513 14957 -32430
905 -32430 18336 16933 -32446 14686 14737 -33377 14678 18888 -31649 11444 18625 -28995 12487
918 12487 20187 -30884 8980 20772 -29099 8803 20792 -30412 7772 23723 -28169 4672
930 4672 22570 -28126 3863 24571 -27040 412 24232 -24582 1533 26343 -25752 -2372
$$ packed form
843B6712m8072J2635L7310m5703J0442L6906m6761Q405L6919m5723M846L6981
855B4897m3126L326M0928m0095r45M2086l6962m425M3212l5927j0056M2530l3440
868g997j1975M4079l0364j6107M5052k4832j8141M5613k4404k4622M6965j9979
880C288k8931M7344j9257l2082N1506j5351l5434N1475j3494l7460N1450j1844
892A1210m2286M9384p808m2244M9485o754m3764N0275k662m4818M9495m556m7387
905c2430N0766j403m9379M7132N1m8114M8055M210n0537M3093P181m7620M1482
918A2487P700n1071L9864J1792m9871L7902J1989n1204L8184J5951n1892L2841
930D672J7898n0696L1989K0708n1611K7452K3820m8814K6115K4810n2095K3380
$$ plain form
942 -2372 26733 -23266 -2046 25707 -24451 -3923 27557 -20393 -4728 25716 -20967 -6026
954 -6026 27487 -19925 -9087 26031 -18232 -9020 27697 -17303 -10482 28260 -14186 -10562 25817
967 25817 -14717 -12643 25293 -13271 -14046 23701 -11610 -13494 26253 -8750 -15752 24702 -7010
980 -7010 -16457 23672 -6635 -18755 21449 -4128 -17189 20405 -2229 -17383 20170 -108
992 -108 -18526 18166 1090 -19904 17543 3128 -20959 16456 6162 -21032 14725 6859 -21676
1005 -21676 13299 8634 -22144 10958 10413 -21540 11039 12768 -21958 9661 15139 -23006 7336
1018 7336 15173 -24297 6310 16481 -24185 5693 18448 -22702 6102 20124 -23576 3155
1030 3155 21356 -23994 851 21015 -24790 53 23371 -22510 -270 23284 -21951 108
$$ packed form
942b372K9105m9999K1220K7753n0158K0528L1480m7950J5665L0444m6683J4941
954f026L3513m7412J0838L5118m4263R212L6717m5000O821L8742m2446L624L6379
967B5817m0534K074L7936l8564p75L7747l5311j884L9747l5003p002M0454l1712
980g010r447M0129l0307j2120M0204k5577j3061L7594k2634j5154L7553k0278
992a08j8418L6692j7076k0994L7447j4415k4087L7415j0294k7194L5757p866k8535
1005b1676L4975m665l0778L3102n45l1953L2579J729l4726L1619N478l8145L0342
1018G336P837l9470L0607J0171m0666K9878J2755m1150K8804J4022m3700K6731
1030C155J8201m5350K4845K0164m5805K4843K3318m5881K2240K3554m5235K2059
$$ plain form
1042 108 24367 -22206 -2241 22906 -22212 -3244 24287 -20560 -5012 25824 -17875 -6197
1054 -6197 25029 -17367 -7509 24390 -17153 -9722 23578 -15274 -8738 24971 -13291 -10193 24568
1067 24568 -10737 -11696 22924 -11168 -15477 22688 -8161 -15756 22255 -7110 -15806 23824 -4132
1080 -4132 -16687 22447 -3699 -18284 21534 -2762 -20221 20458 -676 -20934 19699 952
1092 952 -21541 20401 2866 -22348 19553 3414 -22331 19737 4627 -23495 17598 5711
1104 5711 -23177 16446 6429 -24007 14566 8331 -22513 14021 9253 -22775 13539 10699 -22755
1117 -22755 11939 10851 -22923 9788 12523 -21728 8138 14133 -20458 6126 15346 -20001 4111
1130 4111 15822 -20291 2011 16749 -19873 1905 19259 -18807 641 20243 -18063 -1165
$$ packed form
1042A08K4259m6573J9965K5147m5118J8968K7531m4847J5548L0836m3699J1678
1054f197L1226m2396R858L1899m1543P431L3300l8852O536L3709l8262L098L4761
1067B4568l5305r59L4620l4092m309L8165l0849p595L8011k9365q696L9630k7956
1080d132j2555L9134k6146j4585L9818k4296j7459M0679k1134k0258M0633j8747
1092I52k2493M1942j7535k5214M1901j6139k5745M2068j5110k8122M1093j1887
1104E711k8888L9623j0017l0436L8573o235l0844L6534m768l2028L6314k840l3454
1117b2755L4694j088l3774L2711K735l4251K9866N995l4591K6584R220l5347K4112
1130D111J1711l6113K2302J4738l6622K1778J7354l8066J9448J9602l8306J6898
$$ plain form
1142 -1165 20016 -18751 -4642 19896 -17650 -5420 21679 -16362 -5065 23324 -14849 -5638
1154 -5638 23181 -15578 -7883 21709 -15400 -8852 21421 -13352 -8493 21703 -11410 -8441 21413
1167 21413 -10899 -10319 19711 -10394 -11648 19455 -8643 -11745 19217 -5772 -11142 18763 -3756
1180 -3756 -12554 15978 -3148 -14237 14321 -1791 -15829 14296 1386 -15466 15303 3762
1192 3762 -16679 13957 4805 -17890 12444 5319 -19037 11476 6952 -19027 11783 8416 -19863
1205 -19863 11375 9442 -21022 10898 10412 -21435 10178 11562 -20905 10226 12103 -20383 8427
1218 8427 11346 -20527 7335 11389 -20380 6171 12183 -18963 6450 13834 -17881 5564 14009
1231 14009 -17454 4282 13376 -17433 2165 12911 -16622 1358 14268 -15463 -46 15078
$$ packed form
1142a165K1181l8767J4109K4538l7546J2230K7099l8041J1297K8389l8173R211
1154e638K8819l8759P695K9592l7109O548L0273l4773M859L0196l3113K969K9854
1167B1413l2312N80L0030l0105j254L1103k8098l102L0962k4989n370K9905k2519
1180c756q798K8532j9126j1089K8558j6112j4038L0125j2910j6852L0769j1541
1192C762k0441L0636r152k2695L0334p125k4356L0513m524k5979L0810l367k8279
1205a9863L1238j933l0464L1920m86l1847L1613J384l2467L1131J877l2486K8810
1218H427K919l1873K7862M054l1769K6551O012l1146K5413P384l1715K3445Q445
1231A4009l1463K1736R094l0809J9598J0746k9533J7980J2910k9731J5417J5124
$$ plain form
1243 15078 -14160 -1508 16519 -12957 -2899 16854 -12564 -3552 17091 -11685 -4849 16160
1255 16160 -12148 -6298 16716 -11667 -7452 17415 -10015 -7471 19360 -8627 -8820 19366 -8206
1268 -8206 -9895 18761 -9311 -11191 17815 -9461 -11211 18521 -7473 -11109 19362 -6149 -11323
1281 -11323 19179 -5251 -12017 18414 -5872 -12835 17923 -5302 -12621 16955 -5594 -12512 16514
1294 16514 -4746 -12454 15504 -3698 -11843 15411 -1397 -10897 14087 -1219 -11072 12506 -1353
1307 -1353 -12054 10598 -1300 -11890 10062 1053 -10145 9011 3180 -9637 7618 4960 -9783
1320 -9783 5092 5203 -10717 3387 6471 -11006 2570 7691 -11488 2074 10293 -11096 978
1333 978 11965 -11830 -271 13622 -11415 -942 14196 -13024 -2139 15198 -14001 -3035
$$ packed form
1243A5078k9238J2652J8027k9476J0058J9753k9418R012K0643k8776O836K1009
1255A6160k8308N850K3014k8383M215K4867k7430K544K6831k7987j93K8186k7572
1268h206j689K8656k8072j880K9006k7276j750K9732k5994l636L0471k5511n174
1281a1323L0502k4430o766L0431k4286o963L0758k3225p319K9576k2549o918K9026
1294A6514k1260p708K7958j9202q145K7254j6808r500K4984j5306r853K3578j3859
1307a353j0701K2652j1898j0590K1952r009j1198J9156n831j2817J7255k658j4743
1320i783J4875J11j5920J4104L084j7477J3576N121j9179J3562Q219k1389J2074
1333I78J0987k3795J1559J3893k5037J0473J5138k7220J0885J7337k9199J0966
$$ plain form
1345 -3035 15168 -15559 -2599 17309 -14288 -1525 18124 -14321 -1335 18397 -14224 -3089
1357 -3089 16650 -15698 -3891 16202 -14821 -3592 16532 -13131 -2638 17040 -11561 -3304
1369 -3304 15952 -10896 -5110 14561 -9098 -6000 14273 -7589 -7255 13773 -5447 -8437 13820
1382 13820 -4957 -10920 13960 -2994 -11256 14472 -738 -12822 14688 546 -13771 14290
1394 14290 -199 -16798 13799 500 -17686 15375 1237 -17959 17543 2952 -17134 18280
1406 18280 2078 -18676 16767 981 -19488 15803 411 -18999 15798 1485 -17547 16604
1418 16604 2444 -16701 15199 2772 -15808 13964 3083 -15058 11205 2467 -13590 9400
1430 9400 3363 -11957 6821 3939 -10599 5867 5794 -9847 3656 6969 -8406 2341 8121
$$ packed form
1345c035J8203l0727J2960J9908l1597J2763J9649l2445J2986J9732l2621J1135
1357c089J9739l2348J1807K0093l1023J1229K0124k9663J0493J9678k8601Q257
1369c304J9256k6848N786J9671k3659L098K0273k1862L34K1028j9220k990K2257
1382A3820j8777n963K4880j6954q262K5728j5210j2084K7510j4142j4317K8061
1394A4290j4489j6599L0597j3299j8186L3061j4138j9196L5502j4591k0086L5414
1406A8280j6202k0754L5443j5786k0469L5291j5392j9410L4797j4313j9032L4151
1418A6604j4160j9145L1900j2427j8580K9772j0881j8141K6263q738j6057K2990
1430I400o037j5320J8778k882j4538J6466p3j5641J3503L313j5375J0747N780
$$ plain form
1443 8121 -9106 -306 8583 -8418 -1788 9264 -9175 -3004 11778 -8181 -4188 13230 -8386
1456 -8386 -4962 14569 -8794 -6642 15157 -8229 -6962 15520 -8781 -7487 15698 -7860 -7994
1469 -7994 14260 -8271 -8530 15708 -5769 -8383 15273 -5369 -8013 15409 -4065 -10021 12541
1482 12541 -4613 -9860 11825 -4023 -10335 11766 -618 -9417 12147 279 -10618 11567
1494 11567 1269 -13158 9870 1265 -13220 10245 2665 -13811 10507 4584 -13199 10810
1506 10810 4527 -15433 9970 5645 -16560 9376 6127 -17311 10196 8418 -16765 9690 7702
1519 7702 -17351 9444 7840 -18125 7912 7665 -17140 8264 8996 -15915 7802 9446 -14771
1532 -14771 6639 9106 -15198 5578 8179 -15107 4990 8310 -13473 5227 9178 -12640 4273
$$ packed form
1443H121j7227Q800Q889j7001O630J1052j8439O171J4782j9959L993J7418k1616
1456h386L424J9531k3363K152K1799k3386J267K2482k4301J294K3185k3558j34
1469g994K2254k2531k59K4238k1477k614K3656k0642k644K3422j9474n956K2562
1482A2541j7154n247K1685j5848o312K2101j2384q799K1564j1868j0897K2185
1494A1567j0298j4427K3028q605j4485K3465p580j6476K4318n923j7783K4009
1506A0810o283j9960K5403m325k2205K5936l249k3438K7507j778k5183K6455j988
1519G702k5053K6795j604k5965K6037k47k4805K5404P32k4911K3717J644k4217
1532a4771K1410K467k4304K0776K601k3286K0097L320k1783J8700L951k1818J6913
$$ plain form
1545 4273 9057 -12008 2925 8943 -11502 1260 9202 -10736 883 10195 -10200 70 10371
1558 10371 -9889 -1025 10851 -9404 -2085 11112 -8445 -3175 11189 -7447 -4153 11284 -6874
1571 -6874 -4792 11457 -6337 -5443 11854 -5602 -5791 11782 -4858 -6503 11321 -4777 -7420
1584 -7420 10657 -3850 -7229 10563 -2903 -7389 10962 -1706 -7810 10166 -2197 -9091 9498
1597 9498 -1559 -9199 8836 -359 -8692 8835 1336 -8634 8359 1700 -9702 7595 1975
1610 1975 -10626 7123 2766 -10793 7336 4307 -10735 6725 4966 -10707 5499 4992 -11160
1623 -11160 4526 6294 -11155 4506 7508 -11095 4492 7658 -11861 3456 7982 -12548 2785
1636 2785 8603 -12533 2252 9181 -11524 3266 10344 -11467 1669 10270 -11814 1540 10142
$$ packed form
1545D273M784k1065J4933O018k0445J2762P942j9938J1619R312k0395J0270J0301
1558A0371k0260Q864J1876k0255P319J3197j9557N270J4364j8636L294J5437j8158
1571f874K082J6249j7794Q94J7297j7456j89J7573j6640j645J7824j6098k643
1584g420J8077j4507l379J7792j3466m486J8351j2668o104J7976j2363o894J8589
1597I498j1057p640J8035r195q333J7527p499r970J6993o659j1402J7297n620
1610A975j2601J7749m357j3559J8129l029j5042J7460j759j5673J6206n07j6152
1623a1160J5686J768j7449J5661L002j8603J5587L166j9519J5317M526k0530J5333
1636B785N818k1136J4785O929k0705J4790P078k1811J3136Q601k2084J3354Q602
$$ plain form
1649 10142 -12651 694 11060 -11596 981 10955 -11432 752 11328 -10849 -3 10580
1661 10580 -10568 -263 11121 -10194 -680 11755 -9487 -1612 11254 -9853 -2552 10946
1673 10946 -8636 -2744 10445 -8012 -2630 11508 -6380 -3353 10477 -6467 -4142 10426 -6178
1686 -6178 -6222 9981 -4978 -5757 10641 -3741 -6450 10239 -3226 -6620 10004 -2705 -7281 9454
1700 9454 -2197 -8045 9400 -899 -8563 9637 -388 -8849 8898 124 -9378 8747 267
1713 267 -9649 8657 1329 -9352 8448 1579 -10071 7390 2211 -9944 6817 2622 -10594
1726 -10594 6477 3951 -9868 6216 4040 -9853 5832 4728 -9706 4839 4477 -10007 4200
1739 4200 6098 -9339 2891 6515 -9215 2417 7242 -9428 1172 7504 -8878 1389 8016
$$ packed form
1649A0142k2793J3345J0366k2656J2577R974k2387J2184J0576k2177J0846J0583
1661A0580k1148J0305J1384k1315R514J2435k1242P875J2866k1107P301J3498
1673A0946j9582N892J3189j8457N382J4138j7888L027J3830j6944K325J4568j6604
1686f178m4J6203j4959p79J6398j4382k709J6689j3465l394J6624j2709m576J6735
1700I454j1651n848J7445j0299p664J8200j0025q461J7747q774r502J8125q480
1713B67r916J8306p328j0681J7800o869j1650J7461n179j2155J6761m195j3216
1726a0594J7071k526j3819J6084k176j3893J5685j104j4434J4545l62j4484J4207
1739D200J898j5437J2230L624j5730J1632M825j6670J0600O332j6382J0267O627
$$ plain form
1752 8016 -8612 664 9061 -8191 -795 9103 -8408 -1308 9270 -8142 -2901 9326 -6900
1765 -6900 -1692 10910 -7342 -2892 10797 -6728 -2788 10299 -8071 -4176 10573 -5863 -4008
1778 -4008 10096 -6369 -4582 11004 -5181 -5411 9911 -5151 -5262 10319 -4805 -6096 10073
1791 10073 -3583 -5365 9440 -3470 -6488 9009 -2153 -7131 7670 -1620 -6838 8810 -345
1804 -345 -7478 7947 313 -7501 8315 807 -9386 6673 1456 -8532 6747 1597 -9638 6275
1818 6275 3438 -9098 6167 3192 -9704 6450 4578 -9495 5831 4354 -9864 5633 4522
1831 4522 -10276 4334 4440 -10002 4190 4539 -9502 4801 5837 -8702 4436 5809 -8814
1844 -8814 3718 5766 -9222 1755 4863 -9071 1936 6001 -7643 1026 6297 -6320 1121
$$ packed form
1752H016j6628R276Q397j7252P396R898j7511P100J0578j7412N241J2227j6226
1765f900N208J2602j8252M450J3689j7525L940J3087j8370L895J4749j6436J855
1778d008J4104j6465J787J5586j6185k30J5322j5062j11J5581j5124j291J6169
1791A0073j3656j782J4805j2910l018J5497j1162m978J4801r290n218J5648r155
1804c45p133J5425p634p814J5816p508j0193J6059n217r988J5279n150j1235J5913
1818F275k837j2536J5265k975j2896J6154j872j4073J5326j477j4218J5497j111
1831D522j4798J4610J06j4442J4192L49j4041J4303J036j4539J3138J373j4623
1844h814J2532K048j4988J0977L108j3934J1007M065j3644Q669N271j2617P441
$$ plain form
1857 1121 6947 -6740 -840 6954 -6470 -967 7575 -6083 -1548 7725 -5501 -2222 7942 -5245
1871 -5245 -3114 7498 -5320 -3666 8331 -4734 -3533 9777 -3919 -3754 9772 -3912 -4868
1884 -4868 8720 -4912 -6411 7984 -4150 -5473 8439 -3659 -4927 9599 -1888 -4783 8917
1897 8917 -2650 -5645 8148 -2625 -6475 6835 -2576 -5822 7207 -1369 -5553 6992 -522
1910 -522 -5431 6880 224 -5725 6016 925 -6386 5017 1386 -6914 4547 2067 -6929 4038
1924 4038 2413 -6844 4060 2849 -6884 3203 4039 -6502 3331 4375 -7471 2652 4905 -7262
1938 -7262 2140 5060 -8075 1965 5372 -7838 1419 5674 -8019 1348 6601 -7401 1257 7236
1952 7236 -7017 1026 7629 -7433 -200 6658 -8062 -1057 6584 -7442 -302 7540 -6833 279
$$ packed form
1857A121N826j3687N900P794j3424N503Q542j3658M535R273j3226L279J0164j3187
1871e245K131J0612j2818J654J1997j3065J201J3310j3696J65J3526j3684r56
1884d868J3588j3632j499J4395j2134j323J3912j2098j268J4526j1487k895J3700
1897H917j1567k995J3793j0773l850J3310r411l246J3029q576m184J2545p514
1910e22m909J2311o656n949J1741n091p311J1403l631q300J1461k480q996J0967
1924D038j625r257J0904j211r733J0087Q36j0541R833J044j1846J0123K253j2167
1938g262R402K920j3135J0040L407j3210R257M255j3693R367N253j4002Q658N979
1952G236j4253Q043O603j5062P233O858j4720P005P641j4026P140P842j4373P112
$$ plain form
1966 279 7896 -5865 -107 7898 -6268 -1785 7382 -6204 -2683 7159 -6204 -2408 7907 -4994
1980 -4994 -1980 8278 -4704 -2823 7863 -4718 -3486 7351 -4153 -3992 7511 -3216 -3703
1993 -3703 7848 -2445 -4591 7259 -2785 -5249 7227 -2619 -5463 7158 -1644 -5445 7570
2006 7570 -734 -5668 7548 -749 -6478 6915 -816 -7203 6625 -611 -7115 7176 446 -7206
2020 -7206 6927 537 -6983 6956 707 -7308 6525 793 -7116 5943 965 -6883 5606 1088
2034 1088 -7050 5581 1555 -6543 4580 1915 -6276 4533 2552 -5882 3234 2180 -5729 2766
2048 2766 3142 -5448 1912 3344 -5443 1495 4489 -4942 695 4740 -4868 -399 5242 -4528 -1337
2063 -1337 5480 -4235 -1428 6538 -3989 -2217 6921 -4368 -2901 7479 -4754 -3584 7424 -4899
$$ packed form
1966B79P617j3761N758Q005j4166M483R167j3586L521R842j3363L796J0315j2901
1980d994L014J0258j2982J881J0686j2581J232J0837j1504J61J1503j0727m87
1993c703J1551j0293k146J1850j0044k464J2476r846k844J2621q802l801J3015
2006G570q304m934J3216q297n729J3393p731o387J3828p236o504J4291o730p652
2020g206J4133o390p520J3939o249q015J3833n732p909J3059m978p848J2489m518
2034A088q138J2631m026q098J1123k665q191J0809j981q434R116j054p909Q495
2048B766L76q590P360J432q787O938K994r431N637M045r608M469N641r770L191
2063a337O817r715K807P966j0527J772R138j1289J467J0380j2233J170J1008j2323
$$ plain form
2077 -4899 -3487 8367 -4218 -3334 8836 -4053 -3613 8102 -4300 -3995 7865 -4412 -4508 7810
2091 7810 -3755 -4355 8458 -3263 -4145 7682 -3068 -4213 6882 -2829 -4380 6544 -2090 -4088
2105 -4088 6627 -1432 -4657 6055 -929 -5135 5520 -493 -5791 5305 506 -5671 5234 1231
2119 1231 -5887 5246 1683 -6889 4842 2008 -7445 4669 2602 -8040 4753 3166 -8225
2132 -8225 4513 3530 -8334 4192 3521 -8124 4284 3333 -7509 4678 3953 -7710 3824 3860
2146 3860 -7697 3458 3282 -7900 2821 3340 -7051 3179 3809 -6171 3538 3992 -5349 2610
2160 2610 3501 -5321 1449 3471 -5647 348 3745 -4418 274 4698 -4186 25 4417 -3630 -1077
2175 -1077 4342 -3796 -1760 5250 -2812 -2489 5339 -2501 -2999 5720 -2422 -4043 5070 -2062 -4093
$$ packed form
2077d899J412J1854j2585Q84J2170j2889M40J1715j2402L05J1860j2277r6J2318
2091G810j1565o00J2813j1721q82J1827j0750j145J1095r711j551J0924q634j998
2105d088J0715q059l225J0712o984m206J0655o013n298J1096m799o177J0905m003
2119A231p118J1133l563q572J1731k834r453J2114k067j0642J2793j587j1391
2132h225J2738r83j1864J2526o71j1645J2408r51j0842J2187p25j1663J1534L6
2146C860j1557J1155j76j1182J0721N19j0391J0230O30r980R709M54r341P959
2160B610Q91q822O770K022r118N995L397q163M692M424q884M211M392q047K553
2175a077N419q138K036P010q062L23P828p840m98Q719q142j621R113p132k031
$$ plain form
2190 -4093 6107 -1769 -4419 6206 -1018 -4153 6080 -1449 -4897 6003 -1049 -5276 5258 -1016
2204 -1016 -5049 5591 -356 -5265 5315 -197 -4610 5589 -284 -5175 5155 626 -4693 4771
2218 4771 521 -5743 3956 1167 -5693 3482 1355 -5903 4033 2351 -5476 3703 2735 -5526 4025
2233 4025 2878 -6335 2430 2865 -6293 2249 3529 -6360 2292 4482 -5585 2418 4475 -6456 1977
2248 1977 4464 -6748 1043 4380 -6574 1452 5135 -5880 920 5195 -5672 1366 4726 -6267
2262 -6267 47 4895 -6121 323 4893 -6077 612 6111 -4914 393 5583 -5513 -188 5125
2276 5125 -5224 -885 4859 -4824 -771 5584 -4374 -1001 5474 -3771 -1311 5324 -3644 -2186 5040
2291 5040 -3291 -2249 4621 -2700 -2094 5445 -1717 -2763 4801 -1905 -2830 5169 -1884 -4005 4502
$$ packed form
2190d093J0200p876k650J0625p224l135J0233p529l448J0900p052m227J0534o274
2204a016m033J0640n947m909J0580n512m413J0199n873m891J0330m529n319R464
2218D771m250o264R699k789o860R175k127p258R936j682p827R179r68q261R551
2233D025j147r213Q765M35r158Q542J280r889Q652K190j0067Q003K057j0931Q433
2248A977K487j1212P791L337j0954Q026L683j1015O800M275j0867P038L360j0993
2262f267O314M848j1016O444M570j0970O689N499j1025N307N190j1096N325N313
2276E125j0349M339N744r683M053O355r958L373O475r245K460O635q968J458P226
2291E040q331J042O870p321O06P539p162j046P564o706r25P999p053k121Q507
$$ plain form
2306 4502 -1455 -3546 4796 -896 -3948 4261 -105 -3480 4410 -347 -4138 4412 493 -4646 3839
2321 3839 334 -5091 4075 1043 -4654 3668 1007 -4284 4355 1485 -4968 2967 1680 -4998 2906
2336 2906 1625 -5369 2754 2776 -4859 2603 2760 -4984 2923 3126 -5109 1816 2431 -4971 2157 3341
2352 3341 -5381 1295 3977 -4834 1582 4275 -5161 334 4468 -5264 -20 4081 -5088 -105 4907
2367 4907 -4179 459 4803 -4321 84 4856 -4990 -1220 5018 -4664 -1066 5409 -4514 -1130 5955
2382 5955 -3529 -969 5613 -4094 -1522 5561 -4126 -2227 5088 -4059 -1967 5642 -3416 -2040 5383
2397 5383 -2766 -2256 5585 -2883 -2765 4907 -2728 -2574 5306 -2160 -2599 5360 -1640 -3370 4522 -1446
2413 -1446 -3627 4585 -1290 -3828 4397 -572 -3551 4796 28 -4138 4192 141 -4347 3891 82
$$ packed form
2306D502n957k091Q342n692l052Q209m366l375P890m757l791Q550l919n139Q485
2321C839l505n425R166l032n697Q322k661n291Q639k870o453P935j287o678P904
2336B906j281o994Q123K2p635P462J57p744P907K03q235O925O15p402P128J184
2352C341q722O676K682q811O416K693r436N495M134r732N244M101r169M983N012
2367D907r086M638M344r124M405M772r846L770O238r682L598O475r923L384P085
2382E955r484K560O582r707K572P083r687J899P315r147K092P609r058J376P423
2397E383q149N10P841q468J18P672p635J54P880p466m39P959p000j730P892n968
2413a446k181Q212n875k538Q225m969k979Q347m768m166Q330m051m488Q238l809
$$ plain form
2428 82 -4842 3597 794 -4612 3523 1316 -4687 3584 1582 -4493 3104 1277 -5064 3722 1950
2443 1950 -4650 2960 2237 -5095 2761 1988 -5118 2375 2277 -5118 2318 2631 -4840 2408 2921 -4579
2459 -4579 2004 3128 -4802 1606 2696 -4756 1081 2969 -4062 1018 3588 -3801 290 3660 -3546
2474 -3546 -15 3729 -3807 -335 3842 -3485 -283 4099 -2977 -873 4235 -2739 -1449 4113 -2920
2489 -2920 -2213 4728 -2858 -2112 5056 -2477 -2547 4989 -2433 -2794 5216 -2538 -2699 5110 -1824 -2675 5026
2506 5026 -1975 -3098 4810 -1937 -3127 4706 -1542 -3331 4678 -1596 -3429 4739 -934 -3125 4478
2521 4478 -748 -3347 3867 -588 -3381 3415 -547 -3428 3509 510 -3739 3003 1066 -3757 2933
2536 2933 1016 -4317 2666 1403 -3448 2484 1926 -3634 2052 2114 -4321 1717 1978 -4636 1465 2141
$$ packed form
2428H2m924Q439k803n406Q135k207o003Q271k002o075P597j827o341Q786j772
2443A950o600P610p23p332P856p73p106P493r8p395P436L13p471P248N13p500
2459d579O583J124p930O408J090p452N837J888p031N080K570p389M091L370p206
2474c546L531L744p536L472M177p327L202M382p076K104N108o974J290N562p033
2489b920P07O941p586P46P168p533p0P536p422l61Q010p754j61P809o934q51P701
2506E026p001j123P908o747j190P833o248j789Q009o274j833Q168n673k191P603
2521D478n226k599P214m455k793O796l962k881O937k999m249O742j937m823O690
2536B933j917n333O983j263m851N932n58n560N686O2o435O038K61o614O101O76
$$ plain form
2552 2141 -4713 1477 3025 -4142 1757 3575 -3935 1548 3509 -4364 1350 2986 -4841 514 2705
2567 2705 -4607 491 3344 -4167 549 4084 -3497 671 3750 -3840 192 3409 -3625 -161 3272
2582 3272 -3334 -324 3245 -2886 -1250 3376 -2949 -889 3635 -2288 -1197 3635 -1785 -1014 3758
2597 3758 -1722 -1556 3371 -2014 -2316 3119 -2105 -2725 3534 -1477 -2462 4179 -744 -2377 3853 -571
2613 -571 -2808 3863 -733 -2673 3335 -1073 -3343 3143 -634 -3456 3560 -182 -3143 3386 183
2628 183 -3113 3726 241 -2757 3475 333 -3270 2720 71 -3879 2381 -61 -3817 2048 1094
2643 1094 -3353 2440 1452 -3154 2280 1968 -2951 1723 1334 -3346 1742 1588 -3761 829 1500 -3171
2659 -3171 1193 2386 -3046 589 2633 -2537 808 2999 -2793 298 3010 -2781 -96 2769 -3176
$$ packed form
2552B141o854O190J548p167N899J818p510N483J961p873N714J636p827N355K191
2567B705p312N098K853p511M716L535p581M168L079p590M032L217p034L464L433
2582C272o606L010L569o131J636M626o325K060M524n923J091M832n420P71M772
2597C758n480J66M927n385l02N435n224o20O259n011r85O641m923j633O230m424
2613e71k237O671m596j940O008m408k270O486l777k822P016l742k961O529l203
2628A83l296O839l485k998O232l142l603N990k649l950O260k442l756N865r54
2643A094m447N793r88m606N434l12m919M674l89m680N088j54n349M590O71m671
2659c171M364J193n432L635K044n170L345K191n792L091K712n791K685K865n945
$$ plain form
2674 -3176 -377 3015 -3208 -1028 3094 -2645 -711 3673 -2422 -942 4166 -2191 -828 3958 -2712
2689 -2712 -1467 3865 -2577 -2119 3342 -2959 -1707 4047 -2265 -1786 4151 -1715 -1634 4091 -1985 -1587
2705 -1587 4182 -1840 -2116 3692 -2085 -2271 3305 -1884 -2696 3230 -1251 -1983 3665 -529 -1765 3809
2721 3809 -386 -2355 3233 -718 -2894 2897 -445 -2954 2612 -395 -2871 2696 523 -2943 2668
2736 2668 690 -3188 2177 1054 -3230 2396 1464 -3425 2221 1394 -3761 1993 1392 -4407 1959 1352
2752 1352 -3925 2072 1766 -3651 2443 2327 -3214 2096 2005 -3967 1452 1770 -3964 1029 1646 -3642
2768 -3642 1228 1827 -3095 1189 2441 -2670 1181 2158 -2827 859 1918 -2715 28 2514 -2527
2783 -2527 -132 2496 -2257 -422 2462 -2145 -704 2754 -2008 -1017 2576 -1245 -1247 2791 -1324 -1882
$$ packed form
2674c176K799L392o223K180M122n739J934M384o095J480N108o357J363M786o670
2689b712J245N332o442M58N461o301J252N754o312M79N937n866Q1N725o076L98
2705a587N769o022k76N808n777j86N576n189q12N926m481p32N648m194j236N574
2721C809m195j969N588l951k176N791l342k509N566l007k476N567k173l466N611
2736B668j978l878N365j123m284N626r32m889N646q27n155N754o01n799O366o07
2752A352n277N997l06n417O094j16n541N310r1n972N419L18n734M993O17n288
2768c642M870N99m922M284J252n111L851R77m985L686J059m633K743K486n041
2783b527K395K628m753J835K884m607J441L458m762R91L593l821kM038m115n58
$$ plain form
2799 -1882 3614 -1153 -2356 3068 -1299 -2294 3285 -1200 -2384 3762 -669 -2436 3884 -935 -2677
2814 -2677 3552 -1088 -2968 3566 -734 -2961 3840 -696 -3071 3532 -452 -2972 3304 -643 -3075
2829 -3075 3217 -240 -2670 3558 -19 -2845 2836 387 -3128 2247 351 -3216 2148 785 -2948
2844 -2948 2445 888 -2859 2161 983 -3074 1875 1346 -3248 1028 1640 -3283 1391 1791 -3242 1375
2860 1375 2006 -3195 1189 1925 -3485 782 2327 -3426 942 2284 -3440 874 2185 -2820 843
2875 843 2461 -3119 445 2664 -3036 278 2622 -2906 203 2604 -2690 304 2706 -2767 -82
2890 -82 2384 -2241 174 2768 -1857 -365 2580 -1785 -766 2597 -1628 -1038 2531 -1889 -928 2319
2906 2319 -1228 -1003 2355 -1149 -1316 2473 -892 -1483 2514 -615 -1859 2323 -638 -1670 2464 -51
$$ packed form
2799a882N496m767j203N424m367r95N579m485j184O146m431j767O320m819j742
2814b677O229m640j880O534m300k227O801m536k375O603l984k520O276l947k432
2829c075O292l457k430O228l577k826N681k449l515N375j896l567N364j363l733
2844b948N393j557l747N020j178m057M949n29m594M276O12m923M674M00n033M617
2860A375O31n201M384P36n410M267J545n753M368J342n724M314J311n005L663
2875H43J618n580L564K219n700L314K344n528L109K401n294K994K402n473K685
2890h2K466m625K415K594m625J492K945m365J019L363m225N90L569m420R61L247
2906B319l547K25L358l504j67L789l365n91L997l129j244M182k961j032M134k515
$$ plain form
2922 -51 -2131 2580 -147 -2132 2344 -325 -2478 2148 209 -2045 2027 593 -2205 2252 320
2937 320 -2432 2015 108 -2814 1800 498 -2730 1727 1142 -2620 1355 1175 -2265 1558 1213 -2486
2953 -2486 1185 1452 -2851 1370 1345 -2791 967 1660 -2668 1199 2126 -2726 640 1878 -2361 577
2969 577 2190 -2315 478 2111 -2771 20 2265 -2748 25 2294 -2939 -55 2635 -2237 134
2984 134 2465 -2085 51 2576 -2409 -633 2567 -2247 -570 2790 -2349 -576 2639 -1871 -854
2999 -854 2375 -1908 -684 2607 -1746 -561 2745 -1415 -664 2886 -1187 -1131 2396 -1702 -1547 2056
3015 2056 -1392 -1563 2154 -1147 -916 2547 -655 -963 2393 -132 -1549 1785 -585 -2032 1832 -388
3031 -388 -2261 1818 160 -1955 2047 377 -1829 1987 299 -2135 1766 511 -2486 1545 667
$$ packed form
2922e1k080M711k727j985M476k669k153M626j939k254M072j434k798M457j932
2937C20k752M447j907k922M614j302l228M457n85l762L975j80l440L823l45l699
2953b486L671K67m303M221k5m136L758O93m328L867R27m852L366J238m239K938
2969E77J613m505K793J633m882K791K245n013K773K269n233K884K690m872K371
2984A34K331m550K136K525m985J776L200m814J677L360n139J773L215m510J017
2999h54L229m283J224L291m353J185L306m160P51L550m073N6L527m098J55L603
3015B056l448j71L717l301K31L463l202l08L356k525j417L334k370j447L864k220
3031c88j873M079j658k115M002j670k206L816j688k434L901j255k997M031q78
$$ plain form
3046 667 -2216 1805 866 -2755 1517 959 -2761 1282 742 -2514 1671 1200 -2267 1502 1584 -2172 1358
3063 1358 1346 -2628 814 1116 -2860 526 1004 -2750 675 1599 -2310 891 1729 -2405 883 1978
3079 1978 -2185 134 1894 -2153 56 1732 -2134 -106 2124 -2016 -209 2380 -1594 -332 2432
3094 2432 -1639 -415 2393 -1850 -768 2601 -1503 -1108 2309 -1503 -1407 2424 -1301 -1302 2806 -1156
3110 -1156 -1216 2883 -1225 -1509 2900 -1146 -1540 2964 -1040 -1887 2605 -718 -1612 2581 -1044 -1972 2827
3127 2827 -879 -1787 2603 -891 -1687 2718 -435 -1952 2339 -566 -2162 2069 -631 -2149 1851
3142 1851 29 -2044 2108 187 -1862 1998 413 -2093 1683 519 -2355 1494 625 -2378 1123
3157 1123 1103 -1780 1002 1472 -2140 907 1248 -2353 715 1258 -2468 1118 1932 -2410 842 1716 -2237
$$ packed form
3046F67k883M021r39l621M272n58l720M043n40l256M185m71l467L769Q2l756L530
3063A358j2l974L442L02l976L386M78l754L425R24l909L201Q38m134L288J095
3079A978m163K319J760m047K209J676l866K028K230m140J807K589l974J262K764
3094B432m071J224K808m243J082L369m104L95L417l812R6L831l725jM108l962
3110a156o0M099m108k84M409m046l94M504m004q47M492l323q94M193l625r28M799
3127B827l706r08M390l494p96M405l153j517M291k905j596M231k700j518M000
3142A851j822k073M152j921k049L860j585k506L776j164k874L849q69l003L501
3157A123k0k883K782M70l612L047L41l601L068N43l726L586Q14m342L252Q74l953
$$ plain form
3174 -2237 573 1818 -2216 372 1755 -2516 291 1982 -2170 294 2341 -2407 239 2124 -2416
3189 -2416 -15 2066 -2344 -142 2001 -1934 -96 2287 -1593 -66 2059 -1622 -464 1848 -1824
3204 -1824 -768 2115 -1696 -667 2185 -1107 -739 2162 -968 -1063 1971 -1045 -1187 2067 -923 -1418
3220 -1418 2068 -754 -1685 2521 -297 -1555 2139 -435 -1699 2134 -731 -1909 1817 -196 -1870
3235 -1870 1885 -166 -1746 2400 130 -1929 2008 215 -2058 1834 316 -1875 1596 336 -2032
3250 -2032 2001 218 -2010 1524 362 -1917 1331 690 -2054 1368 922 -1765 1036 878 -1809 1171
3266 1171 1121 -1901 532 1191 -1531 689 1246 -2038 672 1406 -1787 -80 1247 -1584 370 1715
3282 1715 -1612 163 1855 -2082 -138 1566 -1909 -312 1845 -1921 -296 1927 -1824 -129 1993
$$ packed form
3174b237K810J245m034K588J383m271K807J691m152K464K047m748K646J885m540
3189b416K401K081m410K202K143l935J838K383l880J527K125l681J158K312l672
3204a824J056K883l811J029K852l292L68K901l130r5L034l016j42L254k990m95
3220a418L486k822r31M206k818j258L694k574j264L833k865j178L726k013j674
3235a870L755k051j580M146k270k059L937j793k273L892j518k191L471j260k368
3250b032M033j783k228L534j162k279L248o41k744L422m46k687K801j58k687K980
3266A171n0l022K433O59k722K220N57l284K710P34l193J707J327k831J954J345
3282A715l327J775J692l937J944J704l475J597K157l766J625K223l751J695K122
$$ plain form
3297 1993 -1119 -239 1888 -1508 -569 1596 -1771 -490 1705 -1604 -312 2312 -1304 -429 2206 -1088
3313 -1088 -1074 1785 -1279 -1204 1339 -1220 -942 1999 -596 -679 2013 -804 -722 1901 -603 -1179 1407
3330 1407 -596 -1352 1568 -109 -1102 1474 221 -1381 1619 -162 -1420 1265 -318 -1419 1279
3345 1279 -89 -1763 1473 258 -1294 1398 576 -1557 1185 584 -1892 993 345 -1883 1084 443
3361 443 -1639 1088 888 -1704 947 586 -1622 474 829 -1755 727 582 -1562 589 772 -1600
3377 -1600 544 1079 -1718 709 1087 -1323 442 1245 -1662 199 1096 -1350 -139 1091 -1264 262
3393 262 1350 -1318 199 1690 -1435 -279 1553 -1261 -341 1348 -1028 -523 1449 -1019 -338 1680
3409 1680 -712 -673 1827 -953 -893 1674 -883 -1027 1287 -797 -1139 1975 -353 -1171 1965 -280 -983
$$ packed form
3297A993l112Q80K127l396R39K165l367J281K195l309J292K624l616Q75K635l294
3313a088J4K859l064P5K543k559K78K941k595q3K692k817Q2K623k504n76K586
3330A407k003p56K920j677r93K576j253j602L000j781j258K685j583j101K698
3345A279j368j674L236j215j552K692q22k133K742o01k476K885o48k228K967o41
3361D43k082K727k00k592K651l61k208K096L55k584K482j45k144K151J83k372
3377a600K144N35k797K427L78k410J765Q03k907J861Q97k446J211J230k355J526
3393B62J088k668J517J491l125J156J832k814R20J689k376N05J972k468O81K018
3409A680k392L9K500k780O0K567k557j44K314k084l42L114k328q18L136k245p03
$$ plain form
3426 -983 1764 -598 -1470 1456 -604 -1430 1785 -604 -1466 1907 -192 -1388 2043 -122 -1446 1565
3442 1565 -536 -1562 1609 -469 -1380 1797 234 -1233 1601 423 -1457 1348 82 -1535 1063
3457 1063 225 -1425 1426 435 -1138 1229 584 -1397 984 363 -1350 644 907 -1886 601 994
3473 994 -1429 504 1097 -1674 554 1322 -1459 667 1151 -1749 408 1106 -1773 523 1305 -1929
3489 -1929 200 1422 -1642 318 1243 -1350 160 1317 -1269 243 1609 -1137 -137 1419 -1048
3504 -1048 -24 1269 -1216 -188 1367 -1068 -495 1597 -754 -276 1479 -771 -591 1395 -1139 -942
3520 -942 1553 -675 -918 1478 -658 -1061 1243 -422 -1088 1462 -242 -1042 1596 -26 -957 1512
3536 1512 169 -1218 1430 -453 -1426 1260 -92 -1649 1155 161 -1340 1330 525 -1323 1720 161
$$ packed form
3426i83K747k362q72K926k060q26L215k389q62L373k099j196L431k165j324L011
3442A565k101j026L171k078r11L177j563j467K834j178j880K805j266j617K598
3457A063q38j650K851r91j573K367o45j981K381o21j713J994K63k793K487L93
3473I94k423J933N93k771K228P68k781K126M84k900K157O98k879K296P82l234
3489a929K129J222l064J960R25k593J510J157k586J512J366k746J000J556k467
3504a048J024J293k485J028J555k435N73K092k351M78J755k250J80J986k534J97
3520i42K495k228k43K396k136m03K304j665o66K550j704q00K638j622r31K469
3536A512j343j387K648j883r73K686j352j557K804r94j501K670q05j848L043j559
$$ plain form
3552 161 -1478 1202 255 -1969 1499 212 -1566 1059 464 -1336 943 401 -1408 1193 818 -1145
3568 -1145 1083 687 -1403 976 762 -1450 487 503 -1784 428 711 -1529 13 1150 -1494 310
3584 310 1461 -1029 460 1390 -1456 181 1200 -1511 -113 1177 -1681 -94 1258 -1184 157
3599 157 1429 -969 -42 1408 -1140 -24 1393 -1120 -83 1242 -1503 -297 1646 -1062 -97 1488
3615 1488 -708 -405 1078 -1046 -673 1391 -899 -372 1508 -522 -382 1385 -813 -686 1173 -662
3631 -662 -1050 645 -566 -774 1075 -257 -638 1352 0 -876 1207 36 -1159 1119 160 -1383
3647 -1383 1174 -10 -1429 907 -21 -1307 1186 212 -1062 1014 387 -1129 973 509 -1762 759
3663 759 382 -1481 1022 576 -1796 704 909 -1440 943 791 -1215 599 782 -1217 506 784 -1481
$$ packed form
3552A61j639K680r47k224L468j287j778K625n95j800K279n42j809K601l75j963
3568a145K228l96k090K379k14k212J937J6k287K212K83k240J542J137k644J804
3584C10J151k490J489R30k846J637J019k711J398J290k858J587J352k442J341
3599A57J272k398R27J450k548J116J417k513J037J325k745J206J943k708R65J585
3615A488k196L03J483k124L73K064k290N27J880k030J40J767k198J27J859j835
3631f62l88J695j211k08J849j332l81J990j352q76K083j171j195K278r59j543
3647a383K557j184j419K336r28j286K493r74j274K076o27j516K102m64k271K521
3663G59l77j863K503m46k372K500K05k349K383j52k006J814J83j999J723K78k265
$$ plain form
3680 -1481 321 889 -822 373 999 -1151 444 1140 -1325 343 885 -1236 226 816 -1303 161
3696 161 1151 -573 292 1178 -1016 -217 1113 -1199 -371 1067 -1058 -391 1342 -771 -84 1361 -414
3713 -414 -244 1270 -808 -744 1017 -983 -1011 1473 -782 -569 1620 -316 -485 1708 -248 -666 1327
3730 1327 -678 -947 1125 -698 -872 1184 -582 -673 1539 188 -779 1404 -314 -1011 991 -268
3746 -268 -917 1138 -514 -973 1276 122 -917 1152 24 -1067 939 212 -1307 829 113 -1091
3762 -1091 828 439 -1217 843 302 -769 867 424 -1195 577 487 -1072 243 588 -951 452
3778 452 944 -1345 597 1152 -981 547 801 -1182 333 739 -1018 213 977 -1397 -112 880 -931
3795 -931 74 1235 -1241 118 1210 -1014 -85 1333 -1376 -98 959 -1007 -134 1362 -1008 165
$$ packed form
3680a481J802N68j711J195O26k150J595O96k465J668N42k121J462N90k119J464
3696A61R90j724Q65Q86k194P99J330k312Q28J438k125O67J733k113O87J445j775
3713d14J70J514k078O4J761k000k8K484k255K13K189j936j69K193j956m18J993
3730A327k005k69K072j823j74K056j766r1K212j351r67K183j718o97K002j259
3746b68o49K055j652m59K249j154j039K069j128j091K006p27j519K136p16j204
3762a091J919l89j656K060n41j071J636m43j619J772r0j559J315L45j539J403
3778D52M92k289J942N55k133J528K54j983J515M06j757J231P64k374J285R92j811
3795i31J005J161k476J359J092k224R29J418k709J278J057j966Q73J496k370J173
$$ plain form
3811 165 1142 -892 -315 1068 -691 -454 904 -874 -745 1246 -554 -517 1500 -315 -302 1187 -287
3828 -287 -572 756 -636 -996 979 -360 -705 1265 -82 -1044 1109 -215 -1021 1343 -171 -1134 1065
3845 1065 -303 -1139 1134 -21 -1156 1022 284 -1053 810 208 -1262 1216 11 -1527 831 105
3861 105 -1383 1077 403 -1355 1073 346 -1437 662 91 -1049 683 298 -1246 642 596 -1211 730
3878 730 446 -1300 763 618 -1393 540 742 -1059 344 782 -1408 257 857 -1041 177 858 -1246
3895 -1246 -135 810 -1163 239 983 -970 70 1170 -969 150 1218 -990 -352 843 -805 -108
3911 -108 1203 -631 -396 1427 -909 -490 1255 -969 -507 915 -969 -278 1010 -1076 -327 1015
3927 1015 -695 -603 1244 -340 -852 1047 -619 -940 1047 -473 -270 1265 -227 -742 1192 25
$$ packed form
3811A65R77k034N77J383j759K37J358j778J29J991j800L7K017j815J3J489j474
3828b87k85J328j392l60J975j339l45J970j347r62K153j324q06K364j514r63K199
3845A065j368q36K273j155j135K178p38j337J863o02j470K478j205j538K358p26
3861A05j488K460o74j758K428p27j783K099n71j140J732l85j544J888m6j807J941
3878G30k84j746K063j45k011J933K02j801J403M38k190J665O00j898J218O81k104
3895a246J111R45j973J402P44j953J040J100k139J119J068k208O38J195j648O97
3911a08J311j834K35J823k336M19J745k224M62J422j884O91J288k086P49J342
3927A015j710R2J847j584n12J899j666l21J987j520K03J535j492n15J934j167
$$ plain form
3943 25 -824 855 -359 -946 915 -215 -945 987 111 -1026 1133 269 -1145 844 202 -929 796
3960 796 99 -1073 931 311 -1265 1036 203 -1224 672 439 -1374 839 470 -815 597 422 -946
3977 -946 607 345 -1124 920 344 -1089 375 788 -800 602 448 -1024 611 624 -1040 332 522
3994 522 -1182 -45 425 -890 251 710 -955 532 1047 -559 126 597 -841 -364 765 -704 -66
4011 -66 985 -614 45 1237 -886 -188 1115 -1019 -759 796 -737 -285 891 -560 -288 1067 -303
4028 -303 -93 884 -491 -379 615 -629 -788 919 -686 -656 866 -222 -597 1086 -515 -537 1242 -188
4046 -188 -873 958 -247 -669 675 -180 -543 1127 -100 -852 1119 -30 -857 767 124 -655 832
4063 832 -261 -811 1105 6 -705 717 79 -774 885 217 -568 767 -8 -931 440 393 -1047 274
$$ packed form
3943B5q49J679j214n87J861j130p30J932q76j137K159q64j414J989o42j131J725
3960G96o97j172K004o20j576K301q33j427J896k33j813K213l69j285J412j75j368
3977i46J553k62j469K044n76j433J464M13j588J402j54j472J635J3j664J372J90
3994E22j704J137M70j315J141M59j665J487N15j606O85M71j438M77J129j469O38
4011f6J051j599O59J192k123O98J303k134K60J555j533M52J176j451K72J355j370
4028c03K10R77j375J12R94j244j59J707j605L0J522j088l75J683j601k2J779j430
4046a88o85J831j205m22J344q55l63J670j227p52J971j149q27J624o43p79J487
4063H32j093n50J916j099p11J422o38q53J659o68p85J335p75r23J371m7j440J321
$$ plain form
4081 274 529 -824 534 658 -820 329 536 -1167 637 500 -1262 135 620 -1208 130 659 -689
4098 -689 502 691 -992 171 835 -1038 -113 679 -865 -209 690 -830 267 928 -465 18 1013
4115 1013 -722 213 388 -984 -35 563 -749 -4 757 -283 -110 819 -353 -273 1115 -392 -376 626
4133 626 -441 -657 718 -127 -378 851 2 -590 848 -189 -688 693 -102 -445 693 -129 -634 1028
4151 1028 108 -792 861 10 -557 684 -308 -914 850 -303 -848 691 243 -779 737 197 -630
4168 -630 770 380 -810 776 491 -810 705 173 -710 696 574 -883 548 727 -638 423 671
4185 671 -627 349 238 -764 333 431 -972 87 243 -798 303 397 -1079 265 431 -929 32
4202 32 921 -741 -41 616 -782 111 651 -795 392 631 -718 92 941 -544 -124 871 -459 -173
$$ packed form
4081B74K55j353J358J24j478J149K07j703J804j37j762J397M85j828J338N29j348
4098f89J191J89j683J163O64j873R25P92j544O56Q99j520J097O61j393M83R95
4115A013j735R35J75j372R49N98j312P45P61j040J73R29j172Q0J388j507J6J002
4133F26j067k16J375q45k51J229q49n92J438j037m99J381p95l43J138q22n05J662
4151A028r20r00J653q51n67J241r92o06J764j153n45J539m48j022J516n40q27
4168f30J400l90j190J586k85j301J515n32q83J406j22j457J431J79j365J061K48
4185F71j298R76j11j002J097R8j403J059J56j041J101R4j476J344J66j360R61
4202C2Q89j662P00O57j398Q93N40j446J187K39j349Q10Q49j485M20R95j330K86
$$ plain form
4220 -173 697 -770 -24 949 -461 -97 672 -431 -304 924 -552 -469 639 -480 -622 993 -419
4237 -419 -419 1112 -153 -114 1028 -467 -329 697 -419 -722 617 -220 -548 665 -84 -429 883 211
$$ packed form
4220a73Q70j467P46R73j410L64P69j103J27J228j476Q3J108j119j42J615j412
4237d19%J531j265L9J142j495J38J026j116l03J339q37l28J213p49l45J312o72
$$ [...]
8191e2
##END NTUPLES=NMR FID
##END=
