##TITLE=1H_B4e-R1
 CDCl3
 8 sc, 
 13.8.2024
##JCAMPDX= 6.0         $$ Bruker NMR JCAMP-DX V2.0
##DATA TYPE= NMR FID
##DATA CLASS= NTUPLES
##ORIGIN= UXNMR, Bruker Analytische Messtechnik GmbH
##OWNER= root
$$ XWIN-NMR		Version 3.5
$$ Tue Aug 13 13:56:18 2024 Russian Standard Time (UT+4h)  she@DPX200
##.OBSERVE FREQUENCY= 200.1313
##.OBSERVE NUCLEUS= ^1H
##.DELAY= (6, 6)
##.ACQUISITION MODE= SIMULTANEOUS
##.ACQUISITION SCHEME= undefined
##.AVERAGES= 8
##.DIGITISER RES= 18
##SPECTROMETER/DATA SYSTEM= spect
##.PULSE SEQUENCE= zg30
##.SOLVENT NAME= DMSO
##.SHIFT REFERENCE= (INTERNAL, DMSO, 0, 15.7039)
##AUDIT TRAIL= $$ (NUMBER, WHEN, WHO, WHERE, WHAT)
$$ ##TITLE= Audit trail, XWIN-NMR		Version 3.5
$$ ##JCAMPDX= 5.01
$$ ##ORIGIN= Bruker BioSpin GmbH
$$ ##OWNER= she
$$ F:/spectra/data/she/nmr/H-F/1/audita.txt
$$ ##AUDIT TRAIL=  $$ (NUMBER, WHEN, WHO, WHERE, WHAT)
(   1,<2024-08-13 13:54:47.06 +0400>,<she>,<DPX200>,
      <created by zg, POWCHK disabled, PULCHK disabled
       configuration hash MD5:
       00 E9 B6 7A A2 85 ED C7 34 08 36 98 17 FE 4E 26
       data hash MD5: 16K
       E5 3D DE 80 69 CF 09 A4 27 37 DD 3C 4F AC 69 44>)
$$ ##END=
$$ 
$$ hash MD5
$$ 49 B2 9C 8A 52 8E 8D FA FE 25 AD EF C2 90 92 FE
##$RELAX= 
##$RELAX= 
##$RELAX= 
##$RELAX= 
##$RELAX= 
##$RELAX= 
$$ Bruker specific parameters
$$ --------------------------
##$DU= <F:/spectra>
##$EXPNO= 1
##$NAME= <H-F>
##$PROCNO= 1
##$TYPE= <nmr>
##$USER= <she>
##$AMP= (0..31)
100 100 100 100 100 100 100 100 100 100 100 100 100 100 100 100 100 100 
100 100 100 100 100 100 100 100 100 100 100 100 100 100 
##$AQSEQ= 0
##$AQ_mod= 1
##$AUNM= <au_zg>
##$AUTOPOS= <>
##$BF1= 200.13
##$BF2= 200.13
##$BF3= 200.13
##$BF4= 200.13
##$BF5= 200.13
##$BF6= 200.13
##$BF7= 200.13
##$BF8= 200.13
##$BYTORDA= 1
##$CFDGTYP= 0
##$CFRGTYP= 5
##$CHEMSTR= <none>
##$CNST= (0..31)
1 1 145 1 1 1 1 1 1 1 1 1 1 1 1 1 1 1 1 1 1 1 1 1 1 1 1 1 1 1 1 1 
##$CPDPRG= <>
##$CPDPRG1= <>
##$CPDPRG2= <>
##$CPDPRG3= <>
##$CPDPRG4= <mlev>
##$CPDPRG5= <mlev>
##$CPDPRG6= <mlev>
##$CPDPRG7= <mlev>
##$CPDPRG8= <mlev>
##$CPDPRGB= <>
##$CPDPRGT= <>
##$D= (0..31)
0 1.2 0 0 0 0 0 0 0 0.06 0 0.03 0 0 0 0 0.0002 0 0 0 0 0 0 0 0 0 0 0 0 
0 0 0 
##$DATE= 1723542886
##$DBL= (0..7)
120 120 120 120 120 120 120 120 
##$DBP= (0..7)
150 150 150 150 150 150 150 150 
##$DBP07= 0
##$DBPNAM0= <>
##$DBPNAM1= <>
##$DBPNAM2= <>
##$DBPNAM3= <>
##$DBPNAM4= <>
##$DBPNAM5= <>
##$DBPNAM6= <>
##$DBPNAM7= <>
##$DBPOAL= (0..7)
0.5 0.5 0.5 0.5 0.5 0.5 0.5 0.5 
##$DBPOFFS= (0..7)
0 0 0 0 0 0 0 0 
##$DE= 6
##$DECBNUC= <off>
##$DECIM= 24
##$DECNUC= <off>
##$DECSTAT= 4
##$DIGMOD= 1
##$DIGTYP= 9
##$DL= (0..7)
0 120 120 120 120 120 120 120 
##$DP= (0..7)
150 150 150 150 150 150 150 150 
##$DP07= 0
##$DPNAME0= <>
##$DPNAME1= <>
##$DPNAME2= <>
##$DPNAME3= <>
##$DPNAME4= <>
##$DPNAME5= <>
##$DPNAME6= <>
##$DPNAME7= <>
##$DPOAL= (0..7)
0.5 0.5 0.5 0.5 0.5 0.5 0.5 0.5 
##$DPOFFS= (0..7)
0 0 0 0 0 0 0 0 
##$DQDMODE= 0
##$DR= 18
##$DS= 0
##$DSLIST= <SSSSSSSSSSSSSSS>
##$DSPFIRM= 0
$$ [...]
##$SUBNAM2= <"">
##$SUBNAM3= <"">
##$SUBNAM4= <"">
##$SUBNAM5= <"">
##$SUBNAM6= <"">
##$SUBNAM7= <"">
##$SUBNAM8= <"">
##$SUBNAM9= <"">
##$SW= 24.0689771365484
##$SWIBOX= (0..15)
0 0 2 0 0 0 0 0 0 0 0 0 0 0 0 0 
##$SW_h= 4816.95568400771
##$TD= 16384
##$TD0= 1
##$TE= 0
##$TE2= 300
##$TE3= 300
##$TEG= 300
##$TL= (0..7)
0 120 120 120 120 120 120 120 
##$TP= (0..7)
150 150 150 150 150 150 150 150 
##$TP07= 0
##$TPNAME0= <>
##$TPNAME1= <>
##$TPNAME2= <>
##$TPNAME3= <>
##$TPNAME4= <>
##$TPNAME5= <>
##$TPNAME6= <>
##$TPNAME7= <>
##$TPOAL= (0..7)
0.5 0.5 0.5 0.5 0.5 0.5 0.5 0.5 
##$TPOFFS= (0..7)
0 0 0 0 0 0 0 0 
##$TUNHIN= 0
##$TUNHOUT= 0
##$TUNXOUT= 0
##$USERA1= <user>
##$USERA2= <user>
##$USERA3= <user>
##$USERA4= <user>
##$USERA5= <user>
##$V9= 5
##$VALIST= <valist>
##$VCLIST= <CCCCCCCCCCCCCCC>
##$VD= 0
##$VDLIST= <DDDDDDDDDDDDDDD>
##$VPLIST= <PPPPPPPPPPPPPPP>
##$VTLIST= <TTTTTTTTTTTTTTT>
##$WBST= 1024
##$WBSW= 4
##$XGAIN= (0..3)
0 0 0 0 
##$XL= 0
##$YL= 0
##$YMAX_a= 304456
##$YMIN_a= -262513
##$ZGOPTNS= <>
##$ZL1= 120
##$ZL2= 120
##$ZL3= 120
##$ZL4= 120
##$ABSF1= 10
##$ABSF2= 0
##$ABSG= 5
##$ABSL= 3
##$ALPHA= 0
##$AQORDER= 0
##$ASSFAC= 0
##$ASSFACI= 0
##$ASSFACX= 0
##$ASSWID= 0
##$AUNMP= <proc_1d>
##$AZFE= 0.1
##$AZFW= 0.1
##$BCFW= 1
##$BC_mod= 2
##$BYTORDP= 1
##$COROFFS= 0
##$CY= 11.3945322036743
##$DATMOD= 1
##$DC= 2
##$DFILT= <>
##$DTYPP= 0
##$F1P= 15.6554695791079
##$F2P= 12.8336369535428
##$FCOR= 0.5
##$FTSIZE= 0
##$FT_mod= 4
##$GAMMA= 1
##$GB= 0.15
##$INTBC= 1
##$INTSCL= 1
##$ISEN= 128
##$LB= 0.24
##$LEV0= 0
##$LPBIN= 0
##$MAXI= 10000
##$MC2= 0
##$MEAN= 0
##$ME_mod= 0
##$MI= 1.114404
##$NCOEF= 0
##$NC_proc= 0
##$NLEV= 6
##$NOISF1= 3.799351
##$NOISF2= 2.8
##$NSP= 1
##$NTH_PI= 0
##$NZP= 0
##$OFFSET= 15.70392
##$PC= 1
##$PHC0= -25996.35
##$PHC1= 12.98749
##$PH_mod= 1
##$PKNL= yes
##$PPARMOD= 0
##$PSCAL= 0
##$PSIGN= 0
##$REVERSE= no
##$SF= 200.130013532006
##$SI= 16384
##$SIGF1= 3
##$SIGF2= 2
##$SINO= 400
##$SIOLD= 16384
##$SREGLST= <1H.CDCl3>
##$SSB= 0
##$STSI= 0
##$STSR= 0
##$SW_p= 3612.71676300578
##$SYMM= 0
##$S_DEV= 0
##$TDeff= 0
##$TDoff= 0
##$TI= <>
##$TILT= no
##$TM1= 0
##$TM2= 0
##$TOPLEV= 0
##$USERP1= <user>
##$USERP2= <user>
##$USERP3= <user>
##$USERP4= <user>
##$USERP5= <user>
##$WDW= 1
##$XDIM= 8192
##$YMAX_p= 0
##$YMIN_p= 0
$$ End of Bruker specific parameters
$$ ---------------------------------
##NTUPLES= NMR FID
##VAR_NAME=  TIME,          FID/REAL,        FID/IMAG
##SYMBOL=    X,             R,               I
##VAR_TYPE=  INDEPENDENT,   DEPENDENT,       DEPENDENT
##VAR_FORM=  AFFN,          ASDF,            ASDF
##VAR_DIM=   8192,          8192,            8192
##UNITS=     SECONDS,       ARBITRARY UNITS, ARBITRARY UNITS
##FACTOR=    0.0002076,     1,               1
##FIRST=     0,             0,               0
##LAST=      1.7004516,     0,               0
##MIN=       0,             -262513,         0
##MAX=       1.7004516,     304456,          0
$$ Real data points
##PAGE= N=1
##DATA TABLE= (X++(R..R)), XYDATA
$$ [...]
2368C230m675m68N191m507q97N605m162j706N498l908j837N475l640j762N538
2383B975l842j765N873l720k022N595l346k766N736k686l115N758k607k904N622
2398B786k650k865N396k396l202N264k182l164N184j595l267M878j228l470M528
2413B017j001l751M350p52l958M584l45m002M455j19m161M098K33m309L647R00
2429A886m624L420J256m615L279J382m678L116J737m787K983J987n227L053K206
2444B374m955K545K427m834K316K480m571K186K570m876K048K656m752K225K752
2459B591m573J458L117m369J007L224l949P11L251l977M20L326l507J96L488l745
2475a331K83L651l615o53M209l397j073M483l078j247M292l175j170M338k847
$$ y = [3230, -1445, -1913, 3278, -1229, -2126, 3479, -683, -2389, 3109, -799, -2636, 2839, -801, -2563, 2975, -867, -2632, 3241, -479, -2501, 3094, -252, -3018, 2718, 32, -3083, 2675, 68, -2836, 2786, 136, -2729, 2667, 271, -2931, 2333, 151, -3013, 2171, 576, -2691, 2187, 959, -2511, 2017, 1016, -2735, 1615, 863, -3095, 1489, 1144, -2858, 1597, 1478, -2683, 1415, 1648, -2661, 986, 1886, -2738, 682, 1938, -2677, 602, 1984, -2694, 422, 2159, -2628, 355, 2342, -2885, 168, 2374, -2581, -36, 2391, -2443, -127, 2353, -2218, -32, 2538, -2338, -290, 2366, -2386, -161, 2591, -1982, -524, 2593, -1776, -769, 2455, -1494, -783, 2468, -1509, -1089, 2237, -1270, -1074, 2414, -1331, -1048, 2603, -1012, -1665, 2544, -853, -1926, 2557, -521, -1768, 2524, -651, -1821, 2517, -330]
2490c30j605M422k984j775M819k882j947M942k653k448M883k384k314M718k716
2505b54k032M607k236k293M591k281k372M514j946k756M427j359l156L995r60
2520D89k420L563q46k910L774p38k953L216n5l636L449J83l636L441O30l914K994
2537F31J157m104L081J059m184K767J726m374K822J682m682K712K014m583K408
2552A32J993m619K381K282m594K435K267m437K652J863m393K158K256m549J919
2567b54K410m266J492K587l901J512K498l736J451K401l500O08K777l365N36K778
2583B028l107Q6L113l015l12L241k904o96L662l031p82M080k925q80L760k667
2599c49j286M415l336j461M362k975j626M451k710j755M546k632j444M354k460
$$ y = [-330, -1935, 2487, -497, -2272, 2547, -335, -2282, 2660, 7, -2441, 2442, 58, -2256, 2462, -254, -2286, 2321, 85, -2208, 2383, 102, -2270, 2244, 298, -2458, 1969, 610, -2546, 1449, 489, -1931, 1632, 786, -2124, 1650, 912, -2041, 1175, 1120, -2516, 933, 1116, -2520, 921, 1551, -2363, 631, 1788, -2316, 765, 1824, -2360, 407, 2133, -2241, 581, 2263, -2419, 293, 2307, -2276, 132, 2125, -2494, -113, 2169, -2425, 10, 2277, -2160, 492, 2355, -2038, 120, 2376, -2173, -254, 2156, -2110, -618, 1969, -1932, -420, 2078, -1658, -207, 2194, -1306, -698, 2079, -1286, -750, 2028, -1079, -993, 2120, -895, -1207, 2034, -870, -1566, 2096, -935, -1717, 2363, -562, -1442, 2318, -349, -1635, 2780, -556, -2017, 2345, -630, -2256, 2195, -515, -2270, 2276, -356, -1800, 2554, 94]
2614I4k001M308k635j969M436k319k003M000j919k433M621j894k206L649j541
2629A88k336L662r59k618L798j042k641L593m70l191L305j61l447L260M1l200
2645b218L045M03l525L146N06l530L176Q36m102L033P37l829K718J116l895K638
2661B55J384l604K266J776m152K427J717m104K230J908m204K329J916m251J836
2676b71K137l779J556K484m073J405K718l742J262K679l986J396K692m155R20
2691g57L146l918O15L016l574L44L441l508M31L012l359Q8L565l709n2L510l367
2708a076k07L657l327l89L540l144m82L276k851m96L618k979o45L478k360j145
2724a532L882k476j632L515k171j297L366j776j768L421j381j910L614j575k106
$$ y = [94, -1907, 2401, -234, -2203, 2233, -86, -2089, 1911, -8, -2441, 2180, 286, -1920, 1729, 188, -2148, 1514, 555, -2063, 1735, 693, -1948, 1645, 1175, -2016, 1289, 1128, -2319, 941, 982, -2218, 827, 1230, -2295, 851, 1357, -2173, 1003, 1839, -2263, 770, 1507, -2322, 396, 1512, -2383, 255, 1639, -1965, 301, 2077, -2075, 352, 2069, -2035, 195, 2103, -2101, 228, 2144, -2107, -271, 1866, -1913, -357, 2127, -1946, -541, 2177, -1565, -303, 2376, -1610, -214, 2478, -1677, -757, 2389, -1529, -914, 2102, -1472, -1128, 2313, -1195, -764, 2248, -1111, -1023, 2542, -1167, -1219, 2291, -1076, -1283, 2374, -953, -1342, 2198, -946, -1428, 1848, -1003, -1499, 2119, -860, -1505, 1973, -387, -1532, 2350, -126, -1758, 1757, -414, -1711, 1655, -121, -1889, 1532, 151, -1759, 1855, 280, -1826]
2739a826L552j337k469L755j276k655L840j112k642L743r32k751L758j136k685
2754b173L731q38k910L721o99l072L725n22k985L234j89l010L088k88l013L082
2770H82j75k645K965k9k757K616M05l043K319Q65l137K072R90l218J960J456k995
2787a469J524J423k974J300K116l392J215K101l393Q90K908l455L82K958l472
2802a338N22K880l506O17K974l625L89L258l610P47K982l656N86L301l709J24
2818a064L304l612Q5L289l157K87K999l172l4L272l046l13L268l023l04K898k384
2835g07o01L159k048j074K983k029j060L137k096j271L270j742j637L636j694
2850B26k076L491j219k233L256r10k602L579j028k469L555j117k466L619j023
$$ y = [-1826, 1726, 389, -2080, 1675, 399, -2256, 1584, 472, -2170, 1573, 641, -2110, 1648, 512, -2173, 1558, 720, -2190, 1531, 832, -2240, 1485, 963, -2022, 1212, 1023, -1987, 1101, 813, -2200, 882, 707, -1938, 1027, 998, -1759, 857, 1262, -1781, 538, 1403, -1734, 338, 1328, -1890, 70, 1526, -1469, 55, 1478, -1496, -196, 1920, -1472, -257, 1844, -1549, -659, 2249, -1206, -824, 2134, -1338, -816, 2064, -1442, -825, 2149, -1476, -1087, 2171, -1439, -692, 2290, -1366, -780, 2521, -1188, -1064, 2240, -1372, -1287, 2002, -1155, -868, 2131, -1041, -1075, 2197, -849, -1162, 2106, -917, -1221, 1677, -707, -1308, 1851, -197, -1271, 1712, -317, -1377, 1760, -336, -1607, 1663, -79, -1716, 1920, 226, -1850, 1641, 422, -1811, 1445, 535, -2067, 1512, 484, -1985, 1570, 453, -2013, 1606, 583]
2865E83k631L645p49l167L480m64k755L398n97k717L135q7k980L029l24k849L136
2882A086k61k753K981J8k853K597M13l020K102R38k920J934J022k766J601J105
2898A224k958K044J204k972J633J667l347J312J713k925J191J840k869R23K000
2913A680k763P68K516l398N74K556l182M73K698l074M61K505k787K09K782k940
2929i22o7K870k862j38K942k859j15L121l003j53L077k313n68K669k057q48K807
2946A581k028j081L196k072j074L309j754j755L420j798j548L294j586j745L228
2961A587j551j729L015r55k083L066j027k097L307q60k628L355q76k524L253m38
2977H15k869L240m93k667L181m57k391K822m02k664K852J03l038L125p1k946K658
$$ y = [583, -2048, 1597, 848, -2319, 1161, 697, -2058, 1340, 743, -1974, 1161, 1074, -1906, 1123, 799, -2050, 1086, 825, -1928, 1053, 1071, -1782, 815, 1228, -1792, 310, 1248, -1672, 262, 1284, -1482, 119, 1224, -1734, 310, 1514, -1458, 175, 1842, -1505, -193, 1520, -1405, -214, 1626, -1243, -320, 1680, -1083, -315, 2201, -1197, -623, 1933, -1249, -776, 1922, -1152, -691, 1814, -973, -764, 2018, -922, -989, 1881, -981, -1119, 1823, -1036, -1151, 1970, -1033, -1186, 1891, -422, -990, 1679, -378, -1226, 1581, -447, -1528, 1668, -404, -1478, 1831, 77, -1678, 1742, -56, -1604, 1690, 104, -1641, 1587, 36, -1693, 1322, 367, -1716, 1350, 323, -1774, 1533, 673, -1955, 1400, 524, -2000, 1253, 815, -2054, 1186, 693, -1974, 1207, 750, -1641, 1181, 779, -1885, 967, 1070, -1968, 1157, 1086, -1860, 798]
2994G98K09k845K580J82k751K623K47k710K354N43k747J902Q43k960K138J148
3010A554l190K020J093k858J546J344l096J436J349k676J413J446k634J133J875
3025A755k806J032J862l020O25J963k677O72K000k614P41J866k404M97K138k516
3041h86K25K354k480j28K323k407j23K723k247l25K606k276j34K297k280m07K462
3058A297j843o58K660j714q68K766k040q50K530j701p51K474j619q37K462j393
3074h5j330K737j431r36K454j043j584K425j078j570K323o07j936K739o70j844
3090a436K514o85j898K502n49j997K582m42k012K149J68k282K242m9k447K340
3106G00M9k545K216L88k562K424L88k552K188N88k738K093N12k777J987O32k636
$$ y = [798, 1007, -1838, 742, 924, -1827, 796, 1043, -1667, 687, 1230, -1517, 385, 1228, -1732, 406, 1554, -1636, 384, 1477, -1381, 165, 1509, -1587, -151, 1198, -1478, -65, 1381, -1253, -120, 1755, -1051, -19, 1843, -1177, -552, 1411, -1266, -594, 1406, -1208, -467, 1399, -1005, -508, 1630, -886, -661, 1693, -787, -915, 1408, -999, -1122, 1601, -646, -971, 1635, -641, -775, 1522, -758, -1165, 1297, -546, -1204, 1456, -258, -1126, 1640, -400, -1250, 1280, -421, -1172, 1302, -317, -1154, 1308, -85, -1415, 1322, -109, -1045, 1409, 366, -1218, 1207, 129, -1441, 882, 275, -1661, 1078, 408, -1436, 1078, 393, -1505, 997, 448, -1549, 1033, 591, -1421, 728, 896, -1386, 856, 807, -1640, 700, 749, -1796, 420, 808, -1754, 670, 1058, -1494, 694, 1282, -1456, 637, 1149, -1628, 359, 991, -1645]
3123a645K033O01k555K133M55k353J835P46k500J525P82k368J416R41k103J146
3139H9R06k189J335Q96j941Q43J272k360R45J668k270L72J985k253M97J631k334
3156i08L67J767k000K01J843j950M3J792j845k89K552k215j31K087j939j96K308
3173A487j916m58K178j609m55J991j801n02K489j700p40K447j610o00K113j544
3189b30o55K116j450o76J826j019j126K033q74p87J801p60j234K116o92j377J799
3206H11l62j547J598j57j427J834j65j630J595K47j933J867M4j970J710L53k418
3223a550K078L81k218J864L73k174J646N01k177J831K06j981J555Q66k576J568
3239A93J134k467J462P31k026J041P54j925J222P68j958J130Q06j868R14J240
$$ y = [-1645, 388, 989, -1566, 567, 1022, -1331, 504, 1250, -1250, 275, 1057, -1311, 105, 1046, -1057, 89, 995, -1194, 141, 1037, -904, -61, 1211, -1149, -204, 1464, -806, -434, 1551, -702, -205, 1426, -908, -541, 1226, -774, -573, 1270, -680, -637, 1155, -690, -979, 1573, -642, -773, 1314, -625, -821, 1487, -429, -887, 1291, -318, -773, 1218, -583, -1085, 1404, -296, -1036, 1411, -199, -799, 1314, -230, -885, 1231, -219, -895, 931, -88, -1214, 819, -55, -842, 959, 199, -1035, 1081, 389, -988, 811, 449, -1098, 500, 343, -1084, 750, 585, -1045, 550, 797, -1136, 731, 775, -1195, 515, 868, -1550, 528, 909, -1309, 555, 928, -1246, 400, 901, -1276, 555, 761, -1220, 335, 1201, -1375, 193, 1327, -1140, 322, 1053, -973, 68, 822, -1103, 119, 887, -1071, 59, 865, -1003, -89, 1151]
3255A151j906M93J328j756M20J388j850K79J291j587K34J719j931K13J690j783
3271f07j20J983j560o08K202j624m51K056j525n50K054j591m84K140j684m91K392
3288A532j743p11K206j492q17K157j379p92K166j280q34K172j178r35K142j322
3304a08r49J936q71j035J894p07j312J938n26j291K024n20j496J632k95j562J832
3321E84j78j622J990m2k040K012J78k067J827P8j941J470K80j664J481K59j824
3338a219J717N03k032J468L03j807J291Q55k292J329O43j673J157P44j868J077
3354A96R31k118R85R69j943Q38R78j778J008R81k056J038J106j829N09J182j647
3371f50N24J000j773P23J401j965M00J801k016J68J554j777j30J766j568o8J680
$$ y = [1151, -755, -262, 1066, -690, -270, 1118, -732, -453, 838, -749, -515, 1204, -727, -514, 1176, -607, -727, 1256, -304, -912, 1290, -334, -785, 1271, -254, -804, 1250, -341, -825, 1315, -369, -860, 1532, -211, -922, 1284, -208, -1025, 1132, -247, -1039, 1127, -153, -987, 1185, 7, -928, 1214, -108, -1057, 879, 8, -1027, 867, 160, -1152, 786, 260, -1031, 993, 473, -1023, 609, 314, -1248, 584, 406, -1216, 774, 732, -1308, 704, 882, -1185, 642, 720, -1221, 249, 529, -1135, 346, 605, -1219, 498, 1001, -1031, 437, 740, -1067, 224, 1079, -1213, 116, 759, -914, 243, 987, -881, 196, 1127, -991, -6, 963, -980, -142, 836, -942, 66, 1047, -1009, 29, 1135, -694, -185, 997, -650, -126, 874, -899, -176, 1225, -740, -340, 1461, -555, -387, 1167, -610, -740, 1026, -542, -610, 1070]
3388A070j411k61J883j784P4J678j730k85J921j694l58J928j285n11J710j019
3404g4r01K042j003r28J895j271p07J977j137r75K206r96j277K275r62j173J947
3421I38p74j344K084q88j134K161q75j099J926o30j490K134o57j624J994m84j483
3438a245K233l50j533J545m00j303J838m04j672J710J46j773J880j9k009J742
3454C86K15j695J336K03j602J400N34j856J405N83j867J125N85j719R58J124k053
3471i38P61J223j943Q81J000k063J169R64k049R55J035k045R59J107k091P74J382
3488A081j973O05J519j913M20J392j916N31J310j843L58J515j786N19J319j517
3504c79r4J652j645j03J712j725k56J427j099lJ558j257m22J611j249m94J687
$$ y = [1070, -341, -602, 1281, -503, -429, 1249, -481, -766, 1155, -539, -897, 1031, -254, -765, 945, -74, -975, 1067, 64, -864, 1031, -240, -947, 1030, -107, -1082, 1124, 128, -1149, 1126, 164, -1009, 938, 164, -1180, 904, 16, -1118, 1043, 168, -931, 995, 365, -1125, 1009, 352, -1272, 722, 238, -1245, 988, 638, -895, 650, 250, -1053, 785, 381, -1291, 419, 565, -1208, 672, 653, -1356, 386, 601, -1094, 242, 445, -1157, 243, 777, -1079, 326, 909, -958, 167, 752, -967, -9, 1115, -938, -177, 1046, -897, -16, 984, -1079, 90, 1054, -995, -40, 995, -1050, -91, 1016, -1075, -301, 1081, -892, -287, 1232, -681, -261, 1131, -785, -254, 1056, -787, -429, 1086, -700, -181, 1138, -379, -473, 1179, -466, -569, 1143, -582, -838, 589, -510, -513, 1045, -212, -634, 977, -272, -766, 921]
3521I21j105r31J979q64q86J845r29q63J644q17p67J777j075r73J966q45j305
3538a228K237p64j444J877l44j335J703o45j262J790k42j356J692l19j182J513
3554F91l69j302J618k77j509J596m2j434J432N7j482J454K36j678J486J97j747
3571a073J242M55j680J297M37j804J240P86j647Q66P53j769R73P33j695R29J060
3588A103j997Q95J067j976O22J280j799N65R92j586O49J075j325J77J323j870
3604h05N04J408j807M61J132j410m3J532j504J40J032j094K4J108j086J0J178
3621G80j095l43J272q16k92J583j352l53J549r88o05J515j007o71J438o64q41
3638h90J493m34r92J764p44r70J720q45j137J626l96j227J625l59j123J507l42
$$ y = [921, -184, -1115, 864, 0, -886, 959, 30, -833, 811, -6, -773, 1004, -71, -1044, 922, 77, -1228, 1009, 245, -1199, 678, 334, -1001, 702, 57, -1205, 585, 343, -1013, 679, 360, -822, 691, 322, -980, 638, 361, -1148, 448, 406, -1028, 404, 461, -1021, 433, 669, -1009, 477, 674, -1073, 169, 624, -1056, 241, 678, -1126, 114, 900, -747, 119, 872, -897, 76, 809, -886, 43, 1103, -894, 1, 1068, -908, -286, 994, -805, -240, 752, -834, -185, 890, -435, -258, 1065, -805, -301, 1107, -700, -239, 893, -517, -560, 972, -532, -392, 640, -454, -430, 678, -408, -398, 780, -315, -658, 614, -202, -494, 1089, -263, -616, 933, -55, -660, 855, -152, -823, 615, -49, -890, 603, 169, -823, 941, 197, -773, 947, 102, -1035, 591, 195, -1032, 593, 234, -889, 618, 276]
3655B76j020J404k77j334J569m27j009J321l27j068J360Rj393J370j87j232J614
3672F49k35j282J361n1j324J363j75j247J216M06j543J051N42j454Q26M68j362
3689g91Q88N41j597R96P62j567P54P76j595P50J004j571N71R47j536N43Q31j350
3707f44N49Q28j464P18R36j634N09J150j421J55J060j276J75J157j260J10J302
3724I50j256L6J155j319K39J224j487O2J355j344j91J409j302j1J007p23j37J191
3742H58j083l85J311j023k28J316j026l92J531r65n95J653j030m95J466r33o56
3759f76J385q66o35J483n84q04J421n00r32J577o10r45J166l26r24J473n34r39
3777g70J408m88r55J563n35j067J256q5j343J336K14j355J075J14j207J182R7
$$ y = [276, -744, 660, 383, -951, 618, 191, -818, 503, 176, -892, 468, 477, -916, 454, 267, -965, 649, 414, -868, 493, 442, -882, 481, 306, -941, 275, 681, -862, 189, 731, -723, 103, 571, -791, 97, 638, -959, 37, 799, -768, -14, 762, -833, -83, 921, -650, -79, 868, -668, -125, 706, -644, -95, 733, -731, -13, 923, -711, -202, 948, -473, -318, 742, -534, -359, 798, -462, -352, 950, -306, -270, 885, -434, -195, 1029, -458, -396, 959, -385, -576, 833, -469, -480, 527, -196, -333, 858, -225, -610, 701, -322, -550, 766, -260, -652, 879, -86, -681, 972, -58, -553, 913, -20, -676, 709, -157, -792, 691, 107, -697, 724, 224, -708, 869, 259, -686, 480, 154, -770, 703, 169, -770, 638, 150, -805, 758, 223, -844, 412, 327, -1016, 320, 534, -821, 254, 368, -839, 343, 440]
3794D40j191J098K2j316J211K58j229R15K65j378J144L48j285R76M62j313O35
3811F2M95j275R70M88j515P64O37j197M88P04j494O77O78j166O27O08j133M90
3829i2Q88j378L66J057j475L13J001j427M37J220j473J45J301j317J41J036j092
3846c49j34J164j144Q6J228j323l8J270j080k04J456j170k57J316j229N9J055
3863G06j002m0J023r98J3J003q26k34R15n96n12J202m96q96J365n67o19J272m83
3882B30r37Q98k08n44J099l39q24J173k66r50J213k51j115J281j92j067J195k45
3900A51q61J115m9r18R83n1j091J006j3r80J041j22q23R05J50r60O42L37j084
3919f22R46L2j033Q65J35j165P98O33j029L84Q30j217M37M04r50M11N25q19M89
$$ y = [440, -751, 347, 369, -947, 264, 522, -707, 208, 473, -905, 239, 587, -698, 278, 740, -573, 62, 557, -718, 252, 740, -775, -11, 626, -571, -83, 621, -873, -196, 482, -684, -57, 551, -582, -92, 796, -582, -216, 841, -634, -321, 680, -747, -310, 910, -563, -418, 883, -434, -293, 743, -349, -483, 681, -463, -377, 851, -472, -510, 760, -320, -524, 932, -238, -495, 821, -408, -349, 706, -296, -336, 687, -311, -298, 705, -121, -355, 560, -36, -548, 654, 158, -738, 627, 60, -559, 713, 230, -707, 191, -17, -561, 538, 199, -625, 548, 282, -668, 545, 294, -821, 460, 268, -799, 396, 151, -710, 405, 356, -562, 421, 370, -721, 285, 272, -708, 333, 211, -612, 293, 443, -517, 125, 462, -622, 324, 356, -677, 188, 323, -842, -44, 589, -440, -56, 774, -443, -6, 398, -552, -141, 384, -435, 54]
3938E4M80j060M07O57r13K13Q82r91j86R95q81K5Q38r28nJ059j102K72Q32j132
3958d84j4J136j071j80J221j021j54J154q14q5R63o89k35R64q70l42J099q55l81
3977f58J158p04r9P52n64k42Q44n67l41R61n22o40J311o00n98R49l10n87P56k87
3997A2n28J060m64o88P95J01r59J087o0j157J354l38q45J124k4j066J018K6j118
4016f70J015N7j121J204k40r21Q06K01q84Q52J93j098P96L26j120Q57K60j073
4034e60O89M03j160Q03L81j017M45N26o79K33O57j169L15P09j070K56P94j009
4052d53K70O22q08J28R00r81J76P30p42o3P85j022K8J004q90M9J044r88k90J161
4072F60r47j09J121q41j78Q48o31m27J162r26j39J108q35n05J252p58n51J245
$$ y = [54, 534, -526, -119, 538, -375, -162, 720, -271, -457, 538, -343, -318, 520, -408, -413, 646, -456, -184, 648, -484, -498, 638, -433, -613, 608, -413, -567, 587, -227, -312, 651, -38, -273, 691, -179, -521, 578, -277, -658, 500, -204, -303, 449, -115, -357, 487, -80, -421, 540, 18, -622, 689, 89, -509, 440, 130, -457, 299, 12, -516, 544, 80, -608, 187, 288, -671, 416, 356, -801, 553, 215, -630, 494, 470, -596, 422, 448, -670, 345, 402, -719, 485, 245, -676, 130, 331, -553, 299, 492, -606, 190, 516, -604, 253, 513, -560, 129, 532, -628, 175, 556, -461, -16, 510, -169, 64, 721, -448, -133, 576, -494, -238, 556, -453, -183, 439, -369, -241, 659, -322, -146, 584, -158, -221, 564, -458, -430, 574, -316, -267, 777, -211, -501, 660, -287, -396, 725, -116, -294, 554, -77, -504, 658, -268, -407, 701, -134, -639, 613, -145, -696, 549]
4090E49n61m27J024n16o94J280n72n98J012m65o14J004l19p75J283n13o49R55
4108D04l53m48P57k73p36R36k19o39J108l64o89R55J28j470J083J42q38Q40P6
4127D00r77P28K96r56O25L61j163R87qj010Q29M72j185N58N38j204P56M95j140
4146e98O50M38j151P34N51j176M67Q53j102M61N56j173M03O47j003L40O48j317
4164g72M78R78j139N21P29j235L81O02j144N57P04j138R5R34p96k0P80o81j4Q75
4184F95q38j85P03o62j12J015r48m6J080p65k75J071p85l16R04p27l25J054o58
4203a20n23J365q40m32J247n37p22J211o40n31R34n14k14Q33l47p34J161m60q43
4222g06J218k73q29R41k89p68J000j01q19R15j64o99R35j35q45J078j65j041J065
$$ y = [549, -12, -439, 585, 69, -625, 655, 83, -515, 497, 32, -582, 422, 103, -672, 611, 98, -551, 404, 51, -397, 360, 87, -649, 287, 68, -571, 537, 173, -516, 439, 567, -903, 180, 322, -516, 324, 400, -577, 151, 447, -509, 116, 477, -686, 301, 293, -717, 112, 584, -601, -43, 495, -709, 47, 542, -598, 52, 490, -661, 73, 624, -552, -85, 768, -334, 127, 683, -490, -87, 560, -443, -103, 545, -772, -294, 684, -455, 66, 795, -440, -59, 543, -601, -44, 660, -478, -383, 551, -245, -265, 515, -166, -180, 695, -143, -328, 375, -287, -399, 616, -332, -378, 702, -63, -338, 733, -52, -368, 536, -191, -516, 538, -120, -643, 722, -118, -550, 697, 160, -562, 649, 9, -522, 412, -102, -316, 517, 170, -564, 597, 137, -706, 512, 239, -590, 351, 62, -706, 294, 193, -626, 289, 125, -574, 361, 226, -619, 459, 294, -747, 318]
4241C18p9o83O98P3q71Q09R6r97R17J64r26O33J24r25Q46K13p94P41J28j049N76
4262A2N43j114M98L90r03O50M33r95N78M64j021N95K54q16L48O19r86N00M88r49
4282d12N80L10q52M10N43q69O3O96o81MP79q32J10O37o78r0Q92q75J30M75l30
4303A0m50R29q57JR86p28k02Q59p97j21J023o44m05R35o26l79J084n69o28R08
4323C29j58n90R56m30o37R40l57m85R73m50p40R80j48q16R19j20o39R65l47o14
4343d69R45k84o66P18n0o71N89J18o57N52o6n23P38J4o03L32K52p19N51P2o14
4364d41O87Q2r57Q10J36o34L64N17r99L34M77q77O09J93o29L78L76q40L47L75
4384C08p24N46K70q63M49L22p77J05Q00o96J56O07q57L6Q17p97J58P58r57n8R30
$$ y = [318, 239, -444, 254, 327, -544, 265, 361, -636, 281, 445, -481, 152, 276, -649, 197, 410, -384, 357, 485, -564, 12, 555, -559, -61, 329, -574, 76, 509, -486, 92, 556, -465, 130, 384, -432, -84, 535, -451, 49, 537, -412, 168, 478, -374, 36, 579, -290, -227, 469, -212, -208, 571, -261, -151, 486, -192, -282, 610, -265, -135, 340, 10, -440, 489, -368, -367, 619, -109, -311, 548, -249, -370, 653, 9, -396, 539, -87, -466, 618, 49, -579, 329, 171, -419, 537, 107, -530, 410, 53, -432, 541, 91, -649, 331, 183, -633, 286, 166, -473, 492, 145, -469, 476, 192, -474, 244, 194, -477, 112, 230, -427, 125, 59, -464, 274, 288, -315, 17, 269, -450, 101, 173, -441, 246, 328, -629, 181, 317, -317, 47, 564, -435, -101, 376, -501, 108, 301, -328, 50, 426, -414, -67, 308, -416, 130, 400, -463, -14, 308, -469, -364, 436, -260, -104, 503, -354, -318, 499, -298, -140, 618, -339, -397, 533]
4405E33q12nQ85r36P0Q18q35J9Q08o07k07Q49j001Q8R22o85k81Q58n65l32R68
4426E52p15j88Q34m49l24P97n88l29Q37p22O6O91n67l42Q39m38m64Q34l61l25
4446c62P81m29n28R66l63l87O40j49o48R96l67o15P67r5n95O04j8p81Q68j17m86
4467c18P22p1p35P59rp50Q44k55p31P81j05n57O37J24r02O82k8l79M90m1o56M16
4489h2N20r20L46M16q92O43M08q26L86O13p97J34L05n57K13M68o03J87O33q01
4509b06J68N57r54K95N70o64j23P86o29J63L97o82J36P84q79J97O59p75r5O22
4529C27m85M7M95o09o9O39m08k70Q46p16m7O54o49j52O89k47l11P55n18k75O31
4550C27k91l35P89l83n39Q21m66l22O15j34m79Q35k97n28P28l71n45R23k51m30
$$ y = [533, -279, -284, 601, -335, -265, 553, -282, -263, 545, -62, -269, 580, -421, -333, 589, -96, -377, 481, -84, -416, 552, -163, -351, 483, 34, -290, 507, -81, -410, 427, -295, -229, 462, -105, -447, 392, -46, -510, 324, -37, -362, 419, -10, -538, 428, 65, -322, 318, 169, -479, 517, 150, -465, 302, 207, -388, 216, 198, -583, 285, 168, -318, 404, 333, -402, 357, 348, -402, 442, 187, -544, 237, 132, -425, 212, 336, -566, 116, 88, -291, 199, 158, -498, -82, 438, -482, -136, 280, -612, 31, 439, -387, -1, 612, -185, -51, 254, -303, -90, 378, -225, -38, 595, -206, -38, 519, -435, -140, 430, -234, -357, 429, -200, -37, 360, -322, -186, 598, -281, -84, 575, -200, -295, 327, -158, -111, 384, -225, -294, 345, -63, -333, 513, -203, -250, 404, -245, -397, 292, 45, -266, 489, -29, -304, 327, 36, -299, 490, 107, -432, 389, -77, -399, 216, 82, -397, 438, 141, -387, 341, -30, -575, 348, 97, -333]
4570c33P24m25m54P62k23n91O55p3n44R65l40m68N98j52o63P24P0p28Q10l24n03
4591e13Q91j94n85P48r3o60L96O4n84N86J8m27N63L2o13N94Q6o31K58N70r24L35
4613h3L84p55N86m0m73L48M12o71K56K78m75L4O77p56K2N46p50M63M31p97K25
4634a38N69o01r9N36n26J8P34p45O4P01o54l6P28p29J0M54m55k99P95m11j62Q16
4656E70p03J5O31m52m14N16k21j73O03m87k65O74k61m69O60j91l35O72k83l42
4676b55N72k87n41P73k22n24O81jn35O72j65n37O74n5o12O03n0n99O44j16m41
4697c21O27j06n13N92j49m89N21L7n25M15L6l08K57J76n87L75L11o29K59L55p19
4718c85K46L76o27M89J61n08K11J91l80J11L21o27K70L13l89L44J15m78J09M87
$$ y = [-333, 391, -34, -488, 274, 51, -540, 115, 42, -502, 463, 123, -345, 253, 101, -562, 162, 232, -496, 314, -10, -513, 378, 184, -401, 347, 254, -406, -10, 54, -530, 56, 74, -353, 210, 242, -371, 223, 309, -322, -64, 506, -418, -83, 301, -454, 132, 92, -381, -33, 379, -292, -36, 242, -233, -199, 478, -278, -256, 290, -460, 3, 434, -363, -138, 431, -170, -269, 267, -259, -241, 493, -252, -188, 513, -141, -177, 551, -178, -168, 286, -169, -468, 327, -84, -246, 570, -133, -118, 513, 61, -353, 163, -58, -231, 372, -115, -380, 294, 33, -436, 224, 33, -302, 370, 87, -255, 317, 30, -511, 262, 40, -484, 197, 196, -339, 333, 168, -369, 305, 250, -362, 241, 191, -408, 236, 120, -321, 306, 200, -313, 279, 130, -359, 162, 199, -326, 89, 125, -183, 74, 250, -337, 38, 349, -280, -21, 334, -385, -139, 237, -390, 99, 260, -248, -37, 154, -226, -115, 206, -421, -151, 162, -227, 117, 232, -246, -137, 350]
4738C50o30q3R07m66k72M09l18j32L98j76r3M26m78m8L35k22j98P24n54j97N91
4759B73m61j89O49k23j31L95l54j64M31m28k49Q34k77k94M36k83m52R64m23k87
4779b33M16k74j39N88m79l3N22j10m45M34j55n28O70l58q9N04k61k93N02j94m18
4800c73M81M6m71N58m8o16M61L35p66L38K78o12N67J10m83K47J06m73M87J85o30
4821b73L67R3n11L89K70n59J21M08n89ON28m72K03L25p01K82L89o05M69L19p32
4842b73J74M76o28J16N42m94m6N60o76J42M85o50J24M56o35P1O06o54J6O56l71
4863cj37N53m96q5N20l80k14O60o95OO80n14j77P01n63k04N32m35j13O45l38k31
4885b88Q13o21k39Q99o22l40P77l86k22N72m11l80Q23l94l02O38l18l18O11j57
$$ y = [350, -280, -363, 544, 78, -194, 215, -103, -235, 163, -13, -106, 320, -158, -206, 129, -93, -291, 433, -121, -318, 273, -188, -377, 272, 49, -82, 313, -41, -205, 226, -202, -451, 383, 106, -188, 248, -35, -487, 477, 54, -233, 183, -91, -230, 358, -121, -154, 368, 258, -187, 247, 92, -436, 234, -124, -213, 291, 30, -263, 239, 45, -373, 108, 154, -317, 241, 193, -423, 38, 373, -393, -55, 223, -389, 178, 288, -195, 52, 158, -315, 172, 357, -273, 94, 187, -324, 65, 335, -224, -103, 305, -284, -278, 250, -222, -19, 306, -395, -113, 276, -329, 140, 459, -273, -99, 377, -251, -135, 407, -87, -133, 427, -249, -107, 378, -272, -148, 308, -327, -256, 350, -304, -288, 368, -3, -140, 413, -83, -168, 352, -28, -242, 418, -277, -271, 409, -105, -282, 419, -144, -348, 184, -251, -364, 281, -57, -288, 525, -96, -335, 564, -58, -398, 379, -7, -229, 343, -68, -448, 375, -19, -321, 317, -1, -319, 292, 135]
4905A35m08N09j91m96P44j18n77O66j34k93K29J25n93M59K12m57K70J91n21K91
4925D3R1m80M51O9o66M75M03q57N33J72l11K88J03p03K71L74n31L12K41o09L45
4946A4M03p33L48M05p98M24J84o45M70K20n48K24L71o53M02J22n56K27N25o14
4966b08l8N36p26J05P46m49r7L29m48L0N98n86r8N32l17j70M92m34j01O07k99
4987Dk6L18m27j96N48k92k52N83l20j72N78l36k73M16j50m35N07k84k6N45k87
5008B3k00O56n25p1M33j14m08O61n52l09O85k39l85O80l21k98M86K4n96O03k28
5029Em34O10q8k32K67J45l20J03r4j41K76qn77O30q8l32M10q8k42K21J67l61L38
5052A67L7l02P5K81p20O83J11p08M66K17m37K57L62p73K82L06p67N13J51n04L93
$$ y = [135, -273, 236, 45, -451, 293, 175, -402, 264, 130, -163, 66, 191, -402, 57, 269, -188, 82, 273, -248, 43, 134, -346, 105, 174, -492, -17, 386, -471, 62, 234, -77, 211, 314, -389, -118, 256, -275, 37, 278, -331, 14, 417, -316, 32, 437, -361, 63, 247, -398, 72, 292, -256, -32, 339, -314, 88, 210, -346, -119, 406, -208, -246, 290, -436, -331, 415, -34, -131, 198, -250, -220, 378, -208, -306, 226, -91, -261, 231, -203, -304, 303, 4, -22, 296, -131, -327, 221, -71, -323, 260, -60, -232, 346, 10, -263, 153, 3, -432, 75, -209, -235, 310, 23, -177, 479, -46, -117, 316, 202, -206, 455, -97, -406, 279, 40, -345, 335, 14, -284, 202, 226, -370, 233, 5, -429, 181, 93, -139, 128, 273, -47, 56, -38, -179, 97, 89, -488, 142, 54, -278, 132, 44, -198, 23, 190, -171, 167, 204, -98, -23, 258, -462, 221, 332, -376, 90, 307, -130, 127, 489, -284, -2, 304, -463, 50, 201, -303, 90]
5073I0K28o95L54K71m61J82K05m34M7P07n75o8M38m22N9L67l90M4L34n27K36K83
5095B73m70n6M54l18p7O10n23K5M01m86k11O84k99r2M28m45R7K82j79k71L48l63
5117a88j60L41M5k99N11l67j44N09k04k93M43j65l30K88j6k61N63j23k54L99l22
5138b7k34N50j14m71O30j17n31M53P0m89L25m9j88M36k3m38K70m5l82N58j22m77
5160d15N84o0l64M35J3l92L30J35n15K72N5p5q2K68m24K38J92m16L28N8l98J11
5182a22L90n72L81K71o28K18J86l63J03M36m56Q7K81l06O3M23m77L2L65k73j93
5203a54J49j73jM67m07L3K49k71j24M86l41j29L68j91j60L44q0l81N99k42j91
5224a50L90k51j03M21k65k60M15k40l06O53p0m16M04j16k26M14l38l02K91P5m07
$$ y = [90, 318, -377, -23, 248, -213, -31, 174, -260, -213, 494, -81, -149, 289, -133, -74, 293, -97, -53, 281, -246, -10, 273, -197, -253, 201, -117, -194, 416, -107, -82, 319, -167, -378, 306, 7, -85, 343, -102, -5, 277, 98, -173, 175, -188, -348, -7, 38, -261, 250, -117, -261, 248, 44, -249, 194, 29, -301, -13, -29, -290, 273, 150, -104, 295, -27, -261, 289, 175, -296, 334, 217, -314, 139, 209, -280, 45, -4, -192, 244, 221, -217, 53, 8, -374, 184, 62, -415, 169, 109, -255, 180, 193, -199, 131, 266, -249, 23, 78, 3, -79, 189, -235, 3, 195, -221, 107, 165, -233, -122, 268, -304, 77, 348, -280, -62, 124, -239, -136, 300, -156, -69, 212, -94, -31, 392, -85, -53, 312, 39, -154, -5, -178, -179, 288, -119, -86, 163, -108, -232, 254, -87, -216, 152, -39, -199, 145, 65, -316, 283, 41, -150, 240, -11, -114, 307, 42, -218, 197, -43, -349, 304, 234, -182, 222, 106, -120, 294, -44, -346, -55, 20, -387]
5245c87N82j15k42N05j68m43M14K7n62P54k25n44O30m8n26M63Km08N22j80j86
5266a35K41J5m38M63ll03L38k9l41R9J93k65L12lk65J11L40m68J75M19n93J28
5288iJ84m17K59M4l98L98J94o59K89M96o72L01K95m66J64M21p36K65M95n34j44
5309b30M33l12M6K71k57j32N27o95K28L04k45j6M87n05m1L41o2k18K2j3p9M47
5331C01m60N6K20j46k56N84m28r8M91l19l03N68j88l92L60J03n37P19l00o2K00
5352A13p8j62K69j17j79Q5kP2N4R6l49L33ok47K11M0k19K56j10j82J99M6l73L24
5376G4l46P1K29J00l39J34J82l47J33K86j91j6k0j53M39j72l27K73K64m88R7J55
5398C8n3J39Q6l69n8K69j01L0K58m58Q5M34m27J52L01m72O3J68q8J3J12k82J20
$$ y = [-387, 195, 80, -162, 343, 175, -268, 146, 173, -389, 365, 140, -404, 226, 178, -348, 115, 117, -291, 231, 51, -135, 106, 121, -317, 146, 143, -160, 178, 149, -192, -93, 100, -165, 147, 144, -121, -10, 330, -138, 37, 456, -137, -9, 175, -242, 17, 61, -337, 61, 255, -404, -115, 381, -291, 10, 305, -161, 3, 424, -312, -47, 448, -86, -230, 203, -109, -63, 208, -49, -181, 346, -349, -121, 183, -62, -78, 409, -96, -137, 204, 142, -76, -54, -67, -146, 301, -159, -103, 117, -29, -285, 299, -129, -227, 264, -55, -358, 210, 22, -370, -10, 93, -444, 275, -25, -87, 113, 35, -127, 142, 25, -154, -69, -71, 1, 55, 151, -198, 135, 129, -118, 93, 133, -86, 170, 60, -122, 77, 123, -250, 74, -272, -201, 28, 128, -211, -77, 105, -242, -109, 177, -14, -30, -50, -203, 236, 64, -263, 10, 274, -214, -117, 38, -15, 124, 210, -159, -217, 52, -49, -19, 239, -219, -134, 300, -127, 25, 326, -146, -83, 85, -3, 10, 122, -160, -40]
5421d0L56m39N0L47l73o4L65k60KJ36l64K19K58k74L7L67k90M2K65m04k78M13
5443G1L2m9P5j91k03K03J2j72M27k18j6K60k39m7J52N9k56L28j52m18M46r9j36
5466a31J48J27k50J78kj43O4l6k25M17j65l09M29l3j49J58K15n17N50k13j16J77
5488A74J03m56L27J56n55K56J0j87J67J96m47L62j45j80J37L63l47J47J37l32
5508a14R5K62l04K34m7l18Q9L96l97MK55j01j56L35l28K7L24l83j05M35m55J53
5530i9K89k29m4L32k26N3K18n89J37N04m18l05M17l01K89J35j75l6M67o07R4K61
5552A67j53o9J50N8m13L41r1j88K07Mk44L00N5m40N76l62p6L27k44j28L60O3m58
5575b58O02j66k19R1j70R3K20kl31K45m0j57J23J59m30L59j48l27M23M8j96j1
$$ y = [-40, 316, -123, -73, 274, -99, -163, 202, -58, -56, 80, -284, -65, 193, -81, -44, 323, 33, 75, 340, -64, -342, 71, 103, 54, 129, -62, -265, -62, -50, -222, 205, -13, -29, 231, -8, -55, 97, 156, -100, 228, 76, -342, 104, 5, -131, 17, 144, -106, 72, 70, -73, -9, -45, -270, 147, -18, -327, 102, 69, -80, 78, 293, -224, 326, 113, -3, 174, 277, -179, 148, 304, -251, 5, 15, -172, -5, 191, -256, 106, -39, -219, -82, 281, -66, 81, 218, -114, -19, 243, -61, 173, 126, -192, -103, 293, -104, -100, 155, 54, -102, 233, -95, -68, 256, -127, -232, 203, -252, -99, 190, -39, -83, 249, 23, 76, 294, -295, -158, 346, -72, -377, 40, -261, 28, 163, -12, -48, 419, -188, -94, 167, 14, -55, 95, 153, -260, 81, -10, -198, 9, 13, -231, 69, 124, -316, 260, -102, -178, 149, -95, -223, 137, 200, -258, 344, 178, -41, 50, -120, -27, 193, 191, -140, 105, 65, -92, 31, 190, -240, 119, -29, -356, 67, 115, -81, -92]
5597i2K56k51K94k42k41M04J1l19J62J08l49K48m2K4NR2k46L52N3n47K08K63n79
5620d28N01r5k08L41J07n41M46j06k74J48J79k23J92Kj96M7L97m79L01J18l54
5641a25J68K31l85j9M09l24J02J65l08K19k30L0j01L01j98p0M17k01j71K09k88
5662a69J88J81k14J0J16k77J83K47l63k0L43k43j35L60j99n0M72l92q2K19k38
5683f3j53M72l15k37L06N7k11K92k19j75L89j09k06K29L4j93K29l6j91K46Ol96
5705b44L92k24r4N14j80j01j24L79o81N68p7l98M51j33j22Q2M8m04M79j10j65
5726a44K66k40q4J34K98m28J46J29q1K4J06l24K24Q4k31K91l4m64N10j25q1J67
5748A43m3j82J15K64m16P8K23l74K18K61m83K61Q5l36J39M00k85n6K04l84O9K72
$$ y = [-92, 164, -87, 207, -35, -276, 128, 139, -180, -18, 90, -259, -11, -53, -29, -24, 68, -178, 174, 227, -320, -112, 151, -428, 73, -22, -230, 111, 218, -323, 123, 17, -257, -109, 70, -153, 39, 41, -155, -108, 289, -190, 111, 229, -125, 43, 274, -111, -130, 279, -45, 57, 222, -86, 133, -97, -67, -168, 133, -65, -135, 282, 81, -90, 119, -169, 19, 200, -14, -4, 112, -165, 18, 265, -98, -118, 225, -18, -153, 207, 8, -42, 430, 38, -44, 175, -63, -216, 256, -59, -296, 10, 67, -144, 148, -71, -246, 143, 34, -172, 57, 91, -102, 127, 91, -100, 146, 152, -244, 148, -76, -170, 344, 164, 63, -61, 318, -363, 205, 128, -270, 181, 48, -74, 8, 56, -348, 131, 21, -144, 122, -118, -202, -68, 230, -198, -52, 77, -4, 20, 126, -198, 26, 110, -121, 170, 136, -328, 182, 57, -24, 143, 100, -82, 33, 297, -119, -41, 182, -192, 26, 287, -196, 65, 150, -186, -47, 353, 68, 12, 216, -168, -99, 173]
5770A73l45K5K95k55J60K34m55P1K45k34N4K11j78j85M45m29J62K71k96r3L75
5791B51k77m6L20l94K27j16P6l62M59l4j81L42k61j26J15J93o50N21k12K3K89
5812A57j27j40K42j71k22L14J17l03L07j56j93K25J03k77L05N0n40K67J15j63
5832i0j4K46l54L30J4k57J5K84l10K94Nk43J3J10q6k4K89m50J21K09k46K15J98
5855B69k54j43J82j60o7J78q9K85j5l03P9K72m79K69P3k66M2K25j97K08J3k28
5877a06O3K38j85j39J89r6LK49k83P8J41j71O1L0N0k04K92l56oM27m79J09J66
5900G1jj67L85l44N7K49j21m11N29k66k12L26l0k02K99j47j25L37j33k43K04j35
5922h0k1J59J2j21Q1m9k15J39J93k44J74Q8l11K09j5o1K69J6m29K94Q7k81P1J14
$$ y = [173, -172, -147, 148, -107, 53, 287, -168, -97, 148, -86, -32, 179, 1, -184, 261, -168, -6, 265, -31, -124, 251, -26, -72, 248, -146, 81, -35, 41, -321, 138, 104, -77, 265, 4, -122, -7, 186, -464, 57, -155, -132, 157, 30, -110, 132, -39, -261, 53, 170, -133, 174, 18, -175, 50, 153, -124, 181, 231, -309, -42, 73, -90, -104, 142, -212, 118, 132, -125, -110, 174, -136, 158, 163, -80, -67, 43, -43, -67, 222, -228, -107, 102, -144, 71, 269, 15, -128, 54, -106, -173, 5, -84, 201, 186, -117, -38, 234, -245, 24, 97, -169, -127, 98, -99, 109, 122, -106, -43, 195, 10, -129, 60, -36, -33, 216, -67, 11, 152, -19, 42, 72, 122, -82, 210, -146, -152, 275, -204, -95, 71, 70, -97, 288, -56, 1, 250, 129, -282, 247, -19, -231, 95, 65, -137, 162, 15, -110, 227, 94, -149, 55, -80, -101, 58, 70, -51, 30, -19, -234, -95, 98, -146, 28, 116, -195, 14, -1, -62, 207, 223, -206, 88, 175, -106, -35, 79]
5946G9j22k9R0J1L6J32l68K39l8k67N4M57l38N2J49j86O7J95l34J51K41l68K07
5969A10J0l21J57L8Q2J5J47j84n7n2j62NL19qj6N0j07m5J72k33J26K8j73L2K43
5994A76k10k1L59l48k9M8p7Q8J82j04k7K10k16J56p0j6l61M12j93q0K0J88k21
6017a34M11l90J21J53r9k64L48j13n6K29J51m91L33l72J89J08k18J9J59q7j27
6038a30J29O0k95L26P7j29R8P7m97K22J20k15M58j87k05K3K34n10M08J31l55J25
6060c5R2k86L44L5m40L13J08l20J42L29n08K29J85m84K26K31r0m7o8J2J59J43
6082B70m04J10K5j47J28K60m55L09L8k63l4M93j52k33K20l16K10P1l08K69P9k65
6104i5J06O8j61J14pj75M3K35j69o2J44l02J20M2J94p0j84n9J92K10j72j79M50
$$ y = [79, -43, -72, 18, 29, 65, 197, -171, 68, 30, -237, -183, 274, -64, -12, 137, -49, 18, 213, -121, 30, 271, -97, 110, 120, -201, -44, -6, 76, 91, 238, 54, -3, -55, -217, -212, 107, 99, 83, 133, 26, -19, 153, -80, 46, 74, -99, -67, 176, -34, -55, 304, -44, -73, -25, -102, -14, 168, 64, 37, 247, 31, 187, 117, 101, -260, 152, -41, -121, -101, 87, -134, 277, -113, 8, 161, 62, -202, 146, 33, -23, 206, 357, -134, 199, -173, 16, 124, -94, -75, 84, -3, -130, -1, 59, -236, 90, 167, 38, 136, 213, -284, -62, 58, -157, 301, 114, -91, -68, 166, -344, 64, 195, -160, -35, 57, -229, 115, 150, -290, 23, 131, -189, -47, 282, -226, 3, 188, -296, -70, 161, 71, 24, -44, -32, 127, 270, -134, -24, 1, -146, -18, 242, -213, 96, 134, -129, -163, 330, 178, -55, 165, -151, 59, 130, -178, 91, 170, -95, 11, 79, -82, 32, 25, -150, -107, 128, -41, -103, 41, -261, -141, -99, 95, 25, -159, -218, -26, 184, 12, -167, 283]
6127B83l69J17K3r5n5J22M5M6j98R8n7j7J97p9k0j11j1M1J93l56L15j68k9P7R4
6152H6j72N7J58k40K15o0j48J01N8k11J60R8L2m3R1k88J84Lm4n4j72K16k5n1R1
6177D2RK0j64J77l5k37K73J8k48N1N9Q4kP1l98M71j93j78K9J10n9R3J37j27J2
6202A5J33j81j45K22N9j48J28l11J85J53k99M46J0l52K2M31n73J53J51k14q4K19
6224B0m0K4O6l21P7K10j75J41qM6M4q3j87J32J3J08k11J21nJ10o4k4rM3L0k63
6250b05K15r0J24p4K40j68J70k74o6J34J29k33L01n6k34M1L1j32K11J59j84O8
6272A07r7j42J23J54k10m7K24J6MN2k27Q3j6q1K80k28j45R4N1o3J8J11r5P4J10
6297A50k45PJ27j71NJ23l6j9J9r1J49J2l50J51K15j50J71J40k15J3RQj59K1r9
$$ y = [283, -86, 31, 54, -41, -96, 26, 71, 117, -81, 17, -40, -57, 140, 61, 41, -70, -81, -40, 153, -203, 112, -56, -85, -8, 86, -86, -29, 129, -111, 104, 44, -104, -3, 55, -156, 4, 102, 134, 91, 182, -106, 78, 81, 37, -17, -189, 27, 2, -49, 42, 51, 71, -93, 84, 49, -188, 85, 103, -145, -94, -35, 49, 47, 118, -280, 191, -2, -180, -151, -41, -100, -7, 130, 3, 15, 148, -33, -178, 44, 103, -45, 83, -228, -43, 110, -189, 257, 267, -85, -63, 368, -205, -52, 99, -115, -199, 20, -20, 4, 70, -251, -174, 36, -139, 2, -6, 40, 84, 1, -186, -54, -41, 67, -144, -23, -28, 82, 18, -6, -15, 28, 58, -205, 10, -80, 44, -30, 210, 42, 212, -62, -128, 6, 135, -98, 203, 147, -87, -46, -15, -147, 64, 223, 39, 107, 10, -132, -9, 145, -65, -112, 112, 128, 132, 184, -43, 40, 24, -57, 223, -5, -150, -56, -5, -68, -50, 61, -34, 40, 150, -95, -88, 39, -132, -127, -4, -40, -59, -40, -131, 18, 30, -320, -169, 46, -104, 67, 207, -8, 5, 14, 22, -137, -116, -215]
6322b15O8K14j57k24K44O1j4K16j90r4K90l95N7K35k08p8M31k13j20L12k62k16
6344b58Q7K74l73K71J23m8J05l91L09K34l00r5J69k42j80M53k44k03M16n3j34
6365h0J08j1l7J2n4N1j7N2l5k2R4q4j71L06k01K21j85j07J32j12J00N0J38k81
6389a33L6l4q0L52J47l75K33J76m48K72n8k11K77p6j31J7O2j55J77Lk08J24L38
6412C05m22RK39k71J28K48m20J17K24l73K95k9r9j22L43l13J72J85j78q5K03l08
6434a52K04o6o5r5M11k18q4K64j77r5J43m2m4J29k99K03R3j08j64K00k17J56K23
6457B00r3l10K60j92m1N7k4M8J14k7J1N1J93k36P6k25J40P4K7m7M4j83p3J92O6
6482A02k31J20R0k20L47l17K9K58j26q2Q6k23l3J56L3k47N38n01j43N79j48k47
$$ y = [-215, -147, 67, -90, -314, -70, -9, -23, 193, 3, -91, 199, -196, -139, 96, -112, -190, 241, 28, -92, 220, -42, -258, -171, 103, -270, 1, 124, 76, 181, -210, 99, 333, 33, -62, 107, -135, -315, 138, -106, -309, 107, 54, -80, 28, 17, -20, -8, -62, -11, -28, 24, -11, -33, 61, -23, -194, 112, -89, 132, -53, -160, -28, -140, -40, 10, 148, -133, -97, -131, -211, 141, 288, -87, 146, 322, -126, 146, 88, -123, 154, 78, -53, -36, 26, -129, 48, 51, -157, -33, 305, -117, -108, 131, -140, -12, 236, -184, -67, 157, -216, 79, 50, -49, -171, 172, -141, 31, 216, 38, -47, 156, -152, 52, -14, -79, -174, 237, 19, -65, 199, 22, -73, 70, 28, -16, 113, -186, 17, 110, 2, -162, 38, -179, -23, 200, 107, -203, 57, -135, -176, -119, -143, -95, 19, -8, 3, 54, 247, 11, 87, -138, 2, 76, 103, 56, 100, -83, -156, 36, 102, -129, -9, 81, -139, 208, -109, -80, 178, 52, -30, 56, -167, -200, -44, -11, -258, 280, -221, -364, 215, 67, -180]
6504a80K68r3m60N49J94l66J00J28k47Q0R2q8J49pk28L11J5k68Np7M6n2J16q7
6528a00M2%j94K80p0n6J74J5L9k16K18j78J22J65l00q0K34j79J14P1l06K04J52
6551A51l15K81p7o0QJ84j86N7J13k69O9l1J38j26N2O9r6J52j09nJ97j72j10J96
6575A11k96K4K14J7Lj01J63k02P3j40J64j66N7o0M43j92l33K36mM5O2j72O9M6
6599F1J08k44Q5J09m22K37K95k40J25j47k4K01q3j74J45J39l13L59k13l9J83J2
6621A60r9j74R0j50L23j04K5j4N3k07J28nm8Q1k8j86J29mK8k6K14l01J37K27j87
6646F2J10j05m4k58K03j39pM80m38m8K26j79K03k1j66K68j32n7o6K16j04J02J40
6669B46j97r5P1M5l7J52j71o7K89l35n1L01j74j33L78l18J92j20k0PK16o8k54
$$ y = [-180, 88, -5, -465, 84, 278, -88, 12, 140, -107, -27, 65, -23, 126, 119, -109, 202, 217, -51, -46, -123, -77, -129, -13, -100, -58, -58, -252, 28, -42, -98, 76, 91, 130, -86, 132, -46, 76, 241, -59, -139, 95, -84, 30, 101, -205, -1, 151, -164, 117, 40, -20, -12, 172, -14, 43, 156, -113, -44, -75, 63, -63, -11, 58, -38, 114, 5, 0, 197, 25, -85, 111, -185, -161, 53, 70, 73, -28, 135, -67, 6, -134, 30, -136, -79, -139, 304, 112, -221, 15, 11, 56, 118, -54, 15, 61, 169, -75, 10, 119, -303, -66, 229, -11, 114, -33, -57, 144, 61, -113, 32, 171, -142, 217, 4, -35, 148, 160, 61, -113, -23, -173, 150, 46, 71, 57, 110, -97, 31, 26, -22, 59, 31, -155, -26, -30, -2, -28, 186, -115, 22, 249, 62, 172, 67, 23, -235, -32, -171, -178, 302, -136, -184, 42, -137, 66, 45, -121, 147, 15, -42, -108, 108, 4, 106, 246, 49, -46, 25, 70, 33, 185, 14, -53, 236, -99, -150, 151, -23, -156, 222, -96, 96, -24, -44, -37, 179, 111, -143]
6692a43L06l66J14M9J1m6K55k42l6K90k80J2L12k30j25J52M6k05J51pj94K86q7
6715B3k47K11j3P0m2N9n7Q0j3q8j03K14j51K81j81k17K90K1j56q9L05k81J17Q
6739D1k36L11Qk47M1L01j38k49L91k59j9L62l02P5M4k11K58k26K6J10P9q1PJ62
6763B48j72k5j05o8J00L0K34j63j9Pn7Q0r5PK12p5l27L27k30J13Q2j17K43o1m15
6788b46J74K13j15j63L38m56M14kj98Q1m0K6j8Q9j35LJ50n5k09L26q4k92M06k15
6812hj73K69k44k8P2J18jN9j62R4J28rr1m8J75k18N9l6kK57r9l6J6k62j71L51
6838A0N6j46K25l48J78q2K28j65K12K5j43r8J9n0p5M66l22QR1mj35N5n2N0l2J6
6864a3M1kj69K79j64j9J09Q8Kk05K2o9K02q9j85PJ94J98l26K30J67k82J74j69
$$ y = [-143, 163, -203, -89, -40, -29, -75, 180, -62, -98, 192, -88, -76, 236, 6, -119, 33, 79, -126, 25, 18, -176, 110, 23, -224, -13, -26, 44, 2, 61, 4, 84, 71, -17, -120, 94, -57, 224, 43, -174, 116, 137, -19, -108, 197, -84, 33, 41, -195, 116, 124, -123, -82, 219, 81, -168, 223, -36, -55, 307, 5, 80, 124, -87, 171, -55, -29, 81, 160, 79, 86, 248, 76, 51, -54, -122, -22, 8, 242, 79, 60, 67, 10, 90, -5, 2, 214, 139, -188, 139, -91, 22, 104, -13, 230, 169, -246, -72, 141, 26, -137, 201, -255, 159, 157, -41, 40, 0, 26, 8, 97, -38, -35, 115, 60, -149, 177, 93, -199, 207, -8, -181, 88, -156, -184, -112, 6, 5, 64, -98, -4, 124, 115, 24, -24, 151, -67, -8, -44, -46, 211, 112, 76, 92, -170, -341, 10, 66, -80, 145, -203, -25, -107, 121, -44, 168, 193, 50, -48, -29, -79, -154, 312, -10, -2, 89, 85, -50, 5, -47, 3, -29, -13, 28, 26, -143, 136, -28, -47, 62, 150, 152, -53, -31, -100, 102, 13, -172, -165, 29, 227, -99, 131, 298, 16, 190, 21]
6888B1m5l4p3p4K52O9j0K43l43Q6j05j16LL12l80K72K59l23o2J70n5k77L16l29
6912b23K65NQ9j88nJ48jJ34j51k9O2m8p2P0o2L9q7Kl5J76k9m4J3q1PJ06O2j56
6940c3m1R9k16K01J06j38Q3O7k81K30j09N9L1n6J59N7o6r1Rk26K4K55n2k21J76
6965B6m8J07J18P6k95P7k1m3J4N3q0J65l2j47q7J34K2o3N2l44L14jO4k95Q8J57
6991A1M3N4J4k75L44j82l24L61l8j93K44jk3J64n7j86J56o9j35M1P6j92M39l00
7015b8k6N1K06j50j80J24n7L24k75q0J96k6k62J84o1L4K41j98k42L01l4r3Q3J10
7039A42j23N0J2j04R7k00N7J97j24j27K41Q4k93O2J00j92J9J76k15L72k58M6P6
7062I5n1k4J04l7j96J15%J52j93K01k90J93k2L4k70K12p6M4L5k49L28r5r2Q7O6
$$ y = [21, -24, -58, -131, -205, 47, 116, 106, 349, 6, 92, -13, -129, -126, 186, -194, 78, 337, 14, -48, 122, 67, -210, 106, -223, 42, 47, 136, -52, -57, 91, 90, 224, 73, 44, 106, 58, -14, 56, -6, 33, -54, -52, -87, 89, 60, 16, 29, -52, -45, 61, 123, -33, -74, 25, -191, 10, 116, -22, 61, 128, -153, 77, -32, 27, 58, 2, 161, 218, 152, 61, 70, -156, -132, 123, 71, -150, 26, -22, 85, 203, 279, -16, 61, 40, -3, 11, 64, -16, 149, 117, -30, -117, 17, 39, -24, 28, -316, -2, -3, 61, -234, -146, 11, 54, 108, 122, -153, 191, 9, -315, 46, 8, -185, 59, 58, 35, 199, 142, -44, 112, 43, -92, -51, 25, -167, 272, -28, -54, -3, 203, 53, -127, -3, -60, 264, -11, -91, 105, 79, -183, 1, -60, -26, 215, 17, -225, 76, 42, -51, 32, 142, 19, 69, 81, -23, 74, -126, -69, 128, 4, -123, 118, 202, -91, -29, 71, -121, -102, 74, -141, 231, -27, 19, 95, 44, 20, 124, 87, -109, 6, 6, 158, -35, 166, -124, 69, 47, 81, -189, 23, -53, -9, 26, -223, 105, 10, -82, 5, 71]
7087G1j87R4L2j2j00L50k98m9K54j94J20K01m25RO3n3m5K81k46K46N5j87oN0L
7112B7n0K73k55l3J71j44q5J63k9j76J74o6J4j3J03j01L9j03%O5Qj20K38j52p
7137e9k8j9J57qJ12l32J96l0j96J46P1j06J36n8k31n0L25j66L30j35k08L15nl25
7161a68J80J1j18J85kq9n1J70j27J25j43n5J19Q8o4R9q7n2r7nQ8j26J50q5J94
7186A40j02j86J23J12j46J02L6k52K31q9%R0J33k94J87m3m1K3Q7k3k21j2K40k53
7210a58M00l52K52jk04p2J86j80K76q8p3k1J73k64J50l0K09j25r6P9K4J43k78
7233e0M1j8J08J3J9j73q6K91m33L45JNk6n5n8PJ43j7j87J68p5lJ65qn5J37k44
7260d5n9L60l87Q6J02j54N0J5J61j87J43p5O8K10m11k14N10k28q7K56N1k38Q5
$$ y = [71, -116, -22, 10, -2, -102, 248, -50, -99, 155, -39, 81, 282, -143, -134, -71, -124, -169, 112, -134, 112, 167, -20, -26, 24, 27, -23, 250, -5, -38, 133, -11, -96, 67, 38, -138, 36, -30, -16, -29, 74, -27, 12, -91, -91, -26, -18, -138, 100, -52, -59, -87, -106, 51, 43, 155, -177, 19, -11, -207, -61, 10, -96, 40, -18, -249, -299, 26, -140, 190, 55, -153, 162, 157, -168, 12, 23, -95, 90, 88, -1, -52, 118, -9, 116, -27, -82, 37, 125, 61, 160, 73, 21, -76, -81, 7, -119, 31, -54, 140, 38, -148, -25, 87, -59, 43, 79, -173, 58, -31, -31, 59, 192, -102, 85, 42, 1, 24, 111, 88, -133, -145, 95, -158, 242, -110, 142, 141, -63, -135, 51, -129, 147, 59, -14, -35, 138, -126, 24, -6, 203, 78, -18, 61, 85, 228, -50, -9, -27, 81, 94, 113, -60, -146, 145, -288, 57, 58, 63, 37, -18, -76, -69, 74, 57, -130, 38, -37, -40, 125, 117, 62, 199, -45, -104, 256, -131, -45, 57, -97, -47, -32, 129, -58, 85, 10, 78, 288, -123, -337, 173, -55, -142, 114, 165, -73, 12]
7283A2j39q4L68n6Rk7k53J57Qn7O1j7J17j89L12k34p1J52o9j75K41r3n8K65L9
7308B19m35J83jp6J58l2k0K4k5O3r2P4k06Q0J97k55L08j58l2j0O0j06oJ1n6K24
7334I1j38J53j28O2r6n1K80k34M2K02j44n7j8j84J84J16k35J25J26l39L07L6j90
7357i0J7J43j04J6J97J01j30qk20J30n2Q0k35L18j17o0K27k76K8K85m01J92K5
7380F6l1k12M17l16m5L49l96J69O2M7j16J76k39M7q0K63l06N7J2l2P8jM0j03N5
7405c9L6J8J51l78J40R9j29P0K3j68L15j5k38O9J00o7L6J69k91Q5L5l6N4j45J07
7430Ak2l3K60j19L1k82J2K0J44m4q3Q9o6J84P8k5k43M4J04J0j92J67J0k27K91
7455A09j51j05J73L7j50j19K48j41j28M05j95K3P0o8P9r8j67q5L04k83J91J09
$$ y = [12, -127, -211, 157, 101, 110, 83, -170, -13, -5, -62, -1, -18, 99, -90, 222, -12, -83, 69, 0, -175, 66, -27, -85, 180, 219, -216, -33, -34, -110, 48, 16, -4, 20, -5, 58, -34, 40, -166, -86, 111, -144, 164, 6, -26, -36, 24, -82, -88, -77, -133, 91, -47, 106, -22, 40, -56, -107, 173, -61, -19, 183, 39, -18, -36, -220, -36, 80, -155, -30, 96, -243, 64, 100, -90, -73, 70, -34, -18, 179, 280, 150, 142, -78, 52, 0, 80, -155, 163, 46, -14, 213, -63, -35, 250, -151, 41, 66, 35, -177, 240, -76, -121, 228, -168, 1, 63, 110, -6, 170, -69, -22, -102, 161, -145, -88, -76, -108, -30, -31, 9, -94, -39, -3, 15, 166, -212, -72, 27, -102, -32, -9, -177, 138, 123, -115, -46, 54, -13, 23, 192, -99, -14, 21, -15, 39, -106, 1, -21, -54, 206, 87, 118, -164, -152, -132, 12, -32, -115, -26, -92, 92, 170, 145, -98, -54, 50, 60, -132, 35, 45, -182, 109, -42, -147, 26, 63, -87, -206, 42, -99, -227, 178, -17, 6, 76, 8, 87, -11, -178, -263, 41, -242, -51, 58]
7477E8j44J08J43j30K3L62m77k21K39k8R4p1q6Q9k23K78o5K57j50j42K19K04l46
7500iN6j50j92L82j86K63J42l34O3n5K14m57L46j3pJ06j61j77M22j21k81L06l13
7523a56Q0L27k36j06J20N2j88J40k9Q6j11J56j86M1J19k20R3J28k02M8R8%K4N3
7547A31k5j92K04k34K13j12j56J2L69k04L4o0Q3p4JJ57j20J63j00n6J70n5o4L8
7571A23k9j96r4M8J2K8q9O5J89j6j35J74k36R3J05Q7j48L3j64J19J5J23p3j3Q6
7596A07l31L28q3P4k27J25J01J82k85p8J94k14j22L22J7j26K80k34j5j15J19l10
7618b91L21J11k77J77J14k13M8K1M4j0R4k28J47K4k89M47k11j2l9R2j99J09K3
7641Cr4J10J77k09P1o4q4M05l36q2K14j29k01K98N5K9j87nl3n7J75m3O5j52P4
$$ y = [58, -86, 22, 165, 35, 58, 420, -57, -278, -39, -67, 27, -44, -130, -41, -264, 14, -51, 206, 56, -86, 133, 337, -9, 47, -103, -295, 87, -99, 164, 306, -28, 35, -20, 194, -263, 83, 70, 63, 169, 8, -169, 253, 132, -149, 157, -156, -76, 251, 15, -91, 29, 81, -107, 33, 4, 90, -21, 135, -51, -10, 109, -111, -18, 110, -92, -44, 54, 54, 78, 131, 106, -86, 118, -116, 97, -15, -171, -159, 210, 6, 40, -20, 63, -11, -10, 147, 27, 190, 90, 34, 204, 149, 85, 123, 94, -102, -196, -148, -136, -108, -197, -132, 57, 41, -94, 80, -156, -63, 42, 129, -19, 14, -150, -31, -16, 107, 34, 21, 107, -224, 104, 21, 95, -132, -7, 94, 276, -9, -87, 107, -107, -229, 93, 110, -16, 264, 30, 15, -100, 19, -291, 30, 141, -136, 41, 155, -58, -10, 11, 55, 45, 139, -89, 58, 82, -207, 240, 29, 17, -22, 70, -129, -20, 3, -91, 19, 196, -13, 58, -6, -90, 315, -21, -103, 111, -18, -219, 79, 134, 163, -24, -29, -62, -119, 56, 13, 78, -74, 0]
7666@j53j2J49J9K3N8k18J59Q8j98J42j39N8J68j35K14j71l45L30q8K01j88M4
7689Fp4J06J0j88M3J56j6l2mj06R3J82j95kL9p5J37n6P9j97K35j77R1J87j35l86
7715b79L89k27P6K00r4q3N8J20l66K36j42J32R7m7q7K05j47j94J31J45k08J80
7737I5j15rk8N1k8k3r2J91J86k20p6J1K16j21J8j53J39K1kj53N1J43j24j24J30
7762a6J1J29l9l13J63M3k7K98j63k12K15k2l9j3J67k44K9J39j43L3J34k20n0K50
7786A10q4j14L43m32J06K19p5l12M44m01K2J68J16k01J59j74p8L03l13R0O2J07
7808F5q8K07j13k71L07n6j42M22m51j5K90J92m36K50j87J04k1o2P0NP2k29K16
7831A29k11k30K79K51k41R3l6l0j01J36j96K67j47j24K05j16N8r7oJ06mJ24j73
$$ y = [0, -153, -165, -16, 3, 26, 84, -134, 25, 113, -85, 57, -82, -24, 144, 9, 223, 52, -293, 37, -51, 150, -38, 6, -68, 38, 48, -140, -97, 59, 43, 11, 7, -99, -6, 176, -19, -21, 18, -57, 80, 24, 103, -94, 141, -36, 55, 242, 107, -279, 110, -117, -41, 159, 65, -18, 40, 160, -206, 30, -112, 20, 117, 70, -17, 188, 41, -153, -22, 123, -85, 95, -20, -29, -57, -6, -34, -57, -149, 42, 228, 8, -68, -57, 159, 38, 56, -97, 42, 63, 61, -92, -41, 102, -22, -146, -16, -5, 124, 85, -228, -65, -22, -49, 249, 86, -126, 89, 67, 28, 15, 182, -62, -33, 106, -37, -4, 130, -90, -140, 110, 26, -88, 255, -177, -71, 148, 73, -239, 205, -196, -174, -6, 110, -91, 68, -106, -184, 119, -194, -104, -42, 65, -23, 184, 71, -200, 107, 51, -91, 331, -120, -135, 155, 347, -89, 161, -26, 78, 57, -5, 65, 70, 142, -87, 129, -82, -312, -33, 218, -23, 70, 34, 4, -97, 39, -157, 110, -37, -161, 44, -72, -14, -111, -117, -11, -15, 109, -64]
7854f4P1km8j5R4k11K05N7j54J58k4k13L83k27q9J07O0k7J3j37j2K72p5j42J35
7879A15Q8j54M1m2j32O3M4j80J83M0j0J06j12l27J88J02j92J58J71m6p8J18l69
7902b25K76J67j70r9L13j54j38j50J88O6j17m3J31J26n7j32p9J26k11J02K28j06
7924D2o0q5j75M48k16J33k25O8l2L29k78J26j3kj9J01J3k44Q2M5m4J00j17o6K10
7949A21k12l1M8J01L3j5J18M4o3K4m61M43k64K45j83J05o2k3J11k60P9P1j00O7
7973f4O2q6J52j72R3j22K78l97K43q0j69L12R7j30j88K11k38K73j42k4l1J2J19
7996Im2J08J3o3j75pM04p1l07K99k22M7j71R0O3J29O3k30L33l63l6J14K5j00O4
8021b6l5J21q9J69l06J86J36l37J38P7j48K54j86N7o9J21k14K20j69J13o9J71
$$ y = [-64, 7, 5, -43, -58, 36, -175, 30, 87, -67, 91, 67, -146, 237, 10, -79, 28, 88, 61, 74, -63, -75, 197, 122, -20, 115, 203, 49, 90, 48, -84, -21, 23, -157, 26, 66, 56, 162, 50, -277, -89, 13, -179, -21, 150, 104, 26, 144, -225, 51, 218, 48, -51, 262, 108, -30, -180, 8, 74, -43, -86, 45, 171, 114, -18, -97, 29, -182, -80, 148, 42, -18, -103, -278, 170, -46, 87, -138, -70, -102, 227, -51, 75, 62, 60, 41, 142, 155, -89, -7, 38, -6, 94, -23, -89, 121, -91, -122, -74, 27, 60, 45, 163, 207, 144, 168, -293, 150, -114, 131, -52, 53, -9, -32, 79, -181, -102, -31, -131, -64, -2, -88, 64, -108, -15, -137, 141, -256, -13, -93, -262, 50, 147, 17, -171, 40, -198, 75, -67, -91, -122, -110, 9, -33, 75, 88, 25, -150, -157, 247, 176, -131, 168, -54, -7, -178, -88, -25, 104, 167, -63, 270, -93, -129, -15, 10, -90, -26, -61, 60, -29, 140, -166, 20, 156, -181, -43, 34, -114, 140, -46, 11, -58, 63, -151, 69, -100, 13, -56, 115]
8043A15j92M2R1k03K41k01J43J4J31j17k19P4J5M0J62k10J44O6j10M4Q7j42j43
8066a28J51K00k62j32L23l26K50j86j7J00PLJ20j94L8J40J55j62j43N7mL3K06
8089B29j08n5J30j45o2MqJ11Pj73l3J75K6r4jL1k7pK9j7M6j11P9jJ8k0l6p2pJ95
8119A03q6o1p1J08J18m4j66J62J84m34K88J7p6m5L6J38j38p5j44J95qM2o3J64
8143A44j68r8K11m2Pp9p2M1K20j66k4l2J02j58J05J70j05K5m6j39J48j23O0j48
8167a67J39k9R1k1j7J2N2J60n9r9j20O5K9k32L31p1r8K51k82nR5O8k5J3
$$ y = [115, -77, -35, 56, -147, 94, -107, 36, 50, 181, 64, -155, -81, -66, -26, 136, -74, 70, 136, 26, 70, 157, 15, -128, 23, 223, -39, -171, 152, -174, 76, -110, -127, -27, -20, -17, 103, -91, -53, 87, 242, 80, -63, -6, -10, 23, 229, 121, 66, 196, 51, -11, -7, -15, 96, 103, -70, -103, 72, 98, 4, 3, 34, 7, 0, 29, 12, 58, -53, 26, 25, 43, 23, -13, -85, -92, 103, 17, -44, -115, -7, 111, 67, -99, 63, 247, -187, 101, 118, 42, -3, 33, 171, 33, -42, -186, 9, 1, 43, -20, 144, -24, -122, 89, 47, 54, -25, -97, -56, 164, -2, -26, -58, 44, -114, -9, 161, 56, 81, 35, -104, 44, -79, -19, -167, -28, -57, 34, 13, -4, 8, 60, 220, 161, 62, -58, 7, 36, -196, 135, 64, -34, 217, -65, -70, 25, 93, 68, 81]
8191H1
$$ Imaginary data points
##PAGE= N=2
##DATA TABLE= (X++(I..I)), XYDATA
0@%%%%Qj6J6j6K4l2M0m8N6p2Q8j05J29j60J88k19K55k96L45m01M63n27O00o83
28c63P74q76R88j110J244j393J557j735J929k140K377k640K923l233L578l961
44b081M388m866N404o014O712p521Q470r604J0986j2710J4932j7920K2170k8726
58a6380M0214o5956K15599J528k94135L69534k16767k03419K86606j72314k07023
69b62513K88722j27093o3046K86975j18717o6140K62960j47616q2020J91727j49003
80A4236j04613J58030j18684p5877J41937m2788k7641J16825n8229m2253J04997
91F5940l4025p0080P8052m2327j03593J17965M7205j22064R0086O9265j42963
102d6539P6067R2057j74484K4534P6647j71366M9676J04104j51857R0085J26303
$$ y = [0, 0, 0, 0, 0, 8, -8, 8, -8, 16, -16, 24, -24, 32, -40, 48, -57, 72, -88, 100, -119, 136, -160, 185, -216, 247, -280, 320, -363, 411, -465, 523, -587, 657, -736, 821, -914, 1015, -1125, 1252, -1388, 1535, -1698, 1880, -2081, 2307, -2559, 2845, -3169, 3543, -3978, 4492, -5112, 5874, -6836, 8096, -9824, 12346, -16380, 23834, -42122, 173477, 175005, -119130, 250404, 33637, -169782, 116824, -55490, -262513, 26209, -100884, -163930, 123045, 4328, -61812, 201148, 53532, -28488, 163239, 14236, -90377, 67653, -51031, -126908, 15029, -27759, -55400, 61425, 3196, -39057, 65940, 31915, -38165, 39887, -2440, -106033, 11932, 59137, -62927, 27159, 96424, -46539, 29528, 121585, -52899, -28365, 48282, -123084, -73408, 30696, -121161, -31076, 95227]
113I5227j59401J02050J31839j85258P2799R7399k30834L3817R9416j91212M9653
124h4505J04875j55628P5420J30314j06683Q1569R2489j40610M5442P2299j44271
135b9289J9208N4812j39837J8408Q5743q7890L3427R5162p4262J7947Q5771p3176
147F024L109P4650r7192k6630Q5047q0408j8515J10825q0895m0940J26259o0306
159A028n1577J20001o7537p4383J18286m7619o9291J20349l6680o7517J19055
170F4115l5374p1837J13802m0634q7942R6718m6309q3245J13301k4172p9953J08581
182B7051j3261o5896J20478j0175r1527R1573k1160r3235R7555k3837j09616J00609
194H559m907r4553J19299N061j03986J17382J1090j11986J04012O111j18505R5956
$$ y = [95227, -64174, 37876, 169715, -15543, 57256, 154655, -76179, -42362, 57054, -134158, -84505, 20370, -135258, -59838, 70476, -36207, 45362, 137851, -2759, 42683, 114982, -29289, -10081, 44731, -95106, -76698, 9045, -78845, -45418, 49744, -24518, -6571, 79200, 6024, 9133, 83783, -13409, -40039, 45008, -35400, -53915, 56910, -23985, -64925, 61334, 1028, -50549, 69452, 1915, -72468, 45818, -1801, -71092, 49257, 12577, -54940, 64115, 28741, -43096, 70706, 30072, -57870, 38848, -7461, -90706, 22595, -1577, -81530, 27051, 13790, -52106, 68372, 58197, -33330, 58243, 37083, -56152, 41403, 17566, -92050, 8559, 3652, -90901, 28398, 33459, -70527, 46855, 57945, -54041, 49971, 56082, -62423, 33533]
206C3533K804j18702R9208J1863j06939J03834O660j09568J08663J5075j06923
217f0492R6223O371j07322R3214J6219r8653P5952R692q8802P4996J4841q3725
229e1486O4157J4115p7860O3691K1546p7080N3101K8078p3729L9553L3966o9269
241c1217K7670L9127o5702J7709M5591n9701J5048N0869o4593P714O0331o5883
253b3037K510O6248p0437m722P6503o4898r714P7948o5342j4326Q0626o5218j8061
266c1920P9957o9027j8452Q6917o7621j8812R0677o5457k1512R1826o2729k7430
278c3583Q6118o0882l1164Q2904n5651l0716Q3003n0385l0542Q5772m5588l4851
290c5565Q3366m4081m2025Q0097l9263m6732P6939l2098m7783P7911k2714m9236
$$ y = [33533, 36337, -82365, 16843, 28706, -78233, 25601, 32261, -77307, 31356, 46431, -60492, 35731, 42102, -65220, 27994, 44213, -54440, 21512, 31204, -57598, 17398, 32239, -51486, 12671, 26786, -51074, 12617, 34163, -42917, 10184, 38262, -35467, 4086, 38052, -31217, -3547, 35580, -30122, -12413, 33178, -26523, -11475, 39394, -25199, -17485, 42846, -23037, -20527, 45721, -24716, -29438, 47065, -17833, -27547, 50401, -14941, -29267, 51359, -13859, -31920, 48037, -20990, -39442, 47475, -20146, -38958, 51719, -13738, -35250, 56576, -6153, -33583, 52535, -8347, -39511, 43393, -12258, -42974, 40029, -10356, -40898, 44874, -714, -35565, 47801, 3720, -38305, 41792, 2529, -44203, 32736, 638, -47145, 30766, 8052, -41184]
302d1184P6143j9081n4824P4222j5690o2623P0409j2864o6126P1404l539o6190
314d9943P0762K325o6510O9370O633p1094O3009O520p7659O0302J2531p8509N9590
327G327J8752p7812O1135K6947p5683N6961K4850q1323N1068K7690q2828M6050
339C134K8385q4090M7621M0567p9155M5011M2410q0529M1578M4283q2199L3572
351E88M0718q3501L2111M6079p8553L1914N2091p5906K7291N5193p3914K0635
363e254N3960p6873J1215N4101p0032J3377N7607o7620R680O1991o0549P561O0451
376D9615o5537m876O0673n8427q759O1784n5378j2029O7057m5794j1194O6595
388D3730m6966j8905O3787m6593k3828O3938m4198k9670O5613l5160k8166P0625
$$ y = [-41184, 34959, 15878, -38946, 35276, 19586, -43037, 27372, 14508, -51618, 19786, 16247, -49943, 20819, 23144, -43366, 26004, 32637, -38457, 24552, 31072, -46587, 13715, 26246, -52263, 7327, 26079, -51733, 9402, 36349, -39334, 17627, 42477, -38846, 12222, 39912, -42916, 3134, 31519, -52571, -4950, 35617, -43538, 1473, 43883, -36646, 4932, 49215, -32984, 588, 41306, -42195, -10084, 35995, -42558, -10644, 41447, -34459, -7168, 48025, -25889, -5254, 48706, -28167, -16952, 37149, -32883, -19506, 38101, -29519, -19839, 42152, -18397, -10836, 49615, -15922, -20798, 39875, -18552, -27311, 34473, -20905, -32934, 34123, -11671, -22865, 43730, -3236, -22141, 41646, -4947, -28775, 35163, -9035, -38705, 26908, -8252, -36418, 34207]
400C4207k9274l4542O5389k8131l5998O4772k9826m3816O1283k5451m0233O7655
412B6035j9646m5047O5707j3731m5636O4427j2953n2994N7161j1195n2513N9021
424A8636o999n2755N8333l505n1647O0060J924n5491N2504J152n7886M9821P433
437B1580n8098M4246R124n5947M8172J5860n5708M3226J4600n8172M1501J9190
449B9574n9983L4146K0021n9385L3692K7775n5324K9989K8627n6397K8350L2681
461C3766n6863K3270L0282o0488K1554L7082n5616J9043L7666n5206J7578M2301
473C4369n1526J2694L7738n4750R791M1026n1896Q883M1904n1215P964M6685m5989
486a4322M629M4595m7042j904M3531m3016l912M3242m1626o663M7413l5866o418
$$ y = [34207, 4933, -29609, 35780, 7649, -28349, 36423, 6597, -37219, 24064, -1387, -41620, 26035, 6389, -38658, 27049, 13318, -32318, 32109, 19156, -33838, 23323, 12128, -40385, 18636, 11637, -41118, 17215, 13710, -37937, 22123, 24047, -31444, 21060, 22212, -35674, 14147, 21580, -36518, 7728, 16852, -39095, 9077, 24937, -30771, 12455, 27055, -31117, 10384, 29574, -30409, 3737, 23758, -35627, -1935, 25840, -29484, 505, 29132, -27265, 1085, 33766, -23097, 173, 30455, -30033, -8479, 28603, -27013, -7970, 29696, -25510, -7932, 34369, -17157, -4463, 33275, -21475, -11684, 29342, -22554, -13671, 28233, -22982, -15018, 31667, -14322, -9693, 34902, -12140, -14044, 29487, -13529, -17441, 25801, -15825, -22488, 24925, -10941, -17359]
499a7359M9545l6569j4301M9462l3950j7405M9267l3794k3494N0282k7419k1096
511b6831N3772k7167k6484N5297k5459k8399N7683k8518l5608N7959k5167l4303
523c3225N9894k4055l6134N9436k1830l4092N9329k2832l6773N7173k2442l6091
535c1642N8092k0421l7404N5028j8896l5341N4527j6306l5310M8328j5750l2396
547b7491M8053j2528l3779M3333j0407l3146M2985m573l6460L7010j232l6493
559b4728L5122L736l7323K9991O500l6941K9497J1027l8229K6363J4297m1028
571b1716K4767J9476m3357K1672K1412m5604J9903K5677m4560J9205K6145m5996
583b2976J9510K9574m5409J7137K9729m8511J5084L3531m7255J1780L3560m7001
$$ y = [-17359, 32186, -4383, -18684, 30778, -3172, -20577, 28690, -5104, -28598, 21684, -5735, -26831, 26941, -226, -26710, 28587, 3128, -25271, 32412, 3894, -31714, 26245, 1078, -33225, 26669, 2614, -33520, 25916, 4086, -30006, 29323, 6491, -30282, 26891, 4449, -31642, 26450, 6029, -31375, 23653, 4757, -30584, 23943, 7637, -27673, 20655, 4905, -27491, 20562, 8034, -25745, 17588, 7181, -25965, 17020, 12447, -24013, 12997, 11765, -24728, 10394, 14130, -23193, 6798, 13298, -23643, 5854, 16881, -21348, 5015, 19312, -21716, 3051, 22527, -20830, 842, 22254, -23350, -3447, 22230, -22330, -3125, 23020, -22976, -3466, 26108, -19301, -2164, 27565, -20946, -5862, 27669, -19586, -7806, 25754, -21247]
595b1247J0485L7101m3973Q683L5548m3454P265L7679m2538M301L7929m2153J064
608a3310M0373l9507k699M1169l7750n617M2310l5367o563M3027l4609q807M3734
621B6384l2878j0228M4124l2272j5021M3743k8650j6862M4204k6353j9131M3788
633B0848k1940j9038M3362k1290k2400M1914j8466k4881M0833j5514k8516M0666
645A5578r008l0668L9313m896l3986L8391k260l7442L8097l5m1048L9640K516
658A4192m3838M2153O345m8093M2451P768n1885M2930R037n5019M3567R496n5078
671c5974M7429J0533n6265M8557R527n6106M7773P437n6411M4986O370n1852M4033
684A0037N508m6221M2327M716m1387L9779J361l8443L4646J79l5249K9779J934
$$ y = [-21247, -10762, 26339, -17634, -8951, 26597, -16857, -9592, 28087, -14451, -10150, 27779, -14374, -13310, 27063, -12444, -15143, 26026, -11724, -17341, 24969, -10398, -16961, 26066, -8543, -17350, 26384, -6494, -16722, 27402, -4870, -19891, 23852, -4798, -21660, 22544, -3809, -22940, 20848, -1092, -20130, 23232, 1942, -20458, 21456, 2990, -21891, 18942, 3428, -25088, 15578, 6570, -24098, 15215, 10319, -23667, 14724, 12464, -24978, 13119, 13084, -27964, 11676, 14192, -29646, 12507, 18852, -29241, 13210, 20978, -30907, 12023, 21060, -33959, 9608, 19104, -35974, 11455, 21988, -34277, 14280, 23807, -32299, 15474, 22911, -33500, 11486, 17856, -33996, 10037, 15545, -30676, 11651, 16367, -25020, 14759, 16120, -22323, 12323, 12502, -22747, 7032, 8966]
697H966k9566K4726N038k3680J8395P663k0196J0695J0010j9096L262J4340j8004
710g447k095K0983j6904p072K8090j6461j2403L2035j7603j7135L5463j9732k0427
723b0708L9788k2268j9704M5333k5592j9285M9317k8850j9674N1045l1911k0108
735b2617M9931l3206j7616M9276l3143j4599M7503l2168j1481M4764l1915j0867
747a6138M1024l0206j0949L6932k7117r746L2973k2224q384K9847j7621r452K6396
760A5335j4061j2712K4149j0513j7618K3926m687k1965K4674K149k5356K4468
772G789N833l0042K4177Q523l4898K3411R574l8154K6295J3282m0828K8486J5321
785A8769m2045L0181J5661m4803K9367J3252m5482L0486J1653m4466L1758J2031
$$ y = [8966, -20600, 4126, 9164, -14516, 3879, 11542, -8654, 2041, 12051, -7045, -3783, 10557, -7447, -9542, 11441, -5463, -12535, 15555, -906, -13309, 18726, 1123, -16012, 19451, -281, -20708, 19080, -3188, -22892, 22441, -3151, -22436, 26881, -1969, -21643, 29402, -2509, -22617, 27314, -5892, -23508, 25768, -7375, -21974, 25529, -6639, -18120, 26644, -5271, -16138, 24886, -5320, -16269, 20663, -6454, -16200, 16773, -5451, -13835, 16012, -1609, -11061, 15335, 1274, -11438, 12711, 2198, -15420, 8506, 3819, -18146, 6528, 8677, -16679, 7789, 13622, -16420, 7757, 16280, -18618, 4793, 14367, -23787, 2508, 15790, -25038, 3448, 18769, -23276, 6905, 22566, -22237, 7130, 20382, -25100, 5386, 17039, -27427, 4331, 16362]
797A6362m2444L3250J1936m2197L1727J1586m2477K8498J0898m0366K6837J1337
809A4947l7749K5399J3017l4368K3589J2663l4636K0350J3956l3653J5951J5664
821A5130l2242J3464J9559l0038J0775K1211k9567Q649K1780k9829O153K2237
833A7282k9980M339K5307k8473K452K6674k6227J98K7242k5336j631K6245k4857
846f765l433K5855k3245l272K6112k1890m475K6742j9257o964K6288j7304r652
859a1260K5515j5145j1922K5446j2787j3869K5750j1348j4957K7600j0148j8168
871a5293K7830p843k0550K8268o559k3620K8426m334k4754K9189l911k5960L0224
884A1113l011k7050L1050l441k8249L1279k622k9240L0044j186k8468K9454m75
$$ y = [16362, -26082, 7168, 19104, -23093, 8634, 20220, -22257, 6241, 17139, -23227, 3610, 14947, -22802, 2597, 15614, -18754, 4835, 17498, -17138, 3212, 17168, -16485, -534, 15130, -17112, -3648, 15911, -14127, -3352, 17859, -11708, -3059, 18721, -11108, -4955, 17282, -12698, -8359, 16948, -11525, -9073, 17601, -8626, -8428, 18814, -6522, -8153, 18092, -6765, -10198, 15657, -7588, -10860, 15252, -6638, -11113, 15629, -3628, -10592, 15696, -1608, -11260, 14255, -890, -12812, 12634, -153, -14022, 11728, 380, -14577, 13023, 2875, -15293, 12537, 4694, -15856, 12412, 5853, -17767, 10659, 6325, -18429, 10760, 6849, -19111, 11113, 8102, -18948, 12102, 8661, -19588, 11691, 9069, -20171, 9873, 8687, -19781, 9673, 9198]
897I198k8631K8964M61k7626K7696q01k7752K7137J556k8445K4636K677k6615
910a7545K3975M868k6912K0231O871k5317J8096P327k6497J6420J0170k5817J4807
923F77J2064k6717J3909J4996k6926J0614J5642k6193R253J7377k6763P462J9033
936A4428k5359P210J9802k7686O356K2685k7690M713K2003k7807M508K3888k7177
949a0126L076K3029k5464L468K3177k6521J871K3897k5068R65K3940k4993n6K5082
963A6277k3101j642K3681k1714j921K3154k0369l429K2552j8651l575K3004j8511
976d245n700K3458j5574q169K2192j4202r031K2676j1875j0217K1092j0183j0409
989a0187K0860r230j2665K0893p660j3860K0228n729j5447K0702l367j6482J9266
$$ y = [9198, -19433, 9531, 9992, -17634, 10062, 9261, -18491, 8646, 10202, -18243, 6393, 9070, -17545, 6430, 11298, -15614, 4617, 11488, -13829, 4267, 11594, -14903, 1517, 11687, -14130, 677, 12741, -13976, -67, 14929, -11997, -1383, 14259, -11934, -2681, 14696, -12067, -4605, 14428, -10931, -3721, 16081, -11605, -5249, 17436, -10254, -5541, 16462, -11345, -6837, 17051, -10126, -7050, 15979, -9485, -6017, 17160, -9361, -7490, 16407, -8661, -7696, 16244, -8749, -8805, 16277, -6824, -8466, 15215, -6499, -8420, 14734, -5635, -9064, 13488, -5163, -8738, 14266, -4245, -9945, 13513, -2061, -10230, 11962, -2240, -11271, 11405, -470, -10687, 10405, 222, -10187, 10673, 1443, -11222, 9671, 2011, -11849, 8379, 2650, -12797, 7905, 4538, -11944, 7322]
1002G322j799j7016J8853j107j8741J8425N91j9524J8592J465k1032J8890M105
1015I024k2005J7528M732k2415J7265N845k3347J6443O523k2953J6955O673k3782
1028a3514J6149Q460k4435J5034R744k5319J5118J0860k4816J3481J1212k4183
1040a2209J3432J1125k4811J2323J2194k4137J1656J2527k4083J0319J4691k3193
1052a0166Q057J4617k2282P292J5130k2028O077J5205k0718N383J6175k1172L706
1065d724J7298j9861J446J7791j9000J89J9422j7700j869J9401j6715k265J9812
1078A3225j7327m184K0291j6275m966K1387j6061o544K2636j3743p901K2135j3621
1091i48q837K2336j3554r970K2561j3127j0181K3195j2426j0902K3746j1031j2198
$$ y = [7322, 5523, -11493, 7360, 6253, -12488, 5937, 6528, -12996, 5596, 7061, -13971, 4919, 9024, -12981, 4547, 9279, -13136, 4129, 9974, -13373, 3070, 9593, -13360, 3595, 10268, -13514, 2635, 11095, -13340, 1694, 11438, -13881, 1237, 12097, -12719, 762, 11974, -12209, 1223, 12348, -12463, -140, 12054, -12083, -427, 12100, -11983, -1664, 13027, -10166, -2109, 12508, -9774, -2482, 12648, -9380, -3303, 11902, -8816, -3433, 12742, -8430, -4724, 12574, -7287, -5841, 11950, -7050, -6861, 12561, -5139, -7008, 12393, -4322, -6587, 13225, -4102, -8286, 12005, -4270, -9236, 12151, -3910, -10454, 12182, -1561, -9462, 12673, -948, -9785, 12551, -1003, -10973, 11588, -1539, -11720, 11475, -951, -11853, 11893, 862, -11336]
1104a1336K2774j0278j2955K2014q587j3525K1256p663j3593K1896p194j4666
1116a1857K1289n998j5466K0566m462j6832J9582k260j6463J8169l59j7375J7407
1129E941Q64j8246J6810J983j9722J6890K967k0565J6642N148k0876J5412O342
1142I590k1460J4321P718k1844J3536P986k2190J3848R004k2709J3495R792k3239
1155a2152J2679J0753k2538J1331J1033k1844J0166J1303k0652R469J1120k0039
1167i371P889J2157j9562O492J3145j9220N416J3739j7830L364J4665j6901J343
1180d674J5163j5668n22J6172j5122k111J7752j4450m095J9225j4190o030J9996
1193A1446j3776p250K0456j2854q013K0952j2381q182K1497j2592r130K1983j2912
$$ y = [-11336, 11438, 1160, -11795, 10219, 1632, -11893, 9363, 1700, -11893, 10003, 2809, -11857, 9432, 3434, -12032, 8534, 4072, -12760, 6822, 4562, -11901, 6268, 5909, -11466, 5941, 6805, -11441, 5369, 7352, -12370, 4520, 7487, -13078, 3564, 8712, -12164, 3248, 9590, -11870, 2451, 10169, -11675, 1861, 9847, -12343, 1505, 10509, -12200, 1295, 11087, -12152, 527, 11280, -11258, 73, 11106, -10738, -572, 10731, -9921, -452, 10668, -9371, -1482, 10675, -8887, -2395, 10750, -8470, -3054, 10685, -7145, -3781, 10884, -6017, -4674, 10489, -5179, -5701, 10471, -4651, -6762, 10990, -3460, -7555, 11670, -2520, -8550, 11446, -2330, -9580, 10876, -1978, -9991, 10961, -1420, -9602, 11895, -697, -9827, 12156, -756]
1206g56j0219K2720j2629j0928K2864j1569j0961K2417j0853j0562K0962r851
1218F35j0600K0026r219j1339J9492p438j2294J9279o027j2893J7609l940j3320
1231a0029J6201k748j3439J5419j508j3791J5120j59j4624J4722J123j6499J3996
1244C784L194j7719J3467M610j8386J3301N669j8510J2965O137j8720J2807O591
1257I190j9765J2306P352j9720J1700Q228k0092J1106R050j9468J0542Q636j8856
1270i791J0464Q766j8932R819R252j8573R077J0051j8882P321J1012j7676N806
1283b286J1372j7109N387J1978j6281M601J1911j5709L887J2216j6023K699J2621
1296I264j5485K024J3065j4366J106J3126j3198L89J2993j3042J05J2508j2362
$$ y = [-756, -10975, 11745, -884, -11812, 11052, -517, -11478, 10939, 86, -10476, 10486, 635, -9965, 10061, 842, -10497, 8995, 1557, -10737, 8542, 2515, -10378, 7231, 3291, -10029, 6172, 3424, -10015, 5404, 3896, -9895, 5225, 5066, -9558, 5164, 6287, -10212, 3784, 6978, -10741, 2726, 7336, -11050, 2251, 7920, -10590, 2375, 8512, -10208, 2599, 9190, -10575, 1731, 9083, -10637, 1063, 9291, -10801, 305, 9355, -10113, 429, 9065, -9791, 673, 9439, -9493, 326, 9578, -8995, 82, 10133, -8749, -1428, 9584, -8092, -2286, 9086, -8023, -2636, 9342, -6939, -2338, 9573, -6136, -2249, 9967, -6056, -3357, 9264, -6221, -4197, 8868, -5498, -4392, 8734, -4464, -4075, 8918, -4124, -4019, 8489, -3873]
1309c873n75J2652j1499j430J2478r924l003J2343q515m496J2194p204n257J1883
1323E774n772n912J1976m810p526J2441l981r818J2982k852j1259J3200j591j2061
1337i209J3588k81j3175J4630n64j4310J5238q68j5447J6171j231j5899J6563
1350E206m89j6125J6964l84j5813J6729j017j5485J6390j080j5560J6593j160
1363D769j5229J6008p88j4638J4801N3j4179J2896R20j2896J0846K315j2088R200
1377A990L441j1743P814M679j2665O640O257j2729N232P965j3277M011R996j3440
1391e829L722J0904j4384K804J2560j5896K560J3844j7237K570J5395j8222K303
1404d906J6214j8497K772J5984j8556K992J5391j8434L513J4904j8596L786J4502
$$ y = [-3873, -4448, 8204, -3295, -4725, 7753, -2171, -5174, 7169, -1346, -5842, 6352, -852, -6109, 5774, 2, -5910, 6066, 1256, -6270, 6171, 2190, -7628, 5354, 2502, -8757, 4443, 2852, -9209, 4379, 4098, -9077, 5553, 4989, -9321, 5917, 5049, -10398, 5773, 4542, -11357, 5206, 4717, -11408, 5556, 5172, -10641, 6088, 5071, -10414, 5976, 4896, -10664, 5929, 4769, -10460, 5548, 4760, -9878, 4923, 4976, -9203, 3693, 4613, -8283, 2563, 4878, -7210, 1990, 5431, -6312, 1502, 6181, -6484, 156, 6413, -6316, -1084, 6881, -6396, -2385, 7611, -5829, -2107, 8797, -5587, -2783, 9777, -6119, -3559, 10285, -6952, -4382, 11013, -7209, -4906, 11308, -7189, -4417, 11567, -6989, -3997, 11394, -7040, -3527, 11377, -7219, -3433, 11069]
1417A1069j8152L220J4073j7482L428J3344j5424K438J2419j3873K077J1310j2386
1430c939Q85J0209j0639n26J0366q940k115J0359o637l704J0397n544n647J0662
1444E187m205o639J0556l754p712J1809l080r486J2518k177j1038J3244j661j2988
1458i426J4057q51j3032J4111p80j3140J4202k51j3388J3384l59j3593J3481K01
1472D616j4127J2599J390j3313J2070J927j3086J1026K561j2550R898K131j2672
1485g530R367L403j2982Q667N155j3249P991O235j3953O695P871j4608O318Q365
1499G745j4990N856R666j5203N693J0007j6009N264J1205j5574L675J1619j5787
1512f833L805J2426j5831L410J2187j5316L614J1916j5559L361J1919j5049K711
$$ y = [11069, -7083, -3863, 10210, -7272, -3844, 9500, -5924, -3486, 8933, -4940, -2863, 8447, -3939, -3054, 7155, -3484, -4010, 6356, -2584, -4699, 5660, -977, -4681, 5716, 172, -5475, 5187, 982, -5657, 4899, 1145, -6567, 5242, 2162, -7324, 5194, 3017, -8021, 5223, 3562, -9426, 4631, 3780, -9252, 4859, 4079, -9061, 5141, 4890, -8498, 4886, 4527, -9066, 4415, 4616, -9511, 3088, 4478, -8835, 3235, 5162, -7924, 3102, 5663, -6887, 3011, 5142, -7530, 1837, 5240, -7742, 925, 6080, -7169, 822, 7057, -6896, -201, 7670, -6938, -620, 7745, -7245, -1389, 8277, -6926, -1233, 8774, -7235, -1971, 9234, -6340, -2665, 8954, -6833, -3028, 9398, -6433, -3023, 9164, -6152, -2538, 9378, -6181, -2820, 9099, -5950, -3239]
1525c239J1882j4092K149J1880j3149Q64J1831j2030M00J1311j1570m25J1648
1538G460j0927p72J1860j0393k047J2072r121l349J1998q138m401J2472p330m989
1552e605J2420p137n753J2999o998o696J3260o311p480J3640n454q213J3515m903
1566A284q398J2917m134q619J2545m329q694J2948l876q995J2575l168q973J1933
1580E016k618r151J1189k008r144J0341j453q540R829n53r138R698k52r167Q772
1595B821R06r673Q037J543r707P286L153r669O201L793r646N683M388j0681N523
1610d2N511j1215N418O082j1097M580P072j1450M142P392j1445L451P695j1200
1624e106L427Q143j1509L281R088j2037K771R281j2023K072R831j1933J560J0115
$$ y = [-3239, 8643, -5449, -3300, 8580, -4569, -3705, 8126, -3904, -3504, 7807, -3763, -4188, 7460, -3467, -4239, 7621, -2772, -4819, 7253, -1868, -5217, 6781, -1357, -5758, 6714, -616, -5605, 6815, -322, -6075, 6924, -74, -6770, 6490, 179, -7301, 6339, 885, -7328, 6187, 1284, -7114, 5803, 1669, -6950, 5595, 1266, -7428, 5520, 1644, -7351, 5224, 2056, -6917, 5016, 2398, -6753, 4436, 2428, -6716, 3625, 2172, -6368, 3461, 2908, -6230, 3468, 3216, -5951, 2821, 3727, -5946, 2091, 3634, -6073, 1213, 4366, -5303, 898, 4691, -4955, 728, 5116, -5565, -42, 5469, -5746, -328, 5754, -5343, -763, 6309, -5141, -999, 6393, -5052, -1601, 6094, -5106, -1679, 6464, -5045, -1764, 7324, -4713, -1942, 7339, -4684, -2612, 7219, -4714, -3154, 6961]
1638F961j1166J373R534j0940J606R858j1015P16J0071j1002K42J0870j0547m27
1652c866J0860j0162m27J0615r768j065J0229r422q25J0133q751j675J0422q223
1666a925k175J0659p822l272J0551p015l926J0129o281l723J0064n853m429J0553
1680E535n422m860R766m810n769J0223l671o557R881l111o671R628k483p127R709
1695D261k660p219R219j573q252R526q39q670R567r2r276Q964L87r311Q577M44
1711C053r302Q811O58r245Q505J277r543Q131J910j0206P502K836j0118O763L244
1726D276r855O598L402r557O186L530r587N390M121r579M982N096r555L627O154
1741E229r203L085O256r105K275O671q907J944P101r371J897P650q610O03Q589
$$ y = [6961, -4205, -2832, 6702, -4238, -2632, 7226, -3789, -3073, 6998, -4004, -3762, 7108, -3439, -3866, 6994, -3168, -3595, 7020, -2748, -3813, 6416, -3006, -3831, 6302, -2449, -4124, 6298, -1925, -4100, 6559, -1263, -4535, 6016, -999, -4925, 5204, -1077, -4800, 5264, -589, -5018, 5535, 113, -4747, 5019, 209, -5560, 4663, 992, -5565, 4316, 1205, -5466, 4162, 1679, -5448, 4261, 1601, -5618, 3601, 2028, -6224, 3302, 2463, -6207, 3360, 3268, -6008, 2956, 3343, -5968, 2609, 3053, -6249, 2562, 3220, -6025, 2480, 3757, -5786, 2345, 4255, -5951, 1551, 4387, -5731, 1032, 4276, -5579, 1019, 4421, -5136, 1050, 4580, -5007, 383, 4504, -5075, -93, 5003, -4552, -925, 5229, -3974, -889, 5367, -3738, -1463, 5208, -3699, -1755, 5346, -4025, -2128, 5522, -3088, -2485, 6104]
1756F104q904m7Q883q553j152R426q106j543R861q396j710J0498q163k044J0157
1771F311q471k473J0873p916l217J0637o879l373J0568o836l718J0134o464l980
1785d804J0286o402m277J0231n249m801J0245n020n070R644l599o091Q730k914
1799I09o068R010k533o858Q942j521p298R052j350p930Q619L8q625Q040N30q726
1815e769Q202J079r277P958J466r594Q249J669j0148Q031K272j0415P946K788
1829D457j0151P340K900j0123O899L018r921O258L627r721N973L949r642N628
1843D91M249r325M580M709q792L817M599q028K806N198p875K543N582q083J774
1858a755O794q243J051P190p972J41Q215p718l14P995p529q38Q141p373j134Q660
$$ y = [6104, -2800, -2847, 6036, -2517, -3669, 5757, -2349, -3892, 5969, -2427, -4137, 6361, -1802, -3846, 6311, -2160, -4633, 6240, -1676, -4893, 5744, -1135, -4508, 6060, -776, -4494, 5640, -824, -4804, 5482, -920, -5197, 5034, -215, -5016, 5229, 209, -4861, 4783, 1184, -4907, 3823, 909, -5159, 3851, 1318, -5540, 3402, 1881, -5417, 3635, 2285, -5645, 2974, 3012, -5613, 2427, 2957, -5769, 2433, 3512, -5765, 2193, 3659, -5935, 2314, 3983, -6165, 1866, 4138, -6277, 1669, 4457, -5694, 1646, 4546, -5577, 1322, 4340, -5581, 677, 4304, -5417, 556, 4505, -5137, 491, 4740, -4585, -5, 4704, -4088, -271, 4328, -3700, -894, 4304, -3571, -1028, 4554, -3529, -1755, 5039, -3204, -2153, 5037, -2935, -2794, 5421, -2297, -2611, 5384, -2145, -2983, 5158, -2215, -3349, 5311]
1874E311p709j306R197p365j959R762p772j852R520p343k273R218p107k186Q751
1889D887o568k132Q834o158k812Q821n701l178Q548m952l764Q165m016l913P824
1904C885l568l940O947k817m368O910k497m778O987j451n441O953q23o160O637
1919B476m4o808O524R1p116O996K09p277O854J063p896O966J361q012O379J777
1935C543q487O101K179q246O296K056p941N657K210p824N665K423q149N201K820
1950C504q073N038L496q136M405L980p953L972M081q273L563M343q126L342M897
1965D060p804K842N445p701K243N677p542J319O084p730J177O219p479J493O203
1980D506p511J242O759p659P67O660p464M94O839o986J24O549o390k82O943o340
$$ y = [5311, -2398, -3704, 5493, -1872, -3831, 5931, -1841, -3693, 5827, -1516, -3789, 5429, -1678, -3864, 4887, -1681, -3813, 5021, -1137, -3949, 4872, -829, -4007, 4541, -411, -4175, 3990, -26, -3939, 3885, 317, -3623, 3324, 507, -3861, 3049, 552, -4226, 2761, 1310, -4131, 2822, 1999, -4161, 2476, 2432, -4376, 2148, 2239, -4877, 2119, 2328, -4949, 1905, 2968, -4928, 2038, 3399, -4613, 1766, 3543, -4944, 1157, 3336, -4910, 1386, 3442, -4499, 1158, 3368, -4456, 1209, 3632, -4517, 684, 3504, -4569, 469, 3965, -4171, 234, 4214, -3739, 233, 4314, -3959, -396, 3947, -4179, -837, 4060, -3744, -902, 4543, -3158, -915, 4762, -2780, -1461, 4623, -3107, -1930, 4289, -3190, -1697, 4506, -3005, -1763, 4996, -2663, -1896, 4764, -2700, -2206, 4633, -2353, -2229, 4320, -2070, -2352, 4591, -1749]
1996a749o14O662o003j049P059n522j938P344n260k010P056m534k423O958m457
2011d80l065P339m203l236P442m099l706Q076l979m220P987l538m571P776k947
2026E76m655P702l046m682P607k632m949P371k511n143P562k286n300P354k028
2041I40m825O418j197m648N453p72m946N483m84n110N396K02n501M634J331n722
2057c348M259J740n911L487K691n997L104L194o355L095L552o723L047M160p564
2072c569K886M861p931K703N185p753K683N441p767K421N363p816K342N469q088
2087c570K443N554p971K234N726p527J866N660p253J408N647p003J240N538o481
2102b489P97N634o169M80N750n617o64N976m965j475O376m926j660O659m385k190
$$ y = [-1749, -2363, 4299, -1704, -2753, 4306, -1216, -3154, 4190, -1070, -3080, 3976, -558, -2981, 3977, -480, -3545, 3794, -409, -3645, 3797, -302, -4008, 4068, 89, -4131, 3856, 318, -4253, 3523, 576, -4079, 3623, 577, -4105, 3502, 870, -4079, 3292, 781, -4362, 3200, 914, -4386, 2968, 940, -3885, 2533, 1336, -3312, 2141, 1369, -3577, 1906, 1422, -3688, 1708, 1910, -3591, 1043, 2374, -3348, 911, 2651, -3260, 227, 2918, -3079, 25, 3219, -3136, -41, 3511, -3212, -165, 3995, -3569, -683, 4178, -3753, -1050, 4135, -3618, -935, 4506, -3261, -840, 4523, -3293, -951, 4518, -3570, -1127, 4427, -3544, -1310, 4416, -3111, -1245, 4415, -2838, -1430, 4217, -2786, -1546, 3992, -2489, -1692, 3942, -2227, -1747, 4003, -1614, -2278, 3698, -1267, -2742, 3634, -1292, -2952, 3707, -678, -2868]
2118b868O767m323k586O883m112l140P020l963l805P767l834m045Q162l566m080
2133c723P777l610m455P894l694m386P764l486m091P708l007m650P459k844m505
2148c849O933k397m640O559j876m318O267j732m222N568j104m578N406m90m977
2163c450M780M33n060M147J264n233L936J774n371L557J684n720L629K266o098
2178c462L348L374o490L162L782o880K726L954o807K898L844o890K988M198o858
2193c113K560M428o970K553M335o784K015M638o298J622M617o080J271N050o331
2208b487J114N129o040P03N114n417J41N179n013k79N489m814r94N679m636j281
2224b413N849m610j730O415m362k163O607m191k538O882m108k726O493l674l293
$$ y = [-2868, 3899, -424, -3010, 3873, -239, -3379, 3641, -322, -4127, 3640, -194, -4239, 3923, 357, -3723, 4054, 444, -4011, 3883, 189, -4197, 3567, 81, -4010, 3698, 691, -3959, 3500, 656, -3849, 3084, 687, -3953, 2606, 730, -3588, 2679, 947, -3275, 2293, 1189, -3389, 2017, 1527, -3450, 1330, 1763, -3297, 850, 2114, -3119, 817, 2591, -2780, 777, 2461, -3259, 370, 2636, -3462, -114, 3260, -3230, -68, 3714, -3166, -440, 3514, -3293, -395, 3449, -3441, -453, 3745, -3113, -553, 3875, -3095, -542, 3793, -2991, -976, 3662, -2636, -1014, 3603, -2477, -1206, 3844, -2487, -1373, 3756, -2284, -1581, 3533, -1884, -1743, 3436, -1577, -1856, 3633, -1181, -2175, 3504, -1132, -2413, 3436, -1174, -2904, 3511, -851, -3014, 3593, -598, -3136, 3746, -362, -3088, 3405, -269, -3562]
2239c562P110l468l588P084l375l750P197l444l791P181l435m112P156k922l990
2254c709O990k628m017O426k370m257O664k460m464O636k094m559O483j589m584
2269c532O116j239m604N596j071m664N251o54m678N293j80n001M890M13n250M897
2285A583O26n612M268J310n420M073J408n274L662J844n454L569K039n672L095
2300D5K921n868K915K828n688K849L016n713K442L335n683K183L353n637K187
2315e15L564n551J820L986n700J626M265n788R13M431n159O43M664n355R36M351
2331C131m773L44M724n077K6N041m854o33N463m550j062N449m367j053N344m023
2347h70j163N172l969j568N437l424j979N227l267k342N786k995k770N420k668
$$ y = [-3562, 3548, 80, -3508, 3576, 201, -3549, 3648, 204, -3587, 3594, 159, -3953, 3203, 281, -3709, 3281, 653, -3364, 3062, 692, -3565, 3099, 639, -3825, 2811, 717, -3842, 2641, 1052, -3532, 2584, 1345, -3259, 2337, 1266, -3398, 1853, 1199, -3479, 1814, 1634, -3367, 1523, 1936, -3314, 1583, 2209, -3403, 865, 2175, -3245, 828, 2236, -3038, 624, 2468, -2986, 583, 2622, -3050, 45, 2966, -2902, 13, 2841, -2847, 2, 3018, -2695, -253, 3082, -2601, -418, 2935, -2702, -515, 3049, -2502, -682, 3304, -2396, -770, 3495, -2293, -1380, 3051, -2108, -1465, 3199, -2156, -1220, 3131, -1642, -1298, 3426, -1651, -1625, 3416, -1438, -2071, 3392, -1158, -2220, 3229, -1138, -2191, 3153, -870, -2033, 3139, -830, -2398, 3039, -385, -2364, 2863, -404, -2746, 3040, 45, -2725, 2695, 27]
2362B7k983N548k556l030N663k513l089N772k239l608N510j563m275N590j372
2377H82m145N270r87m203N255r69m137N306j042m641N247n49m639N035j70m750
2393c237M838K77m951M636K88m952M535K64m987M419N77m632L931J060m768L620
2409I18J367n040L171J733m764K818J581m456K685K343m730K517K245m578K245
2424E5K341m735J827K939m445J383L234m352Q15L592m469R93L706m705P84M137
2440C100m866N62M223m666M68L986m204mM049l852l38M022l629n67M469l975l61
2457a583M338l756n63M299l480j157M561l120j441M135k793j335M184k436j956
2472b103M389k355k041M206k019k279M274j788k550M279j252l227M358j120l066
$$ y = [27, -2956, 2592, 36, -2994, 2669, 156, -2933, 2839, 600, -3008, 2502, 939, -3336, 2254, 882, -3263, 2007, 1020, -3183, 2072, 1103, -3034, 2272, 1230, -3411, 1836, 1287, -3352, 1683, 1513, -3237, 1601, 1878, -3073, 1563, 1851, -3101, 1434, 1698, -3289, 1130, 1707, -2925, 1006, 2066, -2702, 918, 2285, -2755, 416, 2149, -2615, 203, 1784, -2672, 13, 2356, -2374, 143, 2388, -2190, 55, 2396, -2339, -512, 2427, -2018, -635, 2599, -1753, -938, 2654, -1815, -822, 2884, -1821, -1037, 3100, -1766, -1204, 3019, -1647, -1179, 2807, -1397, -1401, 2648, -1204, -1542, 2480, -1149, -1716, 2753, -1222, -1583, 2755, -1001, -1564, 2735, -745, -1902, 2659, -461, -1902, 2233, -560, -1895, 2289, -147, -2103, 2286, -69, -2110, 2096, 77, -2202, 2072, 284, -2266, 2013, 761, -2466, 1892, 772, -2294]
2487b294M131j031l509M280p07l654M689p61m013M606m06m323M352q0m029L964
2503A215L7m048M266P6m166L871N95m448L792J62m162L685N10l951L212R95l612
2520a971K742R28l750K544J198l550K082J624m055K128K255l843J335K617l903
2535a619J101K876l869R62K757l947R79L255m139P90L401m300O36L738m232K85
2551a326M295m408R9M036m013J93M046m077p0L820l888J45L518l844k84M054l427
2568a131n53M072l323n08L863l011q03L683k991r39L730k710j173L929k287j740
2584a892L697j746k138L927j679k315L843j230k459L827j269k548L948j535k856
2599b425L884j000l068L891m53l567M133l15l441L960o04l245L698j10l680L731
$$ y = [-2294, 1837, 806, -2703, 1577, 870, -2784, 1905, 1144, -2869, 1737, 1331, -2992, 1360, 1280, -2749, 1215, 1252, -2796, 1470, 1546, -2620, 1251, 1846, -2602, 1190, 1352, -2810, 875, 1385, -2566, 646, 1641, -1971, 771, 1699, -2051, 493, 1691, -1859, 223, 1847, -2208, -80, 2175, -1668, -333, 2284, -1619, -518, 2358, -1511, -549, 2208, -1739, -760, 2495, -1644, -854, 2547, -1753, -1117, 2621, -1611, -1326, 2969, -1439, -1340, 2696, -1317, -1124, 2922, -1155, -1225, 2595, -1293, -1148, 2370, -1474, -1758, 2296, -1131, -1684, 2388, -935, -1443, 2420, -591, -1394, 2289, -702, -1641, 2089, -621, -1794, 2135, -152, -1892, 1805, 59, -2079, 1848, 169, -2146, 1697, 467, -1992, 1835, 566, -1982, 1966, 431, -2425, 1459, 459, -2609, 1282, 829, -2738, 1395, 1080, -2361, 1599, 995, -2250, 1448, 1338, -2342, 1389]
2615A389n26l449L765l13l517L628L39l715L365O16l558K733O67l707L047O28
2631A392l447K638R40l582K566J179l968K291J584l607J792J710l332J678K359
2646B193l625J534K018l843J613K106m066J390K641l628J026K671l809J012L054
2661B287l492M91L233l887M59L093l512L71L250l604L08L405l596j80L520l190
2677a044k33L587l086n85L583k906p21L709l034p68L864l055j326M146k877j281
2693b027M130k403j436L636j860j703L740k233j890M017k143j864M050j948k204
2708b138M233j902k403M025j544k409L560j164k206L528j169k351L573j111k659
2723b137L666r06k919L454n58k823L200r4l021L221L0k975K972J63l510L004M18
$$ y = [1389, 863, -2586, 1179, 866, -2651, 977, 1316, -2399, 966, 1582, -1976, 757, 1424, -2283, 764, 1392, -2055, 583, 1523, -2059, 507, 1686, -2282, 9, 1593, -2014, -222, 1488, -1844, -166, 2193, -1432, 102, 2120, -1723, -110, 1996, -2070, -680, 1961, -1667, -641, 2030, -1779, -767, 2287, -1205, -714, 2519, -1368, -909, 2184, -1328, -957, 2293, -1311, -1003, 2402, -1194, -1374, 2146, -1044, -1277, 2310, -776, -1361, 2222, -684, -1405, 2304, -730, -1498, 2366, -689, -2015, 2131, -746, -2027, 2103, -300, -1736, 1900, 40, -1663, 2077, -156, -2046, 1971, -172, -2036, 2014, 66, -2138, 2095, 193, -2210, 1815, 271, -2138, 1422, 258, -1948, 1580, 411, -1940, 1633, 522, -2137, 1529, 623, -2296, 1158, 600, -2223, 977, 883, -2138, 1083, 1113, -1862, 1110, 1273, -2237, 767, 1185]
2740A185l628L095Q01l837K905Q67l686K812J189l943K762J041l675K585R53l467
2756b041K423J103l420K380J365l979K332J679l723J697J816l431J952J792l585
2771a640J732J473k960J272J951l443J165K257l069N32K432k837N14K592k709
2786g38K26K180k407l39K917k553o33L254k590o75L376k497j150L551k244j259
2802a581L541k412j194L745k637j205L906k508j340L952k304j694L867k470j723
2817b057L865k078j583L663j799j764L547j740j842L627j791j717L310j375k187
2832a921L506j236k052L087p74k307K803n68k249K967n35k801L208K3k790K634
2848I95J59l112K736N83l247K422Q08l491K567J043l509K736P50l404K406J217
$$ y = [1185, -2443, 652, 1453, -2384, 521, 1388, -2298, 514, 1703, -2240, 522, 1563, -2112, 473, 1426, -2041, 382, 1485, -1935, 445, 1810, -2169, 163, 1842, -1881, -184, 1632, -1799, 153, 1945, -1640, 92, 1565, -1395, -123, 1828, -1615, -450, 1807, -1262, -730, 1702, -1135, -621, 1971, -738, -512, 1668, -739, -1078, 1839, -714, -1347, 1907, -683, -1358, 2018, -479, -1629, 1922, -322, -1581, 1960, -452, -1646, 2099, -538, -1743, 2163, -345, -1685, 2267, -37, -1731, 2136, -334, -2057, 1808, -270, -1853, 1810, 11, -1753, 1794, 54, -1788, 1839, 48, -1669, 1641, 266, -1921, 1585, 349, -1703, 1384, 610, -1697, 1106, 538, -1711, 1256, 721, -2080, 1128, 1151, -1639, 995, 1154, -1958, 778, 1361, -1886, 536, 1344, -2147, 420, 1463, -2046, 690, 1440, -1964, 442, 1659]
2864A659l738K538J027l804K316J664l586K059J579l673K210J340l326J819J306
2879A390l254J856J629l255J621J793l264J249K061l242J069J972k819N95K313
2894A714k881O64K208k942P08K413k850n2K817k766j21K796k341k95K809k263
2910c82q75K881k283n35L001k223q84K960k196r84L640k341j232L200j750j690
2926a693L267j493j927L361j616j490L086j254j802L346j322k259L407j317k272
2941a978L271q15k368L100p97k152K730j62k635K993m26k688K855r8k703K939
2957A066m3l140K950K94k915K568M46l000K385N70l015K653M99l234K517Q28l371
2974a942K419J015l264K007J136l128J994J230l195J931J289l045J669J478l216
$$ y = [1659, -2079, 459, 1486, -2318, -2, 1662, -1924, 135, 1714, -1959, 251, 1591, -1735, 84, 1390, -1864, -8, 1621, -1634, -13, 1780, -1484, -235, 1826, -1416, -347, 1625, -1194, -599, 1714, -1167, -503, 1705, -1237, -529, 1884, -966, -1018, 1799, -967, -1088, 1708, -633, -928, 1881, -382, -1257, 1624, -659, -1194, 1807, -416, -1300, 1660, -536, -1520, 2120, -221, -1453, 1747, -3, -1693, 1574, 81, -1846, 1515, -101, -1591, 1495, 241, -1561, 1785, 463, -1796, 1611, 294, -1978, 1293, 478, -1890, 1210, 413, -1739, 991, 829, -1806, 1187, 761, -1927, 928, 830, -1873, 1066, 1023, -2117, 833, 1127, -1788, 780, 1226, -1774, 611, 1181, -1834, 819, 1318, -1916, 601, 1429, -1942, 477, 1492, -1772, 235, 1371, -1757, 237, 1467, -1728, 203, 1492, -1553, 116, 1594, -1622]
2989a622J627J404k994J516J762l157J206J766k913J190J926k822Q41J800k848
3004a318R48J988k816O27K313k868M95K540k787J01K267k431J66K064k075J92
3020e94K378k404k47K588k238m51K709k220q48K740j974o97K662j748r92K960
3036A624j728r32K565j781r43K467j575j092K507j012j707L052j231j567K658
3051A305j152j468K802j343j655K603p85j699K733r24j874K865o43k509K610l51
3067E15k026K350k53k087K327j73k158K669l12k280K348j60k327K199J65k310
3083a513J867N52k429K151M71k213J650M96k501J711Q64k476J424J071k422J574
3099B77R88k522J320J194k606J181J371k743J527J278k509J415J220k572J067
$$ y = [-1622, 5, 1409, -1585, -69, 1693, -1464, -258, 1508, -1405, -215, 1711, -1111, -270, 1530, -1318, -370, 1618, -1198, -571, 1742, -1126, -631, 1909, -878, -777, 1490, -941, -775, 1289, -786, -594, 1784, -620, -867, 1721, -517, -968, 1741, -479, -1327, 1413, -561, -1258, 1404, -344, -1336, 1624, -104, -1036, 1529, -252, -1195, 1272, -303, -1395, 1112, 100, -1607, 1445, 214, -1353, 1305, 153, -1315, 1487, 144, -1511, 1092, 307, -1392, 1341, 417, -1457, 1408, 765, -1744, 866, 515, -1511, 839, 586, -1501, 826, 653, -1505, 1164, 852, -1428, 920, 760, -1567, 632, 797, -1513, 354, 906, -1523, 628, 1099, -1114, 536, 1032, -1469, 242, 1106, -1370, 54, 1125, -1297, 277, 1265, -1257, 63, 1257, -1349, -168, 1203, -1540, -13, 1265, -1244, 171, 1391, -1181, -114]
3114a14J639k728Q62J640k508P87J596k212M68J973k340N49K100k677P70J787
3130A592k603M90K050k412L00J975k170K57J718j810J94J751j889j41K080k006
3146f24k20K151j540o09K130j583q20K175j383p61K077j003j094K160r13j251
3162a108K133r17j420K547j198j286K439j084j484K476q59j727K537o88j838K296
3178H19o02j492K449p46j770K288n01j626K370q26j841K342n34j564J856j71j363
3195i12J644j36j441J536R2j780J500M66j997J050P02j959J423O15j837J393O23
3212I82j957J216Q20k138R94J026k237J053J361k178Q40J592k288Q86J368k504
3228a164P75J628k381P48J641k166M55J795k332N04J830j911J64J521j826J73
$$ y = [-114, 1525, -1203, -341, 1299, -1209, -422, 1174, -1038, -570, 1403, -937, -388, 1712, -965, -195, 1592, -1011, -521, 1529, -883, -583, 1392, -778, -521, 1197, -613, -419, 1332, -557, -698, 1382, -624, -844, 1307, -233, -842, 1288, -295, -1115, 1060, -323, -1084, 993, -10, -1104, 1056, 143, -1108, 1025, 108, -1312, 1235, 37, -1249, 1190, 106, -1378, 1098, 239, -1488, 1049, 361, -1477, 819, 217, -1275, 1174, 428, -1342, 946, 445, -1181, 1189, 363, -1478, 864, 330, -1234, 622, 451, -912, 732, 596, -845, 691, 783, -997, 503, 969, -1028, 22, 724, -1235, 188, 803, -1034, 359, 982, -975, 241, 1061, -1077, -83, 943, -1294, -241, 1120, -1058, -218, 1374, -914, -28, 1340, -1164, -389, 1239, -1142, -394, 1247, -919, -464, 1331, -1001, -497, 1333, -578, -414, 1107, -719, -546]
3244e46J601j862L08J669j796K01J571j726j6J897j754j13J488j326m35J953j250
3261a36r52K352j349r19K124j194q74J731o10j374K068o96j377K239p15j543K238
3278A013p59j590K429p38j542K163o71j710K441p13j649K239l79j838K036k38
3294D94j924K062m6j798J935k33j646J635j04j555J861k32j652J696M96k123J362
3311B28O93k032J430M21j800J241M05j785J305P96j819J169O94k043J356Q21k166
3328a086J075J013j966P12J344j808L86J389j852O48J378k160N71J736k471O91
3344d00J637k095L60J564j613J74J518j741J13J602j913K62J381j602J07J821
3360A175j758q7J902j691J3J653j549l64J764j481l53J653j260m64J908j336n54
$$ y = [-546, 1055, -807, -499, 1170, -626, -425, 1146, -580, -596, 1301, -453, -566, 922, -404, -839, 1114, -136, -1088, 1264, -85, -1004, 1120, -74, -948, 783, 173, -1201, 867, 171, -1206, 1033, 318, -1225, 1013, 254, -1336, 1093, 355, -1187, 976, 305, -1405, 1036, 323, -1326, 913, 534, -1304, 732, 494, -1430, 632, 586, -1212, 723, 490, -1156, 479, 375, -1180, 681, 449, -1203, 493, 989, -1134, 228, 921, -1111, 319, 740, -1060, 181, 586, -1199, 106, 902, -917, 252, 946, -1097, 259, 1080, -1086, -11, 1002, -964, -252, 1092, -716, -330, 1059, -793, -145, 1233, -927, -356, 1380, -1091, -400, 1237, -858, -498, 1066, -547, -373, 1145, -596, -483, 1119, -794, -532, 849, -753, -646, 1175, -583, -670, 1232, -459, -446, 1207, -342, -706, 1058, -423, -776, 877, -383, -847, 1061, -275, -829]
3377h29J904j132r05K112j179q77J823r63r01J942p85q93J789j040j148J915r55
3394a22r02J972p04j164J796m10j616J969m59j382J611l38j425J825j64j638J890
3411G39J7j900J897j44j756J595M61k213J616N87k168J572N74j985J585L65k082
3428a240J533M66k115J702L95j993J536P20j999J184Q21j973J276N89k060J336
3444A78P19k020J255Q13j889J046R55j945Q40R75j805O43R99j740Q14J104j841
3461h99O73J326k001M24J506j737L12J730j803j68J854j851L7J848j660k74J956
3478A273j689q2J599j669q1J881j618k23J725j442o22K051j605k41J739j246m70
3495g20J607j218n26J856j276m80J851r29j007J630p69r99J634o73r21J629k38
$$ y = [-829, 1075, -57, -962, 1150, -29, -906, 917, -46, -947, 995, 210, -683, 1106, 66, -1082, 833, -122, -1024, 948, 244, -920, 876, 466, -1150, 819, 360, -1022, 589, 251, -1174, 651, 487, -1151, 739, 756, -1144, 753, 609, -1147, 448, 909, -1304, 312, 899, -1269, 303, 877, -1108, 477, 842, -1240, 293, 759, -1356, 346, 741, -1252, 284, 1004, -995, 189, 1010, -963, 313, 902, -1158, 178, 897, -1123, 132, 945, -944, 102, 1057, -888, -48, 927, -878, -235, 764, -976, -162, 942, -899, -226, 1100, -901, -477, 1029, -708, -396, 1334, -469, -637, 1217, -634, -597, 1251, -409, -683, 1273, -416, -498, 1101, -568, -649, 1232, -386, -609, 1116, -326, -948, 1103, -502, -743, 996, -250, -720, 887, -331, -857, 999, -277, -757, 1094, 165, -842, 788, 19, -980, 654, -19, -940, 689, 451]
3512D51j223J749q37j223J814m02j264J372m7j423J499K24j767J583J60j560J430
3529E36J95j757J570L5j707J638K33j673J224O41k185J576M31j883J323N31j951
3546a223J469M52j563J123O39j931J306O44j872R61O96j888J070R02j624Q96R41
3563I98j660P35J008j835O58J016j770O83J102j733M53J120j536L15J395j397
3579d48j4J229j324J02J485j580J26J343j331n3J587j551j5J496j554KJ467j138
3597a71m82J587j082l16J477j210m48J420q55o37J505q46o35J572j012n86J456
3614G37q44m24J174o45j037J705o52r63J591m19q50J335m15j110J406l40j354
3631a105J476j03j261J346J98j217J273o4j442J539k34j316J411K1j442J107N07
$$ y = [451, -772, 977, 140, -1083, 731, 329, -935, 437, 390, -1033, 466, 690, -1077, 506, 666, -894, 536, 731, -1026, 544, 579, -1128, 510, 743, -930, 294, 935, -1250, 326, 757, -1126, 197, 728, -1223, 246, 698, -865, 258, 897, -1034, 272, 916, -956, 5, 701, -1187, -117, 785, -839, 57, 998, -662, 73, 1081, -754, -96, 920, -850, -167, 935, -798, -345, 775, -761, -446, 949, -448, -462, 767, -557, -455, 1030, -550, -424, 919, -412, -465, 1122, -429, -444, 1052, -502, -500, 967, -171, -653, 934, -148, -464, 1013, -197, -645, 775, -80, -717, 788, -58, -693, 879, -133, -719, 737, -107, -531, 643, -2, -1039, 666, 14, -949, 642, 223, -627, 708, 293, -817, 589, 249, -1105, 371, 268, -993, 353, 551, -666, 607, 543, -899, 640, 406, -910, 501, 522, -920, 187, 694]
3648F94j484J025M74j568J359rj286J216K45j578J069L62j347J046O56j957J173
3665I0Q07j752R13N82j174N36P60j533P81R00j739Q62P09j275L01R63j498P40
3683b7R83j566J87J249j449M56J027j411O9J469j271l36J680j521j54J419j355
3700e51k17J634j232k84J513j276k27J521j300m4J342j242k73J671j246m26J429
3717G92r29n72J577r89o11J628j023m55J329j004k90J489j089n32J529q43r45
3734i38J609m89r29J600o81q59J452m67j076J292l14j070J460l06j208J510k72
3751C14j050J176m4j242J097O4j090R93J37j196J375j53j221J330kj265Q75N04
3769F02j403J022L06j284P73N06j244Q58L70j225Q97L54j353P57P90j649J018
$$ y = [694, -790, 235, 709, -859, 500, 491, -795, 421, 666, -912, 157, 519, -828, 218, 874, -1083, 90, 897, -855, 58, 640, -534, 2, 762, -771, 10, 910, -829, 33, 742, -533, -232, 731, -767, -27, 956, -610, -423, 826, -623, -167, 860, -551, -482, 987, -284, -620, 1060, -461, -615, 804, -551, -768, 866, -366, -650, 863, -413, -640, 881, -419, -463, 879, -363, -636, 1035, -211, -637, 792, -137, -709, 868, -121, -732, 896, -127, -582, 747, -257, -547, 942, -147, -679, 850, 7, -938, 671, 182, -747, 853, 172, -687, 765, 298, -778, 514, 200, -870, 590, 284, -924, 586, 314, -736, 440, 396, -846, 251, 315, -775, 218, 355, -841, 534, 381, -840, 490, 488, -777, 98, 602, -801, 221, 527, -757, 16, 522, -722, 136, 506, -719, 178, 532, -821, -64, 726, -923, 95]
3786I5N79j321O74P03j299M81O03j197P90Q25j650M93Q95j336N66P97j164M92
3804B6P91j288N33O67j090J25R67j304M92R83j310J00J087j311L19R61j257o6
3822e75J466j144j49J023p50k49J176q42m08J127p00n24J353j002n66J673r84
3839g5n63J394p43o33J255p54n93J349p53l35J289q61o24J414q24p08J516q31
3857h0p22J368n78r30J621m80r23J229n12p16J244k13j016R74p9j067J203J71
3875D94j078P87K67j103J055K6j078R05O8j014P96L89j239Q18M20j085M58P69
3893F55j209N04N95j056N54M98j118M38P21j153Q04M16j294P11M83j064L82P32
3911E99j164N34R06j482M61P84j147M57Q96j377K60R15j063K12R73j149J55R43
$$ y = [95, 674, -647, 27, 730, -569, -88, 515, -682, 108, 933, -717, -224, 671, -665, -99, 698, -466, 26, 817, -471, 62, 729, -361, -236, 731, -573, -81, 902, -408, -308, 779, -532, -213, 748, -509, -575, 891, -253, -402, 621, -129, -378, 798, -44, -452, 675, -25, -549, 804, -198, -764, 909, -75, -638, 756, 13, -620, 635, -119, -712, 637, -116, -451, 838, -23, -647, 767, -57, -765, 751, -80, -802, 566, -12, -942, 679, 199, -724, 505, -7, -723, 521, 308, -708, 266, 187, -880, 323, 494, -584, 203, 470, -633, 422, 448, -630, 275, 343, -671, 125, 514, -725, 93, 513, -572, -114, 655, -554, -50, 545, -511, 43, 541, -577, -139, 582, -571, 233, 649, -645, 66, 549, -515, -133, 599, -565, -31, 875, -607, -146, 638, -509, -52, 844, -533, -273, 642, -421, -209, 764, -385, -230, 713]
3929G13j059J96P51j018K02J055j134J74O43q30J38Q62q63k4P95p05n75J275o63
3948f7o23J327n15n94J145o37m04Q63n85n86J356p94p88J551n75n84J048l62p04
3967e28J057k73q48R83j65p30J124n80p21J207l29r49J252j04q83Q91l6r39P04
3986A33K46r22O15J54p04P45J75r34N60M12j027O93M61j109M13O14j052M78N63
4005E14r55N77M15j133N66N07j085N05P73j112L17O38r07K80P03r56J69P31r98
4024d51L66Q57j214K71P69r96L76O82j087M6J002r43Q6P54p92m4P47o27m0P06
4044D68q32q1J070r83j9J007q18l02R62o55l41J175p68n53J366r13k02R84o75
4063a10k72J034o29m63R95p81l32J238o53p64J107k51o56R20k40p79J103r4j062
$$ y = [713, -346, -150, 601, -417, -215, 840, -294, -120, 523, -307, -169, 693, -170, -194, 601, -104, -679, 596, -67, -690, 637, 122, -472, 673, 36, -368, 495, -90, -676, 680, -114, -902, 649, 74, -510, 538, 176, -528, 529, 256, -592, 391, 226, -504, 620, 40, -681, 526, 197, -752, 500, 396, -487, 404, 368, -571, 133, 379, -543, 72, 226, -478, 267, 442, -492, 68, 480, -547, 146, 607, -502, -89, 525, -527, -49, 514, -441, 136, 551, -582, -16, 491, -594, -89, 684, -428, -111, 527, -380, -100, 603, -353, -184, 547, -451, -85, 772, -442, -171, 598, -398, -22, 660, -427, -381, 621, -322, -236, 518, -274, -318, 429, -198, -238, 468, -364, -445, 625, -358, -377, 630, -188, -490, 472, -183, -524, 651, -117, -670, 696, -217, -419, 565, -110, -382, 652, 23, -440, 555, -226, -558, 680, 27, -737, 370, 119, -537, 383, 143, -636, 467, 373, -689]
4082f89J144k07q21J013l18p32R81j22o83P25L6r67J012r3r59J027j43r74Q84
4101A14K31j111J064J46j099Q66O13j480J054lj072O62M53r13N88M05j100M42
4119a40P52j163O20N34j157N23P75j159K72Q50j341P93L74j135N30Q31j071K01
4137a11O42j107L93J044j419K35J100j261K61P79r64R4R64r15%J122j464L93J078
4156H64j271L3J007r94l25J258q50M5R02q59k70J117j073o6J214q89l88J306r33
4175a72m68J302o60n11J147o08n03R82o69k82Q04n30m89J260n79l72Q41l13p41
4194e61Q98j27q05J032m71o62J247l02q61J026l28o37J085l24p60J021l83o89
4212f01R28j78n65P23M6q13Q01Jj069R80J50j122R94J85j085Q57Q9r38P07O42
$$ y = [-689, 455, 248, -573, 440, 122, -610, 371, 249, -434, 291, 327, -640, 372, 279, -680, 347, 204, -770, 114, 345, -766, 298, 444, -655, 211, 824, -656, 398, 395, -677, -15, 438, -475, 113, 518, -582, -140, 612, -551, 69, 603, -554, -31, 744, -415, -143, 707, -634, 159, 533, -602, -72, 759, -312, -111, 531, -576, -183, 861, -558, -323, 777, -484, -223, 556, -408, -314, 650, -265, -265, 857, -607, -214, 864, -407, -374, 633, -361, -686, 572, -278, -233, 669, -190, -460, 657, -416, -482, 732, -157, -545, 761, -172, -640, 662, 2, -509, 638, 30, -473, 509, -160, -442, 362, -168, -657, 603, 24, -348, 493, 180, -561, 337, 210, -595, 437, -34, -696, 551, 249, -612, 414, 86, -551, 534, 210, -550, 471, 88, -601, 327, 149, -416, 307, 353, -460, 341, 342, -727, 253, 403, -719, 275, 460, -625, 232, 321, -617, 90, 732]
4232G32j065K45N51q04L72L09q72N42O38j116N52N30j149M29O08j075M61O36q91
4251c67J56Q23j000K05P07r88J41Q96r84J54P21r61L31P36p56q0P45o93m8Q53
4271E91r62J04P95p83M7R46q93j54R11q53l8P18m95l05R63p68l4N39l66l67Q21
4292D17l31n15J106o31n08Q86k56o34Q75n50l70J046n85m07Q26k36o60Q80k63
4311I0n59P22j13p46O96K55r06R50k3p65M50K71r71P48K81r52O73J41q05P64O0
4332B61q60J031q7q56P94J12q41O43L07q10M68K84q32M40L81r20L80M75q36N26
4352F0K67o17M04L63p41J07O60r84N20K78p73M00M80q18K19Q27q32Q4O50q04l1
4373b81P94p52J34N74r03L29N57o89OP70p19P6N08n14l71R80q03r7R91n21l78
$$ y = [732, -333, -88, 463, -341, 31, 340, -532, 10, 648, -468, 84, 614, -535, -106, 502, -573, -112, 524, -367, -211, 612, -388, -183, 524, -464, -323, 573, -411, -257, 464, -497, -166, 570, -186, -266, 479, -214, -262, 591, -371, -267, 528, -255, -208, 738, -155, -309, 602, -251, -289, 429, -66, -371, 592, -176, -210, 329, -37, -404, 417, 86, -429, 677, 46, -462, 424, 168, -466, 409, -141, -511, 535, -50, -457, 369, 133, -527, 353, 90, -469, 253, 140, -606, 90, 345, -561, 389, 366, -399, 51, 322, -649, 99, 380, -572, 101, 242, -563, 201, 261, -599, 432, 345, -511, 283, 395, -446, 197, 504, -306, 162, 446, -386, 54, 435, -485, -105, 370, -466, 60, 327, -290, 114, 477, -264, -157, 503, -481, 39, 317, -456, -56, 424, -394, -175, 652, -180, -96, 554, -250, -281, 513, -239, -105, 469, -434, -105, 452, -237, -231, 539, -180, -104, 404, -110, -481, 499, -304, -401, 590, 69, -309]
4394c09Q17p15l3O73o77k68Q22m97j66R66p76L8O15m66m30P91l64m47O55l20o12
4415g03R74r5p37J015l75m81O87k1o22N85J5p43Q78k03n16O97k89o11Q19j91n43
4436d60Q75k96o44Q65L0o54M15J9n60O59P5q14O95K04r24P23J15q03N90J47q48
$$ y = [-309, 508, -207, -240, 433, -244, -512, 310, -187, -353, 613, -163, -125, 490, 24, -406, 385, 21, -426, 229, -91, -703, 271, 176, -561, 454, 79, -402, 285, 264, -358, 227, 242, -501, 377, 174, -342, 355, 66, -545, 274, 83, -460, 415, 119, -525, 340, 370, -284, 131, 150, -410, 249, 324, -490, 205, 409, -515, 208, 323, -480, 110, 257, -591]
$$ [...]
8191A4
##END NTUPLES=NMR FID
##END=
