##TITLE=1H_B4e-F
 aceton-d6
 8 sc, 
 16.8.2024
##JCAMPDX= 6.0         $$ Bruker NMR JCAMP-DX V2.0
##DATA TYPE= NMR FID
##DATA CLASS= NTUPLES
##ORIGIN= UXNMR, Bruker Analytische Messtechnik GmbH
##OWNER= root
$$ XWIN-NMR		Version 3.5
$$ Fri Aug 16 13:45:34 2024 Russian Standard Time (UT+4h)  she@DPX200
##.OBSERVE FREQUENCY= 200.1318
##.OBSERVE NUCLEUS= ^1H
##.DELAY= (6, 6)
##.ACQUISITION MODE= SIMULTANEOUS
##.ACQUISITION SCHEME= undefined
##.AVERAGES= 8
##.DIGITISER RES= 18
##SPECTROMETER/DATA SYSTEM= spect
##.PULSE SEQUENCE= zg30
##.SOLVENT NAME= Acetone
##.SHIFT REFERENCE= (INTERNAL, Acetone, 0, 15.7039)
##AUDIT TRAIL= $$ (NUMBER, WHEN, WHO, WHERE, WHAT)
$$ ##TITLE= Audit trail, XWIN-NMR		Version 3.5
$$ ##JCAMPDX= 5.01
$$ ##ORIGIN= Bruker BioSpin GmbH
$$ ##OWNER= she
$$ F:/spectra/data/she/nmr/H-F/1/audita.txt
$$ ##AUDIT TRAIL=  $$ (NUMBER, WHEN, WHO, WHERE, WHAT)
(   1,<2024-08-16 13:44:19.18 +0400>,<she>,<DPX200>,
      <created by zg, POWCHK disabled, PULCHK disabled
       configuration hash MD5:
       00 E9 B6 7A A2 85 ED C7 34 08 36 98 17 FE 4E 26
       data hash MD5: 16K
       34 FD 05 EC DA FB CC 51 C9 4F B0 4F A6 9A 48 27>)
$$ ##END=
$$ 
$$ hash MD5
$$ 4F 24 3B E5 B6 AC 38 0C 75 65 2F D5 05 AF 4C 30
##$RELAX= 
##$RELAX= 
##$RELAX= 
##$RELAX= 
##$RELAX= 
##$RELAX= 
$$ Bruker specific parameters
$$ --------------------------
##$DU= <F:/spectra>
##$EXPNO= 1
##$NAME= <H-F>
##$PROCNO= 1
##$TYPE= <nmr>
##$USER= <she>
##$AMP= (0..31)
100 100 100 100 100 100 100 100 100 100 100 100 100 100 100 100 100 100 
100 100 100 100 100 100 100 100 100 100 100 100 100 100 
##$AQSEQ= 0
##$AQ_mod= 1
##$AUNM= <au_zg>
##$AUTOPOS= <>
##$BF1= 200.13
##$BF2= 200.13
##$BF3= 200.13
##$BF4= 200.13
##$BF5= 200.13
##$BF6= 200.13
##$BF7= 200.13
##$BF8= 200.13
##$BYTORDA= 1
##$CFDGTYP= 0
##$CFRGTYP= 5
##$CHEMSTR= <none>
##$CNST= (0..31)
1 1 145 1 1 1 1 1 1 1 1 1 1 1 1 1 1 1 1 1 1 1 1 1 1 1 1 1 1 1 1 1 
##$CPDPRG= <>
##$CPDPRG1= <>
##$CPDPRG2= <>
##$CPDPRG3= <>
##$CPDPRG4= <mlev>
##$CPDPRG5= <mlev>
##$CPDPRG6= <mlev>
##$CPDPRG7= <mlev>
##$CPDPRG8= <mlev>
##$CPDPRGB= <>
##$CPDPRGT= <>
##$D= (0..31)
0 1.2 0 0 0 0 0 0 0 0.06 0 0.03 0 0 0 0 0.0002 0 0 0 0 0 0 0 0 0 0 0 0 
0 0 0 
##$DATE= 1723801458
##$DBL= (0..7)
120 120 120 120 120 120 120 120 
##$DBP= (0..7)
150 150 150 150 150 150 150 150 
##$DBP07= 0
##$DBPNAM0= <>
##$DBPNAM1= <>
##$DBPNAM2= <>
##$DBPNAM3= <>
##$DBPNAM4= <>
##$DBPNAM5= <>
##$DBPNAM6= <>
##$DBPNAM7= <>
##$DBPOAL= (0..7)
0.5 0.5 0.5 0.5 0.5 0.5 0.5 0.5 
##$DBPOFFS= (0..7)
0 0 0 0 0 0 0 0 
##$DE= 6
##$DECBNUC= <off>
##$DECIM= 24
##$DECNUC= <off>
##$DECSTAT= 4
##$DIGMOD= 1
##$DIGTYP= 9
##$DL= (0..7)
0 120 120 120 120 120 120 120 
##$DP= (0..7)
150 150 150 150 150 150 150 150 
##$DP07= 0
##$DPNAME0= <>
##$DPNAME1= <>
##$DPNAME2= <>
##$DPNAME3= <>
##$DPNAME4= <>
##$DPNAME5= <>
##$DPNAME6= <>
##$DPNAME7= <>
##$DPOAL= (0..7)
0.5 0.5 0.5 0.5 0.5 0.5 0.5 0.5 
##$DPOFFS= (0..7)
0 0 0 0 0 0 0 0 
##$DQDMODE= 0
##$DR= 18
##$DS= 0
##$DSLIST= <SSSSSSSSSSSSSSS>
$$ [...]
##$SUBNAM2= <"">
##$SUBNAM3= <"">
##$SUBNAM4= <"">
##$SUBNAM5= <"">
##$SUBNAM6= <"">
##$SUBNAM7= <"">
##$SUBNAM8= <"">
##$SUBNAM9= <"">
##$SW= 24.0689170037331
##$SWIBOX= (0..15)
0 0 2 0 0 0 0 0 0 0 0 0 0 0 0 0 
##$SW_h= 4816.95568400771
##$TD= 16384
##$TD0= 1
##$TE= 0
##$TE2= 300
##$TE3= 300
##$TEG= 300
##$TL= (0..7)
0 120 120 120 120 120 120 120 
##$TP= (0..7)
150 150 150 150 150 150 150 150 
##$TP07= 0
##$TPNAME0= <>
##$TPNAME1= <>
##$TPNAME2= <>
##$TPNAME3= <>
##$TPNAME4= <>
##$TPNAME5= <>
##$TPNAME6= <>
##$TPNAME7= <>
##$TPOAL= (0..7)
0.5 0.5 0.5 0.5 0.5 0.5 0.5 0.5 
##$TPOFFS= (0..7)
0 0 0 0 0 0 0 0 
##$TUNHIN= 0
##$TUNHOUT= 0
##$TUNXOUT= 0
##$USERA1= <user>
##$USERA2= <user>
##$USERA3= <user>
##$USERA4= <user>
##$USERA5= <user>
##$V9= 5
##$VALIST= <valist>
##$VCLIST= <CCCCCCCCCCCCCCC>
##$VD= 0
##$VDLIST= <DDDDDDDDDDDDDDD>
##$VPLIST= <PPPPPPPPPPPPPPP>
##$VTLIST= <TTTTTTTTTTTTTTT>
##$WBST= 1024
##$WBSW= 4
##$XGAIN= (0..3)
0 0 0 0 
##$XL= 0
##$YL= 0
##$YMAX_a= 152962
##$YMIN_a= -163161
##$ZGOPTNS= <>
##$ZL1= 120
##$ZL2= 120
##$ZL3= 120
##$ZL4= 120
##$ABSF1= 10
##$ABSF2= 0
##$ABSG= 5
##$ABSL= 3
##$ALPHA= 0
##$AQORDER= 0
##$ASSFAC= 0
##$ASSFACI= 0
##$ASSFACX= 0
##$ASSWID= 0
##$AUNMP= <proc_1d>
##$AZFE= 0.1
##$AZFW= 0.1
##$BCFW= 1
##$BC_mod= 2
##$BYTORDP= 1
##$COROFFS= 0
##$CY= 11.3945322036743
##$DATMOD= 1
##$DC= 2
##$DFILT= <>
##$DTYPP= 0
##$F1P= 15.6554695791079
##$F2P= 12.8336369535428
##$FCOR= 0.5
##$FTSIZE= 0
##$FT_mod= 4
##$GAMMA= 1
##$GB= 0.15
##$INTBC= 1
##$INTSCL= 1
##$ISEN= 128
##$LB= 0.24
##$LEV0= 0
##$LPBIN= 0
##$MAXI= 10000
##$MC2= 0
##$MEAN= 0
##$ME_mod= 0
##$MI= 1.114404
##$NCOEF= 0
##$NC_proc= 0
##$NLEV= 6
##$NOISF1= 3.799351
##$NOISF2= 2.8
##$NSP= 1
##$NTH_PI= 0
##$NZP= 0
##$OFFSET= 15.70392
##$PC= 1
##$PHC0= -26074.14
##$PHC1= 13.78748
##$PH_mod= 1
##$PKNL= yes
##$PPARMOD= 0
##$PSCAL= 0
##$PSIGN= 0
##$REVERSE= no
##$SF= 200.130013532006
##$SI= 16384
##$SIGF1= 3
##$SIGF2= 2
##$SINO= 400
##$SIOLD= 16384
##$SREGLST= <1H.CDCl3>
##$SSB= 0
##$STSI= 0
##$STSR= 0
##$SW_p= 3612.71676300578
##$SYMM= 0
##$S_DEV= 0
##$TDeff= 0
##$TDoff= 0
##$TI= <>
##$TILT= no
##$TM1= 0
##$TM2= 0
##$TOPLEV= 0
##$USERP1= <user>
##$USERP2= <user>
##$USERP3= <user>
##$USERP4= <user>
##$USERP5= <user>
##$WDW= 1
##$XDIM= 8192
##$YMAX_p= 0
##$YMIN_p= 0
$$ End of Bruker specific parameters
$$ ---------------------------------
##NTUPLES= NMR FID
##VAR_NAME=  TIME,          FID/REAL,        FID/IMAG
##SYMBOL=    X,             R,               I
##VAR_TYPE=  INDEPENDENT,   DEPENDENT,       DEPENDENT
##VAR_FORM=  AFFN,          ASDF,            ASDF
##VAR_DIM=   8192,          8192,            8192
##UNITS=     SECONDS,       ARBITRARY UNITS, ARBITRARY UNITS
##FACTOR=    0.0002076,     1,               1
##FIRST=     0,             0,               0
##LAST=      1.7004516,     0,               0
##MIN=       0,             -163161,         0
##MAX=       1.7004516,     152962,          0
$$ Real data points
##PAGE= N=1
##DATA TABLE= (X++(R..R)), XYDATA
0@%%%%%qJ6j6J6j6K4l2M0m8N6p2Q8j04J20j40J64j92K24k56K92l32L80m36M93
$$ 0 0 0 0 0 0 -8 8 -8 8 -8 16 -16 24 -24 32 -40 48 -56 64 -76 88 -104 120 -136 156 -176 204 -232 261
29B61n56O25p00P83q74R77j090J211j345J493j654J831k027K243k483K752l053
$$ 261 -295 330 -370 413 -461 516 -574 637 -708 785 -869 962 -1065 1178 -1305 1447 -1606
46a606L388l770M211m724N328o050O935q043R474j1404J4155j8394K5767m1905
$$ -1606 1782 -1988 2223 -2501 2827 -3223 3712 -4331 5143 -6261 7894 -10500 15267 -26638
60b6638J27049n1300k02221L03511k32326M7026J69411k69229J75695K9017j92619
$$ -26638 100411 49111 -153110 150401 -81925 -34899 134512 -134717 40978 69995 -122624
71a22624K35200j48757l3127J94410k11968R5989N8056j79546K04582r4147q2266
$$ -122624 112576 -36181 -69308 125102 -86866 9123 67179 -112367 92215 -1932 -84198
82h4198J93418j76637N7002R9115k00696J68360j6359j39354J86774j09899k4586
$$ -84198 109220 -67417 -10415 88700 -111996 56364 40005 -99349 87425 -22474 -47060
93d7060J31747j55014Q1926M0274j26800J23652m9585m0538J01328j05040M9220
$$ -47060 84687 -70327 11599 51873 -74927 48725 -860 -41398 59930 -45110 4110
104D110L2338r4566J06069n3280m2180J11242j00045K6940N3291j00332Q9350
$$ 4110 36448 -58118 47951 -5329 -47509 63733 -36312 -9372 43919 -56413 32937
115C2937j9194o4132R9615p1334M013O4020r1753O0041Q588o6050P7791m2785
$$ 32937 13743 -50389 49226 -22108 -18095 45925 -45828 14213 22801 -43249 34542 -8243
127h243j1453N1685o4886M9040j113n7658Q1212m6559j8579O8205p2866L1607
$$ -8243 -19696 31989 -32897 16143 15030 -42628 38584 -7975 -26554 41651 -31215 392
139C92K7173o5302O4887k7196l1842P3467o1079O742M3087o1034M6605m655m2706
$$ 392 27565 -37737 27150 -46 -31888 41579 -19500 -12758 30329 -30705 15900 11245 -31461
152c1461O0788l8502m210M2353n5714L3737R574m4591N2855k9021j6906N1691
$$ -31461 29327 -9175 -13385 28968 -26746 6991 16565 -28026 24829 -4192 -21098 30593
164C0593m7051J4140K0858m5603M6316j1215l4960N0089k9119l863L1579m0748
$$ 30593 -16458 -2318 18540 -27063 19253 8038 -26922 23167 -5952 -9815 21764 -18984
176a8984K2614Q325k9209L4373k2325r366L8204l4230N533J7653k7235K5906p829
$$ -18984 3630 11955 -17254 17119 -5206 -14572 23632 -10598 -5065 12588 -14647 11259 3430
189C430j9763L1137j8661j289J7311k6257J9178M721k5054K3355o541r305J7962
$$ 3430 -16333 14804 -3857 -5146 12165 -14092 5086 9807 -15247 8108 1567 -7738 10224
202A0224j7727N928J0113j7295J3424m209q873J9294j3464m664J3125q581O042
$$ 10224 -7503 -1575 8538 -8757 4667 458 -8415 10879 -2585 -7249 5876 -2705 3337
215C337l914q371J7312p196p098R150p392O581J993j1787Q726m08j844N321j0759
$$ 3337 -577 -8948 8364 1168 -5930 3220 -4172 2409 4402 -7385 1341 933 -911 4410 -6349
230f349N339O533r031N184l461j943J0524q800p40M670n206Q469n792o119J3421
$$ -6349 -1010 5523 -3508 1676 -1785 -3728 6796 -2004 -2744 1926 -3280 5189 -603 -6722 6699
245F699q125j596Q139r820O405O03p629J1583q463k322J2608j3059M565O149j3106
$$ 6699 -1426 -3022 5117 -4703 1702 2305 -5324 6259 -2204 -4526 8082 -4977 -412 5737 -7369
260g369J1755k400p929J3205j1607K036J1298j6559R178K760j2079J6140r581
$$ -7369 4386 1986 -5943 7262 -4345 -2309 8989 -7570 1608 4368 -7711 8429 -1152
273a152o616J7463j3717L119O770j5195J6047l414j3174J8878j1491k261J4504
$$ -1152 -7768 9695 -4022 -903 5867 -9328 6719 3305 -9869 9009 -2482 -4743 9761
286I761j7334Q350N054j4481J6132q064p352J8629j5744J749J1582j6235J1579
$$ 9761 -7573 777 5831 -8650 7482 -582 -7934 10695 -5049 -3300 8282 -7953 3626
299C626m86j1817J6934j0131l421J3360j4739P774M741j4965J4184l530p791J3237
$$ 3626 3140 -8677 8257 -1874 -5295 8065 -6674 1100 5841 -9124 5060 1530 -6261 6976
313F976j1091K079Q183j2569R444j188q963J3743p536l473R143q943N952J121
$$ 6976 -4115 -2036 6147 -6422 3022 1834 -7129 6614 -922 -4395 4748 -4195 1757 2878
327B878r318J0415l949l262Q282r359L376N235q104N914k783k745Q717p310K53
$$ 2878 -6440 3975 26 -3236 5046 -4313 -937 4298 -3806 2108 -675 -3420 5297 -2013 -1760
342a760M112n733O770k536n776Q176l427l82K612n988O029k08n045N810m156M11
$$ -1760 2352 -3381 3389 853 -4923 3253 -174 -556 2056 -3932 2097 1889 -3156 2654 -1502 -1091
358a091M955o522K646J329k955M550m635Q2N434n800J898J571l356M276l016q76
$$ -1091 3864 -2658 -12 1317 -1638 2912 -1723 -1641 3793 -2007 -109 1462 -1894 2382 -634 -1510
374a510M218m284K035P33l533M710k336j813L911l410J777R10l744L911j368j242
$$ -1510 2708 -1576 459 1192 -2341 2369 33 -1780 2131 -1279 498 1408 -2336 1575 207 -1035
390a035L025m023K164K137m304K636n40q49K873l877J471K158l656K792p03j840
$$ -1035 1990 -2033 131 2268 -2036 600 60 -789 2084 -1793 -322 1836 -1820 972 269 -1571
406a571L289k712N80J815l089K454n99j515L210k960J91K414k743J898o07j731
$$ -1571 1718 -994 -414 1401 -1688 766 167 -1348 1862 -1098 -907 1507 -1236 662 55 -1676
422a676L248k032k5J297k806L203q6l200K692q92M37J086l541K691Q02k455K353
$$ -1676 1572 -460 -485 812 -1994 1209 1123 -2077 615 -277 160 1246 -2295 396 1198 -1257 1096
439A096k103J36K990l243Q84O79j680L113k196j331L213k225R06O50k890L093
$$ 1096 -1007 -871 2119 -1124 -240 439 -1241 1872 -324 -1655 1558 -667 239 889 -2001 1092
455A092l16j945K154j822Q89J427k993J952K85j785K322j549n41K105j751N53
$$ 1092 776 -1169 985 -837 52 1479 -1514 438 723 -1062 1260 -289 -830 1275 -476 77
471G7L35j251J948r70j103J820q66k2M54j021R40O2o48M79m60L21M22p07K6K35
$$ 77 412 -839 1109 139 -964 856 -10 -32 422 -599 341 403 -245 234 -226 95 517 -190 -164 71
491G1J58j18k38J46k42N60J3j008P11J89k74K97r77P77O76j442Q77j58o56J528
$$ 71 229 111 -127 19 -223 337 350 -658 53 242 -32 265 -712 65 741 -701 176 18 -638 890
511H90j230l23J277j193Q68j0j398J818o56p23J455j554N61J066j726J064k8q87
$$ 890 -340 -663 614 -579 289 279 -1119 699 43 -680 775 -779 -218 848 -878 186 158 -729
529g29J510j173n4J223j569Q48O01j452R97j29l83Q52j029K92P34r19N23l7n53
$$ -729 781 -392 -446 777 -792 56 657 -795 202 73 -310 542 -487 -195 539 -380 143 106 -447
548d47Q30k09m37K51J8K22j49k94J40L05nm29K02Q1r6N44q25p0J113q95J17K90
$$ -447 383 174 -263 -12 6 228 79 -215 -75 230 225 -204 -2 79 -17 527 -298 -368 745 -150 -33 257
570B57q18J296n42r89J548r75J72R31k036J541O06k077J712o74n81K042k278M49
$$ 257 -561 735 193 -796 752 -223 -51 880 -1156 385 991 -1086 626 -48 -629 1413 -865 -416
588d16J614k248J767l36j964L009j374j051K171k237J262J093l012K291Pj738
$$ -416 1198 -1050 717 381 -1583 1426 52 -999 1172 -1065 197 1290 -1722 569 576 -1162
604a162K478j982k18K491k593Q78Q38k110K470q92j734K749j585k36J776k404
$$ -1162 1316 -666 -884 1607 -986 -108 730 -1380 1090 198 -1536 1213 -372 -608 1168 -1236
620a236J236J005k120J605n29q35K100j800j82J793j778Q16N53j794J734j45j340
$$ -1236 0 1005 -1115 490 -39 -874 1226 -574 -756 1037 -741 75 628 -1166 568 423 -917
637i17J574q85j69J280j621O40Q76j633J226J9j316J706p11p94J583j230J09J151
$$ -917 657 -228 -397 883 -738 -98 778 -855 371 390 -926 780 69 -725 858 -372 -263 888
655H88j648R14M63j492J538n22r36J810j351r4J475j808Q57O56j694J606m04j174
$$ 888 -760 154 617 -875 663 141 -795 1015 -336 -430 1045 -763 94 750 -944 662 258 -916
673i16J896j174k05J220j639J171L49j863J869m28j101J777j398K1J439j741P68
$$ -916 980 -194 -399 821 -818 353 702 -1161 708 280 -821 956 -442 -421 1018 -723 45
690D5M56j266J440o65p24J488j144K03Q77j566R95M83j283Q42j95k63Q13r13J25
$$ 45 501 -765 675 10 -714 774 -370 -167 710 -856 139 622 -661 181 -14 -277 536 -377 -252
709b52O73o85L59o7m30P54l16m09N53k06j12K88k80p4L66j07k28J63m9P3J67n06
$$ -252 421 -264 95 28 -402 352 36 -373 180 -26 -138 150 -130 -204 162 55 -173 -10 -59 14 181 -325
731c25K35L79n12L48j52m01R91n98n22J069p38J13O53j154P26L11r25R41n88k48
$$ -325 -90 289 -223 125 -27 -428 563 -35 -557 512 -226 -113 540 -614 112 423 -502 439 -149 -397
751c97J226j270K85P75j289J115r8j188J495o18m35J116j328O57O92j496J155
$$ -397 829 -441 -156 619 -670 445 347 -841 654 36 -399 717 -611 46 738 -758 397
768C97j73q73J547j159l06J500j410L94O80j305J121j46r10J259p92j26R55j199
$$ 397 224 -649 898 -261 -567 933 -477 -83 597 -708 413 267 -643 616 -176 -302 653 -546
786e46O06M42j187J094k74p60J261p80k89R72r09M22K66r51J026k02q02J066n69
$$ -546 60 502 -685 409 135 -625 636 -144 -433 539 -370 52 318 -633 393 191 -611 455 -114
805a14j88Q25r75L74N80j053O48J81p08P06l34k10O79p43K38M74q36N97P6o74
$$ -114 -302 523 -452 -78 502 -551 97 278 -430 276 -58 -268 411 -332 -94 380 -456 141 217 -457
825d57P87l44l36P81o98J23O03q43L66K49n27O07m05k87R00o14j66N41n20L59
$$ -457 330 -14 -350 431 -267 -144 459 -384 -18 231 -296 311 -94 -381 519 -95 -261 280 -240 119
845A19J37o65N16M1k98L56l69O9L84m16J45N4k63M55j84l42L94n8j00J22k32J46
$$ 119 256 -409 107 148 -150 206 -163 -94 290 -126 19 73 -190 265 81 -261 133 75 -25 97 -135 11
867A1K06l11O0J44j98J86J9l06K78M1k72K78j45j28L86l57j1L89m48J68J82m02
$$ 11 217 -94 -34 110 -88 98 117 -189 89 130 -142 136 -9 -137 249 -108 -119 270 -178 -10 172 -230
889b30M01j66k31N47m87J3M77o40L91J09n52O76l56l06P83o48R0M33p17O34q5
$$ -230 171 5 -226 321 -166 -153 324 -316 75 184 -368 308 -48 -354 429 -219 -129 304 -413 221 136
910A36o41R02m86k30Q09q28K53M22p29O59k43m61R06o00j07N56o66N32L0p27Q29
$$ 136 -505 397 -89 -319 490 -338 -85 337 -392 267 24 -437 469 -131 -238 318 -348 184 214 -513 316
931C16k53l27O01o14K91L15p04N67r1m30O75m08q8L79m54L77%m81N38j70j72L13
$$ 316 63 -264 337 -277 14 329 -375 192 101 -329 346 -62 -150 229 -225 152 152 -329 209 39 -133 180
953A80l17J75P1k68L17j72r7K79k46J27nj71L06j82o7J57j75K04q9j86L05j92
$$ 180 -137 38 109 -159 158 -14 -111 168 -78 49 44 -127 179 -3 -70 87 -88 116 27 -159 146 -46
975d6L6J28k87K66l3j88K82k91J27K34m76L12M8k82L57l03L5L44n09K71J32l95
$$ -46 -10 118 -169 97 64 -124 158 -133 -6 228 -248 64 112 -170 187 -116 -81 263 -246 25 157 -238
997b38M33k37j50M66m42J53J84m59M68j09l24M52l22Q8K78n70L68J18l64L61k86
$$ -238 195 -42 -192 274 -168 -15 169 -290 178 69 -255 197 -125 -37 241 -329 39 157 -207 154 -132
1018a32J7M10n33K13J89m01L77j38j60L24l25J77J68m47L46kk27L00k69P9K37
$$ -132 -115 295 -238 -25 164 -237 140 2 -158 166 -159 18 186 -261 85 83 -144 156 -113 -34 203
1039B03l72K21L4k40K92j77oJ92k93J97J00k79J87n7mJ37k78J47J38k15J13m6
$$ 203 -169 52 86 -154 138 -39 -45 147 -146 51 151 -128 59 2 -2 135 -143 4 142 -73 40 -6
1061fl0J40j62Q0J1j04J73r5p7J23q4M9jj05J48n9l2P2j01R4j9j00J49p1l1P5
$$ -6 -36 104 -58 22 33 -71 102 7 -70 53 -31 18 17 -88 60 1 -31 41 -60 34 15 -85 64 -7 -38 37
1087C7j00J09j3j08J38q3j6J19j61O1N6n9P5j35L9J52j71M4M1p2R5q3KP3j23J15
$$ 37 -63 46 33 -75 63 -20 -36 83 -78 -17 39 -20 55 -80 -41 111 -60 -16 25 -47 48 -35 -33 40 -83 32
1113C2J0j34J23m6K4P1k03J32N4j06R1j28N7J39k08R7K9j38J97r9o0J35j68J72
$$ 32 42 -92 31 -15 9 80 -123 9 63 -43 48 -80 -23 116 -92 5 34 -104 93 -6 -66 69 -99 73
1137G3L1k80K56j8j23J53k01J46J05l06K33rj65K52k08J5K07k75J62M2k20K44
$$ 73 104 -176 80 62 -61 92 -109 37 142 -164 69 60 -105 147 -61 -46 161 -114 48 90 -130 114
1159A14j19o2K31k45Q3J28k66K33l9j69K20j48K2J31k57J63Q5k27J81q1m8J82
$$ 114 -5 -67 164 -81 2 130 -136 97 58 -111 109 -39 -17 114 -143 20 105 -122 59 -22 -70 112
1181A12j86K6J11j34J08k3j21J68p2l9Q9j10N6M2q2O8nn3M6JnJ6m5QO1j6o8M6
$$ 112 -74 -48 63 -71 37 14 -107 61 -11 -50 39 -71 -15 27 -55 13 8 -45 1 2 -3 13 -32 -24 37 21 -47 -1
1209aK9m0K1m0J4P2q5M0Or5J49l0j21J18m7K3N7j81J25P6j65J01n6mJ63k02L1
$$ -1 28 -12 9 -31 -17 55 -30 10 16 -79 70 40 -81 37 -10 13 70 -111 14 90 -75 26 -30 -34 129 -73 -42
1236d2J44j76J14Kj44J81r4l7J61k04Q8J17j85J11jr6J46j34J1J54j77O5N5j18
$$ -42 102 -74 40 42 -102 79 -15 -52 109 -95 -7 110 -75 36 35 -61 85 -49 -38 116 -61 4 59 -59
1260e9J17n6m8J38j24J7P3r5M8J0n7P1l3k6N5l9j5K7kKOl0K1K4l1k7M4j8QK3j04
$$ -59 58 2 -46 92 -32 -15 58 -37 11 21 -36 35 2 -24 31 -8 -23 4 2 4 10 -20 1 25 -6 -33 11 -7 1 24 -80
1291h0Q4M7j12O9j8l8J18j21lJ15j28J04kj59J98q0o9J69j88N9J60k37J40Rj35
$$ -80 4 51 -61 8 -10 -48 70 -51 -54 61 -67 37 35 -124 74 -6 -75 94 -94 -35 125 -112 28 37 -98
1316i8K18j67k7K25k53P5J44k53K17n9j54K88k12k2K18k27J21M1k05K48j01j22
$$ -98 120 -47 -74 151 -102 -27 117 -136 81 22 -132 156 -56 -78 140 -87 34 75 -130 118 17 -105
1338a05K34j88K9J68k55J62L1j97K36j16j03K28j64K6Q4j74J67Qj81J85m3r7J20
$$ -105 129 -59 -30 138 -117 45 76 -121 115 -1 -104 124 -40 -14 70 -104 63 71 -110 75 32 -65 55
1361E5r7J9R5j36M8P2j01N8om0R0n7o0J19p9k2Q7r7K0J00j19N2K1j15J78m6j36
$$ 55 -42 -23 72 -64 -16 56 -45 13 7 -33 57 0 -60 59 -20 -42 45 -52 -32 68 -51 1 22 -93 85 39 -97
1388i7J74q9l4J41k10J12J16k39J62j4j49K66j95m7K57k72J12J10k75K76q4j62
$$ -97 77 -12 -46 95 -115 -3 113 -126 36 22 -127 139 -56 -103 154 -118 -6 104 -171 105 21 -141
1410a41L18k92L4K85l79K13P8l19L60j60j71L74l09Q1K15l85K92Nk99L90k10j04
$$ -141 177 -115 -81 204 -175 38 116 -203 157 -3 -174 200 -109 -28 187 -198 94 99 -200 190 -20 -124
1432a24L39l41J38J49l57L39q5k25L65k66K0K38l52K38M5l02L38j43j25K87k66
$$ -124 215 -126 12 161 -196 143 58 -167 198 -68 -48 190 -162 76 121 -181 157 14 -111 176 -90
1453i0Q3J38k76K14k2j41K14j82K0J55k19J22M6j59J62q5k1J01j39R9K2j36J55
$$ -90 -7 131 -145 69 47 -94 120 -62 -42 113 -106 16 62 -97 65 -20 -41 60 -79 20 42 -94 61
1476F1q3j6J04j31O4K7o9P5o6M0L1j15J34o4o5J48j21N1M6j67J88m2j43K16j67
$$ 61 -22 -38 66 -65 -1 26 -43 32 -34 6 37 -78 56 -8 -73 75 -46 5 51 -116 72 30 -113 103 -64
1501f4N5J40k76K06J5k13K70j70m5K51k97J44R2k78L08j08j70L19k87P3K08l89
$$ -64 -9 131 -145 61 76 -137 133 -37 -82 169 -128 16 108 -170 138 30 -140 179 -108 -35 173 -216
1523b16K81M6k95L31j77q8L24l59J42J57l37L07q2k02L66k72k1K71l29J97N0k66
$$ -216 65 111 -184 147 -30 -118 206 -153 -11 146 -191 116 34 -168 198 -74 -95 176 -153 44 94 -172
1545a72L19j61r0K82k94R9J61k76K13n0j55K76j91j9J70k07J33J3j68K17j00o7
$$ -172 147 -14 -104 178 -116 -17 144 -132 81 31 -124 152 -39 -58 112 -95 38 51 -117 100 0 -67
1567f7J51j50O5N7j35J26l2q9J32r2J5M3p2Q4o0k7Q9p5L5nl8O8n0PM3r0R1np3
$$ -67 84 -66 -1 56 -79 47 15 -74 58 -34 -19 24 -48 36 -24 -51 38 -37 -2 -7 -45 23 -27 -20 23 -67 24 19 -54
1596e4J07r5K1R1j37Q5Oq1J55j38OJ43j79Q5L8j39J77q5q7J94j71N2J23k17J51
$$ -54 53 -42 -21 70 -67 18 24 -57 98 -40 -34 109 -70 15 53 -86 91 6 -81 113 -58 -6 117 -100 51
1621E1j2j42K17j49l6J88j93R0N8j94K14n6j41K24j64RJ34k00J31K6j72J99q3
$$ 51 39 -103 114 -35 -71 117 -76 14 72 -122 92 36 -105 119 -45 -36 98 -102 29 55 -117 82 -1
1644ap8J84j56L4J17j80J19%j21J54p7m3J18j16N1P2j49Q1L4r0J01p0k8J21j14
$$ -1 -79 105 -51 -17 100 -80 39 39 -82 72 -5 -48 70 -46 5 77 -72 9 43 -47 54 -16 -44 77 -37
1669c7J3O6j02Q3mp6R9l8m4R9q2RO3q5M7ln7Q3l1n6P8m8OL4p9P6ln7O9k8k3O4
$$ -37 -24 42 -60 23 19 -57 42 4 -40 59 -23 -14 49 -36 11 8 -49 34 3 -53 25 -23 -17 17 -62 14 11 -46 23 -5 -28 36
1701C6o0MM8p0M5J8n7O7l1l4P0o9L0L7o2M6j7j8O9o1rO7p1K7J8m4N2m9J8M2o1
$$ 36 -24 -20 28 -42 3 21 -36 31 0 -34 36 -33 -3 34 -28 18 1 -17 52 -9 -18 49 -22 5 23 -21 31 -18 0 42 -19
1732a9L6mk0M8n6kN3l8OKl0O4n9KO0p1K2L0o5O9m3rO8r3N7L3q7O4k1k4P7q8K2
$$ -19 17 13 -7 41 -15 -17 36 -2 4 6 -24 40 -19 -17 43 -28 -6 24 -41 28 -15 -24 44 -49 8 41 -46 18 -3 -27 50 -38 -16
1765a6O0q3O4j8n6J03q4j9J07q7L5J2p7R9l2m4Q0r0L4N6r3O6j5l5Q7q7jR6r7M2
$$ -16 44 -39 25 7 -49 54 -30 -49 58 -29 6 18 -59 40 8 -36 44 -46 -12 44 -49 17 2 -33 54 -33 -34 62 -35 7
1795GJ4o7Q6m2l4M7n1M5J8p0P2k5m0O6n8L9J2o3O0l0j1P7q7L9K5o1O1m2j1P0p6
$$ 7 21 -46 40 -2 -36 11 -40 5 23 -47 25 0 -40 26 -32 7 19 -44 16 -14 -25 52 -35 4 29 -32 29 -13 -24 46 -30
1826c0M0J0o3P7j9m2P4p2L0K1p5R4l6n5J04n5j2N2q2O0Jo4R4n3k8Q2r0K6M9q3
$$ -30 10 20 -43 34 15 -27 47 -25 5 26 -49 45 9 -46 58 3 -9 43 -39 21 22 -42 52 -1 -29 53 -37 -11 38 -45
1856d5P2j7m6P3o1J6L6q0M6L8q6P3l0j8M5o5N0K4o2L7J0m9M8j3qK7l8K2j1QK5
$$ -45 27 10 -36 37 -24 -8 28 -52 -6 32 -54 19 -11 -29 16 -49 1 25 -37 0 10 -39 9 -4 -12 15 -23 -1 -12 -4 21
1887B1k8MOpQnJ8k9OL5m1%M1m6L0k2mO6n7j3O7r0M6K7q9R0k9m0R6j03M0O5j24
$$ 21 -7 -3 3 -4 4 -1 17 -12 -6 29 -12 -12 29 -17 13 -9 -13 53 -4 -17 50 -40 6 33 -56 34 5 -35 61 -42 -2 63 -61
1920f1O2K8r0J25n9m4J01j04N4L7j28J27Kj27J42q6kJ08j44N9O5j25J16m4p6J53
$$ -61 1 29 -61 64 5 -39 62 -42 12 49 -79 48 50 -77 65 -21 -23 85 -59 0 65 -60 56 12 -64 89
1946H9j05k6J31j35O5L9j19J01k8n7J19j18J8R9j31M9N0r7R4m0n0J16q8qO9r0
$$ 89 -16 -42 89 -46 19 58 -61 40 12 -45 74 -44 -26 73 -58 -9 41 -56 38 -2 -52 64 -24 -32 37 -53
1972e3O4L1j02Q0J2r8Q5m9pO7p7N3M3j18O8L8j01P2Nl4M9m9J4M9q6M8L8q7P4j1
$$ -53 11 42 -60 20 32 -66 19 -30 -37 30 -47 6 49 -69 -1 37 -64 8 13 -21 28 -21 -7 42 -44 4 42 -45 29 18
2002A8p1Q5l5k4O7n2J4L1q0Q2j1r7J21m3n9J15p9J0N9r3O4Nq6J10l6n8J00o5k5
$$ 18 -53 32 -3 -27 40 -12 2 33 -47 35 24 -73 48 5 -54 61 -18 -8 51 -42 22 27 -59 51 15 -43 57 -8 -33
2031c3P6q4L1N3r4Q2k8o7J24o5l7J04q1K0L1p8P3k5m7R2o4l1J09q6kP9q6L5K8
$$ -33 43 -41 -10 43 -51 31 3 -64 60 -5 -42 62 -19 1 32 -46 27 2 -45 47 -17 -48 61 -25 -27 52 -34 1 29
2060B9p4P1j3m3P1p5OR3j11L8O0r6N1Nn3R0n7l1P3p1K6O9j23N5M4q7Q9m3m3J11
$$ 29 -45 26 13 -30 41 -34 -28 65 -46 -8 52 -44 7 12 -41 49 -8 -39 34 -37 -11 58 -65 -10 34 -53 36 -7 -50 61
2090F1j03MQ1j05O9M3j34J15j3p5J04r2L5P1j28Q8L5j36J25j4r3J04n4pP0j06
$$ 61 -42 -38 43 -62 7 50 -84 31 18 -57 47 -45 -10 61 -67 21 56 -80 45 31 -62 42 -12 -19 51 -55
2116e5P6J3j03J19m7n4J31q9k6J07j07J9P0r5P4l4m8J18q2l5J02q7J9N3p9N6p
$$ -55 21 34 -69 50 3 -51 80 -9 -35 72 -35 -16 54 -41 33 -1 -49 69 -13 -48 54 -33 -14 39 -40 16 9
2143Im3P4n4j6Q5q1RN7p2L7J3m3N6m0k4Q1p8QP7r6L3M8o5L6jl9N0l2j5O4o1NO4
$$ 9 -34 40 -14 -30 55 -26 -17 40 -32 5 18 -25 31 -9 -33 48 -30 -22 55 -41 -8 40 -25 11 10 -29 21 -11 -26 38 -23 -18 46
2176D6q9M7L4o7M0Mm1M8l6nM4p0N5K1p5O0Qo8P4k7k9P0q5L4M8q4N9Po5O1j0l1
$$ 46 -43 4 38 -29 11 15 -26 22 -14 -19 25 -45 10 31 -44 16 24 -44 30 3 -26 44 -41 -7 41 -43 16 23 -42 19 9 -22
2208b2N7m6nM6p0N6K0p9P4jp2P7k1k1M0n3M4jo1R3m0n5P7k7l5O8o4K7L1o7N2j4
$$ -22 35 -11 -16 30 -40 16 36 -43 31 30 -42 35 14 -7 33 -20 24 23 -38 55 15 -40 37 10 -25 43 -21 6 37 -30 22 8
2240Hl6P6m8l8Q2n3KM0o4M7pl7N3m0j0P2n8j4N5o2L5J3n8N8j7l3P5p4J3N6q1L2
$$ 8 -28 48 0 -38 44 -9 -7 33 -31 16 9 -28 25 -15 -25 47 -11 -25 30 -32 3 16 -42 16 -1 -34 41 -33 -20 36 -45 -13
2272a3L9o6N7k0k7O6o9K9L7p1N2J4o8O7k5l0N3m9J0M2p1O1J1p5Q2k3l4O0n3%L3
$$ -13 26 -40 17 -3 -30 36 -33 -4 33 -38 14 28 -40 27 2 -28 25 -24 -14 28 -43 18 29 -46 36 13 -21 39 -14 -14 19
2303A9m1M7j9m3O9l7l4N4j9kJ3k4K5Kk8K6j9pL1k0rK0njNOj7%J5qJ2%%mj1J8J2
$$ 19 -22 25 6 -37 32 -5 -39 15 -4 -6 7 -17 8 10 -18 8 -11 -18 13 -7 -16 4 -1 -2 3 9 -8 -8 7 -1 11 11 11 7 -4 14 26
2340B6m7L8ok2L7k9J8Jl0K9%m4N2k0k2M1k9LK9m3L0j0l7O8m8rN2m9J4L3o1M3J2
$$ 26 -21 17 11 -11 26 -3 15 16 -14 15 15 -29 23 3 -19 22 -7 -4 25 -18 12 2 -35 33 -15 -24 28 -21 -7 26 -35 8 20
2373B0m5M8n9K4N7r0M1J3m0M7j7j4M4m9L3Qp4P5kn6P0l9LL3n7M5%m9O0l8k4N8
$$ 20 -25 23 -36 -12 45 -45 -4 9 -31 16 -1 -15 29 -20 13 21 -53 22 20 -36 34 -5 -2 31 -26 19 19 -30 30 -8 -32 26
2405B6m0KL7l7K2jl3O5m8lM4n5K6J1l2L5k9OL3n3L1Rm0K6MrJ1l1K5Ol1M4k7j0
$$ 26 -14 -12 25 -12 10 9 -24 41 -7 -10 34 -21 5 16 -16 19 -10 -4 29 -24 7 16 -24 2 6 -3 8 -23 2 8 -23 21 -6 -16
2439a6M1l7J3J0j2J0j1JK7l6nL0j5%kj3K4j4J4kk8L3Nm4L8Kk3PmONj5K4k5J5J0
$$ -16 25 -12 1 11 -1 9 -2 -1 26 -10 -15 15 0 0 -2 -15 9 -5 9 7 -21 12 17 -27 11 13 -10 -3 -7 -1 4 -11 13 -12 3 13
2475A3k4jJ8j5Nk2J1J3j5J0JkQQJj2mPqJ0Mj6J3J0k3J3j2RRl2K3Ql2K8Ok6K6k3
$$ 13 -11 -12 6 -9 -4 -26 -15 -2 -17 -7 -6 -8 0 8 9 -3 -7 0 -8 2 6 -10 3 13 -10 3 -9 0 9 -23 0 8 -24 4 10 -16 10 -13
2513a3J9J5m2M0pm1L7j2nK7k7J2Ok4L7l9K0K1m0JM3m6K3mk4L8l7J0K3m1L2J9m8
$$ -13 6 21 -21 19 12 -29 8 -4 -9 18 -9 3 9 -15 22 -17 3 24 -16 -15 28 -18 5 1 -23 15 -22 -12 11 -30 2 21 -27
2546b7K6Lj0J1rmK2k5K3k4pK9j5j0J7J5k2mrL1k3K1Kj5lJ5%%j7J6Rj9K3k3LQl0
$$ -27 -1 2 -8 3 -6 -10 12 -13 10 -14 -21 8 -7 -17 0 15 -7 -11 -20 11 -12 9 11 -4 -7 8 8 8 -9 7 16 -3 20 -3 0 8 -22
2583b2K5Lj8L8k4j2K9l4K2Kl5L7j5pM1m6K0J0m4M5kl4L9k2mL5n6L8kk0L2j4j7
$$ -22 3 6 -12 26 2 -10 19 -15 7 9 -26 11 -4 -11 30 -16 4 14 -30 15 13 -21 18 -4 -8 27 -29 9 7 -13 19 5 -12
2616a2L8l6RK9m4L3j0k6M8k1j4L9m5J8K3l6K8ok1K6k4mJ7j9J2J4k6OkoJ1q%Rm
$$ -12 26 -10 -1 28 -16 17 7 -19 29 8 -6 33 -12 6 29 -7 21 15 -6 20 -4 -8 9 -10 2 16 -10 -4 -6 -12 -1 -9 -9 0 -4
2651dMpLmNKPMj7nJ7qJ0kj6J2mj6M2l8KK7m1M3j2k4N0k7j4M6n1PL5n6N4qm3O6
$$ -4 0 -7 -4 -8 -3 -1 6 10 -7 -12 5 -3 7 5 -11 1 -3 -19 23 -15 -13 14 -27 16 4 -20 30 3 -11 35 -16 -9 26 -30 24 16 -27 39
2689C9m4j1O0p4L5M2p8M1Mm3N3l6OL9p6M0J1m4N8rl5M9n0OM5o1M2jl7N2k3k3M1
$$ 39 -5 -16 44 -30 5 47 -31 10 14 -29 24 -12 -6 33 -43 -3 8 -36 22 13 -22 27 -23 -17 28 -33 9 8 -29 23 0 -23 18
2722A8l5J3K5k9J5J0k9L3j4k2L9l2J1J0rJ3j3rjOJ5o%j0J6j2j7K9j3jLnqK0l2
$$ 18 -17 -4 21 -8 7 17 -12 21 7 -15 24 -8 3 13 4 17 4 -5 -6 0 15 9 9 -1 15 3 -14 15 2 1 4 -1 -9 11 -21
2757b1K2Pl0L9j1j7L4l5kL7m1K2Pl2L0j2j7M0l5RK0m6L2Rl7O0m5qM6m8J8K6m1
$$ -21 1 8 -22 17 6 -11 23 -12 -14 23 -18 4 11 -21 9 -3 -20 20 -15 -6 14 -32 0 9 -28 32 -13 -21 25 -23 -5 21 -20
2790b0L6ok5L9l2NL3n2L2J3m3L9j5j4M9l6j2K9m5M1rk8M3k8qK8j6JJ2k2J7Lj7
$$ -20 16 10 -15 24 -8 -3 30 -22 10 23 -20 19 4 -10 39 3 -9 20 -25 16 7 -21 22 -6 -14 14 -2 -1 11 -11 6 9 -8
2823hK5k4mK3k2KOj0kJ5j3N%lQJ1j9oK0nj1J3nQj1lK2nnPk8K2Lj0J6j3kK1l8L2
$$ -8 17 -7 -11 12 -10 -8 -2 -12 -14 1 -12 -7 -7 -10 -2 9 -10 -16 4 -1 -12 1 -4 4 -7 -10 12 7 2 9 -19 3 6 -4 12 -1 -3 18 -20 12
2863A2kk7K7lj7L3k9%K5l7L2ok4L4j3j9K9k9J1K2m8M3ml6L8j8nL6l7K2Rk1Qj0
$$ 12 10 -17 10 7 -10 23 -6 -6 19 -18 14 8 -16 18 5 -14 15 -14 -3 19 -29 14 10 -26 12 -6 -11 25 -12 10 19 -2 6 -4
2897dj3L7l6K0%pJ3ok0J8qRQk3J0O%lJ0k0K5k5LNNmMpmJ1qOkJ0j4PqLnjJJ9k2
$$ -4 -17 20 -16 4 4 -3 10 4 -16 2 -6 3 11 -12 -2 4 4 1 11 -9 16 -9 -6 -1 4 0 4 -3 -7 4 -4 2 0 10 -4 3 -5 -2 -7 -8 -7 12 -10
2940a0RklJ3j8RMk3J9klJ9k6kK2j2J6Nl9L6j3j2K4k4J4Ok4K2Nl0L0j4kK2k3PJ3
$$ -10 -1 -3 -6 7 -11 -2 2 -21 -2 -4 -7 12 -14 -16 6 -6 10 15 -24 12 -1 -13 11 -13 1 7 -17 5 10 -20 10 -4 -6 16 -7 0 13
2977A3j5KpnK4j8nQj3J7Oj3J7j7lQpPRj4%RkPk2J5Mj0KnlJ3MloQ%nJ6rmJqLQj9
$$ 13 -2 0 -7 -12 12 -6 -11 -3 -16 1 7 -6 11 -6 -9 -1 -8 -1 8 -6 -6 3 1 8 -14 1 5 -5 -3 -8 -11 2 6 3 -3 5 5 0 16 7 3 4 -4 -1 7 -12
3023a2J6kj3J9pML%Nkj7JMj0PJ1pRrMnk%MjRk0J3J1k5J0j4J6Jl%J4j3OLk1J9j2
$$ -12 4 2 -11 8 1 5 8 8 13 11 -6 -5 -1 -11 -4 7 0 9 0 4 -1 -3 -3 1 0 9 -11 2 13 -12 -2 -16 0 1 -2 -2 12 -1 5 8 -13 6 -6
3066f%J5pkJ6k1L0k3nK9k6J0Nj1LkqK0j9J3mkOllPj0mQj4J8j1J3j0p%J1nNLj4
$$ -6 -6 9 2 0 16 -5 25 2 -3 26 0 10 15 4 7 5 -3 17 -2 11 7 5 11 8 5 12 2 -2 6 -8 10 -1 12 2 -5 -5 6 1 6 9 -5
3107eJ2j3Rkj0J3pj5K4k1J2J1j1jMjOjj9K7j8J2KqJ7j0NpN%pnJ6j4j2J8nKKj9
$$ -5 7 -6 3 1 -9 4 -3 -18 6 -15 -3 8 -3 -4 0 -1 5 4 -15 12 -6 6 8 0 17 7 12 5 10 10 3 -2 14 0 -12 6 1 3 5 -14
3147a4K7Jj9K0l6K5JnRrmPnPJj3QkpJ5j2KolJJ4oJ2lj1J9j7Rlj4J2QnJj6J0Qn
$$ -14 13 14 -5 15 -21 4 5 0 9 0 -4 3 -2 5 6 -7 1 -1 -8 7 -5 -3 -9 -12 -11 3 -3 9 6 -5 14 -3 6 3 -11 1 9 4 5 -11 -1 7 2
3190BQrjJ3j6JJ6JpLj8J3j0NNJnOj7J4jnOj6QOPj2kj2K0j8JJ7ojqkJ6j1PLmkP
$$ 2 10 1 0 13 -3 -2 14 15 8 11 -7 6 -4 1 6 7 2 8 -9 5 4 -1 5 -11 -3 3 10 -2 -4 -16 4 -14 -13 4 -2 -3 -11 -13 3 -8 -1 2 -2 -4 3
3235Cj3K5j8lK2j0nJ1j7J0onKRmMqRJjMj4kJ6j0J2j6J1lj3J7qOrNj7K3j8QKoN
$$ 3 -10 15 -3 -6 16 6 1 12 -5 5 -1 -6 -4 5 1 5 -3 6 7 6 10 -4 -6 10 0 12 -4 7 4 -9 8 0 6 -3 2 -15 8 -10 -2 0 -6 -1
3277aJ0k2J2lOMk3J9j8KJ0nmK5j9JQkRk0NJ6j8NkqPO%rJ1Lk2LK2j3NrKJ2j5Oj2
$$ -1 9 -13 -1 -4 2 6 -17 2 -16 -14 -4 -9 -13 12 -7 -6 2 0 9 -11 -6 10 -8 -3 -5 -13 -6 0 0 -9 2 5 -17 -14 8 -5 0 -9 -7 5 -10 -4 -16
3320a6K5nLooOoJ2JrorPNnJ0joJ0qpJ5j5RJ1k3J7j0NJ1j4LjoNpJ0Oj3J5olRPj9
$$ -16 9 4 7 1 -5 1 -5 7 8 -1 -7 -16 -9 -4 -9 1 0 -6 4 -4 -11 4 -11 -2 9 -14 3 -7 -2 9 -5 -2 -3 -9 -4 -11 -1 5 -8 7 1 -2 7 14 -5
3365eK5j8qKPqJ9j5JkN%j3J6Jj1J4poJ1k2K3j9MJ1%k4OJ2j1K0k1J0nJnOMMnOk
$$ -5 20 2 -6 -4 3 -5 14 -1 0 -2 3 3 -10 6 7 -4 10 3 -3 8 -14 9 -10 -6 5 5 -19 -13 -1 -12 8 -13 -3 -8 -7 -12 -6 -2 2 -3 3 1
3407Aj1J6j0NJ1Mj5JpJ3j2NlLkOJnpKJ4pj8J9krMMj0kOQoQj0kQj0LJ5j4mrNJ7
$$ 1 -10 6 -4 1 12 16 1 2 -5 8 -4 1 -2 1 -1 5 6 1 -6 -4 10 3 -15 4 2 -7 -3 1 -9 -11 -5 3 -3 5 -5 -7 1 -9 -6 9 -5 -9 -18 -13 4
3452D%Jm%mnKOJoJ6opKKLj1MQJMpJ%lkJ0ommmJ0KrPqjNMJj5LJ3jQj7LjnLMOmO
$$ 4 4 5 1 1 -3 -8 -6 0 1 -5 11 5 -2 0 2 5 -6 -2 6 7 11 4 5 5 2 0 10 4 0 -4 -8 2 4 -5 2 -6 -7 -2 2 3 -12 -9 4 3 11 -6 -3 -4 -9 -6 -2 4 0 6
3506Fj5qQNLj5RK1j5rlJ0Pjj2NkJ0KpNjJ1j2J3noj3KOlJ2qj5J4OpNj0LoJ3j2J5
$$ 6 -9 -17 -9 -4 -1 -16 -7 14 -1 -10 -13 -3 4 3 -9 -4 -6 4 6 -1 4 3 14 2 15 10 4 -9 -7 -1 -4 8 0 -15 -1 5 -2 3 -7 -4 -10 3 -9 6
3550FmJ1j2kPj4%OnkM%kmK1qMnj1J1j2NJ4j4rJ3LMj4J5olJ2j6NQjMNmlRlkp%k
$$ 6 2 13 1 -1 6 -8 -8 -2 -7 -9 -5 -5 -7 -11 10 2 6 1 -10 1 -11 -6 8 -6 -15 -2 1 5 -9 6 0 -3 9 -7 -2 6 5 9 14 10 7 16 13 11 4 4 2
3597BPrJ0j0lPj0J6poJ1j1PLj1OroJ2pjRpO%%njJOj0J4Pj2j7J3%LqPkmJ7%j0%
$$ 2 9 0 10 0 -3 4 -6 10 3 -3 8 -3 4 7 -4 2 -7 -13 -1 -8 -9 0 -7 -1 -1 -1 -6 -7 -6 0 -10 4 11 -1 -18 -5 -5 -2 -10 -3 -5 -9 8 8 -2 -2
3643bJ2oPplJ2j1jjoLPlKLkMMj4Rj0QJlp%LNj0lNnJjNrK1j4KRnj7LLK2j5LLj8
$$ -2 10 4 11 4 1 13 2 1 0 -6 -3 4 1 3 6 4 8 12 -2 7 -3 5 6 3 -4 -4 -1 4 -6 -9 -4 -9 -8 -9 -4 -13 8 -6 -4 5 0 -17 -14 -11 11 -4 -1 2 -16
3692a6K0nj5J2qJ0NRnQj0%JLrKKKJJJj2J3j0jqMjOjjkJ2Jq%kLj9J3MnLo%QOj8
$$ -16 4 -1 -16 -4 -12 -2 3 12 7 15 5 5 6 9 0 2 4 6 7 8 9 -3 10 0 -1 -9 -5 -6 0 -1 -2 -4 8 9 1 1 -1 2 -17 -4 0 -5 -2 -8 -8 0 6 -12
3740a2RqJ2l%Pj7OJ7r%JmOJ1roKKkQoj3J7qJ0pRj1Kj%kmJ3j2OOolJpNKQpn%Pl
$$ -12 -3 -11 1 -2 -2 5 -12 -6 11 2 2 3 -1 5 16 7 1 3 5 3 11 5 -8 9 1 11 4 13 2 4 3 3 1 -3 10 -2 4 10 4 1 2 -5 0 2 10 3 -2 -2 5 2
3790BjpNmOLKmNrJLNnqPMqOMj2J8rLKJj2PnoONn%J3jj1KPqj2J2Mj4OkOOLk1LR
$$ 2 1 -6 -1 -5 1 4 6 2 7 -2 -1 2 7 2 -6 1 5 -3 3 7 -5 13 4 7 9 10 -2 5 0 -6 0 5 0 0 13 12 1 3 10 2 -10 2 6 -8 -2 -4 2 8 11 -10 -7 2
3842BmKlJoOjJ1nmj5QQjoMJ0qLjnQJloJ9j6jK0j8PJ1j6%NrO%j2LOJ6j2nrJ9j8
$$ 2 -2 0 -3 -2 -8 -2 -3 8 3 -1 -16 -8 0 -1 -7 -3 7 -1 2 1 -4 4 5 2 -4 15 -1 -2 18 0 7 18 2 2 7 -2 4 4 -8 -5 1 17 5 0 -9 10 -8
3889hJ5rJ0%rknMQqNJoKMoOjJNj5JNj2J3kLKpK%J0rP%pNPoj0J4lpJ4j4J2qmQj0
$$ -8 7 -2 8 8 -1 -3 -8 -4 4 -4 1 2 -4 -2 2 -4 2 1 2 7 -8 -7 -2 -14 -1 -3 0 2 -5 -3 -3 7 -2 5 5 -2 3 10 4 -6 8 5 -2 12 -2 10 2 -2 6 -4
3939dmOjNklPlRj9QkJ0pKj0jlJ1j7RJ2omNqPj0J0JKJ5j5oPJlLmMjKKQj%mm%rj
$$ -4 -8 -2 -3 2 0 -3 4 1 10 -9 -1 -3 7 0 2 -8 -9 -12 -1 -18 -9 3 -3 -7 -2 -10 -3 -13 -3 -2 0 15 0 -6 1 2 -1 2 -2 2 1 3 5 13 12 12 8 4 4 -5 -6
3990fJ3j3NqKJJj%NkKpM%KkjpMJ0j5J0mlJ4plNo%llJ4j3j4K3%Ml%Rj0mMj3J6P
$$ -6 7 -6 -1 -9 -7 -6 -5 -6 -6 -1 -3 -1 -8 -4 -4 -2 -4 -5 -12 -8 2 -13 -3 -7 -10 4 -3 -6 -1 -7 -7 -10 -13 1 -12 -26 -3 -3 1 -2 -2 7 -3 -7 -3 -16 0 7
4038Gj4J2koMJ9k4J7q%%JpPnpLJN%j4J6Kjnj2LQpJ0Mj4J2l%%j0NkJNj2NmJKKJ5
$$ 7 -7 5 3 -3 1 20 -4 13 5 5 5 6 -1 6 1 -6 -3 -2 3 3 -11 5 7 6 1 -11 -8 0 -7 3 7 -7 5 2 2 2 -8 -3 -5 -4 1 -11 -6 -10 -9 -7 -5 10
4086A0j0pJ2kMKjj4KnJ9j0lLJOlLmPLpj4J5Ok2QrKlkMJPNpkJ0oMp%J3j6nJ7k5
$$ 10 0 -7 5 3 7 9 8 -6 -4 -9 10 0 -3 0 1 7 4 7 3 10 13 6 -8 7 13 -9 -1 -10 -8 -11 -13 -9 -8 -1 4 -3 -5 5 -1 3 -4 -4 9 -7 -12 5 -20
4133b0J4%KNrJ1j2KJ1j4J0o%pJ9%J%jlkMnPj1N%j0J2NNopknOPKkj1Qj5J0KJmJ
$$ -20 -6 -6 -4 1 -8 3 -9 -7 4 -10 0 -6 -6 -13 6 6 7 7 6 3 1 5 0 7 -4 1 1 -9 3 8 13 7 0 -2 -7 -1 6 8 6 -5 3 -12 -2 0 1 -3 -2
4180bklMkM%jMrJ2pnRJrKqKJ0J%okNJmqNJ2kmQLj7K1j4MnnJ3ljK%mJ2j6J0%pj
$$ -2 -4 -7 -3 -5 -1 -1 -2 2 -7 5 -2 -7 2 3 -6 -4 -12 -10 0 1 1 -5 -7 -2 -1 -5 -13 -8 4 2 -2 6 9 -8 13 -1 3 -2 -7 6 3 2 4 4 0 12 -4 6 6 -1 -2
4231bKoJMpjLPLmOpj0J1jKj1J1jJ1j9QnqJ6qPpJ3j0j4K3rkJ1rJ%LPmj2%Lj2J3
$$ -2 0 -6 -5 -1 -8 -9 -6 1 4 0 6 -1 -11 0 -1 1 -10 1 0 11 -8 0 -5 -13 3 -5 2 -5 8 -2 -16 7 -2 -4 7 -2 -1 -1 2 9 5 -7 -7 -4 -16 -3
4277cqJ9qMnllJ3lj2J4k6J6Oj2Rj4J2p%MPnJ0qkMJMkrJ5okOj2MKlLJpJ6nmLj1
$$ -3 -11 8 0 4 -1 -4 -7 6 3 -9 5 -21 -5 1 -11 -2 -16 -4 -11 -11 -7 0 -5 5 -3 -5 -1 0 4 2 -7 8 2 0 6 -6 -2 0 -3 0 1 -6 10 5 1 4 -7
4324gJ5j6N%pPknJ6oJNMlj1Llj5J0Rnj3J8OpknNj2JRj5J5mnJ3%KlrQnLLKKPk0
$$ -7 8 -8 -3 -3 -10 -3 -5 -10 6 0 1 6 10 7 -4 -1 -4 -19 -9 0 -5 -18 0 6 -1 -3 -8 -3 -15 -14 -5 -20 -5 -9 -14 -1 -1 1 -2 -11 -3 -8 -5 -2 0 2 9 -11
4372a1J9Lj2QqJkMJRk0LKM%LrJPJj6oJ3MmKMKkJ%q%RKjnrJ1k4J6Qj4J4oMnj1J4
$$ -11 8 11 -1 7 -1 0 -2 2 3 12 -8 -5 -3 1 1 4 -5 -4 3 4 -12 -18 -5 -1 -5 -3 1 3 1 2 2 -6 -6 3 5 4 -1 -10 1 -23 -7 1 -13 1 -5 -1 -6 -17 -3
4421cj5J4MjPqK%pJ0lPk0J1%QrOj0JJ5j1J0oPj3qJ3nPpj1J6poPJLrONj3nK0j7
$$ -3 -18 -4 0 -1 6 -2 0 0 -7 3 0 7 -13 -2 -2 6 -3 3 -7 -6 9 -2 8 2 9 -4 -12 1 -4 3 -4 -15 1 -6 -12 -5 -4 -1 -10 -4 1 -12 -17 3 -14
4466a4j%QlmRj0RpNlQnMLmKKKpPojJKOj1RlQmjjMnOoJ9pnJ1k0J7j5JJJnJRj8K2
$$ -14 -15 -15 -7 -10 -14 -5 -15 -6 -13 -8 -11 -3 -8 -4 -1 -5 -3 -1 1 -6 1 -5 -6 -5 -3 3 -8 1 -2 6 2 1 0 4 -1 5 -1 18 11 6 17 -3 14 -1 0 1 2 -3 -2 7 -11 11
4518A1j5qJ4j1kJ5j0OrJ6qLqjNPj2PjnO%jokQJ0j7K2j0j1J9nLnoNKj5PO%lJ4k3
$$ 11 -4 -12 2 -9 -11 4 -6 0 -9 7 -1 2 -6 -7 -2 5 -7 0 -1 -6 0 0 -1 -7 -9 -1 9 -8 14 4 -7 12 7 10 5 -1 4 6 -9 -2 4 4 1 15 -8
4563hRKj2RPj2MoLmRNnlmoJPMj1%J2oMOj2nRJ2mmOnjkNmJ3k5K1rMPlokRpJ2j7
$$ -8 1 3 -9 0 7 -5 -1 -7 -4 -8 1 6 1 -2 -6 -12 -11 -4 0 -11 -11 1 -5 -1 5 -7 -12 -3 9 5 1 7 2 1 -1 4 0 13 -12 9 0 4 11 8 2 0 9 2 14 -3
4613cRj7J3KnjkMkKNpJ0j6PmPJ4j1rLjJlnJ2ojPj1J7j5PmQomkJ3pkPoj2LONoQ
$$ -3 6 -11 2 4 -1 -2 -4 0 -2 0 5 -2 8 -8 -1 -5 2 16 5 -4 -1 -2 -1 -4 -9 3 -3 -4 3 -8 9 -6 1 -3 5 -1 -5 -7 6 -1 -3 4 -2 -14 -11 -5 0 -6 2
4662BMJ7k2J3qJ%kqOQnqmMkLJ1j1NqjJmJNkKqNJMJnmJ3nOj5J1j1J3nnJ2j0J8k3
$$ 2 6 23 1 14 6 7 7 5 -3 3 11 6 -2 -6 -2 -4 -1 10 -1 4 -4 -5 -4 -8 -7 -2 -4 -2 -10 -5 -4 0 1 -4 -8 5 0 6 -9 2 -9 4 -1 -6 6 -4 14 -9
4710iJ3LoPmmMmj1K3j3prJ4JQLj1nK2j1j5OJ0Lj4OnJ2rRj4MoJJJ0p%NjolNm%R
$$ -9 4 7 1 8 4 0 4 0 -11 12 -1 -8 -17 -3 -2 6 9 -2 -7 15 4 -11 -5 5 8 -6 0 -5 7 -2 7 -7 -3 -9 -8 -7 3 -4 -4 1 0 -6 -9 -4 -8 -8 1
4757Aj6J9Oj3QqKJjqJ2nokRLj0jJ4mOJ1j9mJ1j2JJ8nKj0mkoLJ3JmMkj4J6lo%%
$$ 1 -15 4 10 -3 5 -3 -1 0 -1 -9 3 -2 -8 -10 -1 2 -8 -9 5 1 7 18 -1 -5 6 -6 -5 13 8 10 0 -4 -6 -12 -9 4 5 1 5 3 -11 5 2 -4 -4 -4
4803dJ2k1J7j2R%lJnOkLOj4J0jrNPjKPj5OKqMoJ2j0J1%j2J1Lj6J5j2%NjQlLrr
$$ -4 8 -13 4 -8 1 1 -2 -1 -6 0 -2 1 7 -7 3 2 -7 -2 5 4 6 13 -2 4 6 -2 2 -4 8 -2 9 9 -3 8 11 -5 10 -2 -2 3 2 10 7 10 1 -8
4849hRjqkRlLpOLkkJjmJ1Oj1oJ3%j3NQRk4QpJ2NpkMNqMJkjmJ3kn%j0Oj5J9%%K
$$ -8 1 0 -8 -10 -1 -4 -1 -8 -2 1 -1 -3 -2 -3 -7 4 10 -1 -7 6 6 -7 -2 6 15 -9 -1 -8 4 9 2 0 4 9 1 5 6 4 3 -1 12 10 5 5 -5 1 -14 5 5 5 7
4900Gj0qJ0NokojKQj0J0rOJlLoqJ1OJjpMnjKJMRoJjklRQk0J3oKKlJ0koqoPjmJ5
$$ 7 -3 -11 -1 4 -2 -4 -10 -11 -9 -1 -11 -1 -10 -4 -3 -6 -3 -9 -17 -6 0 1 0 -7 -3 -8 -9 -7 -6 -2 7 1 2 1 -1 -4 5 13 -7 6 0 2 4 1 11 9 3 -5 -11 -4 -5 -9 6
4953FrJ7j5QKj9mJ1jJ0lj1KNj0Qj1LLjMJ3j4KoMPj0J2j2nJ0MMj3NOoMJ1joJkn
$$ 6 -3 14 -1 7 9 -10 -14 -3 -4 6 3 -8 -6 -1 -11 -3 -14 -11 -8 -9 -5 8 -6 -4 -10 -6 1 -9 3 -9 -14 -4 0 4 -9 -4 2 -4 0 11 10 4 5 3 -2
4998bJ1qJ1ppMOj1J6j0OrJKoKLlRj4MOqkOoJ2k3LJ1nNkNlOoLLoklJJJ1n%JK%n
$$ -2 9 1 12 5 -2 2 8 -3 13 3 9 0 1 3 -3 -1 2 -1 8 -6 -2 4 -4 -6 0 -6 6 -17 -14 -3 -8 -3 -5 0 -3 3 -3 0 3 -3 -5 -8 -7 -6 5 0 0 1 3 3 -2
5049bjOnQj0NoL%KRJorJ9k2RmJ0nJllkJKpRpKjj2J2Pj4J4njknJ8k0J0lMJ1mj2
$$ -2 -3 3 -2 6 -4 1 -5 -2 -2 0 9 10 4 -5 14 -8 1 -3 7 2 3 0 -3 -5 -4 -2 -9 0 -7 -5 -6 -18 -6 1 -13 1 -4 -5 -7 -12 6 -14 -4 -7 -3 8 4 -8
5097hQ%JmKPrQrkO%MQkj4NKKPmqqJ1J6j1qQkJ%j1jJlJ0oQJpnnOOjlOJpLRj0nk
$$ -8 0 0 1 -3 -1 6 -3 5 -4 -6 0 0 4 12 10 -4 1 3 5 12 8 0 -8 3 19 8 0 8 6 7 7 -4 -5 -4 -7 3 -3 5 6 -1 -6 -11 -5 1 0 -3 3 4 -3 0 9 -1 -6 -8
5151hJ0j0QmJ2j3QlMoLj2Rm%J0PnJm%PrloJ3%N%k0J3%nPJ%rMJJ0pp%Rj4J4jnj0
$$ -8 2 -8 0 -4 8 -5 3 0 4 -2 1 -11 -2 -6 -6 4 11 6 7 3 3 10 1 -2 -8 5 5 10 10 -10 3 3 -2 5 6 6 -3 1 2 12 5 -2 -2 7 -7 7 6 1 -9
5200i%J0mJ%Nmk%j1NJ1J%j4RLoqjJ9J%nMk0K6lNj6J1mjNj2PkJnJ3j9OMpJ3j1M
$$ -9 -9 1 -3 -2 -2 3 -1 -3 -3 -14 -9 2 3 3 -11 -2 1 -5 -13 -14 5 6 6 1 5 -15 11 8 13 -3 8 4 3 8 -4 3 1 2 -3 10 -9 -3 1 -6 7 -4 0
5247@kMkjlj%nnJ4j5J3%MmlNJ0j7J3Kj1PrJOj2QO%QrQj4J2QmqmJ2nmj%J2j5PJ
$$ 0 -2 2 0 -1 -4 -5 -5 -10 -15 -1 -16 -3 -3 1 -3 -6 -1 9 -8 5 7 -4 3 -6 -5 1 -11 -3 3 3 11 2 10 -4 8 16 12 4 0 12 7 3 2 2 14 -1 6 7
5295GmlnRnKJ1j0lOj7JJ7rjMkoKJ2Kj8LNKLLjnMMojJn%MpJ7rpJ0j3RlPJj2J3r
$$ 7 3 0 -5 4 -1 1 12 2 -1 5 -12 -11 6 -3 -4 0 -2 -8 -6 6 8 -10 -7 -2 0 3 6 5 0 4 8 2 1 2 -3 -3 1 -6 11 2 -5 5 -8 1 -2 5 6 -6 7 -2
5345bPpRpKKj1NMLnj2J0LnMmPkjJ1j0qJ5nkm%Oj0lkJ6oJ1poPnNJQj2%P%%j2J2
$$ -2 5 -2 7 0 2 4 -7 -2 2 5 0 -12 -2 1 -4 0 -4 3 1 0 11 1 -7 8 3 1 -3 -3 3 -7 -10 -12 4 -2 9 2 -4 3 -2 3 4 12 0 0 7 7 7 -5 7
5394GjpnJ3j5QLJ2j8NNqLQj8J8pJ2qrOj4J4j0NRlqKmQj3QlKpKMNmJ1j0JOkpLK
$$ 7 6 -1 -6 7 -8 0 3 15 -3 2 7 -1 2 10 -8 10 3 15 7 -2 4 -10 4 -6 -1 8 5 -3 -1 -5 3 -10 -2 -5 -3 -10 -8 -4 1 -3 8 -2 -1 5 3 -4 -1 1
5442AkNj6J9nlkMpK3j5KlpJ4JqkKLLpJm%OMmjqOQj1Q%lJk%lqoPmJ0qJ4olJ2qj2
$$ 1 -1 4 -12 7 2 -1 -3 1 -6 17 2 4 1 -6 8 9 1 -1 1 4 7 0 1 -3 -3 3 7 3 2 -6 0 8 -3 5 5 2 3 1 1 -2 -10 -16 -9 -13 -3 -11 3 -3 -6 6 -2 -14
5494a4RKJ3j1kJPjPj2MM%oOoOKrnOLNrnKkNMkOmo%QQk1J3%%Jj2nLNjNNKj1Kjk
$$ -14 -5 -3 10 -1 -3 -2 5 4 11 -1 3 7 7 1 7 1 7 9 0 -5 1 4 9 0 -5 -3 -5 0 4 2 8 4 -2 -2 6 14 -7 6 6 6 7 -5 -10 -7 -2 -3 2 7 9 -2 0 -1 -3
5547cJRj3jJ7pRj5mLLkJ6j5J0j0qKJ5oMKnNrKMQj6PJJjjjklMr%QK0k3RmnLpJ2
$$ -3 -2 7 -6 -7 10 3 12 -3 -7 -4 -1 -3 13 -2 8 -2 -10 -8 7 1 5 7 2 7 -2 0 4 12 -4 3 4 5 4 3 2 0 -3 1 -8 -8 0 20 -3 6 2 -3 0 -7 5
5596Ejj4J7j7LJ6j8lJ2Nj0QLkj3J9k3J7J3pqNNj7J6lpJ%JnKJ1KrRj6kN%%nn%J2
$$ 5 4 -10 7 -10 -7 9 -9 -12 0 5 -5 3 6 4 -9 10 -13 4 17 10 2 7 12 -5 11 8 1 2 2 3 -2 0 11 13 4 13 -3 -5 0 0 0 -5 -10 -10 2
5641Bojj0QMLkNj7RkmJ9lj9J9j9J3Jk0K0mJPpRj4%ML%JpJ7j9%J6j4MJLPj0jLn
$$ 2 -4 -5 -15 -7 -3 0 -2 3 -14 -5 -7 -11 8 5 -14 5 -14 -1 0 -20 0 -4 -3 4 -3 6 -8 -8 -4 -1 -1 0 -7 10 -9 -9 7 -7 -3 -2 1 8 -2 -3 0 -5
5687eLPoLnoJ9k0J3mnJ1jJp%rQj1J1okMjJJrJ2pKOj2J1J8k2LMNmoNRnlMlkOj8
$$ -5 -2 5 -1 2 -3 -9 10 -10 3 -1 -6 5 4 5 -2 -2 -11 -3 -14 -3 -9 -11 -7 -8 -7 -6 -15 -3 -10 -8 -2 -14 -3 15 -7 -4 0 5 1 -5 0 9 4 1 5 2 0 6 -12
5736a2K5j4%J6j6J0qj2J9oj2J3j2J3Jj0LnLJlJ2pnmkJJLJQj1Mj3J2J0j1l%jOJ0
$$ -12 13 -1 -1 15 -1 9 1 -11 8 2 -10 3 -9 4 5 -5 -2 -7 -4 -3 -6 6 -1 -6 -10 -12 -11 -10 -7 -6 2 -9 -5 -18 -6 4 -7 -10 -10 -11 -5 5
5778EpOj0RpmJ6JJlpjj2J1%jQMj5J7mpN%MJj2nK6k4JoK1j9nMJPnrJ1Mnj3J4rJ0
$$ 5 -2 4 -6 3 -4 -8 8 9 10 7 0 -1 -13 -2 -2 -3 5 9 -6 11 7 0 5 5 9 10 -2 -7 19 -5 -4 -10 11 -8 -13 -9 -8 -1 -6 -15 -4 0 -5 -18 -4 -13 -3
5825cmPplKnk%J4JokPj0Q%QpMJRj4kROqrNRlpjLJMJ%rPNojkLj6J2NmlNMmlMqM
$$ -3 -7 0 -7 -10 -8 -13 -15 -15 -1 0 -6 -8 -1 -11 -3 -3 5 -2 2 3 12 -2 -4 5 11 3 -6 -1 8 5 -2 -3 0 1 5 6 6 -3 4 9 3 2 0 3 -13 -1 4 0 -3 2 6 2 -1 3 -5 -1
5881aQj3J7oj4R%KqJ1oMKnMJQj1Lj2oJ8rRJJOnqNj0OJ3j7LLoJ4m%koOrnlQPj1
$$ -1 7 -6 11 5 -9 0 0 2 -6 5 -1 3 5 0 4 5 13 2 5 -7 -13 5 -4 5 6 7 13 8 0 5 -5 1 14 -3 0 3 -3 11 7 7 5 -1 5 -4 -9 -12 -4 3 -8
5930hJ3qj4QRpOj2J0MJn%LllQk9J7%%jO%lKK0j5nJ0oLjklJ3j0jmMj1PkjJK3j8
$$ -8 5 -3 -17 -9 0 -7 -1 -13 -3 1 2 -3 -3 0 -3 -6 2 -27 -10 -10 -10 -11 -5 -5 -8 -6 14 -1 -6 4 -2 1 0 -2 -5 8 -2 -3 -7 -3 -14 -7 -9 -10 -9 14 -4
5977dLLj3J3rjOj1MLj3OJ%KKMlKJ1j4jQmnJ4j4J7olKj2J0JklLKlOl%Qlj0Rj4J0
$$ -4 -1 2 -11 2 -7 -8 -2 -13 -9 -6 -19 -13 -12 -12 -10 -8 -4 -7 -5 6 -8 -9 -1 -5 -10 4 -10 7 1 -2 0 -12 -2 -1 -3 -6 -3 -1 -4 2 -1 -1 7 4 -6 3 -11 -1
6025ak%LNJqmRPk0ROJnkloMpQNj0J3J5k4Rlj3kR%nMPJOLk1PJ0nJjo%Oj3K2j0%
$$ -1 -3 -3 0 5 6 -2 -6 3 10 -10 -1 5 6 1 -1 -4 -10 -6 -13 -5 0 -10 3 18 -6 3 0 -13 -15 -6 -6 -11 -7 0 1 7 10 -11 -4 6 1 2 1 -5 -5 1 -12 10 0 0
6075@J2olNplJ0j3PJ2j0j5QRnj1J6jrklPllOrJ2j8PMKNj3jON%jNnmjJ0jqOqJN
$$ 0 12 6 3 8 1 -2 8 -5 2 14 4 -11 -3 6 1 -10 6 5 -4 -6 -9 -2 -5 -8 -2 -11 1 -17 -10 -6 -4 1 -12 -13 -7 -2 -2 -3 2 -3 -7 -8 2 1 -7 -1 -9 -8 -3
6124cjMMlQj1MPkJj4J5pJ3j3PpJmmJPpJ4j3J4jj8J1pRj0LqPrNNRoj2OoJ0JrOP
$$ -3 -4 0 4 1 9 -2 2 9 7 8 -6 9 2 15 2 9 2 3 -1 -5 -4 3 -4 10 -3 11 10 -8 3 -4 5 -5 -2 -10 -3 -12 -7 -2 7 1 -11 -5 -11 -1 0 -9 -3 4
6172DjKMj3QLJkk1OkRlkRNj6J1LNj4J3pJ2Lk5J5qRpJ2j9LkK%oPmOKj1JlO%LKk
$$ 4 3 5 9 -4 4 7 8 6 -15 -9 -11 -2 -5 -7 2 7 -9 2 5 10 -4 9 2 14 17 -8 7 -1 8 1 13 -6 -3 -5 -3 -3 -9 -2 -6 0 2 -9 -8 -11 -5 -5 -2 0 -2
6221bqkkJ7j5J1MllJ0j1Mjj5J8J2j2mnJ2ljmJ0NJqr%LQonjlQJPj6MNj0J5j0Lj0
$$ -2 -10 -12 -14 3 -12 -1 3 0 -3 7 -4 0 -1 -16 2 14 2 -2 -7 5 2 1 -3 7 12 13 5 -4 -4 -1 7 1 -4 -5 -8 0 1 8 -8 -4 1 -9 6 -4 -1 -11
6267a1J5LJj2J6k0MnMr%PKmJjJ5qrJ5qMNlj0l%J3%%lkJ0%%l%%lQj0J0omrNJ4j
$$ -11 4 7 8 -4 12 -8 -4 -9 -5 -14 -14 -7 -5 -9 -8 -9 6 -2 -11 4 -4 0 5 2 -8 -11 -11 2 2 2 -1 -3 7 7 7 4 4 4 1 9 -1 9 3 -1 -10 -5 9 8
6315Hj1MkJ3k4PPlMpPOljj2JJJ2j6NOj0ONLkoOjj0MLjJjkMpKOrQoRKjjmkQ%Oo
$$ 8 -3 1 -1 12 -12 -5 2 -1 3 -4 3 9 6 5 -7 -6 -5 7 -9 -4 2 -8 -2 3 6 4 -2 4 3 -7 -3 0 -1 0 -1 -3 1 -6 -4 2 -7 1 -5 4 6 5 4 0 -2 6 6 12 6
6368FklQkj1J3j7Ql%kLMKJlKKj5RnMrQmkJ0j3QrMRJJj0J1Lon%JJJ0jrJ5j6PJk
$$ 6 4 1 9 7 -4 9 -8 0 -3 -3 -5 -2 2 4 5 2 4 6 -9 0 -5 -1 -10 -2 -6 -8 2 -11 -3 -12 -8 1 2 3 -7 4 7 1 -4 -4 -3 -2 8 7 -2 13 -3 4 5 3
6418C%mRKj1PKj7J9mj6J6oqJ4LnOj8J1j7J5jmjjJrJ3j3J4j2J9j6MkLj0J9ppJm
$$ 3 3 -1 8 10 -1 6 8 -9 10 6 -10 6 0 -8 6 9 4 10 -8 3 -14 1 0 -4 -5 -6 -5 -14 -1 -14 0 -12 7 -9 -5 -7 -4 -14 5 -2 -9 -8 -12
6461a2K3qoJ2j0J0olRNj3Nj6K3kqkNkMp%k%%mLJ0j4lKNljKpM%RnoJj0J5Mj6J0
$$ -12 11 3 -3 9 -1 9 3 0 9 14 1 6 -10 13 11 3 1 6 4 8 1 1 -1 -1 -1 -5 -2 8 -6 -9 -7 -2 -5 -6 -4 -11 -7 -7 2 -3 -9 -8 -18 -3 1 -15 -5
6508eMKPj5J8j2Nlj1K4mj5J2j3Ojmj0J8Qj2%J2moqJ2KOj3NJ4j0j3OJ2j3j%Oj4
$$ -5 -1 1 8 -7 11 -1 4 1 -10 14 10 -5 7 -6 0 -1 -5 -15 3 11 -1 -1 11 7 1 -7 5 7 13 0 5 19 9 -4 2 14 1 0 0 6 -8
6549hkNJ4j5%J4j1NpnJ4kJrNLLjJnJNj7J2JmJ5nrjNL%Mj4J4nlO%nJ4j1J0j1jJ0
$$ -8 -10 -5 9 -6 -6 8 -3 2 -5 -10 4 2 3 -6 -1 2 5 4 5 0 1 6 -11 1 2 -2 13 8 -1 -2 3 6 6 10 -4 10 5 2 8 8 3 17 6 16 5 4 14
6596A4j4kNkJ0pj4QkmRLj0jj3J2L%Nj4JJ0qOjPnjQj9JJ6oNJ5k0PLLOqOmKj0Nl
$$ 14 0 -2 3 1 11 4 -10 -2 -4 -8 1 4 -6 -7 -20 -8 -5 -5 0 -14 -13 -3 -11 -5 -6 1 -4 -5 3 -16 -15 1 -5 0 15 -5 2 5 8 14 6 12 8 10 0 5 2
6643BpOPMrj0jJ8j4Lj1J6jlojRj1KPJnjLlLoKLqJ%RKj3J7pJLpJ4qj7K1j2PMln
$$ 2 -5 1 8 12 3 -7 -8 10 -4 -1 -12 4 3 0 -6 -7 2 -9 -7 0 1 -4 -5 -2 -5 -2 -8 -6 -3 -11 -10 -10 -1 1 -12 5 -2 -1 2 -5 9 1 -16 5 -7 0 4 1 -4
6692dJ4pJ3j6J0pjpJ2MoNj8J7KoJ2j5Rk1%J0oOojkK0oqMM%Jj2kPRj3jMpRmOmP
$$ -4 10 3 16 0 10 3 2 -5 7 11 5 10 -8 9 11 5 17 2 11 -10 -10 0 -6 0 -6 -7 -9 11 5 -3 1 5 5 6 -6 -8 -1 8 -5 -6 -2 -9 0 -4 2 -2 5
6739EjOj1jknK8j6mJ2oqOM%Mj3LjJKoNlLKJRrQk0J9j3MkkkojJ3nJ3j7J5j7KPm
$$ 5 4 10 -1 -2 -4 -9 19 3 -1 11 5 -3 3 7 7 11 -2 1 0 1 3 -3 2 -1 2 4 5 14 5 13 -7 12 -1 3 1 -1 -3 -9 -10 3 -2 11 -6 9 -8 -6 1 -3
6787c%JlNj1JLRnJkNJ1j8PKk%MpPOoPj0QloJ5mj2J0olLMOj6J2j0mPoQlKj0Qj2
$$ -3 -3 -2 -5 0 -11 -10 -7 2 -3 -2 -4 1 12 -6 1 3 1 1 5 -2 5 11 5 12 2 10 7 1 16 12 0 10 4 1 4 8 14 -2 10 0 -4 3 -3 5 2 4 -6 2 -10
6836a0J0jLJ1j3m%O%kmJ2j4MOqkqJ0%MKlmJ1kjqNJ1nj2jK1j9Qj%lpJ0JLoKqP%
$$ -10 0 -1 2 13 0 -4 -4 2 2 0 -4 8 -6 -2 4 -4 -6 -14 -4 -4 0 2 -1 -5 6 4 3 -5 0 11 6 -6 -7 14 -5 3 2 2 -1 -8 2 3 6 0 2 -6 1 1
6884Aj6K3Kj2Nj0NkMLJj6%PJ1oKlKj2P%pKRJ0j5NlPnnOKK1k9J0j8J2J1k1J8mM
$$ 1 -15 8 10 -2 3 -7 -2 -4 0 3 4 -12 -12 -5 6 0 2 -1 1 -11 -4 -4 -11 -9 0 10 -5 0 -3 4 -1 -6 0 2 23 -6 4 -14 -2 9 -12 6 2 6
6928Fr%jOj2K3rrRKnMLj0Jj7J3%jmPk%j1RJ1mjj4J0pMQlOlKMj1JOjj9RMRkllJ1
$$ 6 -3 -3 -4 2 -10 13 4 -5 4 6 1 5 8 -2 -1 -18 -5 -5 -6 -10 -3 -5 -5 -16 -7 4 0 -1 -15 -5 -12 -8 0 -3 3 0 2 6 -5 -4 2 1 -18 -9 -5 4 2 -1 -4 7
6978GJnJ6j5oljOmJ5pj1J1j1PJ4j1Oj1PrMRj4J1qPj6PNj6R%Mo%J2rjMPoJnkNL
$$ 7 8 3 19 4 -2 -5 -6 0 -4 11 4 -7 4 -7 0 14 3 9 -2 5 -4 0 9 -5 6 -2 5 -11 -4 1 -15 -6 -6 -2 -8 -8 4 -5 -6 -2 5 -1 0 -5 -7 -2 1
7025AKLmnNpJ7lokrJ4mpNJ1jqJ2qkj0J6rkLLNlQl%jj5J6Jk0OLjpLPolmJ3rRjJ1
$$ 1 3 6 2 -3 2 -5 12 9 3 1 -8 6 2 -5 0 11 10 2 14 6 4 -6 10 1 -1 2 5 10 7 15 12 12 11 -4 12 13 -7 -1 2 1 -6 -3 4 -2 -5 -9 4 -5 4 3 14
7076A4j4pMJ1j2JpJ0J0j4QQp%J3j8lJ5lrPoO%qNKqOJjJoNmJ0j6RqKjpqJ5lQj6
$$ 14 0 -7 -3 8 -4 -3 -10 0 10 -4 4 12 5 5 18 0 -3 12 9 0 7 1 7 7 -1 4 6 -2 4 5 4 5 -1 4 0 10 -6 3 -5 -3 -4 -11 -19 -4 -7 1 -15
7123a5J7qo%OKLjJ4j0j7J0OnMMKj0%lkJ3klNmMMjJ0j9%kJ0krKJ3j2mR%olPj2m
$$ -15 2 -6 -12 -12 -6 -4 -1 -2 12 2 -15 -5 1 -4 0 4 6 -4 -4 -7 -9 4 2 -1 4 0 4 8 7 17 -2 -2 -4 6 4 -5 -3 10 -2 -6 3 3 -3 -6 1 -11 -15
7170a5J1lj3J1Mj4J9prJ0mJ0KlpPRq%j%J1j4Rjj3J9j4RmJ2j0Mlj0J6j3J3l%JL
$$ -15 -4 -7 -20 -9 -5 -19 0 -7 -16 -6 -10 0 2 -1 -8 -1 8 0 0 -1 -1 10 -4 5 4 -9 10 -4 5 1 13 3 7 4 -6 10 -3 10 7 7 8 11
7212A1j6LP%k%jmLpJ0rJ0j4%J1Qj0qMOlRj0Oln%MmMj9J6kmLJ6k0J4j3J9oljkJ
$$ 11 -5 -2 5 5 3 3 2 -2 1 -6 4 -5 5 -9 -9 2 10 0 -8 -4 2 -1 8 -2 4 1 -4 -4 0 -4 0 -19 -3 -5 -9 -6 10 -10 4 -9 10 4 1 0 -2 -1
7258apJ3JmoJ3j0jJ4j0JLoJ5qlLQj0Nj0%kJqOnJ3MqLnnQj3LNKlJjJ0pRj2JJ1k8
$$ -1 -8 5 6 2 -4 9 -1 -2 12 2 3 6 0 15 7 4 7 15 5 10 0 0 -2 -1 -9 -3 -8 5 9 1 4 -1 -6 2 -11 -8 -3 -1 -4 -3 -4 6 -1 8 -4 -3 8 -20
7306b0K2oOkjkMPmoJjJ3j2J2rlLrJ3nOjrNkKMmPRj3pkMj%jPljmlPPj5PJj3J1L
$$ -20 2 -4 2 0 -1 -3 1 8 4 -2 -1 -2 11 -1 11 2 -1 2 -7 6 1 7 6 -3 2 0 2 6 2 9 18 5 -2 -4 0 -1 -1 -2 5 2 1 -3 -6 1 8 -7 0 1 -12 -1 2
7357BmLJj2J6j%j1Op%R%oJ1lmJ1llKqMNMqmJ0Rj4kMj0J1Qj6LkpNj4J8j1MMlOl
$$ 2 -2 1 2 -10 6 5 5 -6 0 -7 -7 2 2 -4 7 4 0 11 8 5 7 -1 3 8 12 4 0 10 19 5 3 7 -3 8 16 0 3 1 -6 -1 -15 3 -8 -4 0 -3 3 0
7405@lJkJ1rlJ0nj%nOmlpJ0PRoj1J0k%Nj4K1qjlQj0kj0J6jj0J2nOlrPMnLk0J5
$$ 0 -3 -2 -4 7 -2 -5 5 0 -1 -1 -6 0 -4 -7 -14 -4 3 12 6 -5 5 3 3 8 -6 15 7 6 3 11 1 -1 -11 5 4 -6 6 1 7 4 -5 2 6 1 4 -16 -1
7452aKJ%%qJ2j6J1pj0J5Jj3J0Rj5J4mnjJmKjJ5j1rNJ3lnK%rMQlLk%J0k1K1Ok4
$$ -1 1 2 2 2 -6 6 -10 1 -6 -16 -1 0 -13 -3 6 -9 5 1 -4 -5 -4 -8 -6 -7 8 -3 -12 -7 6 3 -2 0 0 -9 -5 3 0 3 1 1 11 -10 11 17 -7
7497gJ5%j1JKrNPlLRj3j4jJ2%lnJNLlMo%JoPjJoOJ0pqPPp%KOLNLj9J4Ko%mjpP
$$ -7 8 8 -3 -2 0 -9 -4 3 0 3 12 -1 -15 -16 -4 -4 -7 -12 -11 -6 -3 -6 -2 -8 -8 -7 -13 -6 -7 -6 -12 -6 4 -3 -11 -4 3 -4 -4 -2 4 7 12 15 -4 10 12 6 6 2 1 -6 1
7550AnJ3llMMj1%Oj4L%KQNj9RqJ1qMJ1j4LmlQoNMj2jNPrNM%jj1LJ5lkNj4J4nj
$$ 1 -4 9 6 3 7 11 0 0 6 -8 -5 -5 -3 5 10 -9 0 -8 3 -5 -1 10 -4 -1 -5 -8 0 -6 -1 3 -9 -10 -5 2 -7 -2 2 2 1 -10 -7 8 5 3 8 -6 8 3 2
7599BMQj0j0%lQpNNj1J0kRpKMrJ%J4j5kJ0nQqj0RqNoJ7Lk1J2j1J3rNL%j0Nj0K
$$ 2 6 14 4 -6 -6 -9 -1 -8 -3 2 -9 1 -1 8 1 3 7 -2 -1 -1 13 -2 -4 6 1 9 1 -9 0 -8 -3 -9 8 11 -10 2 -9 4 -5 0 3 3 -7 -2 -12 -10
7645a0J3mNk%qPJKJ4j0j3mJ5jjkJJ0rJoMNnlLpmkLPj4jK2Kk5K0jknj%pJ%J2Ml
$$ -10 3 -1 4 2 2 -6 1 2 4 18 8 -5 -9 6 5 4 2 3 13 4 5 -1 3 8 3 0 3 -4 -8 -10 -7 0 -14 -15 7 9 -16 4 3 1 -4 -5 -5 -12 -11 -11 1 5 2
7694BnJ3j7qR%JPj9J0J4jj0kROqjNjJkoRNlrMJJ%nMqJ2Jrkr%NKP%lpjJqJ1j0%
$$ 2 -3 10 -7 -15 -6 -6 -5 2 -17 -7 7 6 -4 -6 3 9 1 0 5 4 5 3 -3 6 11 8 -1 3 4 5 5 0 4 -4 8 9 0 -2 -11 -11 -6 -4 3 3 0 -7 -8 -7 -15 -4 -14 -14
7746a4J3rnJ2kj0OmjOMpJ2j8K0j3mQllJ6p%J0mnkQKLPj3Kj0JolPKJ0qo%KklJl
$$ -14 -1 -10 -15 -3 -5 -15 -9 -13 -14 -8 -4 -11 1 -17 3 -10 -14 -6 -9 -12 4 -3 -3 7 3 -2 -4 4 6 9 16 3 5 -5 -4 -10 -13 -6 -4 6 -2 -8 -8 -6 -8 -11 -10 -13
7794a3JKmJJ0jlKJrJ3okMj%pPJKkj2J7j2J0oJ2j0N%MOqj0QKNlLKokoJ%MmOJj3
$$ -13 -12 -10 -14 -13 -3 -4 -7 -5 -4 -13 0 -6 -8 -4 -5 -5 -12 -5 -4 -2 -4 -16 1 -11 -1 -7 5 -5 0 0 4 10 2 -8 0 2 7 4 7 9 3 1 -5 -4 -4 0 -4 2 3 -10
7844a0RJjkjLqQNojjoMOPpqloNLlJ5jj6oQJ0MqNqNOJKjkOjj2J1lmNmQJ0j1pNj
$$ -10 -1 0 -1 -3 -4 -1 -9 -1 4 -2 -3 -4 -10 -6 0 7 0 -8 -11 -17 -12 -9 -12 3 2 -14 -20 -12 -2 2 -6 -1 -9 -4 2 3 5 4 2 8 7 -5 6 3 -1 4 0 8 18 7 0 5 4
7897DoknJ9j2PkmOj4KK6j7j0JlMOmQj1kJjLLj0J0NmJLj5J8j8MJ4j4KlJ6%jLqK
$$ 4 -2 -4 -9 10 -2 5 3 -1 5 -9 -7 19 2 -8 -7 -10 -6 0 -4 4 -7 -9 -8 -9 -6 -3 -13 -3 2 -2 -1 2 -13 5 -13 -9 5 -9 -7 -10 6 6 5 8 0 2
7943BJ0j2nLkRkj9K1qJ5j6j5J8kJJPj3OkLpKJjj0NJQrPMjoJ1mkOkokPoKQjj1R
$$ 2 12 0 -5 -2 -4 5 3 -16 5 -3 12 -4 -19 -1 -3 -2 -1 6 -7 -1 -3 0 -7 -5 -4 -5 -15 -10 -9 -1 -10 -3 1 0 -6 5 1 -1 5 3 -3 -5 2 -4 -2 6 5 -6 3
7992CjJKlLr%M%J5j5NKLmjOokjj0NlJLj0J6%j5J5qkmRlqRqJ1MqLoJ4nnjLn%NL
$$ 3 2 3 5 2 5 -4 -4 0 0 15 0 5 7 10 6 5 11 5 3 2 -8 -3 -6 -5 -2 -12 4 4 -11 4 -4 -6 -10 -1 -4 -12 -3 -11 0 4 -4 -1 -7 7 2 -3 -4 -1 -6 -6 -1 2
8044BPmqlJ5%j4J5on%JMMjj5J4KokRj3LQj2MmOj4OJ0Jj0kOj2J4j2rJ8JqjMJm%
$$ 2 9 5 -3 -6 9 9 -5 10 4 -1 -1 0 4 8 7 -8 6 8 2 0 9 -4 -1 7 -5 -1 -5 1 -13 -7 3 4 -6 -8 -2 -14 0 -12 -21 -3 -2 -10 -11 -7 -6 -10 -10
8091a0%j0J1KOqlOLj2J0nKRrQL%j2NROloOkpjj0RM%Mk3J5LjJ2rnLlLOj4KJ4j4
$$ -10 -10 -20 -9 -7 -1 -9 -12 -6 -3 -15 -5 -10 -8 1 -8 0 3 3 -9 -4 5 11 8 2 8 6 -1 -2 -12 -3 1 1 5 -18 -3 0 -1 11 2 -3 0 -3 0 6 -8 -6 8 -6
8139fLLj2MNlnLMnOkJJ4j0oJ0Mj4kNmK0j6J0qkJ4j3NMpKlK4j4njLllJ0lkJ0j5
$$ -6 -3 0 -12 -8 -3 -6 -11 -8 -4 -9 -3 -5 -4 10 0 -6 4 8 -6 -8 -3 -7 13 -3 7 -1 -3 11 -2 3 7 0 2 -1 23 9 4 3 6 3 0 10 7 5 15 0
8185@MJj1J7j0J
$$ 0 4 5 -6 11 1 2
8191B
$$ Imaginary data points
##PAGE= N=2
##DATA TABLE= (X++(I..I)), XYDATA
0@%%%%%%%qJ6j6J6j6K4l2M0m8N6p2Q6j02J20j37J61j90K18k50K86l26L72m25M82
$$ 0 0 0 0 0 0 0 0 -8 8 -8 8 -8 16 -16 24 -24 32 -40 46 -56 64 -73 88 -102 116 -134 152 -174 198 -227 255
31B55n43O12o87P68q58R59j069J189j318J459j615J788j981K193k428K688k980
$$ 255 -288 324 -363 405 -453 506 -563 626 -692 767 -848 940 -1041 1152 -1276 1412 -1568
48a568L311l687M119m623N216n926O793p880R288j1184J3872j7942L0939j83889
$$ -1568 1743 -1944 2175 -2448 2768 -3158 3635 -4245 5043 -6141 7731 -10211 20728 -163161
62a63161K26788j4102j83326K86763k25286J7071J89091k46346J43238L0657j87496
$$ -163161 63627 49525 -133801 152962 -72324 -55253 133838 -112508 30730 61387 -126109
73a26109K37719j29049n7831J82315j92005R9447O1785j96271J97359o9098r0174
$$ -126109 111610 -17439 -75270 107045 -84960 14487 76272 -119999 77360 8262 -81912
84h1912J88195j74118M5202J22578k04862J40201J1811j38232J65874r3519k9963
$$ -81912 106283 -67835 -22633 99945 -104917 35284 47095 -91137 74737 -18782 -48745
95d8745J30908j43784O3216M6477j12404J08834m8947l5121R7269j02435N1228
$$ -48745 82163 -61621 1595 48072 -64332 44502 -4445 -39566 57703 -44732 6496
106F496L0675j02094J10953m0296n4759J04886q9568K5755N5362j04193Q2033
$$ 6496 37171 -64923 46030 5734 -49025 55861 -33707 -7952 47410 -56783 25250
117B5250p515o3979R3524o6982j013O7026q6510N0325J2478o0781O8680m0469
$$ 25250 17735 -46244 47280 -19702 -20715 46311 -40199 10126 22604 -38177 30503 -9966
129i966k881M7763p4025N4097Q547o6918P7717l8015k3602O8064o7546K6958K6680
$$ -9966 -12847 34916 -39109 14988 23535 -43383 34334 -3681 -27283 40781 -26765 193 26873
142B6873o6558O7533j9995m2906P0022m8587M357L8820o1594M5123J679m3822
$$ 26873 -39685 27848 7853 -35053 34969 -13618 -9261 29559 -32035 13088 14767 -29055
154b9055N6110l6178n535M4579n4007K9959J0841m7247N4106k1403k3819M6674
$$ -29055 27055 -9123 -14658 29921 -24086 5873 16714 -30533 23573 2170 -21649 25025
166B5025m2042J6609K3807n3331M0874J610l4843M1938k6429n036L2826l6375
$$ 25025 -17017 -408 23399 -29932 10942 12552 -22291 19647 -6782 -11818 21008 -15367
178a5367J8950N382l0243L9620j6734j9708L4318k4266O619J3891l0810K5992
$$ -15367 3583 8965 -21278 18342 1608 -18100 16218 -8048 -1429 12462 -18348 7644
190G644m47k1017K5301j7638P04K0725k8748J2990J0662k1560J7789o566q030
$$ 7644 7197 -13820 11481 -6157 -5453 15272 -13476 -486 10176 -11384 6405 -161 -8191
203h191J8806j6144L059Q986j5626J5409k929j4633J7394m779l547M931j0676
$$ -8191 10615 -5529 -2470 6516 -9110 6299 3370 -11263 6131 1352 -2195 2736 -7940
216g940J2956R05j4860J1312j820j901P206j1972M693O593p603N254n589q45J1049
$$ -7940 5016 5921 -8939 2373 553 -1348 5858 -6114 -1421 5172 -2431 2823 -2766 -3611 7438
231G438r496J55L852n847R250m152o915R170m343K464J142r987J1808j196r406
$$ 7438 -2058 -1903 1949 -3898 5352 1200 -5715 3455 -888 1576 2718 -7269 4539 3343 -6063
246f063J0974o138j032P550j0030P251K13r725J3737o868n332J2864j1983L769
$$ -6063 4911 -1227 -2259 5291 -4739 2512 2725 -7000 6737 -131 -5463 7401 -4582 -813
260h13P277j3496J0770k193q134J5341j2054j392J2916j4717Q889K357j5229J7579
$$ -813 6464 -7032 3738 1545 -6589 8752 -3302 -4694 8222 -6495 2394 4751 -10478 7101
274G101n135r138J4461j2955N500Q626j9237J4531Q62j4015J7634j0338l985J5165
$$ 7101 1966 -7172 7289 -5666 -166 8460 -10777 3754 4616 -9399 8235 -2103 -6088 9077
288I077j5862P582M851j6054J7516n475j0858J8168j2608M05J0869j6125J1710
$$ 9077 -6785 797 5648 -10406 7110 1635 -9223 8945 -3663 -3258 7611 -8514 3196
301C196J138j3531J5974q000l754J3360j5260O389P308j4676J1791k649p527J3240
$$ 3196 4334 -9197 6777 -1223 -4977 8383 -6877 -488 6820 -7856 3935 1286 -6241 6999
315F999j0215J047P899j2560R890P65j0994J1469m610j996P411j0470O191L373
$$ 6999 -3216 -2169 5730 -6830 3060 3825 -7169 4300 -310 -2306 5105 -5365 826 4199
329D199r197Q631m209l292R644q035J164L670o460P780k955n320P810m770J792
$$ 4199 -4998 3633 -576 -3868 5776 -2259 -1095 2575 -3885 3895 940 -4380 3430 -1340 452
344D52K682q272O991R19n445M843m234J908M076p351M309L78l873O255m656j225
$$ 452 3134 -5138 1853 2772 -2673 2170 -2064 -156 3920 -3431 878 1256 -2617 3638 -1018 -2243
360b243N115m374K640p50l387O547l875j966M842m053K160M03l699M920k448j351
$$ -2243 2872 -1502 1138 388 -2999 3548 -327 -2293 2549 -1504 656 1059 -2640 2280 -168 -1519
376a519L582m059K660R00m346M313j406j405L186l866K030J533l597L252j866
$$ -1519 2063 -1996 664 1564 -2782 1531 125 -1280 1906 -1960 70 1603 -1994 1258 -608
391f08q37M091m226O21K316k703K643j866j150L986l467O09J961l273K828o36
$$ -608 -1445 2646 -1580 -959 1357 -1346 1297 -569 -1719 2267 -1200 -591 1370 -1903 925 289
407B89j848L165k616N19J766k878K639q70k022L571k147j67J597k633K611k40
$$ 289 -1559 1606 -1010 -491 1275 -1603 1036 166 -1856 1715 -432 -599 998 -1635 976 736
423G36k189K512k011J028J916m049K003J188j708J792k563P78K808l409J306K46
$$ 736 -1453 1059 -952 76 1992 -2057 -54 1134 -574 1218 -1345 -567 2241 -1168 138 384
439C84j734L385k194j215K650k062J662q9k933L492p90j438K152k616J485J648
$$ 384 -1350 2035 -159 -1374 1276 -786 876 787 -2146 1346 556 -882 1270 -1346 139 1787
455A787l264J870j11j022K336k532L47K078k541J483J29j894K438r79q82J489
$$ 1787 -1477 393 282 -740 1596 -936 -589 1489 -1052 431 560 -1334 1104 125 -757 732
471G32j400J063K53j950J801j4j089R83q07L51O80j083M29L5j66O07o74j42N06
$$ 732 -668 395 648 -1302 499 485 -604 379 -428 -77 603 -480 -51 -16 -182 425 -249 -391 115
490A15rj04k97K08NJ17K76r20L76P19p15K51m11R2J113j356J42Q49j110J126k96
$$ 115 106 2 -295 -87 -82 35 311 -609 -233 486 -229 22 -389 -297 816 -540 -398 451 -659 467 171
511A71j220J655o56k61R22j545J134N14j677J459n43o45J728j497P9J101j401
$$ 171 -1049 606 -50 -311 611 -934 200 714 -963 496 -47 -692 1036 -461 -382 719 -682
528f82J106j44j063J593j002k34J391j503L63P67r61P67m33l90J137q31n2N83
$$ -682 424 280 -783 810 -192 -426 965 -538 -175 592 -369 398 -35 -425 712 -119 -171 412
546D12p37N71J48p26L49J59J1r0l05K10K66n4l81P2L43k69K82l05m94J169n00
$$ 412 -325 246 394 -332 17 176 187 97 -208 2 268 214 -167 -95 248 -21 261 -44 -538 631 131
567A31o26Q72p47N77L32j529J340Jr76J360j390K40J723k304P91Q94j661J877
$$ 131 -495 377 -370 207 539 -990 350 351 -625 735 -655 -415 1308 -996 -205 689 -972 905
585I05j020j129K554j811R8J403k528K104M14k618K416q86p01K317k749P57J915
$$ 905 -115 -1244 1310 -501 -403 1000 -1528 576 990 -1628 788 -98 -799 1518 -1231 -474 1441
602A441k687J726j18j855K918j587r62K316k114J060R05k724K335Pj891K288j480
$$ 1441 -1246 480 362 -1493 1425 -162 -1124 1192 -922 138 1043 -1681 654 661 -1230 1058 -422
619d22l27K170k220N43J014j713J759n54j496K294j092n71J561j727P60J019j939
$$ -422 -749 1421 -799 -256 758 -955 804 250 -1246 1048 -44 -615 946 -781 -21 998 -941
636i41J172K15j145J468r33m47J620j464K35J068j652J077L97j596J477l07r41
$$ -941 231 446 -699 769 -164 -611 1009 -455 -220 848 -804 273 670 -926 551 244 -697
653f97J565j150j46J377j593O95O50j626J514k61j248J833j130m03J622j693O17
$$ -697 868 -282 -428 949 -644 51 701 -925 589 328 -920 913 -217 -620 1002 -691 -74
670g4Q69j853J527m7j361J663j012j18J391j961R51R09j932J483k19j167J866
$$ -74 795 -1058 469 422 -939 724 -288 -406 985 -976 -25 884 -1048 435 216 -951 915
687I15j178l98J460j411O71M29j437J420l04q44J362j151Q4J260j450L38O33p94
$$ 915 -263 -661 799 -612 59 488 -949 471 167 -677 685 -466 -382 878 -572 -234 399 -395
705c95P26l87m48R93n74j21M26n68N38P4o92N61N6l70L23j30j88L38j6l08J52
$$ -395 331 -56 -504 489 -85 -206 220 -348 190 264 -428 133 189 -181 142 12 -176 162 146 -162 -10
726a0Q9p8J60l08j1N30m57j5L10n44O57l7r46J034j83o10R65q29J1R52j108M76
$$ -10 79 1 161 -147 -158 372 -85 -100 210 -334 323 286 -660 374 191 -419 546 -283 -272 680 -428 48
748D8K51q57J193o26o29J345j071K13Q34j512J040L40j273J214o16l68J355j406
$$ 48 299 -558 635 9 -620 725 -346 -133 701 -811 229 569 -704 510 -106 -474 881 -525
766e25K99Q87j380J152j50j235J701p39o58J369j176L30P58j350R55N0r40J196
$$ -525 -226 661 -719 433 283 -952 749 10 -648 721 -455 -125 633 -717 238 288 -652 544
784E44p32k43J094j184M36N87j210J000k5r80J174m95l39Q25r18M58M98j162Q21
$$ 544 -188 -431 663 -521 -85 502 -708 292 267 -713 461 -34 -373 452 -466 -8 490 -672 149
803A49J33q16R42n08l03R78q86O3P52q83M06K28o30O81l41k78P86p17R4O07q32
$$ 149 282 -534 408 -100 -403 575 -311 -248 504 -379 27 255 -375 306 -35 -313 473 -244 -150 457 -375
824c75M67K18p42P38k28m35Q32o21j13O88o28K65J28o10Q05k04o52P58k90j13
$$ -375 92 310 -432 306 78 -357 475 -146 -259 429 -199 66 194 -416 389 185 -467 291 1 -112
844a12M52o59K67L97n33K61n4k12M66l17j10L02l05K59O8m77L40J48l09J63j05
$$ -112 340 -319 -52 345 -188 73 19 -193 273 -44 -154 148 -157 102 170 -307 33 181 -128 35 -70
865g0j3K83k71p8K54j53J7J44k86J42K16l29J36Q8k68L38j22k75M75k74j28M06
$$ -70 -83 200 -71 -149 105 -48 -31 113 -173 -31 185 -144 -8 80 -188 150 28 -247 228 -46 -174 232
887B32l94J44J97m53M61j29l63O10m16o4N05o48L81J48o57P39k28m31P02n39J24
$$ 232 -162 -18 179 -274 187 58 -305 305 -111 -175 330 -318 63 211 -446 293 65 -366 336 -203 -79
908g9M62q68O38J05p54Q77m02l58Q48o96J71L55p74P52r3o36P97m35j6N00q30
$$ -79 383 -485 153 258 -496 381 -21 -379 469 -227 -56 299 -475 277 184 -452 345 -90 -106 394 -436
929d36N18K72p30O15k50k07O55o82J91L89o70N16%m87N56l02PL28n76L64J66m63
$$ -436 82 354 -376 239 -11 -218 437 -245 -54 335 -335 181 181 -306 250 -52 -45 283 -293 71 237 -226
951b26L66j33j08L01l41J84M3k75L23j32q9J80k33K05K2k59K43j05J9J14k88K58
$$ -226 140 7 -101 200 -141 43 86 -189 134 2 -87 93 -140 65 87 -172 71 -34 -15 99 -189 69
973F9k0j77K46k22O7J78l16K41o7j52L64l66N1L23l94K32j6k20M25l56m9M24m59
$$ 69 49 -128 118 -104 -37 141 -175 66 -1 -153 211 -155 -104 219 -175 57 41 -179 246 -110 -159 265 -194
996a94K21J20m19M78j98k17M44m26K02K32n38L89nk57M24m32M6M45m89J89M8k71
$$ -194 27 147 -272 206 8 -209 235 -191 11 243 -295 94 89 -168 256 -176 -130 315 -174 15 63 -208
1018b08M71l58j16M69m33J61J76l75L27j09j38L65l91R7K83l88K24j0j80L32k70
$$ -208 263 -95 -211 258 -175 -14 162 -213 114 5 -133 232 -159 -62 221 -167 57 47 -133 199 -71
1039g1NK47l05J81J9k00K64j88oK51l05P8J18j30J33j69JK58k33J7Q2j27J60q3
$$ -71 -66 181 -124 57 76 -124 140 -48 -54 197 -108 -30 88 -42 91 -78 -77 181 -52 -35 47 -80 80 -3
1063cn2J13j21R2K7j68J40j7m7O4j16J12J7j25R3m4KP6j44R3M5j17R6o5K6O2j39
$$ -3 -55 58 -63 29 56 -112 28 11 -36 28 -88 24 41 -84 9 -35 -33 43 -101 -8 37 -80 16 -49 -23 39 -100
1090a00Q7K9r2J28r0l2J32q0K8l2m2J78j39n0J51j04N8qq9J45r4J2R5j73J00K6
$$ -100 -13 16 -76 52 -38 -70 62 -18 10 -22 -64 114 -25 -75 76 -28 30 22 -67 78 -16 -4 91 -82 18 44
1116D4o5R3j50M4J57j65M4on4J90j57l4J50j75J24L2j89J80q4PJ39k74J40J53
$$ 44 -21 72 -78 -34 123 -42 2 -4 -58 132 -25 -59 91 -84 40 72 -117 63 -21 -14 125 -149 -9 144
1140A44k39J32o2l9K13k63O3J72k42J80l1j73K84j92k9K28k69J25Q7k27K55j20
$$ 144 -95 37 -25 -64 149 -114 -51 121 -121 59 28 -145 139 -53 -82 146 -123 2 89 -138 117 -3
1162cr7K52k45Q7J47k79J75K1j39J86j85J9K05k42O7R1j56J68q7r5J98j20nR2
$$ -3 -100 152 -93 -6 141 -138 37 58 -81 105 -80 -61 144 -98 -31 60 -96 72 -15 -110 88 -32 -37 55
1186E5j63J17L1j29J10n0k9J01r3K3O9q6L9L0l0J0k7MN3j6o8L2N5m2oQj6O6m7
$$ 55 -108 9 40 -89 21 -29 -58 43 -50 -27 42 -44 -5 25 -5 5 -22 -18 35 19 -49 -17 38 -4 -10 -2 -18 48 1
1215Ak5O7p9P1M0j71J14L6o8P6j18L9J48j77L7N5q5J37r4r5K09j28j3J16j72J09
$$ 1 -24 43 -36 35 75 -96 18 54 -14 62 -56 -17 131 -46 -9 46 -39 98 4 -91 118 -10 -23 93 -79 30
1241C0K6j38J69j12o1K11k05L0J16j48J21k6j04J75j19m8J55j27N6M0j23J24l3
$$ 30 56 -82 87 -25 -86 125 -80 -50 66 -82 39 13 -91 84 -35 -83 72 -55 1 41 -82 42 9
1264Iq2J13o4pO9q1N1J9o6O8jo0L0K2j6kqJ6J1nn2M6J3l8L6n0J7Q7j05J5N6r0
$$ 9 -73 40 -24 -31 38 -43 8 27 -39 29 28 -32 -2 20 4 2 -6 10 21 16 -36 10 23 -15 21 -29 -12 75 -30 -15 41 -49
1296d9R6m0r8J55r2JJ02j68J02O1j78J65o6q2K10j88qJ68j76J31Jj82K48j31r1
$$ -49 47 7 -91 64 -28 -27 75 -93 9 70 -108 57 -9 -91 119 -69 -77 91 -85 46 47 -135 113 -18 -109
1321a09K47k18P1J21k45K36m3j98K92j59n9J92k17J25Q5k59K29m8j37K23j82q
$$ -109 138 -80 -9 112 -133 103 60 -138 154 -5 -64 128 -89 36 121 -138 91 43 -94 129 -53 -61
1343f1J92k27J24N0k19K25n8j08J62j33L2J17k15J19P6j73J29j6p8J26j03j7J07
$$ -61 131 -96 28 78 -141 84 26 -82 80 -53 -21 96 -119 0 76 -97 32 16 -62 64 -39 -56 51
1366E1q1pN6o3O5lq3Q3mp1Q2m1n9J41q7k7R9j11O2Q9k06J58K1j42J65j31k1K21
$$ 51 -30 -37 19 -44 21 18 -65 18 14 -57 25 -16 -75 66 -21 -48 51 -60 2 91 -115 43 64 -78 87 -44 -65 156
1394A56k43N9J41k31K09k9k27L17j48j02K60k83J18J41l03K66p0j93L60k67m4
$$ 156 -87 -28 113 -118 91 62 -165 152 4 -98 162 -121 -3 138 -165 101 31 -162 198 -69 -113
1415a13L03l51J90J03l45L42r8k07L73l12N7K49m09K69P0l31L75j80j16L12l28
$$ -113 190 -161 29 132 -213 129 31 -176 197 -115 -58 191 -218 51 121 -210 165 -15 -131 181 -147
1436a47J40J58l50K94l9k31L56k50j5K79l69K04R7l09L00j02j40K84k48M7J83
$$ -147 -7 151 -199 95 56 -175 181 -69 -84 195 -174 30 127 -182 118 16 -124 160 -88 -41 142
1457A42k63J71l1j26K26j78qJ83k07J02M1j38J41p7j1R9j64R2M5j27J34p7j5R9
$$ 142 -121 50 19 -107 119 -59 -67 116 -91 11 52 -86 55 -22 -33 66 -98 -6 39 -88 46 -31 -46 53
1481E3q5L3%m0R3j01N8N2j54J41m2n1J34j67Q8Q3k08J81l1j34K40k10K4J95k68
$$ 53 -32 1 1 -39 54 -47 11 63 -91 50 8 -43 91 -76 12 95 -113 68 37 -97 143 -67 -43 152 -116
1506a16J72K0k12K91j61r3K70k87J35J27l22K89p2j80L39l06J9K96l83K05P4k78
$$ -116 56 76 -136 155 -6 -99 171 -116 19 146 -176 113 41 -139 200 -106 -87 209 -174 31 105 -173
1528a73L32j94j02L40l29R6J71l51L05o1k31L58k27k6K51l21J87P4k77L06j47
$$ -173 159 -35 -137 203 -126 -30 141 -210 95 34 -197 161 -66 -92 159 -162 25 99 -178 128 -19
1549a9j19L01k58M4J78k61K00j6j89K57j38l3J67k23J46M6j99J95o9o6J41j51
$$ -19 -138 163 -95 -51 127 -134 66 50 -139 118 -20 -53 114 -109 37 83 -116 79 10 -56 85 -66
1571f6M8Q9j52J18l0o6J07q0L1K5q9J01k7l3N5o4M9j1n0Q2p4J8P1j18R3k9n8J32
$$ -66 -18 71 -81 37 7 -59 48 -32 -1 24 -65 36 9 -24 31 -33 16 5 -45 37 -37 -19 52 -66 27 -2 -60 72
1599G2j06pR8j22J06j5j12J76j10l5J47j59Q9M2j67J86p5q9K12j84J8J51k14J60
$$ 72 -34 -41 57 -65 41 26 -86 90 -20 -55 92 -67 22 64 -103 83 8 -81 131 -53 -35 116 -98 62
1623F2J0j76K07j06o7J82j96R9P8k18J82k2j53K05j43J0J47k12J24N1j92J85n2
$$ 62 72 -104 103 -3 -70 112 -84 15 93 -125 57 35 -118 87 -56 -46 101 -111 13 64 -128 57 5
1646Ej06J95j44MJ11j58R9L6j34J35n4n6J47j37J4J11j22O6ko7J08q0k2J08q2
$$ 5 -101 94 -50 -46 65 -93 6 42 -92 43 -11 -67 80 -57 -43 68 -54 12 10 -57 51 -29 -51 57 -25
1671b5J2N5r3P2K8r4R3l3n2Q3m9j6O8p1M3J2q7P9j4m0O6n9mP4r3M5M0p4L8nm3
$$ -25 -13 42 -51 21 49 -45 48 15 -37 46 -3 -19 49 -22 21 33 -54 25 11 -29 37 -22 -26 48 -45 0 40 -34 4 -1 -44
1702d4P4m5rM9o7N3ln1O1k2k8O3n6J2M3m6M4k9l3P8m8k1O2o0M6j4l0N9n1KL2l7
$$ -44 30 -15 -24 25 -42 11 8 -43 18 -4 -32 31 -25 -13 30 -16 28 -1 -34 44 -4 -25 37 -23 23 9 -21 38 -13 -11 21 -16
1734a6L7k3j5M8l5j6L7k6K3j4k9P5n4k0M9n1L0J2n5O6m0l5R4r8L6M3o0N1l2l6
$$ -16 21 -2 -17 31 -4 -20 17 -9 14 0 -29 46 -8 -28 21 -30 0 12 -43 23 -17 -52 42 -56 -20 23 -37 14 -18 -54
1764e4R3p4mN9p6P3mq2J01l1l8Q3r2O2L0j02R6l7l9J04q6mO8p9O3l1m4J07o6k2
$$ -54 39 -35 -39 20 -56 17 13 -69 32 1 -37 46 -46 16 46 -56 40 3 -36 68 -18 -22 46 -33 30 -1 -45 62 -4 -26
1794b6O4o2N5lo9Q1m5mN1q0M9L1q4O9l7lN0o8L2J3l4N1l4k5O1n4K5Mn3P4l7l1
$$ -26 38 -24 31 28 -41 40 -5 -9 42 -38 11 42 -42 27 -10 -13 37 -31 1 14 -20 31 -3 -28 33 -21 4 8 -45 29 -8 -39
1826c9P8q2M9K2p4N5j1k5P2q6L1O1j10Q3Oo3P1m7jP0j06O1K3q3R8o2k2P9q5L3
$$ -39 39 -43 6 28 -46 9 -2 -27 45 -41 -10 51 -59 24 30 -33 38 -9 -10 60 -46 15 38 -45 53 -9 -31 48 -37 -4
1856dM2r9P4ql8O2p2J7M9o4K2L2n4M9l7pO4o7K4L4o2M2Pl3L2k1J0J6k7J1lNJ0
$$ -4 38 -61 13 5 -33 29 -43 -26 23 -41 -19 13 -41 8 -29 -36 28 -39 -15 19 -43 -1 6 -27 5 -16 -6 10 -17 -6 -9 -4 6
1889Fk5K3Orlj1L7k5j9N6k0k5K8k7L8j7m7Q5n4j1P7q6L1M1p6O0k9m2J12r7LP8
$$ 6 -19 4 10 1 -2 -13 24 -1 -20 36 16 -9 19 -8 30 13 -34 51 -3 -14 63 -23 8 49 -27 33 4 -38 74 -23 -20 58
1921E8j23Q2K2j24J16l2n1J04j16M1Q9j48Q4L6j09J30q9l4J41j25L5N1j24J25
$$ 58 -65 17 39 -85 31 -1 -52 52 -64 -23 66 -82 2 38 -71 59 -30 -64 77 -48 -13 38 -86 39
1945C9k0j01J40p6m2J27j12M0N5j29J14l0p0J32q2l7J27j15M0L2j01J08k5p1J10
$$ 39 19 -82 58 -18 -60 67 -45 -5 50 -79 35 5 -65 67 -15 -52 75 -40 0 32 -69 39 14 -57 53
1970E3o0j6Q6j11N4M2r1N1J1o4P5n0j0Q0q8RP8r6K9M8o9M8j0l4O5n5oP4q7L7O0
$$ 53 -7 -23 63 -48 6 48 -43 8 19 -45 30 -20 -30 50 -38 -29 49 -47 -18 30 -39 9 -1 -35 30 -25 -31 43 -44 -7 53
2001E3j01O1K6r0P4j3m5Q9o8J2O6j11O8K7r6P9qn9J03p5j0O2q6N9L3j08R2j2p5
$$ 53 -48 13 39 -51 23 10 -35 54 -14 -2 64 -47 21 48 -48 31 23 -36 67 -8 -18 44 -42 17 50 -58 34 22 -53
2030e3J08p4qO8q3M7K1r6Q2J3j04J15l7m0P0p1J3O0q8O0Kp9J15m3o5J05o2k3Q8
$$ -53 55 -19 -27 41 -42 5 26 -70 12 25 -79 36 -1 -41 29 -42 -29 31 -57 3 5 -74 41 -2 -67 38 -24 -47 41
2059D1q3L7K3n8N5Jo1J07p8k8J04p2j5O5p4M9Qp6J00m9l6R7q7JR4j04M4L0r4R8
$$ 41 -42 -5 18 -40 15 16 -45 62 -16 -44 60 -12 -27 38 -36 13 21 -55 45 -4 -40 57 -30 -29 65 -39 5 35 -59 39
2089C9k4p1J05p2lR4j30N9N7j18P3Qn5R7r1nJ06j27M3P0j20Q7Mr1R7n4j1Q1j02
$$ 39 15 -56 49 -23 -26 68 -62 -3 54 -64 9 17 -38 59 -32 -37 69 -58 -15 55 -65 22 26 -65 32 -22 -33 48 -54
2118e4N1N6j33J18mj04J27o2l1R9q1K0L9q1P9lr4J09m5n2R6p2J6M0q5O8Op7Q5
$$ -54 -3 53 -80 38 34 -70 57 -5 -36 63 -18 2 41 -40 39 36 -58 51 6 -46 50 -22 -6 34 -51 17 23 -54 31
2147C1l8m8P9n8mO4o6L4J1o1P3k4n5R6o5j3O4m1oN2o1K7Ll2O6l6l0P2m6j1O3q4
$$ 31 -7 -55 24 -34 -38 26 -40 -6 5 -56 17 -7 -62 34 -31 -44 20 -21 -27 25 -36 -9 -6 -38 28 -8 -38 34 -12 -23 40 -44
2179d4L5M1m1J5oj4N7o7J3N3o2PO1p8L7J8n3N0l7qP0o0rN9p2L2K7o6N5mm7O5n7
$$ -44 -9 32 -9 6 0 -14 43 -24 -11 42 -20 -13 48 -30 7 25 -28 22 -15 -23 47 -13 -22 37 -35 -3 24 -42 13 9 -38 27 -30
2212c0JM9p9N0M8r8N8J8n7N7l3J3L2p2N0K9q7O4J1p1P6k9k6O2n6J8L6o7O0jo6
$$ -30 -29 20 -59 -9 39 -59 -1 17 -40 17 -16 -3 29 -43 7 36 -51 13 24 -47 29 0 -26 36 -20 -2 34 -33 27 26 -40
2243d0O6j6m4O2n1LN6p4M5Ro6P5k5m7P5m4j3O6p2L3J8o3O3l1m4Q9n0k2Q5p3J1
$$ -40 26 10 -34 28 -23 -20 36 -38 7 16 -50 25 0 -47 28 -16 -29 37 -35 -2 16 -47 16 -15 -59 30 -20 -42 43 -30 -19
2274a9M1n9M6k2l7Q6p3LO7o7J5M2o2M8Nm3N2n2J9N4p4M6J5o9O7lm2L2l2K0Nl9
$$ -19 22 -37 9 -13 -50 36 -37 -34 33 -34 -19 23 -39 9 14 -29 23 -29 -10 44 -30 16 31 -38 29 26 -16 16 -16 4 9 -30
2306c0N2pm7L3Kj6K1k1K5Lk4J1Lj2J3rqK2j3mj3J7mj4J2jLM%Mj2oJ7j7%L3m3K9
$$ -30 22 15 -32 1 3 -13 8 -13 12 15 -9 2 5 -7 6 -3 -11 11 -2 -6 -19 -2 -6 -20 -8 -9 -6 -2 -2 2 -10 -16 1 -16 -16 17 -26 3
2344Clk4L2k4J4K0m0L2J6n4M5ml1M6l1pL8m9M7j8m5O0k6k5N2o4L6J6n4O5k5l4
$$ 3 0 -24 8 -16 -2 18 -22 10 26 -28 17 13 -18 28 -3 -10 28 -21 26 8 -37 23 -3 -28 24 -40 -4 12 -42 23 -2 -36
2376c6P1n9nO5p6K8L2p2O0k7pO9q3L0M0p6M8J1l1M4m8J5L3n7L5J9m7M3k2k6O2
$$ -36 35 -24 -29 36 -40 -12 20 -52 8 -19 -26 43 -40 -10 30 -46 2 13 -18 26 -22 -7 26 -31 4 23 -24 19 -3 -29 33
2407C3l6mK8n0M3j0k4N4l7lL1l4K5k3j8L9k8lM7o0J9K4k3No%K3k9J3Lk2K2rj1
$$ 33 -3 -7 21 -29 14 4 -20 34 -3 -6 25 -9 16 -7 -25 14 -14 -17 30 -30 -11 13 -10 -5 -11 -11 12 -17 -4 -1 -23 -1 -10 -21
2441b1J3j0NJ3k4M3m4LL6k8j7L7k0K1qj4K3k3J8Rk4J8J2k4J2j3NQj3J9mk1L8k1
$$ -21 -8 -18 -13 0 -24 19 -25 -22 14 -14 -31 6 -14 7 -1 -15 8 -15 3 12 -12 6 18 -6 6 -7 -2 6 -7 12 8 -13 25 4
2475Dj8K7j1Oj3lJ2j1JJ9k4RMJKj0NLk1K5j6nJ2j5JNrJ6j1LK6m2J1L3k6J8rpJ7
$$ 4 -14 13 2 8 -5 -8 4 -7 -6 13 -11 -2 2 3 5 -5 0 3 -18 7 -9 -14 -2 -17 -16 -11 -20 -4 -15 -12 14 -28 -17 16 -10 8 -1 -8 9
2514Ik8L5Rl7K5J2l9K9j4J1Rm1L9%l7L6k7nM4l5mK2l1K0oj5L4k9rL1l4J3J6j7
$$ 9 -19 16 25 -12 13 25 -14 15 1 12 21 -20 19 19 -18 18 -9 -14 30 -5 -9 13 -18 2 -4 -19 15 -14 -23 8 -26 -13 3 -14
2548a4J9k1KK4l1J5Qk4J8%j4KqjJ2rL1j2jJoj3J6MRk9J8J3j8J1J5j3Pk0K2J1l4
$$ -14 5 -16 -14 10 -21 -6 2 -22 -4 -4 -18 -16 -24 -25 -13 -22 9 -3 -4 -3 -9 -22 -6 -2 7 -22 -4 9 -9 2 17 4 11 -9 13 24 -10
2585a0L6j6k1M8l8j1M2m1PJ3j8L0k1j3K8l1JL3m5L7ml6N0m8LM7n1L3Jm4M5j3j4
$$ -10 26 10 -11 37 -1 -12 30 -11 -4 9 -9 21 0 -13 15 -16 -15 18 -27 10 6 -30 20 -28 -25 22 -29 4 5 -39 6 -7 -21
2618b1L1k7J0K6m4L0nk8M6l2lL5k8%J6j9K4%j5K1j3j3K7k3J6Qj7PqJmJ1j5J0j0
$$ -21 10 -17 -7 19 -25 5 0 -28 18 -14 -17 18 -10 -10 6 -13 11 11 -4 17 4 -9 18 -5 11 19 2 9 1 2 -2 9 -6 4 -6
2653fkQj3qK0Kj7J3j3%K1l3J6J8k3J8rk1L4k0OL7n2J8J0l8N9k2k6N9m1nN0o3K9
$$ -6 -8 0 -13 -21 -1 1 -16 -3 -16 -16 5 -28 -12 6 -17 1 -8 -29 5 -15 -9 28 -24 -6 4 -34 25 3 -23 36 -5 -10 40 -23 6
2688FMm0M9k5j9O0o1K4K8n2N4j2n2O6l1j8N9o4L4K6n9N1k0k7M9m3J8J7m3J8Pl4
$$ 6 10 -30 19 -6 -25 35 -26 -2 26 -26 28 16 -36 30 -1 -19 40 -24 10 36 -23 28 8 -19 30 -13 5 22 -21 -3 4 -30
2720c0L8k2mK6k3oL3k7NK4l9J7lnK4j4oK4j7j1J8%QppJ5J0k8J6rrK3j3qK9rk6
$$ -30 8 -14 -18 8 -15 -21 12 -15 -10 14 -25 -8 -11 -16 8 -6 -12 12 -5 -16 2 2 10 3 -4 11 21 -7 9 0 -9 14 1 -7 22 13 -13
2757a3L5l0J6Jk4K9k5oL1k6lK8l8K6J3m6N8m1qN2m9K1J2m4L7nm1N3k8j5M5l9J3
$$ -13 22 -8 8 9 -15 14 -11 -17 14 -12 -15 13 -25 1 14 -32 26 -15 -23 29 -20 1 13 -31 6 1 -40 13 -15 -30 15 -24 -11
2790a1K8n4M2nk7M7k9ML2m9J9K6l5L4j5rK3k3OJ9l1K4jqJ8j2j7K6l4J0J1k3K4
$$ -11 17 -37 5 0 -27 20 -9 -5 27 -22 -3 23 -12 22 7 -2 21 -2 4 23 -8 16 15 7 25 13 -4 22 -12 -2 9 -14 10
2823A0j1qK6k7j3K6rmN%rJ8j4Mkq%J9j8kK2k5J1jk0M2k6LOj3J2Kj1K5qj9M2m4
$$ 10 -1 -9 17 -10 -23 3 -6 -10 -5 -5 -14 4 -10 -6 -8 -16 -16 3 -15 -17 5 -20 -9 -10 -30 12 -14 -11 -5 -18 -6 -4 -15 10 2 -17 25 -19
2861a9QK1k2J4J3l0L4j1k7L4j2pL4m1K1Ql7L6rj6K9l8J0K0k6J6lk1J9j8JK1j2
$$ -19 -11 10 -12 2 15 -15 19 8 -19 15 3 -4 30 -11 10 18 -19 17 8 -8 21 -17 -7 13 -13 3 0 -21 -2 -20 -19 2 -10
2894a0pK7l3J5Pj8L1k1mJ2j1NJ9k5J6lj2J3QjqmOJ0j5Rj1QKmlJ0lmKlj3J1OnJ0
$$ -10 -17 10 -23 -8 -1 -19 12 -9 -13 -1 -12 -7 12 -13 3 0 -12 1 9 8 0 -4 2 12 -3 6 -5 3 5 1 -2 8 5 1 3 0 -13 -2 4 -1 9
2935Ir%NpJ4j1j3K0j4k1L3k0lJ5k0J3jj2K4j8oL1m2J4J7l1K8oKJ1j5J8Qk2K2%
$$ 9 0 0 5 -2 12 1 -12 8 -6 -27 6 -14 -17 -2 -22 -9 -10 -22 2 -16 -22 9 -33 -19 -2 -33 -5 -11 -9 2 -13 5 13 -9 13 13
2971A3j4J4Lk2K2j9mK3k8K3j8QK0j6pJ6k0PKj4K2qj3J8j8PNj6J8k0PJ3j4LPj0
$$ 13 -1 13 16 -6 16 -3 -7 16 -12 11 -7 1 21 5 -2 14 -6 1 3 -11 11 3 -10 8 -10 -3 2 -14 4 -16 -9 4 -10 -7 0 -10
3007a0jkJ9j7Mj0J0kJ1j4j0QmRJnJ2j1lJ4oPnQJ3j7NRjLk0mK6l2OK3k3RjoJ6j5
$$ -10 -11 -13 6 -11 -7 -17 -7 -9 2 -12 -22 -14 -18 -9 -8 -13 -1 -12 -15 -1 -7 0 -5 3 16 -1 4 13 12 15 -5 -9 17 -15 -9 14 -9 0 -1 -7 9 -6
3049frK3k1J7j1pJ6j1j0J0j7RK1k1J1nkJ6opRj9OJ3k%j4kK1j4Pn%J1Kj1QlkLq
$$ -6 -15 8 -13 4 -7 -14 2 -9 -19 -9 -26 -17 4 -17 -6 -11 -13 3 -3 -10 -1 -20 -14 -1 -3 -3 -17 -19 2 -12 -5 -10 -10 1 3 -8 0 -3 -5 -2 -10
3090a0K4Mj9J2kj7K1qjO%rQj5OpJ4mknprLOOmj3J8Lj3J2j8QRk3K7rkRrljoJ3j1
$$ -10 14 18 -1 11 9 -8 13 5 4 10 10 1 9 -6 0 -7 7 3 1 -4 -11 -20 -17 -11 -5 -9 -22 -4 -1 -14 -2 -20 -12 -3 -26 1 -8 -10 -1 -10 -13 -14 -20 -7 -18
3135a8QJ1omJ0j4K0qkJ1j8MJ7qLpoJ1pj4J6rJ2jomNkRj1NOj5PRj7OqKQj9K0Lj2
$$ -18 -10 1 -5 -9 1 -13 7 -1 -3 8 -10 -6 11 3 6 -1 -7 4 -3 -17 -1 -10 2 1 -5 -9 -4 -6 3 -8 -3 3 -12 -5 4 -13 -7 -15 -13 -5 -24 -4 -1 -13
3179a3%jNKj0K1oj1PkpK0kj6J7k3J1RjQj1Rmj0K1rnLKpJ2j8J0mj6L1k0J4nj3Q
$$ -13 -13 -14 -9 -7 -17 4 -2 -13 -6 -8 -15 5 3 -13 4 -19 -8 1 0 8 -3 6 2 -8 13 4 -1 2 4 -3 9 -9 1 -3 -19 12 -8 6 1 -12 -4
3220dJ3j3pJJ0Nj8Pj%Qj9KLKNr%Oj3QRknKqJ2j%MjmjPjpNP%QrmKMqJ2mlKj6J6
$$ -4 9 -4 -11 -10 0 5 -13 -6 -7 -7 1 -18 -16 -13 -11 -6 -15 -15 -9 -22 -14 -5 -7 -12 -10 -18 -6 -7 -7 -3 -4 -8 -9 -2 -3 -10 -5 2 2 10 1 -3 -1 3 -5 7 3 0 2 -14 2
3271BllqNkJ1qmJ5j8J5j1jRMlj3nJ1j4nK7l2J9J4j9J9j8%J2rOLj0J3Jj9J3jJ1
$$ 2 -1 -4 -12 -7 -9 2 -6 -10 5 -13 2 -9 -10 -1 3 0 -13 -18 -7 -21 -26 1 -31 -12 2 -17 2 -16 -16 -4 -13 -7 -4 -14 -1 0 -19 -6 -7 4
3311Dmj2mJ8j1J5qJ2JrJJjPrk%mPnoJ4mnLj7J3jqJ3loOj5K1j2pPmJ1Kk0K3qmJ3
$$ 4 0 -12 -16 2 -9 6 -2 10 11 2 3 4 3 10 1 -1 -1 -5 2 -3 -9 5 1 -4 -1 -18 -5 -6 -14 -1 -4 -10 -4 -19 2 -10 -17 -10 -14 -3 -1 -21 2 -6 -10 3
3357Cj3J3pnPloOmlJ2%lOoRKk0K6j1JLrJ8jqNk7J9Qj9NoOKj4J0Mj1J5qqMj0JQ
$$ 3 -10 3 -4 -9 -2 -5 -11 -5 -9 -12 0 0 -3 3 -3 6 8 -12 14 3 4 7 -2 16 15 7 12 -15 4 12 -7 -2 -8 -2 0 -14 -4 0 -11 4 -4 -12 -8 -18 -17 -9
3403ioOpmJ4oj5K0j6NlKJ3jlM%L%p%NpJ6or%NNkJQnj0K1j6jJ2rmnMQj%Kmkmlj
$$ -9 -15 -9 -16 -20 -6 -12 -27 -7 -23 -18 -21 -19 -6 -7 -10 -6 -6 -3 -3 -10 -10 -5 -12 4 -2 -11 -11 -6 -1 -3 -2 6 1 -9 12 -4 -5 7 -2 -6 -11 -7 1 0 0 2 -2 -4 -8 -11 -12
3454a2%M%j2J6j2qJ9j6PqMRj5JJ1j0J3j0J4Pj1RrQnJ2j4nK0qJ3j4MQoM%llmmJ2
$$ -12 -12 -8 -8 -20 -4 -16 -24 -5 -21 -14 -22 -18 -9 -24 -23 -12 -22 -9 -19 -5 2 -9 0 -9 -1 -6 6 -8 -13 7 -1 12 -2 2 10 4 8 8 5 2 -2 -6 6
3497Fj7J3jqjjLNpnQoQkJj1qjJ8Oj6MpRrNKk%jlJ1j0J6moNPqkRqJ0rJ9ppmJ3J0
$$ 6 -11 2 1 -7 -8 -9 -6 -1 -8 -13 -5 -11 -3 -5 -4 -15 -23 -24 -6 0 -16 -12 -19 -10 -19 -14 -12 -14 -14 -15 -18 -7 -17 -1 -5 -11 -6 1 -7 -9 0 -8 2 -7 12 5 -2 -6 7 17
3547A7kj6J4jqLNj2OqpOj3NljOJ9j7klRPk4Q%LJ0j0pRkMLmj1LMMpJ0jlJ0j1mO
$$ 17 15 -1 13 12 4 7 12 0 6 -2 -9 -3 -16 -11 -14 -15 -9 10 -7 -9 -12 -3 4 -20 -12 -12 -9 1 -9 -16 -7 -9 -5 -2 -6 -17 -14 -10 -6 -13 -3 -4 -7 3 -8 -12 -6
3594frLJ1nJ6k4J2Rj1QKknJ5rj7J0NnJJ4j7rQmmMj4J5pKPj4J3oKq%lJ4j7J1MJ5
$$ -6 -15 -12 -1 -6 10 -14 -2 7 -4 4 6 4 -1 14 5 -12 -2 3 -2 -1 13 -4 -13 -5 -9 -13 -9 -23 -8 -15 -13 -6 -20 -7 -13 -11 -19 -19 -22 -8 -25 -14 -10 5
3638Ek0QmJJJNnLj%nJ0%LkKnMKoJPOnMJjj2NQj9%J8%j7nRKj2ONpQmj1Rj4PLmK
$$ 5 -15 -7 -11 -10 -9 -8 -3 -8 -5 -6 -6 -11 -1 -1 2 0 2 -3 1 3 -3 -2 5 11 6 10 11 10 -2 3 11 -8 -8 10 10 -7 -12 -3 -1 -13 -7 -2 -9 -1 -5 -16 -7 -21 -14 -11 -15 -13
3690a3KNrKqRlJ4%j2J0nnJ1mJ4moJ2j0RQk4KNMRk1QMKnRj9J7kj2J8j9RlqPmql
$$ -13 -11 -6 -15 -13 -21 -12 -15 -1 -1 -13 -3 -8 -13 -2 -6 8 4 -2 10 0 9 17 -7 -5 0 4 13 -8 0 4 6 1 10 -9 8 6 -6 12 -7 2 -1 -9 -2 -6 -14 -17
3736a7OJ2lj4LJ1qOrqJPLqlJ1OoOlK%QOnnJ2j4J0oLNj2J3rRj5J6j5J0lkMjlKl
$$ -17 -11 1 -2 -16 -13 -2 -10 -4 -13 -21 -20 -13 -10 -18 -21 -10 -4 -10 -4 -7 -5 -5 3 9 4 -1 11 -3 7 1 4 9 -3 10 1 10 -5 11 -4 6 3 1 5 4 1 3 0
3783@NqJRqMkj5J1nnJ2qjJ0j1OMmjj5J0PlpNjJL%j6J2Plm%oPKKjJ5k4J3J4j3J6
$$ 0 5 -3 -2 7 -1 3 1 -14 -3 -8 -13 -1 -9 -10 0 -11 -5 -1 -5 -6 -21 -11 -4 -7 -14 -9 -10 -9 -6 -6 -22 -10 -3 -6 -10 -10 -16 -9 -7 -5 -6 9 -15 -2 12 -1 15
3830A5oj1mJ8Mj3JrK2j4rLJ6k3JLPnpqJ4jjpNlJ8j3kOkMj0J0jjJkj5J5mJ1lLl
$$ 15 9 -2 -6 12 16 3 4 -5 17 3 -6 -3 13 -10 -9 -6 1 -4 -11 -19 -5 -6 -7 -14 -9 -12 6 -7 -9 -3 -5 -1 -11 -1 -2 -3 -2 -4 -19 -4 -8 3 0 3 0
3875@Pq%J0mnKJoOoJkJ9mplMjQj2KjJlJOj6J5k4NJrLnJ3J2pNj4J1%k3L5j4nPj6
$$ 0 7 -1 -1 9 5 0 2 3 -3 3 -3 -2 -4 15 11 4 1 5 4 12 0 2 1 2 -1 0 6 -10 5 -19 -14 -13 -22 -19 -24 -11 1 -6 -1 -15 -4 -4 -27 8 -6 -11 -4 -20
3923b0PK0j5MkljJ5nmOQj6J4lrJNKJ%j4QrPKjLNkJrkNnJ8mrlnRpqJJJLPj1kOl
$$ -20 -13 7 -8 -4 -6 -9 -10 5 0 -4 2 10 -6 8 5 -4 -3 2 4 5 5 -9 -1 -10 -3 -1 -2 1 6 4 5 -4 -6 -1 -6 12 8 -1 -4 -9 0 -7 -15 -14 -13 -12 -9 -2 -13 -15 -9 -12
3975a2%J1j1JoKrJ3mJ1j0QJ1%pOj2MOkJ3q%M%oJ0j3lNMj7OoLQj3K8k8J2qOpLP
$$ -12 -12 -1 -12 -11 -17 -15 -24 -11 -15 -4 -14 -6 5 5 -2 4 -8 -4 2 0 13 5 5 9 9 3 13 0 -3 2 6 -11 -5 -11 -8 0 -13 15 -13 -1 -9 -3 -10 -7 0
4020@j1JNl%JlkKJ1j0OoNj0JJ8j9J3j6J1lJ5j7JJ3pJ%jjjJ4Mj0Qjj0J1j7NJ1q
$$ 0 -11 -10 -5 -8 -8 -7 -10 -12 -10 1 -9 -3 -9 -4 -14 -13 5 -14 -1 -17 -6 -9 6 -11 -10 3 -4 -3 -3 -4 -5 -6 8 12 2 10 9 -1 10 -7 -2 9 1
4063AjoROJj3jj6J2nK0roQj1%pKJlkNjmJ7j6J0KjKqNJjLJ2j6mJ6j2J5j1lJ4j0
$$ 1 0 -6 3 9 10 -3 -4 -20 -8 -13 7 -2 -8 0 -11 -11 -18 -16 -15 -18 -20 -15 -16 -20 -3 -19 -9 -7 -8 -6 -14 -9 -8 -9 -6 6 -10 -14 2 -10 5 -6 -9 5 -5
4108eLQLqOrPkJOk5J3J0k1J9onLqOOmjLqOk0J0LolOj0RJ3j0Kl%kMNklj0J8j1J1
$$ -5 -2 6 9 1 7 -2 5 3 4 10 -15 -2 8 -13 6 0 -5 -2 -10 -4 2 -2 -3 0 -8 -2 -22 -12 -9 -15 -18 -12 -22 -13 0 -10 -8 -11 -11 -13 -9 -4 -6 -9 -19 -1 -12 -1
4156arJ1%KnOkLklJmQ%pJ1j2KpJ0jj1QkNJ1j6QloMnkLrJ3j9J1Kqlj1NJ5Jj0LK
$$ -1 -10 1 1 3 -2 4 2 5 3 0 1 -3 5 5 -2 9 -3 -1 -8 2 1 -10 -2 -4 1 12 -4 4 1 -5 -1 -6 -8 -5 -14 -1 -20 -9 -7 -15 -18 -29 -24 -9 -8 -18 -15 -13
4204a3qJ2j0LRj5J7J0j7PlLMnlJ3n%J2pKJMJJ%j0Rk2J4jQj0nNknONrnJ1j3JL%
$$ -13 -21 -9 -19 -16 -7 -22 -5 5 -12 -5 -8 -5 -1 -6 -9 4 -1 -1 11 4 6 7 11 12 13 13 3 12 -10 4 3 11 1 -4 1 -1 -6 0 5 -4 -9 2 -11 -10 -7 -7
4250gj%j1J1OonJ7%j5QkNj5J5Jj6J0%J1orPpNJ1Mj1J1KrOJkqONj2JJJKJj1Mmk
$$ -7 -8 -8 -19 -8 -2 -8 -13 4 4 -11 -3 -5 0 -15 0 1 -15 -5 -5 6 0 -9 -2 -9 -4 7 11 0 11 13 4 10 11 9 1 7 12 0 1 2 3 5 6 -5 -1 -5 -7
4297gRr%pJ0oj2JJ1mnMpJ3Mj4J3nmJPNpnJ0Mk0J4MqJ%J1Jj7J0O%lJ1k0J1LMOr
$$ -7 2 -7 -7 -14 -4 -10 -22 -21 -10 -14 -19 -15 -22 -9 -5 -19 -6 -11 -15 -14 -7 -2 -9 -14 -4 0 -20 -6 -2 -10 -9 -9 2 3 -14 -4 2 2 -1 10 -10 1 4 8 14 5
4343EmJ1pnPoLQj9QNrL%pkJlMkkMj0mLRqlKJ7j9K2j8QqQ%LM%LJojKMLj3J8pO%
$$ 5 1 12 5 0 7 1 4 12 -7 1 6 -3 0 0 -7 -9 -8 -11 -7 -9 -11 -7 -17 -21 -18 -9 -17 -20 -18 -1 -20 2 -16 -8 -16 -8 -8 -5 -1 -1 2 3 -3 -4 -2 2 5 -8 10 3 9 9
4395IpKj7J7Qj2KKoJ0j2J7j1Rj5NjlnQJ0j8M%nnJ2j8OLRj0jmNqJ7qQrQKoJ4j6
$$ 9 2 4 -13 4 12 0 2 4 -2 8 -4 13 2 11 -4 1 0 -3 -8 0 10 -8 -4 -4 -9 -14 -2 -20 -14 -11 -2 -12 -13 -17 -12 -20 -3 -11 -3 -12 -4 -2 -8 6 -10
4440a0ORn%J0nj4QOnnJMlJ1Jj1KJoJ4KrlqLRj3J5j1RqlMrkRlj1LQrMnKj1MRNn
$$ -10 -4 5 0 0 10 5 -9 -1 5 0 -5 -4 0 -3 8 9 -2 0 1 -5 9 11 2 -1 -9 -6 3 -10 5 -6 3 -5 -8 -4 -13 -15 -6 -9 -20 -17 -9 -18 -14 -19 -17 -28 -24 -15 -10 -15
4490a5KpRQkL%kLj0NQJkj3J5jqOmJ2Mkj2rJ6nMMMj4Pj1JLKnrRkqLLJQjoJJmkM
$$ -15 -13 -20 -11 -3 -5 -2 -2 -4 -1 -11 -6 2 3 1 -12 3 2 -6 0 -4 8 12 10 -2 -11 5 0 4 8 12 -2 5 -6 -5 -2 0 -5 -14 -5 -7 -15 -12 -9 -8 0 -1 -7 -6 -5 -9 -11 -7
4542gj0LOMLpj5K1PpjNMo%KJOj4J1mOj0J6mNj7Ro%PNqj0J0rJ1j7PM%j7K5j5oO
$$ -7 -17 -14 -8 -4 -1 -8 -23 -2 5 -2 -3 2 6 0 0 2 3 9 -5 6 2 8 -2 14 10 15 -2 7 1 1 8 13 5 -5 5 -4 7 -10 -3 1 1 -16 9 -6 -12 -6
4588fJjnOKj0MojQNj3J8j4J3rqJ5%LrPLOj2J0j7J4kMlNjjLj5RPj0MNrJ1pLK%j1
$$ -6 -5 -6 -11 -5 -3 -13 -9 -15 -16 -8 -3 -16 2 -12 1 -8 -16 -1 -1 2 -7 0 3 9 -3 7 -10 4 2 6 3 8 7 6 9 -6 3 10 0 4 9 0 11 4 7 9 9 -2
4636bNmJj1J3Qj9JLpPpPnlJ1pKOj8Q%MNOolMKkOknnLJ5j2oJ0PlKqLJjoLoOoON
$$ -2 3 -1 0 -11 2 10 -9 -8 -5 -12 -5 -12 -5 -10 -13 -2 -9 -7 -1 -19 -11 -11 -7 -2 4 -2 -5 -1 1 -1 5 3 -2 -7 -4 11 -1 -7 3 10 7 9 1 4 5 4 -2 1 -5 1 -5 1 6
4689FlOj2lOJj4J3mrJ2oQj3jJ2KorMQNpoMmkKj1J3LPmklJ3kJlMOJj1K%JJ0j4m
$$ 6 3 9 -3 -6 0 1 -13 0 -4 -13 -1 -7 1 -12 -13 -1 1 -5 -14 -10 -2 3 -4 -10 -6 -10 -12 -10 -21 -8 -5 2 -2 -4 -7 6 4 5 2 6 12 13 2 4 4 5 15 1 -3
4738cQNqKpJ0rJj6K4j2nR%j4jQMjl%l%Lk2K0J1j6J2qKnOpJ4j6J5krQnKRkqJ3j5
$$ -3 5 10 2 4 -3 7 -2 -1 -17 7 -5 -10 -1 -1 -15 -16 -8 -4 -5 -8 -8 -11 -11 -8 -30 -10 1 -15 -3 -11 -9 -14 -8 -15 -1 -17 -2 -4 -13 -5 -10 -8 1 -1 -9 4 -11
4785a1lJ7mQr%J0%mLj2J1pK1j2nQj5MkKpNpkJ7j3%KlOjj5J9lj0KjJ4Mmlj4%OL
$$ -11 -14 3 -1 7 -2 -2 8 8 4 7 -5 6 -1 20 8 3 11 -4 0 -2 0 -7 -2 -9 -11 6 -7 -7 -5 -8 -2 -3 -18 1 -2 -12 -10 -11 3 7 3 0 -14 -14 -8 -5
4831enJ0pNMkj0OkN%O%kPj0lkQj3MRJ%LoNrN%Lj6J6j0lJ1Jj2kJrmRJk0K5lpJ0
$$ -5 -10 0 -7 -2 2 0 -10 -4 -6 -1 -1 5 5 3 10 0 -3 -5 3 -10 -6 3 4 4 7 1 6 -3 2 2 5 -11 5 -5 -8 3 4 -8 -10 -9 -18 -22 -13 -12 -32 -7 -10 -17 -7
4880gj3Qj0POLKknJ6j5ONj7RJRkOj0ROj4JoJ0ljKmJ2j3RoJKjMp%Rj1J4j9QkoQ
$$ -7 -20 -12 -22 -15 -9 -6 -4 -6 -11 5 -10 -4 1 -16 -7 -6 3 1 7 -3 6 12 -2 -1 -7 3 0 -1 1 -3 9 -4 5 -1 0 2 1 5 -2 -2 7 -4 10 -9 -1 -3 -9 -1
4928aj1J0j1Q%LrqJMQokKJnPrNKQkj0J8jjKLQj0kpJ4omPNmopmjJ9qLlKLMj2Km
$$ -1 -12 -2 -13 -5 -5 -2 -11 -19 -18 -14 -6 -12 -14 -12 -11 -16 -9 -18 -13 -11 -3 -5 -15 3 2 1 3 6 14 4 2 -5 9 3 -1 6 11 7 1 -6 -10 -11 8 0 3 0 2 5 9 -3 -1 -5
4980eOn%LoMj7PLNj2J5oLkJJKj0K0j9oPlmJ0KJ4j1jlJ2LjMPj4J2q%MKKj1JmQj3
$$ -5 1 -4 -4 -1 -7 -3 -20 -13 -10 -5 -17 -2 -8 -5 -7 -6 -5 -3 -13 7 -12 -18 -11 -14 -18 -8 -6 8 -3 -4 -7 5 8 7 11 18 4 16 8 8 12 14 16 5 6 2 10 -3
5028cK1j4j6LJ0%KrOqlJj2JKJ5q%Kj5K1pLKj1RkjQnjqRrPLJjJkLJ4pj5J7kRoj3
$$ -3 18 4 -12 -9 1 1 3 -6 0 -8 -11 -10 -22 -21 -19 -4 -12 -12 -10 -25 -4 -11 -8 -6 -17 -8 -10 -11 -3 -8 -9 -17 -8 -17 -10 -7 -6 -7 -6 -8 -5 9 2 -13 4 2 11 5 -8
5077hJ1MqKlkRj3J0kJlKKnP%k0JJ8j6KNlOk5J8kMrLMKpJ2Mj0nqK0lOnqJ4pJ9j0
$$ -8 3 7 -1 1 -2 -4 5 -8 2 0 1 -2 0 2 -3 4 4 -16 -15 3 -13 -11 -6 -9 -3 -28 -10 -12 -8 -17 -14 -10 -8 -15 -3 1 -9 -14 -22 -2 -5 1 -4 -12 2 -5 14 4
5125DpP%MLrM%j2RmLLqLn%J2kjjj6NRkj1LmOkJOlLj2J0lk3J5J0qlJ4j5J5nlrJ
$$ 4 -3 4 4 8 11 2 6 6 -6 3 -1 2 5 -3 0 -5 -5 7 5 4 3 -13 -8 1 -1 -12 -9 -13 -7 -9 -8 -2 -5 -2 -14 -4 -7 -30 -15 -5 -13 -16 -2 -17 -2 -7 -10 -19 -18
5174a8J1j1%J3%Nj3RJ4j1jOLkmQj0J2j6J0l%oJ5mj1pJ0j3J2klJ6k0MOj0qRLqJ0
$$ -18 -7 -18 -18 -5 -5 0 -13 -4 10 -1 -2 4 7 5 1 9 -1 11 -5 5 2 2 -4 11 7 -4 -11 -1 -14 -2 -4 -7 9 -11 -7 -1 -11 -19 -10 -7 -15 -5
5216eMk0J4KplPNj%j1LQj9OMkNj1J2LMoJ0j1J9klJ4j3pOj0RnmQmplJ6j2J4rrN
$$ -5 -1 -21 -7 -5 -12 -15 -8 -3 -4 -4 -15 -12 -4 -23 -17 -13 -15 -10 -21 -9 -6 -2 -8 2 -9 10 8 5 19 6 -1 5 -5 4 -1 -5 3 -1 -8 -11 5 -7 7 -2 -11 -6
5262fJ2j4jMnj0rQMOmPKj5OQpJ2jKrJ4j0pMKJ0j1L%MoqPJ6pPlPmlKj5J7rmMJ1
$$ -6 6 -8 -9 -5 -10 -20 -29 -21 -17 -11 -15 -8 -6 -21 -15 -7 -14 -2 -3 -1 -10 4 -6 -13 -9 -7 3 -8 -5 -5 -1 -7 -15 -8 8 1 8 5 12 8 5 7 -8 9 0 -4 0 11
5310A1rOoqRoJJ0j0oJRrj1J4j5MKjORl7J8JLKoKJ1lMlQqNOj3QJ3nnRj2mJ3j8J6
$$ 11 2 8 2 -6 3 -3 -2 8 -2 -8 -7 2 -7 -18 -4 -19 -15 -13 -14 -8 1 -36 -18 -17 -14 -12 -18 -16 -5 -8 -4 -7 1 -7 -2 4 -9 -1 12 7 2 11 -1 -5 8 -10 6
5357FOj9J1JoQlKRk3J4kpMjjlNrJ1pLjj0Rk0K2j6J7j1kkKoLQrJ5j9POkQJpOJ1
$$ 6 12 -7 4 5 -1 7 4 6 15 -8 6 4 -3 1 0 -1 -4 1 -8 3 -4 -1 -2 -12 -3 -23 -1 -17 0 -11 -13 -15 -13 -19 -16 -8 -17 -2 -21 -14 -8 -10 -2 -1 -8 -2 9
5404Ij0J4j3jOMj1J3j1JJ1lLrkjQoj2OJ8j6J0k5J4kn%PlJ0kq%j0QJ5j7kMJ0qk
$$ 9 -1 13 0 -1 5 9 -2 11 0 1 12 9 12 3 1 0 8 2 -10 -4 14 -2 8 -17 -3 -5 -10 -10 -3 -6 4 2 -6 -6 -16 -8 7 -10 -12 -8 2 -6 -8
5447hj1J0mj0J4nJ2KlqKmLOnjmJ5oQJ3j8J4%j0J4j0Ml%Qj5J2%o%MrojlQolPkQ
$$ -8 -19 -9 -13 -23 -9 -14 -2 0 -3 -11 -9 -13 -10 -4 -9 -10 -14 1 -5 3 16 -2 12 12 2 16 6 10 7 7 15 0 12 12 6 6 10 1 -5 -6 -9 -1 -7 -10 -3 -5 3
5494CKlnLk0RNJpOJ2j2RmJ%Nr%qJ7mnJ0qj1J1rJ1oJ0JL%nMJ0j5%J0j8RJ3j4Oj0
$$ 3 5 2 -3 0 -20 -11 -6 -5 -12 -6 6 -6 3 -1 0 0 5 -4 -4 -12 5 1 -4 6 -2 -13 -2 -11 0 -6 4 5 8 8 3 7 17 2 2 12 -6 3 16 2 8 -2
5540bjJJ1j2Oj5jPn%qJ0nMqJ0pMqJ3JlloMLQoRJllQj3J4OoJj0jkJ4mjPlrJ4Jr
$$ -2 -3 -2 9 -3 3 -12 -13 -6 -11 -11 -19 -9 -14 -10 -18 -8 -15 -11 -19 -6 -5 -8 -11 -17 -13 -10 -2 -8 1 2 -1 -4 4 -9 5 11 5 6 -4 -5 -7 7 3 2 9 6 -3 11 12 3
5590CLJj0Pn%J3j4jMj0J5j3NJ2j8L%mLj3jJ4j%q%Pk3J3J2pjRj2J1jQnkPJMkKJ
$$ 3 6 7 -3 4 -1 -1 12 -2 -3 1 -9 6 -7 -2 10 -8 -5 -5 -9 -6 -19 -20 -6 -7 -7 -15 -15 -8 -31 -18 -6 -13 -14 -5 -17 -6 -7 1 -4 -6 1 2 6 4 6 7
5636GJpjoLPj3PJNjj0OOj2OokNj0PJ2noMnrJ7k0lK2nk%kOrOJj9J9j2OL%K%nNJ0
$$ 7 8 1 0 -6 -3 4 -9 -2 -1 4 3 -7 -1 5 -7 -1 -7 -9 -4 -14 -7 5 0 -6 -2 -7 -16 1 -19 -22 0 -5 -7 -7 -9 -3 -12 -6 -5 -24 -5 -17 -11 -8 -8 -6 -6 -11 -6 4
5686Dj4J8j3J1mQoOmkj1J3J1k0J0oOMlnOj0JmmRj4J2roJ5j5K%MJOj3NllRrMJ4
$$ 4 -10 8 -5 6 2 10 4 10 6 4 -7 6 17 -3 7 1 7 11 8 3 9 -1 0 -4 -8 1 -13 -1 -10 -16 -1 -16 -14 -14 -10 -9 -3 -16 -11 -14 -17 -8 -17 -13 1
5731Aj8J5plRLj5RKjjLPKj4OJ1pQmmOJj1jRMpOqMMQqLj0MkpnkKk2K8Kj3M%j0P
$$ 1 -17 -2 -9 -12 -3 0 -15 -6 -4 -5 -6 -3 4 6 -8 -2 9 2 10 6 2 8 9 -2 -3 6 10 3 9 1 5 9 17 9 12 2 6 4 -3 -8 -10 -8 -30 -2 0 -13 -9 -9 -19 -12
5781a2KjnNlmOPJj3PMj2J2%JLoJ3npRj1JPrJ0J3k7PQrJ4ojQj1OJ2j0mPj7OmQj
$$ -12 -10 -11 -16 -11 -14 -18 -12 -5 -4 -17 -10 -6 -18 -6 -6 -5 -2 -8 5 0 -7 2 -9 -8 -1 -10 0 13 -14 -7 1 -8 6 0 -1 7 -4 2 14 4 0 7 -10 -4 -8 0 -1
5828aqKjOLj5PNj1pKJ1lmmJ2oj0J0PKj0KJ5j8OJRoKkPKJ5k4K2lj1%LlpKjPjrJ4
$$ -1 -9 -7 -8 -2 1 -14 -7 -2 -13 -20 -18 -7 -10 -14 -18 -6 -12 -22 -12 -5 -3 -13 -11 4 -14 -8 -7 2 -4 -2 -4 3 5 20 -4 18 15 4 4 7 4 -3 -1 -2 5 4 -5 9
5876Iojm%nlKJ4rJ7rj1j0OJJmMnJKjqNpJ2%qpNJ2j2%NP%J8j2nQj6J9%LkRj6jJ1
$$ 9 3 2 -2 -2 -7 -10 -8 6 -3 14 5 -6 -16 -10 -9 -8 -12 -8 -13 -12 -10 -11 -19 -14 -21 -9 -9 -17 -24 -19 -7 -19 -19 -14 -7 -7 11 -1 -6 2 -14 5 5 8 6 15 -1 -2 9
5925Ij3J1jOj9MJK0j1lj0%NlJ1qJj1Oj4JJJO%LljJ6k1J6kqJ5j0j0OnJ1mjOrjM
$$ 9 -4 7 6 12 -7 -3 -2 18 7 4 -6 -6 -1 -4 7 -1 0 -11 -5 -19 -18 -17 -16 -10 -10 -7 -10 -11 5 -16 0 -2 -10 5 -5 -15 -9 -14 -3 -7 -8 -2 -11 -12 -8
5970hoJ2m%%J3j7J3Nj0PJ0mKnJJ3j4Pj3MmL%plPoJpLLn%KpJ3r%J0j7J3nj2K3p
$$ -8 -14 -2 -6 -6 -6 7 -10 3 8 -2 5 15 11 13 8 9 22 8 15 2 6 2 5 5 -2 -5 2 -4 -3 -10 -7 -4 -9 -9 -7 -14 -1 -10 -10 0 -17 -4 -9 -21 2 -5
6016erJ2rkJ3rKKnOOk1K0LmMmMkJJ8j2jLLprJ0qJ6mjnm%JnOj2J5j0Oj3Pkj0NN
$$ -5 -14 -2 -11 -13 0 -9 -7 -5 -10 -4 2 -19 1 4 0 4 0 4 2 3 21 9 8 11 14 7 -2 8 0 16 12 11 6 2 2 3 -2 4 -8 7 -3 3 -10 -3 -5 -15 -10 -5
6064epj0J7oPj2J4ljJMkLj4MKJ9k3J2%mMjLj0J8rMJ2j6KOOj8J5mjknoRLmj2PR
$$ -5 -12 -22 -5 -11 -4 -16 -2 -5 -6 -5 -1 -3 0 -14 -10 -8 11 -12 0 0 -4 0 -1 2 -8 10 1 5 17 1 3 9 15 -3 12 8 7 5 0 -6 3 6 2 -10 -3 6
6110FoNlmKoNmnOj2R%j0J2qj2RnJ8r%rK1k8K9nmQpKNoKnLJ4ljPOj4J1j9OjoK9
$$ 6 0 5 2 -2 0 -6 -1 -5 -10 -4 -16 -7 -7 -17 -5 -13 -25 -16 -21 -3 -12 -12 -21 0 -28 1 -4 -8 0 -7 -5 0 -6 -4 -9 -6 8 5 4 11 17 3 14 -5 1 0 -6 23
6158B3k1%nLJ0j5J1jj5K3j2KLj0oQPpmj2J6j8J8npRmmoJ9noKjjj1OJ4j3MoJ6j
$$ 23 2 2 -3 0 10 -5 6 5 -10 13 1 3 6 -4 -10 -2 5 -2 -6 -18 -2 -20 -2 -7 -14 -5 -9 -13 -19 0 -5 -11 -9 -10 -11 -22 -16 -2 -15 -11 -17 -1 -2
6201boRpNRplQj3K7qMj0%Qrj2J0Jk1M2l3%Qj7J4j0MNomOmrJ6j5PRrmRmLJ3rOj2
$$ -2 -8 1 -6 -1 8 1 -2 6 -7 20 12 16 6 6 14 5 -7 3 4 -17 25 -8 -8 0 -17 -3 -13 -9 -4 -10 -14 -8 -12 -21 -5 -20 -13 -4 -13 -17 -8 -12 -9 4 -5 1 -11
6248a1PnLoLOl%LM%kpJ4PlpPjjnOjnRnj7J9nj2J2JJj2MJqOmjKjqkOmOnpNJRp%
$$ -11 -4 -9 -6 -12 -9 -3 -6 -6 -3 1 1 -1 -8 6 13 10 3 10 9 8 3 9 8 3 12 7 -10 9 4 -8 4 5 6 -6 -2 -1 -9 -3 -7 -8 -6 -7 -15 -17 -11 -15 -9 -14 -21 -16 -15 -6 -13 -13
6302a3MJNLmMpmOMJKo%lJ2lj7OLmK4j9PqJ2oJlLpkjNkPj2JJ%Rj7rK0jKnj2N%%
$$ -13 -9 -8 -3 0 -4 0 -7 -11 -5 -1 0 2 -4 -4 -7 5 2 -15 -9 -6 -10 14 -5 2 -6 6 0 1 -2 1 -6 -8 -9 -4 -6 1 -11 -10 -9 -9 0 -17 -26 -6 -7 -5 -10 -22 -17 -17 -17
6353a7Mj2J5%%Rj3LMMjQqN%Qqj4J9pmNRlMj7K0Ok5J3lMrk%PKrqLJ1qnNLmKpQq
$$ -17 -13 -25 -10 -10 -10 -1 -14 -11 -7 -3 -4 4 -4 1 1 9 1 -13 6 -1 -5 0 9 6 10 -7 13 19 -6 7 4 8 -1 -3 -3 4 6 -3 -11 -8 3 -5 -10 -5 -2 -6 -4 -11 -3 -11
6403a1J0knRk3%J6kPqRj3J1rmONj1kJ2J1j7J7j5J1nNLoLKKoOlJ6Jk3jjJ2Lopj0
$$ -11 -1 -3 -8 1 -22 -22 -6 -8 -1 -9 0 -13 -2 -11 -15 -9 -4 -15 -17 -5 6 -11 6 -9 2 -3 2 5 -1 2 4 6 0 6 3 19 20 -3 -4 -5 7 10 4 -3 -13
6448a3%OoJPj7J6oJ1j8J5k%jnlPjpjOlJ2%j3POLLpj0J0njpJ3JpJJ0jKmlKRqLm
$$ -13 -13 -7 -13 -12 -5 -22 -6 -12 -1 -19 -4 -6 -6 -7 -12 -15 -8 -9 -16 -17 -11 -14 -2 -2 -15 -8 -2 1 4 -3 -13 -3 -8 -9 -16 -3 -2 -9 -8 2 1 3 -1 -4 -2 7 -1 2 -2
6497bRJ5k5J2oomqQm%QpO%Jj5nJ6pRnrJ0mRoqJ1Kk0J5Lj1KRnOJ1lj2%kLJ2Ppo
$$ -2 7 22 -3 9 3 -3 -7 -15 -7 -11 -11 -3 -10 -4 -4 -3 -18 -23 -7 -14 -5 -10 -19 -9 -13 -4 -10 -18 -7 -5 -25 -10 -7 -18 -16 -7 -12 -6 5 2 -10 -10 -12 -9 3 10 3 -3
6545ckONj2NmJ0JrJLJ4Jqj4J0pj0J3j5MoPOj0Kj6QJ0pmN%j2J1Kkj1MQkMKNLpq
$$ -3 -5 1 6 -6 -1 -5 5 6 -3 -2 1 15 16 8 -6 4 -3 -13 0 -15 -11 -17 -10 -4 -14 -12 -28 -20 -10 -17 -21 -16 -16 -28 -17 -15 -17 -28 -24 -16 -18 -14 -12 -7 -4 -11 -19
6592a9J2kkJ5j4J0KmPlj2NJ0Oj2NolQpnJ6poJ7j5j2j%%QPOLj4Pj5J1JmNOj3Om
$$ -19 -7 -9 -11 4 -10 0 2 -2 5 2 -10 -5 5 11 -1 4 -2 -5 3 -4 -9 7 0 -6 11 -4 -16 -17 -17 -17 -9 -2 4 7 -7 0 -15 -4 -3 -7 -2 4 -9 -3 -7
6637gqRrNj3PPnJ3mk%lPjLPPqjpKK1mj7PjjLlLNj2RKpp%%j4LRj5J2j7KJ5j1J0
$$ -7 -15 -6 -15 -10 -23 -16 -9 -14 -1 -5 -7 -7 -10 -3 -4 -1 6 13 5 4 -3 -1 20 16 -1 6 5 4 7 4 7 12 0 9 11 4 -3 -3 -3 -17 -14 -5 -20 -8 -25 -23 -8 -19 -9
6686irNjLNk2J2J0j5J3j1J2pKmpRlJ0j3J8qLkQNmrP%mPRj0kNLLjqMLj0JoJ1j3
$$ -9 -18 -13 -14 -11 -6 -28 -16 -6 -21 -8 -19 -7 -14 -12 -16 -23 -14 -17 -7 -20 -2 -10 -7 -9 -1 4 0 -9 -2 -2 -6 1 10 0 -2 3 6 9 8 0 4 7 -3 -2 -8 3 -10
6733a0j1J3j0NoJ6jmrPlJ0pMnRj4J4NnllNj1J4ooNRkJJ0j3mOj3K0pPLj1kMj3J5
$$ -10 -21 -8 -18 -13 -19 -3 -4 -8 -17 -10 -13 -3 -10 -6 -11 -2 -16 -2 3 -2 -5 -8 -3 -14 0 -6 -12 -7 2 0 1 11 -2 -6 0 -13 7 0 7 10 -1 -3 1 -12 3
6778Co%Rj1RkKljrOKlLllJokoJ0%k8K4pJJ3j7LJ4j4MJ0qL%PlmMJ4k2J3pQJ4rq
$$ 3 -3 -3 6 -5 4 2 4 1 0 -9 -3 -1 -4 -1 -4 -7 -6 -12 -14 -20 -10 -10 -38 -14 -21 -20 -7 -24 -21 -7 -21 -17 -7 -15 -12 -12 -5 -8 -12 -8 6 -16 -3 -10 -2 12 3 -5
6826eR%rKkJ7mnlj4J0kRnrJ9j1mJ1j3J5j2RlLj1J5oj1mNnJ1JMj4QJqm%nJJ5j6
$$ -5 4 4 -5 -3 -5 12 8 3 0 -14 -4 -6 3 -2 -11 8 -3 -7 4 -9 6 -6 3 0 3 -8 7 1 -10 -14 -9 -14 -3 -2 2 -12 -4 -3 -11 -15 -15 -20 -19 -4 -20
6871b0QPnqNMNj1K4oj0J5j3J1JrOLj5JKLljLNj1J2j0KNMqj1jJ4lpPpmMmR%qJ%
$$ -20 -12 -5 -10 -18 -13 -9 -4 -15 9 3 -7 8 -5 6 7 -2 4 7 -8 -7 -5 -2 -5 -6 -3 2 -9 3 -7 -5 0 4 -4 -15 -16 -2 -5 -12 -5 -12 -16 -12 -16 -7 -7 -15 -14 -14
6919a4Mj0%K1npk%Pj0ORrPJ1k0M%J1%rJ4omKPrPMlj4QRmmQj0pRKj6M%oLKJ3j1
$$ -14 -10 -20 -20 1 -4 -11 -13 -13 -6 -16 -10 -1 -10 -3 8 -12 -8 -8 3 3 -6 8 2 -2 0 7 -2 5 9 6 -8 0 9 5 1 9 -1 -8 1 3 -13 -9 -9 -15 -12 -10 3 -8
6967hk0RPLkJLKMlj2J3qOkjlK0pj6Rj2J2npPpLK0j4J1mJ4j9kJ8lj4OLpOOpNj8
$$ -8 -28 -19 -12 -9 -11 -10 -7 -5 -1 -4 -16 -3 -11 -5 -7 -8 -11 9 2 -14 -5 -17 -5 -10 -17 -10 -17 -14 6 -8 3 -1 13 -6 -8 10 7 -7 -1 2 -5 1 7 0 5 -13
7013a3J1nO%Oj1lL%r%%J1qpJ5koL%llLqJ1Oj4J0kmRNJj%pqJ4kmPNj2J0%koKKk
$$ -13 -2 -7 -1 -1 5 -6 -9 -6 -6 -15 -15 -15 -4 -12 -19 -4 -6 -12 -9 -9 -12 -15 -12 -20 -9 -3 -17 -7 -9 -13 -4 1 2 1 1 -6 -14 0 -2 -6 1 6 -6 4 4 2 -4 -2 0 -2
7063bjKn%jPnJ2pOqpJ%JqnQNrJ0j6J1kj0J1KOlLml%PkqJ7r%J3rqR%NpmJ1MnJo
$$ -2 -3 -1 -6 -6 -7 0 -5 7 0 6 -2 -9 -8 -8 -7 -15 -20 -12 -7 -16 -6 -22 -11 -13 -23 -12 -10 -4 -7 -4 -8 -11 -11 -4 -6 -14 3 -6 -6 7 -2 -10 -1 -1 4 -3 -7 4 8 3 4 -2
7115b%JKOrPj2KmjoJ4j0J3j8Nnj0J9kj0J6onK%kmJ5mmQKkk2PJ1OrKKjj3K6j2m
$$ -2 -2 -1 1 7 -2 5 -7 -5 -9 -10 -16 -2 -12 1 -17 -12 -17 -27 -8 -10 -20 -4 -10 -15 -13 -13 -15 -19 -4 -8 -12 -4 -2 -4 -26 -19 -8 -2 -11 -9 -7 -8 -21 5 -7 -11
7161a1MjPJ0qQqoRqJ4olpPkQj2jNlMrLlj0RnnNpQJ2j2JmjjMpK0kj4Lj4K2jlJ2
$$ -11 -7 -8 -1 9 1 9 1 -5 4 -4 10 4 1 -6 1 -1 7 -5 -6 -1 -4 0 -9 -6 -9 -19 -10 -15 -20 -15 -22 -14 -2 -14 -13 -17 -18 -19 -15 -22 -2 -4 -18 -15 -29 -7 -8 -11 1
7210AoLkmQj5oJ5jjQLnOLj7J6j5K1mKnj0PMpKqRj1J2lrPqLnRlNj2ljOnj0NmJ0
$$ 1 -5 -2 -4 -8 0 -15 -21 -6 -7 -8 0 3 -2 4 7 -10 6 -9 12 8 10 5 -5 2 6 -1 1 -7 2 -9 3 0 -9 -2 -10 -7 -12 -3 -6 -1 -13 -16 -17 -11 -16 -26 -21 -25 -15
7259a5lNJ%NqkRrJ9rkPj1oJ4jOKqJ3j2jOokrPJ5Oj8QoLQk1J4kMPj1KOj4OJoNj2
$$ -15 -18 -13 -12 -12 -7 -15 -17 -8 -17 2 -7 -9 -2 -13 -19 -5 -6 0 2 -6 7 -5 -6 0 -6 -8 -17 -10 5 11 -7 1 -5 -2 6 -15 -1 -3 1 8 -3 -1 5 -9 -3 -2 -8 -3 -15
7308a5NmJ0j2jOlj2MnJ3QjoNNmj3J3Pj4OOQj1J9j8J8j7j0J0LM%MrKKJnKMj0Op
$$ -15 -10 -14 -4 -16 -17 -11 -14 -26 -22 -27 -14 -6 -7 -13 -8 -3 -7 -20 -7 0 -14 -8 -2 6 -5 14 -4 14 -3 -13 -3 0 4 4 8 -1 1 3 4 -1 1 5 -5 1 -6
7353frkOqONk%J0pQJoj6NRmpkJPPj9K1j9J2jk2K9j3J0JLkJooK0j0LMnKP%kNmQ
$$ -6 -15 -17 -11 -19 -13 -8 -10 -10 0 -7 1 2 -4 -20 -15 -6 -10 -17 -19 -18 -11 -4 -23 -2 -21 -9 -10 -32 -3 -16 -6 -5 -2 -4 -3 -9 -15 5 -5 -2 2 -3 -1 6 6 4 9 5 13
7402A3j6L%kJ1nppJ7rj6QjJ5j2NrJ0oQj1j%K%%Qj0LNmnQ%KKlOqKPjqj1J7kKnj2
$$ 13 -3 0 0 -2 9 4 -3 -10 7 -2 -18 -10 -11 4 -8 -3 -12 -2 -8 0 -11 -12 -12 -10 -10 -10 -2 -12 -9 -4 -8 -13 -5 -5 -3 -1 -4 2 -6 -4 3 2 -6 -17 0 -2 0 -5 -17
7451a7J7J2j7J8j4K%OLlj0J5j2mOj%%j3K0pnJ%njjlj%Ko%KJ1j4J1j4RNmMj0J8
$$ -17 0 12 -5 13 -1 1 1 7 10 7 -3 12 0 -4 2 1 1 1 -12 8 1 -4 -3 -3 -8 -9 -10 -13 -14 -14 -12 -18 -18 -16 -5 -19 -8 -22 -13 -8 -12 -8 -18 0
7495@jj3RM%pPJMmJpOMolNnjJQOj1J1j0mJ2m%jj4J0%klJJ3j2KonkJ3j1LrJ1qn
$$ 0 -1 -14 -5 -1 -1 -8 -1 0 4 0 1 -6 0 4 -2 -5 0 -5 -6 -5 3 9 -2 9 -1 -5 7 3 3 2 -12 -2 -2 -4 -7 -6 7 -5 -3 -9 -14 -16 -3 -14 -11 -20 -9 -17 -22
7544b2nJ0kLLkJLoPLlK2j7mJ6rJ3j9KQj0Nj%NoJ1nMj0J1knK2j1lk1J7okkQpKn
$$ -22 -27 -17 -19 -16 -13 -15 -14 -11 -17 -10 -7 -10 12 -5 -9 7 -2 11 -8 -6 2 -8 -3 -4 -4 1 -5 6 1 5 -5 6 4 -1 21 10 7 -14 3 -3 -5 -7 1 -6 -4 -9
7590iOj0LJQmpRj8JJ7Nj9jJ5pqNnPNMKn%lNJ2nJ4mrkLmJJ3ljjnLnJ5j9qL%K2k0
$$ -9 -3 -13 -10 -9 -1 -5 -12 -3 -21 -20 -3 2 -17 -18 -3 -10 -18 -13 -18 -11 -6 -2 0 -5 -5 -8 -3 9 4 18 14 5 3 6 2 3 16 13 12 11 6 9 4 19 0 -8 -5 -5 17 -3
7640cLqqNOOj3OLrOpJ1ojoOJNj3%J0pJ5j9LjKoQLRomQ%MkQnoj0J8KRk2Q%OJ7j3
$$ -3 0 -8 -16 -11 -5 1 -12 -6 -3 -12 -6 -13 -2 -8 -9 -15 -9 -8 -3 -16 -16 -6 -13 2 -17 -14 -15 -13 -19 -11 -8 1 -5 -9 -1 -1 3 1 9 4 -2 -12 6 8 17 -5 3 3 9 26 13
7691A3oKj1MjJ0j7j3OJ5j4mJRj1Kj9K2mMRj4MPlJ1mrQlnJ0jqQj3J0J5j6ORpLJ2
$$ 13 7 9 -2 2 1 11 -6 -19 -13 2 -12 -16 -15 -6 -17 -15 -34 -12 -16 -12 -3 -17 -13 -6 -9 2 -2 -11 -3 -6 -11 -1 -2 -10 -2 -15 -5 10 -6 0 9 2 5 17
7735A7pj3J1ppJ0OnoJ5oprJ6%lLKk1K3j7KMj1rJ8pkmKKj1RKjJj5PlJ4j1J4j4J2
$$ 17 10 -3 8 1 -6 4 10 5 -1 14 8 1 -8 8 8 5 8 10 -11 12 -5 -3 1 -10 -19 -1 -8 -10 -14 -12 -10 -21 -12 -10 -11 -10 -25 -18 -21 -7 -18 -4 -18 -6
7779fmNLN%KoJQPlLj6LJ%JmLLj3J9pmmNOj6J3kOoQkoj1MmkNMj2Pjj3J1nOpQlj
$$ -6 -10 -5 -2 3 3 5 -1 0 8 15 12 15 -1 2 3 3 4 0 3 6 -7 12 5 1 -3 2 8 -8 5 3 9 3 11 9 3 -8 -4 -8 -10 -5 -1 -13 -6 -7 -20 -9 -14 -8 -15 -7 -10 -11
7831a1jkJ8j2J5j0kNqJ4LmkoKJ4j2LllJ7j0JjplQJJ4k2LrOPjj7J5k0RQj4J9j1
$$ -11 -12 -14 4 -8 7 -3 -5 0 -8 6 9 5 3 -3 -1 13 1 4 1 -2 15 5 6 5 -2 -5 3 4 18 -4 -1 -10 -4 3 2 -15 0 -20 -11 -3 -17 2 -9
7874iKNKmj0RKlkKkNqNJlKj2LKJ6j6OPLJkoQ%J3j0LOJj1OLJj3mJ4kj3J7j0jJ3
$$ -9 -7 -2 0 -4 -14 -5 -3 -6 -8 -6 -8 -3 -11 -6 -5 -8 -6 -18 -15 -13 3 -13 -7 0 3 4 2 -4 4 4 17 7 10 16 17 6 12 15 16 3 -1 13 11 -2 15 5 4 17
7922A7l5K6j2mpKJ3rj8J8Kj4J1lKj1J0%JMj9J1K0j6j0J6j1K3orJ7k2J1Kj2RJ0
$$ 17 -18 8 -4 -8 -15 -13 0 -9 -27 -9 -7 -21 -10 -13 -11 -22 -12 -12 -11 -7 -26 -15 5 -11 -21 -5 -16 7 1 -8 9 -13 -2 0 -12 -3 7
7959GrmJ0rJ0mLJ1j6Qj0QNrPJPj5%Qj1PnJlMj9MoLRnJ7k8J2j1NJ0koMkQRj3JN
$$ 7 -2 -6 4 -5 5 1 4 15 -1 7 -3 5 10 1 8 9 16 1 1 9 -2 5 0 1 -2 2 -17 -13 -19 -16 -7 -12 5 -23 -11 -22 -17 -7 -9 -15 -11 -13 -5 4 -9 -8 -3
8006cQj8PPrRJ1jj4J5j7NOlM%kJlLnj4J9j0MLlO%jKm%oo%JNpJ2j3MmPj4PJ3j2
$$ -3 5 -13 -6 1 -8 1 12 11 -3 12 -5 0 6 3 7 7 5 6 3 6 1 -13 6 -4 0 3 0 6 6 5 7 3 3 -3 -9 -9 -8 -3 -10 2 -11 -7 -11 -4 -18 -11 2 -10
8054a0mQkqOj2lJ3%NlJ2pKjLJjRj4K0pJ1pQj8Rj%llqJ4j8lJ9j3J5j0Qj0mQnJ3
$$ -10 -14 -6 -8 -16 -10 -22 -25 -12 -12 -7 -10 2 -5 -3 -4 -1 0 -1 8 -6 14 7 18 11 19 1 10 9 9 6 3 -5 9 -9 -12 7 -6 9 -1 7 -3 -7 1 -4 9
8099Ij0j0J0pJqLMKJlP%Rj7jOnmJ0qJ9j2J0j1Qj9QQLkmPPLrJ1Jj5NQj4J0j0Pr
$$ 9 -1 -11 -1 -8 -7 -15 -12 -8 -6 -5 -8 -1 -1 8 -9 -10 -4 -9 -13 -3 -11 8 -4 6 -5 3 -16 -8 0 3 1 -3 4 11 14 5 16 17 2 7 15 1 11 1 8 -1
8145aJnnNOOqOqr%QJJqJr%OmMKQkppRJ0JknPpQLnnRj7K0kNjK%q
$$ -1 0 -5 -10 -5 1 7 -1 5 -3 -12 -12 -4 -3 -2 -10 -9 -18 -18 -12 -16 -12 -10 -2 -4 -11 -18 -9 1 2 0 -5 2 -5 3 6 1 -4 5 -12 8 6 11 10 12 12 4
8191D
##END NTUPLES=NMR FID
##END=
