##TITLE=1H_B450306
 CDCl3
 8 sc, 
 4.6.2024
##JCAMPDX= 6.0         $$ Bruker NMR JCAMP-DX V2.0
##DATA TYPE= NMR FID
##DATA CLASS= NTUPLES
##ORIGIN= UXNMR, Bruker Analytische Messtechnik GmbH
##OWNER= root
$$ XWIN-NMR		Version 3.5
$$ Tue Jun  4 14:13:08 2024 Russian Standard Time (UT+4h)  she@DPX200
##.OBSERVE FREQUENCY= 200.1309
##.OBSERVE NUCLEUS= ^1H
##.DELAY= (6, 6)
##.ACQUISITION MODE= SIMULTANEOUS
##.ACQUISITION SCHEME= undefined
##.AVERAGES= 8
##.DIGITISER RES= 18
##SPECTROMETER/DATA SYSTEM= spect
##.PULSE SEQUENCE= zg30
##.SOLVENT NAME= CDCl3
##.SHIFT REFERENCE= (INTERNAL, CDCl3, 0, 15.7039)
##AUDIT TRAIL= $$ (NUMBER, WHEN, WHO, WHERE, WHAT)
$$ ##TITLE= Audit trail, XWIN-NMR		Version 3.5
$$ ##JCAMPDX= 5.01
$$ ##ORIGIN= Bruker BioSpin GmbH
$$ ##OWNER= she
$$ F:/spectra/data/she/nmr/H-F/1/audita.txt
$$ ##AUDIT TRAIL=  $$ (NUMBER, WHEN, WHO, WHERE, WHAT)
(   1,<2024-06-04 14:11:52.14 +0400>,<she>,<DPX200>,
      <created by zg, POWCHK disabled, PULCHK disabled
       configuration hash MD5:
       00 E9 B6 7A A2 85 ED C7 34 08 36 98 17 FE 4E 26
       data hash MD5: 16K
       FE 3B 08 0A E1 55 2D CF 6D FE 4D 84 69 AE 06 86>)
$$ ##END=
$$ 
$$ hash MD5
$$ 91 B6 69 6E 8C 00 C7 A3 6A A8 77 91 CF 2F FD 98
##$RELAX= 
##$RELAX= 
##$RELAX= 
##$RELAX= 
##$RELAX= 
##$RELAX= 
$$ Bruker specific parameters
$$ --------------------------
##$DU= <F:/spectra>
##$EXPNO= 1
##$NAME= <H-F>
##$PROCNO= 1
##$TYPE= <nmr>
##$USER= <she>
##$AMP= (0..31)
100 100 100 100 100 100 100 100 100 100 100 100 100 100 100 100 100 100 
100 100 100 100 100 100 100 100 100 100 100 100 100 100 
##$AQSEQ= 0
##$AQ_mod= 1
##$AUNM= <au_zg>
##$AUTOPOS= <>
##$BF1= 200.13
##$BF2= 200.13
##$BF3= 200.13
##$BF4= 200.13
##$BF5= 200.13
##$BF6= 200.13
##$BF7= 200.13
##$BF8= 200.13
##$BYTORDA= 1
##$CFDGTYP= 0
##$CFRGTYP= 5
##$CHEMSTR= <none>
##$CNST= (0..31)
1 1 145 1 1 1 1 1 1 1 1 1 1 1 1 1 1 1 1 1 1 1 1 1 1 1 1 1 1 1 1 1 
##$CPDPRG= <>
##$CPDPRG1= <>
##$CPDPRG2= <>
##$CPDPRG3= <>
##$CPDPRG4= <mlev>
##$CPDPRG5= <mlev>
##$CPDPRG6= <mlev>
##$CPDPRG7= <mlev>
##$CPDPRG8= <mlev>
##$CPDPRGB= <>
##$CPDPRGT= <>
##$D= (0..31)
0 1.2 0 0 0 0 0 0 0 0.06 0 0.03 0 0 0 0 0.0002 0 0 0 0 0 0 0 0 0 0 0 0 
0 0 0 
##$DATE= 1717495911
##$DBL= (0..7)
120 120 120 120 120 120 120 120 
##$DBP= (0..7)
150 150 150 150 150 150 150 150 
##$DBP07= 0
##$DBPNAM0= <>
##$DBPNAM1= <>
##$DBPNAM2= <>
##$DBPNAM3= <>
##$DBPNAM4= <>
##$DBPNAM5= <>
##$DBPNAM6= <>
##$DBPNAM7= <>
##$DBPOAL= (0..7)
0.5 0.5 0.5 0.5 0.5 0.5 0.5 0.5 
##$DBPOFFS= (0..7)
0 0 0 0 0 0 0 0 
##$DE= 6
##$DECBNUC= <off>
##$DECIM= 32
##$DECNUC= <off>
##$DECSTAT= 4
##$DIGMOD= 1
##$DIGTYP= 9
##$DL= (0..7)
0 120 120 120 120 120 120 120 
##$DP= (0..7)
150 150 150 150 150 150 150 150 
##$DP07= 0
##$DPNAME0= <>
##$DPNAME1= <>
##$DPNAME2= <>
##$DPNAME3= <>
##$DPNAME4= <>
##$DPNAME5= <>
##$DPNAME6= <>
##$DPNAME7= <>
##$DPOAL= (0..7)
0.5 0.5 0.5 0.5 0.5 0.5 0.5 0.5 
##$DPOFFS= (0..7)
0 0 0 0 0 0 0 0 
##$DQDMODE= 0
##$DR= 18
##$DS= 0
##$DSLIST= <SSSSSSSSSSSSSSS>
$$ [...]
##$SUBNAM2= <"">
##$SUBNAM3= <"">
##$SUBNAM4= <"">
##$SUBNAM5= <"">
##$SUBNAM6= <"">
##$SUBNAM7= <"">
##$SUBNAM8= <"">
##$SUBNAM9= <"">
##$SW= 18.0517689322627
##$SWIBOX= (0..15)
0 0 2 0 0 0 0 0 0 0 0 0 0 0 0 0 
##$SW_h= 3612.71676300578
##$TD= 16384
##$TD0= 1
##$TE= 0
##$TE2= 300
##$TE3= 300
##$TEG= 300
##$TL= (0..7)
0 120 120 120 120 120 120 120 
##$TP= (0..7)
150 150 150 150 150 150 150 150 
##$TP07= 0
##$TPNAME0= <>
##$TPNAME1= <>
##$TPNAME2= <>
##$TPNAME3= <>
##$TPNAME4= <>
##$TPNAME5= <>
##$TPNAME6= <>
##$TPNAME7= <>
##$TPOAL= (0..7)
0.5 0.5 0.5 0.5 0.5 0.5 0.5 0.5 
##$TPOFFS= (0..7)
0 0 0 0 0 0 0 0 
##$TUNHIN= 0
##$TUNHOUT= 0
##$TUNXOUT= 0
##$USERA1= <user>
##$USERA2= <user>
##$USERA3= <user>
##$USERA4= <user>
##$USERA5= <user>
##$V9= 5
##$VALIST= <valist>
##$VCLIST= <CCCCCCCCCCCCCCC>
##$VD= 0
##$VDLIST= <DDDDDDDDDDDDDDD>
##$VPLIST= <PPPPPPPPPPPPPPP>
##$VTLIST= <TTTTTTTTTTTTTTT>
##$WBST= 1024
##$WBSW= 4
##$XGAIN= (0..3)
0 0 0 0 
##$XL= 0
##$YL= 0
##$YMAX_a= 409962
##$YMIN_a= -451574
##$ZGOPTNS= <>
##$ZL1= 120
##$ZL2= 120
##$ZL3= 120
##$ZL4= 120
##$ABSF1= 10
##$ABSF2= 0
##$ABSG= 5
##$ABSL= 3
##$ALPHA= 0
##$AQORDER= 0
##$ASSFAC= 0
##$ASSFACI= 0
##$ASSFACX= 0
##$ASSWID= 0
##$AUNMP= <proc_1d>
##$AZFE= 0.1
##$AZFW= 0.1
##$BCFW= 1
##$BC_mod= 2
##$BYTORDP= 1
##$COROFFS= 0
##$CY= 11.3945322036743
##$DATMOD= 1
##$DC= 2
##$DFILT= <>
##$DTYPP= 0
##$F1P= 15.6554695791079
##$F2P= 12.8336369535428
##$FCOR= 0.5
##$FTSIZE= 0
##$FT_mod= 4
##$GAMMA= 1
##$GB= 0.15
##$INTBC= 1
##$INTSCL= 1
##$ISEN= 128
##$LB= 0.24
##$LEV0= 0
##$LPBIN= 0
##$MAXI= 10000
##$MC2= 0
##$MEAN= 0
##$ME_mod= 0
##$MI= 1.114404
##$NCOEF= 0
##$NC_proc= 0
##$NLEV= 6
##$NOISF1= 3.799351
##$NOISF2= 2.8
##$NSP= 1
##$NTH_PI= 0
##$NZP= 0
##$OFFSET= 15.70392
##$PC= 1
##$PHC0= -25474.87
##$PHC1= 14.38748
##$PH_mod= 1
##$PKNL= yes
##$PPARMOD= 0
##$PSCAL= 0
##$PSIGN= 0
##$REVERSE= no
##$SF= 200.130013532006
##$SI= 16384
##$SIGF1= 3
##$SIGF2= 2
##$SINO= 400
##$SIOLD= 16384
##$SREGLST= <1H.CDCl3>
##$SSB= 0
##$STSI= 0
##$STSR= 0
##$SW_p= 3612.71676300578
##$SYMM= 0
##$S_DEV= 0
##$TDeff= 0
##$TDoff= 0
##$TI= <>
##$TILT= no
##$TM1= 0
##$TM2= 0
##$TOPLEV= 0
##$USERP1= <user>
##$USERP2= <user>
##$USERP3= <user>
##$USERP4= <user>
##$USERP5= <user>
##$WDW= 1
##$XDIM= 8192
##$YMAX_p= 0
##$YMIN_p= 0
$$ End of Bruker specific parameters
$$ ---------------------------------
##NTUPLES= NMR FID
##VAR_NAME=  TIME,          FID/REAL,        FID/IMAG
##SYMBOL=    X,             R,               I
##VAR_TYPE=  INDEPENDENT,   DEPENDENT,       DEPENDENT
##VAR_FORM=  AFFN,          ASDF,            ASDF
##VAR_DIM=   8192,          8192,            8192
##UNITS=     SECONDS,       ARBITRARY UNITS, ARBITRARY UNITS
##FACTOR=    0.0002768,     1,               1
##FIRST=     0,             0,               0
##LAST=      2.2672688,     0,               0
##MIN=       0,             -451574,         0
##MAX=       2.2672688,     409962,          0
$$ Real data points
##PAGE= N=1
##DATA TABLE= (X++(R..R)), XYDATA
0@%%%%%%%%%%%%%%%%%%%mJ2j6J6j6J7k1K6l0L7m5M9n5O6p6Q5r7J12j27J41j56
40h2J78k02K23k49K79l08L38l75M17m60N06n57O15o77P43q15Q96r85J081j186
60f20J303j432J566j701J820j868J683o87l922M7877L65199l74269m68308M43445
74A0086L80896m45200l37954M53034K91258m34382k64079M40341K52391m39412
84i3021k42805M61914K20221m86993j91844N10987J44037n26043r2936N28464
94B31981L4471n15917J2578M90828n0718m61316P4302M35877r0585m15793J00895
105a53397M04469j13561m01677J31607M04383j55931l99939J91188L93547k24927
115G5762l74657K60091L48019k91196l14797L10422K75515l23065k45296L22548
$$ y = [0, 0, 0, 0, 0, 0, 0, 0, 0, 0, 0, 0, 0, 0, 0, 0, 0, 0, 0, 0, -4, 8, -8, 8, -8, 9, -12, 14, -16, 21, -24, 25, -30, 36, -40, 45, -52, 60, -67, 74, -82, 96, -106, 117, -132, 147, -161, 177, -198, 219, -241, 265, -292, 323, -354, 389, -426, 470, -515, 566, -620, 683, -749, 817, -884, 936, -932, 751, 64, -3858, 44019, 409218, 34949, -433359, 10086, 390982, -54218, -392172, 60862, 352120, -82262, -346341, 94000, 346391, -93021, -335826, 126088, 346309, -140684, -332528, 178459, 322496, -203547, -296483, 231981, 266452, -249465, -236887, 253941, 203223, -258093, -183791, 252086, 161501, -254292, -153397, 251072, 137511, -264166, -132559, 271824, 115893, -284046, -92858, 300689, 75762, -298895, -38804, 309215, 18019, -296778, 13644, 289159, -33906, -279202, 43346]
125D3346K17151l21988j99524L20171J89428l20503j79974L33181J72659l49045
135i5098j53663L70105J27177l86446r3266L94052N2892l93255j5607L79254j7039
146A69106l59967L8337L40855n0777l27140N9379L21424o7026l22679P9833L28685
157B10030j01486l33379J32109L30032j66896l16440K00827K94809k28043k66591
167b45028K47530K37125k56735k11498K58743J92865k61339j81874K65981J72341
177B18111k77226j62813K93403J48885l12631j26840L31410R7572l42454o2391
187a94974L45725K7944l40074L829L28133k9984l13329M8336K99020o1388k89620
198a76382P2382K84389q5793k81959J02657K79651j24122k74893J49382K64637
$$ y = [43346, 260497, -61491, -261015, 59156, 248584, -71919, -251893, 81288, 253947, -95098, -248761, 121344, 248521, -137925, -231191, 162861, 215753, -177502, -193109, 186145, 169106, -190861, -152524, 188331, 137554, -189586, -130207, 191217, 124191, -198488, -118655, 210030, 108544, -224835, -92726, 237306, 70410, -246030, -45203, 249606, 21563, -245028, 2502, 239627, -17108, -228606, 30137, 223002, -38337, -220211, 45770, 218111, -59115, -221928, 71475, 220360, -92271, -219111, 112299, 209871, -132583, -194974, 150751, 178695, -161379, -157550, 170583, 140599, -172730, -124394, 174626, 113238, -176382, -104000, 180389, 94596, -187363, -84706, 194945, 70823, -204070, -54688, 209949]
208B09949j76142k47170J99561K24791k17129j99692K28839J75169k34649j52736
218a89209K36197J35339k36447j22957K39185J12813k46019j01857K55345Q8121
228A70511k66045p0127K76374M6576k82079j9876K81324o870k73976K9548K62407
239A47767m7675k49483O0176K37183o8098k28712P4449K25498q2841k24731R6036
250f0431K23854j12828k19823J32709K11333j53248j97015J70519J77795j82407
260i542j57847J88332J40085j90642j26039J91486J16090j93327j09550J98749
270D7795J03974k08798r5635K21325Q2161k33599o4244K43107M3011k48325j9698
281a28926K48173k333k42647K0953K35171l4871k28146M6191K22750n6449k19761
$$ y = [209949, 33807, -213363, -13802, 210989, -6140, -205832, 23007, 198176, -36473, -189209, 46988, 182327, -54120, -177077, 62108, 174921, -71098, -172955, 82390, 170511, -95534, -165661, 110713, 157289, -124790, -144666, 136658, 129788, -144188, -114640, 147767, 100092, -149391, -89215, 147968, 79870, -148842, -74393, 151105, 68264, -156467, -60431, 163423, 50595, -169228, -36519, 174814, 21566, -175449, -4930, 172865, -9542, -167389, 20943, 161028, -29614, -155653, 35833, 151923, -41404, -150954, 47795, 151769, -57029, -152664, 68661, 150822, -82777, -147021, 96086, 139097, -109228, -128926, 119247, 116914, -125733, -104780, 130391, 95520, -132626, -86435, 136315, 79866, -139895]
292a39895O6652K18461p9276k18127R5331K15406j14141k08701J33253J97911
302A66874j51004j83110J66297J65479j77223j46741J83271J29811j86155j16052
312a48553J88428J04780j91319r5309J95702Q6640k02862p6388K12215O2539k21481
323h5608m4452K27852K3905k29942k360K27685j8352k21050L5854K11443m8639
334G6336k02215N7448J95524o5077j91770P3056J89975q3444j89084R7468J86712
345A44929j14463j79711J32372J67524j47753j51448J59083J33477j65409j15871
355a37270J67110J00814j65945r0148J64849Q3205j66367p7048J70851O9919j77477
366e7507o0378J84781M7172j91352l0887J93808J3092j92367L511J87451j7062
$$ y = [-139895, -73243, 145218, 65942, -152185, -56854, 158552, 44411, -164290, -31037, 166874, 15870, -167240, -943, 164536, -12687, -159428, 23843, 153654, -32501, -148553, 39875, 144655, -46664, -141973, 53729, 140369, -62493, -138881, 73334, 135873, -85608, -130060, 97792, 121697, -108245, -110605, 117080, 98728, -122322, -86468, 124975, 76336, -125879, -68431, 127093, 62016, -129754, -56698, 133277, 49833, -139251, -41783, 144929, 30466, -149245, -16873, 150651, 2898, -148550, 10533, 144010, -21399, -137270, 29840, 130654, -35291, -125439, 39410, 122615, -43752, -120800, 50051, 119970, -57507, -117885, 66896, 114068, -77284, -108171, 85637, 98729, -93638, -90127, 97324, 80262]
377H0262j80773K8125J74288l5852j68535M1978J66067m7960j65909N6356J66166
388A14213o7338j66137P9957J63705r4611j58544J09266J49840j22512j38087
398a30248J32523J25492j39538j13082J44348J01858j47475r2315J49811Q4800
408A16174j53597p8214J59485P0572j66574o0481J74269M8181j80893l2745J85323
419H1500J5189j85709K332J81703j8019j75507L0415J68179m0180j61698M7532
430e4263J56950n3725j55029O1822J54939p2477j53664Q5896J49804j00652j42598
441a22997J15006J31583j27661j17479J35997J02422j40112q9188J41576P8861
451A08008j42117p0506J43456O4167j46624n8038J52119N0150j58873l9099J64467
$$ y = [80262, -100511, -72386, 101902, 66050, -102485, -60507, 105560, 57600, -108309, -51953, 114213, 46875, -119262, -39305, 124400, 29789, -128755, -19489, 130351, 7839, -130248, 2275, 127767, -11771, -124853, 19495, 121353, -26122, -118437, 31374, 116174, -37423, -115637, 43848, 114420, -52154, -112635, 61634, 109815, -71078, -103823, 81500, 96689, -89020, -86688, 95015, 76996, -98511, -68096, 100083, 59903, -101795, -54263, 102687, 48962, -106067, -44245, 110694, 38217, -115447, -29551, 120253, 19601, -122997, -7991, 123592, -4069, -121548, 14449, 116871, -23241, -112429, 29147, 108008, -34109, -104615, 38841, 103008, -43616, -101654, 50465, 100615, -58258, -97357, 67110]
462F7110K5228j67565j0082J67008n010j63561J9097J57048l0258j49641L8335
473e2291J43281m4522j38651N0423J35262n6287j32705O3222J30918p2161j27869
484a01380Q2579J22879r3261j15702J02857J06807j11135r6807J17418Q5972j21207
495b0980p5867J22890O7610j24186o1002J26276N5283j29277m9997J33609M4061
506H8420j39390l5953J45096K5071j48988j2298J50366r65j48854J3671J45090
517H1266k4489j39434L2329J33879l7830j30117M2323J28281m8030j27461N5370
528c3913J27044o4985j25406P6649J21272q8628j13750R9240J03559j07135r2863
539i8916J12333Q1829j15601p2414J17437O5039j19241n9300J22827N4257j27709
$$ y = [67110, 92338, -75227, -85309, 81699, 76689, -86872, -67775, 89273, 59015, -90626, -52291, 90990, 46468, -92183, -41760, 93502, 37215, -95490, -32268, 98650, 26489, -101380, -18801, 104078, 10817, -104885, -2028, 104779, -6356, -103163, 14255, 100227, -20980, -96847, 26043, 93653, -30533, -91535, 34741, 90024, -39253, -89250, 44359, 88420, -50970, -86923, 58173, 83244, -65744, -78042, 72324, 71359, -77495, -63824, 81266, 56777, -82657, -50328, 83551, 45721, -84396, -42073, 86208, 38178, -89283, -33913, 93131, 28146, -97260, -20611, 100661, 12033, -101717, -2477, 101082, -6053, -98916, 13417, 95246, -20355, -92769, 24668, 89707, -29534, -88834, 33993, 88250, -39459]
550c9459m7467J33686L9191j39191k8589J43795J5655j46515j885J45624j1538
561F3307j42679K2605J37929l1942j32590L9630J27544m5721j23135N1650J20439
572H7037n8331j17967O6448J14654p5499j09888Q4481J03305r3391r4247J00787
583G389Q3681j05453p2693J08080O2850j09165n4581J09181M7660j09433m2483
594g4967J10216L7449j12890l1688J16448K4293j19574j5200J22359N563j23268
605f1259N133J22183j5216j18958K3802J14150l0665j09982L6002J06154m0828
616C0516j03477M5322J02033n0143j01165N6993R9824o4777r6691P3299R1445
627H3179q1587q4633Q8514P5925r3811o6779R6278N8538r7014n1903R7593M6851
$$ y = [-39459, -86926, 46760, 85951, -53240, -81829, 61966, 77621, -68894, -70779, 74845, 63307, -79372, -56767, 81162, 49220, -83370, -43740, 83804, 38083, -85052, -33402, 87037, 28706, -89261, -22813, 91841, 16342, -93546, -9065, 94240, 849, -93398, 7389, 91070, -14383, -87076, 21004, 83854, -25311, -79892, 29289, 76949, -32484, -74967, 35249, 72698, -40192, -71880, 44568, 68861, -50713, -65913, 56446, 62009, -61259, -56126, 66057, 50841, -68117, -44315, 69835, 39170, -70812, -34810, 71344, 30516, -72961, -27639, 74394, 24251, -76914, -19921, 79903, 15126, -81565, -8266, 83179, 1592, -83041, 5473, 81398, -12413, -79192, 17086, 75624, -21390, -73293, 24300, 71151]
639G1151r8430m2244J00632L7999j04237l2895J09047K5582j13805j6295J16571
650E3076N746j17052M899J15422j4877j11840K3307J07591k9536j03907L4572
661c2599J01449l9491j00356M5083R9209n1824r8062N9860R5801o9105r1205P8335
673b905Q4642q6020p6487R2154O7815r6368n8985R8791N0645j00014m3726J00828
685C0370L7760j02447l1947J04602K5882j06902j9144J09397J1355j11431k052
696e4557J11850q056j10406J7812J07104k6783j02586L4315R7221m0062r1901
707f6049M4185Q7748m7476q4824N1479Q2810n6507q0487O2491P7690o9464p3525
719g1929P6771O6887q2840n8866Q6799N0467q8854m2599Q9304L5663q8794l0540
$$ y = [71151, -27279, -69523, 31109, 69108, -35129, -68024, 41023, 66605, -47200, -63495, 53076, 58822, -58230, -53331, 62091, 47214, -64626, -41319, 66272, 36736, -67171, -32599, 68850, 29359, -70997, -25914, 73295, 21471, -76591, -16731, 79070, 9965, -81240, -2905, 81737, -4283, -80770, 11384, 79199, -17169, -76154, 22637, 73282, -26732, -70458, 30370, 68130, -34317, -66264, 38338, 64220, -42682, -61826, 47571, 58926, -52505, -54557, 57293, 49237, -61169, -43357, 63747, 36964, -65622, -31307, 65914, 25852, -66049, -21864, 65884, 18408, -66416, -14937, 67873, 11366, -69121, -6630, 71060, 1596, -71929, 4842, 71729, -11111, -69977, 16822, 67289, -21565, -64164, 25140, 60803, -27991, -58531]
731e8531Q8333K6954q9030k3752R1248J9733r4070j4181R6802P304r8573O96R9149
744E2082r451r7422J7344R4135k3796r0371K8813Q6852l3078q3882L6712Q1574
756E9512m0285q0319M4767P9296n0528p7474N7116P4408o3795p0219P0435O4544
768F7458p6148n7823Q0615N0672q3520m3791Q5390L7718q6899l2156Q8138K7240
780E6894q9669k2767R2108J7676r4993j1402R7646L801r9268M510R9576j3350
792D0762r8341K2210R4964k9876r0415L5790Q5833m0368q1732M4151P8260m7521
804A3717p5781N1618P3770n6663p1375O3110O7291o9567o1616P5396N4535p9794
816a5359m6717Q2698L8570q3724l1419Q3439K5632q3195k0994Q3524J6716q4644
$$ y = [-58531, 29802, 56756, -32274, -56026, 35222, 54955, -39115, -53296, 43506, 50810, -47763, -47067, 52082, 42631, -54791, -37447, 56688, 32892, -57479, -28666, 58186, 25108, -58774, -22062, 59512, 19227, -61092, -16325, 62971, 12443, -65031, -7915, 66493, 2698, -67521, 2914, 67458, -8690, -66513, 14102, 64774, -18746, -62537, 22853, 60571, -26328, -58484, 29654, 56894, -32775, -55542, 36566, 54242, -40751, -52153, 45493, 49294, -49974, -45464, 54112, 40762, -57579, -35369, 59595, 29719, -60696, -24906, 60927, 20559, -61173, -17022, 61238, 13717, -62064, -10446, 63324, 6661, -64714, -1604, 65687, -3880, -65496, 9900, 64435, -15359, -62076, 20622, 59192, -24532, -55951, 27488, 53120, -30075, -51069, 32455, 49171, -35473]
828c5473j2294Q6330P178q8399o61Q9998p028q9792J5056Q8110k2615q4995K9246
841b5339Q0946l4649p6533L8643P2280m1453o9261M4284O6797m7608o4402N1323
853d972O2003n5598n9044O0349N4967o4958m9700O8623M3633p1136l7710P2761
865A9218L1802p3441k6420P3627K1927p3565j8290P4241J4768p5525j0847P7183
877C4678O292p8930j091Q0598n309q1331J2437Q0655j9301p8719K5587P6032l1033
890B0565p2917L5551O9638l9183o7187M2523O5267m6440o3635N1094O1514n6257
902E33n8528O1928N4436o7448m8685P2227M1912p5192l4839P6662K8277p7340
914b6057k2357P7166J7356p7047j3285P7448R143p8692m404Q0251j385q1333Q116
$$ y = [-35473, -47767, 38563, 45741, -42658, -43319, 46679, 39651, -50141, -35085, 53025, 30410, -54585, -25339, 55607, 20958, -55575, -16932, 55348, 13895, -55366, -11082, 55715, 8107, -56295, -4972, 57031, 1433, -57611, 2738, 57705, -7253, -56953, 11670, 55303, -15833, -53543, 19218, 51020, -22421, -48841, 24786, 46713, -26852, -45142, 29099, 43867, -31658, -42505, 34678, 40970, -37960, -39051, 41547, 36238, -45093, -32656, 47999, 28698, -50021, -24434, 51598, 20565, -52352, -16801, 52837, 13654, -53533, -11010, 54257, 7817, -55818, -4724, 56790, 533, -57995, 3933, 58369, -9079, -57764, 14463, 56375, -18817, -53656, 23006, 51283, -26057, -48414, 28752, 46108, -30939, -44224, 33224, 42367, -36325, -40729, 39522, 38137, -43196, -35080]
927c5080Q1520j5385q0478K2841P7932k9727p4071L5367O9881l9724o5756M3299
939i381O2115m6363n8954M9408N6361n2916n3802N7070N0570o1744m6286O5948
951A2026M0946o9625l4987P2339K8376p3533k2165P3737J6485p2945j1705P2285
963C1234P531p1693l770P1496J74p1665L673P2262q510p2500J4074P1744j9862
976B4188p0077K5473O7576l0692o4120L5099O0216l8322n6589M0672N3611m2799
988D236n1353M5260M9327m8114m7528N1746M5288n6160m1962O0513L7556o4232
1000a5423l2191O6670K6541o8204k0699O8402J5776o8079j1562O7669Q431o8053
1012c0722n206O8958J843p0179K192P1547p436p2338J3540P1844k0025p0090K5917
$$ y = [-35080, 46440, 31055, -49423, -26582, 51350, 21623, -52448, -17081, 52800, 13076, -52680, -9381, 52734, 6371, -52583, -3175, 53186, 270, -53532, 3538, 54108, -7636, -53922, 12026, 52972, -16653, -51640, 20699, 49075, -24458, -46623, 27114, 43599, -29346, -41051, 31234, 38765, -32928, -36698, 34798, 34972, -36693, -33020, 39242, 30732, -41768, -27694, 44050, 24188, -45889, -20416, 47160, 16468, -47652, -12553, 47663, 9341, -47248, -6576, 47035, 4236, -47117, -1857, 47470, -644, -48172, 3574, 48862, -7298, -49260, 11253, 48809, -15423, -47614, 19056, 45597, -22607, -43306, 25096, 40872, -27207, -38769, 28900, 37331, -30722, -35928, 33030, 34873, -35306, -33114, 38433, 30997, -41341, -27801, 44043, 24018, -46072, -20155]
1025b0155O7155l1040o3784L5165O0283l8463n6772M0997N4265m3781n2068M7315
1037h83M9949n1422m6990N5644M3549o0109l9073O4191L3302o7076k7050O8688
1049B2720K0877o9590j5119O9840R680o9623m858O8957Q32o8652L201O8626p590
1062B9301o8366J2331O7951j7238o7168K2747O5648k8439o2896L3530N9207l7719
1074H889n5102M1057N0656m3498m6456M5066M2921m6303m0449M7935L8253n0138
1086g169l5898N2927L2928n5948k9001N8942K3936o1092j8169O2189J2368o1782
1098b5769p571O0681L768n9563p57N8724j803n8529M372N9178p628o0235J2088
1111b3044O0667j7127o0110K2347N8465k7378n5836L1857N2230l5137m8621L7358
$$ y = [-20155, 47000, 15960, -47824, -12659, 47624, 9161, -47611, -6614, 47651, 3870, -48198, -883, 49066, -2356, -49346, 6298, 49847, -10262, -49335, 14856, 48158, -18918, -45968, 22720, 43597, -25993, -41112, 28728, 38408, -31215, -36073, 32884, 33716, -34936, -31735, 36891, 29301, -39065, -26734, 41217, 23979, -43189, -20442, 45206, 16767, -46129, -12599, 46608, 8889, -46213, -5156, 45500, 2002, -44454, 612, 43533, -2770, -43219, 4716, 42969, -7169, -43067, 9860, 42788, -13160, -42161, 16781, 40717, -20375, -38544, 23645, 36013, -25769, -33340, 27341, 31109, -28454, -29211, 29513, 27710, -30819, -26447, 32731, 25103, -35132, -23044, 37623, 20496, -39614, -17267, 41198, 13820, -42016, -10159, 42071, 6934, -41687, -4329]
1123d329M5612l9333m3163M1268M1057m3249l9197M5655L7199m8652l4493N1887
1135A0262L0846n4742k6579N7132K2062n8922j7129N9862J2336n9983p926N9575
1147B6794M026n9201n23N9050l181n8864O572N9040j0286n9563J4714N9624j9668
1160A8534n8880K5116N7023l0282n4382L5189N0860l9193m6808M2074M3042m4097
1172a804l9798M5948L6911m7784l4285M9938L1684n2601k8661N5537K4624n8372
1184a8663j9665O0155J4192o0776q849O0522L715n9297P51N7654m173n6029O867
1197b3596N5176r615n4717J2572N4396j6074n3833K0003N2996k4547n1219K9099
1209i359M8446l2971m5162L6004M1716l8481l8206M0168L5027m1369l2434M2598
$$ y = [-4329, 41283, 1950, -41213, 55, 41112, -2137, -41334, 4321, 41520, -7132, -41625, 10262, 41108, -13634, -40213, 16919, 38981, -19941, -37070, 22792, 35128, -24855, -32781, 26794, 30820, -28381, -28904, 30146, 26965, -31899, -25327, 33713, 23427, -36136, -21422, 38202, 18534, -40346, -15230, 41793, 11511, -42871, -7682, 43178, 3985, -42823, -749, 42293, -1804, -41602, 4346, 41257, -6527, -40812, 9126, 40810, -11791, -40452, 15085, 39709, -18663, -38328, 21827, 36019, -24757, -33606, 26916, 30631, -28666, -27915, 29739, 25566, -30463, -23596, 31580, 21965, -32752, -20180, 34216, 18142, -35691, -15688, 37308, 12761, -38458, -9359, 39087, 6116, -39046, -3042, 38674, 193, -38013, 2155, 37182, -4187, -36621, 5977]
1221E977L0233m4215k8150M6258K5771m8391k2952N0617J9677n2616j5720N4121
1233B0610J1176n4516o855N4216K957n3545N02N2567l386n1746N822N1169q045
1246B0926n1251J0818N1405j4259n1185J7914N0806k2287m9462K6572M7383l0631
1258F749m4411L3975M1142l6501l8004L8571L5105m0325l2395M1807L0458m3950
1270g779k8341M6556K5663m9349k2297N1922J8287n4076j3706N5459Q639n5832
1282b4854l726N5161n27n4018M022N2908o982n2047R857N1277j2510n0888J5506
1295a6821N0685j9328m9850K3428M8276k7479m5930L1239M2952l4420l9510L6890
1307A32L5839l8463l2642L9689K9966m0995k7410M2370K4930m3979k2489M5954
$$ y = [5977, 36210, -8005, -36155, 10103, 35874, -12517, -35469, 15148, 34825, -17791, -33511, 20610, 31786, -22730, -29585, 24631, 27588, -25957, -25455, 27112, 23726, -28020, -22198, 28971, 20926, -30325, -19507, 31898, 17639, -33546, -15632, 35174, 12887, -36575, -10003, 37380, 6749, -37662, -3687, 37455, 954, -37050, 1521, 36626, -3699, -36094, 5713, 36171, -7779, -36120, 10436, 36099, -13250, -35547, 16375, 34662, -19414, -33120, 22339, 30978, -24854, -28580, 26581, 26054, -27964, -23942, 28966, 21984, -30063, -20206, 31071, 18561, -32327, -16821, 33864, 14536, -35314, -11886, 36390, 8911, -37019, -5780, 37172, 2752, -36758, 132, 35971, -2492, -35134, 4555, 34521, -6474, -33884, 8486, 33416, -10563, -33052, 12902]
1319A2902J9504m7942j5927M9536J1935n0622p613N0964L313n0776R37M9856m537
1332B1530m8545P549M7294j0134m6250J2669M5296j4982m4648J7616M3943k0588
1344A0750m3075K3832M1575k7140l9380L0080L6714l2527l3838L4507L0716l5683
1356c469k7948L6450K5598l7111k3835L8289K2129l9723k0253M1421J8159m3504
1368a3797j5318M5585J1627m6894p539M7318L541m7195J07M6666l522m5776O328
1381a8869M4892q656m4537J1020M4480j3839m4388J7258M4007k0935m3132K4892
1393g807M1408k8812l8773L2106L5700l4533l2504L6407K9451l7755k6622L8797
1405G063K4141l9844k2037M1252J9764m2978j7091M4582J3850m5939j0315M6868
$$ y = [12902, 32406, -15536, -31463, 18073, 30008, -20614, -28227, 22737, 26050, -24726, -23789, 26067, 21530, -27015, -19466, 27828, 17694, -28556, -15887, 29409, 14427, -30221, -12605, 31338, 10750, -32325, -8493, 33082, 5942, -33438, -3358, 33356, 829, -33009, 1498, 32214, -3469, -31417, 5033, 30631, -6480, -30315, 7974, 30103, -9620, -29873, 11548, 29707, -13797, -29115, 16470, 28097, -18797, -26336, 20982, 24523, -22672, -22565, 24101, 20579, -25197, -18869, 26023, 17367, -27170, -16150, 28330, 14491, -29897, -12639, 31368, 10433, -32699, -7807, 33601, 4789, -33984, -1878, 33822, -711, -33215, 3192, 32643, -5112, -31734, 7063, 31204, -8640, -30677, 10575, 30339, -12639, -29730, 14852, 28702, -17237, -27552, 19316]
1417A9316O440m7337k247M6953j486m6058M919M4982p926m3871J0776M2588j3191
1430A3858m1510J5468M0721j8098l9950K1072L8856k4241l7171K7340L5165l0425
1442A085l2571L3081K9422l5073k6156L6304K3133l7243k0332L7688J8041l8171
1454a0792j5941L8870J4062l9822j1977M1177R219m2215o155M2886K749m2998
1466b0937O74M2447m008m1243O804L9735q852l8476J0575L7703j2272l7115J4088
1479a0877L6756j6280l6570J9068L5713k2136l4334K5183L2311k7823k9854L0032
1491A189K7355l1817k4621L2991K2312l3930k0318L5002J8410l6293j6416L7627
1503A1491J4313l9221j1797M0668Q833m1687n638M2293K280m2385J042M2121m407
$$ y = [19316, 25756, -21581, -23828, 23125, 21639, -24419, -19500, 25482, 17556, -26315, -15539, 27049, 13858, -27652, -12184, 28537, 10439, -29511, -8439, 30417, 6176, -30995, -3655, 31510, 1085, -31486, 1595, 31017, -4056, -30212, 6092, 29225, -8018, -28350, 9338, 27379, -10792, -26733, 12137, 26199, -13623, -25600, 15577, 24796, -17419, -23574, 19312, 22061, -20937, -20263, 22184, 18176, -23067, -16263, 23472, 14620, -23856, -13281, 24422, 12150, -24965, -10877, 25879, 9599, -26971, -7903, 27810, 5674, -28660, -3477, 28834, 1011, -28843, 1189, 28544, -3273, -27894, 5097, 27409, -6521, -26839, 8163, 26573, -9720, -26136, 11491, 25804, -13417, -25214, 15454, 24287, -17400, -23038, 19255, 21535, -20850, -19808, 22313, 17906]
1516A7906m1370P300M0344r805l9349J2063L8492j4303l7647J6597L6849j8959
1528H118l5963K1713L4866k4760l3179K7878L0776l0538k8024L2636K5055l4477
1540e899k1775L5464J8784l6165j6106L6707J3919l7579j1638L8551R254l9496
1552a5979o532M0400L315m0997K58M1021m031m0184P424L8871j0193l7374J2518
1565a1483L5728j4308l4202J5804L3046j7349l2129J9140L1147k1185l0069K3381
1577b479K8593k5494k6777K7441K4540k9117k1992L0241J9482l0993j7236L1598
1589G807J5241l2128j3353L2700J1728l3421j0037L4439Q084l5512n588L6253
1601A6213K886l6914Q7L6990l132l6701O056L5888q589l4800J0612L3892j2739
$$ y = [17906, -23464, -16164, 24180, 14375, -24974, -12911, 25581, 11278, -26369, -9772, 27077, 8118, -27845, -6132, 28734, 3974, -29205, -1327, 29449, -1089, -29113, 3523, 28578, -5899, -27674, 7790, 26574, -9591, -25697, 11010, 24929, -12650, -24288, 14263, 23517, -15979, -22511, 17889, 21204, -19793, -19535, 21486, 17455, -22729, -15305, 23566, 13373, -24001, -11483, 24245, 9937, -24265, -8461, 24585, 7236, -24893, -5753, 25394, 4209, -25860, -2479, 26114, 620, -26157, 1284, 25824, -3293, -25285, 4956, 24438, -6555, -23791, 7807, 23048, -9080, -22433, 10267, 21995, -11426, -21463, 12976, 21060, -14452, -20040, 16213, 19099, -17815, -17728, 19262, 16130, -20571, -14515, 21373, 12784, -22016, -11404, 22488, 9749]
1614I749l2793J4556L1980j6294l1329J8304L0769k0713k9690K3032K8358k5327
1626F02k6486K7410K4296k9179k1872L0546J9351l1479j7150L2115J5266l3045
1638i625j3272L3726J1321l4441r332L5444P088l6420m410L7250J376l7608J711
1651a7192L7621m879l7145P958L6123j0873l4766J3262L3466j5312l2342J7424
1663f655L1118j9322l0076K1485K8974k3723k7527K6108K5574k8431k3164L0319
1675D680K0348l1761j7489L2610J4654l2895j2191L2908J0057l2863q161L3045
1687A2942O372l3408m437L3869K283l4240R8L4354k759l4071N595L3242q034l2063
1701b0257J0152L0836j2110k9483J3683K8342j5038k7542J6528K6566j8185k5679
$$ y = [9749, -23044, -8488, 23492, 7198, -24131, -5827, 24942, 4229, -25461, -2429, 25929, 602, -25884, 1526, 25822, -3357, -25229, 5317, 24668, -6811, -23961, 8154, 23420, -9625, -22897, 10829, 22150, -12291, -21623, 13821, 20909, -15511, -19921, 17329, 18705, -18903, -17192, 20429, 15550, -21595, -13637, 22486, 11613, -23153, -9891, 23575, 8263, -24079, -6655, 24463, 5141, -24935, -3450, 25524, 1801, -25726, 382, 25956, -2475, -25639, 4680, 25028, -6733, -24222, 8388, 23042, -9853, -22044, 10864, 20921, -11942, -20103, 12942, 19314, -14094, -18531, 15338, 17621, -16619, -16521, 17833, 15074, -18997, -13402, 19840, 11806, -20257, -10105, 20731, 8621, -20862, -7179, 21163, 6125, -21417, -4889, 21677, 3492, -22187]
1713b2187J9979K4534k1822k3237K3783K1650k5599j9606K7162J7517k8326j5241
1725b1393K9065J3167k9649j1161L0046R200l0268p723L0697O163l1388m279L1918
1738A4395K462l2501k61L2921k350l2948N008L2469p630l1529R724L0551j1713
1751H598k9425J3464K8345j4914k7384J6475K6815j8365k5961K0537K4855k2809
1763B31k3407K4995K1414k7078j9127K8704J6431k9735j3833L0424J1481l0879
1775a0379r388L1462P254l1807n238L2085L294l2727r72L3111j567l3113M195
1788a3790L2873o811l2198R390L1249j1743k9847J3611K8502j5406k7197J6963
1800d404K5725j8371k4439J9643K3220k1053k1969K2704K0516k4231j8807K5788
$$ y = [-22187, -2208, 22326, 504, -22733, 1050, 22700, -2899, -22505, 4657, 22174, -6152, -21393, 7672, 20839, -8810, -19971, 10075, 19275, -10993, -18716, 11981, 18144, -13244, -17523, 14395, 16857, -15644, -15905, 17016, 14666, -18282, -13274, 19195, 11565, -19964, -10240, 20311, 8598, -20827, -7363, 20982, 6068, -21316, -4841, 21974, 3609, -22352, -1815, 23040, 231, -23176, 1819, 23233, -3845, -22972, 5732, 22163, -7572, -21405, 9019, 20500, -10379, -19767, 11695, 18949, -12858, -18096, 13989, 17283, -15444, -16416, 16695, 15128, -17985, -13790, 19083, 12272, -19926, -10536, 20713, 8970, -20877, -7266, 21236, 5830, -21367, -4404, 21321, 2950, -21489, -1846, 21374, 321, -21648, 1056, 21572, -2659, -21466, 4322]
1812D322J6890k7105j4648K8227J2222k9011r789K9327P412k9323n413K9270L601
1825A5982k9292j815K9243K74k9512J576K9692l600k9778N930K9465q318k8707
1838a8860J0529K7728j2546k6425J4238K4928j5403k3674J6333K2675j7304k1848
1850a9629J8357K1106j9723k0284K1187J9342k2923j7812K4503J5963k5681j3905
1862a9499K6580J1968k7294r910K7616Q133k7984o402K8182M969k8811l257K9442
1875A3733J208l0007R66L0302l389l0450O038L0168q602k9351J0964K8331j3070
1888F841k7184J5042K5996j6821k4505J8291K3308j9797k2143K1269K0736k2786
1900a753j9300K4167J7676k5611j5782K6866J3724k7880j1373K8499R111k8742
$$ y = [4322, 21212, -5893, -20541, 7686, 19908, -9103, -18892, 10435, 17847, -11476, -16889, 12381, 15982, -13310, -15125, 14118, 14392, -15120, -13544, 16148, 12548, -17230, -11300, 18165, 9847, -18860, -8331, 19397, 6851, -19574, -5336, 19592, 4189, -19485, -3152, 19523, 2219, -19629, -1272, 19834, 111, -20173, 1014, 20356, -2567, -20379, 4124, 20087, -5594, -19499, 7081, 19049, -8245, -18155, 9461, 17594, -10390, -16792, 11390, 16359, -12452, -15709, 13733, 14941, -15066, -14100, 16202, 12813, -17637, -11599, 18569, 9967, -19384, -8420, 19911, 6841, -20343, -5301, 20695, 3874, -20631, -2340, 20968, 1171, -20972, 297, 21033, -1753, -21053, 3114, 20790, -4821, -20603, 6263, 19987, -7893, -19266, 9233, 18344, -10398]
1912a0398o942K8836M901k8727l049K8548J348k8411K92K8472k039k8626M093
1925a1702K8401o100k8165Q385K7562j0771k6522J2886K5112j4621k3771J6160
1937c146K2214j7396k0793J8477J9644j9517j8425K0646J7366k1943j5968K3181
1949D340J4343k4375j2476K5200J0524k5949q460K6269O431k6271m629K6064L196
1962A4207k5799j803K5741M35k5641Q27K5743k365k5888M022K5836n953k5459
1975a6097P820K4944r721k4156J1594K3053j3076k1918J4317K0808j5489j9789
1987a7710J6613J8862j7795j7928J9167J6910k0541j5696K2143J4137k3508j2236
1999a7582K4510J0298k5364q344K5895O222k6107m455K6206K669k6232j076K6319
$$ y = [-10398, -17340, 11496, 16397, -12330, -15379, 13169, 14517, -13894, -13602, 14870, 12831, -15795, -11702, 16699, 10599, -17566, -9181, 18381, 7610, -18912, -6026, 19086, 4465, -19306, -3146, 19068, 1672, -19121, -644, 19000, -517, -18942, 1704, 19070, -2873, -18841, 4340, 18683, -5692, -18168, 7032, 17556, -8393, -16853, 9416, 15847, -10424, -15053, 11011, 14207, -11592, -13395, 12346, 12781, -12860, -12033, 13710, 11345, -14543, -10521, 15315, 9362, -16097, -8277, 16667, 6946, -17210, -5616, 17437, 4361, -17557, -3240, 17568, 2079, -17710, -1097, 17765, -30, -17958, 1209, 18119, -2422, -18118, 4025, 18162, -5346, -17582, 6928, 17226, -8138, -16482, 9413, 15635, -10472, -14927, 11279, 13948, -12284, -13360, 12959]
2012A2959n96k6295K236K6486l963k6323N847K6133p913k5566R961K4676j1919
2025E723k3681J3685K2391j5323k0947J6540J9519j7475j8351J8615J7047j9726
2037a983j5741K0826J4513k2053j2982K3298J1170k4357r085K5059O926k5339
2049i748m836K5485K684k5229r24K4874o57k4578J943K4464l386k4301M941K4084
2063A4816o576k3716Q279K3181r983k2410J1686K1250j2966k0130J4106J8984
2075A6521j5017j7958J5953J6828j6748j5821J7558J4926j8582j3846J9572J2692
2087A6078k0475j1365K1268R997k2198q322K2851O611k3387m760K3584L073k3666
2100a0711j546K3752j21k3504J497K3330k838k3337M424K3236o012k3151P769
$$ y = [12959, 12363, -13932, -11696, 14790, 10827, -15496, -9649, 16484, 8571, -16995, -7034, 17642, 5723, -17958, -4273, 18118, 2795, -18152, -1612, 17907, 432, -17919, 696, 17743, -1983, -17724, 3102, 17615, -4438, -17420, 5878, 17048, -7309, -16394, 8665, 15591, -9748, -14584, 10901, 13585, -11644, -12568, 12306, 11649, -12929, -10986, 13478, 10092, -14209, -9268, 14816, 8240, -15476, -7197, 15984, 6001, -16409, -4723, 16527, 3561, -16569, -2463, 16521, 1504, -16454, -501, 16327, -421, -16242, 1316, 16242, -2340, -16186, 3386, 16078, -4397, -15762, 5506, 15503, -6695, -15017, 7834, 14445, -8942, -13702, 9882, 12955, -10711, -12257, 11495, 11374, -12130, -10633, 12697, 9859, -13478, -9054, 14182, 8170, -14981, -7212]
2113g212K2849r509k2355J1383K1463j3137k0230J4514J8953j5544j7789J6446
2125a68J6683j7325j5600J8096J4801j9056j3934K0268J2673k1392j1194K2472
2137F324R344k3224p526K3809N575k4136l639K3991K052k3872n61K3840r57k3818
2151a2798K663K3693m268k3537N932K3448p917k2888R829K2048j1618k0996J3165
2164c244J9801j4597j8449J5811J7063j6863j5790J7726J4492j8515j3209J9229
2176C455J1944j9811j0699K0399R438k1029p975K1677O387k2008m862K2238L239
2189A2393k2205j611K1887J31k1527J143K1146k305k0839L304K0704m522k0565
2202a2866N770K0394p122k0123Q756J9614j0357j8672J1845J7614j3050j6571
$$ y = [-7212, 15637, 6128, -16227, -4844, 16619, 3482, -16748, -2234, 16719, 1175, -16614, -168, 16515, -810, -16410, 1686, 16487, -2569, -16503, 3765, 16438, -4954, -16148, 6324, 15668, -7556, -15082, 8727, 14302, -9834, -13473, 10518, 12570, -11302, -11863, 11977, 11020, -12798, -10135, 13558, 9290, -14247, -8315, 15133, 7216, -15672, -5843, 16205, 4587, -16409, -3244, 16557, 1960, -16489, -678, 16385, -478, -16268, 1458, 15950, -2565, -15774, 3455, 15399, -4412, -15111, 5288, 14726, -6303, -14278, 7399, 13786, -8222, -13084, 9154, 12393, -9812, -11423, 10464, 10595, -10932, -9789, 11357, 9052, -11787, -8483, 12221, 7699, -12866, -7096, 13298, 6176, -13947, -5191, 14423, 4066, -14606, -2761, 14853, 1803, -14768]
2214a4768J4126J5416j5010j4367J5634J3427j6307j2710J7351J1624j8215j0538
2226a4337J9180R300k0029p899K0800O251k1184m717K1442L115k1540j616K1436
2239A0202K13k1332J208K1134k305k1095L637K0970m959k0835O485K0449p995
2252E777j9981R561J9329j1236j8354J2621J7222j3786j6117J4949J4881j5869
2264a003j3618J6763J2408j7493j1329J8189J0172j9132q806J9874P405k0596
2276g166n855K1188M114k1422k289K1477O14k1250J011K0813k341k0481L532K0151
2290A2096m847j9661N825J9323p052j8925Q356J8414r574j7770J0996J6892j2292
2303A781j5854J3365J4699j4288j3405J4881J2219j5344j1311J6042J0237j6577
$$ y = [-14768, -642, 14774, -236, -14603, 1031, 14458, -1849, -14559, 2792, 14416, -3799, -14337, 4843, 14143, -5886, -13785, 7015, 13266, -7918, -12635, 8807, 11922, -9618, -11234, 10202, 10415, -10917, -9709, 11425, 9120, -11975, -8338, 12632, 7673, -13162, -6677, 13772, 5777, -14204, -4643, 14686, 3450, -14904, -2283, 14939, 1153, -14964, -15, 14866, -1003, -14621, 2142, 14550, -2943, -14272, 3917, 14089, -5043, -13849, 6025, 13430, -7166, -13021, 8167, 12281, -9141, -11430, 10047, 10661, -10589, -9578, 11235, 8894, -11587, -8055, 12096, 7249, -12412, -6587, 12736, 5684, -13241, -4885, 13529, 3955, -13815, -2819, 14073, 1781, -14073, -708, 13991, -297, -13702, 1179, 13398, -1946, -13257, 2785, 13022, -3555]
2315c555r144J7013Q230j7677p136J8447N718j8884m280J9185K729j9273j378
2328a0005J9298q6j9004J284J8755k292j8576L356J8382m382j8184N525J7904
2341A1975o740j7630P838J7227r112j6597J0316J5925j1349j5147J2369J4373
2353A3448j3369j3308J4075J2384j4748j1603J5493J0637j6269r635J6969Q521
2365A2595j7650p406J8360O130j9070m564J9520K968j9672j449J9801j51j9615
2378a0203J577J9460l036j9085M356J8714n536j8491O983J7905q174j7458R484
2391c504J6834j0826j6017J2115J4961j3247j3843J4093J2705j4888j1469J5471
2403B385J0362j5940r239J6321Q265j6685p345J7257O171j7588n042J8015L654
$$ y = [-3555, -12699, 4314, 12544, -5133, -12269, 6178, 11896, -6988, -11268, 7917, 10646, -8627, -10005, 9293, 9207, -9797, -8513, 10242, 7950, -10626, -7270, 11112, 6730, -11454, -5929, 11975, 5235, -12395, -4557, 12670, 3558, -13039, -2723, 13202, 1853, -13294, -925, 13448, 79, -13229, 846, 13230, -1518, -13121, 2372, 13009, -3260, -12895, 4074, 12595, -5055, -12461, 5899, 12029, -7041, -11605, 7915, 10883, -8789, -10238, 9563, 9412, -10203, -8626, 10834, 7798, -11287, -6931, 11783, 6247, -12244, -5261, 12644, 4470, -12988, -3504, 13330, 2504, -13513, -1398, 13563, 316, -13527, 566, 13271, -1617, -13086, 2385, 12747, -3193, -12432, 3889, 12154, -4531, -11876, 5381, 11552, -6036, -11078, 6937, 10591]
2416A0591j8253k276J8335Q50j8180M48J7893j614j7657K828J7270l920j6802
2429a0487M854J6548n997j6174P117J5656q150j5187R315J4473j0289j3753J1334
2442g40J2797j2204j1747J2820J0792j3349r969J3972Q952j4385q036J4790P206
2455A0899j5216o371J5667N437j6049m418J6427L249j6589k238J6797R82j6755
2468h178J62J6658j245j6470K189J6404l275j6162M323J5846n269j5636O350J5369
2482A1066p450j5027Q723J4388r859j3683J1021J2799j2066j1834J2947J0748
2494A1773j3665r714J4180Q844j4843p833J5373O921j6026n763J6480M696j6955
2507f532l428J7417J969j7523o07J7411o57j7273J978J6909l092j6603M118J6306
$$ y = [10591, -7662, -9938, 8397, 9247, -8933, -8485, 9408, 7794, -9863, -7035, 10235, 6315, -10487, -5633, 10915, 4918, -11256, -4139, 11517, 3367, -11820, -2505, 11968, 1679, -12074, -740, 12057, -147, -11894, 926, 11718, -1631, -11600, 2372, 11324, -3061, -11097, 3693, 10899, -4317, -10688, 4979, 10416, -5633, -10051, 6376, 9625, -6964, -9202, 7595, 8577, -8178, -8016, 8642, 7397, -9073, -6884, 9520, 6245, -9917, -5594, 10252, 4983, -10653, -4303, 11066, 3616, -11411, -2688, 11700, 1841, -11842, -821, 11978, -88, -11922, 1025, 11773, -1892, -11606, 2574, 11418, -3425, -11258, 4115, 11036, -4990, -10753, 5727, 10423, -6532, -9960, 7457, 9426, -8097, -8704, 8707, 8050, -9223, -7245, 9664, 6572, -10031, -5913, 10393]
2521A0393n183j5929O235J5449p252j4948Q248J4364r287j3675J0401J2726j1236
2534C06j1837J2098J0826j2745r907J3411Q855j3941p710J4211O766j4579n725
2547i971J4884M750j5180l665J5398K643j5658j606J5770N34j5812N49J5759j727
2561F668j5434K734J5120l724j4705M520J4358n307j3963O008J3699o865j3332
2574a0223P702J2901q463j2509R423J1920j0313j1224J1232J0233j1716r405J2224
2587A782Q524j2736p699J3239O831j3636o123J4151N190j4566m185J4965L086
2600H823j5157k064J5495P96j5478L84J5389j431j5375K521J5098l465j4881M399
2614d946J4588n425j4170O303J3826p200j3473Q201J3009r080j2502J0026J1739
$$ y = [10393, 5210, -10719, -4484, 10965, 3713, -11235, -2987, 11377, 2090, -11585, -1184, 11542, 306, -11531, 567, 11393, -1352, -11259, 2152, 11007, -2934, -10644, 3567, 10333, -4246, -9971, 4913, 9663, -5517, -9182, 6216, 8859, -6799, -8405, 7365, 7899, -7913, -7364, 8395, 6668, -8766, -6032, 9088, 5364, -9341, -4821, 9537, 4230, -9733, -3725, 9974, 3109, -10223, -2521, 10380, 1917, -10592, -1169, 10751, 438, -10786, 446, 10679, -1037, -10442, 1782, 10306, -2430, -10129, 3110, 9941, -3695, -9818, 4333, 9523, -5043, -9228, 5737, 8823, -6334, -8398, 7097, 7893, -7585, -7201, 8188, 6757, -8618, -6097, 9001, 5536, -9345, -4946, 9642, 4217, -9953, -3650, 10176, 2976, -10497, -2296, 10713, 1633, -10869, -843, 10896]
2627A0896j0787j1059J1709J0025j2325r150J2972Q227j3555p212J3997O216j4219
2640d265n327J4611M275j4974l216J5213K102j5392q28J5462l37j5517J663J5172
2654H642k764j4873L936J4303m853j3897N767J3416o687j2865P559J2258q335
2667A607j1764R178J1147j0002j0197J0486R496j1086q613J1601P846j2101p015
2680i417J2460O090j2621n421J2921M465j3040l658J3179K957j3426k147J3599
2693E941J331j3717m19J3710n06j3648J442J3534k397j3344L422J3011m306j2659
2707h605N057J2340n799j2011O665J1502p401j1052Q123J0724r081j0033R845
2720B74R367j0629q478J1125P758j1645p021J2088O141j2523n303J2936M525j3263
$$ y = [10896, 109, -10950, 759, 10784, -1541, -10691, 2281, 10508, -3047, -10259, 3738, 9954, -4265, -9592, 5019, 9294, -5680, -8896, 6317, 8419, -6973, -7801, 7661, 7324, -8193, -6530, 8642, 5878, -8995, -5059, 9244, 4391, -9506, -3739, 9677, 2990, -9875, -2316, 9942, 1607, -10157, -979, 10168, 166, -10031, 455, 9951, -1135, -9748, 1853, 9699, -2402, -9417, 3043, 9133, -3488, -8909, 4012, 8477, -4563, -8221, 4958, 7915, -5511, -7658, 5941, 7272, -6445, -6864, 6846, 6340, -7308, -5866, 7668, 5271, -8073, -4651, 8360, 4054, -8605, -3548, 8792, 2993, -9018, -2353, 9149, 1748, -9304, -1181, 9543, 462, -9571, 274, 9641, -988, -9466, 1659, 9417, -2228, -9249, 2839, 8980, -3543, -8846, 4090, 8615, -4648]
2734d648l698J3627K804j3912j795J3966Q78j4116J38J4077j154j3991K213J3755
2748H144l125j3433L949J3319n083j2785N932J2393o818j1898P610J1354q514
2761A045j0722R290J0040j0036r340J0876Q430j1440p456J1885O588j2394n571
2774h805J2664M707j2933l804J3137K861j3355j915J3393J129j3531j72J3521
2787F897q34j3381J741J3248k654j2993L512J2674m390j2235M990J1933n656j1559
2801h707O444J1046p108j0512P738J0071q449r373R066Q727r626q085J0168P253
2815H653j0677o494J1006N767j1351m982J1654M264j1929l445J2144K568j2168
2828d990j859J2332J103j2502k80J2540o33j2434J349J2535k224j2395L019J2245
$$ y = [-4648, -8346, 5281, 8085, -5827, -7622, 6344, 7222, -6894, -6756, 7321, 6167, -7824, -5611, 8144, 5019, -8414, -4465, 8854, 3771, -9014, -3082, 9311, 2493, -9405, -1795, 9559, 1045, -9677, -387, 9653, -383, -9723, 1153, 9583, -1857, -9313, 2572, 9160, -3234, -8805, 3859, 8566, -4367, -8171, 4966, 7827, -5528, -7443, 5950, 7079, -6452, -6624, 6897, 6063, -7318, -5577, 7671, 5017, -7976, -4464, 8210, 3820, -8415, -3425, 8508, 2852, -8707, -2263, 8783, 1675, -8837, -1099, 8972, 523, -8850, 216, 8943, -683, -8768, 1400, 8653, -2024, -8518, 2488, 8255, -3096, -8078, 3576, 7840, -4089, -7534, 4610, 7178, -4990, -6849, 5483, 6586, -5916, -6196, 6344, 5711, -6723, -5374, 7161, 4937, -7458, -4439, 7806]
2842G806l874j1983M601J1753n369j1444O165J0980o782j0659P509J0195q200
2855F98r757Q982R165r667q478J0333P694j0930o894J1397O045j1782n095J2083
2869C794M220j2349l349J2493K526j2769j488J2833N98j2943L77J2967j368j2778
2883g236K330J2536l280j2209M168J1754m871j1482N726J0947o327j0502O943
2896a503J0060p696r422Q272Q927q876q310R408P622r832p025J0354O180j0650
2910b491n512J1014M711j1169m038J1448L215j1579k413J1701J555j1787p15J1759
2924E699j23j1645P95J1680j681j1419K429J1280l303j0941M100J0558m755j0262
2938g588N476R893o227r345O783Q805p215q442P695Q127q354p475Q743O980r336
$$ y = [7806, 3932, -8051, -3450, 8303, 2934, -8510, -2345, 8635, 1853, -8806, -1297, 8898, 698, -9059, -77, 9088, -579, -9057, 1276, 8970, -1960, -8854, 2543, 8588, -3194, -8289, 3794, 8014, -4335, -7684, 4809, 7335, -5434, -6922, 5911, 6509, -6434, -6057, 6910, 5542, -7236, -4906, 7630, 4350, -7859, -3691, 8063, 3192, -8290, -2564, 8383, 2056, -8446, -1503, 8557, 861, -8561, -289, 8638, -238, -8548, 860, 8482, -1350, -8375, 1979, 8159, -2491, -8003, 3011, 7722, -3447, -7485, 3963, 7178, -4401, -6814, 4887, 6442, -5345, -6060, 5699, 5576, -6069, -5274, 6406, 4725, -6694, -4265, 7015, 3712, -7229, -3129, 7429, 2674, -7588, -2112, 7781, 1554, -7791, -1008, 7797, 582, -7860, -165, 7962, -392, -7867, 876, 7856, -1480]
2953a480o392R866N668j0140n018J0419M435j0733l730J0995K930j1060k361J1323
2967D722J567j1390q86J1534J00j1626O90J1684j576j1553K393J1421l238j1152
2981g310M071J0858m875j0519N633J0117o447r606P110R114p799q559Q428P940
2995H156r044p285R649O559j0002n919J0458N118j0905m237J1142L497j1374k644
3009f831J1464J893j1588j043J1560L23j1640M85J1613j268j1556K037J1397k855
3023C991j1128L638J0854m448j0421N127J0042n817r466O314R044o929q568P582
3037a85P891p962p396Q430O772q960o087R322N470r670m787J0001M138j0273l422
3052f718J0426K691j0555j943J0676J284j0726o89J0806m0j0707N96J0748j280
$$ y = [-1480, -7872, 1994, 7662, -2478, -7496, 2923, 7358, -3375, -7105, 3890, 6820, -4240, -6601, 4722, 6289, -5101, -5987, 5547, 5647, -5979, -5289, 6395, 4819, -6734, -4341, 7080, 3842, -7310, -3239, 7619, 2744, -7775, -2142, 7975, 1528, -8078, -968, 8146, 347, -8212, 216, 8156, -888, -8173, 1476, 8035, -1967, -7886, 2572, 7690, -3215, -7452, 3690, 7187, -4187, -6831, 4633, 6526, -5062, -6105, 5455, 5778, -5862, -5377, 6236, 4968, -6588, -4551, 6846, 3991, -7137, -3499, 7355, 2907, -7514, -2387, 7655, 1838, -7628, -1314, 7730, 801, -7767, -185, 7706, -256, -7652, 778, 7550, -1410, -7497, 1825, 7295, -2375, -7162, 2839, 6977, -3296, -6718, 3708, 6399, -4156, -6099, 4577, 5861, -4865, -5554, 5252, 5212, -5495, -4899, 5849, 4569]
3066D569j0780K042J0623k708j0441L381J0272m044j0053M678R753n363r305N880
3080a496Q939o501q509P072Q024p632p518Q180P007q642o463R209N709r539n138
3095g298J0006M279j0209l660J0543K877j0712k053J0876J258j0890n40J0959
3108E436l01j0909J030J0858j733j0813K488J0601l166j0471L849J0276m596r937
3122g388N322R597o016r155O746Q514p138q125P745P568q225o965Q647O345r078
3137a606n701R457N109r958m284J0265L439j0434k657J0545J874j0636j040J0533
3151D906K92j0446M50J0292j151j0158J830J0104k622r730L116R635l865r286
3165f633M550Q745n028q460N555Q046n935p717O537P188o879o901P396O365p729
$$ y = [4569, -6211, -4169, 6454, 3746, -6695, -3314, 6958, 2914, -7139, -2461, 7292, 1929, -7376, -1496, 7443, 942, -7567, -495, 7529, -103, -7621, 559, 7566, -1076, -7539, 1670, 7379, -2160, -7298, 2708, 6987, -3222, -6882, 3661, 6538, -4174, -6227, 4649, 5907, -4983, -5523, 5436, 5135, -5774, -4744, 6114, 4381, -6432, -3944, 6657, 3491, -6980, -3131, 7145, 2549, -7388, -2066, 7531, 1515, -7640, -894, 7620, 482, -7643, 102, 7670, -555, -7520, 1127, 7472, -1606, -7307, 2150, 7259, -2699, -6983, 3282, 6721, -3713, -6370, 4175, 6049, -4587, -5627, 4906, 5198, -5248, -4798, 5494, 4343, -5815, -3985, 6119, 3497, -6233, -3117, 6518, 2653, -6633, -2083, 6662, 1634, -6826, -1271, 6775, 840, -6877, -340, 6848, -31, -6932, 464, 6829, -900]
3180i00n850P994N454q460m776Q718M198q942l714R227L163r431k609R690J944
3195E706r868j228R915M99r888J80R894q66r851J570R678k163r598K901R366l548
3211B699r146M202Q838m905q465N573Q106o134p707O696P152p107o668P533O131
3226F798p920n683Q387N127q766m510R110L923r420l249R582K679r894j874R873
3241D163J258j0015n52J0071j59j0057Q97R957j566r876K298R660l000r391L698
3256b614R092m396q654M951Q290n598p828O130P389o611o863P119O281p541n695
3271f548P830N236q302m520Q502L938q698l407Q924K779r042k169R156J537r221
3286d005r95R332L48r319L24R179q60r104J425R001j985q833K493Q664l042q433
$$ y = [-900, -6750, 1244, 6698, -1762, -6538, 2180, 6378, -2564, -6278, 2949, 6112, -3319, -5928, 3762, 5706, -4162, -5390, 4525, 5024, -4864, -4684, 5210, 4344, -5507, -3937, 5741, 3578, -6020, -3119, 6247, 2699, -6447, -2245, 6593, 1688, -6777, -1204, 6902, 768, -6939, -243, 6909, -198, -6866, 667, 6798, -1122, -6805, 1582, 6709, -2057, -6567, 2543, 6466, -2954, -6203, 3379, 6058, -3836, -5710, 4163, 5421, -4594, -5146, 4925, 4766, -5291, -4394, 5563, 3997, -5879, -3581, 6079, 3079, -6312, -2614, 6478, 2082, -6572, -1621, 6669, 1071, -6757, -627, 6762, 151, -6712, 407, 6688, -853, -6548, 1282, 6518, -1784, -6304, 2198, 6136, -2562, -5969, 2955, 5734, -3308, -5477, 3679, 5216, -4005, -5000, 4332, 4680, -4639, -4315, 4864, 4004, -5100, -3675, 5326, 3341, -5492, -2999, 5665, 2623, -5810]
3302e810L561Q211m105p953M637P633n154p262N613O897o141o351O492N902o851
3317f81n510P209N057p493m521P830M003q101l486Q263K985q579k293Q707J817
3332E207q923j208Q995N24q979l5R109o01r042J159R074j785r006K433Q834l029
3348B727q683L582Q494m195q232M872P853n428p448N955P052o502o550O928N983
3363F408p348n398P746M836q062m222Q308L582q519k986Q648K392q907j559Q911
3378C830R94r011k94Q896l23q895J075Q735j681q467K117Q402k734q150L255P900
3394E649l732p600M102P392m666p026N091O736n568o266N949N844o335n453O661
3409G78M940o903m413P115L993p396l495P588L016p831k420P923J929q065j401
$$ y = [-5810, -2249, 5962, 1857, -6096, -1459, 6174, 1020, -6242, -629, 6268, 127, -6224, 268, 6170, -681, -6191, 1018, 6075, -1418, -5939, 1891, 5894, -2207, -5693, 2570, 5555, -3024, -5317, 3390, 5207, -3716, -4924, 4071, 4595, -4384, -4419, 4690, 4089, -4953, -3794, 5280, 3495, -5511, -3078, 5756, 2727, -5956, -2374, 6120, 1925, -6307, -1435, 6418, 990, -6458, -503, 6549, 47, -6503, 425, 6408, -940, -6338, 1408, 6244, -1818, -6040, 2268, 5850, -2669, -5655, 2993, 5385, -3522, -5081, 3830, 4824, -4187, -4481, 4415, 4092, -4803, -3728, 5007, 3326, -5141, -3024, 5378, 2644, -5506, -2251, 5649, 1917, -5683, -1581, 5811, 1145, -5881, -790, 5946, 378, -5888, 61, 5905, -430, -5883, 778, 5718, -1185, -5598, 1517, 5510, -1886, -5381, 2207, 5223, -2608, -5028, 2895, 4824, -3241, -4642]
3424d642Q201P88q208j53Q164m43q057J003P911j497p779J967P619k446p409K867
3440b114P250l304p137L830O792m210o607M717O379n228n949N546N648n945n240
3455e572O304M854o640m470O966M001p278l543P532L089p793k622Q074K048q255
3470c305j424Q342Q40q444j60Q374l52q392J003Q334j758q082K286P940k875p692
3486e365L430P375l858p176M500O752m942o459N432O105n925n598O282N137o685
3501i95m502O885M071p156l622P356L099p560k586P685K134p837j601P937J031
3516D339p997m46P966o1p950O48P927j180p757J667P555k126p462K666P140l097
3532A832o828L498O632l984o360M325O027m630n732N063N370n427m985N799M541
$$ y = [-4642, 3559, 4347, -3861, -4014, 4150, 3707, -4350, -3347, 4564, 3067, -4712, -2745, 4874, 2428, -4981, -2114, 5136, 1832, -5305, -1475, 5317, 1107, -5500, -783, 5596, 368, -5581, -35, 5613, -332, -5572, 732, 5586, -1054, -5524, 1442, 5443, -1835, -5378, 2154, 5243, -2550, -5172, 2902, 4950, -3305, -4729, 3613, 4453, -3991, -4151, 4223, 3871, -4521, -3518, 4816, 3058, -5024, -2738, 5202, 2327, -5365, -1935, 5440, 1582, -5594, -1094, 5658, 716, -5743, -311, 5794, -131, -5729, 553, 5690, -995, -5497, 1388, 5459, -1697, -5319, 2037, 5136, -2424, -5010, 2675, 4809, -3028, -4629, 3308, 4339, -3658, -4104, 3862, 3801, -4149, -3501, 4426, 3246, -4511, -2844, 4711, 2585, -4877, -2211, 4929, 1832, -4996, -1498, 5134, 1150, -5210, -885, 5142, 512, -5220, -157, 5213, -214, -5199, 600, 5141]
3547E141o156m002O361L568o507l205O705K729o822k418P101K008p236j588P415
3562C094J009p468n71P579Q2p611M48P581r81p534J517P387j974p232K394P100
3578D820k867o894L312O719l772o517M203O349m773n903N112N530n499n140N967
3593F47M584o234m159O470L683o676l163O872K768p121k305P401J676p408j219
3608d184P518O56p583j72P672m51p650R77P544j445p406J991P329k644p038L047
3624a839O875l479o596L818O420m368o057M755N646n060n380N497N011n997m447
3639e201O248L941o365l501O644K905o736k418O805J934o872j527O977J050o959
3654c075o14P078Q7o975L23O993q69o920J361O766j842o544K243O375k600o237
$$ y = [5141, -1015, -5017, 1344, 4912, -1595, -4800, 1905, 4634, -2188, -4606, 2495, 4503, -2733, -4321, 3094, 4103, -3365, -3936, 3643, 3725, -3886, -3438, 4143, 3162, -4372, -2855, 4532, 2558, -4674, -2280, 4820, 1953, -4941, -1629, 5090, 1318, -5199, -996, 5353, 580, -5323, -211, 5319, -180, -5320, 647, 5231, -1003, -5162, 1308, 4991, -1685, -4848, 2024, 4792, -2329, -4634, 2767, 4443, -2965, -4184, 3334, 3990, -3593, -3765, 3907, 3456, -4194, -3217, 4327, 2882, -4524, -2533, 4796, 2152, -4886, -1839, 5036, 1557, -5039, -1221, 5199, 831, -5226, -471, 5175, 115, -5265, 232, 5243, -754, -5201, 1047, 4988, -1377, -4878, 1766, 4671, -2065, -4483, 2322, 4256, -2616, -4143, 2834, 3884, -3075, -3689, 3389, 3476, -3499, -3176, 3817, 2948, -3972, -2611, 4155, 2313, -4231, -1988, 4387, 1787, -4450]
3670d450K903O042l236n900L677N738m085n519M421N258m720n032N166M669n512
3685e80m284N797L806n986l419O172L054o343k644O542K266o752j848O858J427
3700D066p080q43P173K57p157K61P174q45p072J422O873j820o731K286O462k674
3716A752o321L117O124l564n878L909N794m367n572M828N177n204m801N566M372
3731D932n818l937O039L574o387l101O662K570o702k256O868J819p008j306P138
3746C087Q34p221l10P278k99p232P79P149j324p017J858O757k281o556K764O303
3762D569l169o028L513N810l929n506M277N191m571m923M962M549n281m161N576
3777H79L759n868l327O093K837o159k492O325K039o308j738O389J415o507j060
$$ y = [-4450, -1547, 4495, 1259, -4641, -964, 4774, 689, -4830, -409, 4849, 129, -4903, 263, 4932, -580, -4864, 933, 4739, -1247, -4666, 1506, 4560, -1783, -4427, 2115, 4381, -2371, -4219, 2639, 4066, -3014, -3857, 3316, 3573, -3584, -3323, 3851, 3006, -4066, -2644, 4229, 2409, -4322, -2036, 4426, 1752, -4569, -1452, 4672, 1108, -4770, -861, 4933, 566, -5006, -178, 4999, -205, -5006, 560, 4932, -886, -4823, 1216, 4790, -1597, -4698, 1964, 4534, -2168, -4424, 2444, 4263, -2745, -4051, 3087, 3921, -3300, -3610, 3668, 3369, -3863, -3084, 4065, 2741, -4276, -2418, 4339, 2058, -4498, -1734, 4569, 1400, -4628, -1115, 4695, 766, -4740, -463, 4728, 157, -4766, 196, 4745, -536, -4697, 879, 4638, -1230, -4557, 1536, 4373, -1786, -4278, 2047, 4086, -2222, -3960, 2429, 3844, -2663, -3723]
3792c723O668O02o704k25O806k95o792P94O686j208o594J627O390k053o197K485
3808a733O050k803n957L188N736l582n425L908N241m273n002M633M752n057m370
3823d694N437L929n734l481N931L014o110k579O256K205o441j736O472J448o689
3838b772j009O849N29o943j08P008m29o996J020O990j632o691J920O605k436o427
3854d522K941O203l381n880L642N687m057n389M395N142m816m789N284M280n483
3869g43l928N813L371n988k869O165K396o290j922O274J558o379j152O456P19
3884C481o465l87O627j41o586O25O498j088o374J489O297j984o081K315N990k720
3900A496n820L169N500l364n405L715N119m050m815M359M624m770m266N091L889
$$ y = [-3723, 2945, 3547, -3157, -3382, 3424, 3129, -3663, -2869, 3817, 2609, -3985, -2358, 4032, 1979, -4218, -1733, 4317, 1514, -4443, -1255, 4481, 899, -4526, -618, 4623, 350, -4652, -19, 4733, -324, -4694, 743, 4672, -1062, -4543, 1388, 4402, -1708, -4287, 1969, 4174, -2267, -4003, 2469, 3917, -2772, -3781, 3068, 3597, -3346, -3454, 3554, 3125, -3871, -2851, 4139, 2507, -4184, -2264, 4341, 1905, -4522, -1581, 4622, 1241, -4639, -997, 4690, 633, -4756, -361, 4781, -35, -4824, 460, 4740, -743, -4671, 1142, 4513, -1475, -4344, 1821, 4217, -2073, -3995, 2279, 3837, -2542, -3694, 2762, 3481, -2984, -3371, 3256, 3115, -3471, -2846, 3652, 2564, -3810, -2321, 3976, 1992, -4089, -1774, 4216, 1496, -4324, -1155, 4345, 981, -4424, -709, 4410, 360, -4455, -96, 4528, -242, -4508, 583, 4472]
3915D472n303l567N585L096n714k766N970K245o011j805O024J454o112j095O219
3930B692O74o331k70O323j10o293N63O331j088o315J628O167j974o072K396N850
3946D171k773n634L092N472l391n334L770N169m200m899M575M650m946m354N260
3961F28M052n736l480N915L065o145k692O368K198o452j701O467J301o574q44
3976c630O704L55o718J09O755o77o624J110O636j707o495K224O187k667n895L099
3992a234N626l425n393L797N018m015m783M311M551m633m305M981M014n330l611
4007d431N523L219n792k735N876K446o134j854O068J538o140j154O157P94o204
4022b823m06O264K1o272L65O339q45o281J346O091j689o096K220N867k641n540
$$ y = [4472, -831, -4398, 1187, 4283, -1431, -4197, 1773, 4018, -1993, -3798, 2226, 3680, -2432, -3527, 2692, 3366, -2965, -3235, 3088, 2978, -3315, -2752, 3579, 2491, -3824, -2196, 3971, 1997, -4075, -1679, 4171, 1398, -4236, -1144, 4328, 937, -4397, -627, 4542, 342, -4557, 18, 4668, -278, -4632, 628, 4680, -1056, -4536, 1379, 4444, -1701, -4393, 1975, 4173, -2279, -3980, 2487, 3788, -2786, -3630, 3074, 3429, -3289, -3180, 3575, 2898, -3726, -2616, 4020, 2313, -4182, -1958, 4229, 1562, -4333, -1234, 4392, 967, -4426, -629, 4389, 374, -4409, -98, 4453, -180, -4485, 496, 4510, -820, -4431, 1092, 4311, -1481, -4216, 1660, 4106, -2028, -3882, 2186, 3724, -2416, -3570, 2587, 3381, -2823, -3229, 3035, 3056, -3216, -2851, 3488, 2643, -3638, -2292, 3799, 2110, -3986, -1766, 4101, 1460, -4080]
4038d080K914N260l218n072L524M891l822m646M139M397m459m104M726L843n039
4053g46l472N293L078n541k757N799K323n911j924N994J590o108j195O166Q38
4068C427o263m02O299M3o421L48O527q40o444J390O248j853o141K324N876k682
4084A436n682L093N439l455n118L718M998m118m682M385M364m750m041N058L728
4099D373n414l305N712K769n802k388O005J874o080j395O123R71o093o21O156
4114B885K52o232J89O229n64o226R63O190j402o094J933N845k293n757K771N460
4130D149l152n213L531M791l695m572L944M413m236m121M453L828m719l442M988
4145I47L120n222k778N467K240n537j804N511J413n539j038N520P36n574l55N553
$$ y = [-4080, -1166, 4094, 876, -4196, -672, 4219, 397, -4249, -110, 4287, -172, -4276, 450, 4293, -746, -4218, 1075, 4153, -1388, -4145, 1654, 3977, -1934, -3858, 2136, 3726, -2382, -3577, 2589, 3427, -2836, -3238, 3061, 3104, -3317, -2969, 3558, 2718, -3726, -2336, 3912, 2059, -4082, -1758, 4118, 1436, -4246, -1153, 4286, 831, -4287, -569, 4429, 311, -4371, 14, 4378, -372, -4413, 645, 4373, -1041, -4346, 1366, 4135, -1667, -4055, 1950, 3824, -2256, -3651, 2472, 3443, -2650, -3271, 2885, 3137, -3095, -2906, 3323, 2759, -3467, -2504, 3686, 2284, -3810, -1877, 3968, 1675, -4082, -1311, 4149, 997, -4216, -685, 4106, 411, -4161, -217, 4196, -40, -4161, 292, 4120, -599, -4041, 947, 4067, -1155, -3933, 1534, 3774, -1763, -3567, 1944, 3357, -2182, -3220, 2300, 3036, -2538, -2893, 2660]
4161B660J90n667J04N838o02n715R29N735j436n614J823N502k229n339K621N056
4177C856k788n029L157M780l448m573L667M477m053m194M417L874m649l639N014
4192H69L225n289k831N505K421n643j976N773J528n840j094N799P54n904l38N944
4208B903p0n887M65N815p60n895J226N863j719n781K196N609k661n295K987N091
4224D087l431m767L705M504l868m364M130M099m380l829M668L591m976l309N357
4239A217K789n527k367N679J925n795j464N877R78n749o81N820K31n715K7N827
4255C072m82n792R17N676j286n599J658N477k046n316K396N082k732m841L082
4270g34M530l326m266L606M024l823l818M004L623m249l291M383L134m688k891
$$ y = [2660, 2850, -2817, -2713, 3125, 2523, -3192, -2263, 3472, 2036, -3578, -1755, 3747, 1518, -3821, -1200, 3856, 1068, -3961, -804, 3976, 528, -4045, -378, 4099, 46, -4148, 269, 4143, -506, -4145, 869, 4094, -1195, -4026, 1479, 3900, -1743, -3719, 2054, 3582, -2258, -3352, 2447, 3201, -2703, -3041, 2903, 2833, -3054, -2589, 3226, 2466, -3429, -2203, 3660, 1941, -3840, -1644, 3965, 1304, -3991, -1004, 4087, 656, -4111, -406, 4098, 230, -4134, -4, 4095, -285, -4114, 554, 4145, -831, -4140, 1217, 4006, -1521, -3888, 1791, 3716, -2079, -3543, 2334, 3312, -2437, -3118, 2702, 2933, -2782, -2755, 3072, 2590, -3202, -2285, 3391, 2105, -3494, -1836, 3641, 1595, -3721, -1325, 3757, 1025, -3816, -734, 3796, 470, -3796, -190, 3834, 11, -3807, 197, 3820, -429, -3720, 663, 3797, -891, -3782]
4285c782M964K500n163k123N340J778n442j449N499R55n394p14N469M86n575j21
4301b772N560j22n619M84N725j057n562J377N547j865n374K274N181k640m980
4316c843K932M728l194m474L505M206l720m029M018L802m255l665M675L256m940
4331i98k868N216K458n400k004N504J591n598j246N713Q09n673m98N716Q4n684
4347b878K30N774o50n721R87N683j462n609J946N427k325n229K762M929l046m658
4363c840L284M446l603m094L685L956m092l502M165L294m443k968M613K694m791
4378a196k377N066J959n160j650N306J173n241q25N256N06n312j51N255j47n254
4394b792M23N235o37n325J107N244j492n185J911N085k324m874K684M585k940
$$ y = [-3782, 1182, 3682, -1481, -3604, 1736, 3514, -1928, -3377, 2122, 3077, -2317, -3031, 2438, 2924, -2651, -2772, 2788, 2666, -2953, -2469, 3256, 2199, -3363, -1986, 3561, 1696, -3678, -1404, 3777, 1137, -3843, -911, 3817, 623, -3851, -346, 3860, 140, -3889, 129, 3931, -324, -3989, 686, 3942, -998, -3866, 1350, 3808, -1592, -3596, 1908, 3499, -2099, -3345, 2368, 3177, -2496, -2994, 2722, 2806, -2878, -2648, 3126, 2476, -3245, -2258, 3425, 1963, -3646, -1700, 3727, 1402, -3827, -1065, 3864, 818, -3840, -556, 3890, 287, -3807, -122, 3834, -258, -3760, 405, 3699, -744, -3712, 901, 3595, -1196, -3573, 1493, 3452, -1708, -3358, 1948, 3121, -2120, -2945, 2311, 2817, -2495, -2646, 2609, 2462, -2792, -2369, 2866, 2229, -3096, -1989, 3255, 1763, -3422, -1511, 3574, 1250, -3624, -940, 3645, 705]
4409G05m318L140M122l380l933L651L655l774l489L940L280m180l041M545K616
4424C539m677k318M858J962m982j562N119J182n166q70N078N53n090k29N125M
4440B526n247L46N292p17n291J071N300j500n225J921N125k370m900K708M728
4455C767l029m506L268M250l590l927L760L797m084l453M245L325m647k859M742
4470A059K520m985k176N234J711n300j273N316Q68n233n94N325O9n125K41N060
4486B717n08n046P72N054j176m995J529M905j928m749K246M682k565m513L033
4501e42M064l145l888L357L698l583l454L741L214l921l045M139K824m355k541
4516c437M612K200m802j803M875J494n003j130N009O96m933m00M932J67m966J89
$$ y = [705, -3613, -473, 3649, 269, -3664, -13, 3642, -132, -3621, 319, 3599, -581, -3622, 923, 3539, -1138, -3456, 1402, 3364, -1618, -3180, 1939, 3121, -2045, -2915, 2163, 2716, -2374, -2603, 2522, 2526, -2721, -2375, 2917, 2200, -3091, -2020, 3280, 1780, -3445, -1524, 3601, 1231, -3669, -961, 3767, 738, -3768, -500, 3750, 160, -3767, -7, 3790, -294, -3747, 498, 3823, -824, -3683, 1059, 3579, -1406, -3582, 1652, 3363, -1937, -3210, 2106, 2974, -2259, -2853, 2472, 2541, -2584, -2343, 2717, 2209, -2837, -2065, 2989, 1813, -3182, -1653, 3252, 1324, -3425, -1179, 3503, 938, -3575, -542, 3522, 377, -3511, -154, 3544, -39, -3493, 248, 3462, -459, -3504, 635, 3459, -896, -3437, 1175, 3375, -1427, -3230, 1645, 3139, -1864, -2994, 2015, 2711, -2222, -2622, 2310, 2477, -2489, -2300]
4532b300M864m16m806O60M891j022m887J471M736j834m598K089M491k475m253
4547c389K804L986l040l718L125L721l472l411L581L264l872k998M086K812m418
4562i39k538M679K119m764j815M884J551n065j104N130O67n054m78N144M9n040
4578b574K55N026n00n094R23N002j164n033J586M853j997m777K507M464k690m291
4594c504L005M013l306l643L431L412l611l161L772K999m075k744M297K452m490
4609a153k107M636J812m878j315M887R25m903n48M930K35m943O3M816k20m890
4625b653N96M862r08m793J156M790j510m653J859M468k174m330K490M130k818
4640E12l795K979L522l097l357L311L129l493k917L656K772l881k519M010K244
$$ y = [-2300, 2564, 2148, -2658, -1998, 2893, 1871, -3016, -1545, 3191, 1357, -3241, -1152, 3339, 864, -3389, -585, 3401, 361, -3357, -232, 3489, 17, -3394, 187, 3451, -421, -3419, 667, 3479, -939, -3477, 1202, 3321, -1443, -3258, 1626, 3177, -1888, -2992, 2138, 2805, -2249, -2727, 2417, 2466, -2574, -2319, 2707, 2207, -2887, -1964, 3038, 1874, -3159, -1573, 3280, 1283, -3494, -987, 3477, 787, -3504, -499, 3514, 208, -3435, -4, 3408, -203, -3364, 408, 3407, -668, -3412, 885, 3337, -1153, -3260, 1376, 3188, -1690, -3005, 1882, 2807, -2096, -2644, 2286, 2521, -2422, -2359, 2457, 2237, -2653, -2057, 2805, 1897, -2896, -1740, 3050, 1540, -3113, -1254, 3214, 1040, -3290, -800, 3330, 512, -3283, -304, 3218, 121, -3236, 75, 3204, -289, -3206, 450, 3222, -659, -3178, 832, 3076]
4655C076m141k019M369J722m536j367M617J023m658p06M706L24m650l8M677j79
4671B220m707M16M798p77m760J023M860j455m786J799M627k211m428K577M259
4686C455k930l953L117L710l314l430L446L269l700l037L898K774m052k553M252
4701I52K295m484j960M729J414m665j142M839P13m838k95M730M8m738K43M708
4717B549n30m683P73M664j076m604J370M605j696m606K222M344k540m126K859
4732d75L911l166l610L306L353l575l048L700K839l779k721L961K476m161k167
4747c156M371J863m506j525M630J085m666p42M655M55m624o6M517k29m441M23
4763a956M440o85m327Q97M286j155m343J507M294j810m135K095L958k359l854
$$ y = [3076, -1065, -3084, 1285, 3007, -1529, -2896, 1721, 2744, -1914, -2620, 2086, 2410, -2240, -2278, 2399, 2220, -2487, -2071, 2727, 1950, -2810, -1787, 3073, 1618, -3168, -1369, 3258, 1047, -3381, -804, 3455, 525, -3428, -311, 3399, 85, -3345, 101, 3370, -330, -3367, 531, 3305, -747, -3300, 952, 3247, -1237, -3197, 1532, 2946, -1719, -2861, 1978, 2691, -2147, -2442, 2288, 2336, -2402, -2159, 2549, 2019, -2664, -1891, 2773, 1697, -2907, -1537, 3068, 1372, -3234, -1012, 3332, 792, -3334, -475, 3436, 270, -3340, -34, 3319, -256, -3304, 396, 3235, -544, -3265, 696, 3172, -989, -3156, 1215, 3078, -1428, -2953, 1677, 2762, -1904, -2646, 2009, 2464, -2160, -2226, 2291, 2062, -2379, -1956, 2484, 1799, -2528, -1631, 2655, 1500, -2843, -1336, 2958, 1148, -2987, -892, 3066, 707, -3147]
4778c147K729L544k954l325L098L124l213l019L490K834l661k603L809K387m014
4793i21k134M175J935m422j555M557J187m631q36M687M14m659j04M609j84m527
4809b409M64M513p28m490R36M566j312m507J717M317j978m259K446L939k720l714
4825c219K982L401l171l193L374L025l594k718L721K441l868k313M120K047m233
4840a198j795M447J482m649j039M656P44m760k91M651j7m624L28M572p05m380
4856b578R40M282j119m279J389M195j629m175J964M049k301l826K639L546k866
4871B31l295L107K983l226k795L392K527l477k323L565K141l704j935L809J802
4886B802m023j511M255J133m389q13M462M85m407k04M408k14m343M77M258o52
$$ y = [-3147, -418, 3126, 172, -3153, -55, 3069, -144, -3163, 327, 3161, -500, -3103, 706, 3093, -921, -3055, 1120, 3055, -1367, -2922, 1635, 2822, -1809, -2645, 2042, 2456, -2203, -2307, 2302, 2118, -2409, -1945, 2568, 1840, -2650, -1714, 2852, 1540, -2967, -1250, 3067, 1089, -3170, -724, 3215, 495, -3219, -237, 3164, -7, -3200, 174, 3199, -395, -3113, 608, 3049, -819, -3132, 988, 3035, -1198, -2993, 1454, 2936, -1713, -2752, 1904, 2648, -2112, -2403, 2248, 2231, -2393, -2065, 2507, 1802, -2578, -1638, 2644, 1525, -2754, -1365, 2830, 1201, -2974, -1010, 3039, 738, -3088, -449, 3097, 231, -3064, 43, 3026, -200, -2995, 397, 2924, -553, -2876, 689, 2830, -874, -2809, 1000, 2802, -1221, -2732, 1523, 2656, -1733, -2546, 1916, 2401, -2006, -2210, 2198, 1984, -2359, -1882, 2376, 1724]
4902A724m194Q14M220j053m233J388M132j648m133J970L991k292l742K574L549
4917C067k799l344L033L128l278k740L321K530l407k405L587K187l763j947L895
4932A065J785m119j482M320J067m419p37M485L43m428o1M437k07m450N34M373
4948B506q49m284J052M346j385m240J672M101j898m085K320L894k658l666K981
4963a93L320l115l223L479K739l508k433L620K270l798j993L767J799l820j617
4978b706L983J303m105r83M199O78m304k87M313r3m237L99M121o43l991Q85L930
4995B462j140l832J228L834j483l787J705L759j959l662K279L535k611l260K828
5010a04L008k990k790L128K572l220k397L388K137l503j926L674J650l691j567
$$ y = [1724, -2470, -1656, 2564, 1511, -2722, -1334, 2798, 1150, -2983, -1013, 2978, 686, -3056, -482, 3067, 268, -3076, -43, 3085, -193, -2933, 388, 2918, -489, -2894, 693, 2880, -883, -2830, 1065, 2850, -1269, -2751, 1569, 2636, -1783, -2520, 1965, 2308, -2120, -2181, 2256, 2049, -2401, -1867, 2506, 1657, -2627, -1575, 2771, 1386, -2854, -1182, 2919, 1021, -3064, -744, 3150, 492, -3174, -193, 3127, 12, -3211, 268, 3007, -501, -2934, 686, 2956, -842, -2835, 932, 2731, -1089, -2706, 1277, 2580, -1525, -2508, 1691, 2369, -1935, -2222, 2091, 1998, -2239, -1840, 2281, 1638, -2353, -1468, 2462, 1322, -2510, -1282, 2552, 1069, -2718, -1013, 2746, 787, -2875, -596, 2939, 328, -2932, -104, 2904, -86, -2876, 252, 2824, -396, -2793, 595, 2732, -771, -2697, 977, 2627, -1064, -2631]
5025b631L930J271m082r44M102P17m290k83M174N3m115K68M000n54l924P82L878
5042B352r72l848J249L722j376l760J667L729k009l561K277L350k522l220K858
5057f4K950l022k689L196K440l348k201L443K016l574j899L733J706l916j398
5072b627M033J177m280p63M288M25m297m9M230k80m171O85M011q92l950J087L871
5089B498j306l734J484L756j830l516J954L519k391l249K622L090k847k895L054
5104B09K559l218k303L376K054l451j838L528J601l538j440L658J267l853r87
5119b376L871Q09m080m20M120N7m043K53L996o25l794P93L725j035l658J231L536
5136B360j254l565J506L496j752l395J978L259k239l082K404L022k692k794L024
$$ y = [-2631, 1299, 2570, -1512, -2456, 1646, 2363, -1927, -2210, 1964, 2017, -2098, -1830, 2170, 1616, -2308, -1526, 2352, 1380, -2468, -1219, 2503, 1127, -2633, -966, 2763, 754, -2807, -530, 2820, 298, -2922, -64, 2886, -136, -2825, 371, 2811, -537, -2738, 705, 2721, -853, -2752, 981, 2687, -1229, -2627, 1406, 2583, -1697, -2460, 1828, 2253, -2044, -2093, 2137, 1857, -2314, -1629, 2382, 1490, -2460, -1373, 2498, 1192, -2542, -1058, 2698, 868, -2648, -694, 2825, 434, -2815, -193, 2897, 50, -2845, 209, 2768, -450, -2753, 623, 2677, -774, -2612, 916, 2517, -1021, -2461, 1197, 2464, -1389, -2376, 1495, 2304, -1776, -2196, 1924, 1981, -2062, -1809, 2187, 1562, -2232, -1439, 2286, 1251, -2407, -1176, 2360, 1106, -2459, -953, 2543, 791, -2604, -626, 2633, 394, -2688, -284, 2738, 46, -2748, 276]
5151B76K414l007k324L190K023l234j830L274J705l466j474L572J296l749j101
5166b435L877Q54l969n56M130J28m086J95M098n94l926Q14L764r34l766J245L605
5183B444j327l685J614L580j909l462K233L316k510l122K748K911k951k647L121
5198C54K357l250k087L303J870l378j641L388J525l526j349L675J071l784p27
5213b199L850M46l999q0L998j70l995N10L868p41l818J033L645j211l562J455
5229i70L550j721l447J880L317k032l230K301L052k593k824K838K589l000k424
5244b714L254K010l231j820L295J560l318j362L390J198l416r83L413P85l522
5259a461n66L637L23l756K4L721l53l629N76L556p76l471J022L359j109l348J320
$$ y = [276, 2690, -317, -2641, 549, 2572, -662, -2492, 782, 2487, -979, -2453, 1119, 2415, -1334, -2435, 1442, 2296, -1673, -2229, 1901, 2029, -2057, -1862, 2236, 1642, -2284, -1470, 2294, 1360, -2406, -1161, 2444, 1117, -2568, -954, 2626, 717, -2745, -512, 2804, 294, -2828, -80, 2831, -120, -2767, 354, 2711, -539, -2626, 677, 2547, -831, -2472, 916, 2441, -1085, -2434, 1241, 2312, -1472, -2199, 1651, 2097, -1902, -1982, 2016, 1846, -2149, -1639, 2229, 1488, -2330, -1297, 2348, 1137, -2425, -970, 2580, 859, -2588, -708, 2609, 577, -2653, -352, 2700, 107, -2717, 121, 2710, -290, -2714, 540, 2550, -681, -2501, 794, 2354, -964, -2326, 1064, 2262, -1154, -2137, 1276, 2061, -1461, -2027, 1610, 1933, -1823, -1799, 1922, 1569, -2060, -1484, 2072, 1296, -2175, -1153, 2206, 1097, -2251, -931]
5276i31L248j448l354J776L237j980l168K268L026k568k796K782K533k913k308
5291b596L030K097l170j875L303J630l308j452L406J271l597j019L652Q63l797
5306a562m85L800K42l896J14L785m04l714P57L543r41l473J109L461j415l284
5322b363J530L250j783l098J927L053k209k939K536K704k703k524K923K266l094
5337e24k028L195J776l283j448L331J273l388j135L458R18l464p73L669M40l672
5353a655k57L740o7l767M63L593p00l482R31L344j119l200J293L142j414l115
5369b270J537L064j840k855J960K861k268k601K397K513k676k299K798K066k954
5384e67j782L073J551l093j389L098J283l235j022L278Q68l357p35L527M25l591
$$ y = [-931, 2317, 869, -2485, -709, 2528, 548, -2620, -352, 2674, 106, -2690, 92, 2625, -288, -2596, 434, 2531, -639, -2514, 789, 2419, -889, -2341, 1065, 2336, -1261, -2280, 1372, 2235, -1562, -2047, 1753, 1995, -1901, -1787, 1998, 1594, -2120, -1363, 2180, 1239, -2234, -1125, 2336, 921, -2363, -833, 2417, 634, -2464, -537, 2516, 307, -2632, -96, 2608, -95, -2619, 304, 2570, -524, -2552, 643, 2419, -864, -2312, 1019, 2292, -1096, -2231, 1227, 2145, -1319, -2092, 1577, 2017, -1655, -1912, 1828, 1761, -2006, -1543, 2050, 1350, -2132, -1201, 2143, 1024, -2176, -883, 2259, 845, -2270, -733, 2331, 491, -2364, -404, 2457, 189, -2412, -15, 2498, -178, -2477, 321, 2387, -567, -2349, 724, 2275, -818, -2207, 891, 2174, -1061, -2083, 1195, 2063, -1294, -2029, 1498, 1923, -1668]
5400a668j48L660j32l645M47L485o18l549R42L399j157l202J243L151j399l121
5416b312J615L027j748l036K033K880k218k770K490K537k730k243K829K067k932
5431e11j795K973J591l090j369L198J211l361r33L405P27l474n86L621L23l690
5447a760%L756m16l617O02L631r89l440J157L382j401l211J514L080j618k989
5463b319J849K917k120k787K346K563k507k484K765K189k775k013K945J733l031
5478g29j482L067J234l063j012K989J002l141p26L123O29l247m48L327J64l425
5494a738J44L385m02l378P33L284r14l198J103L089j312k910J448K856j627k820
5510b257J771K793j988k708K229K610k504k379K650K095k696j931K880J725k973
$$ y = [-1668, -1816, 1844, 1712, -1933, -1486, 1999, 1381, -2168, -1226, 2173, 1016, -2186, -943, 2208, 809, -2312, -697, 2330, 582, -2454, -421, 2459, 241, -2529, -39, 2498, -232, -2475, 354, 2421, -511, -2306, 667, 2258, -832, -2201, 997, 2208, -1153, -2086, 1319, 2046, -1428, -2014, 1607, 1930, -1760, -1760, 1996, 1580, -2037, -1435, 2196, 1207, -2233, -1076, 2306, 905, -2306, -792, 2288, 670, -2319, -470, 2447, 327, -2460, -114, 2449, -58, -2542, 223, 2412, -363, -2376, 569, 2302, -729, -2211, 856, 2090, -973, -1985, 1004, 2006, -1135, -1861, 1262, 1891, -1356, -1804, 1523, 1687, -1738, -1594, 1791, 1389, -1989, -1256, 2028, 1114, -2084, -981, 2108, 796, -2114, -666, 2190, 563, -2257, -486, 2307, 319, -2389, -160, 2450, -54, -2433, 217, 2312, -384, -2315, 565, 2290, -683]
5525f83j448K954J258l064j045L072R36l152p09L195N01l220l97L452K8l393K09
5542a506L407m02l465P82L187r13l237J232L004j293l022J517K949j698k844J896
5558d06K727k096k657K340K602k633k334K846K006k963j763L085J535l164j286
5573b161L189J020l129q79L163P45l270n81L341L17l438K4L435k50l395M79L323
5590A933p01l244R07L223j256l000J469K804j588k621J616K622j861k525K007
5605b15K440k166k276K383K119k609j923K757J725k812j589L014J228k951j061
5620a936K941R48l042p21L036N42l091m21L162K09l172l9L269j81l298N43L178
5637A927p96l102J073K872j204k770J296K730j455k646J558K614j753k484J917
$$ y = [-683, -2131, 823, 2081, -983, -2028, 1044, 1980, -1172, -1881, 1314, 1815, -1405, -1802, 1650, 1678, -1715, -1506, 1901, 1499, -1966, -1184, 2003, 1090, -2147, -915, 2089, 796, -2226, -709, 2240, 542, -2302, -406, 2321, 225, -2432, -92, 2510, -123, -2457, 389, 2395, -568, -2331, 754, 2289, -875, -2161, 1028, 2048, -1081, -1960, 1203, 1948, -1322, -1903, 1438, 1755, -1683, -1659, 1776, 1526, -1869, -1390, 1933, 1232, -2012, -1105, 2118, 862, -2138, -669, 2135, 547, -2074, -458, 2164, 303, -2222, -215, 2225, 59, -2217, 166, 2285, -324, -2247, 510, 2235, -577, -2166, 848, 2076, -875, -1936, 1005, 1953, -1089, -1810, 1226, 1768, -1323, -1744, 1418, 1627, -1545, -1584, 1685, 1504, -1794, -1251, 1927, 1131, -1971, -898, 1974, 770, -2000, -704, 2026, 571, -2075, -517, 2097, 344, -2140, -223]
5652b23K454k084k372K317K185k585j884K671J711k863j429K909J280k985j078
5667a976L041Q67l060p14L139N10l220l05L224R9l281J44L309l87l357P65L249
5684B047j023l092J206K985j462k725J500K667j665k533J795K456j985k338K135
5699c2K246k329k066K458J929k590j738K750J443k887j183K992R39k992p34K884
5715A090O76l028m36L007K80l013n5L064j54l120L59L197p66k984R33K904j102
5732H52k928J402K733j442k573J573K415j710k342J867K236k002k172K164K025
5747B098k311j868K467J710k665j424K652J236k702j024K630R60k717p29K749
5762A062N41k799m47K921K26k898m2K916o1l102M36L069o71k974Q87K897j187
$$ y = [-223, 2231, 147, -2225, 92, 2277, -308, -2192, 479, 2190, -673, -2102, 807, 2087, -898, -1976, 1065, 1932, -1128, -1842, 1297, 1807, -1413, -1718, 1506, 1605, -1676, -1532, 1777, 1390, -1967, -1202, 2047, 1024, -2068, -862, 2123, 661, -2064, -564, 2103, 438, -2095, -300, 2156, 171, -2167, -32, 2214, -115, -2181, 277, 2206, -384, -2122, 628, 2071, -816, -1999, 993, 1932, -1060, -1794, 1090, 1766, -1262, -1698, 1309, 1589, -1424, -1479, 1585, 1431, -1689, -1330, 1867, 1101, -1883, -950, 1954, 852, -2076, -674, 2059, 617, -1956, -383, 2032, 322, -2020, -153, 2083, 81, -2091, 73, 2098, -213, -2081, 386, 2096, -569, -1993, 659, 1895, -807, -1831, 799, 1759, -958, -1687, 1062, 1603, -1196, -1643, 1278, 1504, -1394, -1436, 1480, 1419, -1683, -1247, 1822, 1151, -1823, -936, 1961, 774]
5779G74k757J298K658j456k492J609K456j784k391J970K190k053k178K211K101
5794B156k456j831K651J573k715j397K813J179k932q87K853P94k958n13K875L95
5810A600k917k19K972k8k922K16K914l81k912O26K854r08k726J029K749j345k579
5827a977J519K432j692k193J713K234j906k120K036J936k096j898K366J702k547
5842d91j553K673J376k796j142K851Q35k744o69K755M93k797k94K741J53k665
5858a274p4K801j61k827L14K815m82k770P25K730r84k636J213K460j318k360J458
5875c70K246j654k091J689K100j865j982J962J856k025j842K325J631k463j487
5890a970K632J240k695j019K688Q13k717n75K692M82k738l17K716K71k849rK780
$$ y = [774, -1983, -685, 1973, 517, -1975, -366, 2090, 306, -2085, -115, 2075, 22, -2156, 55, 2156, -300, -2131, 520, 2093, -622, -2019, 794, 1973, -959, -1846, 1007, 1801, -1157, -1670, 1205, 1600, -1317, -1536, 1436, 1408, -1514, -1298, 1616, 1235, -1677, -1051, 1803, 895, -1831, -802, 1947, 602, -1977, -458, 1974, 282, -1911, -198, 2036, 130, -1990, 46, 1982, -114, -2012, 354, 2056, -491, -2044, 629, 2005, -791, -1933, 918, 1753, -991, -1660, 1095, 1588, -1209, -1503, 1238, 1391, -1274, -1348, 1453, 1292, -1535, -1221, 1594, 1112, -1658, -933, 1797, 813, -1823, -610, 1850, 532, -1828, -370, 1876, 222, -1869, -180, 1920, 55, -1927, 35, 1891, -134, -1976, 349, 1980, -483, -1970, 662, 1902, -793, -1812, 876, 1689, -1028, -1603, 1089, 1571, -1167, -1484, 1232, 1503, -1346, -1355, 1425]
5907A425j19k833L16K917o46k864Q67K753j033k654J290K476j399k404J560K241
5923A893j688k166J894J943j835j957J992J930k275j692K365J552k543j325K640
5938G28J153k849q47K852O67k827m63K857J97k737p7K714p0k762K24K846m89k748
5956a631O46K738q86k664J045K530j215k395J438K226j522k167J705J985j766
5971F7j935J891J797j914j725K021J607k131j478K287J248k369j128K470R02k476
5987h66o97K562M97k590k88K543J64k480l1K527j38k596K94K579l77k643N92K601
6005A653q25k569J026K482j232k414J503K168j521k099J732J920j804j890J947
6020G7J745j950j692K102J534k190j376K275J312k522j005K473Q22k538n73K524
$$ y = [1425, 1306, -1527, -1211, 1706, 1060, -1804, -937, 1816, 783, -1871, -581, 1895, 496, -1908, -348, 1893, 205, -1961, -67, 1876, 41, -1916, 76, 2006, -269, -1961, 404, 1956, -587, -1912, 728, 1881, -968, -1815, 1037, 1704, -1123, -1586, 1271, 1468, -1269, -1346, 1368, 1298, -1464, -1240, 1606, 1117, -1631, -985, 1753, 867, -1797, -752, 1778, 563, -1832, -394, 1832, 310, -1857, -152, 1833, 67, -1868, 23, 1820, -94, -1819, 202, 1809, -322, -1800, 487, 1735, -634, -1762, 708, 1610, -866, -1563, 999, 1496, -1094, -1382, 1161, 1325, -1155, -1186, 1341, 1203, -1393, -1099, 1480, 1103, -1540, -948, 1653, 828, -1741, -715, 1767, 535, -1879, -376, 1792, 271, -1828, -96, 1824, 20, -1870, 77, 1822, -128, -1820, 282, 1816, -374, -1750, 525, 1837, -685, -1690, 783, 1605, -933, -1506, 1018]
6036A018M53k616k31K613Pk499M3K528j14k648L64K574m66k666P90K578r90k545
6054a807J206K456j402k312J592K117j756j955J816J871j904j778K030J708k223
6069c41j445K249J366k399j189K504R76k588q15K673N86k728k34K530J02k508
6085a261M2K537j92k499K87K469m05k445N46K430p15k452R28K466j215k207J278
6102d08K098j446j988J645J863j754j725J745J628j801j592J977J414j984j376
6117a704K161J276k346r91K387Q61k465p09K546M43k594k18K512J31k491m4K501
6134A256j08k422J64K457l46k522O14K436p11k447R83K324j111k324J331K171
6150A745j420k063J556J910j722j687J769J651j873j562J912J491k089j375K299
$$ y = [1018, 1471, -1145, -1376, 1237, 1244, -1255, -1212, 1316, 1202, -1446, -1082, 1492, 1026, -1640, -850, 1728, 738, -1807, -601, 1855, 453, -1859, -267, 1850, 94, -1861, -45, 1826, -78, -1856, 174, 1882, -341, -1786, 463, 1829, -570, -1759, 745, 1721, -867, -1682, 991, 1577, -1151, -1385, 1145, 1247, -1261, -1219, 1318, 1126, -1373, -1086, 1383, 978, -1467, -921, 1509, 794, -1658, -730, 1736, 521, -1686, -408, 1690, 244, -1744, -99, 1764, 10, -1715, 30, 1658, -143, -1735, 242, 1656, -328, -1704, 457, 1733, -613, -1604, 783, 1644, -821, -1530, 1016, 1459, -1135, -1353, 1159, 1290, -1201, -1245, 1256, 1148, -1274, -1110, 1347, 1001, -1521, -907, 1529, 818, -1629, -646, 1678, 567, -1757, -426, 1745, 325, -1738, -182, 1728, 6, -1681, 88, 1739, -134, -1696, 216, 1707, -382, -1757, 542]
6165E42J189k428j005K560P69k610m96K555L91k639r0K496J7k505R6K512l09k464
6183a419M71K433o04k429P31K460r59k407J198K301j344k197J504K008j630j841
6199a724J661J732j750j566J831J463j915j358J971J312k155j136K255R39k266
6214g06q31K439N83k502l22K480O4k364qK368j09k381L14K176k64k370N42K361
6232A470p22k228Q22K246j077k146J219K076j361j925J384J891j576j690J611
6247fJ615j668j523J766J342j800j252J885J167k092j014K140Q90k190p43K336
6263H53N15k298l77K385J18k300j5K315j01k381L23K278m51k352O48K332p10k310
6281a528R09K248j125k194J372J980j490j873J638J769j707j615J746J522j953
$$ y = [542, 1731, -697, -1702, 858, 1627, -983, -1479, 1076, 1467, -1172, -1262, 1234, 1251, -1254, -1158, 1354, 1045, -1419, -948, 1485, 881, -1548, -817, 1643, 684, -1723, -525, 1776, 432, -1765, -261, 1747, 117, -1724, -63, 1669, -81, -1647, 184, 1647, -268, -1626, 345, 1657, -498, -1634, 621, 1560, -706, -1537, 902, 1485, -1017, -1339, 1141, 1205, -1159, -1167, 1201, 1092, -1289, -975, 1201, 937, -1433, -891, 1470, 748, -1480, -658, 1588, 511, -1635, -416, 1660, 299, -1626, -242, 1649, 73, -1617, -6, 1609, -59, -1582, 184, 1526, -274, -1526, 359, 1526, -566, -1580, 560, 1450, -740, -1483, 853, 1368, -930, -1307, 1078, 1196, -1104, -1119, 1196, 1095, -1286, -963, 1315, 864, -1488, -840, 1492, 782, -1528, -619, 1629, 504, -1690, -318, 1662, 172, -1701, -63, 1706, -1, -1616, 130, 1652, -301]
6296c01j307J931J274k001j196K093J013k187q33K279P02k284o23K437K80k318
6312a041j41K308m7k280K05K239l64k158L88K216n59k107O40K143q00k165J010
6329e13K080j239j984J476J894j660j741J739J537j751j412J806J310j875j199
6344a532J918J070k011r09K089Q24k153p44K241N43k258l43K275J78k318N1K261
6361A182k04k159K30K171l76k076M65K104n92k087O86K143q93k124J050J996j207
6378C09j862J406J740j490j646J596J538j709j446J777J316j901j190J944J144
6393A526k037r51K017R36k256o20K201N56k333k84K279J58k320J6K290j35k224
6410a181L01K152l76k224N50K179o82k181Q44K178j067k033J149J995j362j846
$$ y = [-301, -1608, 323, 1597, -404, -1600, 493, 1506, -681, -1514, 765, 1467, -817, -1440, 997, 1277, -1041, -1182, 1126, 1079, -1201, -996, 1243, 879, -1279, -891, 1325, 766, -1341, -701, 1442, 642, -1523, -513, 1567, 328, -1656, -180, 1714, 54, -1687, 52, 1589, -162, -1574, 232, 1542, -333, -1532, 386, 1456, -555, -1464, 625, 1449, -704, -1448, 793, 1336, -922, -1265, 1010, 1188, -1130, -1079, 1182, 978, -1181, -951, 1220, 844, -1232, -767, 1337, 745, -1342, -656, 1487, 594, -1530, -480, 1516, 309, -1553, -147, 1593, 103, -1543, 53, 1591, -118, -1564, 213, 1529, -372, -1562, 382, 1526, -511, -1462, 555, 1491, -765, -1385, 816, 1372, -961, -1245, 1034, 1192, -1128, -1112, 1178, 1043, -1181, -880, 1272, 896, -1328, -778, 1401, 719, -1462, -618, 1560, 493, -1540, -391, 1604, 242, -1604]
6426a604J470J767j678j563J738J382j761j299J820J224j883j110J960R83k037
6441e91q19K124O62k213n61K304K83k269o8K278o6k293K77K176l14k151M79K088
6459A326o75j920O09K038q25j934R22J881j027j823J113J814j376j598J444J526
6475A495j575j382J571J291j590j166J632J112j777j019J839R37j915q23K031
6490F61N73k017m87K168L36k221j27K177l8k137K27K030l24k047N13J971n88j937
6508a267O05K008q20j948R50J922j088j870J263J775j406j624J544J420j545j339
6524a420J633J159j672j047J727R71j753r47J887P66j887p25K038N09k127k35
6540a123K087J18k130j0K192j99k093L04K041m85j950N82J931o32k014Q82J956
$$ y = [-1604, -134, 1633, -45, -1608, 130, 1512, -249, -1548, 272, 1496, -387, -1497, 463, 1446, -591, -1410, 714, 1376, -837, -1398, 906, 1189, -1080, -1148, 1130, 1064, -1229, -952, 1224, 910, -1241, -762, 1326, 651, -1269, -660, 1378, 553, -1381, -459, 1422, 395, -1428, -315, 1499, 123, -1475, -31, 1495, -80, -1462, 109, 1400, -190, -1356, 276, 1388, -389, -1408, 431, 1368, -547, -1370, 661, 1234, -783, -1270, 898, 1234, -987, -1114, 1063, 1025, -1112, -885, 1145, 821, -1226, -713, 1258, 670, -1267, -662, 1346, 526, -1422, -472, 1450, 362, -1508, -245, 1530, 124, -1500, 44, 1464, -81, -1420, 213, 1372, -300, -1347, 380, 1351, -402, -1349, 538, 1304, -583, -1308, 730, 1239, -888, -1123, 964, 1082, -1048, -1058, 1134, 935, -1158, -854, 1187, 702, -1248, -666, 1265, 633, -1381, -499, 1457]
6557A457j054j865J151J717j156j753J433J544j611j326J633J300j772j103J717
6572C12J065j752r35J731Q49j856o79J925N39j948m46K034L13j969k66K074%k017
6590a026J20J993k80j899L89J918n84j865O71J742o35j773Q01J708r29j676J051
6607b74J660j217j609J356J457j428j337J526J219j575j093J644R97j801q86J733
6623C72Q30j730p23J867N56j889m34K030K79k053j65K048j3k003J65J958k82j981
6641a168M29J875m70j859O05J810p49j751Q33J706r37j633J037J679j297j549
6657a439J382J394j414j282J530J158j689r37J698Q50j706q01J795O67j791o23
6673a208J845M92j922l23J925K41j993l9K009j65j962L15J867m52j750N40J698
$$ y = [1457, 403, -1462, -311, 1406, 250, -1503, -70, 1474, -137, -1463, 170, 1470, -302, -1405, 312, 1377, -375, -1310, 421, 1270, -586, -1265, 660, 1199, -749, -1195, 839, 1152, -817, -1083, 991, 991, -1026, -906, 1087, 807, -1092, -703, 1215, 631, -1234, -563, 1179, 544, -1229, -428, 1280, 351, -1325, -274, 1386, 169, -1440, -84, 1373, -55, -1392, 134, 1353, -222, -1315, 329, 1326, -475, -1361, 372, 1202, -528, -1251, 616, 1172, -717, -1151, 879, 1158, -895, -1060, 988, 975, -1028, -863, 1095, 813, -1168, -739, 1136, 666, -1193, -588, 1222, 473, -1278, -445, 1261, 324, -1309, -272, 1407, 110, -1439, -57, 1337, -77, -1359, 171, 1329, -360, -1297, 401, 1251, -455, -1256, 539, 1206, -585, -1208, 637, 1129, -793, -1116, 809, 1050, -943, -982, 1027, 862, -1100, -785, 1082, 630, -1120, -580, 1118]
6690A118o02j702P00J682p98j644Q69J678j030j617J224J405j245j404J440J185
6706A259j397j141J559R63j517r35J598Q02j616p37J730N82j765m81J761L63j747
6723g19k91J813J49j913J67J742j70j846L61J794m18j789M99J751o44j642P63
6740c93J557p69j585Q55J603r92j486J058J419j212j328J265J263j412j112J538
6756B69J024j627q87J614P73j691n80J674N23j698m65J731L79j835k00J902Qj796
6774h82K3J855l04j719L70J867o47j705O01J681p28j631Q14J583q87j542J008
6791b43J498j110j422J286J290j316j220J424J075j506j011J600Q15j593o59J514
6807D22O72j554o08J640M68j742l94J833K55j815n3J814j68j728K30J682k50j802
$$ y = [1118, 516, -1186, -486, 1196, 398, -1246, -377, 1301, 271, -1346, -122, 1283, 38, -1366, 74, 1259, -138, -1279, 280, 1243, -274, -1209, 389, 1191, -425, -1162, 568, 1150, -615, -1096, 665, 1028, -719, -1010, 803, 952, -961, -794, 948, 778, -1068, -707, 1087, 669, -1120, -621, 1130, 486, -1156, -393, 1164, 395, -1190, -335, 1268, 276, -1210, -152, 1267, 55, -1273, -8, 1255, -157, -1269, 269, 1293, -334, -1221, 393, 1166, -525, -1105, 569, 1092, -606, -1071, 660, 1039, -796, -996, 906, 914, -882, -859, 996, 692, -1027, -657, 1210, 563, -1142, -541, 1140, 412, -1219, -405, 1178, 291, -1251, -243, 1255, 145, -1277, 9, 1299, -17, -1237, 187, 1262, -244, -1255, 345, 1160, -433, -1092, 422, 1094, -460, -1068, 572, 1040, -702, -1096, 737, 992, -823, -876, 938, 770, -958, -728, 954, 704, -1098]
6825a098N49J546n05j646O49J661q03j499Q14J473r51j332J031J374j206j297
6841a240J294J107j304j067J446R25j466q31J469P97j578o17J532N45j607l73
6857i68J522L58j511l83J641K49j740n1J705k7j771K64J639k61j671M38J599n44
6875D88j566O22J571p70j466Q13J467r70j414J086J327j161j210J215J241j467
6891a94j043J518R53j563q73J616P60j649n99J577N15j645m18J690L27j673k68
6908i69J697J80j791P6J781j88j793L16J719m88j604M93J711o51j618P77J510
6925A158q38j478R42J360j043j340J171J302j326j124J337J088j474q33J456P85
6941A143j482o91J529N68j643m01J590L39j584l00J635J30j594r0J669m2j681
$$ y = [-1098, -549, 997, 492, -1154, -505, 1156, 353, -1146, -332, 1141, 190, -1142, -111, 1263, 57, -1240, 54, 1161, -143, -1210, 236, 1161, -305, -1136, 333, 1130, -448, -1065, 467, 1012, -595, -968, 554, 912, -599, -982, 659, 908, -832, -883, 822, 795, -976, -712, 927, 666, -1005, -567, 1032, 488, -1078, -456, 1115, 345, -1121, -308, 1159, 189, -1225, -139, 1188, 27, -1183, 32, 1273, -194, -1237, 281, 1234, -329, -1202, 414, 1174, -475, -1074, 503, 1018, -627, -1045, 645, 972, -701, -969, 728, 908, -883, -807, 974, 786, -1007, -691, 1028, 540, -1064, -571, 1140, 489, -1129, -352, 1158, 320, -1158, -216, 1144, 101, -1239, -68, 1234, -92, -1216, 121, 1209, -265, -1098, 358, 1143, -339, -1030, 499, 1067, -576, -977, 613, 952, -632, -932, 703, 833, -761, -851, 818, 776, -905]
6958i05J56J709k94j645M30J528n26j490O40J427o88j377P81J265p50j318R17
6975a40J233j011j172J095J151j206j130J345J009j408q78J446P05j487n78J511
6991D85N89j611m73J581L12j569k42J649J43j631j04J690r7j641K37J632l84j589
7009a023N27J484n34j488O78J450p80j356Q16J359r27j350R99J225j046j185J203
7026E2J125j309j085J388R73j462p71J480O86j546o10J573M41j500m18J649K32
7043H98j598j59J607J05j648l1J833l29j649L51J661m71j661O53J539p13j445
7060a057P65J408r01j280R64J219j075j144J086J140j196j041J239R46j330q51
7076a108J391P73j471n99J441N46j440m82J427M16j493l01J559K02j507j02J496
$$ y = [-905, -749, 960, 666, -979, -549, 979, 453, -1037, -397, 1030, 342, -1035, -254, 1011, 261, -1057, -140, 1093, 82, -1090, 5, 1156, -50, -1180, 165, 1174, -234, -1112, 334, 1039, -448, -1026, 485, 1074, -537, -1010, 571, 883, -686, -928, 721, 864, -767, -871, 819, 722, -919, -682, 950, 566, -1023, -496, 988, 454, -1034, -356, 1094, 314, -1042, -226, 1133, 206, -1144, -145, 1080, 34, -1151, 52, 1177, -132, -1217, 171, 1144, -318, -1089, 391, 1077, -469, -1079, 494, 935, -565, -983, 666, 898, -700, -859, 748, 853, -795, -826, 1007, 678, -971, -620, 1041, 570, -1091, -438, 1101, 388, -1057, -292, 1116, 215, -1065, -101, 1118, 43, -1101, -15, 1125, -71, -1112, 127, 1073, -257, -1108, 283, 1056, -415, -1014, 427, 973, -467, -949, 478, 894, -599, -900, 659, 861, -646, -748, 748]
7093G48J1j608J80J541k28j507K79J561m42j510N32J443o28j417P55J287q43j257
7111a103R84J178r71j161J012J060j081j044J267R47j394p51J334P82j431n95
7127i67J397N58j479m50J514K42j395l24J590J81j624j3J520l8j529Q6J701l25
7145F45j619M43J511m89j459N87J391p43j301Q03J247q59j187Q58J243j023j137
7162a089J110J077j253r60J295Q59j334p44J470O35j557m71J476M28j443m03J513
7179F09K45j445k51J579N2j556P5J450p1j581K16J611m14j465N27J370n83j381
7197a013O88J326q11j162P60J224r02j149R84J008r52j027J089R69j171q71J260
7214B50P48j317o04J282N93j416m65J385L69j352l32J439J95j369j31J411K9j430
$$ y = [748, 759, -849, -669, 872, 644, -863, -584, 977, 535, -975, -443, 1000, 372, -1045, -290, 997, 154, -1103, -119, 1059, 88, -1073, -61, 999, -82, -1126, 141, 1088, -306, -1057, 277, 1059, -372, -967, 430, 988, -491, -941, 573, 815, -580, -904, 686, 867, -757, -770, 750, 712, -817, -731, 970, 645, -974, -531, 980, 491, -968, -381, 1010, 267, -1034, -231, 1016, 157, -1030, -172, 1071, 48, -1089, 21, 1098, -155, -1115, 180, 1039, -295, -1039, 431, 1066, -491, -962, 514, 942, -501, -904, 609, 854, -591, -842, 737, 789, -767, -692, 758, 687, -894, -678, 933, 519, -946, -419, 951, 368, -1013, -325, 1001, 190, -972, -212, 1012, 110, -1039, -55, 953, 1, -1026, 63, 1032, -139, -1010, 250, 998, -319, -923, 359, 952, -464, -929, 456, 825, -527, -859, 580, 775, -594, -725, 686, 715, -715]
7232g15M8J434j67j454K34J468l49j442N24J395o24j307O49J278o99j247P89J114
7250I29q22j115R43J049r71j029J102R97j244q50J239P86j327o35J323N91j475
7267e09m12J442L23j390k67J484Q6j408o1J505j34j415P2J475k39j434L87J443
7285I48n62j359N57J427o95j310P53J229q79j072Q93J050r21j100J029J002j062
7302g2r15J164Q41j184q08J264O35j346m90J324M43j314l37J336K15j349j47J395
7320F55Q5j375k0J394j61j371K22J419k65j499M49J341n03j292O43J215p03j205
7338i71P82J117p61j118Q63R94q80j002R89R36j051q88J203P62j184p63J298O28
7356I54j314n51J302N00j352l72J360L21j448j35J304J75j418j4J381kj470J43
$$ y = [-715, -667, 767, 600, -854, -620, 848, 499, -943, -419, 976, 352, -955, -306, 972, 273, -974, -185, 929, 107, -1008, -65, 984, 13, -1016, 86, 1083, -161, -1011, 228, 1014, -313, -948, 375, 966, -509, -921, 521, 844, -546, -813, 671, 757, -651, -712, 793, 659, -756, -684, 791, 552, -882, -495, 948, 386, -973, -416, 1011, 316, -994, -241, 988, 109, -963, -70, 980, 59, -1041, -12, 990, -72, -987, 177, 1018, -166, -974, 290, 925, -421, -911, 413, 856, -458, -795, 541, 756, -593, -740, 655, 740, -635, -655, 739, 578, -793, -571, 848, 583, -916, -467, 874, 371, -921, -278, 937, 234, -971, -189, 928, 167, -951, -88, 906, 26, -976, 13, 949, -102, -990, 213, 975, -209, -972, 326, 954, -360, -911, 391, 891, -461, -833, 527, 848, -600, -735, 569, 744, -674, -688, 693, 691, -779, -636]
7374f36J439k83j411M06J392m79j364O27J209o65j231P88J205q68j074Q57J039
7391I51r41r76R88R03j027q65J145Q08j283o27J236N48j348m30J422L49j349k74
7409g70J317K56j358j37J300J3j319M4J416k22j348K55J373l79j286N07J268o17
7427C13j259O91J145p35j048P72J020q10r34Q31R44r50q71R70Q21j061p27J101
7445B13O20j140n69J237M35j222l48J253J99j159k87J320J13j255p8J302K3j339
7463f82P8J352j50j375L10J281l62j192L63J242n42j178O21J202p12j167P48R98
7481H35p30j028Q43R64q93q54R09Q76j028q17J143O67j179n65J232M14j234l76
7499h21J331K38j315j62J278J27j307J3J236j9j312J59J241j31j411L67J322m54
$$ y = [-636, 803, 520, -891, -485, 907, 428, -936, -309, 900, 235, -996, -208, 997, 129, -945, -88, 951, 10, -966, 22, 925, -102, -967, 178, 986, -297, -924, 312, 860, -488, -918, 504, 853, -496, -770, 547, 803, -555, -692, 608, 621, -698, -654, 762, 540, -808, -553, 820, 441, -845, -338, 930, 313, -946, -255, 890, 155, -893, -121, 899, 89, -845, -14, 930, -20, -891, 79, 900, -161, -888, 213, 833, -307, -876, 361, 796, -426, -774, 479, 678, -481, -768, 552, 665, -590, -668, 634, 657, -682, -604, 748, 598, -777, -467, 814, 452, -740, -377, 865, 323, -855, -234, 968, 256, -911, -163, 835, 105, -923, -80, 884, -9, -863, 46, 922, -106, -923, 220, 887, -292, -857, 375, 789, -445, -821, 510, 748, -567, -729, 549, 676, -631, -618, 618, 599, -713, -554, 687, 556, -855, -488, 834, 380]
7517C80j268N47J199o00j178O54J166p09j086P11J102q67r24R05R05j006q46J013
7535I8P75j075o93J181N38j173m63J224L53j260l00J282K27j244j80J253P4j210
7553e93k4J306j01j316K42J226k76j232L80J199m16j248N86J104n72j110P09R76
7571H40p39r60Q02R40q98q81R05Q20q84q12R79P37j074o09J056N52j048n21J169
7590C74L98j187l11J160K51j203j89J234J47j321L1J261p3j261J51J185j85j240
7608g78L28J250m35j183N12J190o39j036O24J112p95j060Q47R56q97q61Q45Q32
7626H12r00p93R98P21j086o06J110O50j224n05J194M06j232k45J160K47j186j73
7644f52J222N3j299R0J204r4j239K23J245l29j235L99J210m49j200N81J130o87
$$ y = [380, -888, -341, 858, 258, -920, -266, 900, 191, -895, -184, 918, 51, -873, 32, 937, -69, -915, 98, 873, -202, -895, 286, 824, -349, -812, 412, 765, -495, -795, 487, 714, -530, -710, 543, 617, -593, -617, 689, 588, -728, -486, 740, 464, -768, -388, 811, 395, -853, -267, 837, 265, -845, -136, 840, 101, -859, -57, 883, -15, -896, 9, 829, -55, -867, 112, 849, -225, -834, 222, 774, -274, -795, 374, 772, -415, -726, 434, 685, -518, -707, 527, 674, -647, -616, 645, 572, -689, -538, 647, 462, -778, -450, 800, 365, -818, -306, 884, 245, -791, -167, 945, 150, -910, -63, 893, -4, -865, -20, 812, -88, -881, 117, 838, -248, -854, 256, 906, -318, -823, 371, 777, -455, -700, 460, 707, -479, -652, 570, 623, -676, -586, 618, 524, -715, -492, 753, 424, -811, -412, 798, 349, -851, -270, 860, 173]
7662A73j017P60R57q56q37Q05Q49r10q31R57P96r63p24J039O41j071n90J153M62
7681G93j085m63J179K42j120k28J224J40j257q7J175M6j168P8J183j43j217J95
7699e13J264l86j148L64J198n07j151O05J029o80q58O67R06p16q55Q13P81q66
7717e3p67R02O92r22o91J055N85j114m74J155M56j214l74J189K55j142k12J162
7735D88J22j134q8J170M8j215P7J148j07j210K81J139l12j181M13J154n35j100
7753h42O57J017p38j008P57R76q63q09Q89P93r33p12R52O50j007n66R97O09j146
7772c27m42J157L35j097l08J240J59j285m4J171M4j218R1J154j15j165J90J120
7790F60k35j135L28J130m93j025N23R98n70r77O46R59o96r68P95R28r21q00R05
$$ y = [173, -844, -84, 873, 17, -820, -15, 834, -76, -907, 50, 846, -117, -841, 198, 839, -232, -822, 331, 793, -292, -755, 424, 666, -454, -682, 542, 682, -575, -662, 513, 559, -609, -531, 652, 509, -708, -513, 751, 365, -783, -419, 779, 272, -879, -274, 755, 75, -783, -116, 790, 74, -781, 32, 813, -53, -820, 82, 774, -148, -839, 216, 801, -313, -787, 368, 824, -390, -764, 425, 680, -462, -674, 488, 610, -524, -612, 558, 606, -609, -532, 616, 509, -701, -420, 719, 407, -774, -361, 793, 258, -842, -185, 832, 94, -914, -157, 819, -44, -853, 36, 829, -104, -816, 136, 786, -221, -787, 210, 819, -327, -769, 388, 723, -374, -682, 558, 717, -568, -612, 559, 603, -615, -524, 630, 515, -650, -460, 660, 425, -710, -382, 748, 255, -770, -247, 751, 181, -796, -150, 809, 113, -855, -60, 868, -53, -853, 52]
7809E2P41r33o89R84O55j044n71J130L76j033m31J190K79j142k33J159J07j054
7827d57p0J064k0j127J00J178j90j126K32J114k94j134M39J034m76j069N87R33
7845G18n54r69O21R90p28q93P61Q81q29q53Q93P69r41o10R19N54r91m77R85N03
7865G49j120l10J074K80j122j70J095J21j157q1J261n9j170J45J031j44j049J56
7883d70J225m70j107M98J065m89j051O94R44p26q95P55P67p97o92P54Q06r08o45
7902g42Q90O60j052n04J028M72j052l79J011M02j140k57J084J73j048j44J086
7919D88Q7j099L2J069j43j055J48J152l12j069L85J004m04j024N07R65n99r05
7937g73O47Q32o07q72Q06O79p75o32P51O41q54n70Q87N66r55m14Q75M41r98l43
$$ y = [52, 793, -140, -829, 155, 810, -234, -805, 325, 701, -332, -763, 427, 706, -436, -669, 490, 597, -457, -527, 537, 517, -610, -510, 668, 478, -648, -416, 698, 404, -730, -291, 743, 267, -802, -215, 718, 164, -805, -184, 806, 78, -815, -54, 827, -2, -855, 38, 807, -134, -744, 175, 729, -262, -739, 246, 749, -371, -681, 393, 673, -449, -619, 476, 597, -560, -641, 620, 561, -609, -464, 567, 423, -626, -470, 755, 285, -822, -324, 741, 252, -799, -105, 839, 113, -782, -27, 740, -57, -749, 5, 811, -97, -742, 148, 808, -244, -748, 280, 752, -300, -679, 332, 734, -406, -663, 421, 594, -454, -598, 488, 575, -524, -492, 577, 434, -621, -473, 679, 367, -702, -317, 687, 283, -741, -234, 731, 132, -773, -126, 706, 99, -773, 33, 712, -63, -695, 56, 697, -157, -727, 160, 726, -229, -643, 232, 673, -325, -668]
7957f68J041K75j091k37J066J60j108K2J022k1j004K6J097j42j064J70J135l51
7975C28r91L88R85m10j075N20R98n83r19O49Q70p39p71P55P45p69p54Q91O67r30
7995a45n81R16M79r31m76J047M00j064l09J096J66j040j31J022J31j082k9J095
8013E64r3j102J79J048k33j016K90J080l12j061M20J024n38r19N55Q64n72r80
8031h02Q26P37q00p17P84P20r07n87R11N61r85m40R56L56r35l87J046K17r26j90
8051e62R46K05j131K6J008n7r88J13J005j80r76K36R40j93j017L10J003l55j031
8070f98M45Q90m27q93N59Q59o27q83P39Q12p73p10P57O72q33o56Q60N77q61n42
8090g33R70M16r43l14R51L31j068j80J004J46j093m1J084L4j080LJ097j77j065
$$ y = [-668, 373, 648, -443, -680, 386, 546, -562, -540, 482, 461, -543, -517, 580, 438, -626, -456, 679, 328, -663, -275, 710, 300, -775, -255, 743, 160, -759, -110, 760, 21, -750, 5, 750, -19, -773, 118, 785, -145, -726, 190, 669, -262, -738, 309, 709, -355, -664, 432, 598, -442, -573, 449, 580, -502, -531, 564, 471, -631, -452, 596, 363, -653, -363, 717, 405, -656, -236, 788, 250, -669, -114, 750, 178, -802, 24, 761, -39, -756, 28, 748, -159, -746, 165, 726, -259, -699, 257, 613, -322, -709, 337, 554, -372, -562, 384, 589, -542, -516, 492, 435, -553, -440, 565, 385, -591, -355, 585, 392, -625, -315, 688, 333, -698, -253, 637, 210, -683, -124, 735, 108, -775, -36, 776, 3, -707, 50, 722, -111, -767, 93, 670, -191, -733, 237, 653, -290, -604, 347, 678, -390, -570, 434, 580, -513, -554, 530, 564, -516, -513, 584, 407, -658]
8109f58K33R69k88r25L71R29l54r55M72Q91n68q09N62Q43o32q15P66O69p62o36
8129f97P91O00q31n53Q82N23r73m30R69L32r55l13J075J25r45k09J093M5j010
8148d81k7J004m0j051J19J034k24r41K75J018l61r59L88Q98m91q55N01R24o33
8167I8p71N84Q36p85p13P71O90q38n88Q27N06q09n01R43L73q48m30R02L50r33
8187c36k41R99R9r28
$$ y = [-658, -425, 544, 256, -669, -298, 631, 277, -678, -206, 685, 117, -692, -130, 713, 81, -734, 32, 701, -61, -697, 94, 694, -137, -690, 192, 715, -258, -688, 281, 613, -342, -655, 420, 545, -400, -609, 484, 529, -481, -508, 496, 456, -595, -476, 558, 334, -607, -332, 686, 325, -634, -246, 652, 161, -694, -193, 731, 98, -673, -89, 747, -38, -751, 20, 710, -128, -716, 111, 617, -192, -693, 250, 623, -225, -655, 247, 597, -336, -577, 422, 521, -407]
8191d07
$$ Imaginary data points
##PAGE= N=2
##DATA TABLE= (X++(I..I)), XYDATA
0@%%%%%%%%%%qJ6j6J6k4M0m8N6p0Q6j04J20j38J63j94K26k60L02l51M03m59N27
32B83o03O80p66Q64r74J091j220J364j518J687j873K078k301K540k801L091l410
49a788L755m135M557n023N539o116O767p506Q349r323J0468j1834J3492j5557
63h355J8222k1798K6869l4682M8367p9038K65287r8989n67457M68762L92774m26815
75a6853l95809M66871L05618m29948k98459M43921K58277m22391k61274M51246
85A01199K35210m58119k14955M96643J67695n07174j23155N22548N7975n14283
95b36416q925M99230m0164m68396O8719M45324r1338m21490J01614M07859j15795
106A40222m02989J26700M04334j50296m05968J78115M02538k11775l88507K47583
$$ y = [0, 0, 0, 0, 0, 0, 0, 0, 0, 0, 0, -8, 8, -8, 8, -16, 24, -24, 32, -38, 48, -56, 64, -74, 89, -105, 121, -139, 163, -188, 215, -244, 283, -320, 360, -406, 458, -516, 575, -645, 719, -799, 888, -985, 1093, -1208, 1332, -1469, 1622, -1788, 1967, -2168, 2389, -2634, 2905, -3211, 3556, -3950, 4399, -4924, 5544, -6290, 7202, -8355, 9867, -11931, 14938, -19744, 28623, -50415, 214872, 115883, -451574, 17188, 409962, -16853, -412662, 54209, 359827, -70121, -368580, 75341, 333618, -88773, -350047, 101199, 336409, -121710, -336665, 159978, 327673, -179501, -302656, 219892, 277867, -236416, -245341, 253889, 213725, -254671, -185952, 259372, 168034, -253456, -151842, 256017, 140222, -262767, -136067, 268267, 117971, -287997, -109882, 292656, 80881, -307626, -60043]
116f0043L70039k76876l36086L04210L01592l17709k65485L21088K33921l21761
126d7110k13470L15839J95862l16702j87982L21156J78940l35260j64167L56254
136A03360J42517l73371j08830L88012P1953l91223l1276L84228n606l68282L1899
147a56619L47925m9572l32634N9052L23273o6570l21900P6097L26999r2418l33882
158b20249J18323L35241j51529l27454J85540L09636k15974k84158K39445K55253
168B44074k52165k25973K57322K04106k57993j88855K60808J78447k68917j69509
178b18655K81772J56846l00711j39440L19858J12533l35621p9131L43282M3819
188A84552l41645r610L33590j9437l19702M2299L05262n7602k93527O8850K86824
$$ y = [-60043, 309996, 33120, -302966, 1244, 302836, -14873, -280358, 40730, 274651, -47110, -260580, 55259, 251121, -65581, -253563, 67593, 246533, -88727, -252894, 103360, 245877, -127494, -236324, 151688, 223641, -167582, -198858, 185370, 179764, -188518, -156619, 191306, 141734, -190900, -131848, 191425, 124855, -197045, -120948, 206051, 113633, -220249, -101926, 233315, 81786, -245668, -60128, 249508, 33534, -250624, -11179, 244074, -8091, -234064, 23258, 227364, -30629, -219484, 41324, 219771, -49146, -218655, 63117, 219963, -80748, -220188, 99670, 212203, -123418, -202549, 140733, 184552, -157093, -166703, 166887, 147450, -172252, -129953, 175309, 117707, -175820, -106970, 179854]
199A79854q0682k83917R5579K81959j14411k79270J37642K72118j63940k58556
209b13624J88968K38196k09412k14224K23531J89094k31921j65012K35183J44781
219A85560k35051j29787K36176J18739k40764j08221K48909R5699k59157p9650
229a67547K70007N8509k78493l2751K81536N399k77237J9897K67690m0542k55464
240a48996N5718K42628o6005k32471P2326K26632p9316k25430Q9924K25287j04767
251E5530k23112J23341K17434j43448k05968J62842J89018j77454j68733J85876
261A5326J49297j89383j33481J90470J21342j91359j13116J94640J07392k02298
271e1170j00679K13978Q9582k26896p3582K37808N3554k45651l0984K48154P746
$$ y = [179854, 99172, -184745, -89166, 192793, 78382, -200888, -63246, 208872, 44932, -213624, -24656, 213540, 4128, -210096, 13435, 202529, -29392, -194404, 40779, 185560, -49491, -179278, 56898, 175637, -65127, -173348, 75561, 171260, -87897, -167547, 102460, 160969, -117524, -150275, 131261, 136660, -140577, -120680, 147010, 106468, -148996, -93278, 149350, 83345, -149126, -76800, 149832, 70516, -154914, -64990, 160297, 55530, -167582, -44241, 173193, 29745, -176223, -13381, 175637, -1817, -170550, 15326, 164623, -24760, -158241, 32229, 153571, -37788, -150904, 43736, 151128, -51170, -151849, 62129, 151711, -75185, -148767, 89041, 142595, -103056, -134040, 114114, 121860]
282A21860k45289J2916K38688k9001k31174M1653K25292n2009k21033O2219K19150
293A43272p3244k18773Q7352K17645j05146k13272J24104K04401j42661j91638
303a67960J59185J75240j72271j56781J80666J38702j84772j22958J86859J10503
313A46413j89180j00177J92653R1158j98461q1981K06814P0036k16513n3853K24516
324I1425L4198k28884j2752K29041q658k24576K8235K16237m3193k06539N3919
335g1547J98491o1812j93541O9351J90755p8362j89961R0328J88641j05974j84337
$$ y = [121860, -123429, -110513, 128175, 99174, -132000, -90347, 134945, 82936, -138097, -75878, 143272, 70028, -148745, -61393, 156252, 51106, -162166, -38062, 166339, 23678, -167960, -8775, 166465, -5806, -162587, 18079, 156781, -27991, -150949, 35910, 146413, -42767, -142944, 49709, 140867, -57594, -139575, 67239, 137275, -79238, -133091, 91425, 125623, -103261, -116013, 113028, 104370, -120206, -91971, 124266, 81073, -125466, -71547, 126944, 65132, -128409, -59058, 131697, 53335, -136626, -46298, 142343, 36369, -147968]
$$ [...]
8191e12
##END NTUPLES=NMR FID
##END=
