##TITLE=1H_B3f2301
 200.13MHz, CDCl3,
 8 sc
 
 24.1.2025
##JCAMPDX= 6.0         $$ Bruker NMR JCAMP-DX V2.0
##DATA TYPE= NMR FID
##DATA CLASS= NTUPLES
##ORIGIN= UXNMR, Bruker Analytische Messtechnik GmbH
##OWNER= pz
$$ XWIN-NMR		Version 3.5
$$ Fri Jan 24 14:15:33 2025 Russian Standard Time (UT+4h)  she@DPX200
##.OBSERVE FREQUENCY= 200.1313
##.OBSERVE NUCLEUS= ^1H
##.DELAY= (6, 6)
##.ACQUISITION MODE= SIMULTANEOUS
##.ACQUISITION SCHEME= undefined
##.AVERAGES= 8
##.DIGITISER RES= 18
##SPECTROMETER/DATA SYSTEM= spect
##.PULSE SEQUENCE= zg30
##.SOLVENT NAME= CDCl3
##.SHIFT REFERENCE= (INTERNAL, CDCl3, 0, 14.3821)
##AUDIT TRAIL= $$ (NUMBER, WHEN, WHO, WHERE, WHAT)
$$ ##TITLE= Audit trail, XWIN-NMR		Version 3.5
$$ ##JCAMPDX= 5.01
$$ ##ORIGIN= Bruker BioSpin GmbH
$$ ##OWNER= she
$$ F:/spectra/data/she/nmr/H-C/1/audita.txt
$$ ##AUDIT TRAIL=  $$ (NUMBER, WHEN, WHO, WHERE, WHAT)
(   1,<2025-01-24 14:14:08.68 +0400>,<she>,<DPX200>,
      <created by zg, POWCHK disabled, PULCHK disabled
       configuration hash MD5:
       00 E9 B6 7A A2 85 ED C7 34 08 36 98 17 FE 4E 26
       data hash MD5: 16K
       E4 30 85 EC AB 0B 75 F6 3C C3 C4 0E 35 F9 03 25>)
$$ ##END=
$$ 
$$ hash MD5
$$ 2C 5A 5A 29 77 09 3D 40 9B 31 24 3B F8 DF 1F A2
##$RELAX= 
##$RELAX= 
##$RELAX= 
##$RELAX= 
##$RELAX= 
##$RELAX= 
$$ Bruker specific parameters
$$ --------------------------
##$DU= <F:/spectra>
##$EXPNO= 1
##$NAME= <H-C>
##$PROCNO= 1
##$TYPE= <nmr>
##$USER= <she>
##$AMP= (0..31)
100 100 100 100 100 100 100 100 100 100 100 100 100 100 100 100 100 100 
100 100 100 100 100 100 100 100 100 100 100 100 100 100 
##$AQSEQ= 0
##$AQ_mod= 1
##$AUNM= <au_zg>
##$AUTOPOS= <>
##$BF1= 200.13
##$BF2= 200.13
##$BF3= 200.13
##$BF4= 200.13
##$BF5= 200.13
##$BF6= 200.13
##$BF7= 200.13
##$BF8= 200.13
##$BYTORDA= 1
##$CFDGTYP= 0
##$CFRGTYP= 5
##$CHEMSTR= <none>
##$CNST= (0..31)
1 1 145 1 1 1 1 1 1 1 1 1 1 1 1 1 1 1 1 1 1 1 1 1 1 1 1 1 1 1 1 1 
##$CPDPRG= <>
##$CPDPRG1= <>
##$CPDPRG2= <>
##$CPDPRG3= <>
##$CPDPRG4= <mlev>
##$CPDPRG5= <mlev>
##$CPDPRG6= <mlev>
##$CPDPRG7= <mlev>
##$CPDPRG8= <mlev>
##$CPDPRGB= <>
##$CPDPRGT= <>
##$D= (0..31)
0 0.7 0 0 0 0 0 0 0 0 0 0.03 0 0 0 0 0 0 0 0 0 0 0 0 0 0 0 0 0 0 0 0 
##$DATE= 1737713648
##$DBL= (0..7)
120 120 120 120 120 120 120 120 
##$DBP= (0..7)
150 150 150 150 150 150 150 150 
##$DBP07= 0
##$DBPNAM0= <>
##$DBPNAM1= <>
##$DBPNAM2= <>
##$DBPNAM3= <>
##$DBPNAM4= <>
##$DBPNAM5= <>
##$DBPNAM6= <>
##$DBPNAM7= <>
##$DBPOAL= (0..7)
0.5 0.5 0.5 0.5 0.5 0.5 0.5 0.5 
##$DBPOFFS= (0..7)
0 0 0 0 0 0 0 0 
##$DE= 6
##$DECBNUC= <off>
##$DECIM= 32
##$DECNUC= <off>
##$DECSTAT= 4
##$DIGMOD= 1
##$DIGTYP= 9
##$DL= (0..7)
0 120 120 120 120 120 120 120 
##$DP= (0..7)
150 150 150 150 150 150 150 150 
##$DP07= 0
##$DPNAME0= <>
##$DPNAME1= <>
##$DPNAME2= <>
##$DPNAME3= <>
##$DPNAME4= <>
##$DPNAME5= <>
##$DPNAME6= <>
##$DPNAME7= <>
##$DPOAL= (0..7)
0.5 0.5 0.5 0.5 0.5 0.5 0.5 0.5 
##$DPOFFS= (0..7)
0 0 0 0 0 0 0 0 
##$DQDMODE= 0
##$DR= 18
##$DS= 0
##$DSLIST= <SSSSSSSSSSSSSSS>
$$ [...]
##$SUBNAM0= <"">
##$SUBNAM1= <"">
##$SUBNAM2= <"">
##$SUBNAM3= <"">
##$SUBNAM4= <"">
##$SUBNAM5= <"">
##$SUBNAM6= <"">
##$SUBNAM7= <"">
##$SUBNAM8= <"">
##$SUBNAM9= <"">
##$SW= 18.0517328524113
##$SWIBOX= (0..15)
0 0 2 0 0 0 0 0 0 0 0 0 0 0 0 0 
##$SW_h= 3612.71676300578
##$TD= 16384
##$TD0= 1
##$TE= 0
##$TE2= 300
##$TE3= 300
##$TEG= 300
##$TL= (0..7)
0 120 120 120 120 120 120 120 
##$TP= (0..7)
150 150 150 150 150 150 150 150 
##$TP07= 0
##$TPNAME0= <>
##$TPNAME1= <>
##$TPNAME2= <>
##$TPNAME3= <>
##$TPNAME4= <>
##$TPNAME5= <>
##$TPNAME6= <>
##$TPNAME7= <>
##$TPOAL= (0..7)
0.5 0.5 0.5 0.5 0.5 0.5 0.5 0.5 
##$TPOFFS= (0..7)
0 0 0 0 0 0 0 0 
##$TUNHIN= 0
##$TUNHOUT= 0
##$TUNXOUT= 0
##$USERA1= <user>
##$USERA2= <user>
##$USERA3= <user>
##$USERA4= <user>
##$USERA5= <user>
##$V9= 5
##$VALIST= <valist>
##$VCLIST= <CCCCCCCCCCCCCCC>
##$VD= 0
##$VDLIST= <DDDDDDDDDDDDDDD>
##$VPLIST= <PPPPPPPPPPPPPPP>
##$VTLIST= <TTTTTTTTTTTTTTT>
##$WBST= 1024
##$WBSW= 4
##$XGAIN= (0..3)
0 0 0 0 
##$XL= 0
##$YL= 0
##$YMAX_a= 456592
##$YMIN_a= -543828
##$ZGOPTNS= <>
##$ZL1= 120
##$ZL2= 120
##$ZL3= 120
##$ZL4= 120
##$ABSF1= 10
##$ABSF2= 0
##$ABSG= 5
##$ABSL= 3
##$ALPHA= 0
##$AQORDER= 0
##$ASSFAC= 0
##$ASSFACI= 0
##$ASSFACX= 0
##$ASSWID= 0
##$AUNMP= <proc_1d>
##$AZFE= 0.1
##$AZFW= 0.1
##$BCFW= 1
##$BC_mod= 2
##$BYTORDP= 1
##$COROFFS= 0
##$CY= -3
##$DATMOD= 1
##$DC= 2
##$DFILT= <>
##$DTYPP= 0
##$F1P= 0
##$F2P= 0
##$FCOR= 0.5
##$FTSIZE= 0
##$FT_mod= 4
##$GAMMA= 1
##$GB= 0.15
##$INTBC= 1
##$INTSCL= 1
##$ISEN= 128
##$LB= 0.25
##$LEV0= 0
##$LPBIN= 0
##$MAXI= 10000
##$MC2= 0
##$MEAN= 0
##$ME_mod= 0
##$MI= 1.114404
##$NCOEF= 0
##$NC_proc= 0
##$NLEV= 6
##$NOISF1= 3.799351
##$NOISF2= 2.8
##$NSP= 1
##$NTH_PI= 0
##$NZP= 0
##$OFFSET= 14.38212
##$PC= 1
##$PHC0= 258.7682
##$PHC1= 4.192201
##$PH_mod= 1
##$PKNL= yes
##$PPARMOD= 0
##$PSCAL= 0
##$PSIGN= 0
##$REVERSE= no
##$SF= 200.129724274929
##$SI= 16384
##$SIGF1= 3
##$SIGF2= 2
##$SINO= 400
##$SIOLD= 16384
##$SREGLST= <1H.CDCl3>
##$SSB= 0
##$STSI= 0
##$STSR= 0
##$SW_p= 3205.1282051282
##$SYMM= 0
##$S_DEV= 0
##$TDeff= 0
##$TDoff= 0
##$TI= <>
##$TILT= no
##$TM1= 0
##$TM2= 0
##$TOPLEV= 0
##$USERP1= <user>
##$USERP2= <user>
##$USERP3= <user>
##$USERP4= <user>
##$USERP5= <user>
##$WDW= 1
##$XDIM= 8192
##$YMAX_p= 0
##$YMIN_p= 0
$$ End of Bruker specific parameters
$$ ---------------------------------
##NTUPLES= NMR FID
##VAR_NAME=  TIME,          FID/REAL,        FID/IMAG
##SYMBOL=    X,             R,               I
##VAR_TYPE=  INDEPENDENT,   DEPENDENT,       DEPENDENT
##VAR_FORM=  AFFN,          ASDF,            ASDF
##VAR_DIM=   8192,          8192,            8192
##UNITS=     SECONDS,       ARBITRARY UNITS, ARBITRARY UNITS
##FACTOR=    0.0002768,     1,               1
##FIRST=     0,             0,               0
##LAST=      2.2672688,     0,               0
##MIN=       0,             -543828,         0
##MAX=       2.2672688,     456592,          0
$$ Real data points
##PAGE= N=1
##DATA TABLE= (X++(R..R)), XYDATA
0@%%%%%%%%%%%%%%Pj5J6j6J6j6K0k5K9l2L7m5N2n8O6p9Q8r7J12j27J40j54J71
37I0j94K18k39K65k94L23l55L92m32M77n25N77o36O99p69Q50r40J042j160J296
57F85j455J644j876K166k533L013l676M641o150Q766j4111K8867j39226m24583
71e43828M86662L59215l88426p4510M09053j01185m19803J36780L11361j27182
81D8137p6585J67849j53571k64285K30257K63030k00121r8647K25251r9223l08285
92b66193K10834L40625k40521k43481K63859N3620l52560Q9112M49175j03245
102B01225m14938R2904K40359j75576p7905K87061J3209k96769N779J66202r0717
113d9166o204K50909m7840l33859M7659K63314j23641j41134K66339P2241l68534
$$ plain form
0 0 0 0 0 0 0 0 0 0 0 0 0 0 0 0 7 -8 8 -8 8 -8 12 -13 16 -16 21 -24 28 -30 36 -43 45 -52 60 -67 73 -81 90
37 90 -104 114 -125 140 -154 169 -186 206 -226 251 -274 303 -333 366 -403 447 -493 549 -611 685
57 685 -770 874 -1002 1164 -1369 1644 -2032 2609 -3541 5225 -8886 19981 -119245 -543828
71 -543828 -57166 302049 -86377 -160887 248166 146981 -272822 -136042 175319 48137
81 48137 -28448 139401 -14170 -278455 -48198 214832 14711 -83936 141315 42092 -266193
92 -266193 -55359 285266 44745 -198736 65123 118743 -233817 -144705 304470 201225
102 201225 -213713 -120809 119550 -56026 -133931 153130 166339 -130430 -124651 41551 -49166
113 -49166 -55370 195539 147699 -186160 -138501 124813 1172 -139962 126377 198618 -169916
124a69916n5344L58640J2617k63515J14983J93058k53803j84402K81610J47464
134A81392k13726l7083J42136r5965j10140J79996R3641j67860j3488J13902j35866
145f3061j03197K47797J14498k56930o8627K18268m7444k08934J60054K24598
155B17022k04012j99698J84929R8406j68209K8047J87439r3647j85207R5207J10717
166G0994r6541N110J21883r4515j37397J25762R5341j30396J4J58834q6904j97304
178a65119J23970J86656j40105j17412J67762L5540k00028J6935K06770l1707
188H3262j57080N5133P8778j00604k2339J22059j5033r5519N0873L6573r4544
199e8441J9831J34990n1411j41120P7160J07346j20867o2886J65037L1698j76354
$$ plain form
124 -169916 -225260 133380 145997 -117518 -2535 190523 -63280 -247682 33928 181392
134 181392 -32334 -69417 72719 -23246 -133386 46610 140251 -27609 -41097 72805 -63061
145 -63061 -166258 81539 196037 -60893 -129520 88748 41304 -167630 -7576 217022
155 217022 13010 -186688 -1759 96647 -71562 -43515 143924 50277 -134930 -39723 70994
166 70994 -25547 -20437 101446 6931 -130466 -4704 90637 -39759 -39745 119089 32185 -165119
178 -165119 -41149 145507 5402 -112010 55752 91292 -108736 -91801 114969 83262
188 83262 -73818 -18685 60093 -40511 -62850 59209 44176 -51343 -470 36103 -58441
199 -58441 -38610 96380 44969 -96151 -18991 88355 -32512 -95398 69639 101337 -75017
210g5017n670J52987k9427j16230P0721Q2608j00067n1690R8345J0730p2373L6933
222A850M1718p3128j4160Q5724k0319q0094O4838O6002j04537m0689J29842Q008
234F5055j34411K8860J23954o3839j06889Q8031P9000j02755m2674J03307N497
245D3136q6362K4687N4987m4846j7426N7908j6406n6940M8455L8051q1041p927
257d3724J06431k1990j15614M5158J02611o7303p7140R2877N2918j09959l2590
268f8325J02299O520p3799K6277M3333n2638k2416N8575K988l9920L3205J7936
280C4035p4594m276R2666j1924q2094M0356N9620p9293m8859J06928M4769j04740
292b7406k1888Q5344k1431p1988N8245O6372o2784n0141M5986J1452l2879L4768
$$ plain form
210 -75017 -80687 72300 42873 -73357 -2636 79972 -20095 -71785 26560 37290 -35083 1850
222 1850 43568 -29560 -43720 42004 21685 -58409 6429 72431 -32106 -72795 57047 65055
234 65055 -69356 -40496 83458 19619 -87270 761 79761 -22994 -65668 37639 43136
245 43136 -43226 -18539 36448 -8398 -25824 32084 15678 -41262 7193 45244 -35797 -43724
257 -43724 62707 40717 -74897 -29739 72872 5569 -71571 21306 74224 -35735 -68325
268 -68325 33974 40494 -33305 -7028 36305 -16333 -38749 19826 22814 -17106 16099 34035
280 34035 -40559 -44835 47831 35907 -46187 -5831 53789 -25504 -74363 32565 77334 -27406
292 -27406 -49294 36050 14619 -57369 876 67248 4464 -45677 309 11761 -21118 13650
304A3650L2157o0075k6150N1940j0227l8570O3216M4473r4195n2575R3078L3178
316D9900q3973J4405Q9929n5299j03054N9938R1678m2242m3487M3339m608o2074
328d5548K1332N8321k0215j8894K5433l6157m7650O7408O3825o4454m2046O5137
340B6492n538q9761M0650J14015m7327j03636M4146N6697n9826j0881R1491j042
352E5480r8984m551N9745j3648r122N3299j4158p1555J4059M7216k5247m64O5452
365E7522k5649j03735K3802R7635l0230n5462O7451K5469j08043k5900J13283
376C6143K7169q4022r98M9075m6489l9043P0742M2012m6539j6213J1187l5336
388c2312j878P5571Q099p7878L287N2865m9240m0677R8106N2689j05859n3723
$$ plain form
304 13650 45807 -14268 -40418 11522 1295 -37275 25941 70414 -23781 -76356 16722 49900
316 49900 -34073 -19668 70261 14962 -88092 -28154 63524 21282 -22205 21134 16526 -45548
328 -45548 -24216 34105 13890 -5004 20429 -15728 -63378 4030 67855 3401 -38645 26492
340 26492 20954 -68807 -28157 85858 38531 -65105 -20959 35738 -24088 -34969 56522 55480
352 55480 -43504 -48055 11690 -1958 -11080 42219 28061 -43494 -29435 17781 -7466 -7930 57522
365 57522 31873 -71862 -48060 49575 19345 -36117 31334 56803 -51240 -77140 36143
376 36143 63312 -20710 -21708 27367 -19122 -58165 12577 54589 8050 -8163 3024 -32312
388 -32312 -34190 41381 49480 -28398 -25111 27754 -21486 -62163 35943 88632 -17227 -70950
400g0950Q0695J6442o5440L5713P4096o2719p8514N2870M9557l3987N977M1159
412D4899m4192n7804M3156M2343l0977R039L8612n8469n9151P2130N7154o2609
424e869j9139O7647k8978r4728M8808J07899m2184p7633M4650K9253o5419l76
436c6069Q2043k384o8385K872K4215k8324J4920O0042k5569o0142K8317K6232
448A7768m8819R684Q3321k2621j01792K2276Q3337l6251m6029P1817K7623r5864
460c5550k8593Q3430J8966n1824J3842K8639m9526k3027N5675J3469l1798J8258
472A1961J0650n7352q591P4927P803o4354J5450M8269n4014m2844Q0051M1624
484F3580p8757k7858O3191o570n9170L8833O4886m7137n5392L8396K3922l1394
$$ plain form
400 -70950 9745 26187 -39253 -3540 70556 7837 -70677 -17807 31750 -2237 3740 44899
412 44899 707 -57097 -13941 28402 -2575 6464 45076 -13393 -72544 -414 56740 -5869
424 -5869 -25008 42639 13661 -81067 -32259 75640 33456 -44177 473 29726 -35693 -36069
436 -36069 45974 43590 -24795 -21923 2292 -26032 -11112 48930 23361 -36781 -8464 17768
448 17768 -31051 -21367 61954 39333 -62459 -40183 43154 6903 -39126 32691 60314 -35550
460 -35550 -64143 19287 38253 -13571 271 28910 -20616 -43643 12032 25501 -6297 11961
472 11961 22611 -34741 -43332 31595 39398 -24956 -9506 38763 -15251 -58095 21956 63580
484 63580 -15177 -43035 20156 13586 -45584 -6751 58135 10998 -44394 -5998 17924 -13470
496a3470J2397L4445l0809l3257L0467R583l1097K8455M3398n4704n0351O0816
508E873L7086o2006r426O9188j5269q0018K5234P3969k7992m6035L7574J5676
520B3854m8375K239M8101r967l1228K1766N731l9160J3135M8253k5288l8883L7028
533G206J6647n3067J315O6812j1318o6669K2743N4387l9143l8010N4257K5350
545D0510n6924j4604M5752m02l0730J8469J8662l0273n824L0275j1564k2921K9634
558A0060J3216m3195m529M7233o567m5006K4092M0726m0409l2027N0121K0083
570C3798n2554o272M9331o350m4669J5477L3521k0974j8024K2436L53j7166J5494
583D401P678k7516M201L7573j5211m2489K5900L9522l6842l0347M5661J9102m8145
$$ plain form
496 -13470 -1073 33372 2563 -30694 -227 9356 -21741 6714 50112 -4592 -54943 5873
508 5873 42959 -19047 -28473 40715 25446 -54572 -29338 44631 16639 -29396 8178 23854
520 23854 -24521 -22282 25819 15852 -15376 6390 12121 -27039 -13904 34349 9061 -29822 7206
533 7206 23853 -29214 -27899 38913 27595 -39074 -16331 38056 -1087 -39097 15160 40510
545 40510 -16414 -31018 14734 14332 -16398 2071 20733 -9540 -15364 14911 3347 -19574 10060
558 10060 23276 -19919 -24448 22785 16218 -28788 -4696 36030 -4379 -36406 13715 33798
570 33798 -18756 -25028 24303 17953 -26716 -11239 22282 1308 -16716 5720 6073 -11093 4401
583 4401 12079 -15437 -11236 26337 11126 -31363 -5463 34059 -2783 -33130 12531 31633 -16512
596a6512q789M3145l114l4222J7447K4525k9068j5983L0949M156k3772J0481J5508
609A4751k1921q410K5606L8k1928J6582J5972l5425j2678M5490O927m4493M107
622a5382L9002j8981l8392K9611L7300k9225k6260K4004P162j9917R507J8510
634A6939j3983j1417J0188n634j1271K5216J5813l4643j4299L3499L68l1691J7689
647c226L6014k7254m0374K5370L1300k2747j1500K8192l124l2704N558K6233k702
660I036q366P759r085j9250J4366K0173j4087n656J9187j2876l0797K0422L6927
673B7753j7222k8075J9929J1270l2849k59M4157M64l8921p99K0087r811o725K3788
687A2787O310k5612o162J0299n935O858K5140j2050l3153J0491K2978j8382r330
$$ plain form
596 -16512 -25301 17844 14730 -19492 -2045 22480 -6588 -22571 8378 12534 -11238 -757 14751
609 14751 -7170 -15580 10026 10064 -11864 4718 20690 -14735 -27413 18077 25004 -19489 -15382
622 -15382 23620 4639 -33753 -4142 33158 3933 -22327 1677 8839 -11078 -1571 16939
634 16939 2956 -8461 1727 -3907 -15178 10038 25851 -8792 -23091 10408 10776 -20915 -3226
647 -3226 32788 5534 -34840 -9470 21830 -917 -12417 15775 12651 -20053 -14495 11738 9036
660 9036 670 8429 -656 -19906 -5540 14633 546 -5110 14077 1201 -29596 -9174 27753
673 27753 10531 -17544 2385 13655 -19194 -19453 24704 25168 -13753 -14552 5535 -4276 -11001 12787
687 12787 19097 -6515 -12677 -2378 -8313 -1455 23685 11635 -21518 -11027 11951 -6431 -15761
700a5761L7951O147n0674r040M6009M551k9998J1474J9472k7196k1145K6533J8893
713A7216j4289k335M817j9640m078K9154N204k0193O693R050k8078j0275M2258
726A5504J6180l8720q598K8058j4439k6920L2206L2888l0731k9948K0064J0897
738F441j8041J0161K5219j6835k4387J0435P282o875J5247J3444k6400j8728K4790
751A753J0022k2877J1017K9682k8303l9286K9208L5502k3904j8451K8376R88l9357
764b5630M638M2041q95k5064M232K133j7092P328K4212o156j5190J0668k687k7188
778b4650J3491M0613j3459l7012J4724K1071k5685r195L9931P164m2453n597L1149
791A0092o066j6784K3289J1032l1361j1063K4108M062j1407J2933M042k7706l010
$$ plain form
700 -15761 22190 28337 -22337 -31377 14632 19183 -10815 659 20131 -7065 -28210 -1677 17216
713 17216 2927 592 5409 -14231 -18309 10845 16049 -4144 2549 11599 -16479 -26754 15504
726 15504 31684 -7036 -15634 12424 -2015 -28935 3271 36159 5428 -24520 -4456 6441
738 6441 -11600 -1439 23780 6945 -17442 -7007 275 -6600 8647 22091 -4309 -23037 1753
751 1753 11775 -11102 -85 29597 1294 -37992 -8784 26718 2814 -15637 12739 13727 -25630
764 -25630 -20992 21049 20154 -4910 -678 1455 -15637 -8309 15903 9747 -5443 5225 2538 -24650
778 -24650 -11159 29454 15995 -21017 -6293 14778 -10907 -20102 19829 26993 -15460 -21057 10092
791 10092 4026 -12758 10531 21563 -9798 -20861 3247 7309 -4098 8835 12877 -14829 -17839
804a7839K7304m060j6437K1743R887l8263j1696M4099J1385l7424J328L1050j9810
817A267l0858K7619K8955k3305j7734J6407L27j7065J3333J9259j5835j1525J2462
830C307n958j2672K1953J6086k7265j4292K6639K459k8934J3193L5145k1181l6715
843b8235K0453K6714j9974j1694K3834Q83k8223L837K2662p396q568J5773m159
856E907k2294J0130K1685j2207j2930J8648Q90k8046O462L1761j2272k5908J9521
869A347J5832k8428r443L4685P172l2711j773K4785q153j6249J5857R954j6637
882c762k959J1315o712n913J7215K474k3560K772K2617j2344j8511K2142J4577
895A9351k8407j1409L0301N699k8947L563K7174j0897k3114J4581J5367j3206
$$ plain form
804 -17839 9465 5405 -11032 10711 20598 -17665 -29361 14738 26123 -11301 -9973 21077 1267
817 1267 -29591 -1972 26983 3678 -14056 2351 2678 -14387 -1054 18205 2370 -9155 3307
830 3307 -2651 -15323 6630 22716 -4549 -18841 7798 10257 -18677 -5484 29661 8480 -28235
843 -28235 -7782 18932 -1042 -12736 11098 11981 -16242 -12405 10257 2861 -5707 10066 5907
856 5907 -16387 -6257 15428 3221 -9709 8939 9829 -18217 -11755 20006 7734 -18174 1347
869 1347 17179 -11249 -20692 13993 21165 -11546 -13319 11466 3313 -12936 2921 12875 -3762
882 -3762 -6721 4594 -2118 -8031 9184 11658 -11902 -9130 13487 1143 -17368 4774 19351
895 19351 -9056 -20465 9836 15535 -13412 -9849 17325 6428 -16686 -2105 13262 56
907E6o277J0867l115r285R787M850j4818K501J8003j1039j7191J6738J4226j9461
921d158q719K1960J844k3595N057K2251j1906j7550J7398J1664j9832p002J8812
934F224K989j5775J973J0796p170m913Q962k759o564J0974L885j7523j896K1915
948A1118j36k2962N956K1533j2683k0006J6192J6371j5786j0834J3494L480j3498
961g761L486J2965n840p806N957j021n676Q675O005j1465m515J1988k181j4208
975a1397J0293J7828j4745j7928J4612J1926j4361m456J6873P5j8867M56J4858
988E167j479n590N569p94q938L033O792k824j3O103o654j2253Q737J3615r544
1003I27q314J2448P70j7937J809K1595R77j8624j44J1635n526p512J0301P642
$$ plain form
907 56 -6221 4646 1531 -7754 2033 6883 -7935 -5434 12569 1530 -15661 1077 15303 -4158
921 -4158 -12877 9083 10927 -12668 -7611 14640 2734 -14816 2582 14246 -5586 -12588 6224
934 6224 9213 -6562 -4589 6207 -963 -5876 3086 327 -6237 4737 8622 -8901 -10797 11118
948 11118 10982 -11980 -6024 15509 2826 -17180 -988 15383 -403 -11237 2257 5737 -7761
961 -7761 -4275 8690 2850 -4956 1001 -20 -5696 2979 8984 -2481 -6996 4992 2811 -11397
975 -11397 -1104 16724 1979 -15949 -1337 10589 -3772 -8228 8645 8720 -10147 -9691 5167
988 5167 3688 -1902 3667 2873 -6065 -3032 3760 936 923 7026 372 -11881 -3144 10471 927
1003 927 -7387 5061 5831 -12106 -10297 11298 12275 -6349 -6493 5142 -384 -7896 2405 10047
1017A0047p725o949o56J105N618O625m785r048M360M475j0006Q22J7733o87k0401
1032i472k242J6096M77j0075P166R221j3217j0489J1503Q694m986j523J371n701
1046c177l948O159M735j660J692j186j1543K32J5310J494j1354L224P150j1132
1060d004r475J6412J3061j5220j0576J0098K191r279M879J1766m048j1486o18
1073f299M017J601N477K386r682l366O850k748m900J2589R056j6736j3518J4357
1087i16J0836j2306k078J4492m719j8017L609J5476k27p058J753n73o586L663
1101b651P966k731j379L783p728q384J1011J1805r420r206R101J419j4490M436
1115f468J9856m315j8197L101J0308o539m731J3245M536j4332n297Q321J010o81
$$ plain form
1017 10047 2322 -4627 -5283 -4178 1440 8065 3280 -5768 -1408 3067 -6939 -6117 11616 10929 -9472
1032 -9472 -11714 4382 4859 -5216 1950 11171 -2046 -12535 -1032 7662 2676 1153 2524 -3177
1046 -3177 -7125 -966 3769 2109 3801 2615 -8928 -8696 6614 8108 -3246 -22 7128 -4004
1060 -4004 -13479 2933 15994 774 -9802 296 2487 -6792 -1913 9853 5805 -5681 -6299
1073 -6299 -2282 -681 4796 7182 -2500 -5866 984 -1764 -6664 5925 14981 -1755 -15273 -916
1087 -916 9920 -2386 -4464 10028 5309 -12708 -9099 6377 6150 -908 845 272 -6314 -2651
1101 -2651 5315 2584 1205 4988 -2740 -11124 -113 11692 2272 -6934 2167 3586 -10904 -6468
1115 -6468 13388 9073 -9124 -6023 4285 -2254 -6985 6260 10796 -3536 -8833 -512 498 -183
1129a83O741k167r478J677N996n068j049J2637j671j9346J653J9332l710j4301
1143h937R562J1008j5337j0674J7087J0667j3722n353Q925k947p009P519N500
1156F289n997j300K579p112k297J4192M095j5976r73J3813o810j3193J3778J4043
1170A5131j5019j2705J4012O601j3981J475J5059o167j4507P083R154o952k099
1183b915P675l578q814O168O403p602J273R607q048j1831J2344J1308j3573p487
1197i070J5849J759j9971K224K1273m909j7373O661J1140r077o213J0801L343
1210F437r090L44M790o200P75J0165m494j0816P929Q903j2244n770J6473L316
1224A0518j9184l32J8039m166j5424R221J1417j1911q436J2533M899j1300J019
$$ plain form
1129 -183 6558 4391 -5087 -3410 2586 -2482 -3531 9106 7435 -11911 -10258 9074 5364 -8937
1143 -8937 625 11633 -3704 -14378 2709 13376 -346 -5699 3226 279 -6730 789 6289
1156 6289 292 -1008 1571 -5541 -7838 6354 10449 -5527 -6500 7313 503 -12690 1088 15131
1170 15131 112 -12593 1419 8020 -5961 -4486 10573 4406 -10101 -3018 6136 -816 -2915
1183 -2915 4760 1182 -7632 -1464 4939 -2663 -1390 8217 169 -11662 682 11990 -1583 -9070
1197 -9070 6779 8538 -11433 -9209 12064 7155 -10218 -3557 7583 -1494 -7707 3094 6437
1210 6437 -2653 -2309 2481 -3719 -2944 7221 2727 -8089 -160 8743 -3501 -9271 7202 10518
1224 10518 -8666 -8998 9041 4875 -10549 -1328 10089 -1822 -10258 2275 7174 -4126 -3107
1237c107R363o003n818Q240J254p975L825O345q844n232J2557K350j4945K445
1251e545J5671p360j4720J1403J2442j3555q828J4563M885j5094m97J3407l365
1264C407r072N783M334o911M24N947m526l980Q586N30j2404L117J4084p399j2673
1279a0753J1428J0381j4035p929J5805N591j5663j509J3369l321j0372N874O961
1292E827o594k763N395k031m350O426L333q836p2R482n215q415R793P480j1965
1307b505n939J2628K454j3626K675J4352o541j3435P345J0141p338n519P516J667
1321C875p691K1N669j515Q4L641n420n064Q627M526r557j818J1549k303j4617
1336i993M193J5586n407j2974O833Q151q497m940J0071L847q498k105M872j620
$$ plain form
1237 -3107 6256 253 -5565 2675 3929 -4046 -221 6124 -2720 -7952 4605 6955 -7990 -5545
1251 -5545 10126 2766 -11954 -551 11891 -1664 -10492 4071 8956 -6138 -6635 6772 3407
1264 3407 -5665 118 4452 -2459 -2035 3912 -614 -4594 3992 4522 -7882 -4765 9319 1920 -10753
1279 -10753 675 11056 -2979 -10908 4897 10488 -5175 -6684 6685 3364 -7008 -1134 5827
1292 5827 -767 -3530 1865 -166 -4516 1910 5243 -3593 -3665 5817 602 -7813 1980 9460 -2505
1307 -2505 -8444 4184 6638 -6988 -4313 10039 3498 -9937 -2592 7549 211 -5308 2208 3875
1321 3875 -3816 -3795 1874 359 443 4084 -1336 -6400 2227 6753 -2804 -4622 6927 4624 -9993
1336 -9993 -5800 9786 4379 -8595 -1762 6389 -2108 -7048 3023 6870 -1628 -3733 1139 -481
1350d81q96M640j329m793K937J825n559J005R214j785j1641K636J0084n327o702
1365f172Q702M831j0462n046R544M005o928K18N391l751m784M219K679j020J10
1380A536j314l984Q28N817j297n335M694M037r133l730J1662M661j0798l497R043
1395C190N87r035K388R491k737q123P85M010J28L50J80j485m31J041k664j128
1411c453O839K902r338l393Q442J851p410J647Q431l290j0062L421Q758l026m994
1426b675L186R70m328J2L809Q24j044m0k366j744M396K591m476k27N130l931o574
1443f487N726Q113n735p584N749M753p444k163Q778J708p323k348L911J406o83
1458C77J16m05r20J599j105l565M567O124n991p366N970N969o418m113Q150K779
$$ plain form
1350 -481 -1377 3263 1934 -2859 78 1903 -3656 -2651 6563 4778 -6863 -4227 5857 530 -6172
1365 -6172 2530 7361 -3101 -8147 1397 5402 -1526 -1308 4083 332 -4452 -233 2446 1426 1536
1380 1536 222 -3762 -2934 2883 1586 -3749 945 4982 -4151 -7881 3781 8442 -2356 -5853 3190
1395 3190 3777 -5258 -2870 6621 3884 -4239 -3454 556 684 1034 1214 -271 -702 339 -2325 -3453
1411 -3453 3386 6288 -3050 -6443 1999 3850 -3560 -1913 6518 3228 -6834 -3413 5345 2319 -2675
1426 -2675 511 1481 -2847 -2835 974 1798 754 714 -1652 -3396 1000 3591 -885 -1112 4018 87 -6487
1443 -6487 -761 7352 1617 -5967 -218 4535 -2909 -5072 3706 5414 -1909 -4257 -346 1060 377
1458 377 493 88 -832 767 -338 -3903 664 6788 797 -6569 -599 5370 -1048 -5161 2989 5768
1474E768j0188k276R298J320o188P98L908k240k933K765J997j300N56p44l862
1489c321J962N050l090l876M609K354o883j910R068J276r383L71Q285l222p083
1504e793N189O623n290n500M559L189l795Q9K538j570q42J372k081j371N061J283
1520C661p152j382Q242J86q860K807R704n207q862N611P660n727n505O026L035
1535D237o481j297N665p80k539J964n62k489K525K554m067j441N947m71p997K826
1551b406Q335m430p328O005N735p511m129Q653K533q813m55P265k002n326L430
1566d44L521l545j632K829n74j668L543L68n304K020N430m819n135P255M630r211
1582b736l916R689K585j0322K06R906j958q385K655O145k714l592K979R75l109
$$ plain form
1474 5768 -4420 -6696 2602 3922 -2266 -1468 2440 200 -2733 32 2029 729 1285 541 -3321
1489 -3321 -1359 3691 601 -3275 1334 3688 -3195 -5105 3963 5239 -4144 -3773 4512 1290 -5793
1504 -5793 -604 6019 729 -4771 -212 2977 -818 -729 1809 239 -603 769 -1312 -2683 2378 3661
1520 3661 -3491 -4873 3369 3555 -5305 -2498 7206 1999 -6863 -1252 6408 681 -4824 1202 4237
1535 4237 -2244 -3541 2124 1344 -1195 769 207 -2282 243 2797 -1270 -2711 3236 2765 -5232 -2406
1551 -2406 5929 1499 -5829 176 5911 -1600 -5729 2924 5457 -3356 -3811 3454 1452 -3874 -444
1566 -444 3077 -468 -2100 729 155 -1513 2030 2398 -2906 -886 4544 -275 -5410 1845 6475 -2736
1582 -2736 -6652 3037 5622 -4700 -4494 5412 3454 -4931 -2276 3869 1155 -2437 542 1517 -1592
1597a592J572J683l492J172M552l583n273N543M578o653l634Q013J417r600R12
1612d385R471k249q084M143N896n012l996N838K795n661q97M014j593k318L241
1627A203P8l168J541K509l781j521O463L17p888J273Q271l464p686N816O450o533
1643a20o155P180M382o795k044N995k23m583J066K315j215O1J253k397j383M168
1659A505J083n491J168O128l104o210M755O206n716n340O075L452p140j723P389
1674C037K29o168M00M341j081k528K322Q35k213O91J186k547P70L718k074m611
1690c693L411M192m709l035N963J904p411p24P516q02o609K404N310l123m610
1705d016L309M121l019k077J936L30o91J182j131j388K809Q14m631j105O117J209
$$ plain form
1597 -1592 -20 1663 -1829 -657 3895 312 -4961 582 5160 -1493 -5127 2886 4303 -5297 -4385
1612 -4385 5086 2837 -5247 -1104 4792 -220 -4216 1622 4417 -1244 -2141 1873 280 -2038 1203
1627 1203 1281 -1887 -346 2163 -1618 -3139 3324 3641 -4247 -2974 5297 1833 -5853 -37 6413 -120
1643 -120 -6275 905 5287 -1508 -3552 2443 2220 -2363 -1297 1018 -197 -136 1117 -1280 -2663 1505
1659 1505 2588 -2903 -1735 4393 1289 -4921 -166 6040 324 -5016 1059 4511 -2629 -4352 3037
1674 3037 3266 -2902 -2502 1839 758 -1770 552 1387 -826 -135 1051 -1496 -726 2992 918 -3693
1690 -3693 -282 3910 -799 -3834 2129 4033 -3378 -4102 3414 2612 -3997 -1593 3717 594 -4016
1705 -4016 -707 3414 395 -1682 254 584 -107 1075 -56 -1444 1365 2179 -2452 -3557 2560 3769
1721C769p202k43P329j119o496K347N755k377n380K608L823k680j664K352J62
1736I84j878M83O45o08O34P85j892r96K951K1l474Q35M482k377m577L488M366
1753C872l381m202M143L245m318k389M493J265l808r35J976Q93j027m06K56L39
1769A6Q18q75k104K326L204l287l339L253L283m128k505M630K365n082k042M971
1785A504J172m017n06K884K40k056n44J610M03k89j040n83J634J733k568j221
1801a644K977R19l754o13M151J67m079k84L829q89l191J545K922j094k550P44
1817h44J933m86j058K53O95N85q26j940J015K691j312l121J644L447j931l831
1833c086K440L681k783l456K937K786j986k804J620K425j453j481J014J062M25
$$ plain form
1721 3769 -3433 -3676 3653 2534 -3962 -1615 4140 1763 -3617 -1009 2814 134 -1530 822 984
1736 984 -894 -411 234 -374 260 1045 -847 -1843 1108 1129 -2345 -1510 2972 595 -3982 -494 3872
1753 3872 491 -3711 432 3677 -641 -3030 1463 2728 -1080 -2015 -39 854 -173 -579 -323 16
1769 16 834 -41 -2145 181 3385 98 -3241 12 3295 -833 -3338 1292 3657 -1425 -3467 1504
1785 1504 2676 -1341 -1847 1037 1277 -779 -1323 287 690 401 -639 -1222 412 2145 -423 -1644
1801 -1644 1333 2252 -1502 -2115 2036 2203 -1876 -2160 1669 780 -2411 -866 2056 962 -1588 -844
1817 -844 1089 603 -455 -202 493 1078 252 -1688 -673 2018 706 -2415 -771 2676 745 -3086
1833 -3086 -646 3035 252 -3204 -267 2519 533 -2271 -651 1774 321 -1160 -146 916 1341
1848A341j432j731J731K263k116k454K010K673k439l053L321K579l203j862L383
1863A011J116k762j006K372Q28k073l32J524k95n07J9n58R92P71j517r64J982
1880F01J043k797q81L454Q54m391j45M741n98m362J189L703j191l261J339K713
1896B011j444j692O45M26K60P3j063m85K182M87k904k24L832N11m967O61M591
1913B900j473m348J909M178k346l809K595K616k512j287K234L00j436J8L60m36
1929e37J065O20j851r09K948M24l744J081M011k363l747K786L400l460k801L999
1945I22J769m680q16M694j46l404N38K342o31j278J068K27p81R69m25k157J409
1962c80L227k736l405L381L103m097k624N367J872n785q97N135N1m419J044L153
$$ plain form
1848 1341 -91 -1822 -91 2172 56 -2398 -388 2285 -154 -3207 114 2693 -510 -2372 1011
1863 1011 2127 -635 -1641 731 1559 -514 -846 678 383 -124 -105 -663 329 1100 -417 -1381 601
1880 601 1644 -1153 -2034 1420 2274 -2117 -2262 2479 1881 -2481 -1292 2411 1220 -2041 -702 2011
1896 2011 567 -1125 -480 -54 206 279 -784 -1269 913 1400 -1504 -1728 2104 2615 -2352 -1691 2900
1913 2900 1427 -2921 -1012 3166 820 -2989 -394 2222 -290 -1577 657 957 -479 -461 -101 -537
1929 -537 528 1148 -703 -1612 1336 1760 -1984 -903 3108 745 -3002 -216 3184 -276 -3077 922
1945 922 2691 -1989 -2805 1889 1743 -1661 -1123 1219 588 -690 378 605 -176 793 368 -1789 -380
1962 -380 2847 111 -3294 87 3190 -907 -3531 1836 3708 -2077 -2974 2161 2212 -2207 -1163 1990
1978A990j521k223J702J170j147J48M78j527P2K515j548k194K391J957l484j949
1994c170M833J475n262j28M879r02m533J965M026k428l553K707K034k755n24K435
2010A099m14j987J331K26j074R00J377k134j250L249O51m198P19M767k140m857
2026c735K868M503k828m165L408K962l977j623L510N28k116L7O16l19Q2J195r24
2043B2j257J943Q49k996K92L956j476m178J851L452k382k993L554K177m201j475
2059b862M165L26l180P69K373j161j855J361J090j114j53P20j295J08K253r72
2075E73k294J722K133k945j941M059J541m321j379M315N51l969N74L666q01l357
2091a873R78K525j239j024J020j73o67M36m27m84J522J036k440j624K877J853
$$ plain form
1978 1990 469 -1754 -52 1118 -29 119 597 -930 -858 1657 109 -2085 306 2263 -1221 -3170
1994 -3170 1663 3138 -2124 -2252 2627 1725 -2808 -843 3183 755 -2798 -91 1943 -812 -1336 1099
2010 1099 685 -1302 29 255 -819 81 1458 -676 -1926 1323 1974 -2224 -1505 3262 1122 -3735
2026 -3735 -867 3636 808 -3357 51 3013 -964 -2587 923 1451 -665 -628 -12 -331 -249 946 22
2043 22 -1235 708 1557 -1439 -1147 2809 1333 -2845 -994 2458 76 -2917 637 2814 -1387 -2862
2059 -2862 1303 1629 -1551 -782 1591 430 -1425 -64 1026 -88 -241 479 -816 -708 1545 573
2075 573 -1721 1 2134 -811 -2752 1307 2848 -1473 -2852 1463 2014 -1955 -1381 2285 1484 -1873
2091 -1873 -895 1630 391 -633 387 214 -453 -17 -444 -928 594 1630 -810 -2434 443 2296
2107B296l310n44L426m94l455N08L682o68l156R36K112j471j141J771N33j054
2123b9m95K49k83O02Q52p89j010R35P01j795N74K512q58k853Q22K648j037k573
2141a827J973K218k772k092K240K087j856j147J082P97r86n11R53P70K8j239j110
2158a392J173J700j019j661J256J245j475j903K112K339k171k254J926J302j425
2173b47r49J579R55j709p84J239P27l50j65l41Q9L96p46j81J140J81j319j150
2191a635J600J285j763o68J986P4j892k40K325O88k297n10J812J09j493n1J312
2208F42L58j434r09J071J147m11j256L55J161l87j715Q47K050o49k221K77K202
2225A128J88k015J9K031l68k351L01J864N02j639j179J396R29j066n86R07J080
$$ plain form
2107 2296 -1014 -1558 1868 1374 -2081 -1573 2109 1441 -1715 -779 1333 -138 -1279 492 1025 -29
2123 -29 -524 -275 -558 44 896 107 -903 32 733 -1062 -488 2024 1166 -1687 -865 1783 746 -1827
2141 -1827 146 2364 -408 -2500 -260 1827 -29 -1176 -94 703 -283 -794 159 929 957 -282 -1392
2158 -1392 -219 1481 462 -1199 57 1302 -173 -2076 36 2375 204 -2050 -124 1178 -247
2173 -247 -1196 383 1338 -371 -1155 84 811 461 296 -45 44 440 -306 -487 653 834 -485 -1635
2191 -1635 -35 1250 -513 -1181 805 879 -1013 -1253 1072 1760 -537 -1047 765 874 -619 -670 642
2208 642 1000 -434 -1343 -272 875 464 -792 -437 724 337 -1378 -531 1519 870 -1351 -1074 1128
2225 1128 1316 -699 -680 1351 983 -1368 -1067 797 1299 -340 -1519 -123 806 -260 -846 61 1141
2242A141j178j367J244J519r29j063N62P24o25r13O50J314r00j201P66O67p1j039
2260f99J31J182j32j694N06J620K7j756l65J937L44j972K42J692r2j827k87J719
2278E76N68j592n91J042N14p11n24P22J064n09j779M65K059j98j876k72K028k22
2296G64j872L46K031l76k030J24J802L7j351J54J065o78r84N02R18K28p54m80
2314e54L89O29k03o87N39J029q68j764J147J748j065j720J009J361j405j251J940
2331B74J647j914j652J571Q34m12p80P66L35r69n71M72O96P94j071j356Q63J560
2349A087j016j224J738J169k168j941K507J909k084j230J537M81j611j41J767
2364G80P95j739q15O10K15L97K16o56O7J08q95j92J703J172j539j852J668J105
$$ plain form
2242 1141 -37 -1404 -160 1359 430 -633 -71 653 28 -885 -235 1079 179 -1022 -256 411 340 -699
2260 -699 -568 614 482 -1212 -706 914 941 -815 -1180 757 1101 -871 -629 1063 971 -856 -1143 576
2278 576 1144 -448 -1039 3 517 -194 -718 4 1068 559 -1220 -755 1304 1106 -770 -1042 986 764
2296 764 -1108 -762 1269 893 -1137 -1013 789 826 -525 -371 694 16 -968 -466 452 680 -74 -554
2314 -554 -165 464 261 -426 113 1142 274 -1490 -343 1405 340 -1380 -371 990 -415 -1666 274
2331 274 1921 7 -1645 -74 760 348 -432 334 669 -300 -871 -399 297 1091 20 -1336 -473 1087
2349 1087 71 -1153 585 1754 -414 -2355 152 2061 -23 -1253 284 765 -846 -987 780
2364 780 1575 -164 -979 -369 -154 243 459 -197 -130 -22 -917 -1109 594 1766 227 -1625 43 1148
2382A148j671M0K033l83k563l10K687r6j463L33J241j317j091J199J174j84n54
2399B23r11j57P55Q94n70n31J072j06k322L49L081K97k931n39K199o33j896J342
2417c84K585j807k421R04J522p1K9J52k53o57k00N88p0J256J2k216p44K033P04
2436I62j551L71J759j401k564J555L011j156j928J087N79j774j29K115O55j640
2452d9j178R85j55L97J030m54p38Q7o36o88J562J880j448k680J192K145j383j039
2470a170K651Q01l177j516K610J732j799n66J194q04j337M98J363M13j85j045
2486c37r08L36J731R6j304P79M98j973q78K881J423k393j503J729M52j819P30
2503d60K481q74k694K54J094L67r5N29k53q80k35M62L26J052K68j812r40J261
$$ plain form
2382 1148 -523 -483 1550 1167 -1396 -1706 981 885 -578 -245 996 -321 -1412 -213 961 777 223
2399 223 -688 -845 -90 804 234 -297 775 669 -1653 -1304 1777 2074 -857 -1396 803 170 -1726 -384
2417 -384 2201 394 -2027 -1123 399 328 357 509 256 -401 -601 -13 -83 1173 1185 -1031 -1775 258 962
2436 962 -589 -218 1541 140 -2424 -869 2142 986 -942 145 724 -1050 -1179 936 1591 -49
2452 -49 -1227 -242 -397 0 1030 576 -162 -75 -711 -1399 163 2043 595 -2085 -893 1252 -131 -1170
2470 -1170 1481 2282 -895 -2411 199 1931 132 -434 760 -44 -1381 -883 480 893 708 -337
2486 -337 -1245 -909 822 918 -386 393 891 -1082 -1960 921 2344 -49 -1552 177 629 -1190 -460
2503 -460 2021 1147 -1547 -1293 -199 168 73 602 349 -531 -766 -304 22 1074 1342 -470 -1410 -149
2521a49R66j080j78J598n16k954P84L139l94k019L68J297j019j149J364J632j003
2538F87j433j48L87P32J70l50JL09m87r61N10J974j12k511j62K380o65j432J042
2557f9J591j383j761J020J809p37q67O54O8q94qO98L48j23n60p38L52Q82K86j154
2577e86O66Q60j341j091J811J291j477j222J188R67j593o37J930L95j794o39J140
2594a32Q95o77q71Q61L89n92o09K48J113L64j441n94J280Q50j110q76J265Q36
2612A199j884n90J706N28j638m29J398N92j392o40J548K25j018j38R38K81l70
2629C16r43M29P10j76p29j3Q72j97j103K70J424q8j320j73J425r7j451K75J683
2648A114n03j690M68J480Kj007l12R37j8j061N0J157J92r74j082Q44J191n58r09
$$ plain form
2521 -149 817 -263 -441 1157 641 -2313 -1529 1610 1216 -803 -435 862 -157 -1306 58 1690 687
2538 687 -746 -894 -507 225 395 45 46 355 -132 -1093 -583 1391 1279 -1232 -1394 986 321 -1111 -69
2557 -69 1522 139 -1622 -602 1207 470 -397 257 325 -569 -577 121 469 346 -214 -952 -600 282 568 -586
2577 -586 80 940 -401 -1492 319 1610 133 -1089 99 1066 -527 -1164 766 1161 -633 -1272 -132
2594 -132 763 86 -785 76 465 -127 -736 -488 625 989 -452 -1046 234 1084 -26 -902 363 1199
2612 1199 -685 -1275 431 959 -679 -1108 290 882 -510 -1150 398 623 -395 -533 405 686 316
2629 316 -627 -198 512 336 -393 -406 466 269 -834 -564 860 772 -548 -721 704 607 -844 -569 1114
2648 1114 611 -1079 -611 869 871 -136 -448 489 471 -590 -540 617 809 -165 -1247 -403 788 230 -679
2667f79O75Q72p98j381J055J812n87j877J87J200l26o83O16J210q27j612P8J494
2685D29L15n76l07J02J89r19J92J215L41r69j006M63J165k25o31Q14Q0j140r64
2704a432J222J511n92j757M60P84p71l23J372R54j339j417N00J421o3m16R3J80
2722C87p81p13K73J729M11j420j022Q23O34m37k08J179K87j896j104J652J637
2739A431o87j372N41L10r36p4J400R65j173j448p2J116K53j53J13P1o10r00L95
2758h30J782N80j363q36L37L88l27K34J163j91k018l70J578R27q53m09L47O3j458
2777a256L60J774O89j437j041K05O19J94J27M45N6r91r45L55J718P41j549r77
2795i13P35K52j077P50J651m46k155k31J706N69n48n6M09n45j096K89J335M84
$$ plain form
2667 -679 -4 868 70 -1311 -256 1556 969 -908 -721 479 153 -530 86 1296 469 -1143 -1065 429
2685 429 744 168 -139 -37 152 -767 -575 640 981 12 -994 -531 634 409 -222 592 672 -468 -1432
2704 -1432 -210 1301 709 -1048 -588 196 -575 -898 474 1428 89 -1328 -828 593 530 114 207 387
2722 387 -394 -1107 -834 895 1306 -114 -1136 -313 321 -116 -324 855 1142 -754 -1858 -206 1431
2739 1431 744 -628 -87 223 -713 -787 613 1578 405 -1043 -1115 1 254 101 214 285 -325 -1225 -830
2758 -830 952 1532 169 -667 -330 58 -269 -35 1128 937 -1081 -1451 127 1054 201 -208 139 202 -1256
2777 -1256 -896 878 1567 130 -911 -706 -87 107 234 679 735 -256 -1201 -846 872 1613 64 -913
2795 -913 -178 74 -1003 -253 1398 952 -1203 -1434 272 841 293 237 646 101 -995 -706 629 1113
2813A113m76j070n15O09M31m1K57N33q29j455N58J666K09j206j77P25p29q58J576
2832C21J318j040j525qJ188j12k59O92l4q42o80R2J134R84o84j130l03R38J25
2851A75n72R80Q88j383j869J287J697n42j390Q12O44j470p35J692J074j070j035
2868h17J96O54L9N6L05m5k63m81n26R36J195o34j539L92R73o59p18J818O32k291
2888g77r76J898O71j131q2J263m68j375L46J358L10q54j35m94K91K30M1j14L88
2907C90K71j429n14J798Q92j832o20J742j90j620L32J881j27j979R6J358j72p52
2925d75N18N20o63k21r3L20N56J34r51n01J026N40j252j19J707l05j693K83J798
2944A129l55j619O04J364j185r92J011R07q50p97O49K92k83QK49j15K16j43m25
$$ plain form
2813 1113 637 -433 -948 -339 92 51 308 841 12 -1443 -885 781 990 -216 -393 332 -397 -1255 321
2832 321 1639 599 -926 -934 254 142 -117 575 541 -301 -981 -889 245 1229 545 -585 -888 50 175
2851 175 -397 583 1471 88 -1781 -494 1203 661 -729 83 727 -743 -1478 214 1288 218 -817
2868 -817 -621 33 72 128 433 388 125 -356 -882 54 1249 615 -924 -532 441 -218 -936 882 1514 -777
2888 -777 -1753 145 816 -315 -397 866 398 -977 -631 727 1037 183 48 -446 -155 75 116 2 390
2907 390 661 -768 -1282 516 1408 -424 -1044 698 508 -1112 -780 1101 974 -1005 -909 449 277 -475
2925 -475 43 563 -100 -321 -414 -94 462 596 -355 -856 170 710 -542 -661 1046 741 -952 -669 1129
2944 1129 774 -845 -241 1123 -62 -1054 -43 864 14 -783 -134 158 -125 -117 132 17 233 90 -335
2963c35Q1R15k77j284O01J226q27j276J044J529j578j169J477R60j410q02J341
2980B16N19j049l56R96Q0m11m8k72N75N46q48p19M87J116r45r18J199R22j489
2999c99r53J761P38j471o46J435K28j321Q3J479j17j374O2O68j13%J5K2K32l11
3019A8n36j17J014O46j273p94J416n6r57K38J600l84j939J11J839O8j233K59O47
3038E67o50p62L28J176K40j062m79O9N83L46n51K76O26n64j173O68J539k27j414
3057d64k19J156n50r36R83J164r40j016o6J068L13m82K24J05o76l41Q4Q96O43
3076I46p09r13L23N03K0L2M71J24j153j216J473R14l96p49L00J38q47JJ274O96
3096A232q67j076N8J009ml99K71M01o86j011L03J184P63j090p09M43K03m54K17
$$ plain form
2963 -335 -254 661 384 -900 -299 927 100 -1176 -132 1397 -181 -1350 127 1087 -323 -1125 216
2980 216 735 -314 -670 326 406 -5 -53 -325 250 796 -52 -771 -284 832 -113 -1031 168 1090 -399
2999 -399 -1352 409 1147 -324 -970 465 693 -628 -545 934 817 -557 -495 173 60 60 75 97 329 18
3019 18 -518 -635 379 1025 -248 -1042 374 318 -639 -401 1199 815 -1124 -1013 826 894 -339 -80 567
3038 567 -83 -845 -517 659 899 -163 -642 -573 10 356 -195 81 707 143 -1030 -362 1177 950 -464
3057 -464 -683 473 -77 -1013 -30 1134 194 -822 -888 180 493 11 235 340 -336 -677 -593 303 946
3076 946 237 -676 -353 150 170 202 673 797 -356 -1572 -99 815 419 -330 -30 108 -739 -738 536 1232
3096 1232 365 -711 -653 356 352 -47 224 625 -61 -1072 -769 415 1178 88 -621 -178 25 -429 -212
3115b12J075Lj331o82Q39R01p1l96J35l8p68l88J094J050o82j226k4P53r1r1P28
3136E78J91r28p56K46J280K83o85l36K12l79l00K92J114J20j151j065J049O27
3154C92m17o5O92l11j230k73J534P57q19p64L56J61l86J31R00J11q18r29L88R27
3174C37K35m35l32K56k25n63J23J519j2j217p42J197K92p65M56P96m25j218k09
3193i32J166M76p90n0L4k49j51K79M42L77n11n46o9P62K82o46J80M31n44r88P05
3214c42J304k53j202L00M15m26m41P72P68r25p41K25N52L68k16k05J42n4l78M5
3234b92N87M66m38j287N54R00k93q54P38N38q91q82J157J022j022n67O82J56m89
3253b15j20N60K88n03l89JK75L49j39l20L17L51n86n77Q21O13q57n77O44P25j172
$$ plain form
3115 -212 863 866 -465 -1147 -308 593 522 126 261 223 -545 -933 161 1211 529 -697 -721 32 -59 -150 578
3136 578 769 -159 -915 -669 611 894 209 -127 85 -294 -594 -302 812 932 -219 -1284 -235 392
3154 392 -25 -90 602 291 -939 -1212 322 1079 260 -504 -148 13 -373 -242 658 769 -49 -978 -590 337
3174 337 572 137 -195 61 -164 -727 -604 915 903 -314 -1056 141 433 -332 124 920 495 -723 -932
3193 -932 234 710 -80 -130 -96 -345 -496 -217 225 602 91 -455 -524 238 520 -126 54 485 -59 -1047 -342
3214 -342 962 709 -493 -193 222 -204 -645 127 895 -30 -771 -546 6 374 158 -47 95 41 -337 -292
3234 -292 295 761 323 -964 -410 490 197 -657 81 619 -272 -1154 3 1025 3 -564 118 274 -215
3253 -215 -335 225 513 10 -379 -378 -103 246 107 -213 104 455 -131 -708 113 726 -131 -708 -64 661 -511
3274e11j38J152j03p44k40R15K76p89p8O05o9n01j46L38L15j68k79j48N79K86
3294E52q03k04R29K32j114l51J198K08j279l7J197J16j394L07J100l71o83J05
3312b92O10j23m30Q3J70R2O4k72p7L25K82q16M4P88j39q54k2J154k88r00L38R61
3334F98q46q87R59O42o39k00K49K95k86j37L08J41Kk18m62K82M11j48o31L00P17
3355E50m79q53P06J059r47j240J052P66p47m22O64O67r90k78O41L42k42j24j66
3374d1j03R9K4j71L61L13n02p85N51Q52l28o58N66L48r39m58J357M08r55n11O73
3395A01p4n22M46P94l76o65l09M95L23J9M9n35J42J57l82K79O49K10j189m53J045
3416B04L87r22K8J159o12j267M37R79K79q57o2J09R4k54L84K70K15k70o53j58
$$ plain form
3274 -511 -649 503 400 -344 -584 331 607 -182 -260 345 276 -225 -371 -33 282 114 -165 -313 266 552
3294 552 -251 -455 474 706 -408 -759 439 647 -632 -669 528 644 -750 -443 657 286 -397 -292
3312 -292 318 195 -235 -152 18 110 174 -98 -175 150 432 -384 -340 448 309 -545 -567 587 299 -601 -263 698
3334 698 -148 -1035 -76 566 -73 -273 -24 271 -15 -152 156 297 299 81 -381 -99 312 164 -467 -167 550
3355 550 71 -782 -76 983 36 -1204 -152 614 -133 -555 109 776 -214 -492 149 491 249 125 -41
3374 -41 -144 -45 -21 -192 169 482 -20 -805 -254 598 270 -388 178 526 -413 -871 486 894 -61 -572 101
3395 101 27 -495 -49 745 369 -296 -605 -110 213 232 281 -254 -112 45 -337 -58 591 801 -388 -841 204
3416 204 591 -331 -303 856 244 -1023 -586 393 672 -185 -247 -138 -44 -298 86 356 571 301 -352 -510
3436e10Q95L21p70K0J18j39p08N58J144k47j344K26M97j39k82O44L66q31o40M97
3456c24O28J36o6k70k60m2j16J48N75K17o02p97K88P57Jm04K72L20q66l06R34
3477B23O52m70p47L20q9j84K53M87L82r67n49J35N63K12O1k63k5o5l75j2J024
3498E66M82j112o89M35O48l38j46P30k30q16j75Q57L23j81m57K0k27k27M47L33
3518B43K99m51n57J5N63L68m12J55P3l35o03K11J116l74m65k86L07M4k38N56J78
3539D07j12o81j06L85M34k28p5j70L30n90j46R34K88m59o62o0O49J2k76L03jk91
3561a15m58R6P29K70n06k55J85J31j13L7M43jq91k7M07M22l37l27L76j0m38Q3
3583b99N95K26p13M6L8J51r5J6L00J02k97m98K46M39K02n45R1L05l13o81O72N07
$$ plain form
3436 -510 385 706 -64 -44 74 -65 -773 -215 929 682 -662 -436 61 -78 -360 284 650 -181 -821 -324
3456 -324 304 440 374 104 -156 -198 -314 -166 409 626 24 -773 -485 272 273 -131 141 461 -405 -711 223
3477 223 875 405 -342 -22 -111 -295 -42 445 827 -140 -689 -554 9 221 282 19 -6 -71 -446 -458 566
3498 566 1048 -64 -753 -318 330 -8 -154 576 346 -470 -645 212 535 354 -103 -83 -310 -537 -90 243
3518 243 542 91 -466 -451 112 480 68 223 296 -39 -642 -431 685 311 -154 -440 -133 -89 -327 229 407
3539 407 295 -386 -492 -107 327 99 24 -146 184 -406 -552 382 670 211 -451 -511 138 150 -126 177 176 -115
3561 -115 -573 -477 252 522 16 -239 -54 77 -36 1 444 443 -448 -475 -68 354 17 -310 66 56 -382 -299
3583 -299 296 522 -191 -145 -107 44 -51 -35 265 367 70 -428 -182 257 459 -86 5 310 -3 -684 -12 495
3605D95j79q12K66M74k91k53L31M70m67l85K77K16L8k14j00j25L32J30n70K90
3625g7M10k62m53J59O56k84o67L73O89m85l80N81J59l37m53M26K06n05K98K24
3645B78m38R6o7r2J57J74r9l42L09N21n82k61M91O33q66n18P56K45o10k33O31
3666A83J15o33PO32l52k48K63N5J62k15J0j21k9L94n6n25N40L82p29m31R84J28
3688E16o60m11Q66n8o94K22M78r6n25R4K12M0O2K97m48p9J48r2j31L67M14o32
3710a10l84N39J93n60J45N93k11r09M11P76l27l56K85K03n60j45O04L49m51k20
3730a35J28j76K82R0n1l28K79k56k31K57O69j51q56K34N51m41j81P64K44p31p10
3751g49P81L05k28j91L32k51n14J37L94L03j42o8m70p1O50q3l79K91K35n73k69
$$ plain form
3605 495 316 -496 -230 244 -47 -300 31 501 34 -351 -74 142 180 -34 -134 -259 73 203 -367 -77
3625 -77 333 71 -382 -223 433 149 -518 -145 544 59 -321 260 419 82 -371 55 261 -244 54 278
3645 278 -160 -64 -131 -223 -66 108 9 -333 -24 497 -85 -346 145 778 -88 -606 150 395 -215 -448 183
3666 183 298 -335 -328 304 -48 -296 -33 22 184 -31 -21 -142 -171 223 167 -358 182 564 -165 -596 388 516
3688 516 -144 -555 311 253 -441 -219 259 163 -362 -268 -56 -16 46 343 -105 -184 -36 -128 -259 108 522 -110
3710 -110 -494 45 238 -322 -177 416 205 -704 -293 483 156 -200 85 288 -272 -417 187 536 85 -135
3730 -135 -7 -183 99 189 138 -190 89 -167 -398 -141 528 377 -479 -245 306 -135 -316 448 692 -39 -749
3751 -749 32 337 109 -82 250 -1 -515 -378 16 319 177 109 -361 -432 218 135 -244 47 282 -291 -560
3772e60N32O86n20l44L56J12o41L20N11o1p05P5L01l1p0K62Q4n40j35J95j8N41
3794C50K33n39m63M27K50l97R3O10k52r04N8O83J94n75L07J53m44k61M99L43k35
3815A30j48k50n1K04L09j19q1J47j92l29k0N50K55p29p7N08k80p2K92N12m54n69
3837d64J10N16j14J9J19q8m48J10N6K60L81m62l41J06K19J98m01K80M91m98n77
3858e28N13L18M9m82K74j03k16j57M84K35l61m08J77L45o2j23L30j41K0l37j22
3879b95L40N15m37l32J6K91o3l55N60pn77p3K45M40m00K51k70O9n0k08M54K30
3901C44j81j98p4mJ63o1J58N4o0l51k54M77K14l61j42K03K52n52K35M13o8m27
3923b20k2J80J71q8Q8P5m4k23k63L35L14j23l47J61RM0j83J02L62k29l85J93L08
$$ plain form
3772 -560 -28 658 138 -206 150 262 -379 -59 452 391 -314 -239 62 31 -39 223 307 -233 -368 -173 -191 350
3794 350 583 44 -419 8 258 -139 -46 564 312 -592 -534 149 343 -232 75 228 -216 -477 22 365 130
3815 130 -18 -268 -319 -115 194 75 -6 141 -51 -380 -400 150 405 -324 -401 107 -173 -245 47 559 105 -464
3837 -464 -354 162 48 67 186 98 -350 -240 -184 76 457 -5 -346 -240 -21 177 -224 56 547 49 -528
3858 -528 -15 303 352 -130 144 41 -175 -332 152 387 26 -382 -205 140 78 -45 285 144 164 -173 -295
3879 -295 45 560 123 -209 -193 98 35 -320 240 233 -344 -417 -172 268 -132 119 -151 -82 -132 -340 114 344
3901 344 163 -35 -109 -113 50 -11 147 201 141 -210 -464 13 227 -134 -276 -73 179 -373 -138 275 207 -220
3923 -220 -242 -62 109 21 109 184 140 -83 -346 -11 303 180 -167 -6 3 43 -140 -38 324 95 -290 -97 211
3946B11k5k09j8K32J37m67L5K98M0l30q7N9K16j23pJ9K83l46j36J93J82p9k79
3969b01K38rj27J4J48J56j73j38%J68o8l23L08L91l03k71o6L90j48j25J69J78
3991B08Jl17p4M59k18j37jK62n1k19l8L43j36j4j95O5k1K43l13l8L64J7m64J30
4015a44M67r1m51K19K07k79k27L60K72k37k78K00K15k72j10J41K0j10j0L1J20
4036D3J30r5j60m9L84j50k77J44L30l32k92L62M30l97l79L54K3l37n0N97ml33
4058e8M4j53m0K34O8O3j86J88k53k01Q0P67l98m77K92J02k76q0M88J73p72nN46
4081A46j10n7J7M01m93j84K65J42r4O4p7l14J73K05k41L5Q8K68o10j89P19K92
4103D46o30QN24m49m54N77M16j16o16K73J08j95j13M24j81m9n5j33j08L56L68
$$ plain form
3946 211 186 -23 -41 191 328 -139 -104 194 234 -96 -183 -124 92 -31 -38 -19 264 -82 -218 -25 157 78 -201
3969 -201 37 28 -99 -85 63 219 46 -92 -92 76 8 -315 -7 384 81 -190 -256 134 -14 -139 30 208
3991 208 209 -108 -182 277 59 -78 -79 183 132 -87 -125 218 82 68 -127 -62 -83 160 -153 -191 173 190 -274 -144
4015 -144 323 232 -219 0 207 -72 -299 61 333 96 -182 18 233 -39 -149 -8 12 -98 -108 -77 43
4036 43 173 78 -82 -131 253 103 -174 -30 300 -32 -324 38 468 71 -308 46 69 -268 -318 279 275 -58
4058 -58 -14 -167 -207 27 95 158 -28 160 -93 -294 -214 553 155 -322 -30 72 -204 -284 204 377 -395 -400 146
4081 146 36 -21 -4 397 -96 -280 -15 127 33 97 20 -294 -121 84 -157 -122 -34 234 -376 -565 154 446
4103 446 -184 -176 348 -101 -555 22 438 322 -294 -21 87 -108 -221 203 22 -27 -82 -215 -323 33 401
4124D01o05l1K14K13n80K70M96j53p79K77N32k65R9j38J43m76J80L65Q3j80M4
4145A10o2k51J31K52l9k38K68M9n53J74O38m49l55N27J15l59k60N93J78p61r0
4166c82N20jm76L06L46j46k41L8m5J35N2J60l80J1L52k19k61L06K42l76j89K22
4188b6M21n54L6M74l20m99M61L32q5k64Q6j86kJ19L7o7o6J54n4k81L11J88j00
4211A15l28J09J81j75j14N44j96l66J7M02k07j49L32K2l79j76M98j81J47J11j05
4232A02j85j9L1k39L85J64k53l22M5O52k06l33o1M79k11m12L02M14l29l30K33
4253i3J27j28j4J52j24N3Q2j65P0J46J13k46j65L36k37j76K83K09l64k97L61L11
4275B34l98J4J58J18k59m4N15k13k64J16K84j84K1k51K09K74l92n2q5K38q2m7
$$ plain form
4124 401 -204 -235 -21 192 -388 -118 378 225 -554 -277 255 -10 89 -49 94 -382 -202 163 246 66 110
4145 110 48 -203 -72 180 141 -97 171 220 -333 -159 479 30 -325 202 317 -42 -302 291 469 -292 -382
4166 -382 138 137 -339 -33 313 167 -74 -36 -81 54 106 266 -114 -103 249 30 -231 75 317 -59 -248 -26
4188 -26 395 -159 -123 351 31 -468 -7 325 240 -24 62 -124 -126 -7 30 -37 -103 51 -3 -284 27 215 115
4211 115 -213 -104 77 -98 -212 332 136 -230 -213 189 -18 -167 165 187 -192 -368 130 -51 96 207 102
4232 102 -83 -102 -71 -310 75 239 -14 -336 -291 361 155 -178 -239 240 29 -383 -81 333 4 -326 -93
4253 -93 34 -94 -108 44 -80 -27 55 -110 -40 106 219 -27 -192 144 -93 -269 14 223 -141 -438 -77 234
4275 234 -164 -150 8 126 -133 -177 338 125 -139 -23 261 77 98 -153 56 330 -62 -114 -199 39 -43 -90
4297i0Q8J88q7k54jJ85l6n2n4J83mq8l3J26K22j88j24n3J23J0k98J62K47m9k47
4322a24K2K75J35n69nK38J47j71J75m3O9j22k25K26m6J07j36m4R4k7j51J63J4
4345Bn6M2q4K77l7l15L30r2J7l21L38K50k85k6j09R5N1j49J48j40QK0k12K08m5
4370h5J0q4Q9P2j8r0K56L44l89j48R6l1j93J06L05p5k10n8K14l8j81J02P4k2M2
4395H8l35K17J19j60L5j69K46o0o8p7L36j71k31K17j2r6J01K1qj4j10L5J06J07
4419A17k1M6k15P1Lj15J89knl61K09J37k8j09J34M7r6j57M02L2k13j50P8l1n3
4444i1J04p9J25J11m0k35J2J64k5p7m7J67j41k45L39J36k19j79K9K13j27J24J86
4467B05o6n11K85L1J32k31N3K96k80l7L56k79P2Nj16n7J98L17l23j09J67J2l58
$$ plain form
4297 -90 -2 186 99 -155 -156 29 -7 -59 -113 70 66 -22 -55 71 293 105 -19 -72 51 61 -237 -75 172 123 -124
4322 -124 -102 173 308 -261 -266 -28 119 -52 123 80 149 27 -198 28 -18 89 -47 -91 3 -24 -175 -12 2
4345 2 -54 -12 -96 181 144 -171 159 67 84 -237 101 351 66 40 -69 26 77 -72 76 -64 -56 -36 -248 -40 -85
4370 -85 -75 -159 -70 2 -16 -106 150 494 105 -43 53 22 -171 -65 240 165 -45 -103 111 73 -108 -6 68 46 88
4395 88 -247 -30 89 -71 -36 -205 41 -19 -87 -164 172 1 -230 -13 -25 -121 -20 1 -7 -21 -131 -96 10 117
4419 117 96 142 -73 -2 1 -114 75 73 68 -293 -84 53 25 -84 50 97 1 -156 246 278 65 -85 -7 -38 -91
4444 -91 13 -66 59 170 130 -105 -93 71 46 -31 -78 89 -52 -297 42 178 -41 -220 -191 22 -105 19 205
4467 205 139 -372 -87 -56 76 -155 -102 194 -86 -123 233 -46 26 31 -85 -142 56 373 50 -59 108 120 -238
4490b38M6M04j29q4j50L42k29j85J62J77j82j59J76j06L7K30j00p8J6R7j43j21
4512b17N75k50l10K07Q1j33k06K76L43m73k52L85L16l97J02J50j72k51K59J86
4532B19m4k33Q8j20j18J52O0o9MJ53l5o1j80M85k76k86K59J97k10j90N07k91n8
4555d7j2N9Q7J2m2N5l7p5L7j97K27J46k32r7J8K04j19k42M75M6l70j28M03R4m34
4580a69j28K66J18l05J94R3j70n0J65K7qN9J44k96R7J74j93j76K66N9l12J12O6
4603C3j4j36P7K26Ol66P5L17k14j61R4L5O9J52k08j5QJ69j79Q1Pk0j79P6K52J1
4629A96n51J53L63o1k36K11P7k64k49L39L1r2l8J19R3l70M24p5J3K04j07l35R3
4652f2J07Q5j96k2K59j29k99L79P9k63o3K99Jj99q5L48n4p9j44j6O2J7q3o5R9
$$ plain form
4490 -238 -192 212 83 -1 -151 191 -38 -223 -61 116 -66 -225 -49 -155 -118 112 12 -66 -50 47 -96 -217
4512 -217 358 108 -202 5 86 -47 -253 23 366 -107 -359 26 342 -55 47 197 25 -226 33 219
4532 219 175 -58 30 -90 -208 -56 4 -65 -61 92 57 -4 -184 301 25 -261 -2 195 -15 -205 302 11 -47
4555 -47 -59 0 87 99 57 112 75 0 37 -160 67 213 -19 -116 -98 106 -13 -255 220 266 -104 -232 171 265 -169
4580 -169 -297 -31 87 -218 -24 69 -101 -151 14 41 33 92 236 -60 37 211 18 -158 108 167 -145 -33 33
4603 33 19 -117 -40 186 192 -174 -99 218 4 -157 -63 -28 41 193 -15 -30 -22 147 -32 49 56 36 -143 -67 185 196
4629 196 -355 -202 161 100 -136 75 152 -112 -361 -22 9 -83 -121 -2 91 -279 145 70 83 287 180 -155 -62
4652 -62 45 130 -66 -88 171 42 -257 122 201 -62 -125 174 175 -24 -109 239 185 106 -38 -54 8 25 -58 -123 -24
4677b4Q5j9j68K17l3q9k5L9L41l78o0L63j00J9k20K86J14m11J35J74j67j95p6
4700a92J31J94o2j42r7R3P4J78k61J01N5k62qK26J52j12j88L28j28k41J76o6o
4723e7kj61L23R4l02J64j45K81j07j67k4L63l19QL6RP2j69J40O2k42l4J06J46
4747G5K7k13K21p4k6j37J20J52j07l0j77J55L1%n0l6O3Orj48L65l2l70J80J48
4772A34j31Qj6K07j93P4j69J4K50k13L3o2N9j49L4J84J35k95O4K22k16p8j24N23
4796B95l76J3Q5J39j38J33k4m8o4j39J32q3jK07l23q8M52k77L9j66K79j62k57
4819c72L11J88K2l08J17J00K3k33J93M8q2m7j10J24L3P3j53R2O4m7j98J27k9J66
4843A02j10m2M9Q1j93J82K07l06n8K42J09k09j60K87k59n7M8K10q9j01J27p8M5
$$ plain form
4677 -24 61 42 -126 91 58 -31 -56 -17 324 -54 -114 249 149 168 -52 234 348 -63 72 246 79 -116 -192
4700 -192 -61 133 71 -71 -168 -75 -1 177 -84 17 72 -190 -198 28 180 68 -120 208 80 -161 15 -51 -57
4723 -57 -59 -220 103 197 -105 59 -86 195 88 -79 -103 260 -59 -51 -15 -6 66 -103 37 99 -143 -177 -71 75
4747 75 102 -111 110 36 10 -127 -7 145 38 8 -169 -14 17 17 -33 -69 -6 0 -9 -157 208 176 -194 -14 134
4772 134 3 11 -5 202 9 83 -86 -72 178 -35 -2 -64 -5 -154 -120 64 199 -96 -32 190 -26 -104 -228 295
4796 295 -81 -68 17 156 18 151 127 79 15 -124 8 -75 -76 131 -192 -280 172 -105 -66 -232 47 -115 -372
4819 -372 -61 127 149 -159 -42 58 81 -152 41 89 7 -40 -150 -26 7 80 -73 19 83 36 -162 -35 -64 102
4843 102 -8 -50 -1 80 -113 69 276 -30 -88 154 263 54 -106 181 -78 -135 -87 123 34 -67 60 -18 27
4866B7L7qq6J13mm4j81J16K36k15j47L47r7k72J72P3K2k37J37O5p1j20J31M3j04
4891f7J6n7R4j28L83k69m2K27Jk83j43K15R2l31J53L33j82j49L09J16k64o4J92
4914A52q1j29M6Ro1o2J65Jo9J12r9j15o0L63jk55K53J44m25L5J49R1j00k18M14
4939B59k12j31k70M45m2n4j12o4L01p8M1j93J75M2r8j6o7J76J00j60q4K16q2k17
4963a25J95Q6l01J12K14l9k42j3J24q0L2O4K7k8k5J99j94K5J05pj71J25j6j15
4987d8rP6J73k82q4L64k28k40L99O0j53j95L08j25J13k25J39j2k20L05j45k02
5009b31K78J0j36J27J19k16o4L7K37R7m99L52J42k85m1K38k00J07j44J58P7j45
5031A8J03j73J6q6O9Q5r1R7k4k19Q4J84q5k42L28R6j85o7J30k9k7R7j4l4k80J96
$$ plain form
4866 27 64 56 -30 83 79 35 -146 -30 206 -9 -156 191 94 -178 -6 67 89 -148 -11 54 -17 -137 -6 37 -67
4891 -67 -51 -108 -14 -142 241 -28 -70 157 158 -125 -268 -53 39 -292 -139 194 12 -137 172 288 24 -40 152
4914 152 71 -58 -12 -3 -64 -126 39 40 -29 83 -16 -131 -191 172 171 -84 169 313 -112 -77 72 163 63 -155 259
4939 259 47 -84 -354 91 49 -5 -117 -181 120 42 83 -110 65 107 9 -7 -74 102 202 42 -42 174 92 -125
4963 -125 70 156 -145 -33 181 142 -100 -113 11 -69 -37 27 54 26 1 200 6 31 136 129 -42 83 67 -48
4987 -48 -57 19 192 -90 -174 190 -38 -278 121 181 28 -167 141 16 129 -96 43 31 -189 116 -29 -231
5009 -231 47 57 -79 48 167 -49 -113 -76 161 258 -241 111 253 -32 -73 165 -35 72 -72 86 163 18
5031 18 121 -52 -36 -122 -53 32 -59 38 14 -205 -121 63 -22 -264 64 160 -25 -92 38 9 -18 79 65 31 -249 -53
5057e3rmN5L6j81J92J01K8j33j05K24k59J70KK0j49j20K32O5k03M4l7K57j50M
5082B7K4k52J44L3M8j03L08j19j24M8K3j08q0L16J3k91%K4Q1j6j24P6M0O7j10
5107e5L1o7k1N4o0J87j38J23j7p8J83p6k60L75l9k75J5Q2Q8m0j10J83j4j76J32
5132B7J30k61p0J64R8o0O9q0j1kN0n3kn1J02m12K12J71n3j09Q8J69q7R5m4K1j51
5159e0P6L5Rj16lJ56o3j04J23r0P2P1l65K69K5m1m7PJ46J00l23J66k19K30j69
5184a05K9J04L4j22n3J47L9j63J1L4J73Q2o1j54J74j70Q2n9O0j02j31J94J97l14
5208g4J79m2j14O8j60K5K23p3j38J40l3jlJ3n7N3J9K21k85j39J52J07o8J8Oj90
5234a53J53r5K12j88K26j06k19J3O3K60r6M4k64J92O6L2q4j2j60J89k06K8J29
$$ plain form
5057 -53 -62 -66 -11 25 -156 36 137 165 32 -73 151 -108 62 64 84 -65 -185 47 112 -91 -47 -84 173 23 27
5082 27 51 -201 -57 -24 24 -79 229 110 -14 34 57 -51 -131 185 198 -93 -93 -69 12 -4 -128 -52 -12 55 -55
5107 -55 -24 -91 -112 -58 -118 69 -69 54 37 -41 142 66 -194 181 142 -133 -118 -36 52 12 -98 85 71 -105 27
5132 27 157 -104 -174 -10 88 28 97 17 6 4 54 1 -1 -52 50 -362 -150 21 -32 -141 -53 116 29 124 80 101 -50
5159 -50 26 61 70 -46 -49 107 44 -60 63 -27 45 116 -249 20 45 4 -43 -36 110 210 -113 53 -166 64 -105
5184 -105 -76 28 62 -60 -113 34 73 -90 -79 -45 128 210 149 -5 169 -1 81 22 82 -20 -151 43 240 -74
5208 -74 105 63 -51 17 -143 -118 105 32 -106 34 1 0 -3 10 -47 6 25 246 -39 -178 -26 81 13 31 37 -153
5234 -153 0 -95 117 -71 155 49 -170 -157 -94 166 70 114 -150 42 108 140 56 44 -116 73 -133 -105 24
5257B4j28j18K44J05m6k82K42lk17J2J16M6j23J39K1L8k04O7M2Q0%O6k70J12N3
5282A6R7k70M4K67k42J01O1Jj77J57n6O1j18J17K02j83R9J2m3j83j73L07j03j18
5306a24K85j85p6J33Jj61O1K10j29p4oN3j02j6J77N1j04J8J12k0j38m2J19j8n0
5331b5l5K83j88q6K76l62J81J16j73Q3j97L35j08k73J25J55l5k39J01P7L5j02
5353e6J22Q4j64R1j05k8K8j83N7L33j89jJ19j48K12m2k03J4J60r9j91J04m3j5
5377a43J13Q6Q6j52J3j44K43j84K43k47O3Rj41K00j37LP3l3J21k7n9J3K26k70
5401d5k7l1J85Q0q8N4Rj81J5J68j57J57j63J41J0j49m5J48j43J38n0l7j0L8qj0
5427aM0J00r8L8j74J81r3j76J95K0o9m8QJ43%j86J57j66J46J66j66p3L7K47k27
$$ plain form
5257 24 -104 -222 22 127 81 -201 41 38 -179 -167 -51 -5 -128 11 32 70 -134 -67 -25 55 55 121 -149 -37 16
5282 16 113 -157 -113 154 -88 13 74 75 -102 55 -1 60 -58 59 261 78 177 189 146 -37 -210 97 -6 -124
5306 -124 161 -24 -100 33 34 -127 -66 144 15 -59 -65 -12 -114 -130 47 98 -6 12 124 104 -34 -76 43 25 -25
5331 -25 -60 223 35 -51 225 -137 44 160 -13 70 -127 208 100 -173 -48 107 72 -167 -66 11 46 -56
5353 -56 66 150 -14 77 -28 -56 -28 -211 -154 179 -10 -11 108 -40 172 130 -73 -59 101 2 -189 -85 -128 -143
5377 -143 -30 56 142 -10 3 -141 102 -82 161 -86 -23 -14 -155 45 -92 -89 -16 -49 72 45 -14 -1 225 -45
5401 -45 -72 -103 82 162 74 128 137 -44 -29 139 -18 139 -24 117 127 -22 -67 81 -62 76 26 -11 -21 17 9 -1
5427 -1 39 139 41 79 -95 86 -7 -183 12 32 -37 -85 -77 66 66 -120 37 -129 17 183 17 -56 -19 228 1
5452Ak2l8J35k08R4L77k57j73K09l6k57k6L73r8M1k60K51j90K04O9l17J92p8M0
5476B6j50P5P6k21K00p7j3Q5j06M41m28j7j7J92P4j90K1k2k8K21k55J01J17K0
5500A25k45J40q0J94j03l2j6j01P7P9M3M7j26j39K02q8R6j12O7J49l38j3J98K6
5524E0j23K26k7j14j30J63j2jo1O1j23J44mm5l4K31m00J21K27r4j7J71j63lj24
5549h1r4K08J1j58R2L0j2O1p1Rj21J19L8k18K95j02j15j48K98j2N3j23l5R2o7
5574e1N5j24K27r8J17k82p3J60K4K6J89N7j45o9J08N6k08J4M4Q2j66J29j69j6
5598a13K5j17K78K3j2Qo4q0N0l9J53p5J77j51j46L2O9m2J7R1nn9k75L16q8L6j7
5625ho3nL3Q7K0M2Ml84K57J82l3k48J13K7L0l00J95qQ5j3q1J64k23LK58j86p7
$$ plain form
5452 1 -21 -59 76 -132 -38 339 82 -91 118 82 -175 -201 172 74 115 -145 106 -84 120 189 -128 64 -14 26
5476 26 -124 -49 27 -194 6 -71 -84 1 -105 336 -92 -109 -126 66 140 -50 -29 -51 -79 142 -113 -12 105 125
5500 125 -120 20 -60 134 31 -1 -17 -118 -41 38 81 128 2 -137 65 -23 73 -39 28 177 -161 -174 24 50
5524 50 -73 153 126 12 -118 45 33 32 -29 32 -91 53 49 4 -30 201 -199 -78 149 55 38 209 46 43 -81
5549 -81 -175 33 44 -114 -22 8 -4 57 -14 -5 -126 -7 31 -187 108 6 -109 -257 41 29 82 -41 -76 16 -51
5574 -51 4 -120 107 9 126 -156 -229 -69 -45 -19 170 227 82 13 121 177 -31 -17 27 109 -57 72 -97 -113
5598 -113 -88 -205 73 96 84 92 28 -52 -2 -41 112 37 214 63 -83 -51 18 -24 -7 84 79 20 -255 61 -27 9 -8
5625 -8 -71 -76 -43 44 64 106 110 -274 -17 165 132 -116 -3 24 54 -246 -51 -59 26 13 -68 96 -127 -124 134 -52 -129
5652a29R7k2N0l1PJ81j74Q7o6J28j39J58j55k42K82r8J34j78J77j20J41k08J81
5675F1n7o9N8PJ08l8k00N8q1M1K60k78J5J33o8j3NM0P1j63J50J29k38N2K02j18
5701F7j40l2J29J47k81Q2L18j41j46L2nqk57L20j2r6k5O8Q1j06k8N1l49L21M3
5726C3j1l4L4K02l20P2l7J51q0J1K3k2j92J08J50m5q6j1J3J26j11Pk2J29k7j38
5752g7R1o7L2L3p4J70j15j17LL05j22m6K62l23K0j59L15M6l27J72L8q5P7n9k5
5777c2j0K3j24R9k0K69p0l06J45P5N1k55K47j06j40J35N0P3j09O3j8R4k01k4J91
5802A00q1O0j45N0J70k19M3pJ9k2N1j35K60j33k4k7L2J47k76J75Jp3j23J52J80
5827A75j85om9q8J84o6K07j57o3J85k03o7K04j9m1o8k0K06j93L2K49l14P8j63
$$ plain form
5652 -129 -32 -54 -4 -35 -28 153 -21 66 0 128 -11 147 -8 -250 32 -66 68 -110 67 -53 88 -120 61
5675 61 4 -65 -7 0 108 70 -130 -72 -153 -112 148 -130 -115 18 -50 -63 -58 -18 53 -110 40 169 -69 -17 185 67
5701 67 -73 -105 24 171 -110 -28 290 149 3 35 30 22 -235 85 73 -23 -48 20 101 -5 -33 18 -331 -10 33
5726 33 22 -12 22 224 -96 -24 -61 90 10 21 44 22 -170 -62 88 43 -43 -54 -41 85 -26 -19 -41 88 61 -77
5752 -77 14 -53 -21 12 -62 108 -7 -124 -121 184 62 16 278 -45 -25 -184 131 177 -150 22 60 -25 52 -7 -32
5777 -32 -42 -19 -143 -44 -64 205 135 -171 -26 49 100 -155 92 -14 -154 -19 31 104 -5 58 40 134 -67 -91 100
5802 100 19 79 -66 -16 154 -65 -22 -29 -10 -32 19 -116 144 11 -13 -40 -8 139 -137 38 39 -34 -157 -5 175
5827 175 -10 -16 -65 -153 31 -35 172 15 -48 137 -66 -133 71 52 11 -57 -77 129 -64 -32 217 -97 -19 -182
5851a82J51j26K63k4L5m1j07j18R4J82k11l6J71j17J04j64M8K13j18j10J63N8
5873A28Qp4p0J18r1l37M51n7o7J8J21j94OJ27p9o9n5K5R5J04k58K23m6l2L0l28
5899c03K50J12n8k86K96J7P1m6J4j98R0j56P4J59j1m6P0K36l01J7p9K14j53j12
5923a29L7m7p5K04j49k6Q4Q4m4J3N1R3k48O1J25j33JK13n5j22J07K9j45Q2m5N7
5949B3rK0J28k1j57nJ16k51Q9M7J39K2J4n7n8n0r4N2K02l00L27j30k01Q5j09K38
5975F0M3N2j75m5R6j74J43j8J05k11QK30j40P5M8lj43J83j90J15j53Q2J3J8j10
6000i1O5Nkj98K31J36k03J02o6k2M6J55n7Rk13%k2K6q2J72J9pJ46l44RJ82MJ5
6028A5k2k5KK05m9j25n5k7P5M7Q0j41M0Pj16J05Q7k3j75K45l3j45J63j99m7K45
$$ plain form
5851 -182 -31 -157 106 82 117 76 -31 -149 -55 127 -84 -120 51 -66 38 -126 -78 135 17 -93 70 128
5873 128 136 62 -8 110 19 -318 133 76 9 27 148 -46 -40 87 8 -61 -116 -91 4 108 -150 73 27 -5 25 -303
5899 -303 -53 59 1 -285 11 28 99 53 67 -131 -41 -197 -123 36 25 -21 49 285 -16 1 -78 136 -17 -129
5923 -129 -92 -139 -214 -10 -159 -185 -101 -17 -61 -48 3 96 -152 -91 34 -99 -98 115 60 -62 45 74 -71 11 -34 23
5949 23 14 34 162 141 -16 -21 95 -156 -67 -20 119 141 155 98 40 -10 -104 -52 150 -150 177 47 -154 -69 -178 60
5975 60 103 155 -20 -65 31 -143 0 -18 87 -124 -116 114 -26 49 97 94 -49 134 -56 59 -94 -12 1 19 -91
6000 -91 -26 -21 -23 -221 10 146 -57 45 -21 -43 3 158 101 110 -103 -103 -125 -99 -181 -9 10 3 149 -195 -186 -4 0 15
6028 15 -7 -32 -30 175 126 1 -54 -81 -6 41 121 -20 20 27 -89 16 103 80 -95 150 117 -28 135 -64 -111 134
6054A34o6j44K45k41o4R3k4J03K9l69L02J61l8j98P0k1j9N9k7m5J38j91Q7K0N7
6079E1j03K1N2M2Nk48J25L5j6k8K32l00P7nJ24j75Q9o7J38j40LJ98j54j29K98
6104A25k4o8j84Q7J14j93J80p3p1j23K90j07jN2J79j45Op5K64j30j36J30q1N1
6128F7j80J6M0m8J85M0k65N0K30j09j36j08K10m9r3J92J77l98J12J62k80J69m4
6151f0J29q4n2Q6J07j07k20J34K62j36P8j90R8n9n4P4o1J89j04j89J28o1k6OK4
6176h8J44j00j38J63k2r4L2O9K62l25R4n7J1J25L0j65N7J07j24J9L0R3j06OM2
6201F5K6r9j01J41J9Q2q4qJ22j53k9Q8L9p0j17M2k4J22O0J4JN2k38r2J33O7j08
6228e0K16j21p9j3j64L41j86J58j67O9lj54K14j7J1j41lJ43o1j3M6J4j9J06p9
$$ plain form
6054 134 68 -76 169 -72 -136 -43 -67 36 65 -304 -2 159 121 -77 -7 -28 -47 12 -15 -60 78 -113 -26 -6 51
6079 51 -52 -31 21 63 68 -180 -55 -20 -36 -64 168 -132 -55 -60 64 -111 -22 -89 49 -91 -88 110 -44 -173 125
6104 125 101 33 -151 -64 50 -143 37 -36 -107 -230 60 -47 -48 4 183 38 44 -31 233 103 -33 97 16 67
6128 67 -113 -97 -57 -105 80 120 -145 -95 135 26 -110 -218 -8 -57 -150 42 219 -179 -67 95 -185 -16 -60
6151 -60 69 -15 -67 19 126 19 -201 -67 195 59 137 -53 45 -14 -68 6 -55 134 30 -159 -31 -92 -118 -112 -88
6176 -88 56 -44 -182 -19 -41 -135 -103 -34 228 -97 -3 -60 -49 76 106 -59 -2 105 -19 0 30 123 17 23 65
6201 65 91 -8 -109 32 51 133 49 41 163 10 -19 69 108 38 -79 -37 -61 61 121 135 136 188 -50 -142 -9 58 -50
6228 -50 166 45 -34 -47 -211 130 -56 102 -65 4 1 -153 61 44 55 -86 -89 54 -7 -20 26 40 21 127 48
6253D8k90M68j20j20P1j01J4j30J10P1Qk15J54M6op8J39k9M6q4j52Q0l4K77k99
6278a26J08JJ09o3O4j25j2l1K11pj06n9J14l4j58J92r9n8J51J53k59no9J83m6
6303B9O3o7k7K8N0j18j89K40L7l4j03R6o4J0q1P0O2p9j18J88q1o9K00j31K48j88
6329b8o3J59j84k7J34j80K20K4k3j56Q3j0O9k0J84r4O0j56p8J3K89k67R1M0qj47
6355g5l2J60j72K28j64J53j92L8j02J54J17k71K61j31R0o9O2p3J37R7k55K54j14
6378A01r0j75K25j3q1qk1l2J58rp6j1j6P5r2K2R2j18j20K90j8j22K6J06N3j78
6404c2J9o6J21j17R8l5P2K6m0j17J20J15j97K8Q3Oj49J86j5L7l51L33j79P2L7
6429E5p1J22j61N7K0QjQ2l1j51J11k27L34l03J06pK3N1K1j12J16m4Q7j87j39L20
$$ plain form
6253 48 -242 226 106 -14 57 -44 -30 -160 -50 21 29 -186 -32 14 8 -70 69 40 86 2 -150 -70 -104 173 -126
6278 -126 -18 -17 92 29 93 -32 -44 -75 136 129 23 -36 78 44 -114 78 -21 -79 72 225 -34 -39 -108 75 29
6303 29 92 25 -2 26 76 -42 -231 9 46 12 -91 5 -59 -49 -130 -60 2 -77 -195 -7 -88 -157 43 -88 160 -28
6329 -28 -91 68 -116 -143 -9 -189 31 55 32 -124 -41 -51 18 -2 182 88 148 -8 -86 -73 216 -51 40 80 72 -75
6355 -75 -107 53 -119 109 -55 98 -94 -56 -158 -4 113 -158 103 -28 62 -7 55 -18 119 216 -39 215 101
6378 101 11 -164 61 48 -33 -41 -62 -94 64 55 -21 -32 -48 27 -65 -43 49 -69 -189 101 83 -39 -13 93 146 -32
6404 -32 -13 -79 42 -75 23 -12 60 86 46 -71 49 164 -33 -5 78 84 -65 121 106 143 -208 125 -54 18 55
6429 55 -16 106 -55 2 22 30 29 111 80 -71 40 -187 147 -156 -50 -57 -34 17 38 -74 42 -2 85 -102 -241 79
6455G9j5n5j02J51k4j25J02p4j1j6J31l8J52k58R7Q7l3O8q5M3j41J15L8K8l02
6480a88QJ45J42k15J18j7L6J2p1p4J50j33K47j34j04J67j65KM9j41Q3J89j47M
6504c7PJ31k13J34J77j85j40J79J33j91r3M7R2J10r5Q6j85J41l9p4p0J18K2j11
6528e6Q1r0Q1P2k4J4r4o2l4L4O7p2L7j2O7l0l3N2n3M3K6j15O8J31j29j17J88l
6556C7po2P5m7l8J74q7j26j57L92r4j17r8K09j51M3M1J87O1k90R9J0k1j24P7J0
6582dq6J90m9J7j53Q9M4q6M1P5r3q2L9J33k07Q9j61K00Q9p9j49R8P2j05N9j4J06
6609G3l3j0j67K84q1m7L6j3K0j51O2R4k03J38n2j16J80RQ6k95K44Q1j39pN2or8
6636e9K18q5%k34K01j30N0J80K0o8K8j48K53j25l06K49q4l9J89p6r3J56j67K03
$$ plain form
6455 79 64 9 -93 58 34 -91 11 -63 -74 -90 41 3 155 -103 -6 81 48 116 31 74 -67 48 86 114 -188
6480 -188 -180 -35 107 -108 10 -7 29 41 -30 -104 46 -87 160 26 -78 89 -76 -74 -25 -166 -83 106 -41 -37
6504 -37 -30 101 -112 22 199 14 -126 53 186 -5 -98 -51 41 151 56 142 -43 98 59 -15 -85 33 55 -56
6528 -56 25 -65 16 88 64 78 -16 -78 -112 -78 -11 -83 -46 -58 9 -21 -54 -2 -55 -12 14 -101 -33 98 -31 -148 40 37
6556 37 30 -32 43 -4 -42 132 45 -81 -238 154 60 -57 -155 54 -97 -54 -13 174 235 -55 44 54 33 -91 -14 -4
6582 -4 -90 100 51 68 -85 4 48 -38 3 78 -15 -97 -58 75 -132 -43 -204 -4 85 6 -143 -45 27 -78 -19 -33 73
6609 73 40 30 -137 147 66 19 55 42 62 -89 -27 67 -136 2 -50 -166 14 23 109 -186 58 139 0 -7 45 39 -59
6636 -59 159 74 74 -160 41 -89 -39 141 161 93 121 -27 226 101 -205 44 -40 -79 110 34 -59 97 -70 133
6660A33r6j1m4M0q7J64lk10J64K%qq5J8J92k60m9J34r1R9j33J42R4j23J55k04
6686f7j00J32mJ38j78L21l49j15L95qk00J76p4n2M4r7J67j50K2J29k68J21P8O4
6710A25pj27m9J09r5j07J82K2m0p6M7Q3l2l5m7L6q8J87k6q9Q7j65k2Q6J6J65k45
6737a05K41j01P7j59J63m3J28l24J14pr5K00j11j21J41p5kJ32l6r5K3J4oL8j8
6762b7Q8p2Q2r1L6j04J23J05j18k2oL3j23L3m2J36l9P6q1J61j08r5K07j53J6P9
6788I4j7l8k07J73K5k33L35r7k1j53J1P2l8L18q7j54O6o6J14l23L20Mk54K2J67
6813C3J99j35k30J21Q4j34K67k91q6J10Nj28K05J2k3Q4j5q1O9j41L0J81j81L7
6837hl0p9J77j40M3K32j03j9O2k13R4o1k4P2M3K7j95J34J77j50o0o1J12r8J40
$$ plain form
6660 133 37 26 -18 22 -65 99 96 -114 50 52 52 44 -41 -23 169 -91 -140 -6 -97 2 -131 11 105 -18 137 -67
6686 -67 -167 -35 -39 99 -79 242 -107 -222 173 165 -35 141 67 15 59 -38 129 -21 1 130 -138 -17 61 125
6710 125 118 -9 -58 51 -44 -151 31 53 13 -63 -16 67 35 0 -47 -11 -99 88 62 -27 60 -105 -127 -41 -25 140 -105
6737 -105 136 35 112 -47 116 73 201 -123 -9 -16 -111 89 -22 -143 -2 -77 -79 53 17 -78 -55 -41 -47 -9 -27
6762 -27 61 -11 71 -20 16 -88 35 140 22 0 -6 27 -96 -63 -105 31 -8 68 -13 148 40 -55 152 -1 15 94
6788 94 77 39 -168 5 30 -203 132 35 14 -139 -128 -56 -94 224 137 -17 49 -17 97 -226 94 98 -156 -134 33
6813 33 232 97 -133 -12 72 -62 205 -86 -172 -62 -57 -185 20 32 9 93 78 -3 66 -75 -45 136 -45 -8
6837 -8 -38 -117 60 -80 -37 195 92 73 135 -78 16 -45 -69 3 46 73 -122 12 189 39 -21 -82 30 -68 72
6862G2j05n8M4R7M7k32J19q8J94j68K38q1L3j65Q7J0N1l5k18J29n7Q9N4j89K19
6887H7k5K12l77N3l9J70J07k01L6j00J13r6K19j24K25k97L1j33J56L1M2j12ML3
6911A5k9J21j54J17j3Kn0p9mJ13j44K15%q2m8n6Q6O0j18k1j3j8L39j93O2L2k50
6938a10j1J59O6q9J18l1q7N2k34L1K40o2j42O8Q9j4J9r0JJ00k85L31j46P2m3J80
6964A82o6j86J50j2j2j29K28r2j10p1K53k00L1N4j71R4N7j42O4M8Q1l6l9j81J60
6989d5Q1J6Q4k06L1J14o7kj00K86k71R7J49j15j53J36Q6l55J60J17J41k19p4K1
7013h8R6j6L4M7m2j07lJ85l7M5j0p5j96J00K96m46J88J12j30j30J71R3q2kk62
7038b59L62j79J84p8j44J98k6%j27J20J36j85Q4j6O4j87P5N9lk50R3R5J70k89
$$ plain form
6862 72 -33 -91 -47 50 97 -135 -16 -104 90 -78 160 79 112 -53 34 44 95 60 -158 -29 -86 3 57 -132 87
6887 87 62 274 -103 -50 -89 81 188 -13 23 -77 36 -60 159 35 260 -37 -6 -139 17 48 90 -22 -18 15
6911 15 -14 107 -47 70 57 59 9 -70 -74 39 -105 110 110 28 -20 -76 10 70 -48 -69 -82 -100 239 46 108 140 -110
6938 -110 -121 38 104 15 133 102 15 67 -167 -136 104 42 -100 -32 57 43 62 -28 -27 73 -212 119 -27 45 2 182
6964 182 116 -70 80 68 56 -73 155 63 -47 -118 135 -65 -34 20 -151 -57 0 -142 -78 -30 51 15 -24 -205 -45
6989 -45 36 52 136 -70 -39 75 8 6 -94 192 -79 18 167 52 -101 35 121 -234 -74 43 184 -35 -109 -88
7013 -88 8 -8 26 73 31 -76 -79 106 69 114 104 29 -167 -67 229 -217 -29 83 -47 -177 -6 87 5 3 -259
7038 -259 103 -76 108 30 -114 84 58 58 -69 51 187 2 86 70 134 -53 22 81 78 -172 -79 16 186 -103
7062a03J14l9k9L8j6J85j09n5pJ50r5P6j15r7J3M6o7J16J1M7j39J65J5K8k53o3
7088a83K56j08Lj34L12j35o3L09j52j35N0L3jJ7nO2k45K74j50K3j2P6j15l5J90
7113A32j54J6l0L7R7m0OO0j78j8R4k2L7J45k08n1KJ88j04J44j18Q9o6o4Q4j20
7139d2r6J08L2R0j81J63q9J58j59p4K3Q9L0J8nr2NN5k54K80j04k2R2j9M0j0k2
7166A4m6J00p7j35L00q7j67O7L2J01m5lK2j02J92l20K13r4J42j42n8M7p2J20M5
7191D7o8j88J63L0J5j11J85N2oj83NJ26o2N4j88J90n2R1j49J19N8k27J4M1J44
7216A00n9L2j2k9J7P6r6PP0Qj14q7L1p0J71m7m1j25K52k35L38j56p0j17J42n2
7242f6p6K37o1l5r6J11Rm6j1P6k01J19P0J2P2n3j60J60k27K71k21J34P1m4j07
$$ plain form
7062 -103 11 -28 -57 -19 -35 150 41 -14 -21 129 34 110 -5 -102 -89 -43 -110 6 17 64 -75 90 105 133 -120 -183
7088 -183 73 -35 -32 -166 146 11 -52 257 105 -30 20 53 52 69 64 126 -119 155 5 28 16 92 -23 -58 132
7113 132 -22 -6 -36 1 98 58 64 124 -54 -72 22 0 37 182 -26 -77 -75 113 9 153 35 124 58 -6 78 -42
7139 -42 -138 -30 2 92 -89 74 -15 143 -16 -90 -67 22 52 70 65 -27 -22 33 -221 59 -45 -67 25 6 46 36 14
7166 14 -32 68 -9 -144 156 69 -98 -31 1 102 57 54 76 -26 166 -154 59 -35 107 -35 -93 -46 -118 2 47
7191 47 -21 -209 -46 -16 -1 -112 73 125 119 -64 -59 67 5 59 -129 61 9 100 -49 70 128 -99 -85 -44 100
7216 100 41 73 61 32 49 125 29 36 106 114 0 -87 -56 -126 45 -2 -43 -168 84 -151 187 31 -39 -156 -14 -66
7242 -66 -142 95 34 -1 -97 14 23 -23 -34 42 -159 -40 30 42 114 61 -99 61 -166 105 -116 18 89 45 -62
7267f2J45q1P7m9j15K03k0j24j85L18r8J24j06J6m5l7J27j0j82K5J0p9L46k96
7291i8J67j8k9j48J3P9r5K61j26J25k01N7lOJ07R6k39m5O6p8n3J96p8N5k63K23
7317b3O7j15M3O5J39n9j6k58J10p9J62L6LpP9q4j14K63j13q8L7k44K55l3N7K3
7343A06l05J34J87j47j40K41p2l2L3R1q2j40J98P4j55p1K33j86L2r9J16n2J50
7366A14p6Nq3m2J59m2J42j29L3l9j40P8J49k33K56k8j33m5R9P5p4j55L27k07K7
7391C8j23J88q7J05J14k33j57K21O5oj97j08L84k27O2m7n0j98K88j17J11j22J29
7414C3j17J10O9p2K3j16K62j57j37M9L05l27J65j9l6j24j9K49k01J91k70M4oJ13
7438A2K6j77J61j77J91R6j76J62m22L35O1K7L4j05j33J99q6l8n7K1J0QJ95j91
$$ plain form
7267 -62 83 2 79 30 -85 118 98 -26 -211 107 9 133 27 43 -2 -39 88 78 -104 -79 -69 -148 198 -98
7291 -98 69 51 22 -126 -113 -34 -129 132 6 131 -70 -13 -16 -10 97 193 -46 -91 -25 -103 -156 40 -38 17 -246 -23
7317 -23 44 -71 -28 37 176 117 101 -157 -47 -126 36 72 75 68 147 63 -51 212 99 11 48 -196 59 26 83 106
7343 106 -199 -65 122 -25 -165 76 4 -28 5 96 14 -126 72 146 -9 -80 153 -33 -1 -100 16 -36 114
7366 114 38 43 -40 -82 77 35 177 48 81 42 -98 -20 129 -104 152 124 -9 -54 45 120 46 -109 218 11 38
7391 38 -85 103 16 121 235 2 -155 66 131 125 -72 -180 204 -23 39 -8 -58 -256 32 -85 26 -96 33
7414 33 -84 26 95 23 46 -70 192 35 -102 -53 252 -75 90 71 35 -89 -108 141 -60 131 -139 -95 -101 12
7438 12 38 -139 22 -155 36 132 -44 118 -304 31 92 119 153 48 -85 114 28 -10 -67 -46 -36 -28 167 -24
7462b4L5J36j69N3m5K03l08R6Q0l4q1J65j44J18j88J0J82k12J10k7l9J13j97J01
7486f6Q4Mj01o9K24K3O7k11M7J02n0J46j89o7J4l5M9qJ93j06j15J55q5j8N9j0
7512C7P4N7j57l7R3r5J21j6j57P7k2l2J36j56q1j22K56r4M4K05k2m8k38K86k3
7537H6k6j60N7O3l4J51k41r2K40or5J98k05j1r9J76Lj05K7Q0J13k02O9N9k06K44
7563H4p7q5k6O7nlJ4Q7j86OPN0J00k6m4O6o6J25k24J81q5L6J18j26L0pqn7J48
7592I4k80K00k4P4q3k9K25k47L2J57r2j33J54p1q1J38n1j9p2k1J85k28J47j19
7616a44J20L0N3K3o7j02J00oJ2J71j71J02k07K29rl31Q4R1Q9J3k67J49j5P9M6
7641G2L9m7m5j55J88o9Q4K1p9J8j02J7M6n0J33o8L7r9l9K70j6j86p7R4J9o0L9
$$ plain form
7462 -24 11 147 -22 31 -14 189 -119 -23 57 23 -58 107 -37 81 -107 -97 85 -127 -17 -44 -83 30 -167 -66
7486 -66 18 22 -79 -148 76 99 166 -45 2 104 54 200 11 -56 -42 -77 -28 -36 157 51 -64 91 6 -12 47 37
7512 37 111 168 11 -26 67 -28 93 77 -80 -3 -25 -57 79 -77 -158 -280 -24 -118 -74 131 109 61 -177 109 86
7537 86 60 -100 -43 20 -14 137 -104 -196 44 38 -57 141 -64 -75 -174 2 5 -100 -73 7 120 -82 -13 46 -160 84
7563 84 7 -78 -104 -37 -42 -45 -31 56 -130 -124 -117 -67 33 7 -37 29 -37 88 -136 45 -40 -4 114 -12 18 11 3 -54 94
7592 94 -186 14 -10 64 -19 -48 177 -70 -38 119 27 -106 48 -23 -104 34 -17 -36 -108 -129 56 -172 -25 -144
7616 -144 -24 6 59 82 15 -87 13 7 19 190 19 121 -86 143 134 -197 -113 -22 67 80 -187 -38 -53 26 72
7641 72 111 64 19 -136 52 -17 67 88 9 27 -75 -58 -12 -62 71 3 40 -59 -98 172 156 -30 -107 -13 6 -54 -15
7668a5P3l3pM0j47J06j14J20j32K8R1n8j6q6P4p3P6M0J04k17K18j62o7j7J36L1
7694gK6j08N3J48p6l8J6j18K72k8k10J59o9m7q3J38l2nK4J4J49j58j26K59k47
7719i4P9N4J67j90l6R0o4J22k35L06k95J53l0j04m3K4J67R0j68J9r1j05J95p2
7743f1qJ12O4J36l83N0L0MO0M6J23k65J03M8J98k04j21J66j25N9KRj48Q6j40K22
7769F3j39p5K67j88J15M9r3J06K8L3k73l5L41k04q4k0Q3j36J24N7Qr3Q0J51j31
7794C4L7q2l7J0K0J01q1p1K9J6j4k0R6J1J56k94J57o6N8j12J56L1j25N1j8Q1k01
7821g7OJ55p5k03K85j68J47k17J82j23JL0Q4j67J63J25j77j08N6P2j34L1mkJ4
7846a04J72l0k23K39O5k18P5J21mj24J25j84K39k08J47n4m1J7O4j38p1K26q6R0
$$ plain form
7668 -15 58 25 18 58 -89 17 -97 23 -109 -81 10 -48 -64 -150 -76 -149 -73 -33 71 -146 72 -90 -157 -174 -38 -7
7694 -7 19 -89 -36 112 36 -2 14 -104 168 140 -70 89 20 -27 -110 28 -4 -9 15 29 178 20 -106 153 -94
7719 -94 -15 39 206 16 -20 70 6 128 -107 199 -96 57 27 -77 -120 -96 71 161 -7 12 -79 -184 11 -61
7743 -61 -69 43 107 243 -140 -90 -60 -56 4 50 173 -92 11 59 257 53 -68 98 -27 32 34 43 -105 -19 -159 63
7769 63 -76 -151 116 -72 43 92 -1 105 133 166 -107 -142 199 -5 -89 -109 -26 -162 -38 19 27 -66 14 165 34
7794 34 71 -11 -48 -38 -18 83 2 -69 -40 -24 -38 -58 38 49 205 -89 68 2 60 -52 104 135 10 61 43 124 -77
7821 -77 -71 84 9 -194 91 -77 70 -147 35 -88 -87 -57 27 -140 23 148 -29 -137 -81 -9 -143 -112 -116 -118 -104
7846 -104 68 38 -185 54 119 -99 -24 97 93 -31 94 -90 149 -59 88 34 -7 10 74 -64 -135 91 5 95
7870I5j39J37J7p9j27Q6Q3j18J73j53M9j13rK05k2r7Q2k08P5K71l77M6K57j20
7894A4n2j12J95qk9o9P1J4n7L9p9J86j84M2j64L98j80J3n9J34jKj38j71L20n8
7920F7j00M8Q3r7j7j7K55k45K2N6M4j24n3O6n4J14k18J24J28J33k17J13r2j43
7944a24J26q8L2J91p7Rj32L7m3P5j11J07P0O2p7Q7j79l3Q3R4N3k78jQ1L6Q4j98
7971a14K80J02m30J29QO3r8o0P4Q5k52K74J00n1l3j8p5J7j45NK44r4j47J80k37
7996a93K11j30PJ48j46J45O0J47j49j38j9J99mJ9o0r0nl6j66J83n4JJ68j63J13
8021D8R4j8p3l3j10K22k44J53L4j04J13j23j6K8J40j80l7M5Q5J1m9l4M8OJ41j33
8047A4J8q7R6K3j09Q1j55J69M7k38L38k99L9oJ8j33L60j25K4j9m6J1Lq4J31q9
$$ plain form
7870 95 -44 93 110 31 -96 -10 73 -45 128 -25 24 -89 -98 107 85 -12 70 -138 -63 208 -169 -123 134 14
7894 14 -38 -150 45 37 8 -61 10 24 -33 6 -73 113 -71 -29 -193 205 25 38 -21 113 112 114 -24 -195 125 67
7920 67 -33 15 98 1 -16 -33 222 -23 -1 55 99 -25 -78 -12 -66 48 -170 -46 82 215 -2 111 19 -124
7944 -124 2 -86 -54 137 60 69 -63 -26 -69 6 -105 2 72 134 57 144 -35 -68 15 109 162 -116 -117 -36 0 84 -114
7971 -114 166 268 -162 -33 -25 38 -60 -120 -46 39 -213 61 161 110 77 59 -16 1 -144 -139 105 11 -136 44 -193
7996 -193 18 -112 -105 43 -103 42 102 249 100 -38 -57 142 138 157 97 7 2 -34 -200 -17 -71 -70 98 -65 48
8021 48 142 124 51 18 -92 130 -114 39 73 -31 82 -41 -57 -29 111 -69 -106 -61 24 35 -14 -48 0 6 147 14
8047 14 32 -55 41 64 -45 36 -119 50 97 -141 197 -102 -63 -69 -51 -184 176 51 75 56 10 21 24 -60 71 -18
8073a8J11P4j93nO7j43P5m1N9k5j57K66K1k86K97j65j6K33n9op1P8n7j0k3j21
8099a15J67j65R0l34K91J11n2j8m3K27j53j13J45l5j4q3J7K72%j36k01J54q8Q9
8123A3j37P5M8j86K14J6Pk2J91j76n6k8r4K69j52J06j71K8L0o0J66o6j23Q2J98
8148A72o6q8j50L02k65n6J62l8O3m6j5j53J43l9m5N2M1P4k0k22L90k07P0N5o6
8173D8j72J22n7j19K04Q2j76J19QkQ3kk25j9J00M0J7q7
$$ plain form
8073 -18 93 167 -26 -31 36 -107 -32 -73 -14 -39 -196 70 91 -195 102 -63 -79 154 95 89 18 96 39 29 6 -115
8099 -115 52 -113 -23 -357 -66 45 -7 -25 -68 159 6 -107 38 3 -11 -94 -77 195 195 59 -142 12 -76 13
8123 13 -124 -49 -1 -187 27 43 50 28 219 43 -13 -41 -135 134 -18 88 -83 -55 -25 -85 81 15 -108 -26 172
8148 172 106 18 -132 170 -95 -151 11 -27 36 -10 -25 -178 -35 -74 -119 -67 -26 48 28 -194 196 -11 59 114 48
8173 48 -124 -2 -59 -178 26 108 -68 51 59 57 140 138 -87 -106 -6 34 51 -36
8191c6
$$ Imaginary data points
##PAGE= N=2
##DATA TABLE= (X++(I..I)), XYDATA
0@%%%%%%%%%qJ6j6K4l2L2m0N6p2Q8j04J21j45J76k08K41k81L29l85M46n11N86
31C13o71P64q63R76j102J238j390J558j738J933k149K386k646K930l237L574l944
48b068M347m790N274n810O407p066P801q628R564j0636J1873j3320J5046j7143
62i149J9749k3093K7565l3886M3564o0385R7739l27962J55716N66734m83634j67324
74a94366L54728l998m45902J53608L66867j17484k19976J47829o1148k06904K05443
85b1303K92489k24416j88807J96484M80k70438J71296L32605k29665l12696K49744
96d227J49960k97648L0670M11934j09129m50635R0536L38409j23869j48432K35222
107A22791L4259l12612o454K42343l5843p8655J69920l5666l11145M4282L15446
$$ plain form
0 0 0 0 0 0 0 0 0 0 0 -8 8 -8 16 -16 16 -24 32 -40 48 -56 65 -80 96 -112 129 -152 177 -208 238 -273 313
31 313 -358 406 -457 519 -583 655 -735 823 -915 1018 -1131 1255 -1391 1539 -1698 1876 -2068
48 -2068 2279 -2511 2763 -3047 3360 -3706 4095 -4533 5031 -5605 6268 -7052 7994 -9149
62 -9149 10600 -12493 15072 -18814 24750 -35635 62104 -265858 -110142 456592 -27042 -194366
74 -194366 160362 156364 -289538 -135930 230937 113453 -106523 41306 -19842 -226746 -21303
85 -21303 271186 46770 -142037 54447 54927 -215511 -44215 288390 58725 -253971 -4227
96 -4227 145733 -151915 -121245 290689 181560 -269075 -178539 159870 36001 -112431 122791
107 122791 157050 -155562 -162016 80327 44484 -34171 135749 100083 -211062 -166780 148666
118A48666p1428j98114J93555R6796l29506o1401L79059M3959l15573M0759K18898
129A45670j91862j84317K84905J74919k54889j01161J73681l1231j20630J48376
139D3461J03921j85183o4337J41175n6187j00637K03939J11395k63582j01683
149a67718K37373J4468k09667J08006K16910j91870k21222J98253J57022j72108
159c0553l1284J76322p1160j94178R8058J56847r2121n2700J07643n6257j34551
170a23934J17188J25867j26672n1248J39830m9709j81373J10494K00156j32413
180B8186j57823J51815P5157j84373k901K10304k6313j88548L9955J18110p6478
191a2909m7091J16615K006j15174L2152O8333p1948o635J16509l8644j43668O3015
$$ plain form
118 148666 77238 -120876 72679 169475 -160031 -221432 157627 201586 -113987 -73228 145670
129 145670 -46192 -230509 54396 229315 -25574 -126735 46946 15715 -104915 43461
139 43461 147382 -37801 -102138 39037 -17150 -117787 86152 197547 -66035 -167718
149 -167718 69655 84123 -125544 -17538 199372 7502 -213720 -15467 141555 -30553
159 -30553 -61837 114485 43325 -150853 -52795 104052 11931 -40769 66874 10617 -123934
170 -123934 -6746 119121 -7551 -58799 81031 31322 -150051 -39557 160599 28186
180 28186 -129637 22178 97335 -87038 -89939 120365 94052 -94496 -54541 63569 -12909
191 -12909 -60000 56615 58621 -56553 -24401 43932 -28016 -34651 81858 43214 -100454 -37439
203c7439J27648r7543q4699J45520M6378j75566j8862J67778j0449j33935N1250
214a9919R9420q8754o8017J02799L2609q7150J2764N5827n8749k8706Q2516j172
226C3468q3981M2002P4243q5545n3949J20380K5325j34949R905J30442m6960j16177
238h5796P7171R4060r6585o1888J05007K3662r7116J0245P1489l6325l6302N2613
250B0235n6n9537L2039M9955o4084k2908R5638p277j13613L4383J12037n5712
262B1100r0772P9031O3596j04404m2976J09578K0363q9806R460N7744m0501l0867
274c8454N8943J3873n1184J2914K8450n4863j0329Q7466k868r0211K4649P0933
286D9319n9991n3278R5801M7580j09734l6948R5077Q51p7258M3677O9529o4263
$$ plain form
203 -37439 90209 -7334 -92033 53487 99865 -75701 -94563 73215 62766 -71169 -19919
214 -19919 79501 -9253 -77270 25529 58138 -29012 -16248 39579 -19170 -47876 34640 33468
226 33468 -50513 -8511 65732 -19813 -73762 46618 71943 -63006 -53101 77341 30381 -85796
238 -85796 -8625 85435 -11150 -73038 31969 55631 -41485 -31240 40249 3924 -32378 20235
250 20235 20179 -39358 -7319 42636 -21448 -44356 51282 44005 -69608 -35225 76812 21100
262 21100 -69672 9359 72955 -31449 -74425 35153 55516 -34290 -24830 32914 -7587 -38454
274 -38454 20489 34362 -16822 -3908 24542 -30321 -40650 46816 43948 -46263 -21614 49319
286 49319 -10672 -63950 31851 79431 -30303 -67251 27826 28677 -48581 -4904 64625 362
298C62o0809N5735L3654l7228J2995L1863n2256l2183N9034J2239m3543L6713
310A6576L8816q3799n0699R6743M7273q7576j1576Q4529l8231r6869O3298J02778
322H1263n1123p0663L9410J7014n2663J6554O4549k1690m2473K0605r384l5483
334d4084N6003N8494o8765n8094O2081J8927p4922K6494J04728m6129j13614M4961
346c3920Q3111m9034l0583P6288O22j01484k773Q3685o39l2013L3118p523o7914
359d9059J4689O4578j5765k3749M2500j6865q7979K7193J08011k2934p8001M5169
371G788L6552q9782k3037J15821K7906j02303j8533O4732k2234m0585O4081M1730
383F2136o3757l3765K7586q129l059N9198N366q0966o398O6476k2811m3344P7049
$$ plain form
298 362 -60447 -4712 28942 -8286 4709 36572 -15684 -47867 11167 23406 -20137 16576
310 16576 55392 -28407 -79106 17637 64910 -22666 -34242 50287 12056 -84813 -21515 81263
322 81263 30140 -40523 -1113 15901 -36762 -20208 44341 22651 -19822 783 -8601 -44084
334 -44084 11919 70413 1648 -56446 5635 24562 -50360 -23866 80862 34733 -78881 -33920
346 -33920 49191 157 -30426 45862 46484 -55000 -57773 25912 25273 -6740 26378 18855 -49059
359 -49059 -34370 30208 14443 -9306 33194 16329 -71650 -44457 63554 40620 -37381 7788
371 7788 44340 -45442 -68479 47342 75248 -27055 -45588 19144 -3090 -43675 20406 62136
383 62136 -1621 -35386 -7800 -15929 -18988 40210 45576 -35390 -41788 24688 1877 -41467 35582
396C5582M4983j08043n7594R4258L8957p0018J0598O7653n4209p9364O1276O9477
408E3556m1294k2503L4443k9729n1041M7853N6190l5420j9376L1455l7073m9811
420f2750P0131O2543o8148m2388O1007o504p9668M3675J05816m6917r7606M0911
432a9898N3406n3302j0748P6069l219p9856J276M8485j2676j824M5723k3224o5537
445d5325K5474M5334l6287o854O6077j9084r6538K2588R7265k5682o3975N3488
457A6481L3493q7726k7670R4062K6900o8113m914L7497l3646k4918N7153K0353
469C8952m5792n32J8686l9280p348P0325J0084p1964O60N5839l4412m3310P0209
482B2117M2729q2884l7463P1188J2407n9185K4389O1899m6285o3383M3598M1667
$$ plain form
396 35582 80565 -27478 -85072 9186 48143 -21875 -11277 56376 2167 -77197 -15921 53556
408 53556 12262 -10241 24202 -5527 -56568 -8715 47475 12055 -7321 24134 -12939 -62750
420 -62750 7381 69924 1776 -40612 20395 13891 -65777 -22102 83714 36797 -60809 -19898
432 -19898 33508 -19794 -30542 45527 42308 -37548 -36272 12213 -463 -2287 43436 20212 -45325
445 -45325 -19851 25483 -10804 -17658 48419 29335 -67203 -44615 52650 26968 -37007 16481
457 16481 49974 -37752 -65422 28640 55540 -12573 -17487 20010 -13636 -38554 18599 38952
469 38952 -6840 -7372 11314 -27966 -35314 35011 45095 -26869 -26209 29630 -4782 -48092 22117
482 22117 64846 -18038 -55501 15687 28094 -31091 -6702 55197 8912 -54471 -10873 30794
494C0794l4109m659L2290k4555l5549L2170K4502k9083R795L6560m3851m8954
506e4649N9296M6282o1160k3994O4166m633p5611K1723P9764k6103o1890L1677
518e132K9639m3444m662N0623o400m1300J5019J8356k9887N022M5784j9860m5988
531c2230L0293K8277m4683o746O0801p182o8846J6234O1683l0760m6025M7932
543H748L1297n7428j9727N2753Q007l8014R833K4705k5465j3330L1480k490k7774
556a7405K1159J7508l7727q936M5999j10m6440J5072M3128l2771l6849M6580K6683
569C5891n2150j3274N1430j03m7219J0957M0208j8634k6759K2285R161k0840P991
582a056J2712k2159j805L2713r689m0630K0247M2267l0955l5097M1990K4830m7724
$$ plain form
494 30794 -3315 -7974 24316 -239 -35788 -3618 20884 -8199 1596 38156 -5695 -54649
506 -54649 4647 50929 -10231 -34225 29941 25308 -50303 -28580 51184 25081 -36809 -5132
518 -5132 24507 -18937 -23599 27024 20624 -20676 -5657 12699 -17188 -12166 33618 13758 -32230
531 -32230 -1937 26340 -18343 -25089 35712 28530 -40316 -24082 37601 6841 -39184 8748
543 8748 40045 -17383 -37110 15643 23650 -14364 -4531 20174 -5291 -18621 12859 10369 -17405
556 -17405 3754 21262 -16465 -25401 20598 20488 -25952 -10880 32248 -523 -37372 9208 35891
569 35891 -16259 -29533 21897 21794 -25425 -14468 25740 7106 -19653 2632 11793 -9047 -1056
582 -1056 11656 -10503 -12308 20405 10716 -29914 -9667 32600 1645 -33452 8538 33368 -14356
595a4356j3847M6461K962l8671R626K8625k4133k0749L1275J0336k7930L130J9228
608A1957j6591j1644K4977N192k4487P341J9268k6194j4281M2003J0471m6197
620a8185k427M1763j1531l8452K5369L8254l0417l3515K6506J6928k1374K529
632d552J9462j3224j6161J2687L922r485J6090J3877l1417j6916L4817Q454l1644
645a4090Q575L2815k4464l9429K7158L7892k2956k2025K4417K874l1139O324L1445
658A7397l734j7993L676j407j3232J3005K2003j4352j4830J5484l971k5096J8196
671d854L5326j9356l4387J7126J9694k5466m375M0215l71m3844j280L0274l069
684E633j1821J7743N432k7096p344J8652J671n37J5347j1454l1523J0885K9638
$$ plain form
595 -14356 -28203 18258 21220 -17451 -7825 20800 -3333 -24082 7193 17529 -10401 -7271 11957
608 11957 -4634 -16278 8699 13891 -10596 -3255 16013 -10181 -24462 17541 28012 -18185
620 -18185 -20612 21151 9620 -28832 -3463 34791 4374 -29141 -2635 14293 -7081 -4552
632 -4552 14910 1686 -14475 -1788 2134 -7351 8739 22616 -8801 -25717 9100 17554 -14090
645 -14090 -5515 27300 2836 -36593 -9435 28457 5501 -16524 7893 10767 -20372 -14048 17397
658 17397 13663 -4330 -654 -2061 -15293 -2288 19715 5363 -9467 6017 2046 -23050 -4854
671 -4854 30472 11116 -23271 -6145 13549 -11917 -16292 23923 23552 -20292 -21572 8702 5633
684 5633 -6188 11555 16987 -10109 -17453 1199 2870 2333 17680 6226 -25297 -14412 15226
697A5226j2303j4985K7548O270m6178p311N0947Q455l8267K317K3098k0632j9363
710b5178K9105K1448k1408j2218Q408r396l481K6864N116k6399j116J3677j6730
723a1308q065L7191J3870m1978j4607L3135j834k6034K5085K9950l3683l3685
735c1963K4865K1841j7868M29K1570j5647k7066J4374J7693p162M835R389k2430
748g140j7366K6894J6664k2617m05K4924k1364l5333L0625L9165k6118k8227K4424
761D126Q496l3720L686M2718k909l5732J368J3158j0015M644K2406o975k1597
774a0346P208O195j8130R438L5241j4503m1212J3163K9417j9499j3804L3328P187
787B3683m2875p422L8274J282k2922J4876J2904k8884j1361K8966R397j7486L295
$$ plain form
697 15226 2923 -12062 15486 21756 -24422 -31733 19214 27669 -10598 -8281 14817 -5815 -25178
710 -25178 3927 25375 3967 -8251 157 -9239 -12720 14144 19260 -7139 -8255 5422 -11308
723 -11308 -19373 17818 31688 -10290 -24897 8238 6404 -19630 5455 35405 1722 -31963
735 -31963 -7098 14743 -3125 -2696 18874 3227 -23839 -9465 8228 1066 5901 15290 -7140
748 -7140 -24506 2388 19052 -3565 -3970 20954 -410 -35743 -5118 34047 7929 -20298 4126
761 4126 12622 -21098 -17412 25306 22397 -13335 -11967 1191 -8824 -4180 18226 11251 -10346
774 -10346 -3138 3057 -15073 -5635 29606 15103 -26109 -12946 16471 -3028 -16832 16496 23683
787 23683 -19192 -26614 11660 12942 -9980 4896 17800 -11084 -22445 6521 15918 -1568 1727
800A727O550k1669l874K9695O09k2170J1754J2219l0998j0123M2994J2648m1294
813a1932o818L3785j0745l0300K5760L0566k6209k4581J9195R100j6108P822J8479
826A8014j5995j7451J4122L352j1807J4834J4351k5490j6259K7108R553k6747
838a2415N798L2410j8568l7426K1753L2560j9713j9129K1266N166k6799J782K6786
851A3471n179j6231J1301J368j9426Q214K3324j1253j7868J4729O640k3009L321
864a0598L1138r472k9951J5460K0712k3657j2227L1983P915l4921n199K9224l033
877G374k0098J2755J3083j7459o110J4484j341q334J2235M331k1255l58K3489
890A2796p258k0934J7575J6225k6155j3125K9766Q992k9439j224K8280p891k5471
$$ plain form
800 1727 8277 -13392 -17266 12429 13038 -9132 2622 14841 -16157 -26280 16714 29362 -11932
813 -11932 -18750 15035 4290 -26010 -250 30316 4107 -20474 -1279 7821 -8287 -465 18014
826 18014 2019 -15432 -1310 2042 -9765 5069 19420 -6070 -22329 4779 14332 -12415
838 -12415 -6617 25793 7225 -30201 -8448 24112 4399 -14730 6536 11702 -15097 -13315 13471
851 13471 8292 -7939 3362 4730 -14696 -6482 16842 5589 -12279 2450 9090 -13919 -10598
864 -10598 20540 11068 -18883 -3423 17289 -6368 -18595 13388 21303 -13618 -18817 10407 7374
877 7374 -12724 31 13114 -4345 -10455 4029 2688 -5646 6589 10920 -10335 -10693 12796
890 12796 5538 -15396 2179 18404 -7751 -20876 8890 17882 -11557 -12781 15499 7608 -17863
903a7863J3537J9755j3996j1116J2357J217j0191P257P224j2769j553J6614o800
916C673j8094J3976J5960j8706j1662K0864N318k2606J087K3755q261k0046J4973
929B31J4856j9043r200J9664N001j7634n83J3387n223q170Q530J145p918O835
943A878N206j4700k473K0424J198k2697K477K2432r341k0825J5089J8630j6505
956G93j4072J4750O988j3276P1J3319n362j0996O196L571o010N433N967j0448
970c076n720J1964J781j2681O672J6075j2940j8959J5048J5569j4370p849J4925
983F439J326j8295L33J7679n16j0272L409J714p826K931Q854k636m042L858l713
998g57q885Q133J3846r349j1609J0484M074j5142J451K0266o75k1340j146J5393
$$ plain form
903 -17863 -4326 15429 1433 -9683 2674 3891 -6300 957 8181 -4588 -6141 10473 3673
916 3673 -14421 -445 15515 -3191 -14853 6011 11329 -11277 -10190 13565 5304 -14742 231
929 231 15087 -3956 -13156 6508 11509 -6125 -6708 6679 1456 -6714 1816 2961 -4957 1878
943 1878 7084 -7616 -10089 10335 11533 -11164 -8687 13745 4404 -16421 -1332 17298 793
956 793 -13279 1471 8459 -4817 -4746 8573 3211 -7785 -1589 1982 -4028 1405 7372 -3076
970 -3076 -8796 3168 4949 -7732 -1060 15015 2075 -16884 -1836 13733 -637 -8486 6439
983 6439 7765 -10530 -10197 7482 6966 -3306 103 1817 -6009 -3078 5776 3140 -902 2956 -757
998 -757 -9642 -1509 12337 2988 -8621 1863 5937 -9205 -7754 12512 11837 -9503 -10649 4744
1012D744k423r066Q868P304j0072p438L815N113L691K946n756q545L857P304o845
1027b503j430J3793j388k0137q71J8830K259j2474K794R388j0986r848J3309J0464
1041A1200q053n666K158k741k211O871N197m296k461m78o980J326J4583O03j3947
1056d895q8Q849o870p643J4838J1553j6446j2871J2806P134r268K246J0156n492
1070D009j2570J597Q487J595R31J36q689l760R028J110n383Q628O461j5666j1747
1085a5833J5667J3316j2595o727J2986k348j6720M847J7529j673j1728P0K951
1098b58m146K639P956l258n409K555k860n613J0072J0671j0397j1316Q856N491
1112D983j1098K144J7383m982k0369L184J4548m198o908R982M126j4631n090J1801
$$ plain form
1012 4744 2321 -6745 2123 9427 -645 -8083 -4268 845 4536 7482 1726 -6819 -2962 4342 -2503
1027 -2503 -3933 9860 8472 -11665 -12536 6294 8553 -3921 -1127 8261 -2725 -12573 736 11200
1041 11200 3147 -2519 -361 -3102 -5313 1558 6755 2459 -2 -480 -7460 -6134 8449 9052 -4895
1056 -4895 -4983 3866 -3004 -10647 4191 15744 -702 -13573 -767 6367 -2901 -655 9501 4009
1070 4009 -8561 -6964 1523 3118 4049 4185 -4504 -8264 764 1874 -3509 5119 11580 -4086 -15833
1085 -15833 -166 13150 555 -6172 6814 4466 -12254 -7407 10122 8449 -3279 -3209 -258
1098 -258 -4404 -1765 6191 2933 -2476 79 -2781 -8394 1678 12349 1952 -9364 -508 4983
1112 4983 -6115 -3971 13412 8430 -11939 -8755 5793 1595 -5313 4669 8795 -5836 -10926 875
1126H75L693l702L177j367q773J786Q386l011l359Q646q48j6649J459K0525k573
1141H265j7143O364J1954j2353j0568J6807J0952j5653q674J1332J062p540O245
1154A050O742p514m196M101k726j576J1055L011j6021l380J5107k878j2997J0864
1168F42J3472j5129j3701J4969R917j3462k300J4727m435j5259O996J1926o934
1181A429n387O821j123q484M962Q342o846l112Q501m792j0975J0643J2095j2787
1195g13j0049J4760M559j7899M77K1549l637j9868N436J4081p830q321J0268M476
1209G289j0714j920P302k997j936Q323k436j0895O468J0088r646p358J4267M505
1223A0340j8122k181J9285k127j7017P011J2673j0435j0219J2553P049j2190k065
$$ plain form
1126 875 4568 866 4043 2676 -6097 -4311 4075 1064 -2295 6351 5503 -11146 -9687 10838 8265
1141 8265 -8878 -2514 9440 -2913 -13481 3326 14278 -1375 -10049 1283 2345 -5195 1050
1154 1050 7792 278 -3918 183 -2543 -4119 6936 9947 -6074 -9454 5653 2775 -10222 642
1168 642 14114 -1015 -14716 253 10170 -3292 -5592 9135 4700 -10559 -3563 8363 1429
1181 1429 -3958 2863 1740 -6744 -1782 6560 -286 -3398 5103 311 -10664 -21 12074 -713
1195 -713 -10762 3998 8557 -9342 -8865 12684 9047 -10821 -5385 8696 866 -7455 2813 7289
1209 7289 -3425 -5345 1957 -1040 -2976 5347 2911 -7984 -1516 8572 -1074 -8432 5835 10340
1223 10340 -7782 -9963 9322 7195 -9822 -2811 9862 -573 -10792 1761 8810 -3380 -5445
1236e445J0584l578q027P501L984q269J235P234o132o127J0737M371j3942l85
1250f259J5789n247j5647R715J3370j2548j0770J4005P040j4960k527J4672j458
1263E175j1368N073O715o552j876O559k416n430O401K427j0821J251J3357n275
1277C220j3602R381J1777j2890r120J5167P040j6027l622J4588p89j1964M987
1290a854Q741o516m896N793O81m864M051M045q166k006R150k255r089P572Q317
1305H704j1075p021J2624M666j2795N7J3894m731j4372P246J1884p455p987P244
1319H83L542p930r33P409q17l028K629l003m247P173N200r064l426J0337m5j2918
1335h238L302J5488n006j4585O116J0165p496o343R511M120r823l218P029K86
$$ plain form
1236 -5445 5139 1561 -6466 1035 5019 -3250 -2015 5219 -913 -7040 3697 8068 -5874 -6259
1250 -6259 9530 4283 -11364 -1649 11721 -827 -11597 2408 9448 -5512 -8039 6633 5175
1263 5175 -6193 -1120 5595 -957 -2833 3726 1310 -4120 2281 4708 -6113 -4862 8495 3220
1277 3220 -10382 -1001 10776 -2114 -11234 3933 10973 -5054 -8676 5912 5123 -6841 -1854
1290 -1854 6887 371 -4525 1268 1949 -2915 1136 5181 -2985 -4991 4159 1904 -7185 387 8704
1305 8704 -2371 -9392 3232 7898 -4897 -4840 9054 4323 -10049 -2803 9081 1626 -6361 883
1319 883 4425 -3505 -4438 2971 2154 -874 1755 -1248 -5495 1678 6878 -2186 -5612 4725 4680 -8238
1335 -8238 -4936 10552 5546 -9039 -2923 7242 -254 -6597 2914 7034 -2789 -6007 1022 1308
1349A308k573L499n15n120K093L714l696k97P424j624j0986K090J1125l932q420
1364e910P101N258r957m865J0294M605p847j986N968k210m872M269L973k565j553
1379b97k14k499J609N257j019o046K653M548o764m024J1080M128j1625m512R715
1394A990K361q649J282R364k900r103K150O257k59j488j48j531m03J109q38q25
1410a631M468K025q414l734R465K854p730q3P685k431r387L781R556k927p126
1425c629K875K668l922j87M361N12k773p44p40p61L533K478m557j789M625j983
1441c3n393N518P155n690q081N631O266o544l201Q143J695q421k454N935K035
1456B561k199q70K43r21J004K22k529K938N119n316p037O059O910n907n172O868
$$ plain form
1349 1308 -1265 2234 1719 -3401 -1308 2406 -1290 -1587 5837 4213 -6773 -4683 6442 2510 -5910
1364 -5910 1191 6449 -3508 -8373 1921 6526 -1321 -3307 2661 451 -4421 -152 3821 1256 -297
1379 -297 -511 -3010 -1401 3856 2837 -3209 -556 3992 -2772 -6796 4284 8412 -3213 -7725 1990
1394 1990 4351 -4298 -3016 6348 3448 -5655 -3505 2752 2493 1005 857 -674 -1077 32 -806 -1631
1410 -1631 2837 4862 -3552 -7286 2179 5033 -2697 -2780 4905 2474 -6913 -3132 6424 3497 -3629
1425 -3629 -754 1914 -2008 -2195 2166 2678 -95 -839 -1579 -2340 1193 3671 -886 -2675 1950 -33
1441 -33 -5426 92 7247 1557 -6524 -893 5373 -1171 -4372 3771 5466 -2955 -5409 526 2561
1456 2561 362 -508 -265 -1186 -182 40 -2489 449 5568 252 -6785 -726 6184 277 -4895 1973
1472A973L574r444k392R899J964q003m05N012j712l234K604K625k299p65L65k145
1488b383J408M800k258m524L501L128n894k097Q317J454r525o67Q711k005p598
1503e632M731O767n428o210M897M858l919j787L234q47j979J640l49j219L234
1518A991J192o141j423P609J079q800J425R357m157r465N343Q636n540o548N768
1533C26M277o415j662O357j31m040J317O57k223J523K590l260k367M862N57p105
1549d737J765Q412l437q030N355O542o645m682P840L586q811j970Q361o82o552
1564c685K699M512l617k605L109M22j949J914J030m398P31N588l244n449O194
1579A252M804q116m300R548L227r762j554R973j076r381K449P156k900m775K946
$$ plain form
1472 1973 5547 -3897 -6289 3610 5574 -2429 -2834 2178 466 -2768 -164 2461 162 -603 -238 -2383
1488 -2383 -975 3825 1567 -2957 544 3672 -2222 -4319 3998 5452 -4073 -4740 3971 1966 -5632
1503 -5632 -901 5866 438 -5772 -875 3983 64 -1723 1511 664 -1315 325 -24 -1243 1991
1518 1991 3183 -2958 -4381 3228 4307 -4493 -3068 6289 2132 -7333 -1990 6646 1106 -5442 326
1533 326 4603 -1812 -3474 2883 2752 -1288 29 686 -1537 -14 2576 -684 -3051 1811 2368 -4737
1549 -4737 -2972 5440 2003 -6027 -672 5870 -775 -5457 2383 5969 -2842 -4812 3549 2867 -3685
1564 -3685 -986 3526 -91 -2696 413 835 -1114 800 1830 -2568 -1837 3751 507 -4942 1252
1579 1252 6056 -2060 -6360 3188 6415 -3347 -4901 5072 3996 -5385 -2936 4220 1320 -3455 -509
1594e09K231l111M29K561k290n29M328k484m962M708M957o096m275P195K462q876
1610d261k17R569j593q956L420O953m616n033N849L344o128j684N066n63l047
1625a897K807Q60l281J071K663k574k345N269Q19p497M97Q133k565p725M615P063
1641E913o164o129O721N542o634l354O185R75n288N87L415j082j390J062j133
1656g74j374L340J351m953j22O163k349o129M200O324n325n919N768M746o660
1671a713k608P602N74o799L02N001q22l367J567J658k372j01J776j452m06L379
1687B219j350m462L085M371l692l702N335K504o905j374P599k23p237J538N864
1702C570k775m785L292M433l368l142K711J023j132P96m82j306J965J087l576
$$ plain form
1594 -509 1722 -1389 -960 1601 -689 -1218 3110 626 -4336 372 5329 -767 -5042 2153 4615 -4261
1610 -4261 -4478 5091 3498 -5458 -2038 4915 299 -4734 1115 4459 -1669 -3353 1713 1150 -1897
1625 -1897 910 1770 -1511 -440 2223 -351 -2696 2573 3392 -4105 -3608 4525 1960 -5765 -1150 5913
1641 5913 -251 -6380 341 5883 -751 -4105 2080 3055 -2233 -1646 1769 687 -703 359 -774
1656 -774 -2148 1192 2543 -2410 -2532 3631 1282 -4847 -647 5677 352 -5567 201 4947 -1713
1671 -1713 -4321 3281 3855 -2944 -2642 2359 1537 -1830 -263 1395 -977 -1078 698 -754 -1160 2219
1687 2219 869 -3593 -508 3863 171 -3531 1804 4308 -2597 -3971 3628 3405 -3832 -2294 3570
1702 3570 795 -3990 -698 3735 367 -2775 -64 959 -173 623 141 -1165 800 1887 -1689
1717a689j094N541J321p118q47P464m60p019J464O254k445n554K580M501k217
1732F82k784K434R38k083L99J144l33n6O01j682o78K365O62l374K31M113j891
1749F88m421K950M705l478m143L711L666m026k990M717J597m093j150L010P87
1764A530j341p09M15L31K76n55j464J471K592k743l427L441L195l462k796M201
1780I55K853m787k437M841J712m341p96L079L24k453m01J862J24n87n98l56J327
1797C21J560k313j526K843R57l105o66L671O05m268l86M274l81l620J220K935
1813B121j188k843R28K151n24j510M23P05K57p34j069P81K568j241k783J446L101
1830B589j622l617K029L709k797l550K975K866k747k344J849K509j461j718J038
$$ plain form
1717 -1689 -2783 2758 4079 -3039 -3886 3578 3118 -3901 -2437 3817 1372 -4182 -1602 2899 682
1732 682 -2102 332 1270 -813 -414 730 397 341 942 -740 -1418 947 1609 -1765 -1534 2579 688
1749 688 -3733 -783 3922 444 -3699 12 3678 -348 -3338 1379 2976 -1117 -2267 743 1530
1764 1530 189 -520 -105 226 502 -53 -1517 -46 2546 -197 -3624 -183 3012 -450 -3246 955
1780 955 3808 -979 -3416 1425 3137 -1204 -2000 1079 1403 -1050 -1451 411 535 -52 -650 -1006 321
1797 321 1881 -432 -1958 885 1842 -1263 -1929 1742 2347 -1921 -2307 1967 1586 -2034 -814 2121
1813 2121 933 -1910 -982 1169 645 -865 -442 263 520 -214 -1283 -502 2066 825 -1958 -512 2589
1830 2589 967 -2650 -621 3088 291 -3259 -284 2582 -165 -2509 -660 1849 388 -1330 -292
1845b92J463k85j380r70J592J948j805k345K179K242k374k600K701K884l412k183
1861b637L080J690l172j216K943P26k124o29K050Kj021J60J75L98O03j340r23
1878a235J787J002k650j135L342Q29l917m23M480k7m270N03M342j014l827J346
1894h67L102j461k157J119O93k36p6n87k36J568J96k491m05L628M26m755L6N189
1912B686j058m732J956M222k024l982K472L321k691j844K158M39j519J9O24l32
1928b85K98M96j216q72K581O72l131K96L773j571l978K690L549l035l364L616
1944E19K498m577j037M548L41m130L68K514n48j485Q88P62r79K86L47j577J071
1961a91K708k179l281K973L141l795k812M690K208n423j590N392P78m880L39L665
$$ plain form
1845 -292 1171 886 -494 -1464 128 2076 271 -2074 105 2347 -27 -2627 74 2958 -454 -2637
1861 -2637 443 2133 -1039 -2255 688 1414 -710 -1339 711 713 -308 -148 27 425 1028 -312 -1235
1878 -1235 552 1554 -1096 -2231 1111 1940 -1977 -2400 2080 2053 -2217 -1714 2628 1614 -2213 -867
1894 -867 2235 774 -1383 -264 429 193 117 -470 -706 862 1058 -1433 -1838 1790 2216 -2539 -2503 2686
1912 2686 1628 -3104 -1148 3074 1050 -2932 -460 2861 170 -1674 484 923 -596 -577 47 -285
1928 -285 13 509 -707 -1579 1002 1674 -1457 -1161 2612 1041 -2937 -247 3302 267 -3097 519
1944 519 3017 -1560 -2597 1951 2292 -1838 -1470 1044 496 -989 -101 661 -318 -32 315 -1262 -191
1961 -191 2517 338 -2943 30 3171 -624 -3436 1254 3462 -1961 -3551 1841 2619 -2261 -1922 1743
1977A743q63k951J661K190j574p73J264j164j57K086q84k319J654K097k798k014
1993b802M103J791m935r53M908k96m741J567M233k046l792K589K811k685j190
2008a438K668k67k099R97Q44r34K67R68j737j261K617J319l636k04M706j609m701
2025c500K607M621k575m418L088L450l553k473L733J041l123l59J636j6l85P40
2041E14o18j271J625J057k529j01L677r82m111J555L921k196k973K839K685m142
2057a050j644M136Q30l739M1K547o41k293J387J608j432l90J210r01p1J812n74
2074H36k243J408K067k334k062L121K247m489j689M622Q85m206K62L740q12l817
2090b464R95L253p53k023Q41L25l86J83L4l89R93O45j919j160K283J827l281j143
$$ plain form
1977 1743 880 -2071 -410 1780 206 -567 697 -467 -624 1462 578 -1741 -87 2010 -788 -2802
1993 -2802 1301 3092 -1843 -2796 2112 1816 -2925 -1358 2875 829 -2963 -374 2437 -248 -1438
2008 -1438 1230 963 -1136 -139 705 -229 38 1006 -731 -1992 625 1944 -1692 -1896 2810 1201 -3500
2025 -3500 -893 3728 1153 -3265 -177 3273 -280 -2753 980 2021 -1102 -1461 175 159 -226 514
2041 514 -104 -1375 250 1307 -1222 -1323 2354 1372 -2739 -1184 2737 541 -2432 407 3092 -1050
2057 -1050 -2694 1442 2272 -1467 -1426 1121 480 -1813 -426 1182 -250 -640 570 -331 -402 1410 836
2074 836 -1407 1 2068 -266 -2328 793 3040 -1449 -3138 1484 2369 -1837 -1575 2165 1353 -2464
2090 -2464 -1469 1784 1031 -992 -151 174 -212 -29 5 -384 609 1254 -665 -1825 458 2285 -996 -2139
2108b139L417K5l607N38L787m74l415P99K647j047j692J803J005j754p89Q09Q5
2125bQ3N87p80r42P82R86j376j24K440p20k891P93L011r51k672J715K361k568
2143b68k414L007K141k125j746J173J212j176o68J068M94m31r38o99J240J703
2159A573j072j886J167J625j574j358J869K117k316k308K045J504j605r47J525
2174C59N98j573p25J473Q86p20n75k65N84K37m51m5P74K59j515o33J564J361j649
2193e6q24J467L58j985l32K287M85k212p92J827O82j580J06J342L01j333o80J197
2211B58J023q21j240L74R14l36j334O03J692o58j967K46K467j83k073J00J902
$$ plain form
2108 -2139 1278 1303 -2304 -1766 2021 1547 -1868 -1069 1578 531 -1161 642 1647 -107 -896 -87 -2
2125 -2 81 668 -112 -1054 -272 714 -662 -786 1654 934 -1957 -1164 1847 896 -1776 -61 2300 -268
2143 -268 -2682 325 2466 341 -1405 -232 980 -196 -864 204 698 267 -671 -1370 -130 1573
2159 1573 501 -1385 -218 1407 -167 -1525 344 2461 145 -2163 -118 1386 -219 -1166 359
2174 359 957 -616 -1341 132 1018 298 -277 -542 42 279 -172 -217 557 816 -699 -1332 232 1593 -56
2193 -56 -880 587 945 -1040 -1372 915 1400 -812 -1604 223 905 -675 -569 773 1074 -259 -939 258
2211 258 1281 460 -780 -406 508 172 -1162 -559 1133 475 -1492 -1246 1221 1038 -1035 -935 967
$$ [...]
8191d4
##END NTUPLES=NMR FID
##END=
