##TITLE=1H_B3f0606
 CDCl3
 8 sc, 
 7.6.2024
##JCAMPDX= 6.0         $$ Bruker NMR JCAMP-DX V2.0
##DATA TYPE= NMR FID
##DATA CLASS= NTUPLES
##ORIGIN= UXNMR, Bruker Analytische Messtechnik GmbH
##OWNER= root
$$ XWIN-NMR		Version 3.5
$$ Fri Jun  7 15:55:38 2024 Russian Standard Time (UT+4h)  she@DPX200
##.OBSERVE FREQUENCY= 200.1309
##.OBSERVE NUCLEUS= ^1H
##.DELAY= (6, 6)
##.ACQUISITION MODE= SIMULTANEOUS
##.ACQUISITION SCHEME= undefined
##.AVERAGES= 8
##.DIGITISER RES= 18
##SPECTROMETER/DATA SYSTEM= spect
##.PULSE SEQUENCE= zg30
##.SOLVENT NAME= CDCl3
##.SHIFT REFERENCE= (INTERNAL, CDCl3, 0, 15.7039)
##AUDIT TRAIL= $$ (NUMBER, WHEN, WHO, WHERE, WHAT)
$$ ##TITLE= Audit trail, XWIN-NMR		Version 3.5
$$ ##JCAMPDX= 5.01
$$ ##ORIGIN= Bruker BioSpin GmbH
$$ ##OWNER= she
$$ F:/spectra/data/she/nmr/H-F/1/audita.txt
$$ ##AUDIT TRAIL=  $$ (NUMBER, WHEN, WHO, WHERE, WHAT)
(   1,<2024-06-07 15:54:17.71 +0400>,<she>,<DPX200>,
      <created by zg, POWCHK disabled, PULCHK disabled
       configuration hash MD5:
       00 E9 B6 7A A2 85 ED C7 34 08 36 98 17 FE 4E 26
       data hash MD5: 16K
       95 06 75 74 CD BC 00 FA C8 D9 19 3A 51 74 CC 29>)
$$ ##END=
$$ 
$$ hash MD5
$$ B0 06 2B A4 03 18 7C 9C BC 40 FC 33 56 F9 AC EF
##$RELAX= 
##$RELAX= 
##$RELAX= 
##$RELAX= 
##$RELAX= 
##$RELAX= 
$$ Bruker specific parameters
$$ --------------------------
##$DU= <F:/spectra>
##$EXPNO= 1
##$NAME= <H-F>
##$PROCNO= 1
##$TYPE= <nmr>
##$USER= <she>
##$AMP= (0..31)
100 100 100 100 100 100 100 100 100 100 100 100 100 100 100 100 100 100 
100 100 100 100 100 100 100 100 100 100 100 100 100 100 
##$AQSEQ= 0
##$AQ_mod= 1
##$AUNM= <au_zg>
##$AUTOPOS= <>
##$BF1= 200.13
##$BF2= 200.13
##$BF3= 200.13
##$BF4= 200.13
##$BF5= 200.13
##$BF6= 200.13
##$BF7= 200.13
##$BF8= 200.13
##$BYTORDA= 1
##$CFDGTYP= 0
##$CFRGTYP= 5
##$CHEMSTR= <none>
##$CNST= (0..31)
1 1 145 1 1 1 1 1 1 1 1 1 1 1 1 1 1 1 1 1 1 1 1 1 1 1 1 1 1 1 1 1 
##$CPDPRG= <>
##$CPDPRG1= <>
##$CPDPRG2= <>
##$CPDPRG3= <>
##$CPDPRG4= <mlev>
##$CPDPRG5= <mlev>
##$CPDPRG6= <mlev>
##$CPDPRG7= <mlev>
##$CPDPRG8= <mlev>
##$CPDPRGB= <>
##$CPDPRGT= <>
##$D= (0..31)
0 1.2 0 0 0 0 0 0 0 0.06 0 0.03 0 0 0 0 0.0002 0 0 0 0 0 0 0 0 0 0 0 0 
0 0 0 
##$DATE= 1717761257
##$DBL= (0..7)
120 120 120 120 120 120 120 120 
##$DBP= (0..7)
150 150 150 150 150 150 150 150 
##$DBP07= 0
##$DBPNAM0= <>
##$DBPNAM1= <>
##$DBPNAM2= <>
##$DBPNAM3= <>
##$DBPNAM4= <>
##$DBPNAM5= <>
##$DBPNAM6= <>
##$DBPNAM7= <>
##$DBPOAL= (0..7)
0.5 0.5 0.5 0.5 0.5 0.5 0.5 0.5 
##$DBPOFFS= (0..7)
0 0 0 0 0 0 0 0 
##$DE= 6
##$DECBNUC= <off>
##$DECIM= 32
##$DECNUC= <off>
##$DECSTAT= 4
##$DIGMOD= 1
##$DIGTYP= 9
##$DL= (0..7)
0 120 120 120 120 120 120 120 
##$DP= (0..7)
150 150 150 150 150 150 150 150 
##$DP07= 0
##$DPNAME0= <>
##$DPNAME1= <>
##$DPNAME2= <>
##$DPNAME3= <>
##$DPNAME4= <>
##$DPNAME5= <>
##$DPNAME6= <>
##$DPNAME7= <>
##$DPOAL= (0..7)
0.5 0.5 0.5 0.5 0.5 0.5 0.5 0.5 
##$DPOFFS= (0..7)
0 0 0 0 0 0 0 0 
##$DQDMODE= 0
##$DR= 18
##$DS= 0
##$DSLIST= <SSSSSSSSSSSSSSS>
$$ [...]
##$SUBNAM2= <"">
##$SUBNAM3= <"">
##$SUBNAM4= <"">
##$SUBNAM5= <"">
##$SUBNAM6= <"">
##$SUBNAM7= <"">
##$SUBNAM8= <"">
##$SUBNAM9= <"">
##$SW= 18.0517689322627
##$SWIBOX= (0..15)
0 0 2 0 0 0 0 0 0 0 0 0 0 0 0 0 
##$SW_h= 3612.71676300578
##$TD= 16384
##$TD0= 1
##$TE= 0
##$TE2= 300
##$TE3= 300
##$TEG= 300
##$TL= (0..7)
0 120 120 120 120 120 120 120 
##$TP= (0..7)
150 150 150 150 150 150 150 150 
##$TP07= 0
##$TPNAME0= <>
##$TPNAME1= <>
##$TPNAME2= <>
##$TPNAME3= <>
##$TPNAME4= <>
##$TPNAME5= <>
##$TPNAME6= <>
##$TPNAME7= <>
##$TPOAL= (0..7)
0.5 0.5 0.5 0.5 0.5 0.5 0.5 0.5 
##$TPOFFS= (0..7)
0 0 0 0 0 0 0 0 
##$TUNHIN= 0
##$TUNHOUT= 0
##$TUNXOUT= 0
##$USERA1= <user>
##$USERA2= <user>
##$USERA3= <user>
##$USERA4= <user>
##$USERA5= <user>
##$V9= 5
##$VALIST= <valist>
##$VCLIST= <CCCCCCCCCCCCCCC>
##$VD= 0
##$VDLIST= <DDDDDDDDDDDDDDD>
##$VPLIST= <PPPPPPPPPPPPPPP>
##$VTLIST= <TTTTTTTTTTTTTTT>
##$WBST= 1024
##$WBSW= 4
##$XGAIN= (0..3)
0 0 0 0 
##$XL= 0
##$YL= 0
##$YMAX_a= 145671
##$YMIN_a= -207937
##$ZGOPTNS= <>
##$ZL1= 120
##$ZL2= 120
##$ZL3= 120
##$ZL4= 120
##$ABSF1= 10
##$ABSF2= 0
##$ABSG= 5
##$ABSL= 3
##$ALPHA= 0
##$AQORDER= 0
##$ASSFAC= 0
##$ASSFACI= 0
##$ASSFACX= 0
##$ASSWID= 0
##$AUNMP= <proc_1d>
##$AZFE= 0.1
##$AZFW= 0.1
##$BCFW= 1
##$BC_mod= 2
##$BYTORDP= 1
##$COROFFS= 0
##$CY= 11.3945322036743
##$DATMOD= 1
##$DC= 2
##$DFILT= <>
##$DTYPP= 0
##$F1P= 15.6554695791079
##$F2P= 12.8336369535428
##$FCOR= 0.5
##$FTSIZE= 0
##$FT_mod= 4
##$GAMMA= 1
##$GB= 0.15
##$INTBC= 1
##$INTSCL= 1
##$ISEN= 128
##$LB= 0.24
##$LEV0= 0
##$LPBIN= 0
##$MAXI= 10000
##$MC2= 0
##$MEAN= 0
##$ME_mod= 0
##$MI= 1.114404
##$NCOEF= 0
##$NC_proc= 0
##$NLEV= 6
##$NOISF1= 3.799351
##$NOISF2= 2.8
##$NSP= 1
##$NTH_PI= 0
##$NZP= 0
##$OFFSET= 15.70392
##$PC= 1
##$PHC0= -25311.62
##$PHC1= 9.387481
##$PH_mod= 1
##$PKNL= yes
##$PPARMOD= 0
##$PSCAL= 0
##$PSIGN= 0
##$REVERSE= no
##$SF= 200.130013532006
##$SI= 16384
##$SIGF1= 3
##$SIGF2= 2
##$SINO= 400
##$SIOLD= 16384
##$SREGLST= <1H.CDCl3>
##$SSB= 0
##$STSI= 0
##$STSR= 0
##$SW_p= 3612.71676300578
##$SYMM= 0
##$S_DEV= 0
##$TDeff= 0
##$TDoff= 0
##$TI= <>
##$TILT= no
##$TM1= 0
##$TM2= 0
##$TOPLEV= 0
##$USERP1= <user>
##$USERP2= <user>
##$USERP3= <user>
##$USERP4= <user>
##$USERP5= <user>
##$WDW= 1
##$XDIM= 8192
##$YMAX_p= 0
##$YMIN_p= 0
$$ End of Bruker specific parameters
$$ ---------------------------------
##NTUPLES= NMR FID
##VAR_NAME=  TIME,          FID/REAL,        FID/IMAG
##SYMBOL=    X,             R,               I
##VAR_TYPE=  INDEPENDENT,   DEPENDENT,       DEPENDENT
##VAR_FORM=  AFFN,          ASDF,            ASDF
##VAR_DIM=   8192,          8192,            8192
##UNITS=     SECONDS,       ARBITRARY UNITS, ARBITRARY UNITS
##FACTOR=    0.0002768,     1,               1
##FIRST=     0,             0,               0
##LAST=      2.2672688,     0,               0
##MIN=       0,             -207937,         0
##MAX=       2.2672688,     145671,          0
$$ Real data points
##PAGE= N=1
##DATA TABLE= (X++(R..R)), XYDATA
0@%%%%%%%%%%%%%%%mJ2j6J6j6J6k4L2l2L6m4M8n6O6p4Q4r5J08j22J38j55J74j92
38a00K15k40K65k96L26l60L97m36M80n28N83o41P06p79Q58r49J051j167J302j457
58g70J640j860K130k469K907l496M329n586P674j1695K1863q8113j34491L13161
72A05224p2591j26565K21069r8342j78462J96364P035j22985J30259j3742j48663
83a01399R6962O6275p6047J9456K3010n8756m719N7980P629m1566K7700L602q2801
96f2674M9337Q4432q4784o25P0785j06027r733J34268n9939m4665P5754q2863
108c6734j4013J21766o8185l6667Q4415p9998k6980J15503l5614m7948M3709m8809
120b9555m530Q2035l4664l1679L2776l0287Q29K5930j6117K9778j2152n8585M6600
$$ y = [0, 0, 0, 0, 0, 0, 0, 0, 0, 0, 0, 0, 0, 0, 0, 0, -4, 8, -8, 8, -8, 8, -16, 16, -16, 20, -24, 24, -32, 34, -40, 44, -51, 57, -65, 73, -82, 92, -100, 115, -125, 140, -156, 170, -190, 207, -229, 251, -277, 306, -335, 371, -408, 450, -499, 552, -615, 687, -770, 870, -990, 1140, -1329, 1578, -1918, 2411, -3175, 4499, -7196, 14667, -73446, -207937, 105224, 32633, -93932, 127137, 28795, -149667, 46697, 53732, -69253, 61006, 47264, -101399, -4437, 61838, -14209, 5247, 28257, -30499, -35218, 22762, 30391, -11175, 16525, 20127, -62674, -13337, 71095, -13689, -14314, 56471, -49556, -59289, 74979, 15040, -29625, 46129, -36734, -50747, 71019, 2834, -33833, 50582, -29416, -56396, 59107, 23493, -24455, 19254, -29555, -34085, 47950, 13286, -18393, 14383, -15904, -15075, 10855, -5262, 24516, 12364, -46221, 379]
133C79K4559m3739L0483P342n0195K5199J8255k5191K8911m281m0230K5578O850
146C920j0415K7238j9509k2528J8524n991J3344J8822l2126m658J3596j3148K2879
159I948N958l6597K5761O428m6948M7658K3948o8894K5358K9736m5923L1531J4574
172B2538n1979L5959J7911n8892L3284L5740n3200J2942K5248m3447K2943L1061
184C0108m4164M830K7418k6259m511K6545j307k1251N82J7779q372j0168K2469
197A3699p169k6845K6256R665k9032K3293J066l9454M0409J2363n4306L5695K4044
210B9684n6859K3243L1653m8074J5241L3722m8045P738M2961m2456r708M4394
222B3494j8242k2239J9521K576o633M258k391q189P599J0232j4414n390K0576
$$ y = [379, 24938, -18801, 11682, 19024, -31171, -5972, 12283, -12908, 16003, 11722, -28508, -2930, 3920, -6495, 20743, 1234, -21294, -2770, -8761, 4583, 23405, -8721, -13379, 217, -12931, 9948, 15906, -20691, 5070, 11498, -35450, 12208, 36156, -32738, -7380, 22356, -23567, 7964, 22538, -29441, 6518, 24429, -34463, -1179, 34561, -18639, -5697, 19551, -23896, -953, 30108, -14056, -9226, 18192, -8067, -12578, 13967, 12660, -8591, -8009, 9770, 1398, -8770, 13699, 6530, -20315, 5941, 15606, -13426, 9867, 10933, -28521, 11888, 24251, -30055, 5640, 29684, -27175, -3932, 27721, -20353, -5112, 28610, -19435, -11697, 31264, -11192, -20900, 23494, 5252, -16987, 2534, 5110, -1523, 2735, 344, -7845, -246, 9986, -4428, -9818, 10758]
235A0758r621j8438K6460L211l2334K2236J2948l6706K2958J9514m3219J7005
247e228K7314l9067R063K9815l4864k273L4644k1065j2591K2696j1374k598J7028
260A1500j8422m232K3074q775j6089J3788R774j6299m274J9031m241j4664J0975
273A146J917j0488J4671J270k5701J6086K1542l0823k43K7072j9328m921J8506
286A0706j3742k463J5153j3020k628J8983j2063j3118K0241j609j5839J2665M952
299H218j2998J890J0278m605q257P231J273o448R834j867j5940J3117J1476j8638
313e436k310J6871p861o605J0646p347l49J1487j5123r95K1903j4123j7757K1672
327D673P243k0239N188J0771j3494M056J0091j5839O96J7005j0001j0190J5894
$$ y = [10758, 1137, -17301, 9159, 12370, -19964, 2272, 15220, -21486, 1472, 20986, -22233, -5228, 22086, -16981, -7918, 21897, -12967, -15240, 19404, -1661, -14252, 8444, -2930, -5528, 11500, -6922, -11154, 11920, 3145, -12944, 844, 10618, -5681, -9955, 9076, 4835, -9829, 1146, 3063, -7425, 7246, 8516, -17185, -1099, 20443, -10380, -10623, 16449, -2879, -7800, 10706, -3036, -5499, 9654, -3366, -5994, 12989, 926, -12192, 8049, 6440, -9399, 3266, 8218, -4780, -2890, 7388, 2783, -5474, 1757, 3030, -3418, 6416, 4549, -11391, 1726, 13202, -5436, -7746, 9125, 1264, -5341, 5305, -2042, -2391, 9096, -6027, -7022, 14881, 758, -16999, 4673, 11916, -8323, -3135, 7636, -5858, -1802, 8289, -7550, -6854, 10151, 150, -10040, 5854]
340E854j64j7378J0631R014j4384N027O652j1998N379P973j2713J631J2421j2625
354d680l364J9880j1351j7485K2419N480k0699O957R290j2034M211Q833j5743
367h286K821J8314j6077p065K0848q822j2866J4974J63q137R238m542j0462J7506
381G607P56k2564J3297J4726j9093K8J4301r824o649J3289j393j0814R486K150
395E303j2276Q435O952j3144J655J0583r196k578J3471r597q950J6399l295q996
409e234J2083p451q717J9017l506j9558J5268J1137j9131N71J2534q421j593O717
423C716m795M60L689m519j857N542K148q986l18J0121k498n446L366l044k060
438d481R199k634q080R663k018j3004J5179M973j8073P443P954j2604L674R645
$$ y = [5854, 5690, -11688, -1057, 7957, -6427, -1400, 5252, -6746, -1367, 6606, -6107, -4476, 7945, -4680, -8044, 11836, 485, -17000, 5419, 10899, -9800, -2843, 6447, -5587, -1376, 7457, -8286, -5465, 12849, -3228, -10293, 10555, 1733, -11133, 3841, 4004, -4133, 5105, 563, -9899, 7607, 8363, -14201, -904, 13822, -5271, -5243, 9058, -766, -7415, 5874, 4481, -6333, 3153, 5303, -6973, 1462, 8414, -4730, -3075, 7508, -1688, -4266, 9205, -392, -9342, 7057, 3762, -5234, 6849, -602, -9319, 9698, 6192, -13366, 1902, 13039, -6092, -5521, 7013, -1408, -3001, 3716, -1079, -619, 3070, -1449, -3306, 2236, 4384, -4602, -4920, 5201, 2703, -2743, 623, -2421, -4481, 4718, 2084, -5996, 3667, 1649, -11355, 3824, 8797, -9276, -1833, 6121, -6483, -2809, 6836]
452F836q141l554N185j987J507L316o163R1N367k948l150K278O437j860r950L617
468c119M532j830N957m814r612J1749J891j4484J2883J0310k3834J219J9603j0585
482a34j709R876j4238q16J5293o969m131R187o688q662J1432N032q911J922K753
497C237p765J086R867l075o631P700l976j1431J8157M165k2197J1789J0300k3830
511a2604P780K1957j7864o019J1727j4206O601K2084k3393p990K2952j4319p986
524a1280K4683p726j5927J2657l129q677J9661j13k3577R368J2768j4579J969
537c902J5241j0985j2201J3333K049r300J2102q13j7848J0930P152j3774J2332
550D316P138k3848L723J8282j3204P42J4798j8421m593J8097q687o8J3301j6763
$$ y = [6836, -1305, -4859, 326, -1661, -154, 3162, -3001, -2910, 2457, -491, -3641, -1363, 5074, 3214, -6736, -3119, 1413, -417, 5540, 726, -8886, 2863, 4754, -9730, 3153, 13463, -10371, -9152, 10451, -134, -1843, 8033, -6205, -7021, 8272, 1303, -2828, 6359, -329, -8991, 2441, 7473, -1438, 484, 3237, -4528, -3442, 6425, 3350, -3281, 4419, 443, -10988, 7169, 11334, -10863, 926, 11226, -12604, -4824, 17133, -731, -6750, 4977, -9229, -2628, 19456, -3937, -11927, 11025, -3294, -11280, 13403, 5677, -10250, 2407, -722, -9399, 10262, 10149, -13428, -4060, 8708, -5871, -3902, 11339, 354, -11847, 1486, 3535, -5765, 6337, 5524, -12324, -1394, 5758, -8016, 4316, 11454, -12394, -8671, 9611, -3593, -2851, 11947, -6474, -11067, 7030, -1657, -1725, 11576, -5187]
564e187q910J8738J811q125L247l289l050O548k101m05P959p465r098P774O764
579E211j942m073j23L04k212L376L238k927K18j194n366M666Q340n096n237L292
595D75k705k71P365p56l405l465j618O883K089m162J014k322l358N212K465j363
611B078J218o606l762J3019p27j0808Q515L10r866Q058J746o438Q084j159j3707
626a0045Q607J0906j1494j613Q136p075j349P341l479nL406p395k049J0603o3
641D432q537M301J494q844O957Q005j0722j768Q272o236j561J1033o783p813J2246
656D476l361r602J3553M95j3661P352N281q819M363M000r171M907O096j2959L251
671c799J3942j1070p221J1413j259o119O657M7p429N641L368q918M819O964j0284
$$ y = [-5187, -14097, 4641, 6452, -1673, 1574, -1715, -4765, 1783, -318, -723, 7236, -229, -9327, -1553, 5211, 3269, -804, -927, -623, -2835, 541, 3779, 852, 1070, -124, -5490, -824, 7516, 2420, -2817, 475, -2230, -2501, 4864, 4108, 703, -2762, -4380, 2503, 4592, 430, 1444, -878, -4236, 976, 3441, 2078, 3296, -3310, -7072, 5947, 5220, -5588, 2927, 3237, -6629, 1429, 3175, -3263, 4821, 3662, -10045, -1438, 9468, -2026, -3639, 4497, -2578, -3927, 3414, -65, -70, 3336, -4059, -6108, 4495, 4432, -4105, 196, 1690, -7154, -197, 7808, -2914, -4682, 3590, -2646, -4207, 6826, 43, -7770, 4476, 1115, -8487, 5066, 5561, -8100, -748, 4533, -4286, 77, 4077, -5094, -187, 5909, -7050, -3799, 10143, -927, -8148, 3265, 2006, -4113, 2544, 2591, -4838, 803, 4171, -4747, 72, 7036, -3248]
686c248k079J0291k714n251N556j611n640Q044N78q293O368J185q408O683M566
701F027j0487J989R683p969m805J0243k604n758O246j278l742N028j092m658M787
716A610K449p594Q97P477l680l258K350j153J254K717m477k024O641n84q062N511
732G4N576q688k03O651l820j679M079k945k158O277j891n717N492L61m834M326
748I01J254n488J674M311k773k055K406j001l34L417l308k511N666m04n971L293
764i23N404n950l124O898j56m831K546l14l61L837k989m386N456K277o013Q80
780a749M807l800j8K245k922K152J705n125R49O293l712n012N641J545n493L250
796G56K144n034J176M013k583j674K521j447q15M628l512m051O711O7n944L345
$$ y = [-3248, -5327, 4964, 2250, -3001, 2555, 944, -4696, 3348, 3926, -4367, 2001, 3186, -5222, 1461, 6027, -4460, -2471, 7212, -757, -5562, 4681, 2077, -3681, 2565, 1287, -2455, 2573, 1481, -3177, 1610, 4059, -3535, -2638, 4839, 1159, -2099, 251, -902, 352, 3069, -1408, -3432, 3209, 2625, -5437, 74, 5650, -3038, -3241, 3410, -410, -2089, 1990, -955, -3113, 3164, 1273, -4444, 1048, 1409, -3425, 901, 2155, -3333, -1659, 2652, -121, -2176, 230, -771, -1105, 2312, -996, -3507, 2159, 1755, -4216, -923, 4481, -1469, -4593, 2305, 2149, -2682, -136, -450, -811, 3026, 37, -4349, 1107, 3384, -2629, -1749, 3058, -742, -760, 1485, -1437, 715, 2420, -2705, -1756, 4537, 825, -4187, 1454, 2999, -2494, 756, 2900, -2134, -958, 3055, 472, -1202, 1319, -128, -943, 3685, 173, -3878, 2833, 2900, -3044, 301]
812C01K428m009J125K077l485K001L086o844J307Q121n934n237O657J454m618
827a570Q12J817k005J675M49l658L019J628m453P83L823k025k386K253K63j705
843a280K556j170l572M554J103n080K406K388m566R21N470m382l746N954K56m097
859b285K179l64o37K361j439k396L683Q51n033J672M606l769j954L351j050K77
875E3J550l128r22M801j61n946L176M253n183m57M346j895j726J810l28n33K171
892A881j778k554M501M0m122K922R11l988K471L002m269r56M492j825k201L548
908B075k433j445M816j456m874L663L265m400j288M009j195j644J179p62J288
923G98J425l768o67M838n21n095K349K910l762J563J800m030J649K821m285O39
$$ y = [301, 2729, -1280, -155, 1922, -1563, 438, 3524, -3320, -2013, 6108, 174, -5063, 1594, 3048, -1570, -758, 1059, -946, 729, 1178, -2480, 539, 2167, -2286, -1503, 2320, 295, -2091, 162, 425, -1280, 1276, 106, -3466, 1088, 2191, -2889, -483, 1905, -2661, -1740, 3730, -652, -4398, 1556, 1812, -2285, -106, -470, -1107, 1254, -185, -2581, 1102, 1953, -3080, -1408, 3198, -571, -2525, 826, -224, 53, 1603, -1525, -2447, 2354, 2193, -3753, -577, 3676, -1507, -1964, 2382, 487, -1239, 571, 243, -290, 1881, 103, -2451, 2050, 2090, -2032, 890, 1801, -2187, 284, 3286, -983, -1939, 2553, 728, -1473, 2075, -358, -1803, 3013, 1557, -3317, 346, 3611, -789, -2077, 1932, 737, -907, 272, -490, 798, 2223, -1545, -2212, 2626, 2105, -2990, -641, 2269, -1493, 70, 1870, -2160, -511, 2310, -1975, -1336]
939a336M559l652l285N553k22m463L274M85l329K801K86k553J759J080k583J293
955c33K215m247L53N448l600l769M152J778l159M08J577k303Q79K504l713O10
971a200M481m563k648O074L20m366J025Q21q28K959j461l449M762j16n456M190
987E45K900m971L60L124k191r59L114j512k041K849p06k301K752J247l074m8K840
1004A928k343j188M800j832m129L217k4p06L210k859l711N709P16o417L976M316
1020D663o950n46N028j660O8M53k727N84K886j057k292J926J424l016o78K586
1036F92P20j592j39j22r94J905O37k543K599n04m892M417L362n329K12L288l825
1053b108n7N098k212k830K337j578K12L371k153k201K022P00j550l59K871m70
$$ y = [-1336, 3223, -429, -3714, 1839, 1617, -2846, 428, 913, -2416, 385, 671, -1882, -123, 957, -1626, -333, 1882, -2365, -2012, 3436, -164, -3933, 219, 1997, -1162, -754, 823, -1480, -601, 1903, -1810, -1200, 3281, -1282, -3930, 2144, 2464, -1902, -877, -56, -884, 2075, 614, -2835, 1927, 1811, -3645, 545, 3445, -1526, -1166, 1958, -233, -1192, 1922, 410, -1631, 1218, 512, -1789, 963, 2210, -864, -912, 1928, -415, -1603, 3197, 1365, -2764, 453, 429, -277, 2933, 74, -3637, 2072, 2788, -3629, 347, 4663, -2287, -2833, 2195, 535, 603, 1056, -1671, -1087, 1799, 742, -1550, 376, 1800, -1216, -1894, 692, 1412, -180, -319, -441, -1435, 470, 1107, -1436, 1163, 659, -4233, 184, 3546, -1783, -1571, 1717, -2108, -2165, 2933, 721, -2109, 228, -1350, -1138, 2233, 80, -2121, -99, 601, -949, -1308, 1563, 1093]
1069A093k804O94Q87K36J555k023k652M232J508o519L201N839p240j001N755l681
1085i20M99M313n613j322N881k728k139N285k974l754M943k28k079K915j783k610
1101b314L186O14k286J195J595l408m70M823j296m126L189K225m850M71M022k749
1117a79p2K429m700J667M988n426p99N499l939j924M452k044p37L420m375j517
1133c257O910k322m526L729M47k244J326N28m38j059K33J322j120P3J208j507
1149f97j89J632j520o92L450k595j676M553k458k413M707j954k058L677k693j579
1165b505N021j341m597L271K432l082n21J519M03m54j851J954R62k090R08p13
1181f84k06K903k056k209L650l45k387K159q05j584L858j647l499N025r29m298
$$ y = [1093, -1711, -1017, -130, 106, 1661, -362, -3014, 1218, 2726, -3793, -592, 5247, -1993, -2994, 2761, -920, -421, 3892, -1721, -3043, 2838, 110, -2029, 3256, 282, -3472, 1471, 1243, -836, 2079, 296, -2314, 872, 1486, -800, 395, 1990, -1418, -1888, 2935, 1639, -2487, 702, 2927, -1923, -1452, 2570, -179, -251, 2178, -2522, -855, 4133, -1293, -2092, 3407, -532, -2456, 1996, -48, -785, 2635, -1740, -3257, 3653, 1331, -3195, 534, 981, -1263, 63, 591, 153, -906, -673, 649, -471, -398, 810, -697, -886, 746, -774, -1466, 1984, -611, -2287, 2266, -192, -2605, 2102, 148, -1910, 1767, -926, -2505, 2516, 1175, -3422, -151, 2281, -801, -1322, 197, 600, 146, -1705, 249, 1211, -879, 29, -684, -890, 2013, -43, -2252, 1398, 1053, -1334, 825, 20, -1564, 2294, 647, -2852, 2173, 1244, -3054]
1197c054N190k82m977L643J621l145R55J314j531N91j3r37J777k97k209J247J368
1214A261k97j541n11K902q57k511K512p80j146K929k258k024N017j157n394M649
1230G94K509n742J311K804k407J441j57k973L078Q28k714R09J205j755L35J496
1246I62j358l45R81j38k21l01N95n06q45K330j418j987L977r09m396M228J591
1263B240m572J324K549k397J133K40l499L728J906n532J836L592l613k10K413
1278A138j449k65J382j257l07K120o67k642J495K523j622k391K291J350k970J417
1294A46J109k768J818J028k392J799M29k961K348J904m162R82L583l717n66L535
1310B115k217o66J980j575l64K469j092k420J848K093k131j481J579J159j343
$$ y = [-3054, 2136, 1854, -3123, 520, 2141, -1004, -49, 1265, -266, 325, 312, -625, 1152, 855, -1354, -107, 1261, 964, -577, -1088, 1814, 957, -1554, 958, 178, -968, 1961, -297, -2321, 2696, 1539, -3855, 794, 3303, -2439, -1128, 1676, -731, 710, 553, -2420, 658, 1486, -1228, -319, 886, -869, -534, 962, -396, -741, 240, 102, -119, -420, 175, -331, -1176, 1154, -264, -2251, 1726, 817, -3579, 649, 2240, -2332, -1008, 1541, -856, 277, 517, -2982, 746, 2652, -2880, -1044, 2548, -1065, -1275, 1138, -311, -576, 806, -451, -758, 1362, 695, -1947, -452, 2071, 449, -1942, 349, 1699, -1271, 146, 1255, -1513, 305, 1333, -1059, 740, 1169, -1792, 556, 2460, -1702, -720, 2863, -854, -1420, 2115, -102, -768, 1212, -363, -727, 1742, 650, -1770, 78, 2171, 40, -1441, 138, 1297, -46]
1325d6n88R61k17K11j45j780K573Q62m192J647L365l528l49K529k118J7K904k858
1343g52j372M039j479k494K859l60j758J474N21j294r4Q18%n13N40o75J56J179
1361G95j502p93K555k1l500J526L584l482j101L265j979M5K491l143n35L777j633
1378C49k675K868J117l227J173J211j070O96p27o93J819J51j921J1K409r79j861
1395a349K048J40k168J915R47k461J63K179j534m09J930j665o48K683j622j481
1411a332K751l69k182J352O88j027N80l68j431K625M82l655R56L265k032j860
1427a557J993O74j968P56J168j962J087Q70k211P43K037k134q41K036J12j733
1443i30Q13J31p88J690p61j260J547p1j273J275O11k453M22K846k087j328K468
$$ y = [-46, -634, 327, 110, 321, 176, -1604, 969, 1831, -2361, -714, 2651, -877, -1226, 1303, -815, -798, 2106, -752, -2124, 1915, 436, -2058, 801, 441, -1317, 157, 678, -616, -710, 108, 108, -405, 135, -540, -384, 795, -707, -1500, 1055, 1034, -2466, -940, 2644, -838, -1939, 1326, -653, -608, 1883, -1260, -1795, 1982, 349, -2326, 542, 1659, -1568, -395, 816, -254, 442, -285, -978, 841, 992, -929, -918, 1491, 512, -1349, 699, 839, -1329, 586, 1533, -928, -765, 1414, -120, -529, 1401, -264, -912, 1771, 149, -1332, 1419, 1050, -1132, 220, 908, -119, 461, 93, -1338, 1287, 1769, -1886, -930, 2335, 303, -1557, 436, 1110, -858, -102, 1066, -896, 191, 1061, -1150, -407, 1630, -504, -1345, 691, 803, -930, -117, 14, -774, 916, 155, -1105, 442, 371, -902, 373, 984, -1469, -1047, 1799, -288, -1616, 852]
1460H52j24j694O19L68l26M62j25j329J548J097k505j37K180n30o94K08m97Q16
1478A89N35j336r39K734j49k870J787J734k429l95K354o09j789J402J95j291J873
1495I96j79k090J383O62j213P15O23j370o0J607q85n89J212j121m8J402j355k63
1513e73K093p09k585J597K480k121j496K155j71j083N13k89J70J372j292j933
1529a872K388J506k886L20J194j481J030P74j654O22J356k964O01L435k229k286
1545b146K882l45j802J875L87j742K50R21o71K33N59r93p1J429j377o57K537p23
1563E46k124J219Q05j366J200N91k573J749J388l798J899L431l486j946K997K71
1579H03j104Q84j048n60J860q12j065K025n01j581Q47P45l26k48M14p36j09J231
$$ y = [852, 728, -966, -347, 21, -305, 157, 32, -1297, 251, 1348, -1157, -1294, 886, 356, -338, -130, -627, 189, 724, -612, -1551, 1183, 1034, -1836, -49, 1685, -744, -1139, 1215, 606, -1183, 219, 414, -877, 996, 817, -1273, 110, 772, -441, 274, 897, -473, -533, 1074, 189, -400, 812, -309, -357, 1045, -310, -573, 1520, 811, -1774, -177, 2303, 182, -1314, 841, 670, -413, 100, -189, -19, 1353, 61, -1872, 516, 2022, -864, -544, 650, -831, 199, 973, -681, -59, 1297, -1667, -1066, 2369, 140, -2146, 736, 391, -1411, 464, 851, -891, -641, 280, -391, -158, 401, -592, -663, 766, -611, -1268, 1269, 546, -1578, -359, 446, -920, 280, 871, -1702, 47, 1435, -2363, -464, 2967, -519, -2465, 532, 803, -301, 583, -465, -1025, 835, 23, -1042, 983, 482, -1099, -252, 493, 167, -81, 333, -403, -512, 719]
1597G19n56p53J491m12j708J430J301k088K94J888k242m29K364p01q12O10j204
1614h08Q44J150j286l64J610q93j525J669P56j033k30n10M86Q56m5j030m55J475
1632F67K30k214Q30K167j991r72J761j93j155J291l70r71J356m20j016J656n81
1649G5j063J170K09j122P61O82j261j74J032l40q5L67p67j98J023J80j440M05
1667e46J659j480j001K124l29j185M76J13O5R86j384r59K731k82k711J733R61
1684I71j751J045K59j652J298Q93j706J61J355o97j289J782K07j723R95N17p78
1701a13l94J358n26j008J111k82n13J507j583n79K506o29k335J588J145j773L37
1718a83J065j519R02Q47k215R68J790k119q95K288J06j639J74M94J24N76q34r21
$$ y = [719, 163, -590, 901, 489, -1219, 211, 1512, -576, -282, 1606, -636, -1065, 1299, 598, -214, 396, -808, 36, 1186, -100, -464, 1146, 253, -1272, 397, 1153, 120, -110, -620, -134, 722, 677, -353, -808, 667, 897, -1317, -487, 1680, -311, -1283, 478, 285, -870, 421, 51, -920, 436, 16, -1000, 656, 75, -988, 182, 391, -731, 30, 712, -549, -723, 309, -31, -116, 251, -516, -714, 309, 489, -951, -546, 1113, -367, -1368, 756, 427, -758, -282, -169, -104, 882, -502, -1461, 1270, 988, -1723, 10, 971, -780, 265, 524, -1128, 170, 1063, -643, -482, 873, 176, -1113, 669, 876, -847, 148, 665, -113, -507, 851, 325, -683, 428, 146, -367, 1140, -443, -1022, 1484, 855, -1480, 108, 1253, -520, -183, 882, -637, 265, 1112, -1103, -135, 1655, -464, -1359, 929, 1035, -604, -430, 64, 188, 764, -70, -991]
1736i91J515L51j700K12J578r08j202J840j04j957J883Qj676J496N23k159J134
1753a57J150j931L41J819j822m00J817n87q13L10j58M86L75j067l11J528K00k018
1771a238Q43J316j171o47J110L30p72R0m0j53J092k76j843J337J139j487m76J252
1789D06k8m74K52m23K1Q64p89l48J475p78q31J003L18j074J73J053q35m54R64
1808D95l8p33M80k05oN76k07j029P13J229j494n13J391p00K27J33q17P35Q51j583
1828d95k57K063o87j961J368J076j303m9L79l87N76J11j102K36J024o17q22J045
1846A98J8o84N41L1l57J70J37m23J66O85r02l1P97j022L4J660r26j257J000P58
1866E93q89k30L77j74N40J03j105P54O80j108j18Q77o9o63J44M59p9J33n78m56
$$ y = [-991, 524, 875, -825, -613, 965, 57, -1145, 695, 591, -1366, 517, 525, -1151, 345, 868, -1291, -157, 993, -938, -597, 1222, -600, -1000, 817, 230, -583, -273, -431, 55, 430, -637, -948, 580, 780, -1238, -395, 921, -250, -897, 213, 543, -229, -139, -179, -332, 760, 484, -1359, -22, 1117, -370, -846, 406, 378, -96, 156, -267, -246, 618, -171, -519, 956, 178, -653, 350, 668, -406, -233, 820, -15, -469, 495, 457, -276, 204, -1, -7, 569, 362, -667, 46, 1275, -219, -732, 659, -41, 186, 319, -498, 237, 1088, -495, -752, 1311, 624, -1337, 31, 1107, -196, -245, 134, -253, 323, 434, -668, -432, 592, -25, -847, 198, 216, -468, 73, 104, -253, -83, 54, -369, -203, 482, -420, -451, 346, -676, -642, 1018, 92, -1165, -165, 593, -296, -526, -149, -323, 217, 320, -785, -31, 649, -459, -577, 300, 231, -432, -288, 171, 92, 225, -353, -809]
1886h09J303K28j575N17J301r31q69J453m49r49J169j9q79P05K0n08L81M50p97
1905b58J66Q27j092jJ360j163l32Q14K3j24K01o74k12J289O8k063R72J513j351
1924c7o12Q56J86m91K26n0L7M64n57o43J272j1j154J97O07l81J46K76p63L98O29
1945E95j017j59J293r90n56J353k73p27K95Q00q74k55P42k44n54M64j76L31L87
1964D35j203J21J121j7j230K16J127o19k36N7j37O22J49j032J3J350l09j550J045
1983g7R05j214QL53J52N9l03l60M84M56o92j45J113p23n05P79Mn08J87M46m43
2004b4p9M64m50qP48r15l5J139n70r11Q55N95j084k22J007k74M2k12o18Q69Q08
2025A125j606j45J217j80j118J043Q0o43L59j02o02J400l09j474N03J243p37o50
$$ y = [-809, 494, 722, -853, -336, 965, 34, -835, 618, 169, -780, 389, 370, -509, 196, 216, -292, 89, 539, -258, -92, 735, -357, -358, 1002, -161, -493, 321, 344, 220, 421, -253, -465, 824, 892, -1171, -199, 1314, -37, -649, 207, 393, -98, 128, 78, 115, 579, 22, -621, 651, 640, -514, -317, 290, -91, 55, 331, -432, -34, 595, -422, -581, 712, -278, -834, 519, 246, -481, -186, 614, -260, -515, 227, -17, -571, -107, -283, 48, 435, -768, -647, 474, 457, -773, -557, 570, -49, -285, -228, -365, 257, 406, -626, -613, 737, 428, -1122, -77, 828, -386, -378, -25, 127, 186, -117, -477, 7, 463, -229, -374, 739, 16, -489, 290, 294, -214, -27, 419, -24, -103, 361, -89, -97, 651, -264, -299, 840, 270, -641, 214, 809, -275, -497, 510, 236, 278, 66, -552, 317, 1125, -481, -626, 591, 411, -707, 336, 416, -227, 132, 30, -572, 828, 519, -955, -452, 791, 54, -596]
2043e96J285m17q62P00j30k55P65m82n18M87K22q82O96P37j479Q7J389q85l49
2062d87O97l14m42N47m8l96R14l64j376J297R66j197l33O25n7O0k53k90N28L38
2082D15r27j04J152k11j021O46L90n57J58L69m50m2P09o89k51J171n34o65N31
2101I0J07m60K29O76q38q8M37j84L22K28p09K06L08n68L4O71j08r88K30J267q10
2122E2m74M03J10L65l48j84n6O47j07j011P11N79o89k28K43K7J93l40l8L75J83
2143D13r93J68Q84n89r6N07m21j55M32J25m53k15L69N4l28K04j44j10P21m76j74
2164b77L15L12q76J12P20l21O8j79m36P35M02j512K67J333n73r15R17N03n64l9
2184hk32p4P63n17k94M13K72n11j42N49o2k78J96j68j50M52j45l56L56J92o28
$$ y = [-596, 689, 272, -590, 110, -20, -275, 490, 8, -510, -23, 199, -683, 13, 750, -729, -642, 747, -138, -487, 210, -104, -546, 1, -47, -443, 471, 107, -1269, 28, 994, -203, -536, 89, 32, 92, -161, -451, 77, 415, -512, -616, 536, 325, -696, -50, 340, -217, -59, 310, -140, -182, 527, -162, -413, 758, 224, -441, 90, 197, -263, -34, 642, -196, -284, 153, -31, 291, 519, -190, 16, 324, -244, -210, 461, 353, -635, -405, 862, 52, -422, -19, 91, 456, 108, -76, -132, 515, 408, -603, 108, 687, -2, -230, 13, 40, 233, -107, -145, 230, 413, -580, -412, 472, -117, -213, 294, -127, -282, 150, 275, -178, -393, -24, 30, -298, -94, -238, -348, 373, -103, -277, 38, 350, -526, -414, 306, -15, 53, -126, -562, 173, 575, -937, -670, 663, 90, -825, 92, 595, 31, -8, -240, -314, 449, -68, -362, 51, 323, -188, -330, 219, 157, -121, 75, -93, -243, 209, 64, -292, 64, 256, -372]
2205c72N44N03j314J22J628j109n44R85Nm62J01q7j63Q74q75m93J201J00j060
2224d16M14M18j34j73l63J15O03J13r26k06J302m08j108O45Q44p82j65K66J6j89
2244a34J75j75l1P29p24j27M74l36p0P86o16m40M20K30l13L10k86k65M95K17q18
2265d99J21O83j04r89N18P50m95n71N18J24j4j88k10L51K83n04m60J017J0p84
2285d43N35Nj36N07q59l34J186J3j001K26R73p01l30M74j1j76J96L2j81l3L67
2306C09j57lRl34K63N48q71j11R37j78r95O44L49o89O41j01p13Q67J11j257N18
2327b13Q88o36l53J38O06l53k45o0J31L96n95Q1M64J57o03n2L60k00j7M74n24
2348a56J35N71m59o13P22K57q17L76L44j000N43P21j020P1L81l0n6j27m8M04Q9
$$ y = [-372, 172, 675, -639, -517, 1111, 2, -542, 443, 448, -14, 87, 0, -163, 711, -164, -657, 544, 644, -416, -2, 416, 282, 109, -254, -139, 464, 577, -349, -555, 747, 339, -769, -124, 720, -62, -227, 39, 55, -134, 41, -134, -165, 564, -160, -287, 187, -149, -219, 567, -49, -489, -69, 161, -152, 158, -128, -393, 102, 319, -499, -378, 305, 201, -788, -270, 480, -15, -586, -68, 56, 42, -146, -356, -5, 278, -226, -686, 331, 341, -443, 92, 97, -39, 468, -391, -725, 461, 474, -527, -301, 672, -29, -359, 115, 104, -72, 124, 156, -25, -58, 309, 152, 149, 158, -176, 87, 635, -236, -347, 590, 412, -583, 61, 410, -279, 362, 261, -452, 415, 526, -731, -213, 675, 39, -314, -176, 430, 77, -168, -228, -97, 299, -296, -215, 249, 406, -197, -249, 111, -89, -106, 368, -156, -21, 550, 91, -522, 200, 457, -360, 16, 360, -640, -97, 624, -396, -325, 56, 26, -30, -157, -205, 199, 288]
2369B88n35k19N85J78r86L91M76k09k66J38J93k08M00l56n52J177j16j175N67
2388b29P20p34j80P33j22k28J32k73Q4N08o53J45K95l85J64K89j49m76M29L80
2408D50n07j00K90O1p2j54j7j6M08j42o49M40O20n97l14N80J03j83k87j16M41
2429B39L11q33n8R39l35p15O10O4k59J14k63N9L30n9k20k14M16J9m06K54L65k56
2451A02l63K11J64k83K74j46k8M4j95K24K60r11K20J097o48n00K75L54k43p4Q4
2472h2J25Q6j34m25K76L74j46o80M70L20k14k68j67O36L5m02l3O67k01o91J70
2493b84Q31n95k56N79k88j66J92j66O1L00j30l54L06K66m91L16J84o55L35K46
2513B31k46J80l51J41K83K94p63l15J192j97r11K75R25o28m92M65K72k15j07k25
$$ y = [288, -247, -466, 119, 297, -689, -298, 178, -31, -297, -159, 34, -174, 226, -130, -682, 495, 379, -796, -229, 491, -243, -423, 310, 188, -40, 92, -181, -97, 411, -242, -97, 198, -187, -23, 266, 117, -359, 70, 450, -57, -157, 133, 194, 122, -32, -49, -65, 343, 201, -448, -8, 612, 15, -299, 281, 384, 201, -86, -202, 239, 550, -283, -341, 598, 263, -452, 158, 222, -37, 77, -186, -127, 203, 144, -76, -290, 126, 145, -261, -7, 358, 102, -261, -50, 114, -169, 105, -41, -69, -25, -220, 4, 264, -647, -427, 670, 22, -478, -203, 151, -92, -166, -82, 43, 129, -5, -430, -154, 220, 74, -606, -136, 184, -30, -298, -465, 171, 206, -196, -229, 438, 237, -454, -284, 547, -48, -304, 275, -13, -179, 13, -153, -92, 208, 78, -276, 30, 296, -195, 121, 305, -350, -15, 231, -15, 165, -186, -45, 238, 532, -231, -546, 646, 449, -462, -187, 738, 110, -382, 83, 355, 140, 33, -192]
2533a92o0P12k29o68M41L47l38k10J35R9J32J51o27L47L08p17J76P17o62l11N12
2554F3J37m58L52J95p63M03K43k05J32j69j60K03L81n36k76O85Ko06K54J6K0L25
2576B38l33l57P57Jq63P1R96l95q14P27L72m98j75J42p9L04Pj83M5J26j57J4K07
2599A53l01K34P3k77J69L12l77o9L04o3m10L59J69n50K77M24m89k28L30M56n71
2620g5j98K74K01J28m02k41N09K41o64J19N88k29k42j7j02K68K43m19k74O37J39
2641D84p32R9N87k35m51M65j93k73J41K40k16L8J08r1j51K47k80J19L12n38J48
2662a72L61k71j92L04R0k99K44k06j85O13j17q10M14P73n75m26K87M57l79j69
2682b58K87J04J19k79o31Q14L20o92M3M02k97Q7L46o03J29N08n45L1L12k73k55
$$ y = [-192, -252, 460, 231, -437, 4, 351, 13, -197, -62, 37, 169, 320, -307, 40, 348, -369, -193, 524, -138, -449, 63, 200, -258, 94, 289, -474, -71, 172, -33, 99, -70, -230, -27, 354, -182, -458, 227, 229, -377, -123, -107, -87, 238, -95, -452, 305, 306, -557, -486, 510, 115, -699, 28, 400, -98, -273, -131, -210, 94, 101, -82, -37, 89, -68, -54, 153, -148, 86, 159, -118, 51, 363, -14, -83, 221, 158, -252, 107, 276, -274, 3, 427, -62, -290, 40, 496, -75, -273, 1, 202, 330, -72, -313, 196, 437, -227, -108, 480, 251, 9, -8, -110, 158, 401, -18, -292, 345, 484, -248, -149, 438, 203, -248, 217, 24, -249, -108, 132, -84, -46, 62, -29, -180, 67, -213, -94, 218, -320, -172, 189, -82, -274, 30, 120, -179, 65, -141, -326, 287, 170, -640, -226, 547, -28, -454, -167, 290, -89, -258, 29, 133, 252, -27, -658, 156, 476, -216, -173, 229, -68, 19, 365, -238, -109, 399, -146, -115, 197, -76, -331]
2703c31O74j93m42J87N16l68k77M03m3m3j06j3K00n1k76j31P23rq57M00K46j37
2725G2n9J36k25L43l1m32l01J070l88o38L67N94m27l23L16K57o6m57kK67K12m40
2747a55M3J45k54J51J67J8m33M31o1m56K96L11m24J50K37l37O4L98k89l19L38
2768B1K78n26P1J32N9P7k14n47Q74K6o70J38M69ro37M81Q6k7l5l86K5M95jm69
2792b89j69Q30k13n39K67J13j73J50j66jK57j57L2K65j93k44M45J51o40K20J53
2813I9M3r6n1J51Q8j24j25N8J54K5n07K59L34j45j60kM52l47j56j67K60L94n02
2836f5k08P34j13o90J67M28j92j81M75o77K58K75k46q1L53m6k41p9J77n4j58M55
2858B91m53Q7J95k35N1P2r7J58J67m34j90N03j69m06M42K21j85j46k0J61P2k73
$$ y = [-331, 343, 150, -292, -105, 411, 43, -234, 169, 126, 83, -23, -36, 164, 113, -163, -294, 429, 420, -437, -37, 209, 72, 13, 149, -76, 267, 236, -196, -497, 573, 185, -453, -86, 508, 81, -242, 74, 331, 265, -192, -194, 73, 285, -155, -112, 33, -221, -70, 97, 115, -318, 113, 52, -404, -108, 203, -221, -71, 166, -171, -107, 291, 2, -317, 21, 299, -227, -156, -24, 35, 112, -102, -649, 225, 251, -419, -281, 188, 179, -458, 23, 109, 82, 47, -339, -314, 181, 180, -289, -458, 372, 159, -380, -113, 0, -173, -23, -189, -190, 67, -90, -58, 207, 14, -230, 215, 366, -274, -54, 99, 142, 46, -5, 146, 234, 110, -15, 43, 197, 222, -285, -26, 308, 163, 3, 1, 453, 106, -50, -217, 43, 437, -65, -273, 461, 348, -342, -175, 253, 61, -120, 355, -322, -64, 211, -35, -116, 237, 191, -50, -129, 48, -6, -164, 291, -162, -75, 120, -115, -64, 8, -89, 69, 236, -198, -388, 115, -54, -460, -18, 203, 18, -128, -148, 13, 85, -188]
2880a88k70L11K84j63k34K95m5o7r2N8J37j4mj56J34J70l08k9N79o49L32M9j17
2903A3k30L81J21n08J03K87l82N65k48k30K98J09m22P2J45K48m20j40L07k5K11
2924B55m79J7O65k28m58MP76l66n28N24J1l41L29j67J11O2j70j84J93K70m12j39
2946b55N81j10pj58R0L8Mk07M7L4M6k61K96K57p69K62L30j44n46N55K2n5k54J62
2970d2k0K26j61m13N64j8k49j80J92K07k22o4M0L24q3m33nM78P4n48R5M34o1n06
2994c71M10o5p7J86k96O4K27Q4m83K74J55k41O5K01l82K52L13l21k9J2j6J23r7
3017a2j03j5M25j69m22L01M47k68l19l4L09j16n5j12J08M50k95l83M30K02k77
3038I2j38P5o0J38O1k78K40k2n40L44N38k90l56K12K2o8q5J74j61N2K21k18o8
$$ y = [-188, -458, -147, 137, -26, -260, 35, -10, -77, -169, -111, 26, 12, 8, -148, -14, 156, -152, -181, 398, -251, 81, 130, 13, -217, 164, 285, -223, -120, 167, -215, 350, 102, -128, 170, 279, -143, -71, 74, 322, -98, -238, 69, 44, 255, -224, -207, 458, 230, -228, -224, 552, 186, -342, 182, 193, -148, 181, 14, 125, 187, 17, -167, 26, 296, -116, -255, 326, 216, 209, 51, 141, 179, 183, -24, 23, 57, 103, -158, 138, 395, -374, -112, 218, 74, -472, 83, 105, 50, -204, -42, -62, 164, 3, -410, 154, 136, -113, -293, -101, 106, -116, -180, -140, 184, 101, -332, -337, 141, 215, -333, -238, 196, 135, -371, 39, -26, -103, 83, -213, -149, 78, 162, -321, -47, 108, -133, -68, 133, -249, 3, 316, -5, -34, -22, -38, 85, -12, -115, -130, 295, 126, -296, 5, 452, 184, -135, -169, 140, 24, -31, -143, -35, 415, 120, -263, 167, 369, 92, -46, 29, -31, 107, 168, -110, 130, 108, -432, -88, 450, 160, -196, 16, 38, -30, -115, 59, -102, -50, 171, -47, -115]
3061a15J08N6J42k71j15n2L02J58n00K13p1J83Kk00K1L82j32n76J97N86j25p33
3083e40L23K94O8j63j62J12J23j63QJ67m7j59O9J11oj01Q2r7Q8n2K78l04q1J41
3107a1K8L6J46k47R6K01k69j20K36J88k40r2J0L0J44k49j63N20p1k56j24N67R4
3130D54n76J82P4r4K10k49j56M89j23l23j33L66J29m41K12Mj07R8j58J06J62n2
3152G4J6j14L1k40L18P3k25j87N67l39Nl5K7O8q3j63K71J2O7l64L5N19l92k90
3176c49M20J40j84p3n0K74qm48R6L58J9m29K3L43J0j0j98m9J73R8l20J33J07j32
3200e6j38M13j68j6j10J13j64o3J29K8J87k27j91M03j53j43K4K65J26o18L11J65
3222A17K6j69L7O3L17m16j06K56oJ7n10M02K26j75j95P3K38J63m93J88q7K29j13
$$ y = [-115, -7, 49, 191, -80, -195, -247, 55, 213, -287, -74, -145, 38, 40, -160, -139, 243, 111, -465, -268, 318, 193, -540, -217, 77, 145, -18, -180, -68, 55, -108, -100, 67, 20, -139, -70, 41, 35, -66, 16, -81, 7, -45, 233, -71, -152, -11, 17, 53, 199, -48, 48, 249, -20, -140, 96, 284, 44, -48, -38, -8, 136, -113, -276, 244, 173, -83, -207, 360, 454, -122, 60, 134, 40, 250, 1, -155, 334, 211, -112, -245, 121, 250, -191, 21, 25, -82, 16, -142, -36, 126, 74, 90, -24, 7, -233, 85, 158, -67, -254, 313, -26, -21, -56, -29, 39, -44, -207, 64, 76, 143, -221, -186, 333, -59, -349, 71, 211, 27, -46, -96, 178, 170, -278, -182, 176, 195, -234, -211, 132, 142, 132, -66, -115, 58, 156, -164, -31, 76, -56, -194, 219, 51, 35, -75, 38, -126, -189, -60, -32, 155, -72, -263, 140, -13, -156, -132, 133, 259, -359, -48, 117, 143, -26, 11, 74, 391, -25, -131, 125, 119, 136, -374, 28, 254, 79, -116, -43, 195, 358, -135, 53, -34, 195, 82]
3245H2k50K90j48J02l3j42J32R0J7j55n0NJ04P3J6k27J2K27k33j53L28m6j40J
3269i8J01N8R9k54l83O05M5m39J42J70J71m58J89Q8q6L2k95J45L28k14j31J3K70
3292I8l9k18N6N9J20Jk77K08K14k37q0oK00k00R1K27l78J10J74l43K37M1m3l4
3316a9l3j78L42J7k6l85L16K93l83K9m0J19l6k04L36m3K35l38k16M21l2j31k97
3339b53M41K5m15L33l9m8J39m10M3L09j11J08j70M4O4M9Q3l72K37J09l43R1LJ56
3363G3J35l03j32J06K28r4k47J14J53o0k8l6k0M24l70j39J52J58k91o2K50P4o9
3386A6k16K09M8Ok3m8l4J50k74J19J81k47j5L01k17K9J18q5j28J04l5j6p9J79
3410D3j43j24M84m84R5K27n5q7O9m7rJ02k72J27L88m8n44J03K10J15k91j04M00
$$ y = [82, -168, 122, -26, 76, 43, -99, 33, 123, 140, -15, -65, -60, 44, 117, 133, -94, -82, 145, -88, -241, 87, 41, -99, -98, 3, 61, 160, -94, -477, 128, 173, -266, -124, 46, 217, -241, -52, 36, -50, -18, -313, -168, 160, -54, -185, -172, 98, 59, -159, -103, -44, 76, 77, -200, 8, 222, -15, -95, -101, 99, -101, -10, 217, -161, -51, 123, -220, 17, 58, 15, -19, -52, -230, 112, 129, 103, -282, 34, 327, -56, -27, -67, 52, 16, -188, 148, 105, 340, 2, -214, 207, 175, 44, -253, 188, 213, -202, 131, 92, 44, 183, -227, -184, 125, 14, 122, -48, -4, 60, 109, 192, -180, 57, 166, -177, -86, -83, 73, 208, -95, -227, -121, 107, 13, -234, -120, 33, -27, -55, -91, -111, 313, -57, -196, -44, 114, -177, -239, 11, 85, 16, -200, 9, 57, 63, 40, -8, -42, 108, -166, -47, 134, -113, -128, 173, -44, -15, 103, 18, -110, -6, -41, -57, -136, 43, -100, -224, 260, -224, -129, 98, 43, -44, 25, -22, -31, 71, -201, -74, 314, 266, -278, -175, 35, 150, -141, -245, 155]
3433A55j45l02J36L06P1k16j39J17L12q5m31L06L3k00J21l41K73L17l93nK36m7
3455G9k56P6K76j33K1L6j53K4r5J76o3j55N0M8J63r5k87L94O3j18k24J38K17k13
3479c1q0J76r9J69j19k18K34n3k12J50Q8Q8m9l38K60J24j59P4J56j4k64j80L77
3502H0k7j2j98L6KRK54j70j10L38k57Q1J11j69J6P5n3j51N7M23l57J52l23L01
3526A08K20l85j21K19J72k28oK42j60m9o6l3K07m9p3l8K42P3l02j54L77k50j8
3549g2J04M3K00j42j80P3q4Q3k29K95j00p0O0J61j86qR6jk34P4J47m2Q8p5o6K07
3575A42j97k35J91K36j00k72pL63J6o7l06J33L39k77p7J42M1k55J13n7J72j27
3597h9l2J24J00k5j06j36L5J96k9q3N8j65K73k85M8J78J45k46J77k24N4J84m2
$$ y = [155, 10, -292, -156, 150, 221, 5, -134, -17, 295, 210, -221, 85, 118, -82, 39, -302, -29, 288, -105, -110, 126, 79, -177, -101, 175, 42, 63, 99, -54, -30, -125, 51, -12, -167, -117, -69, 94, -1, -288, 106, 169, 51, -173, -35, 182, -31, -111, 65, -34, 135, 16, -202, 32, -21, -233, -83, 5, 93, 44, -294, -34, 90, -69, 5, 161, 147, -117, -297, 80, 53, 41, -157, -121, -119, -110, 144, -26, -136, 202, -55, 26, 137, -32, -16, 59, 6, -145, -88, 335, -22, 130, -193, 108, 328, -57, -178, 41, 213, -15, -21, 221, 61, 12, -54, -87, 120, 71, -2, -40, 202, 275, -27, -181, 196, -54, -72, 32, 75, 275, 133, -47, 26, -58, 25, -204, 91, -9, -79, -19, 142, -44, -52, 44, 43, -191, -117, 30, -12, 76, 1, -65, 142, -55, -290, -99, 137, 37, -235, -242, 121, 137, 70, -236, -103, 236, -41, -118, 24, 65, -190, -77, -134, 38, -89, -121, 3, 103, 78, -28, -164, -129, 67, 38, -45, 13, -152, 121, -164, -116, 62, 207, -39, 138, -86, -32, 152, 110]
3620A10k56l0K06L3j86O3K56j40j14l6K70J87k97k93J37L40j28j74J51P0r3j91
3642a15q7K52R8%l77K89J85m17K9J01j91J50Q7K27k73n2L69m06j05K31J2q6P1
3665hl07L18J5q3j56J87J46l09K55m2J98k98n6J40K3L19m16k40M81K4m84K0K49
3688b4J04j31o1J44J7j78l9J34j55L62k82O3m6J11jj10K62L4l0l18J67k4r1K37
3712A45R7l65rK91Jl33R7N1nJ57j45j33L88k87M4K82p4k25j0L5Q4M7j31k23L99
3737A78P7l75J8J80K77n93K43k8K93l53J57j40J87k93J77m9j4NJ53j98J86j30
3759d2M8J9k10L24j48J56j32j36N3Q0J12j42n9K27j7m40L41R2j4k99j60L83Oo4
3783b2j20J89M9k42K52k4j11R6k54P0O6K26k43k51M03R8l15KL7KO5j06J68J8j9
$$ y = [110, -146, -176, 30, 63, -123, -60, 196, 56, -58, -94, 176, 363, 66, -227, -90, 250, 122, -52, 99, 169, 76, -115, -202, 50, 148, 148, -229, 60, 245, -172, -143, -42, -233, -83, 4, 231, -42, -94, 275, -131, -236, -5, 7, -79, -8, -315, 3, 18, -65, -221, -34, 112, -197, 58, 16, 214, -84, -140, 0, 23, 342, -74, -314, 167, 191, -293, -273, -24, 80, -51, -112, 32, 49, -129, -168, -34, -189, 173, -109, -46, -92, 19, 18, -92, 170, 204, 174, -144, 23, -1, -92, 145, 242, -123, -132, 159, 160, -173, -76, -25, -30, 127, -18, -151, 237, -50, -6, 276, 202, -23, -33, 2, 86, 133, 2, -221, 178, 255, -120, -102, 78, 355, -238, 5, -23, 270, -83, 74, -66, 121, -172, 5, -44, -58, -53, 100, -98, 88, -42, 6, 25, -185, 139, -9, 147, 15, -121, -68, 12, 124, -18, -77, 150, 133, -307, 34, 126, 112, -187, -347, 36, 42, -22, -142, 47, 96, -146, 106, 82, -29, 67, -187, -117, -51, 175, -68, -319, 84, 182, -133, -131, -94, -92, -27, -133, 35, 53, 34]
3808C4l7q5N7j2o5K18j62j67N46k56k78J52J8J83k26K1j9J43J06j61p5J02K8N6
3832A21j39K04r5k32P6K06N1k33j25J87j8N8qj22K99j65n1L9j30J95l5Lm29L46
3856CQ7l28K87j62o0K55p3j79J14J83k66K58l12M28j80q5j00J72M3k07k7J58q5
3879g6j7l6K95j84p8P6rk16L89j79K9J37l0k43MJ13Q7q1o9J12j9j04r3K61j37
3904f8nJ63j53Q4o9L07k86n0K21m9m4m0r0Q5J09j19j29m1K90p5k48K48N3Q7j42
3929C9j09J95N8k35ON5P2k21J87L6K16k69k24L68j98J57j97K8k6J09k48J36K08
3952A43k22j8p2j0K90q4M3m8k0o5K0j1p2l3K94m6l39J67K47Pk40O1m7J80m6k24
3978a45K27r2J49m1r6rJ11j95J30K0j50N2r2J70M0j85N8QJ63k10j34L21k00n6
$$ y = [34, -3, -88, -31, -43, -108, 110, -52, -219, 327, 71, -207, -55, -37, 146, -80, -59, -78, 65, 171, 10, -65, 37, 65, 121, -18, 186, 91, -141, -65, 141, 192, -41, -166, 21, 3, 61, 53, -69, 230, 65, 14, 53, -77, 118, 83, 86, -343, 3, 90, -238, 49, -113, -173, 82, 9, -170, -56, 127, -139, 119, -193, 235, 55, -30, -130, 42, 85, -122, -149, 9, -76, -93, -129, 166, -18, -96, -20, -29, -245, 144, -35, -6, 131, 101, -142, -138, -25, 62, -19, -88, 24, 5, -99, -192, 69, -68, -73, 90, -63, 21, -48, 259, -27, -77, 144, 95, 51, 11, -79, 6, 115, -4, -133, -174, 116, 41, -207, 41, 94, 181, 39, -70, 125, 183, -52, -46, 9, 81, -140, 47, 83, 299, 30, -194, 174, -24, 133, -64, -36, -62, 47, -201, -65, 143, -79, -97, -169, -179, 111, 27, 70, 22, 2, -63, -43, -54, -126, -159, 135, 89, -250, -83, 164, 171, -69, -8, -55, 125, 79, -145, 82, -10, 139, 98, 2, -7, 104, -91, 39, 59, -91, -39, -131, 39, 79, -106, -48, -40, 123, -87, -221, 100, -100, -156]
4002a56q6K46m1r4K57k25J10M9l0p6M9j8J34r2m1q5n1K94k16rL0J35L9j72k7K81
4028B05M3k52j21J37J12j25o0J11o7J75j59j45L12k42j84K41N7j45J89k20J27
4049a1J13%nj34J01pj49J7J06n0J6o8M8j19K30r0r1K83j04r8M8p1R5J9n2j36J61
4076E2P6j85M7N6l3QJ67m64M60p9l66M0K99o3n2LJ02J13k83K8K09j11N1k02N4
4101g3p9j5J27n8O6j85K46L8j13j75R5J19R1n6m1L4P3J41k12N5o7j17Q6L0M0j40
4127i0K6J29J10j48PLJ25l21O6P5m3J89o9k21J64M3k24K12k50L93l87Q6K04Lp0
4152A2j43J09j39O2OL9r7J14K7J18pj43R0L0r2lm7pK7J42j28O8P2k17J39j09K98
4179B21k81l7K22j8j77j81K28K7o5m1KO3k3j24K61j50J88j75r0N3J35k6k75K44
$$ y = [-156, -242, 4, -37, -131, 126, -99, 11, 60, 30, -46, 3, -15, 119, 27, -14, -99, -150, 144, -72, -81, -51, 84, 123, -49, -76, 205, 248, -4, -125, 12, 124, -1, -61, 50, -17, 158, -1, -146, 166, -76, -260, -19, 38, -107, 82, -138, -11, 102, 102, 97, -37, 64, 57, -92, -75, 31, -19, -3, -71, -23, -142, 88, -2, -93, 190, 86, -12, 36, -35, 60, 79, 27, -109, 52, 128, -57, -10, 46, 13, 21, 188, -276, 184, 105, -261, -221, 78, 15, -37, -34, 68, 181, -102, -74, 135, 24, 75, -127, -73, -152, -167, -40, -98, -32, -217, 29, 67, -46, -221, -126, -7, 84, 28, -13, 21, 94, 235, 23, 78, 11, -106, -20, 10, 50, -90, -64, 65, 175, 27, 34, 37, 162, -159, -93, -18, -61, 128, 59, -162, 2, 45, -179, 33, -217, 176, -211, -125, 79, 82, 12, -131, -22, -161, -99, -93, -54, -151, -37, -10, 108, 101, -42, 48, 78, -14, -17, -64, -71, -44, 98, -30, 38, 110, -107, 32, -77, 221, -60, -97, 125, 107, -70, -251, -23, 4, -61, -102, -100, -37, -60, -184, 77, -73, 115, -60, -150, -97, 38, 12, -263, -19]
4203a9L7N4J8Q3j37k22J05J95k31L0J76m2K9k82K51k60M52m18J58P2k57J96k2
4226c4K12j22k3K9J0n0L0j81J37K46l01p4J29J98k14j20K66M2k98J18M4n5k3J5
4250a9m7q0J04n8J93n0J2P7kj91J29L5l15K23J11q3m6J72j60p7N3J2l0j1P1o2
4276c9J75j10or6j4r3N0J97k65P2J55Mj20J62j35J46K3j55p6R5J18j69J02J4K8
4301F3q7k25K35k38J86J92r9j27M3R9L9k1o0k7M8J7K6l7j30R8K4n6J69j20j16
4326a04K3J99q9L3k19L49j08j78O2J76p9k3j3j03J35k3k60L3M36l13l1J59j82
4349a20J25M8j67K63j36J19j58R4P5k20R8L8j24L9J47j42q4J30L1k8j69J0J93
4372F2j5J7k32L73k25k5r3L2J58n6j12J21m6PN5j17K21j56p3l1L23r4k07J40K0
$$ y = [-19, 18, 72, 90, 173, 36, -186, -81, 114, -117, -87, 89, 47, 76, -206, 45, -215, 237, -181, -23, 49, -208, -12, -34, 178, 56, 33, 62, 72, 22, 52, -129, 8, 254, -47, -121, 8, 206, -8, -128, 138, 180, -118, 0, 44, -11, -34, -19, -66, -146, -42, -100, 93, 43, 55, 132, 130, -61, 68, 103, -212, 11, 122, 39, -7, 165, 5, -72, -19, -7, -37, -48, 23, -39, 136, 26, 20, -76, -90, -183, -133, 64, -201, -129, 26, 30, -90, 72, -63, 83, 106, -49, -125, -30, 88, -81, 21, 35, 63, -24, -249, -14, -252, -66, 126, 27, -100, -57, 42, 81, 60, 0, -27, 21, 38, 64, 27, -103, -5, 19, -37, 132, 12, -104, -81, 118, 29, 62, -157, 192, 84, -94, -32, 144, 65, 42, 29, -74, 61, 38, -222, -189, 247, -66, -97, 62, -120, 5, 53, -114, 149, 13, 132, -26, 68, 143, -77, 21, 59, -65, -26, 121, -21, -105, 25, 56, 28, -141, -131, 62, 47, 64, -168, 205, -20, -45, -138, -106, 52, -4, -116, 5, -41, -34, 21, -96, 125, -31, -104, -135, 188, 94, -113, 27, 47]
4397D7j46J11r9nN0J0j56J05O2j3M8l6R6j55n1R0j7l8P3N7Qk79K19Q9m8j74rK55
4425I4n1K4o4J26j25J1j11J94L17l34l78K70J08M8j85P4L9j8J32lk8m7Q0j92J73
4450A54k3k35K9J71p4k5o7MJ09j26o5J20O7l2N8n5J66j77O2Oj54j8K47K8j14j14
4476e8J16Q2r1j89J27J57j35p8M7m3R9j20Qn6K89j05j14J35j5j45r5M03l15J99
4500A03q1J6j8n8Pm1j4J45m1k8l3O7K4J94l88K23p2J02j5j74J70j1N3k19J45o3
4526gJ14k15N6J02M1j79Q8QR2p0r0P1qj24K06q4k4N1K8q6j9J86M2j64j36K13j62
4553g0J57j96J6J17l3l4N2j07k5J47J07l59K31j0Q5l4k42K36Kk08L54k28J91k22
4577g3J12J11j37p0k0J82k30l2R5R2j63J31L9k6k2j01K0l6K14Q0k26j85L42j47
$$ y = [47, -99, 12, -87, -92, -42, -32, -188, -83, -21, -34, 14, -22, 74, -81, -132, -42, -59, -97, -24, 33, 41, -238, -19, 70, 22, -152, -161, 94, 43, 67, 3, 129, 4, 15, -96, 98, 415, 81, -297, -27, 81, 129, -56, 18, 57, 39, 171, 168, 140, 93, 173, -19, 154, 131, -104, -75, 96, 22, -3, -70, -66, 43, -83, -148, -28, 39, 7, 65, 10, 176, -1, 61, 67, -87, -105, 142, 170, 56, -58, 58, 140, 49, -140, -13, 144, 9, -69, -22, -65, 34, -86, -78, -134, 155, 50, -64, 71, 56, -89, -184, 219, -96, 103, 22, 38, 20, -38, -31, -72, -86, 59, 18, -10, -43, 24, 48, 242, -146, 77, 5, 107, 92, -82, 88, 77, 130, -89, 56, -7, 107, -108, -52, 50, 91, -88, 0, 8, 100, 30, -60, 11, 3, -121, 85, 1, -23, 28, 56, -30, -49, 137, 179, 15, -121, 92, -70, 87, -109, -93, 24, -9, -43, 9, -98, -123, 24, 131, -228, 3, -7, 78, 44, -198, 38, 40, -168, 186, -42, 149, -73, 39, 150, 13, -57, -77, 105, -125, -157, -62, 30, -133, -2, 37, 11, -11, -112, -92, -128, 86, 166, -60, -245, 97, -50]
4601e0M6j25J26o7Jj8N7R1L7kk7K8j48Lj20K41p7l1j58J16Q3J5m2M3j5l1K8R0
4629I4j51j18J93L6k94K05P5n3P0m6L5k04L5L9p4M07k26P4j8j09J08N2O5j68n6
4654b9n9J79j14M1j87K06l3j07J86j06O4M1m0j04J22k32K79j79j1j33K08J02j42
4677d8j8P6rJ5j94K4J20J95rl78K12J62k41M0l4K49j11j76K27r7l4P0l40K30M0
4702b9J79j61j61J49n2J43p7j38l0L30k67K80j33Rj20k6J01L0J64j22r8J26k4
4725G3J13k41J42J43k77O5r7J31N6j23j79K24J17k37K32j37o1P9j96K03j39J91
4747H2j61P9O2q5R2m5R1L9j17J62j25J6J02j56j20J41p1j40K10j84J52N6r0q4
4771i4J84j41m5J32m6J10J4l2j68J50lp1j62L05m4k03P8k33M66j01k33J33j47
$$ y = [-50, -4, -129, -3, -70, -69, -87, -30, 61, 98, 96, 69, 97, -51, -48, -168, 73, -4, -35, -193, -77, 6, 21, -21, 22, 7, -24, 4, 94, -57, -175, 18, 54, -240, -35, 40, -13, 57, 11, 46, -158, -123, -84, -158, 249, 23, 97, 79, -30, 78, 130, 195, 27, -29, -88, 91, -23, 18, -169, 37, 4, -103, 83, -23, 41, 82, 42, -62, 60, -172, 107, -72, -83, -216, -8, 94, -48, -66, 10, 1, 16, -178, -154, -34, 161, 152, -226, -14, 148, -93, -53, -87, 162, 51, -125, 102, 5, -29, 41, -299, -69, -29, 150, -11, -172, -23, -75, 68, -9, -147, -177, 153, -114, 166, 33, 42, -78, -104, -3, 27, 191, 69, -29, 97, 73, 186, -55, 87, 230, -47, 18, -79, 52, 108, -15, -194, 30, 147, -90, 142, 5, -56, 23, -173, 30, -109, 82, -79, 0, 62, -23, 69, 24, 115, 154, 37, 199, 74, 90, 192, 36, -84, 57, -14, -154, 56, -128, 24, 80, -10, -94, 90, -51, -96, 36, -10, 100, 114, 82, -86, 64, 61, -10, -172, 133, 89, -114, -36, -269, 197, 96, -137, -4, -151]
4794a51J61j46O9L3r9J63k7r0J52j28m3R5l4J60N6j57M0p9j15K69l08Q7O5J2j71
4819a86P7P7J79k19k2J20J5j11J51p9K8Q3k24J4O4J28q2J42q6l0l5n3P6K3J03
4844A53k09J86J6L4k49l7J51Q8j26K06k91J1P7M2q8K6N2l6L5M3r2K15r9j74j12
4869a78J69J00j60M8pj1p3J33j40n1K86r4N7p1l1P4k09J36l9K3R6JO3j37O4J1
4895F0j26J7K11L7q8j60J06j65J07l4M0m1o2K42k40Q9P9j44pK37j12j68J73o9
4919a8j05J81j01K2j7J98k63M6J71o2j02K2M7P7j43N8K4j16K1K1K04p2j53L13
4943B53k67J06k10k7K65k17R2L6J03k32R4K0m3P9j15J76j35K82l41J2n9N1J90
4966A13o2K48k52k25K23j45J34j18P3p5Q1n1M9j6%L3o0K26j04j09p3J18j06K4
$$ y = [-151, 10, -136, -67, -34, -133, 30, 3, -87, 65, -63, -106, -11, -45, 115, 171, 14, 54, -25, -140, 129, -179, -92, -27, -15, -186, -109, -32, 147, -72, -94, 26, 41, -70, 81, 2, 30, 113, -111, -97, -33, 95, 13, 155, 69, 39, 4, -49, 27, 50, 153, -56, 130, 146, 180, -69, -106, 45, 133, 7, 213, -78, -67, 10, 52, -36, -10, 42, 6, 41, 84, -8, 207, 108, -66, -178, -9, 91, -69, -21, -28, -39, -112, 21, -119, -170, 116, 22, 79, 8, -23, 51, -158, -22, -61, -38, 58, 59, 122, -15, 49, 60, -66, -49, 162, 199, 111, -49, 57, -108, -1, -35, 5, -36, -98, 144, -96, -7, 72, -72, -79, 158, 46, -122, 51, -18, -123, 58, -43, -21, -38, 160, -103, -57, 114, 52, -50, -28, 19, 96, -47, 11, 35, -81, -60, -39, 165, 93, -60, 253, -14, 92, -118, -145, 120, -97, -5, 31, 134, -98, -4, 16, -27, 52, -63, 113, -22, 260, -81, -69, -128, -77, 113, 51, 299, 47, -178, 45, -100, 34, -84, -11, -86, -5, -56, -7, -23, -23, 10, -50, 176, 72, -37, -110, 8, -98, -74]
4990g4J94k76Q1R0r2q9L15r4k24J97J5o0J6J20l00L27j57J50j23l0K8O3L2j81
5014g2J25j12J40j05R9K0j53J15r5K5Q7l9j38j24M60k93r3J21J88m9j55N5J21
5037A28j3j23Q7r7J57k78L6K04j75L0J89k08R7jJ01k73J39J4q3J77K8j02J47k20
5061c9m1K5r2J31j44L37k01m0j46J38J85m6j45R4p1RL6l4M7N9O9j40K1j08KjN7
5088c8n6K44r3p7j02J57r3J1k6P0jm9lL2Q2j85J90k19J62M3j37P5J25n1l1o9K10
5115A71k88k0o4J14J09n9K27k07j9N5L4j92J07K8N2p0O7j15L3R4j04K10l03J69
5139B9n8oj3J17m0n3N8Q7j9m5j53J33m7J4R5Q7j70J1n8j8J30j99J39nO1k57J26
5166e4Q2j52J68p0J4k20P9J70r9J20N2j0q9j7M4kL3kq9O5k5K2o5J2J28p4n4m4
$$ y = [-74, 120, -156, -75, 15, -77, -166, 149, 55, -169, 28, 43, -17, -1, 119, -181, 146, -11, 139, 16, -14, 14, 77, 109, -72, 53, -59, 81, -24, 75, 95, -58, 57, -38, -13, 74, 35, -103, -227, 233, -60, -153, -32, 156, 107, -48, 7, 128, 115, -8, 79, -18, 139, -139, -103, 101, -74, -44, 145, -63, 34, 33, 134, -139, 0, 14, -69, 108, 136, 34, 181, -39, -80, -55, -147, -16, -160, 177, -24, -64, -210, -72, 113, 67, -78, 16, -55, -46, -10, -44, 3, 62, 131, -9, 12, -96, -94, -95, -38, -94, 150, 57, -20, -122, 35, -58, -47, -73, -3, -4, -53, -56, -24, 58, -127, 63, -156, 6, 49, -88, -13, 112, 61, 30, -39, 171, -117, -137, -201, -87, 22, -37, 190, -17, -36, 19, 53, -139, -32, -4, 48, -22, 45, -70, -37, 57, -47, 163, -140, 29, -29, -35, -48, 69, 29, -24, 34, 121, 102, 57, -96, 37, -10, 4, 99, 186, 16, 27, -31, -49, 81, -118, 21, 16, 77, -180, -54, 28, -124, 44, -26, -12, -232, -153, 17, -82, 38, 90, 80, -9, -26, 18, 16, 49, 47, -42, 23, -2, 20, -45, -33, 95, 21, -33, -77]
5194g7P7p0K28k66J91J29j12k6N4o0Q4k45K27k48J23l1j77K38r6N9O4n5O6J11
5218A88k02n2l4M1K12j99l9M0L2K20k91k0J71rr3J03r2M0M9j89J98j15o9J20P5
5243H5L4r7J25j28m7j2l6l9N1J19j48m4J14O7j61L0K13o7o1p4p7K06M6n7j44J59
5269E7P9j14O5j50oj00J56j23R9N4K1j75J76M5O9j45j09J11o1J39j05k1O2m8j58
5294a82K56l5j36J06q9K8K4N1j95lK85L4j49M6j49K16k11K60r2r3P4l6kl8J53
5319A23o9j75J44J3j96K20j06J87j42Q8m8N7q6j37P8j30J85K5P7k24J96O7k61
5342a14K6N8J98K4j34j17r6J48J14j11K5J04r0k02K77q6J1j83J2J0J63q7J22k7
5366D5k10J83j05k3J70j26N4j67J61P4Lk2j02O0J39j6j23R3j89Jk5J65P7j38m4
$$ y = [-77, 0, -70, 158, -108, 83, 212, 100, 74, 128, 68, 152, -93, 134, -114, 9, -22, -199, 39, -57, 2, 66, 11, 77, 188, -14, -66, -100, -59, 153, -46, -85, -45, -13, 207, -84, -104, 67, 58, -35, 68, -24, 16, 65, -124, 74, -41, -110, 10, 85, 119, 22, 147, 19, -28, -40, -76, -115, -64, 55, -93, -137, -23, 44, -117, -87, 126, 59, -2, -76, -153, 53, 99, 42, -102, 57, 136, 22, 87, -63, -69, -169, -13, -136, -37, 17, 38, -137, 39, 84, 153, 8, -101, 10, -51, 88, -17, -38, 24, -24, -182, 74, 39, -97, 9, -80, -52, -28, 23, -172, -175, 110, 144, -5, 41, -108, 108, -103, 157, 65, -28, 46, 10, 8, -30, 123, 54, -121, 23, 36, -160, 60, -46, 141, -1, 87, 39, 96, 10, -127, -49, -179, 6, 31, 108, -116, 80, 147, -114, -88, -30, 168, 192, 58, -59, -155, -7, 107, -4, 21, 125, 35, -167, 110, 24, 35, -148, -136, -126, 37, -50, 72, 45, -165, 18, -87, -110, 60, -66, -12, -179, -18, 56, 59, 37, -65, -5, 134, 118, -5, 88, -101, -100, -125, 40, 117, -21, -65]
5391f5j56J71J32n9o6J34m7k88K41J08r0l2n2n9K23k4l2J50j08L0q9J92k56Q6
5415D4j75N3Q6l8Kk4K6J1l2K33j13j45o8J41j15M3QJ18N2j49O5j44k5J32k7j9
5441f0N1M8J0r6J72j68k0l4q0P9K99k77R5P2K3k13N3J31m0M8j07RO2p0o9J1J51
5468H0k68P4J26r6N4J55k47K16j46J22m8o1O0N3J00j60k6l2R1j42J30n5j00L6
5492h4N0n8R3P4q9j28k2Q8m2R7J00n7Lr5O9J04j13J34Kk31J23j24K9J09j15O2
5518b1P8j11J8Q3l8%j51R0K2PM7L8m4q7J74n3J68k31O9j10J2Kj30L1J13p6J03
5545CJ71k27j3J84L4k67O8M1M6J67j35j7K9j68L0l0j0J09l4q7K57o7M8m3OJ08
5571B03q3j91k9K01m7n1QK77l26k5J4m0r0Q7J08k4j4Rj6M3j2J13q7Q4j09j26J06
$$ y = [-65, -221, -50, 82, 23, -43, 91, 44, -244, -3, 105, 15, -17, -69, -128, 95, 71, 39, 189, 81, 111, 22, 214, -42, 44, -131, -78, 8, -30, -28, -52, -26, -15, -47, 186, 73, -72, -140, 1, -114, -71, -63, 55, 107, -42, 23, -121, -146, -14, -41, -60, -9, 39, 49, -47, 125, -43, -63, -97, -177, -98, 201, -76, 19, 91, 114, -99, -46, 85, 45, 93, -14, -5, 57, -13, -82, -71, 80, -188, -114, 12, -84, -30, 125, -122, 94, -52, 70, 22, -39, 21, 74, 174, 14, -12, -44, 47, -95, 35, -20, -120, -84, -34, -92, 1, 75, -14, -142, -164, -76, -118, -21, 79, 22, 25, -70, -1, 103, -10, 124, 126, -105, 18, -106, -77, 32, -83, -21, 57, -54, -36, 47, 9, 9, -142, -52, -30, -23, 24, 62, 18, -69, 105, 52, 220, -11, 58, -52, -40, -38, -168, -137, -24, -100, 3, 174, -53, -66, 118, 152, -115, -47, -6, 40, 207, 72, 55, 84, -84, -54, -84, -94, 15, -19, -106, 151, 84, 132, 89, 95, 203, 120, -71, -100, 101, 54, 3, 11, 288, -38, -63, -49, -89, -179, -92, 16, -8, -22, -13, -29, 14, 2, 115, 28, 112, 3, -123, -17]
5598a7Kk3J60j16r7J2o4K33j62J71k21K25k98K23J07p3O4l9K6pj55n8Q0J78k23
5623g2K6J41k48q7K34J37j07O5m9M3j07K50m28O4M7K3O9O7j34J17j1j00J09n5
5647fJ5O6m7o6K4J00j75m3K13k34K86j24j7j1J84j81o6Q7J2M7j46K80k93O1Q6
5672E2o5L8l5P3j23J21Pj59J36j61p8m6M17l15O8L4N3j41QJ12N3j3j56N7K34j01
5698G0N8K4k49J06K8j60J60l5j9Q5m0M5o0JJ9r7N1k1J71q8l3j17pO1JmJ64j85
5726g1J47L1n4m4j31m4K71j45K02j28N6j89k2R6M7k56K67jj0lj1R3rj34n5J34
5752C7Lp9J00j03p5L37k55r0J58L2j26K9Q2j5K4j05J62K7j64J03Pj87j15Q5J65
5777C7N7m1j18J0J3j3QL9J61J4k14K97k23p9Q7r8j4Q8q1n7J54lj20L9j4J59j93
$$ y = [-17, -15, -38, 122, 6, -91, -79, -143, 90, -72, 99, -122, 103, -195, 28, 135, 62, 126, 87, 113, 106, -49, -107, -27, 151, -72, -46, 95, -153, -240, -6, 131, 24, 89, 40, 83, -24, 226, -202, -138, -91, -68, 1, 68, -66, 51, 40, -60, 49, -6, 9, 75, 28, -38, -14, 86, -89, -132, 81, -153, 133, 9, -8, -19, 165, -16, -82, 5, 17, 64, -82, 198, -95, -34, 52, -13, 25, -10, 63, -60, 61, 68, -91, 45, -116, -194, -240, 177, -138, -70, -36, 17, -124, -116, -4, 49, 36, -120, -63, 171, 70, 128, 152, -97, 9, 37, -123, 37, 2, -17, 68, 28, 73, 13, 14, 33, -64, -13, -34, 137, 49, 16, -101, -108, -47, -46, -50, 114, -71, 76, 107, 53, 9, -122, -166, 105, -40, 162, 34, 90, -99, -121, -25, 22, -234, 33, 32, 22, 19, 8, 101, 92, -42, -97, 37, 40, -39, 61, -42, -117, 220, -35, -125, 33, 65, -61, -32, 50, 35, 59, -46, 116, 143, -21, 82, 89, -98, -213, -128, 37, 94, 53, -65, -55, -42, -55, -47, -8, 153, 167, -47, 250, 27, -52, 35, -63, -77, 11, -70, -127, 27, 24, -96, -57, -71, 88, -105]
5804a05J39j07K39j70J0l1r0N3J33L3k72J18q2J2J0m4J04J95L0k17J70q2q1L6
5828AR7NP1j19j48o3M12k75J8R7J6k61K42j30r9J47Q5j66m1J30M1j42O0j0j6J03
5854E5l1P5N9k17q0K75m07K34p9J24j72Q0R1R5o2m4qJ30k51J09PK9j33J25Q5p2
5880A7j07J38j39K24j76qJ84j02k1K6j94O9L4k7N3%M4j77J39j6J94j24j04m6J8
5905a01K01p4q6J83j46K9p7K01k15P9K1n5q3L8J99r2nM7J79k45j01J01O5j76O0
5930e3P9R9Oj73P5J6j52O7j35K8J40j60M0R7J30j13l5P8J4j55k0L9J15J7n8O2
5956D8M8j49N5J24j84M0J6P5M3k62J36J8R2k0M9j22M6k12J49K0J4k2j12M8mJ48
5982H2k74K48J71k45K2p8J03k5Q2p1J30j33q3p0O8K40j20q0J55p4j17J51L6J17
$$ y = [-105, 34, -73, 166, -4, 6, -25, -115, -62, 71, 104, -168, -50, -132, -120, -110, -154, -50, 145, 175, -42, 128, 46, -35, 1, 98, 103, 174, 55, -93, -156, 256, -19, -1, 96, 112, -149, 93, -37, -136, 11, 96, -70, -111, 19, 60, -82, -22, -32, -48, 55, 24, 99, 158, -59, -139, 136, -271, -37, -116, 8, -164, -84, 7, 102, 40, -4, -12, 118, -133, -24, -17, 12, -121, 4, 89, 17, -90, 48, -91, 133, -43, -51, 133, 31, 10, 36, -158, -89, -55, -82, -29, -29, 15, -162, -23, -39, 155, 31, -73, -119, -101, 100, 26, -60, 123, -23, 6, -71, 130, -85, -6, 15, -40, -123, -85, 114, 22, 17, 64, 243, -2, -103, -2, 63, -113, -53, 26, 125, 131, -42, 33, 49, -103, -36, -171, -143, -3, -163, -123, -26, 104, -9, -44, 34, 48, -107, -127, -88, 27, 44, -14, 48, 96, -53, 2, 126, -58, -18, -2, 73, 116, -146, -10, 8, 100, 80, 129, 7, 53, -159, -10, 10, 24, 2, -110, -62, -66, 82, -192, 56, 227, -18, 4, -74, 29, 4, 86, 15, 145, 12, -71, -141, -73, 167, 47, -33, 122, 48, -69, 82, 118, 235]
6006B35l76J50j44J36k2l8O3P3j2l6m9M4J83m23O0K22j97J77j05K4r0j2J81N7
6030A01K1k29M8J55j01j23J55oP6j56J12J3j95L56k18l2J3k08K04L8j5R3l1j13
6054d2J39ol9L9j36L4j0O1k08J35J00k61L71j28o4l9j41K23j90K07k04K23N8k4
6078I8j1p7ML4J92k71j85J47rn4P6j33K28l4j53J5k2K29J1o1p0kK2J17j55O5l6
6105c5m8P4L3k15J70n4Nk3K46o5r2j01M8Q0K1m2m2P0l3k7O7k71K10J9mq4R2j01
6133a02J39RNR8k6j10k18J67K7Q0P8j78J77j12o9l3J7J85k12J09n8q5Q8J35o4
6158D7l6J97j54L8m3l0ql4o5Q8M2l9L1N8l5J29l03J99Lj90J45k03J11j18K34k2
6184D2q9O8m3m3J59j61k4K0P4N0k30K85j54M5n9P8j68k9J73QJ4j17K4M6J26k99
$$ y = [235, -141, 9, -135, 1, -21, -59, 4, 77, 65, 29, -20, 24, 207, -216, -156, 66, -131, 46, -59, -35, -125, -137, 44, 101, 122, -107, -59, 96, -5, -128, 27, 21, 97, -59, 53, 66, -129, 227, 9, -23, -10, -218, -14, 24, 9, 102, 71, -42, 97, 91, 52, 91, -45, -11, -21, 40, -168, -33, 67, -194, 177, 49, -15, -54, -195, 28, -162, 45, -159, 64, 122, 98, 87, 10, 14, 48, 240, -31, -216, -69, -78, -132, -56, -189, 39, 5, -148, -133, -155, 74, 85, 24, -46, -48, -26, 91, -64, 1, -35, -83, -9, 24, -191, -21, -75, -70, -93, 153, 88, -4, -105, -57, 23, 44, 2, -40, 30, -3, -30, 37, -234, -24, -5, -9, -93, -1, -102, 37, 46, 51, 149, 123, 13, -205, -38, -11, 69, 147, -31, 146, 34, -35, -68, -51, 134, -78, 31, -27, -112, -24, 111, 47, 11, 208, 54, 92, 49, 19, 11, -23, -88, 0, 42, 3, 34, 92, 57, 186, -117, 82, 85, -105, 40, -163, -52, -170, 64, 42, -47, 21, -22, -65, 94, -67, -91, -71, 3, 53, -177, 108, -46, -1, -60, 18, -150, -179, -6, 2, 16, -101, -77, -31, 95, -204]
6210b04Q3J91j00J08j80P2J30j64O5k4r7P8K6o5J08j51J99J9q8j42lQ0m2J65p8
6235a4j10J47PJ1J61k35N3N7L9R4m19J21J41n5J83j90N6R2n3k09J20o9j4J23k31
6260a94K22Rj73L10j42j02Q9rN2Oj33m0Q7J23j21J38j99l6M4Q7k4K9p1K98j84
6285F6k42J82q1K6p7R7qJ47l63J79l5J86j73K18j29N2l5R7j56J7J1R7j37J45J4
6310I8j13j62JJ68Q7kJ59l30K29r1r4m4J71j60n5P7J27J58l78K50j96LK11p7j90
6335a53J13j81L86o8j79J6Jk22M02P5k80K4J16m7k7J76j07n4P0pJ05k62N8K78
6359B33k73j9j62L09j77J81j30L2J02m1Qk35L99j88P9j3l2q8pO3j97J08n9O7q9
6384a29J14q7J20k8o8k0P4J62j53J0Q5o2l5RK37k00j01P8K03j32j74P5J27k8q4
$$ y = [-204, -121, 70, -30, 78, -102, -30, 100, -64, 1, -23, -120, -42, -16, -81, 27, -124, 75, 94, 6, -136, -139, -59, -101, 64, -14, -124, 23, 30, 41, 202, -33, 20, 77, 116, 210, -209, -88, 53, -2, 181, -9, 47, 139, 86, -123, -3, -72, -86, 37, -194, 28, 37, -136, 174, 32, -70, 19, 10, 62, 68, -65, -105, -18, 105, -16, 122, -77, -113, -69, 18, -6, 23, -48, 250, 66, -176, 6, -75, -49, -126, -29, -37, 110, -253, -74, -109, 77, -96, 122, -7, 45, 10, 107, -49, -32, -21, 76, -61, 84, 98, -15, -177, -176, -8, 79, 77, 236, -94, 135, 44, -50, -94, 77, -83, -138, -61, 66, 224, -154, 96, -100, -97, 114, 37, -153, -40, -221, 165, 97, -82, -66, -65, -287, 115, 190, -90, -66, 50, 3, -24, 152, 45, -9, 61, 54, 159, -103, -45, 233, -40, -59, -221, 88, -89, 92, -38, -6, 96, 55, 63, -172, 227, 39, 118, 105, 73, -15, -22, 41, -156, -48, -107, -40, -129, -15, -102, 18, -10, -78, -98, -24, 138, -15, -5, 80, 18, -17, -8, 229, 29, -72, 6, 209, 77, -97, -22, 105, 77, -7]
6409gn7K85j05k34P5J8R6n6N1o7j71M3L6J37j45KJ76q1l5P8l3m5j02K50l0k14
6435a35K06q8J58j1p4n9O6K4j0j39jP6o2p1Q7J62j38M8j2K6J29j37oj30J28o7
6461c0oJ0Q7j16K45k71O3J29j29k8L0k1lJ75k09j09J30J02q5J47k18J22n2j8J61
6486A06j0O0r8j56N9LMMJ07j65o5l0K48p4n6Q5L8j59Q0l8l3K26j45J1nj6n9K16
6514A38m3q5n6M2J6nP5m7N5j42n8K62m7j69J28j43J2m7J57k6k24J69j8N2m1Mn7
6541i8j98K63P3oL1p1J29j81o8K05k08J28N4j32J30j54K16j02j53K19j11r9P5
6564e8k4J81j0J9q5o9J41j9o4N3M6j87Q8M4J38j19k06Q3J39r4j97j1J71k6J66
6589A00j7j65r2J64j08J18J8J5m6q6J22Jj3j36Pj80K58nJ19j35N7j39Q4R2q4J9
$$ y = [-7, -64, 221, 116, -118, -43, -25, 71, 15, 66, -1, -172, -129, -93, 44, -101, -99, 77, -4, -39, 39, 6, -39, -141, 109, 79, -135, 71, -17, 141, 130, 56, -3, 63, 87, 77, -62, -63, 13, -49, -120, -33, 129, -9, 39, 27, 53, 182, 45, 39, -91, 37, -30, -36, -26, 61, -55, 190, -81, -18, 111, -18, -46, -16, -37, -40, 135, -74, -183, -53, 49, -36, 111, -107, 15, -37, -55, 106, 96, 156, 58, -98, -39, -36, -32, -28, 79, -86, -151, -181, 67, -7, -63, 22, 60, -99, -19, -57, -90, 136, -9, 2, -3, -19, -78, 138, 95, 10, -46, -4, 12, 7, 82, 35, 90, -52, -110, 152, 105, -64, 64, -79, -67, -114, 43, 17, -207, -38, -56, -4, -45, -41, -98, -296, -33, 40, 34, 65, -6, 123, -58, -126, 79, -129, -1, 53, -79, 51, -103, 113, 11, -142, 77, -34, -133, -58, -82, 99, 89, 108, 23, -46, 95, 76, 12, 65, 111, -76, 12, 56, 194, 75, -131, -48, 91, -3, -200, -211, -40, -66, 100, 83, -82, -174, -10, -118, 0, 18, 33, -13, -99, 23, 24, 11, -125, -118, -298, -40, -45, 74, -61, -4, -143, -59, 33, -51, -32]
6615c2R8r7q9J27M6j40J50q9J82k31o5Q3P6J98k67pL7J13m4jj90J38K9N9R2j32
6641D4N8l2j02J01j52J51k89L31j19nj7o0J23j11J62j38N1Q5J2n6j73K11j77Q4
6665a8q0K04k8M5j97p2J26R5J27k08L0m2j2LJ06O6k16J16k80J78K1o0J21l7p4
6690h6p2J31O6q2K33j52o3K4M1l1k03J43J55m2j21J18j31J00R9j50mJ05j41o7
6714a30J41P2j56J21m0N8l7p3Q7j01L16l14J32k09J0J58J1q4J51r6n4Ok0o2Q6
6739b7Q3j29J95l02L66j85Pj41L97l35K4q1J39j42J67L5O0l87K70j0r2K36K3j76
6763ek3J01j29j1p8J73L2pj45K09o3k8q5q8J34K92l65RJ64j40k3k6K23oj54K0
6789a9p2J56ql20K39j73J53J8Q7j24K5J34L7j38p4J48Q3K6l57M8K24m9L4J32j25
$$ y = [-32, 66, -31, -120, 7, 53, -87, 63, -26, 156, -75, -140, -57, 19, 217, -50, -57, -20, 93, 49, 48, -142, -4, 25, 84, 176, 44, 102, 70, -32, 69, -83, 68, -221, 110, -9, -14, -31, -91, 32, -79, 83, -55, -4, 81, 93, 37, -136, 75, -102, -18, -98, 106, 78, 123, -74, -146, -20, 75, 202, -6, 24, -18, -30, -27, 79, 145, -71, 45, -235, -57, -36, -96, 25, -12, -86, -158, -27, 39, -43, 190, 38, -25, -1, 40, 9, -194, -51, 104, 62, -59, 59, -72, 28, 127, -23, -27, 78, -63, -130, 11, 83, -73, 48, 8, 66, 29, -44, 43, -58, 258, -56, 76, -133, -123, 35, 46, -38, 113, 17, -37, -31, -51, -113, -27, 56, -73, 122, -180, 186, 1, 8, -133, 264, -71, -47, -128, 11, -131, 36, 71, 131, -256, 14, 4, -88, 148, 171, -5, -28, 73, -56, -67, -145, 28, 60, 53, -92, 117, 54, 26, -59, -147, -13, 279, -86, -77, 87, -53, -76, -102, 121, 115, -39, -19, -91, 65, 57, -263, -24, -197, -44, -26, 61, -63, -38, 96, 133, -5, -79, 69, 152, 178, -179, -131, 93, 44, 78, 210, 85]
6814H5j79K52j52P8j00P3j67M2K8J11j07j57J79r6O4J1M1j4K51k23J48k4p3l6
6838C5l4k31J50L36k73R0k02L53o3k01L0P4j36K04j68J5Q8j01j2j60K40p8Q3p
6862C2j19J24oJ22j10j09M2l8j2P0j88q6K24J47Jk45R7K4P3p4P5n4p9K74j37l0
6888A8OQ8j36K2Mj63K8K14l5p2J22j21ql0J42j47L6J35k14K00j90K61k4k02K05
6913A39o6j87j7J56q4J67r0j57R8J03r6j24K52J02m09J20J49M2k14K26k07O6O1
6936C0o3R6k1j28J03k7k5rO2J18k14R8n2L4j62J86j51K00j47p3J75R3p4j9Pj51
6962a14J49J53j44m7k2J47j89L0K4R4l2q4N1j4j61J31J59k47K44k02l7N5p4r6
6986b26J12Q8P7k5k0p3J14o5j05j9J92J07l21K60l5L2k6l0M7k6m2k20L68j78j11
$$ y = [85, -94, 158, 6, 84, -16, 57, -110, -68, -40, 71, -36, -193, -14, -110, -46, -35, 6, -8, 243, 20, 168, 144, 71, 35, 1, -230, -80, 256, -17, 73, -129, 224, 161, -40, -10, 64, -72, 132, -36, -21, 67, -34, -46, -206, 34, -44, 39, 32, -87, 37, 31, 153, 43, -66, -24, -62, -74, -4, -192, -278, -54, 93, 94, -151, -54, -30, 43, -31, 44, -10, -89, 185, 48, 18, 24, 112, -24, -2, 2, -161, -133, 81, 46, -26, 96, -25, -33, -63, 79, -68, -32, 103, -111, 89, -101, 160, 136, -66, 139, 73, -114, -131, 25, -59, 108, 18, -139, -41, 62, -34, -158, 94, 196, -213, -93, 56, 98, -116, 110, -97, -31, 30, -33, 63, 42, -86, 17, -10, -35, -44, 18, 136, -78, 20, -32, 2, -160, 26, -125, 75, -72, -145, 30, 123, 49, 30, 37, -114, 35, 188, 44, -3, -25, 122, -67, -37, -13, 81, 49, -35, 16, 2, -159, -28, 131, -116, 128, -74, -111, -56, -130, -226, -114, -26, 51, 26, 6, -67, 47, -18, -123, -142, 50, 157, -164, 96, 61, 93, 67, 37, 84, 58, 16, -204, 164, -14, -125]
7011a25J11J9j4j9p1J00R7q2r6K14j40p7K8K0l7J6N8j42R9J02N0r7N1m4j01R2
7037A2r4R0o8L8J60j55o9J55nk2P4PN2j38q8k1Pk4n8m6K87l9j2j31P2r5K24j14
7065ak3l9J41r8O4n8O4J06l59K39p4J59j1l5q5J17k44K7J69q4J48mj15o9K8K4
7091a3m1o3P4R0Q6j82L3K06k04K07j11j10o5J26j20M4N4N3n9k9K23k97J03j3O0
7116E2j42K40m0l31J99m4L6q5N1L0J45j49N9K16l33M2MJ68m1q9j03J88j37J00
7140C6j0m6J79j82R9j46r3K14r9j21K62o4k07K66L2j74Q3o0N8p2jj53J73Q6r7
7165c7J33r3q0J35j2P3n0j03K6r2m2Q8pL0O9j02M7J17j40k4j1J12k8K08m5k01
7191b9j64J10j9K68o6r8j13M04k77k7k4Q9k8L9l0k8P6OMj54o1J41m0J53j63NN0
$$ y = [-125, -14, 5, -9, -28, -99, 1, 98, 16, -80, 134, -6, -83, -55, -35, -72, -56, 2, -140, -41, 61, 111, 14, 65, 21, -80, 12, -82, 8, -60, -22, 138, -17, -86, 69, 64, 42, 116, 123, 175, 37, -51, -72, -65, -89, -147, -193, 94, 55, 43, -88, -16, -111, 113, -1, -24, -63, 78, -20, 44, -14, 50, 156, -203, 36, -38, 121, 110, 75, -10, 107, -137, -110, 59, -25, 123, 119, 4, -65, -37, -13, -54, -117, -43, 47, 133, -49, -16, 190, -14, 193, 82, -28, -93, 33, -87, -43, 11, 64, 5, -24, 199, -98, 5, -8, 52, -90, 150, 110, -221, -22, -66, -30, -115, -64, -34, 111, -38, 21, 237, -96, -54, -50, 118, 77, -12, -115, 73, -64, 36, 26, -20, 159, -23, 76, -70, -163, 51, -48, -169, 93, 29, -178, 88, 120, -54, 29, -31, 27, -45, -46, -199, -26, 60, -37, 96, 3, -77, 58, 46, 119, 69, -34, -8, -100, -142, -54, -61, -31, 38, -64, -17, 100, -40, -64, -75, 37, 9, 217, 172, -29, -193, -83, -102, 166, 100, 2, -111, 293, 16, -11, -35, 54, 26, 65, 35, 7, 83, 89, 93, -61, -122, 19, -21, 132, -31, -26, 24]
7218B4N2j64m7K14j27r6M8K91j2j63K9J35j87L9j21JP2J1M3q7J16j63J86j45n0
7243a01J33q7R8j80M2J7P3P1L3j91J14m5J27l11J24Q4N0j09N4K3J00j11L0j10
7267g2J21o5O3r2Q9r4J4J11q2oL0J89j11j53O6r2k0P6K16j06j92J77k55L12j48
7292b4q4l6J63nj09N9j27J28J07q1L5R3j64J5Q9j39J31nQ2n3j61o3J60l3l6O0
7318BL6m3Pj22P3l9m5K18o3o0j0N4r6J52k6j21Q6m6q6K7PQ4J37j39Q3p6O9j7j17
7347g1R1P6nk09kJ48l5J00k29J84k1n9j45K93j60J37j90Q2J60k8k9p9m3nRP3J0
7374E3l4p6Q2J1No0Q6j40J33j65P6n2L7N1q6J48n8q7p3K65Q0l41J75q8j81J04
7400a35J15j85K02M8k04P8K0Q9M0N7j10j81M0R0J8n4J74p4m5J20k40j05K48J2
$$ y = [24, 76, -88, -135, 79, -48, -144, -96, 195, 183, 20, 49, 184, -3, 36, -85, -84, -12, -1, 42, -45, 71, -92, 94, -51, -101, 32, -55, 43, -137, -95, -78, -5, 66, 99, -92, 22, -23, 104, -207, -83, 1, 51, -58, -4, 19, 119, 8, 38, -72, 49, -16, 47, -45, 44, -50, -36, 75, -7, -13, 17, 206, 95, -58, 8, -84, -104, -28, 188, 82, -110, 67, -188, 124, -24, -108, -144, 19, 14, -95, -36, -163, -35, 72, -9, 26, 119, -45, -30, 59, -80, 51, 46, 128, 75, -86, -149, 11, -22, -58, 2, 38, -5, 2, -120, -47, -86, -131, 87, 24, -36, -46, 8, -88, 64, 38, -83, 3, -43, -129, -102, -95, -11, 126, -13, 70, -6, 63, 46, -71, 20, 96, 91, -118, -120, 28, -7, 93, -136, 48, 27, -32, -177, 116, -44, 93, -97, -15, 145, 117, 88, 9, -34, -39, -30, 43, 53, 19, -57, 25, 36, 41, -19, 67, -73, 60, -105, -29, -81, -44, 7, -79, 69, 11, -76, -149, 116, 196, -145, 30, -58, -239, -135, -20, -205, -3, 45, -159, -81, -61, 28, 68, 125, 15, -166, -126, -36, -18, -72, 102, 28, -17, 103, -137, -242, 6, 18]
7424A8j10K2J64r8J01J26j87RK8m9j25J2O2L9J33k65J42q5P4K9j63J86j31P2L0
7449C4j3Q1p0q2K1J66j09k6L5Kj02m2J28Jp5j6K5j4jN3M6j4j57R4J56n9qP7l8
7478I3Pl8j15J14j57J23n2J65j47O1p1J30q3j5l2q5O9j06P2J78k25P7j0Ql1J23
7504E3j0o0K07k03J28k8n3j77Lk8n4J99N5k01K35o1O3j02J60j58L2J4N0nmk5L7
7531F7Q7q8r1J72m4k01J19L9LJ78k04K00k71j6J53n8j6N2j28K6o8O0R5n9j72L79
7557B14k59J42q3j55R8n2Q8J11o7R9r1q9K67l02J60N5j11l2oN9kn7l8J26n0j35
7583a10K82j25M7P8j98j45K19l5j65O1J85J49k51p4J22j45J02L9j16l5J94j99
7605a20J51j29j33K12Q3k08J40j39L5Q8N9j14Q9k8K1K6J62q0o0m5JO0j34M9R8
$$ y = [18, -92, -70, 94, -4, 97, 223, 36, 45, 73, 24, -101, -89, -27, 12, 145, -120, 22, -63, 11, 40, -123, 63, -68, 4, 34, 21, 102, 32, -50, -29, 137, 28, 2, 37, 39, -63, -105, 23, 24, -51, -67, -42, -56, -57, -4, 42, 28, -129, -35, 121, 62, 54, 131, 93, 100, 62, -53, 61, -96, 27, -25, 140, -7, 54, -17, 113, 30, 15, -17, -102, -33, -139, -67, 111, -114, -37, -47, -39, -70, 53, 43, -17, 190, -13, 115, 87, 34, -143, -140, -168, -222, -23, 32, -169, 66, 5, 68, -34, 126, -32, 0, 14, 64, 59, 55, 30, 67, 154, 66, -25, 147, 103, -98, 21, 60, 63, 241, 37, 237, -34, -50, 103, 45, 29, 81, -47, -21, -89, -29, 66, 7, -165, 214, -45, 97, 14, -141, -43, -95, -7, 104, 37, 136, 45, -44, 223, -79, 81, 136, 25, -7, -13, 46, 44, -13, -51, 75, 25, -110, 172, 47, 94, 172, -26, -171, 48, 13, -152, -91, 94, 243, -8, -82, 40, -105, -3, 36, -80, -115, 79, -120, 31, -98, -231, -19, 64, -144, -4, -143, -108, -20, 39, -75, 14, -14, 7, 33, 195, 115, 55, 10, 11, 71, -63, -14, 84]
7630H4r2k6R0j38K2l1Q4j45L8J17J30j69N9q5R1q8J8K7J7l8R8l0o0m7J72j95L9
7657e8k1K40j35M5Q3l43J47j7J77o7l2J58j77j0J23k21J74J2q1l9m7J05M1j94
7681a37K36n9l9r5K15k02J9O2M6J04Rr0q0O3j76N0J65j29j37K66o0m0o4p1P4J07
7707C7k1j39K04k21J99k9n2%M%Q0j67L37k09q3l4J69jq2K08k68J17J1k5j25P0
7733b0O4j96R5R6j34J00%j11J2J50K8j90J32k3r4J75k04K5K21J6J4j22K0nr0J23
7759H2j84J12M5N9j28p1Q9L05j15k49P3K3r9jJ70o9Q2k08K05j16J5m4J8r1J01
7784DR9k18J66k05N6J47k6PJ01k64J00P4j18Q9m0k9qM8N6P4j82J25k1P7k01P6
7810a3k6J07n6l7J66j61j6M8o6oJ61r2J00j23m2R1M8j06o9J86p4J6j99J75j6j47
$$ y = [84, -8, -34, 56, -82, -60, -91, -7, -152, -114, 3, 133, -36, 23, -62, 29, -59, -41, -14, 3, -35, 63, 33, -27, -74, 98, -97, -58, -79, 161, 26, 71, 154, -189, -42, -59, 118, 51, 19, 177, 0, -10, 113, -108, 66, 78, -3, -42, -89, 16, 57, -137, 99, 40, 1, -94, 121, -81, -62, 0, 46, 150, 159, 69, -11, 52, -124, -74, 91, -38, -175, 91, 31, -9, -73, -144, -70, 37, 16, -123, 81, -140, 59, 30, -22, -22, -18, -18, 62, -105, 232, 23, -60, -94, 75, 74, -8, 200, -68, 49, 60, 35, -90, -20, 44, -152, -57, 39, -95, 5, 5, -106, -94, 56, 84, -106, 26, 3, -91, 84, -120, -95, 126, 142, 156, 34, 54, 49, -41, 82, -102, 10, 55, 114, -14, -85, 4, 309, 194, -55, 18, 41, -58, -59, 111, 42, 124, -84, 121, 5, 20, -24, -6, -97, 4, 103, -115, 51, -154, -98, 49, 23, 30, 131, -133, -33, 41, -77, 12, -28, -57, -65, -17, 39, 113, -69, 56, 35, 112, -89, -13, -39, 68, 12, -25, 141, -20, -36, 12, -54, -60, 101, 9, 109, -14, -56, 35, 83, -23, -92, 94, 20, 36, -163, 12, -4, -151]
7836a51K75k17J89j86J18j53J06J72j10q7j59K90k30P3J33k9j1n5L8j04J08j00
7858i0J31r5PJ7J33j06j52K62j31J09j00q4J69j09K52k36O9j01L9l4P0o0j94K97
7882F3k07O4L5kJ59Q2j34p8k9k8O5O2N4p7j73R8l1J04j98J1J47j7J31k6P4l16
7908a67N1NJ52o1L5J34q0o6m0J16J01k00M7q5P0L0j1MO1o8j19J94o0%P5k11P8
7935a5jO1j45L2K03j62j2j2J57k25M1J6J35k3j44R2m4qPl7N0n4J89k31l6L7K67
7962A38j44j47J56r1j21J43J03j35j2L82l57N4r1J50K4k4j55J64j49J43k6j34
7984a29J45L1r5L0k6J2J21q7k9Q6J3L8j88R5q4O8j03J17J51k48J35j19K36j27
8008D3J05j80k7o3K61j32J81j17l1l6p5N1k0K25j86j30K13q4J00q0l4q6P0pk1
$$ y = [-151, 124, -93, 96, -90, 28, -125, -19, 153, 43, -44, -203, 87, -143, -70, 63, 34, 23, -32, 6, -98, 10, -90, 41, -54, -47, -30, 103, -3, -155, 107, -24, 85, -15, -99, 70, -39, 213, -23, 46, -55, -16, -50, 20, -40, -234, 63, -144, -80, -45, -47, 112, 194, 60, -18, -47, -75, -10, 52, 106, 29, -144, -46, -77, 27, -171, -160, -13, -30, 101, 75, 149, -167, -116, -111, 41, -20, 15, 149, 69, 3, -37, 79, 180, -20, 27, -58, 12, 42, 31, 35, 96, 28, -91, 103, 43, 43, 118, -93, -15, -16, 45, -100, -68, 135, -27, -39, -51, 106, -119, -78, -62, 73, 50, -94, -2, -46, -54, -47, -84, -34, -88, 101, -130, -166, -129, 138, -6, -153, 3, -88, -209, -66, 37, -98, -110, 272, -85, -31, -122, 28, 52, 28, -127, 37, -112, 31, 5, -129, 16, 47, -48, -18, -44, -32, 89, 2, -27, 59, 72, 110, -78, 17, -67, 1, -102, 15, 166, -82, 53, -66, 170, 43, 148, -32, -59, -122, 139, 7, 188, 71, 40, 4, -71, -20, -40, 185, -1, -131, 82, -2, 98, 18, -16, -102, -32, -39, -60]
8033f0Q0k7PM7n7mn9O7J29o9J04j11M2Qn8j23K31k8m66K52J90j16j10R4J20j12
8059b9l9MJ2J39p8J19j09L8p6r5M3RL9m2K8N6J5j2m3K02j46L6M3k67K90j41%%
8087dJ5j36Q7O7p4K1l5K88l21M0p5J65P3j69p8J94J4k35N6N9J45k22O6P1J04j22
8113fj6K6m7m7J62k17J19J22k02O9mJ13n8q3Ol4K22J51o5j06j99O5R7J9k15J2
8139a16L61l69K35k55L05l1k27K7J61N5k20J0r0J43k1J1j6j7N7k4j62J85L3k2
8163A3r4Q7RO0k7m7J53j59L5j19O9r2N3k4J49K9k09M3Q0Q7r0r6j09P6J99q8M3
8190C1j46
$$ y = [-60, 20, -7, 0, 47, -10, -14, -73, -6, 123, 54, 158, 47, 89, 97, 39, -84, 147, 119, -347, -95, 95, -21, -131, -37, 83, -29, -68, -64, -52, 87, 9, 128, 19, 57, -19, -114, -71, -62, -23, -65, -37, 19, 34, 22, -21, 181, 35, 71, 114, -153, 137, -4, -4, -4, 11, -125, -38, 29, -45, -24, -59, 229, -92, -52, -127, 38, 111, -58, -136, 58, 72, -163, -107, -48, 97, -125, -59, 12, 116, -6, -22, 4, -43, -90, 72, -145, -26, 96, -106, -37, -41, 72, 14, -69, -63, -97, 125, 276, 211, 105, -94, -29, 68, 87, -128, -116, 245, -124, 111, -144, 161, 130, -97, -70, 91, 146, -74, -64, -154, -11, -32, -21, -37, -54, 3, -21, -183, 2, 35, 13, -81, 6, 15, 75, 48, 1, 154, -5, 30, -89, -20, -112, -59, -83, 66, 95, -114, -71, 9, 96, 6, -90, -199, -123, 76, -12, 31, -115]
8191a15
$$ Imaginary data points
##PAGE= N=2
##DATA TABLE= (X++(I..I)), XYDATA
0@%%%%%%%%%%%%Qj6J6j6K4l2M0m8N6p2Q8j04J20j36J60j85K09k42K82l22L64m15
34b21M70n30N97o70P50q38R34j037J151j277J414j563J725j903K099k314K547
51A334k804L089l407L763m159M608n120N710o403P222q210R436j0997J3064j5946
66h820K0268k7557M2938j32469J55897R5414k69880J90606j0411k09963J58583
77D606J08577j84862Q1695M7947j50090O3327J18793j00756j5138M4202m2232
88b3931j0916O3982N797m9423K274K7456n8540K4300R3288p0699n2285Q5883n7090
101a9904m4104J34632k7061j02456P8496k3308n2352J18994l0541r1404Q7912
112B8904k6062o1489J12118q821r1264M7587l543k7634P7098j8363o4352L9497
$$ y = [0, 0, 0, 0, 0, 0, 0, 0, 0, 0, 0, 0, 0, 8, -8, 8, -8, 16, -16, 24, -24, 32, -40, 48, -56, 64, -72, 88, -97, 112, -130, 152, -170, 194, -221, 249, -281, 316, -354, 396, -442, 492, -545, 606, -671, 743, -820, 905, -998, 1101, -1213, 1334, -1470, 1619, -1788, 1975, -2184, 2424, -2696, 3014, -3389, 3833, -4377, 5059, -5938, 7126, -8820, 11448, -16109, 26829, -105640, 50257, 145671, -124209, 66397, 55986, -153977, 4606, 113183, -71679, 10016, 57963, -92127, -28800, 89993, -10763, -25901, 18301, -23931, -34847, 29135, 34932, -14491, -12217, 15239, -43301, -19001, 74287, 3588, -48697, 37186, -19904, -64008, 70624, 43563, -58893, 19603, -3705, -56057, 62937, 32396, -59008, 28904, 2842, -58647, 53471, 44650, -46614, 973, -2570, -30204, 46894, 28531, -35821, 3676]
124C676m151j6927L7860j3779J12O260n1876L2051M8508n1303M747K7569m7590
137b4843J1909L9434l0048O422J2250m1272J8752K7074k2642J3558n953l0203
149b5562K4409Q605m214J5910k6846j4306K7003o028N028J3313l4795Q240K6823
162A7580m0660K1199M1457o5807N05N6002m1865K638L5636m9092J1437M0094n3160
175b4036Q882N2866m9305j1989M4598l3222l30M2544l9057j3063L9205j8909j4411
188a6227K8487m22k3741N79J9865l200j5055J5414K408k6405J7611K1285l1288
201a0689O690J8672l6020K0861L1159n3049J2335M3723n1709J53M9321m0116q749
214a7418M5814l5577j4296N0303k8087k8088M8139p229l4602K2326J0745j3425
$$ y = [3676, -475, -17402, 20458, 6679, 6791, 13051, -38825, -6774, 41734, -9569, -4822, 22747, -24843, -12934, 26500, -3548, 2874, 15124, -26148, -7396, 19678, -2964, 10594, 4641, -25562, -1153, 7452, 3238, 19148, -7698, -22004, 4999, -1029, 3999, 17312, -17483, -9243, 17580, -23080, -1881, 39576, -26231, -25726, 30276, -11589, -8951, 26685, -22407, -10970, 29124, -24036, -15154, 37712, -11593, -23582, 21016, -12206, -12536, 30008, -9049, -22112, 17093, -1816, -16227, 12260, 11838, -11903, -11324, 8541, 5341, -9714, 5700, 8108, -18297, -686, 20599, -10689, -3999, 14673, -21347, -486, 30673, -22376, -10041, 33682, -18027, -17874, 31447, -8669, -17418, 28396, -7181, -21477, 28826, 739, -27349, 20790, 13561, -21041, 1285, 12030, -1395]
226a395J791J115n916M926R853j0718r409J8023j279k0836J8194J2747l2037R102
240e839K6064l2501M638L2078l7119j777L9569l1721r612L7867k4734j7358L8284
253A7839j1310k5402K5046p63j4346J7016r435j1982K3195l508k0156J2362J2491
266A1047j4920p405J7802K24j7697Q034Q805j1527O283P071k1231O658K6148k5062
280e770j2026L1910j1163j7087K1430n813j1372J6652n988r907J7288m719j7610
293a4175J7536O310j9380Q032J0707j3544p32J1473l292r835O314N699p669M530
307A974L053j4025P868J4585j6639p377J8972l147j2656J0712m88p066J1407p669
321d96p579J9952p195k0613J9084J2862k1966j026J6581j0731l406J2985j1102
$$ y = [-1395, 396, 1511, -4405, 521, 10374, -344, -9753, 8270, 6991, -13845, 4349, 17096, -14941, -5839, 20225, -12276, -7638, 24440, -12679, -14456, 25113, -6608, -16220, 21647, -3087, -20445, 17839, 6529, -18873, 6173, 5410, -8936, 8080, -1355, -13337, 9858, 6350, -13806, -1444, 11047, -3873, -11278, 6524, 6748, -10949, -2915, 5890, -5637, 646, 7717, -13514, -6856, 19292, -5770, -17796, 14114, 2951, -14136, 7294, 1481, -9891, 6761, 773, -9134, 8154, 3435, -14175, 3361, 9671, -9709, -1677, 9030, -4514, -5246, 6227, 2935, -6900, -586, 5113, -2556, 1974, 5027, -8998, -1130, 13455, -3184, -10561, 8411, 5264, -7392, 3320, 2832, -4234, 7173, -496, -8075, 11877, 4682, -15931, 3153, 16015, -5951, -6977, 9604, -1127, -4533, 8452, -2650]
334b650m928J7809n761j4252J3253N193j7518N792J4263j3947k140J2006r912
347b792p55J0901r851l629J3515o957r290J7049l568k0209J8025J1899k3078J600
361g140J5409j0645k247J1027j0379l873J8824j0242j4145K0131j368j8216J3676
374H12O625j2659N152K247j1288J1590P070k1884O647K0004j7424p636J7902n607
388A551j0943J2533K844j2852N570P297j1783L616J0409j1651k757J2794n846
401G82p153J2157l371j2667J4579L496j4737R211Q56j2218J4611L473k0536R950
415a567J6101j8389n428J7225n516p221Q965k681l169M788l142k521M941K149
429D535p326j566J0405j117q753L131J278l015O759L76r941O081M104j2882R129
$$ y = [-2650, -7578, 10231, 4470, -9782, 3471, 8664, -8854, -3062, 11201, -2746, -4886, 7120, -2792, -3547, 7354, -2497, -6126, 7389, 432, -8858, 8191, 4623, -15586, 2439, 14338, -8740, -7140, 8269, -2376, -4623, 6404, -3975, -7848, 10976, 734, -13411, 6720, 5352, -12864, 812, 7437, -5222, -70, 2177, -9111, 2479, 9549, -12335, -5688, 14316, -3108, -10744, 7158, 1551, -9392, 3141, 5985, -6867, -1297, 6000, -5783, -2167, 8242, -3409, -6166, 6628, 782, -6371, 5786, 2415, -10252, 4327, 7823, -6914, 2297, 3153, -9065, 5546, 9019, -11517, -1567, 14534, -3855, -9283, 7942, 2426, -4795, 4170, 1489, -1680, 3108, -34, -2555, 2386, 4535, -2791, -4357, 6048, 4931, -3822, -691, 587, -2428, 4331, 4707, -5234, 847, 4951, -7931, 1198]
444A198J0230j8312J408J4134j1254j817J1738o908o636P365J91k000L540m535
458a658j923O006j965l513K661M228k128q915K919Q589l362R70j441r299Q713
473a18P128j3865N325J3158j9580n183K4025o617j1692J1763p633n796J6780l484
487D211j0502Q526j728r362R992P687j1056j710N710n025j11R279j840r357N001
502b85K662j0256J1048R423k1874L324J8147j9103j018K4842j4655j5625J7168
515C798m550l283K0810j6664j7112K5250l197j6496K2085r01k2388J1368P210
528E930j1439J2288M692k3920M952J9930j2760n512J5570p340j4422J2919P749
541H637j1990N161M827j7146O694J4556j3730K468J1460k0243j788K3140r307
$$ y = [1198, 11428, -6884, -5476, 8658, -2596, -4413, 7325, 417, -6219, 1146, 1337, -663, 2877, -1658, -3581, 2425, 460, -3053, -392, 3836, 1708, -7207, -4288, 4301, 939, 1909, 468, -8831, -118, 7010, -6855, -1530, 11628, -7952, -13135, 10890, 4273, -7419, 4344, -3289, -9085, 7695, 4211, -6291, 2235, 507, -8855, 1137, 8824, -2232, -3942, 1768, -3257, -3368, 5911, 4071, -5286, -285, 2377, -7879, 3169, 12592, -9282, -5958, 12189, -6914, -7932, 16910, 2255, -13370, 3798, -752, -4035, 16775, 111, -17001, 8249, 5052, -11444, 10641, 9740, -12648, -1280, 5930, -5509, 6779, 11471, -12449, -7497, 12433, -327, -5839, 9731, 2391, -12031, 888, 8637, -3353, 1808, 6635, -10511, -3817, 10739, -2991, -523, 10937, -9306, -11094, 12046, 2739]
554B739r740J5555j1057j0953K1232k566j0338J2205r599j2159J9949N385j4297
567c644J042J820l954O473P42m447N650m143r315Q906P930m831n544Q4K599r58
583a590J828L327l844k005J344k880L182P569n287p698M344J717j913N914n42
598C466o238j070N83N995K670o673m00J007k776M820L314l795r45k647k865J0455
614D901K461j3174M954O135j0561M903O636q517L340L111j1731N358J3201j0766
628B51o597J0682l630m948Q608j848m178L804l787k933R331J467j0319J820N589
643C312p115K858R398r589n325J0108k561n221R222k514j0739J0136K951j2006
657g085R098N683j5343L977J0373r062k64P152p671l6Q771r410j815J4551p953
$$ y = [2739, -7001, 8554, -2503, -13456, 7776, 5210, -5128, 7077, -2522, -14681, 5268, 10653, -3644, -2602, -782, -4736, 1737, 2479, -1968, 3682, -461, -9776, -870, 7060, 2229, -3315, -3231, -632, -1590, 238, 3565, -279, -2284, -940, -3820, -638, 6931, 1644, -6054, -1710, 7, -1906, 4008, 3466, -2772, -3842, -3259, 2736, 5406, -1267, -1667, -660, -3436, 1384, 4698, 903, -42, -2689, -5554, 4901, 7362, -5812, -858, 5277, -5284, -381, 6255, -2262, 1078, 4189, -7542, -2184, 11017, 251, -6346, 4336, 706, -4242, 4366, 2518, -1660, 2144, -1643, -4576, 4755, 6222, -4097, -2277, 3312, -3803, -945, 8453, -1136, -6461, 3647, 1086, -4135, 5087, 2573, -8166, 1970, 4921, -7085, 2013, 7696, -7647, -3670, 6703, -2359, -2623, 4529, -3142, -3178, 5593, -3817, -5632, 8919, 966]
672I66j1174J2091K856r100M350L235p913K971O208p956Q91Q592q328m564J0820
687C945m61q163M550J970o196N220L739r119L089N255q041L164P103r250j414
702d609J0714n157p649R727J109q872N377K109n346L580J309n025L122L748o473
717b336r82Q240k669n695L765P01p97K300k972k673N761Q19p528L081P192p543
733a336k881Q325k255m427M102p58k803M337K70o329L730L514n821K127L438n494
749b261N14M853k269l330K712N75k172K988j582l323M746J202o353J965N856m346
765b25m907O801J506o115J630K142j779K403j217m474M291L573n964q58O160k955
781A2k399L330j835q1K759l902m67O038k393n860M803L617n948Q16M200m382m06
$$ y = [966, -10208, 1883, 4739, -4361, -11, 3224, -4689, -1718, 4490, -3466, -2575, 6017, -2311, -6875, 3945, 3484, -4679, -129, 1841, -4355, 865, 4604, -4515, -1426, 3829, -4212, -1048, 6055, -3195, -4609, 6105, 948, -6701, 3026, 4135, -4737, 640, 2749, -2597, 983, 2292, -2733, 389, 4137, -2336, -3318, 4922, 2253, -3442, 323, 1024, 227, 2527, -445, -3118, 2643, 3462, -4066, -985, 6207, -1336, -4217, 4108, 1853, -2574, 1528, 770, -2033, 2304, 2574, -3755, -25, 3489, -2332, -205, 3233, -2261, -1747, 3106, 837, -2493, 219, 794, -1378, 1610, 28, -3295, 1451, 2653, -3700, -1735, 4121, -225, -5132, 1669, 3175, -2940, -1310, 832, -947, 1456, 239, -4235, 56, 3629, -2335, -3193, 2967, 12, -2387, 943, -892, -973, 1786, -2116, -2583, 3455, 1062, -4798, 5, 3622, -2326, -1510, 2690, -1692, -2098]
798b098M817k043k970K735J47j900L031r48m666N344K305o775J978M292l890o83
814a324L216k347k49L862m849j216Q315l936p205P003L312n926k41L427j555j30
830A57J315k658J213K846l920p12M570j509l404K288J741k525J268N00l626K953
846D97K930n529Q10M042l601r96M978k478m937N574J888n319J276J819j834J563
862F83l84k417K552J734m523K76N249l242l371M037L76j856J310j455j504M120
878A585N36n578J663N259m197k511N066j046k902J846O80j186J298l82k588K963
894E06J833m783J684K800l850J180L440l614j847M495m49l759L168j62k899M255
910A998J04n279K859L886l880k514M595o3l158J671M66k37J372k858j211M934
$$ y = [-2098, 2719, 676, -2294, 441, 588, -1312, 1719, 771, -3895, 1449, 3754, -3021, -1043, 3249, -641, -1324, 1892, -455, -704, 3158, -1691, -2907, 5408, 1472, -5733, 1270, 4582, -1344, -1585, 1842, 287, 157, 1472, -1186, 27, 2873, -1047, -1759, 2811, 1302, -2102, 186, 1927, -598, 670, 1170, -2456, 497, 3427, -2102, -1292, 2750, -851, -1847, 3131, 653, -4284, 1290, 3178, -2141, -865, 954, -880, 683, 299, -2118, 434, 2168, -2355, -2079, 3170, -72, -3443, 594, 970, -886, 424, -1031, -2535, 1585, 2121, -3457, -1794, 3465, -732, -3243, 1823, 777, -2125, -279, 401, -785, 513, 131, -2457, 506, 2339, -2444, -760, 2040, -1810, -630, 2810, -804, -2651, 1844, 1395, -2364, 804, 642, -2257, 1998, 2102, -3177, -318, 3568, -312, -2826, 1769, 1706, -1452, 219, 685, 448, 1820, -1038, -2249, 2685]
926B685q1n238J554M281l337r04L267k868n25L770l111j076M432k004m284M872
942A433J761n713K025K931l873J482J929l182Q47J829k363J84K636k878r52N008
958C104k153n052M140L017l713j047K448j351n00K712k357j384M684k816l867
973d135N836J504n592M43K652j272J375j46l612L106K237n639K333M157m926j024
989b703M303j592j990L005j23k936K327O82k760K045J631l017p30L015r53k188
1005a984M014l40n158L143K290k445J954j047l870M604K667o489J420N863n974
1020a352k512O404p12k401J226j559R7K982r22k598J419J825k395r89K735Q29
1036B077k262q97J223l17Q07J271k540O63J408m293L012M207n505j462M711k552
$$ y = [2685, 2604, -2634, -1080, 3201, -136, -1040, 2227, -641, -1166, 2604, -507, -1583, 2849, 845, -3439, 1433, 3194, -2519, -494, 2437, -1436, 46, 1975, -1207, -360, 1469, -894, -710, 1926, -952, -1904, 3104, 951, -4101, 39, 3056, -657, -1704, 744, -607, -1107, 1605, -752, -2136, 2548, -268, -4135, 1701, 3205, -2387, -1944, 708, -564, 811, 665, -2947, 159, 2396, -3243, -910, 3247, -1679, -2703, 1600, 8, -1982, 1023, 900, -2036, 291, 973, -1787, 258, 1889, -1128, -1858, 1157, 204, -1984, 2030, 1690, -3468, -325, 1965, -480, 1474, 427, -3443, 1161, 3828, -2661, -1241, 4622, -1352, -3864, 2540, 1828, -573, 653, -906, -809, 2173, 1251, -1347, 72, 1897, -498, -1487, 1248, 2077, -185, -1082, 141, -176, 631, 1902, -638, 25, 1433, -2860, 152, 4359, -1146, -2608, 2103, -449]
1052d49j822N316j247m743K801N64j147K946j676l131K419J419j938l75K167n3
1068A051l080O70J935k13L76j285k040K865K336n211M69O853n646l860P229j595
1084H54l037M675l471l033O144o19m344M441n75n199M668J912l900J897J32l155
1100b610K904J581k725K31J946k347j235M324j55m689K415L037l969r55M872j738
1116H87k365K988k679o90N952m022l532O483j946m049M703k5k936K949j787k845
1132b914N889j33o339L222K696l225P38J163p32p85Q7J146l77j029J567q89o88
1149f03J479p14j277K496q92k626L714m39l776M019R8l838L194j38l136M237o7
1166A731m927K409L344l161j166K308R0p08j308J202J578k278k22J198p50J805
$$ y = [-449, -2271, 3045, 1798, -2945, -144, 420, -727, 2219, 543, -2588, -169, 1250, -688, -1063, 1104, 1051, -2029, -1359, 576, 363, 739, -546, -2586, 279, 2615, -2596, -2127, 4726, -920, -4780, 2449, 854, -2183, 2492, -979, -4012, 2132, 1513, -2831, 1610, 1035, -4164, 504, 2416, -1484, 413, 545, -2610, 294, 1875, -850, -619, 1327, -1020, -2255, 2069, 1914, -2775, -360, 2677, -1292, -2247, 2625, 887, -1478, 1510, -1169, -1859, 4093, 71, -3461, 3022, 1076, -2973, 1730, 1705, -1231, 1718, -69, -2914, 2975, 2842, -3497, -275, 2421, -804, -66, 1097, 365, -420, -333, 813, 436, -593, 974, 85, -603, 876, 162, -1115, 1381, 489, -2137, 1577, 1138, -2638, 1381, 1479, -2359, 835, 697, -2439, 1798, 1731, -3196, -787, 2557, -604, -1770, 538, 628, -80, -1388, -186, 1392, -886, -1108, 90, -660, 1145]
1182A145q00l054L260R82l396J763Q54k345K368L87m246L729J666n402L615K168
1198B694n667K252L042l382p0K273j767M3J120j159R47N48k285J029J809r54j133
1215f60l07K224j49k711J755R85k233K157m43k734L548P90n469K977M395n906
1231a781n2M455k461k69J291k598J578J944k961L1K115j691q4J753j071j080J191
1248C10K55n56q4L79J14j230J703j44k625K963Q23m645K795K865m736N9L654j992
1266i2p60J684k625J614L083n067J70M875l202j825L233p06j531J305l67q05K053
1283A037m04k714J280K454j335k561J743K223k717qK282k465M33K163k336M41
1299d84J686k649R01K709l281p03M299k617k159M148j117k488K881q85j063K086
$$ y = [1145, 345, -2709, 551, 1533, -1863, -100, 754, -1591, 777, 1164, -3082, 647, 2313, -3089, 526, 2694, -2973, -721, 2321, -1061, -1131, 1142, -625, -582, 538, -621, 326, 874, -1411, -382, 1427, 473, -660, -967, 1257, 1108, -1603, 152, 1137, -1096, 1061, 618, -2116, 1432, 2222, -3247, -270, 4125, -1781, -1833, 2622, 161, -108, 1183, -1415, 163, 2107, -854, -823, 1292, -399, -483, 1270, 199, -881, 310, 565, 9, -75, 304, 418, -812, 891, 747, -1878, 1085, 1908, -2737, 58, 2923, -1813, -1754, 1900, -92, -852, 832, -1793, -179, 2904, -2163, -1993, 2882, -320, -2145, 1088, 382, -1149, 156, -211, -1016, 1037, 633, -2081, -801, 1653, 318, -2243, -500, 1723, -994, -1002, 1280, -1185, -752, 1411, -925, -484, 1202, -1447, -546, 2163, -1118, -1821, 2478, -139, -2298, 1850, 733, -1755, 1126, 241, -822, 1264]
1315A264q25j996J466K194k255j553K008J223j556q71J391Mm56M23j179J205J850
1332B337l840L00M158k895j901L333j121j390K738j531k283L683l8l391K231J142
1348A532k643J124J308j706k61J161j85n89N13k78j96J019j054j073K226L49l212
1365a965Q85L559k763k343L857p44j919K635j637j729L671l37l485J987K094l134
1381a368K87K142j312m2M36j258J449N35k035j08K406m53k037J162J318k242Q57
1398b63J526k258j37K109q66j379J852k31j595K068j02k561K376P22k691J157
1414b73J534j245j44N43j255J530J056l420J2M048j667k599K314J032k075L76
1430b33J418j478J22J441j941J97K063j489j419J933P32k180N99Q89q61Q12P2
$$ y = [1264, 439, -1557, -91, 2103, -152, -1705, 303, 1526, -30, -901, 490, 494, 38, 461, -718, 487, 2337, -1503, -1203, 2955, 60, -1841, 1492, 371, -1019, 1719, 188, -2095, 1588, 1550, -1841, 390, 1532, -1111, 13, 1321, -385, -646, 515, 330, -259, 254, -24, -220, 799, -255, -1328, 898, 1247, -1965, -1080, 2479, -284, -2627, 1230, 486, -1433, 1202, -435, -2164, 1507, 1170, -2315, -328, 1766, -1368, -1081, 1061, -251, -293, 143, -1115, 334, 869, -1166, -1274, 1132, 679, -1358, -196, 1122, -1120, -263, 1263, -995, -1132, 977, 111, -1268, 584, 353, -1242, 826, 724, -1837, 539, 1261, -1430, -273, 1261, 16, -128, 415, -840, 690, 1746, -1674, -1662, 2386, 719, -1880, 434, 1466, -609, -233, 1185, -293, -171, 1270, -671, -474, 1589, 100, -1319, 614, 1346, -834, -235, 654, -207, 605, 677]
1447F77j630J290M33j615R38J005j879o1K561j188k336K250Q91k344P17R20q67
1464b38J51K89j118R80J370k181p94K518l13j376K21K33J97N64j176o84K293J68
1482A104k875P91K550k106r52K339j75k118R66J040j337R04N53k059Q67J562j500
1499d46o6J163j417l18K017l97j502J182k88o41J573r43q36J964k05k504J249
1516d15K451j830j872K216N78j755N97N57l98P54o72j655J488K021k496p41K191
1533A019j397K53J495j784N2J525j812j56K888j222k970K488J035k386J185J194
1549A407k186n5J389m26j93O94p17n22J177m93j127K246k55k285O99J729j274
1566a92qJ178j989M44K267l216L68L971l239k556L658Q11k040M94p0j099J743
$$ y = [677, -953, 337, 770, -845, 93, 1098, -781, -842, 1719, 531, -1805, 445, 1336, -1008, -291, 629, -238, -87, 202, -916, 64, 1434, -747, -1541, 977, 664, -712, -491, -258, -61, 503, -673, -1357, 936, 1104, -1771, -980, 1570, -536, -1488, 851, 676, -1442, -476, 564, -773, 131, 684, -1375, -508, 1054, -446, -512, 651, -766, -1084, 933, 536, -966, 216, -72, -713, 860, -83, -919, 1045, 840, -1664, -415, 2036, 206, -1666, 550, 1128, -627, -30, 527, 129, 883, 211, -1444, 44, 2065, -431, -1172, 1019, -378, -125, 1370, -414, -362, 1163, -649, -805, 2083, 861, -2109, 379, 1414, -972, 213, 1407, -779, -834, 555, 129, -64, 630, -87, -609, 568, 75, -1052, 1194, 939, -1346, -647, 1082, -192, -200, 978, -1011, -567, 1700, -1516, -1148, 2823, -416, -2972, 686, 1497, -543, -49, -119, -1218, 525]
1583E25n9j765J519L33k045Q80J262m43o75L14k43l78J454m64r34R61K14j893
1601a437J326J302j640n50K215j384j379K591k33j573Q10n33K82J269r86p12J130
1618D98mj752J345J229j176p27L25K78Q08k62q68j98R99O90j846n4K538j432j648
1637a257J712M72j403Q49M70j400R29K40j204J167L51j802J043N19j106M12Q52
1654H44j094n13J261M3n89L52n33l43J140J21r98j55J472q18j441J811L23j687
1672h04N03K67O8O17r11j105K074L76k757J005J934j810K25Q73j600P86J266j655
1690f48l42J815n14j524J433N33j695M42J073o58n96J022k4j152R92K81j032J200
1708F06n84j321K083K32k633J196J843j875l62J702j107l04J762k043J99K162
$$ y = [525, 466, -1299, 220, 553, -1492, -612, 650, 207, -468, -154, -397, -775, 679, 215, -719, 242, 456, -1437, -111, 1191, -449, -999, 1216, -168, -1547, 1044, 811, -762, 48, -485, -203, 1066, 80, -632, 498, 494, -1258, 87, 1316, 140, -587, -262, 16, 824, 562, -306, -504, 495, 1185, -661, -715, 1823, 391, -1257, 455, 927, -476, 373, 843, -557, 372, 612, -592, 575, 926, -876, 167, 686, -420, -8, 844, -250, -763, 498, 541, -48, 304, -229, -572, 568, 689, -309, -464, 1008, 190, -1251, 560, 883, -804, -301, -34, 34, 651, -260, -1365, 709, 1085, -1672, -667, 1267, -543, -318, 555, -1045, -259, 1007, -648, -990, 825, 311, -1213, 220, 753, -942, -500, 573, -85, -681, 341, 317, -835, 157, 438, -594, 606, 22, -1299, 784, 1016, -1617, -421, 1422, -453, -815, 887, -220, -524, 1238, -805, -606, 1556]
1724A556j781j204K121P23j943l2J242k93j81j25q46J103P13j658q7J636l05j692
1742a053J555M91j915J069J041k062R07J201j947N52J344j513m92K176j417j023
1758a086K082m91j358Q01K04m7M50q53m71J251M11j985L79J740r61j154J284N53
1776G49r85l41N48k52N94K62j798P43J880j685q43J345J82q26J62J16o4O33o51
1795b31n22J189k25j253J310K24j066L8R20m01o21R47K55j124L53J24o4L44p7
1814A20p82M57J182r96r75J564p0o05K21m69P30L62r63m43J737k61j986J092J370
1833A285j510m25R36l21L54K19r26R2J098l56r08O73M66r71K36M29m54K84Mp0
1853A35j84P08o68k62R75q77l30J478n71j334Q03R72r45n41P16J45j47J54q85
$$ y = [1556, -225, -1429, 692, 1415, -528, -560, 682, 389, 208, 83, -763, 340, 1053, -605, -692, 944, 639, -1053, 502, 993, -922, 147, 1188, -874, 33, 1234, -713, -161, 1183, -330, -822, 1354, -63, -1086, 996, 505, -853, -52, 152, 105, 555, -298, -769, 482, 893, -1092, -713, 1027, 66, -1088, 196, 749, -236, -577, -29, -281, 313, 575, -1223, -480, 1400, -285, -1128, 217, 399, -427, -265, -149, -213, 420, -231, -753, 436, 211, -1042, 268, 492, -574, -536, 384, -17, -638, 309, 564, -560, -207, -83, -147, 197, 120, -662, -205, 977, -19, -994, 570, 500, -105, 116, -353, 377, 739, -224, -667, 1070, 809, -1177, -85, 1285, -225, -650, 286, -35, 319, 538, -388, -296, 802, 446, -462, 211, 677, -294, -58, 371, -83, 201, 205, 135, -49, 659, -9, -271, 704, -173, -503, 975, 404, -930, -127, 845, -100, -641, 75, 220, 73, 227, -658]
1872f58N12P71j010k70Q22J45p58Q5M57k92K62l12n55J190K17j619K70J474o52
1891G9q57Q61K02j088Q31L95r25M88N33j222L05P46p35j14R41q10k78J309n14
1910A47j044J092J76o23J05j05j04J013n0j620M66J931j295r72J055K78o02K23
1928G1J07j16L84k94p41J074M31j595M37Q85o01n4L50l22l14R96n32r19J658m02
1948E03j269J254M3j057M81O31n87m95J126l72n46M38j08n7L62p20k02J106J8
1967E49j290K01J448m47r28M16j95L95L13j147o4J201r5j309R24J046j432m31
1985h45J130j19l49Q9l21M90K02k64o55O84K23r01Q29Q1n60R0M96o80N8N47k46
2006b1l37O58l75o11J131k19q79N02R90j054n77J302ko70O7l30Q37M77j467l64
$$ y = [-658, -146, 625, -385, -655, 167, 312, -446, -361, 96, -196, 66, -246, -801, 389, 606, -1013, -743, 731, 79, -778, 83, 285, -803, 28, 423, -502, -14, 519, -703, -398, 348, -387, -501, 440, -370, -648, 661, 147, -897, 195, 371, -252, -147, -252, -356, 657, 607, -1013, -547, 1384, 89, -883, 172, 450, -152, 71, 178, 62, 446, 152, -589, 485, 916, -679, -242, 643, 42, -12, 338, 16, -298, 698, 166, -753, 905, 503, -766, 488, 531, -526, -45, 586, -1, -496, 630, 258, -288, 150, 42, -15, 347, -373, -575, 531, 549, -741, -540, 908, 461, -467, -51, -246, 149, 462, -685, -749, 452, 357, -952, -28, 1018, -414, -845, 285, 166, -183, -94, -415, 75, 277, 13, -642, 42, 265, -636, 193, 274, -286, -196, 300, -380, -322, 225, -21, -358, 300, -75, -686, 445, 226, -653, -151, 839, -215, -792, 510, 508, -162, -95, -425, 412, 889, -578, -942]
2026i42J596J97j306M17O00o14p9M05m87P53R8j263K50J450n87j323J188L00j112
2045d59L08N13m57L25Q8o56N35K94q35N4J194r98q46J817l32j204J033j76p42
2064e44M67L72l71L92k05j122Q25J350j301p83J023J01o5j88j36J94L56p63l77
2083g75J263K48j522L11J008p25j48O38k04k78N33k89o53J040M3j201N09N40q30
2102d92J91O77o66j55N61j59j31M93o16J37M46n15p0Q32l09q44K70J227n85r55
2122f63N55N64k23l02l1L9L29Pq08L13R27o03n26N14O6m2j04j74M39K47p66n7
2144b99Q76l63n41O08O3n70N93K5m18m02N37J71k08K29l00j24N03l02k18K72L04
2165D36o82j98Q76q3n14R4k63L31M56j151J58J242l84j090N51Q33p61l34L05q
$$ y = [-942, 654, 851, -455, -38, 562, -52, -131, 274, -213, 540, 638, -625, -375, 1075, 488, -835, 353, 653, -459, -151, 362, -95, 230, 318, -338, 197, 491, -344, -290, 904, -94, -940, 877, 545, -659, 374, 198, -544, -77, 295, -76, 316, 111, -1011, -186, 1164, -137, -920, 103, 204, 139, -49, -185, 9, 365, -398, -775, 488, 736, -786, -475, 533, -192, -340, 298, 94, -184, 349, 60, -593, 447, 490, -711, -202, 338, -492, -301, 376, -290, -445, 116, -43, -174, 319, -297, -160, 286, -229, -299, 533, 224, -620, -350, 877, 292, -663, -108, 456, 233, -69, -100, -61, 268, 275, -533, -220, 707, 104, -422, 92, 158, 116, 12, -162, 277, 524, -242, -299, 577, 214, -327, 281, 344, -226, 367, 392, -26, -428, 109, 280, 72, 301, 1, -123, 380, 78, -140, 132, 436, -246, -444, 432, 349, -165, -71, -334, -3, 453, -698, -540, 702, 318, -772, -221, 612, -149, -483, -178, -186]
2185a86M28l6n53L77R1l19K9K20K51n40J76J7l11L71m0m14L10K86m61K00O31j113
2207e86q1J350n65q29J075k2o52J53M8j35O61m08p57J219K77j282M31N64k42k49
2227c0r7L1M67R1q50J32R48k6j298O25P07o72k30M93Q4m84K55o7l34Q16k69p21
2249d29R20k66m00M69l5n48L11O26o70K01J4l66M17L71r72K35O46k33o80J28R73
2270G12n17o28M43K92j20m57j9M21L22n81o38R56K19r02L83K89n04N77l85n05
2290f42Q68Q0q84Q2J005n45n28N37K17m16M9O7k8k10L65K1k60J51p5P3N71o80
2312a82l36Q56P8r16L71M72n87J44M60p70O01N43j259K01J056m76q68O80M48n07
2332Il56J24L57K41m25k36L66J72k34k45O53r8o42M97Q1n99P38k02p55P04M12
$$ y = [-186, 242, 206, -347, 30, 121, -198, -169, 51, 302, -238, -62, -45, -356, 15, -25, -439, -129, 157, -304, -104, 527, -586, -667, 683, 118, -711, 364, 342, -310, -157, -109, -244, 417, 9, -748, 471, 748, -534, -103, 461, 219, -30, -127, -96, 371, 462, -388, -256, 692, 666, -632, -7, 700, 28, -202, 291, 375, -109, 146, 79, -255, 561, 292, -429, 491, 225, -175, 294, 259, -289, 22, 648, -22, 179, 193, -173, 244, 615, -357, -122, 524, 291, -389, -261, 712, 195, -433, 10, 302, 182, -275, -294, 127, 449, -132, -770, 186, 405, -497, -114, 175, -329, 248, -137, -642, 226, 306, -578, -496, 509, -36, -564, -27, 190, -226, -177, -110, -138, -348, 17, 38, -222, -71, -146, -73, 498, -182, -518, 338, 416, -500, -129, 343, -244, -100, 360, -410, 191, 734, -525, -324, 732, 256, -612, 68, 516, 9, -347, -223, 134, 375, -50, -286, 80, 252, 18, -227, 426, 328, -314, 183, 264, -335, 403, 201, -554, 150, 562]
2353E62o28j0O10q89K50Q64n87m47O25n1l36O9k77L84M00q70j09P78Q8o76J39
2374a11N41j98m96J55K21j95n1J59l84N15L55j295M74Q78o86j40L87Pl60K51n2
2395b5L2M59q47k6P71m48j76M47l03j94K35N38o91q9L48J15k38K70k61P2L10o0
2417B39p94K71Q73o23l54O82j6k64j55J9K75J49n10l64J103k26q15M31M30m93
2437a42K15P4j54K51q0j85j78M07Q2m59L18J76k48k38K71P8j90P3O9j77J61k03
2459g9J57K68n20q7Q04l53q38O41O05l98m98L61j41K44k8l49K32L59k52o05L94
2480h3M53n21k04J85M01q0m20p0N27J06q02K96M90k24n29N78n6l91M26j94k15
2501c27N87l70k26J42K82j27j19L39k56j36L73j67q9j06J96J27M5l03l60Q43K70
$$ y = [562, -66, -76, 534, -355, -105, 759, 172, -275, 350, 299, -37, 32, -245, 139, 539, -331, -440, 338, 426, -250, -111, 430, 232, -264, -109, 112, -83, -134, 25, -359, 156, 511, -784, -310, 568, -118, -258, 129, 136, -224, 27, -25, 7, 466, -381, -407, 364, -84, -260, 187, -116, -310, -75, 463, -228, -317, 31, 146, -92, 178, -83, -11, 299, 239, -555, -284, 589, -34, -388, 294, 278, 14, -141, -122, 153, 302, -208, -572, 531, 305, -510, -79, 351, -142, 73, 147, -7, 244, 164, -21, -199, 208, 290, -169, 149, 325, 77, -161, 110, 188, -2, 71, 140, -37, 124, -79, 78, 346, -174, -261, 543, 190, -648, -7, 598, 200, -298, 63, -78, 166, 138, -211, 21, 380, 128, -477, -83, 370, -151, -355, -170, 231, 151, -269, -339, 188, 294, -508, -212, 278, 54, -475, 103, 47, -344, 82, -112, -327, 260, -110, -336, -194, 88, -39, -158, 181, -75, -211, 162, -5, -94, -200, -4, 123, 168, -135, -495, 348, 618]
2522F18j110M1J186o46n47N39J81k70m0q8r4O82m3r13O40M75o30j21J93J45P0
2543B68j89k18K77L73n56j04O42m46m54N67L96o63j57P01m93j68N88k21j73K19
2563A89l15J47L99n43k69M12L00p45K27M36k39J85k43m03P52J59q40m05J302k42
2583B64r85Q75K84o21M9L6q4K12n5k36J05K28j62k19M36l69J21O8K5L1Q2l24n8
2606b97K72J98n50L75L12n88K4M49j11l86L75K30m40j67K50l9K07j48k79N71J21
2627C79m50j01L77Q0m41m5K46kL70n29j66N51L3n96K64M53j09m32K84L7l04L42
2649B41p3k06j64K94J0q7J34j06qM33n56N8M48m52k84M42m1r4L3R3m29M52K32
2672C70q78K52R28p44l80M50L60l60k85L92j61K88k18l53M45K67o17r6N11r4m53
$$ y = [618, -492, -451, 735, 89, -458, 81, 262, -8, -48, -136, -230, 452, 409, -504, 136, 611, -19, -140, 53, 198, 268, 79, -139, 138, 511, -45, -149, 493, 47, -407, 160, 556, -107, -264, 437, -56, -224, 364, 143, -30, 189, -126, 21, 420, -123, -392, 20, 320, -425, -198, 238, -1, 184, -59, -462, 290, 449, -391, -796, 506, 264, -721, 154, 438, -183, -134, -98, -182, 30, -25, -261, -156, 72, -90, -309, 127, -242, -121, -53, -28, 3, 85, -239, -297, -25, 173, -377, -2, 310, -278, -254, 195, 84, -302, 73, 303, -137, -304, -54, -93, 114, -34, -313, 258, 379, -71, -172, 205, 285, -156, -201, 45, 43, 413, -116, -282, 269, 302, -294, -30, 423, 314, -118, 166, 203, -101, 241, 168, -38, -202, 92, 102, 15, 149, 43, 35, 468, -88, -30, 418, -34, -318, 124, 83, -11, 22, 115, -314, 138, 370, -508, -256, 672, -72, -452, -2, 358, -2, -287, 105, -56, 232, 14, -339, 106, 373, -244, -340, 171, 77, -376]
2693c76L15j92m5O26n83j82P35l92j26K65J82n96K5Q02m32k08K06n4q0L7j72L42
2715I7k7k23j36N73q5p73J95O34k12j90J62QM4K90n77l00Q52n2p48N03N39o70
2737i6m4J69J66l3l2k10J40K36k07j85J48K06l43P7Q9p7k1L43l64l6K77k73J58
2760H8K89n35m2M56j8n76L95K80k78l22K41J38P6k97l57O64J49p10kP11j10m90
2782b50M4M79m17J36K9n1P9L9l55m9N55oq32N44J55k24K22j75j33R7K68k36J92
2805A11k35k07M23N5l59O3K83k46m9J23J0j7pJ7r4K95J23n57K15M69k99n05K84
2828a04L06k75j5l4K31K22l53m71Q97O3p67J67M67k63k82M31j86M9J99l82o5M44
2850B79J00m47j12J96jN2Q5r3l31M43pk38J66o4p1K85k26l57O43N5q79N46M00
$$ y = [-376, -61, -253, -298, 328, -255, -437, 298, -94, -220, 45, 227, -369, -344, 458, 26, -182, 24, -30, -110, -73, -245, 97, 70, -153, -289, 284, 199, -574, -379, 255, 43, -147, 15, 23, 67, 357, -220, -520, 332, 280, -468, 35, 574, -96, -140, 29, 195, 162, 130, -80, 60, 296, 89, -96, 52, 258, -85, -8, 81, 4, -17, 326, -38, -74, 203, -70, 88, 377, -158, -200, 256, 238, -338, 57, 337, 59, -263, -22, 116, 192, -105, -462, 202, 351, -359, -361, 350, 240, -250, -206, 273, -144, -8, 21, -30, 49, 88, -267, -316, 239, 233, -599, -55, 100, -124, 98, -77, -210, -113, 155, -81, 111, -124, -331, 92, 147, -212, -149, 134, -112, -161, -38, -28, -45, -52, -35, -129, 166, 289, -268, -53, 416, 117, -388, -104, 202, -73, -88, -122, 109, 331, -22, -493, 404, 467, -300, -133, 334, 71, -211, 220, 34, 83, 282, -100, -165, 279, 379, -68, -180, 16, 15, 67, 152, 59, -272, 171, 164, -74, 92, 28, -43, 242, 16, -341, 302, 357, -522, 24, 424]
2873D24m26k56K43J52K7r8j96J66Q2N5m43L78J47l73l5J00K41j24k39q3K83n5
2895c0k42j95O08j4l50J48M9l27J05M87l88%K36k9J5N7m32L45K24m12r7L33J62
2918B53n13K9L19l8l0j90j1N20q4n86R9O19n0p57K65L55k73j03L12j08J01Pl46
2941b10K7M47l41j20M17j24j23J44j05J57M8k65RJ61Q4k53K07k8m19K68L93l65
2963Il57K07M35j98k13J63R1n6K0l72L05M58o70j98O25j45j81o1QJ35L05m99j95
2986c84O14jo67K95L90k18l62K44K56k43Q9jj92L15k39k48K28K78j07m17L54k14
3008b30j74N60k82j07L01p9q5O8j56j09M34J7o18K35O26k85m35K31L02j6l38k
3030a42J34K47j90m07M29L41l41j22K9k6K57p7k46R5L56m47k24O29m6o21L88K4
$$ y = [424, -2, -258, -15, 137, 164, 66, -130, 36, 118, 173, -270, 108, 255, -118, -153, -53, 188, 64, -175, -258, 25, -30, -272, -467, 141, 127, -223, -75, -26, -353, -248, 239, -149, -149, 87, 58, 73, 130, -302, 43, 267, -145, -242, 91, 253, -260, -231, 88, 50, 20, -170, -181, 339, 255, -331, -232, 387, 337, -420, -155, 200, -73, -176, 136, 28, 129, 136, -210, -183, 264, -77, -197, 220, 96, -27, 117, 12, 169, 217, -48, -39, 122, 206, -47, 160, 132, -287, -19, 374, 9, -348, -141, 294, 96, -117, 46, 137, 81, 101, -271, 34, 492, -178, -376, 249, 104, -77, -138, -130, 5, 310, -189, -384, 230, 229, -438, -143, 247, 29, -333, -89, 167, -76, 13, 12, -180, 135, -104, -352, -124, 154, 47, -370, -16, -230, -404, 156, -126, -233, 68, -11, -96, -28, -184, -293, 141, 158, -460, -225, 401, 116, -319, -88, 214, 198, -140, -142, -8, 239, 49, -358, 71, 412, 71, -51, -22, -48, 209, 132, -114, -19, 337, -110, -334, 295, 249, -372, 16, 40]
3052D0j00R4J60j98q1L11k19p8L12q6k22Kk7M5Q8K10l92n0L54j54K00l23m1K60
3076A05r1k95J96J73R1n80J58N84l16j16k9m0K67k73l5K88p3M2j72P0J36k51K08
3099D7j99P7J02k3J9m4J47l83O7K34n1n5K08l00j17J82K96k90j84K67K7Q9j04
3122A2n7J98Jm31J96K98k3k42j89K42Q1J06k96l1M64Q9o34J21L52l8l54K30J24
3145B19k61K59Q8l65K38J9l60J66l0%J66J32l40M0K39k26j34J11L8lQj41Q7L31
3169B81j27l98Q1N44m36n4J31K92k64k98L0L11J64n42m1M93M9m40K7K32J79m28
3191b14KJ15j71K88j84N6K90j26k06J55M7o8o4R4j28J28Q6j57J6J34l60L71J59
3214B63l79j35L50J79o46mL77J53l15l8O8L83k43k35M0K59J00m04K78J28j51k55
$$ y = [40, -60, 34, 194, -4, -85, 226, 7, -71, 241, 155, -67, -65, -92, -47, 41, 251, -141, -191, 163, 9, 209, -114, -155, 105, 14, -281, -85, 88, 179, -401, -243, 341, 25, -91, -120, -160, 107, -166, -201, 87, 14, 56, -116, -46, 90, -161, 47, -152, -75, 27, 4, 23, -21, 126, -257, -190, 44, -7, -62, 146, -154, -271, -89, 207, -83, -267, 0, 27, 116, 12, -45, 153, 154, -277, -81, 217, 194, -48, -237, 5, 86, 192, -104, -135, 329, 418, -216, -95, 257, 219, -135, 95, 219, -42, 217, 305, -60, 178, 197, -163, 3, -27, -27, 139, 271, -69, -29, 210, -16, -150, -39, -1, -4, 4, -137, -50, 281, 154, -244, -163, 381, -55, -109, 22, 314, 50, -248, -218, 93, 257, -285, -326, 167, 216, -224, -197, 35, 214, -214, -212, -97, -268, 20, -164, -108, 182, 56, -150, 5, 52, -16, -80, 14, -114, 14, 100, -57, -41, 93, -267, 104, 263, -116, -251, 99, 278, -368, -372, 5, 158, -157, -195, -127, 256, 13, -222, -182, 77, 177, -227, 51, 179, 28, -227]
3236b27J44J32M38n31j82L71R2l51m0L46o4jL6j36q0P8J81k22OR9j63J18J13j94
3260c7j0J80j93q3J91M9k6j21P9J65P1l07k69M28L5k84m8K79k4k28N1J81P4q1
3284G2k44Q4J75j23O7n6K87j26k39J89l1j43J81l70P2L31j61j13J01J53j74k30
3306b98M18m06K8N31n15Q2J15J2J32j73J01k9J1J37n38K89J72k22L8R0j3J02j79
3329a15N5M5Q3R5k89J48K30m54L0L58p2k38L12j71l1N1r6O9L44j90k14J54O5j57
$$ y = [-227, -83, 49, 487, -44, -226, 145, 237, -114, -154, 192, 128, 127, 163, 27, -53, 25, 206, -16, -10, 89, -74, 44, 157, -37, -47, 133, -60, -143, 48, 97, 71, -50, 29, 194, 265, -42, -311, 117, 152, -132, -180, 99, 75, -153, -102, 79, 153, 72, -172, -88, 87, -36, 31, -25, 262, 136, -103, 86, 55, -88, 93, -277, -205, 126, -35, -148, -47, 106, -68, -298, 120, -286, -258, 273, -242, -160, -45, -33, 99, -74, 27, -2, 9, 146, -392, -103, 69, -153, -115, -25, -38, 64, -115, -60, -15, 68, 163, -126, 22, 252, -202, -172, 186, 114, -124, 188, 17, -14, 37, -59, 10, 354, 164, -50, 104, 169, 12]
$$ [...]
8191a8
##END NTUPLES=NMR FID
##END=
